0xee12
0x34ee <-- Start of Header Marker
0x0000
0x0009 <-- Header size - fixed
0x0301
0x0000 <-- Format version number - formed within FLIC from firmware
0x0000
0x007f <-- Source identifier - fixed
0x0003
0x652e <-- 0 | RunNumber[30:0]
0x0008
0x4d86 <-- Extended level 1 ID
0x0000
0x0956 <-- Res[31:12] | BCID[11:0]
0x0000
0x0000 <-- Res[31:8] | L1TriggerType[7:0]
0x0000
0x0000 <-- Res[31:24] | DetectorEventType[23:16] | Res[15:4] | TIM[3:0]
0x0bda
0x7a88 <-- Res[3:0] | L | 0xbda | sector
0x0016
0x0ff7 <-- 
0x0000
0x0008 <-- RoadID[23:0]
0x268b
0x7ff8 <-- Track chi2[31:16] | Track d0[15:0]
0x7ba1
0x84de <-- Track z0[31:16] | Track coth[15:0]
0x3501
0x7bf3 <-- Track phi0[31:16] | Track curv[15:0]
0x0000
0x015a <-- Res[31:12] | Module L0
0x1023
0x14e1 <-- IBL
0x0000
0x027d <-- Res[31:12] | Module L1
0x1580
0x27bb <-- PL0b
0x0000
0x042a <-- Res[31:12] | Module L2
0x2764
0x28eb <-- PL1b
0x0000
0x069b <-- Res[31:12] | Module L3
0x0000
0x0000 <-- PL2b
0x02cc
0x09d5 <-- SAx0
0x02b0
0x09d4 <-- SSt0
0x0036
0x0d64 <-- SAx1
0x006a
0x0d65 <-- SSt1
0x0392
0x119f <-- SAx2
0x03c6
0x119e <-- SSt2
0x0114
0x16ae <-- SAx3
0x00f9
0x16af <-- SSt3
0x0bda
0x16f4 <-- Res[3:0] | L | 0xbda | sector
0x0016
0x0bff <-- 
0x0000
0x0000 <-- RoadID[23:0]
0x1b51
0x800a <-- Track chi2[31:16] | Track d0[15:0]
0x7f9c
0x8808 <-- Track z0[31:16] | Track coth[15:0]
0x3a3a
0x4c0a <-- Track phi0[31:16] | Track curv[15:0]
0x0000
0x015a <-- Res[31:12] | Module L0
0x22e4
0x27fe <-- IBL
0x0000
0x028a <-- Res[31:12] | Module L1
0x1880
0x12f8 <-- PL0b
0x0000
0x0438 <-- Res[31:12] | Module L2
0x1240
0x283b <-- PL1b
0x0000
0x06a8 <-- Res[31:12] | Module L3
0x24c1
0x244c <-- PL2b
0x0280
0x09ef <-- SAx0
0x029a
0x09ee <-- SSt0
0x01d8
0x0d7e <-- SAx1
0x01e2
0x0d7f <-- SSt1
0x0182
0x11cf <-- SAx2
0x0152
0x11ce <-- SSt2
0x0000
0x16e0 <-- SAx3
0x0130
0x16e1 <-- SSt3
0xe0da
0x0000 <-- E0DA (begin debug block) | Length of debug block | Indeterminate[3:0]
0xe0df
0x0000 <-- E0DF (end debug block)   | Length of debug block | Indeterminate[3:0]
0x0000
0x0000 <-- L1ID
0x0000
0x0001 <-- ErrorFlag
0x0000
0x0000 <-- Res
0x0000
0x0000 <-- Res
