0xee12
0x34ee <-- Start of Header Marker
0x0000
0x0009 <-- Header size - fixed
0x0301
0x0000 <-- Format version number - formed within FLIC from firmware
0x0000
0x007f <-- Source identifier - fixed
0x0003
0x652e <-- 0 | RunNumber[30:0]
0x0008
0x6a2d <-- Extended level 1 ID
0x0000
0x015b <-- Res[31:12] | BCID[11:0]
0x0000
0x0000 <-- Res[31:8] | L1TriggerType[7:0]
0x0000
0x0000 <-- Res[31:24] | DetectorEventType[23:16] | Res[15:4] | TIM[3:0]
0x0bda
0x63e0 <-- Res[3:0] | L | 0xbda | sector
0x0016
0x0ffc <-- 
0x0000
0x0031 <-- RoadID[23:0]
0x2c08
0x7f4e <-- Track chi2[31:16] | Track d0[15:0]
0x9d6e
0x8075 <-- Track z0[31:16] | Track coth[15:0]
0x433c
0x5528 <-- Track phi0[31:16] | Track curv[15:0]
0x0000
0x0170 <-- Res[31:12] | Module L0
0x0000
0x0000 <-- IBL
0x0000
0x028b <-- Res[31:12] | Module L1
0x0000
0x0000 <-- PL0b
0x0000
0x0452 <-- Res[31:12] | Module L2
0x1740
0x21dc <-- PL1b
0x0000
0x06c2 <-- Res[31:12] | Module L3
0x1770
0x12e0 <-- PL2b
0x0342
0x0a05 <-- SAx0
0x0326
0x0a04 <-- SSt0
0x041e
0x0d94 <-- SAx1
0x043c
0x0d95 <-- SSt1
0x0544
0x11e5 <-- SAx2
0x0524
0x11e4 <-- SSt2
0x00e0
0x170c <-- SAx3
0x0104
0x170d <-- SSt3
0x0bda
0x1ce0 <-- Res[3:0] | L | 0xbda | sector
0x0016
0x0fff <-- 
0x0000
0x001c <-- RoadID[23:0]
0x31cb
0x7fcc <-- Track chi2[31:16] | Track d0[15:0]
0x8d91
0x8855 <-- Track z0[31:16] | Track coth[15:0]
0x3332
0xc673 <-- Track phi0[31:16] | Track curv[15:0]
0x0000
0x015b <-- Res[31:12] | Module L0
0x11ef
0x13b1 <-- IBL
0x0000
0x027e <-- Res[31:12] | Module L1
0x14cc
0x15c0 <-- PL0b
0x0000
0x042b <-- Res[31:12] | Module L2
0x27d9
0x14c0 <-- PL1b
0x0000
0x068f <-- Res[31:12] | Module L3
0x1124
0x14f0 <-- PL2b
0x04d4
0x09bf <-- SAx0
0x04c4
0x09be <-- SSt0
0x006f
0x0d4e <-- SAx1
0x00ae
0x0d4f <-- SSt1
0x01fa
0x1189 <-- SAx2
0x0212
0x1188 <-- SSt2
0x02f9
0x1680 <-- SAx3
0x0306
0x1681 <-- SSt3
0x0bda
0x0127 <-- Res[3:0] | L | 0xbda | sector
0x0016
0x0ffe <-- 
0x0000
0x0015 <-- RoadID[23:0]
0x3666
0x7f32 <-- Track chi2[31:16] | Track d0[15:0]
0x8d83
0x8053 <-- Track z0[31:16] | Track coth[15:0]
0x3a04
0xbb3b <-- Track phi0[31:16] | Track curv[15:0]
0x0000
0x015c <-- Res[31:12] | Module L0
0x0000
0x0000 <-- IBL
0x0000
0x028b <-- Res[31:12] | Module L1
0x10b0
0x1228 <-- PL0b
0x0000
0x0438 <-- Res[31:12] | Module L2
0x10c0
0x2583 <-- PL1b
0x0000
0x069b <-- Res[31:12] | Module L3
0x10e0
0x297e <-- PL2b
0x0473
0x09d5 <-- SAx0
0x0480
0x09d4 <-- SSt0
0x01a1
0x0d64 <-- SAx1
0x0198
0x0d65 <-- SSt1
0x0491
0x119d <-- SAx2
0x0498
0x119c <-- SSt2
0x0144
0x16ac <-- SAx3
0x0140
0x16ad <-- SSt3
0x0bda
0x479f <-- Res[3:0] | L | 0xbda | sector
0x0016
0x0fff <-- 
0x0000
0x0002 <-- RoadID[23:0]
0x7cbc
0x7fd2 <-- Track chi2[31:16] | Track d0[15:0]
0x632f
0x9268 <-- Track z0[31:16] | Track coth[15:0]
0x415d
0xc58a <-- Track phi0[31:16] | Track curv[15:0]
0x0000
0x016d <-- Res[31:12] | Module L0
0x212e
0x21ee <-- IBL
0x0000
0x028a <-- Res[31:12] | Module L1
0x32cc
0x5847 <-- PL0b
0x0000
0x0445 <-- Res[31:12] | Module L2
0x201a
0x46b4 <-- PL1b
0x0000
0x06b5 <-- Res[31:12] | Module L3
0x2604
0x248a <-- PL2b
0x03e0
0x09f1 <-- SAx0
0x03f6
0x09f0 <-- SSt0
0x0237
0x0d80 <-- SAx1
0x027c
0x0d81 <-- SSt1
0x0041
0x11d3 <-- SAx2
0x0017
0x11d2 <-- SSt2
0x0412
0x16cc <-- SAx3
0x040a
0x16cd <-- SSt3
0xe0da
0x0000 <-- E0DA (begin debug block) | Length of debug block | Indeterminate[3:0]
0xe0df
0x0000 <-- E0DF (end debug block)   | Length of debug block | Indeterminate[3:0]
0x0000
0x0000 <-- L1ID
0x0000
0x0001 <-- ErrorFlag
0x0000
0x0000 <-- Res
0x0000
0x0000 <-- Res
