0xee12
0x34ee <-- Start of Header Marker
0x0000
0x0009 <-- Header size - fixed
0x0301
0x0000 <-- Format version number - formed within FLIC from firmware
0x0000
0x007f <-- Source identifier - fixed
0x0003
0x652e <-- 0 | RunNumber[30:0]
0x0008
0x66d6 <-- Extended level 1 ID
0x0000
0x0ce2 <-- Res[31:12] | BCID[11:0]
0x0000
0x0000 <-- Res[31:8] | L1TriggerType[7:0]
0x0000
0x0000 <-- Res[31:24] | DetectorEventType[23:16] | Res[15:4] | TIM[3:0]
0x0bda
0x1684 <-- Res[3:0] | L | 0xbda | sector
0x0016
0x0fff <-- 
0x0000
0x0000 <-- RoadID[23:0]
0x13b3
0x8011 <-- Track chi2[31:16] | Track d0[15:0]
0x58ac
0x9222 <-- Track z0[31:16] | Track coth[15:0]
0x3312
0x80d2 <-- Track phi0[31:16] | Track curv[15:0]
0x0000
0x0158 <-- Res[31:12] | Module L0
0x2374
0x13d9 <-- IBL
0x0000
0x027c <-- Res[31:12] | Module L1
0x1800
0x1640 <-- PL0b
0x0000
0x042a <-- Res[31:12] | Module L2
0x1510
0x15e0 <-- PL1b
0x0000
0x068e <-- Res[31:12] | Module L3
0x11e0
0x273d <-- PL2b
0x012c
0x09d9 <-- SAx0
0x015d
0x09d8 <-- SSt0
0x03fe
0x0d50 <-- SAx1
0x0416
0x0d51 <-- SSt1
0x010c
0x11a3 <-- SAx2
0x0110
0x11a2 <-- SSt2
0x03ec
0x169c <-- SAx3
0x03b6
0x169d <-- SSt3
0xe0da
0x0000 <-- E0DA (begin debug block) | Length of debug block | Indeterminate[3:0]
0xe0df
0x0000 <-- E0DF (end debug block)   | Length of debug block | Indeterminate[3:0]
0x0000
0x0000 <-- L1ID
0x0000
0x0001 <-- ErrorFlag
0x0000
0x0000 <-- Res
0x0000
0x0000 <-- Res
