0xb0f0 <-- stripped by FLIC in CoreCrate machine
0xcaf0 <-- stripped by FLIC in CoreCrate machine, Bits[3:0] are indeterminate
0xff12 <-- stripped by FLIC in CoreCrate machine
0x34ff <-- stripped by FLIC in CoreCrate machine
0x0003 <-- 0 | RunNumber[30:16], RunNumber=0x3652e
0x652e <-- RunNumber[15:0], RunNumber=0x3652e
0x0008 <-- ExtendedLevel1ID[31:16], word=0x84d86
0x4d86 <-- ExtendedLevel1ID[15:0], word=0x84d86
0x0000 <-- Res
0x0956 <-- Res[3:0] | BCID[11:0], word=0x956
0x0000 <-- Res
0x0000 <-- Res[7:0] | L1TriggerType[7:0], word=0x0
0x0000 <-- Res[7:0] | DetectorEventType[7:0]
0x0000 <-- Res[11:0] | TIM[3:0]
0x0bda <-- Res[3:0] | L | 0xb | 0xd | 0xa, word=0xbda7a88
0x7a88 <-- Sector Number
0x0016 <-- Res[3:0] | TFNum[3:0] | Res | Tower[6:0], word=0x160ff7
0x0ff7 <-- Res[3:0] | Layermap[11:0]
0x0000 <-- Res[7:0] | RoadID[23:16], word=0x8
0x0008 <-- RoadID[15:0]
0x268b <-- Track chi2
0x7ff8 <-- Track d0
0x7ba1 <-- Track z0
0x84de <-- Track coth
0x3501 <-- Track phi
0x7bf3 <-- Track curv
0x1023 <-- (IBLa) 0 | ColWidth[2:0] | ColCoord[11:0]
0x14e1 <-- (IBLb) s | RowWidth[2:0] | RowCoord[11:0]
0x1580 <-- (PL0a) 0 | ColWidth[2:0] | ColCoord[11:0]
0x27bb <-- (PL0b) s | RowWidth[2:0] | RowCoord[11:0]
0x2764 <-- (PL1a) 0 | ColWidth[2:0] | ColCoord[11:0]
0x28eb <-- (PL1b) s | RowWidth[2:0] | RowCoord[11:0]
0x0000 <-- (PL2a) 0 | ColWidth[2:0] | ColCoord[11:0]
0x0000 <-- (PL2b) s | RowWidth[2:0] | RowCoord[11:0]
0x02cc <-- (SAx0) 0 | Width[2:0] | Res | Coord[10:0]
0x02b0 <-- (SSt0) 0 | Width[2:0] | Res | Coord[10:0]
0x0036 <-- (SAx1) 0 | Width[2:0] | Res | Coord[10:0]
0x006a <-- (SSt1) 0 | Width[2:0] | Res | Coord[10:0]
0x0392 <-- (SAx2) 0 | Width[2:0] | Res | Coord[10:0]
0x03c6 <-- (SSt2) 0 | Width[2:0] | Res | Coord[10:0]
0x0114 <-- (SAx3) 0 | Width[2:0] | Res | Coord[10:0]
0x00f9 <-- (SSt3) 0 | Width[2:0] | Res | Coord[10:0]
0x0bda <-- Res[3:0] | L | 0xb | 0xd | 0xa, word=0xbda16f4
0x16f4 <-- Sector Number
0x0016 <-- Res[3:0] | TFNum[3:0] | Res | Tower[6:0], word=0x160bff
0x0bff <-- Res[3:0] | Layermap[11:0]
0x0000 <-- Res[7:0] | RoadID[23:16], word=0x0
0x0000 <-- RoadID[15:0]
0x1b51 <-- Track chi2
0x800a <-- Track d0
0x7f9c <-- Track z0
0x8808 <-- Track coth
0x3a3a <-- Track phi
0x4c0a <-- Track curv
0x22e4 <-- (IBLa) 0 | ColWidth[2:0] | ColCoord[11:0]
0x27fe <-- (IBLb) s | RowWidth[2:0] | RowCoord[11:0]
0x1880 <-- (PL0a) 0 | ColWidth[2:0] | ColCoord[11:0]
0x12f8 <-- (PL0b) s | RowWidth[2:0] | RowCoord[11:0]
0x1240 <-- (PL1a) 0 | ColWidth[2:0] | ColCoord[11:0]
0x283b <-- (PL1b) s | RowWidth[2:0] | RowCoord[11:0]
0x24c1 <-- (PL2a) 0 | ColWidth[2:0] | ColCoord[11:0]
0x244c <-- (PL2b) s | RowWidth[2:0] | RowCoord[11:0]
0x0280 <-- (SAx0) 0 | Width[2:0] | Res | Coord[10:0]
0x029a <-- (SSt0) 0 | Width[2:0] | Res | Coord[10:0]
0x01d8 <-- (SAx1) 0 | Width[2:0] | Res | Coord[10:0]
0x01e2 <-- (SSt1) 0 | Width[2:0] | Res | Coord[10:0]
0x0182 <-- (SAx2) 0 | Width[2:0] | Res | Coord[10:0]
0x0152 <-- (SSt2) 0 | Width[2:0] | Res | Coord[10:0]
0x0000 <-- (SAx3) 0 | Width[2:0] | Res | Coord[10:0]
0x0130 <-- (SSt3) 0 | Width[2:0] | Res | Coord[10:0]
0xe0da <-- Begin trailer debug block
0x0000 <-- Length of debug block | Indeterminate[3:0]
0xe0df <-- End debug block
0x0000 <-- Length of debug block | Indeterminate[3:0]
0x0000 <-- L1ID[31:16]
0x0000 <-- L1ID[15:0]
0x0000 <-- ErrorFlag[31:16]
0x0001 <-- ErrorFlag[15:0]
0x0000 <-- Res
0x0000 <-- Res
0x0000 <-- Res
0x0000 <-- Res
0xe0f0 <-- stripped by FLI in CoreCrateRcvr machine
0xa5a5 <-- stripped by FLI in CoreCrateRcvr machine
0x5a5a <-- stripped by FLI in CoreCrateRcvr machine
0x0e0f <-- stripped by FLI in CoreCrateRcvr machine
