0xb0f0 <-- stripped by FLIC in CoreCrate machine
0xcaf0 <-- stripped by FLIC in CoreCrate machine, Bits[3:0] are indeterminate
0xff12 <-- stripped by FLIC in CoreCrate machine
0x34ff <-- stripped by FLIC in CoreCrate machine
0x0003 <-- 0 | RunNumber[30:16], RunNumber=0x3652e
0x652e <-- RunNumber[15:0], RunNumber=0x3652e
0x0008 <-- ExtendedLevel1ID[31:16], word=0x86a4b
0x6a4b <-- ExtendedLevel1ID[15:0], word=0x86a4b
0x0000 <-- Res
0x00a5 <-- Res[3:0] | BCID[11:0], word=0xa5
0x0000 <-- Res
0x0000 <-- Res[7:0] | L1TriggerType[7:0], word=0x0
0x0000 <-- Res[7:0] | DetectorEventType[7:0]
0x0000 <-- Res[11:0] | TIM[3:0]
0x0bda <-- Res[3:0] | L | 0xb | 0xd | 0xa, word=0xbda3842
0x3842 <-- Sector Number
0x0016 <-- Res[3:0] | TFNum[3:0] | Res | Tower[6:0], word=0x160fff
0x0fff <-- Res[3:0] | Layermap[11:0]
0x0000 <-- Res[7:0] | RoadID[23:16], word=0x4
0x0004 <-- RoadID[15:0]
0x634e <-- Track chi2
0x800d <-- Track d0
0x5ea3 <-- Track z0
0x82ab <-- Track coth
0x2c10 <-- Track phi
0x5165 <-- Track curv
0x10c3 <-- (IBLa) 0 | ColWidth[2:0] | ColCoord[11:0]
0x204d <-- (IBLb) s | RowWidth[2:0] | RowCoord[11:0]
0x1254 <-- (PL0a) 0 | ColWidth[2:0] | ColCoord[11:0]
0x1090 <-- (PL0b) s | RowWidth[2:0] | RowCoord[11:0]
0x1370 <-- (PL1a) 0 | ColWidth[2:0] | ColCoord[11:0]
0x260c <-- (PL1b) s | RowWidth[2:0] | RowCoord[11:0]
0x1450 <-- (PL2a) 0 | ColWidth[2:0] | ColCoord[11:0]
0x1410 <-- (PL2b) s | RowWidth[2:0] | RowCoord[11:0]
0x033c <-- (SAx0) 0 | Width[2:0] | Res | Coord[10:0]
0x031c <-- (SSt0) 0 | Width[2:0] | Res | Coord[10:0]
0x058c <-- (SAx1) 0 | Width[2:0] | Res | Coord[10:0]
0x05b4 <-- (SSt1) 0 | Width[2:0] | Res | Coord[10:0]
0x0276 <-- (SAx2) 0 | Width[2:0] | Res | Coord[10:0]
0x023c <-- (SSt2) 0 | Width[2:0] | Res | Coord[10:0]
0x052c <-- (SAx3) 0 | Width[2:0] | Res | Coord[10:0]
0x04f4 <-- (SSt3) 0 | Width[2:0] | Res | Coord[10:0]
0x0bda <-- Res[3:0] | L | 0xb | 0xd | 0xa, word=0xbda31a8
0x31a8 <-- Sector Number
0x0016 <-- Res[3:0] | TFNum[3:0] | Res | Tower[6:0], word=0x160ffe
0x0ffe <-- Res[3:0] | Layermap[11:0]
0x0000 <-- Res[7:0] | RoadID[23:16], word=0x0
0x0000 <-- RoadID[15:0]
0x38a2 <-- Track chi2
0x7efd <-- Track d0
0x93a4 <-- Track z0
0x8c2c <-- Track coth
0x3d85 <-- Track phi
0xb408 <-- Track curv
0x0000 <-- (IBLa) 0 | ColWidth[2:0] | ColCoord[11:0]
0x0000 <-- (IBLb) s | RowWidth[2:0] | RowCoord[11:0]
0x2908 <-- (PL0a) 0 | ColWidth[2:0] | ColCoord[11:0]
0x14e8 <-- (PL0b) s | RowWidth[2:0] | RowCoord[11:0]
0x13e0 <-- (PL1a) 0 | ColWidth[2:0] | ColCoord[11:0]
0x1130 <-- (PL1b) s | RowWidth[2:0] | RowCoord[11:0]
0x2852 <-- (PL2a) 0 | ColWidth[2:0] | ColCoord[11:0]
0x7711 <-- (PL2b) s | RowWidth[2:0] | RowCoord[11:0]
0x0185 <-- (SAx0) 0 | Width[2:0] | Res | Coord[10:0]
0x0192 <-- (SSt0) 0 | Width[2:0] | Res | Coord[10:0]
0x0560 <-- (SAx1) 0 | Width[2:0] | Res | Coord[10:0]
0x0583 <-- (SSt1) 0 | Width[2:0] | Res | Coord[10:0]
0x033e <-- (SAx2) 0 | Width[2:0] | Res | Coord[10:0]
0x0357 <-- (SSt2) 0 | Width[2:0] | Res | Coord[10:0]
0x00c9 <-- (SAx3) 0 | Width[2:0] | Res | Coord[10:0]
0x00ed <-- (SSt3) 0 | Width[2:0] | Res | Coord[10:0]
0xe0da <-- Begin trailer debug block
0x0000 <-- Length of debug block | Indeterminate[3:0]
0xe0df <-- End debug block
0x0000 <-- Length of debug block | Indeterminate[3:0]
0x0000 <-- L1ID[31:16]
0x0000 <-- L1ID[15:0]
0x0000 <-- ErrorFlag[31:16]
0x0001 <-- ErrorFlag[15:0]
0x0000 <-- Res
0x0000 <-- Res
0x0000 <-- Res
0x0000 <-- Res
0xe0f0 <-- stripped by FLI in CoreCrateRcvr machine
0xa5a5 <-- stripped by FLI in CoreCrateRcvr machine
0x5a5a <-- stripped by FLI in CoreCrateRcvr machine
0x0e0f <-- stripped by FLI in CoreCrateRcvr machine
