0xee12
0x34ee <-- Start of Header Marker
0x0000
0x0009 <-- Header size - fixed
0x0301
0x0000 <-- Format version number - formed within FLIC from firmware
0x0000
0x007f <-- Source identifier - fixed
0x0003
0x652e <-- 0 | RunNumber[30:0]
0x0008
0x4d69 <-- Extended level 1 ID
0x0000
0x08bc <-- Res[31:12] | BCID[11:0]
0x0000
0x0000 <-- Res[31:8] | L1TriggerType[7:0]
0x0000
0x0000 <-- Res[31:24] | DetectorEventType[23:16] | Res[15:4] | TIM[3:0]
0x0bda
0x7339 <-- Res[3:0] | L | 0xbda | sector
0x0016
0x0dff <-- 
0x0000
0x0024 <-- RoadID[23:0]
0x1d77
0x7ffa <-- Track chi2[31:16] | Track d0[15:0]
0x85f4
0x80db <-- Track z0[31:16] | Track coth[15:0]
0x2864
0x3d47 <-- Track phi0[31:16] | Track curv[15:0]
0x0000
0x0146 <-- Res[31:12] | Module L0
0x12f3
0x17d9 <-- IBL
0x0000
0x0270 <-- Res[31:12] | Module L1
0x1790
0x26dc <-- PL0b
0x0000
0x041d <-- Res[31:12] | Module L2
0x17e0
0x20ea <-- PL1b
0x0000
0x0673 <-- Res[31:12] | Module L3
0x1830
0x26f3 <-- PL2b
0x0130
0x09bd <-- SAx0
0x0148
0x09bc <-- SSt0
0x033c
0x0d34 <-- SAx1
0x0326
0x0d35 <-- SSt1
0x0592
0x116d <-- SAx2
0x0000
0x1184 <-- SSt2
0x0280
0x167c <-- SAx3
0x0274
0x167d <-- SSt3
0x0bda
0x176e <-- Res[3:0] | L | 0xbda | sector
0x0016
0x0ffe <-- 
0x0000
0x0009 <-- RoadID[23:0]
0x214f
0x81aa <-- Track chi2[31:16] | Track d0[15:0]
0x6db8
0x903b <-- Track z0[31:16] | Track coth[15:0]
0x2a09
0xb3b0 <-- Track phi0[31:16] | Track curv[15:0]
0x0000
0x0145 <-- Res[31:12] | Module L0
0x0000
0x0000 <-- IBL
0x0000
0x0270 <-- Res[31:12] | Module L1
0x15d0
0x17d0 <-- PL0b
0x0000
0x041e <-- Res[31:12] | Module L2
0x11f0
0x1188 <-- PL1b
0x0000
0x0674 <-- Res[31:12] | Module L3
0x17c0
0x1638 <-- PL2b
0x043b
0x09a9 <-- SAx0
0x0464
0x09a8 <-- SSt0
0x0458
0x0d20 <-- SAx1
0x0478
0x0d21 <-- SSt1
0x044f
0x115b <-- SAx2
0x045a
0x115a <-- SSt2
0x0409
0x1652 <-- SAx3
0x0446
0x1653 <-- SSt3
0x0bda
0x7096 <-- Res[3:0] | L | 0xbda | sector
0x0016
0x0fff <-- 
0x0000
0x0003 <-- RoadID[23:0]
0x7647
0x7f83 <-- Track chi2[31:16] | Track d0[15:0]
0x85f0
0x8d70 <-- Track z0[31:16] | Track coth[15:0]
0x3718
0xd0f9 <-- Track phi0[31:16] | Track curv[15:0]
0x0000
0x015b <-- Res[31:12] | Module L0
0x10a5
0x15b9 <-- IBL
0x0000
0x027e <-- Res[31:12] | Module L1
0x14a0
0x2923 <-- PL0b
0x0000
0x0438 <-- Res[31:12] | Module L2
0x1900
0x10a0 <-- PL1b
0x0000
0x069c <-- Res[31:12] | Module L3
0x1420
0x1280 <-- PL2b
0x016d
0x09d9 <-- SAx0
0x0184
0x09d8 <-- SSt0
0x038f
0x0d50 <-- SAx1
0x03b0
0x0d51 <-- SSt1
0x055f
0x118b <-- SAx2
0x057c
0x118a <-- SSt2
0x00df
0x169a <-- SAx3
0x010a
0x169b <-- SSt3
0x0bda
0x7a5d <-- Res[3:0] | L | 0xbda | sector
0x0016
0x0bff <-- 
0x0000
0x0000 <-- RoadID[23:0]
0x26f8
0x8015 <-- Track chi2[31:16] | Track d0[15:0]
0x6dc6
0x871d <-- Track z0[31:16] | Track coth[15:0]
0x4217
0x2613 <-- Track phi0[31:16] | Track curv[15:0]
0x0000
0x016d <-- Res[31:12] | Module L0
0x11c7
0x12c1 <-- IBL
0x0000
0x028a <-- Res[31:12] | Module L1
0x113c
0x2a33 <-- PL0b
0x0000
0x0451 <-- Res[31:12] | Module L2
0x139c
0x212c <-- PL1b
0x0000
0x06c1 <-- Res[31:12] | Module L3
0x1610
0x2265 <-- PL2b
0x0404
0x0a05 <-- SAx0
0x03e6
0x0a04 <-- SSt0
0x0586
0x0d96 <-- SAx1
0x0548
0x0d97 <-- SSt1
0x01dd
0x11ff <-- SAx2
0x01f6
0x11fe <-- SSt2
0x0000
0x170e <-- SAx3
0x0424
0x170f <-- SSt3
0xe0da
0x0000 <-- E0DA (begin debug block) | Length of debug block | Indeterminate[3:0]
0xe0df
0x0000 <-- E0DF (end debug block)   | Length of debug block | Indeterminate[3:0]
0x0000
0x0000 <-- L1ID
0x0000
0x0001 <-- ErrorFlag
0x0000
0x0000 <-- Res
0x0000
0x0000 <-- Res
