0xb0f0 <-- stripped by FLIC in CoreCrate machine
0xcaf0 <-- stripped by FLIC in CoreCrate machine, Bits[3:0] are indeterminate
0xff12 <-- stripped by FLIC in CoreCrate machine
0x34ff <-- stripped by FLIC in CoreCrate machine
0x0003 <-- 0 | RunNumber[30:16], RunNumber=0x3652e
0x652e <-- RunNumber[15:0], RunNumber=0x3652e
0x0008 <-- ExtendedLevel1ID[31:16], word=0x84daa
0x4daa <-- ExtendedLevel1ID[15:0], word=0x84daa
0x0000 <-- Res
0x0adf <-- Res[3:0] | BCID[11:0], word=0xadf
0x0000 <-- Res
0x0000 <-- Res[7:0] | L1TriggerType[7:0], word=0x0
0x0000 <-- Res[7:0] | DetectorEventType[7:0]
0x0000 <-- Res[11:0] | TIM[3:0]
0x0bda <-- Res[3:0] | L | 0xb | 0xd | 0xa, word=0xbda01c8
0x01c8 <-- Sector Number
0x0016 <-- Res[3:0] | TFNum[3:0] | Res | Tower[6:0], word=0x160ffe
0x0ffe <-- Res[3:0] | Layermap[11:0]
0x0000 <-- Res[7:0] | RoadID[23:16], word=0x1
0x0001 <-- RoadID[15:0]
0x5c6b <-- Track chi2
0x8017 <-- Track d0
0x7b62 <-- Track z0
0x825b <-- Track coth
0x40a4 <-- Track phi
0xd059 <-- Track curv
0x0000 <-- (IBLa) 0 | ColWidth[2:0] | ColCoord[11:0]
0x0000 <-- (IBLb) s | RowWidth[2:0] | RowCoord[11:0]
0x1420 <-- (PL0a) 0 | ColWidth[2:0] | ColCoord[11:0]
0x279b <-- (PL0b) s | RowWidth[2:0] | RowCoord[11:0]
0x1500 <-- (PL1a) 0 | ColWidth[2:0] | ColCoord[11:0]
0x1548 <-- (PL1b) s | RowWidth[2:0] | RowCoord[11:0]
0x15c0 <-- (PL2a) 0 | ColWidth[2:0] | ColCoord[11:0]
0x12d0 <-- (PL2b) s | RowWidth[2:0] | RowCoord[11:0]
0x02f7 <-- (SAx0) 0 | Width[2:0] | Res | Coord[10:0]
0x030a <-- (SSt0) 0 | Width[2:0] | Res | Coord[10:0]
0x00f3 <-- (SAx1) 0 | Width[2:0] | Res | Coord[10:0]
0x00ed <-- (SSt1) 0 | Width[2:0] | Res | Coord[10:0]
0x04b4 <-- (SAx2) 0 | Width[2:0] | Res | Coord[10:0]
0x04b1 <-- (SSt2) 0 | Width[2:0] | Res | Coord[10:0]
0x0218 <-- (SAx3) 0 | Width[2:0] | Res | Coord[10:0]
0x022c <-- (SSt3) 0 | Width[2:0] | Res | Coord[10:0]
0xe0da <-- Begin trailer debug block
0x0000 <-- Length of debug block | Indeterminate[3:0]
0xe0df <-- End debug block
0x0000 <-- Length of debug block | Indeterminate[3:0]
0x0000 <-- L1ID[31:16]
0x0000 <-- L1ID[15:0]
0x0000 <-- ErrorFlag[31:16]
0x0001 <-- ErrorFlag[15:0]
0x0000 <-- Res
0x0000 <-- Res
0x0000 <-- Res
0x0000 <-- Res
0xe0f0 <-- stripped by FLI in CoreCrateRcvr machine
0xa5a5 <-- stripped by FLI in CoreCrateRcvr machine
0x5a5a <-- stripped by FLI in CoreCrateRcvr machine
0x0e0f <-- stripped by FLI in CoreCrateRcvr machine
