0xb0f0 <-- stripped by FLIC in CoreCrate machine
0xcaf0 <-- stripped by FLIC in CoreCrate machine, Bits[3:0] are indeterminate
0xff12 <-- stripped by FLIC in CoreCrate machine
0x34ff <-- stripped by FLIC in CoreCrate machine
0x0003 <-- 0 | RunNumber[30:16], RunNumber=0x3652e
0x652e <-- RunNumber[15:0], RunNumber=0x3652e
0x0008 <-- ExtendedLevel1ID[31:16], word=0x86772
0x6772 <-- ExtendedLevel1ID[15:0], word=0x86772
0x0000 <-- Res
0x0d18 <-- Res[3:0] | BCID[11:0], word=0xd18
0x0000 <-- Res
0x0000 <-- Res[7:0] | L1TriggerType[7:0], word=0x0
0x0000 <-- Res[7:0] | DetectorEventType[7:0]
0x0000 <-- Res[11:0] | TIM[3:0]
0x0bda <-- Res[3:0] | L | 0xb | 0xd | 0xa, word=0xbda3eb2
0x3eb2 <-- Sector Number
0x0016 <-- Res[3:0] | TFNum[3:0] | Res | Tower[6:0], word=0x160ff6
0x0ff6 <-- Res[3:0] | Layermap[11:0]
0x0000 <-- Res[7:0] | RoadID[23:16], word=0x7c
0x007c <-- RoadID[15:0]
0x0efd <-- Track chi2
0x7f2c <-- Track d0
0x99f4 <-- Track z0
0x8362 <-- Track coth
0x2584 <-- Track phi
0x3570 <-- Track curv
0x0000 <-- (IBLa) 0 | ColWidth[2:0] | ColCoord[11:0]
0x0000 <-- (IBLb) s | RowWidth[2:0] | RowCoord[11:0]
0x172c <-- (PL0a) 0 | ColWidth[2:0] | ColCoord[11:0]
0x1458 <-- (PL0b) s | RowWidth[2:0] | RowCoord[11:0]
0x287a <-- (PL1a) 0 | ColWidth[2:0] | ColCoord[11:0]
0x1648 <-- (PL1b) s | RowWidth[2:0] | RowCoord[11:0]
0x0000 <-- (PL2a) 0 | ColWidth[2:0] | ColCoord[11:0]
0x0000 <-- (PL2b) s | RowWidth[2:0] | RowCoord[11:0]
0x0507 <-- (SAx0) 0 | Width[2:0] | Res | Coord[10:0]
0x053a <-- (SSt0) 0 | Width[2:0] | Res | Coord[10:0]
0x00ee <-- (SAx1) 0 | Width[2:0] | Res | Coord[10:0]
0x00ce <-- (SSt1) 0 | Width[2:0] | Res | Coord[10:0]
0x02fa <-- (SAx2) 0 | Width[2:0] | Res | Coord[10:0]
0x030e <-- (SSt2) 0 | Width[2:0] | Res | Coord[10:0]
0x0530 <-- (SAx3) 0 | Width[2:0] | Res | Coord[10:0]
0x052a <-- (SSt3) 0 | Width[2:0] | Res | Coord[10:0]
0x0bda <-- Res[3:0] | L | 0xb | 0xd | 0xa, word=0xbda0bba
0x0bba <-- Sector Number
0x0016 <-- Res[3:0] | TFNum[3:0] | Res | Tower[6:0], word=0x160ff7
0x0ff7 <-- Res[3:0] | Layermap[11:0]
0x0000 <-- Res[7:0] | RoadID[23:16], word=0x70
0x0070 <-- RoadID[15:0]
0x230b <-- Track chi2
0x7ff8 <-- Track d0
0x9a05 <-- Track z0
0x7e98 <-- Track coth
0x268f <-- Track phi
0x2a7d <-- Track curv
0x13b7 <-- (IBLa) 0 | ColWidth[2:0] | ColCoord[11:0]
0x26d5 <-- (IBLb) s | RowWidth[2:0] | RowCoord[11:0]
0x14cc <-- (PL0a) 0 | ColWidth[2:0] | ColCoord[11:0]
0x2585 <-- (PL0b) s | RowWidth[2:0] | RowCoord[11:0]
0x1440 <-- (PL1a) 0 | ColWidth[2:0] | ColCoord[11:0]
0x287c <-- (PL1b) s | RowWidth[2:0] | RowCoord[11:0]
0x0000 <-- (PL2a) 0 | ColWidth[2:0] | ColCoord[11:0]
0x0000 <-- (PL2b) s | RowWidth[2:0] | RowCoord[11:0]
0x0084 <-- (SAx0) 0 | Width[2:0] | Res | Coord[10:0]
0x0094 <-- (SSt0) 0 | Width[2:0] | Res | Coord[10:0]
0x0298 <-- (SAx1) 0 | Width[2:0] | Res | Coord[10:0]
0x0282 <-- (SSt1) 0 | Width[2:0] | Res | Coord[10:0]
0x050a <-- (SAx2) 0 | Width[2:0] | Res | Coord[10:0]
0x052a <-- (SSt2) 0 | Width[2:0] | Res | Coord[10:0]
0x022c <-- (SAx3) 0 | Width[2:0] | Res | Coord[10:0]
0x0206 <-- (SSt3) 0 | Width[2:0] | Res | Coord[10:0]
0x0bda <-- Res[3:0] | L | 0xb | 0xd | 0xa, word=0xbda3b42
0x3b42 <-- Sector Number
0x0016 <-- Res[3:0] | TFNum[3:0] | Res | Tower[6:0], word=0x160ffe
0x0ffe <-- Res[3:0] | Layermap[11:0]
0x0000 <-- Res[7:0] | RoadID[23:16], word=0x14
0x0014 <-- RoadID[15:0]
0x0849 <-- Track chi2
0x803b <-- Track d0
0x9c40 <-- Track z0
0x8438 <-- Track coth
0x3320 <-- Track phi
0x415b <-- Track curv
0x0000 <-- (IBLa) 0 | ColWidth[2:0] | ColCoord[11:0]
0x0000 <-- (IBLb) s | RowWidth[2:0] | RowCoord[11:0]
0x1890 <-- (PL0a) 0 | ColWidth[2:0] | ColCoord[11:0]
0x2685 <-- (PL0b) s | RowWidth[2:0] | RowCoord[11:0]
0x1090 <-- (PL1a) 0 | ColWidth[2:0] | ColCoord[11:0]
0x278b <-- (PL1b) s | RowWidth[2:0] | RowCoord[11:0]
0x1210 <-- (PL2a) 0 | ColWidth[2:0] | ColCoord[11:0]
0x29ed <-- (PL2b) s | RowWidth[2:0] | RowCoord[11:0]
0x035c <-- (SAx0) 0 | Width[2:0] | Res | Coord[10:0]
0x0378 <-- (SSt0) 0 | Width[2:0] | Res | Coord[10:0]
0x0195 <-- (SAx1) 0 | Width[2:0] | Res | Coord[10:0]
0x018f <-- (SSt1) 0 | Width[2:0] | Res | Coord[10:0]
0x05da <-- (SAx2) 0 | Width[2:0] | Res | Coord[10:0]
0x05d0 <-- (SSt2) 0 | Width[2:0] | Res | Coord[10:0]
0x04a2 <-- (SAx3) 0 | Width[2:0] | Res | Coord[10:0]
0x04be <-- (SSt3) 0 | Width[2:0] | Res | Coord[10:0]
0x0bda <-- Res[3:0] | L | 0xb | 0xd | 0xa, word=0xbda56b3
0x56b3 <-- Sector Number
0x0016 <-- Res[3:0] | TFNum[3:0] | Res | Tower[6:0], word=0x160fff
0x0fff <-- Res[3:0] | Layermap[11:0]
0x0000 <-- Res[7:0] | RoadID[23:16], word=0x11
0x0011 <-- RoadID[15:0]
0x19ab <-- Track chi2
0x7fbc <-- Track d0
0x92fa <-- Track z0
0x8304 <-- Track coth
0x3b48 <-- Track phi
0xac92 <-- Track curv
0x226c <-- (IBLa) 0 | ColWidth[2:0] | ColCoord[11:0]
0x2846 <-- (IBLb) s | RowWidth[2:0] | RowCoord[11:0]
0x1430 <-- (PL0a) 0 | ColWidth[2:0] | ColCoord[11:0]
0x1350 <-- (PL0b) s | RowWidth[2:0] | RowCoord[11:0]
0x1570 <-- (PL1a) 0 | ColWidth[2:0] | ColCoord[11:0]
0x17b8 <-- (PL1b) s | RowWidth[2:0] | RowCoord[11:0]
0x1660 <-- (PL2a) 0 | ColWidth[2:0] | ColCoord[11:0]
0x12d8 <-- (PL2b) s | RowWidth[2:0] | RowCoord[11:0]
0x000b <-- (SAx0) 0 | Width[2:0] | Res | Coord[10:0]
0x05be <-- (SSt0) 0 | Width[2:0] | Res | Coord[10:0]
0x03b4 <-- (SAx1) 0 | Width[2:0] | Res | Coord[10:0]
0x03f4 <-- (SSt1) 0 | Width[2:0] | Res | Coord[10:0]
0x0144 <-- (SAx2) 0 | Width[2:0] | Res | Coord[10:0]
0x016d <-- (SSt2) 0 | Width[2:0] | Res | Coord[10:0]
0x0482 <-- (SAx3) 0 | Width[2:0] | Res | Coord[10:0]
0x0464 <-- (SSt3) 0 | Width[2:0] | Res | Coord[10:0]
0x0bda <-- Res[3:0] | L | 0xb | 0xd | 0xa, word=0xbda1418
0x1418 <-- Sector Number
0x0016 <-- Res[3:0] | TFNum[3:0] | Res | Tower[6:0], word=0x160ffe
0x0ffe <-- Res[3:0] | Layermap[11:0]
0x0000 <-- Res[7:0] | RoadID[23:16], word=0x0
0x0000 <-- RoadID[15:0]
0x20e9 <-- Track chi2
0x7a35 <-- Track d0
0x7c43 <-- Track z0
0x889d <-- Track coth
0x411a <-- Track phi
0x3cf9 <-- Track curv
0x0000 <-- (IBLa) 0 | ColWidth[2:0] | ColCoord[11:0]
0x0000 <-- (IBLb) s | RowWidth[2:0] | RowCoord[11:0]
0x17b0 <-- (PL0a) 0 | ColWidth[2:0] | ColCoord[11:0]
0x27ed <-- (PL0b) s | RowWidth[2:0] | RowCoord[11:0]
0x1160 <-- (PL1a) 0 | ColWidth[2:0] | ColCoord[11:0]
0x280c <-- (PL1b) s | RowWidth[2:0] | RowCoord[11:0]
0x2439 <-- (PL2a) 0 | ColWidth[2:0] | ColCoord[11:0]
0x1830 <-- (PL2b) s | RowWidth[2:0] | RowCoord[11:0]
0x0210 <-- (SAx0) 0 | Width[2:0] | Res | Coord[10:0]
0x0229 <-- (SSt0) 0 | Width[2:0] | Res | Coord[10:0]
0x02e3 <-- (SAx1) 0 | Width[2:0] | Res | Coord[10:0]
0x02ee <-- (SSt1) 0 | Width[2:0] | Res | Coord[10:0]
0x040e <-- (SAx2) 0 | Width[2:0] | Res | Coord[10:0]
0x03de <-- (SSt2) 0 | Width[2:0] | Res | Coord[10:0]
0x0566 <-- (SAx3) 0 | Width[2:0] | Res | Coord[10:0]
0x053e <-- (SSt3) 0 | Width[2:0] | Res | Coord[10:0]
0xe0da <-- Begin trailer debug block
0x0000 <-- Length of debug block | Indeterminate[3:0]
0xe0df <-- End debug block
0x0000 <-- Length of debug block | Indeterminate[3:0]
0x0000 <-- L1ID[31:16]
0x0000 <-- L1ID[15:0]
0x0000 <-- ErrorFlag[31:16]
0x0001 <-- ErrorFlag[15:0]
0x0000 <-- Res
0x0000 <-- Res
0x0000 <-- Res
0x0000 <-- Res
0xe0f0 <-- stripped by FLI in CoreCrateRcvr machine
0xa5a5 <-- stripped by FLI in CoreCrateRcvr machine
0x5a5a <-- stripped by FLI in CoreCrateRcvr machine
0x0e0f <-- stripped by FLI in CoreCrateRcvr machine
