0xb0f0 <-- stripped by FLIC in CoreCrate machine
0xcaf0 <-- stripped by FLIC in CoreCrate machine, Bits[3:0] are indeterminate
0xff12 <-- stripped by FLIC in CoreCrate machine
0x34ff <-- stripped by FLIC in CoreCrate machine
0x0003 <-- 0 | RunNumber[30:16], RunNumber=0x3652e
0x652e <-- RunNumber[15:0], RunNumber=0x3652e
0x0008 <-- ExtendedLevel1ID[31:16], word=0x8672e
0x672e <-- ExtendedLevel1ID[15:0], word=0x8672e
0x0000 <-- Res
0x07c1 <-- Res[3:0] | BCID[11:0], word=0x7c1
0x0000 <-- Res
0x0000 <-- Res[7:0] | L1TriggerType[7:0], word=0x0
0x0000 <-- Res[7:0] | DetectorEventType[7:0]
0x0000 <-- Res[11:0] | TIM[3:0]
0x0bda <-- Res[3:0] | L | 0xb | 0xd | 0xa, word=0xbda00cf
0x00cf <-- Sector Number
0x0016 <-- Res[3:0] | TFNum[3:0] | Res | Tower[6:0], word=0x160efe
0x0efe <-- Res[3:0] | Layermap[11:0]
0x0000 <-- Res[7:0] | RoadID[23:16], word=0x4
0x0004 <-- RoadID[15:0]
0x5dbe <-- Track chi2
0x8052 <-- Track d0
0x8d94 <-- Track z0
0x80fc <-- Track coth
0x2c75 <-- Track phi
0x2c6b <-- Track curv
0x0000 <-- (IBLa) 0 | ColWidth[2:0] | ColCoord[11:0]
0x0000 <-- (IBLb) s | RowWidth[2:0] | RowCoord[11:0]
0x1100 <-- (PL0a) 0 | ColWidth[2:0] | ColCoord[11:0]
0x1140 <-- (PL0b) s | RowWidth[2:0] | RowCoord[11:0]
0x1170 <-- (PL1a) 0 | ColWidth[2:0] | ColCoord[11:0]
0x27a4 <-- (PL1b) s | RowWidth[2:0] | RowCoord[11:0]
0x11c0 <-- (PL2a) 0 | ColWidth[2:0] | ColCoord[11:0]
0x2694 <-- (PL2b) s | RowWidth[2:0] | RowCoord[11:0]
0x04c3 <-- (SAx0) 0 | Width[2:0] | Res | Coord[10:0]
0x04c8 <-- (SSt0) 0 | Width[2:0] | Res | Coord[10:0]
0x022d <-- (SAx1) 0 | Width[2:0] | Res | Coord[10:0]
0x022c <-- (SSt1) 0 | Width[2:0] | Res | Coord[10:0]
0x0000 <-- (SAx2) 0 | Width[2:0] | Res | Coord[10:0]
0x05a8 <-- (SSt2) 0 | Width[2:0] | Res | Coord[10:0]
0x03d0 <-- (SAx3) 0 | Width[2:0] | Res | Coord[10:0]
0x03d4 <-- (SSt3) 0 | Width[2:0] | Res | Coord[10:0]
0xe0da <-- Begin trailer debug block
0x0000 <-- Length of debug block | Indeterminate[3:0]
0xe0df <-- End debug block
0x0000 <-- Length of debug block | Indeterminate[3:0]
0x0000 <-- L1ID[31:16]
0x0000 <-- L1ID[15:0]
0x0000 <-- ErrorFlag[31:16]
0x0001 <-- ErrorFlag[15:0]
0x0000 <-- Res
0x0000 <-- Res
0x0000 <-- Res
0x0000 <-- Res
0xe0f0 <-- stripped by FLI in CoreCrateRcvr machine
0xa5a5 <-- stripped by FLI in CoreCrateRcvr machine
0x5a5a <-- stripped by FLI in CoreCrateRcvr machine
0x0e0f <-- stripped by FLI in CoreCrateRcvr machine
