0xb0f0 <-- stripped by FLIC in CoreCrate machine
0xcaf0 <-- stripped by FLIC in CoreCrate machine, Bits[3:0] are indeterminate
0xff12 <-- stripped by FLIC in CoreCrate machine
0x34ff <-- stripped by FLIC in CoreCrate machine
0x0003 <-- 0 | RunNumber[30:16], RunNumber=0x3652e
0x652e <-- RunNumber[15:0], RunNumber=0x3652e
0x0008 <-- ExtendedLevel1ID[31:16], word=0x84d8b
0x4d8b <-- ExtendedLevel1ID[15:0], word=0x84d8b
0x0000 <-- Res
0x0960 <-- Res[3:0] | BCID[11:0], word=0x960
0x0000 <-- Res
0x0000 <-- Res[7:0] | L1TriggerType[7:0], word=0x0
0x0000 <-- Res[7:0] | DetectorEventType[7:0]
0x0000 <-- Res[11:0] | TIM[3:0]
0x0bda <-- Res[3:0] | L | 0xb | 0xd | 0xa, word=0xbda1802
0x1802 <-- Sector Number
0x0016 <-- Res[3:0] | TFNum[3:0] | Res | Tower[6:0], word=0x160ffb
0x0ffb <-- Res[3:0] | Layermap[11:0]
0x0000 <-- Res[7:0] | RoadID[23:16], word=0xc0
0x00c0 <-- RoadID[15:0]
0x1bfa <-- Track chi2
0x7f27 <-- Track d0
0x7765 <-- Track z0
0x84fa <-- Track coth
0x34a7 <-- Track phi
0xd113 <-- Track curv
0x24f2 <-- (IBLa) 0 | ColWidth[2:0] | ColCoord[11:0]
0x2455 <-- (IBLb) s | RowWidth[2:0] | RowCoord[11:0]
0x23d6 <-- (PL0a) 0 | ColWidth[2:0] | ColCoord[11:0]
0x26ad <-- (PL0b) s | RowWidth[2:0] | RowCoord[11:0]
0x0000 <-- (PL1a) 0 | ColWidth[2:0] | ColCoord[11:0]
0x0000 <-- (PL1b) s | RowWidth[2:0] | RowCoord[11:0]
0x1770 <-- (PL2a) 0 | ColWidth[2:0] | ColCoord[11:0]
0x271d <-- (PL2b) s | RowWidth[2:0] | RowCoord[11:0]
0x0578 <-- (SAx0) 0 | Width[2:0] | Res | Coord[10:0]
0x0568 <-- (SSt0) 0 | Width[2:0] | Res | Coord[10:0]
0x012f <-- (SAx1) 0 | Width[2:0] | Res | Coord[10:0]
0x015d <-- (SSt1) 0 | Width[2:0] | Res | Coord[10:0]
0x029e <-- (SAx2) 0 | Width[2:0] | Res | Coord[10:0]
0x025a <-- (SSt2) 0 | Width[2:0] | Res | Coord[10:0]
0x037b <-- (SAx3) 0 | Width[2:0] | Res | Coord[10:0]
0x0359 <-- (SSt3) 0 | Width[2:0] | Res | Coord[10:0]
0x0bda <-- Res[3:0] | L | 0xb | 0xd | 0xa, word=0xbda197d
0x197d <-- Sector Number
0x0016 <-- Res[3:0] | TFNum[3:0] | Res | Tower[6:0], word=0x160ffb
0x0ffb <-- Res[3:0] | Layermap[11:0]
0x0000 <-- Res[7:0] | RoadID[23:16], word=0xbc
0x00bc <-- RoadID[15:0]
0x1270 <-- Track chi2
0x7f97 <-- Track d0
0x6f41 <-- Track z0
0x8a32 <-- Track coth
0x3363 <-- Track phi
0xd3fe <-- Track curv
0x2365 <-- (IBLa) 0 | ColWidth[2:0] | ColCoord[11:0]
0x13b9 <-- (IBLb) s | RowWidth[2:0] | RowCoord[11:0]
0x1330 <-- (PL0a) 0 | ColWidth[2:0] | ColCoord[11:0]
0x25a4 <-- (PL0b) s | RowWidth[2:0] | RowCoord[11:0]
0x0000 <-- (PL1a) 0 | ColWidth[2:0] | ColCoord[11:0]
0x0000 <-- (PL1b) s | RowWidth[2:0] | RowCoord[11:0]
0x10f0 <-- (PL2a) 0 | ColWidth[2:0] | ColCoord[11:0]
0x24c4 <-- (PL2b) s | RowWidth[2:0] | RowCoord[11:0]
0x0472 <-- (SAx0) 0 | Width[2:0] | Res | Coord[10:0]
0x048b <-- (SSt0) 0 | Width[2:0] | Res | Coord[10:0]
0x05c0 <-- (SAx1) 0 | Width[2:0] | Res | Coord[10:0]
0x05d4 <-- (SSt1) 0 | Width[2:0] | Res | Coord[10:0]
0x0108 <-- (SAx2) 0 | Width[2:0] | Res | Coord[10:0]
0x0137 <-- (SSt2) 0 | Width[2:0] | Res | Coord[10:0]
0x01af <-- (SAx3) 0 | Width[2:0] | Res | Coord[10:0]
0x01ae <-- (SSt3) 0 | Width[2:0] | Res | Coord[10:0]
0x0bda <-- Res[3:0] | L | 0xb | 0xd | 0xa, word=0xbda9159
0x9159 <-- Sector Number
0x0016 <-- Res[3:0] | TFNum[3:0] | Res | Tower[6:0], word=0x160ff6
0x0ff6 <-- Res[3:0] | Layermap[11:0]
0x0000 <-- Res[7:0] | RoadID[23:16], word=0x61
0x0061 <-- RoadID[15:0]
0x2176 <-- Track chi2
0x802d <-- Track d0
0x7036 <-- Track z0
0x9122 <-- Track coth
0x3a71 <-- Track phi
0x5bef <-- Track curv
0x0000 <-- (IBLa) 0 | ColWidth[2:0] | ColCoord[11:0]
0x0000 <-- (IBLb) s | RowWidth[2:0] | RowCoord[11:0]
0x16d0 <-- (PL0a) 0 | ColWidth[2:0] | ColCoord[11:0]
0x1310 <-- (PL0b) s | RowWidth[2:0] | RowCoord[11:0]
0x2442 <-- (PL1a) 0 | ColWidth[2:0] | ColCoord[11:0]
0x2835 <-- (PL1b) s | RowWidth[2:0] | RowCoord[11:0]
0x0000 <-- (PL2a) 0 | ColWidth[2:0] | ColCoord[11:0]
0x0000 <-- (PL2b) s | RowWidth[2:0] | RowCoord[11:0]
0x0234 <-- (SAx0) 0 | Width[2:0] | Res | Coord[10:0]
0x0242 <-- (SSt0) 0 | Width[2:0] | Res | Coord[10:0]
0x013b <-- (SAx1) 0 | Width[2:0] | Res | Coord[10:0]
0x0105 <-- (SSt1) 0 | Width[2:0] | Res | Coord[10:0]
0x0094 <-- (SAx2) 0 | Width[2:0] | Res | Coord[10:0]
0x0078 <-- (SSt2) 0 | Width[2:0] | Res | Coord[10:0]
0x05b4 <-- (SAx3) 0 | Width[2:0] | Res | Coord[10:0]
0x0592 <-- (SSt3) 0 | Width[2:0] | Res | Coord[10:0]
0x0bda <-- Res[3:0] | L | 0xb | 0xd | 0xa, word=0xbda1005
0x1005 <-- Sector Number
0x0016 <-- Res[3:0] | TFNum[3:0] | Res | Tower[6:0], word=0x160ffd
0x0ffd <-- Res[3:0] | Layermap[11:0]
0x0000 <-- Res[7:0] | RoadID[23:16], word=0x59
0x0059 <-- RoadID[15:0]
0x2fe7 <-- Track chi2
0x7e5a <-- Track d0
0x6824 <-- Track z0
0x88bd <-- Track coth
0x3b23 <-- Track phi
0x3d16 <-- Track curv
0x1041 <-- (IBLa) 0 | ColWidth[2:0] | ColCoord[11:0]
0x1849 <-- (IBLb) s | RowWidth[2:0] | RowCoord[11:0]
0x0000 <-- (PL0a) 0 | ColWidth[2:0] | ColCoord[11:0]
0x0000 <-- (PL0b) s | RowWidth[2:0] | RowCoord[11:0]
0x231b <-- (PL1a) 0 | ColWidth[2:0] | ColCoord[11:0]
0x2976 <-- (PL1b) s | RowWidth[2:0] | RowCoord[11:0]
0x25f4 <-- (PL2a) 0 | ColWidth[2:0] | ColCoord[11:0]
0x1678 <-- (PL2b) s | RowWidth[2:0] | RowCoord[11:0]
0x03c6 <-- (SAx0) 0 | Width[2:0] | Res | Coord[10:0]
0x0396 <-- (SSt0) 0 | Width[2:0] | Res | Coord[10:0]
0x038e <-- (SAx1) 0 | Width[2:0] | Res | Coord[10:0]
0x036e <-- (SSt1) 0 | Width[2:0] | Res | Coord[10:0]
0x03c0 <-- (SAx2) 0 | Width[2:0] | Res | Coord[10:0]
0x03b8 <-- (SSt2) 0 | Width[2:0] | Res | Coord[10:0]
0x0422 <-- (SAx3) 0 | Width[2:0] | Res | Coord[10:0]
0x0450 <-- (SSt3) 0 | Width[2:0] | Res | Coord[10:0]
0x0bda <-- Res[3:0] | L | 0xb | 0xd | 0xa, word=0xbda0096
0x0096 <-- Sector Number
0x0016 <-- Res[3:0] | TFNum[3:0] | Res | Tower[6:0], word=0x160fff
0x0fff <-- Res[3:0] | Layermap[11:0]
0x0000 <-- Res[7:0] | RoadID[23:16], word=0x3d
0x003d <-- RoadID[15:0]
0x0db9 <-- Track chi2
0x7ff6 <-- Track d0
0x7761 <-- Track z0
0x838f <-- Track coth
0x3031 <-- Track phi
0x90b9 <-- Track curv
0x1475 <-- (IBLa) 0 | ColWidth[2:0] | ColCoord[11:0]
0x2244 <-- (IBLb) s | RowWidth[2:0] | RowCoord[11:0]
0x1310 <-- (PL0a) 0 | ColWidth[2:0] | ColCoord[11:0]
0x1370 <-- (PL0b) s | RowWidth[2:0] | RowCoord[11:0]
0x1460 <-- (PL1a) 0 | ColWidth[2:0] | ColCoord[11:0]
0x2145 <-- (PL1b) s | RowWidth[2:0] | RowCoord[11:0]
0x1590 <-- (PL2a) 0 | ColWidth[2:0] | ColCoord[11:0]
0x1068 <-- (PL2b) s | RowWidth[2:0] | RowCoord[11:0]
0x0442 <-- (SAx0) 0 | Width[2:0] | Res | Coord[10:0]
0x044c <-- (SSt0) 0 | Width[2:0] | Res | Coord[10:0]
0x005e <-- (SAx1) 0 | Width[2:0] | Res | Coord[10:0]
0x0069 <-- (SSt1) 0 | Width[2:0] | Res | Coord[10:0]
0x026a <-- (SAx2) 0 | Width[2:0] | Res | Coord[10:0]
0x0251 <-- (SSt2) 0 | Width[2:0] | Res | Coord[10:0]
0x043e <-- (SAx3) 0 | Width[2:0] | Res | Coord[10:0]
0x0464 <-- (SSt3) 0 | Width[2:0] | Res | Coord[10:0]
0x0bda <-- Res[3:0] | L | 0xb | 0xd | 0xa, word=0xbda0098
0x0098 <-- Sector Number
0x0016 <-- Res[3:0] | TFNum[3:0] | Res | Tower[6:0], word=0x160fff
0x0fff <-- Res[3:0] | Layermap[11:0]
0x0000 <-- Res[7:0] | RoadID[23:16], word=0x32
0x0032 <-- RoadID[15:0]
0x16f6 <-- Track chi2
0x801d <-- Track d0
0x775d <-- Track z0
0x81dc <-- Track coth
0x3439 <-- Track phi
0xba1b <-- Track curv
0x13e9 <-- (IBLa) 0 | ColWidth[2:0] | ColCoord[11:0]
0x1451 <-- (IBLb) s | RowWidth[2:0] | RowCoord[11:0]
0x1240 <-- (PL0a) 0 | ColWidth[2:0] | ColCoord[11:0]
0x26a2 <-- (PL0b) s | RowWidth[2:0] | RowCoord[11:0]
0x12f0 <-- (PL1a) 0 | ColWidth[2:0] | ColCoord[11:0]
0x1670 <-- (PL1b) s | RowWidth[2:0] | RowCoord[11:0]
0x139c <-- (PL2a) 0 | ColWidth[2:0] | ColCoord[11:0]
0x272c <-- (PL2b) s | RowWidth[2:0] | RowCoord[11:0]
0x05ea <-- (SAx0) 0 | Width[2:0] | Res | Coord[10:0]
0x0025 <-- (SSt0) 0 | Width[2:0] | Res | Coord[10:0]
0x020d <-- (SAx1) 0 | Width[2:0] | Res | Coord[10:0]
0x01ee <-- (SSt1) 0 | Width[2:0] | Res | Coord[10:0]
0x03e7 <-- (SAx2) 0 | Width[2:0] | Res | Coord[10:0]
0x03fe <-- (SSt2) 0 | Width[2:0] | Res | Coord[10:0]
0x0565 <-- (SAx3) 0 | Width[2:0] | Res | Coord[10:0]
0x0555 <-- (SSt3) 0 | Width[2:0] | Res | Coord[10:0]
0x0bda <-- Res[3:0] | L | 0xb | 0xd | 0xa, word=0xbda3f6e
0x3f6e <-- Sector Number
0x0016 <-- Res[3:0] | TFNum[3:0] | Res | Tower[6:0], word=0x160fff
0x0fff <-- Res[3:0] | Layermap[11:0]
0x0000 <-- Res[7:0] | RoadID[23:16], word=0x29
0x0029 <-- RoadID[15:0]
0x3f22 <-- Track chi2
0x8025 <-- Track d0
0x6f63 <-- Track z0
0x8e90 <-- Track coth
0x2d2d <-- Track phi
0x5df6 <-- Track curv
0x14cf <-- (IBLa) 0 | ColWidth[2:0] | ColCoord[11:0]
0x20de <-- (IBLb) s | RowWidth[2:0] | RowCoord[11:0]
0x1520 <-- (PL0a) 0 | ColWidth[2:0] | ColCoord[11:0]
0x215c <-- (PL0b) s | RowWidth[2:0] | RowCoord[11:0]
0x11a0 <-- (PL1a) 0 | ColWidth[2:0] | ColCoord[11:0]
0x27c4 <-- (PL1b) s | RowWidth[2:0] | RowCoord[11:0]
0x265f <-- (PL2a) 0 | ColWidth[2:0] | ColCoord[11:0]
0x2613 <-- (PL2b) s | RowWidth[2:0] | RowCoord[11:0]
0x03b8 <-- (SAx0) 0 | Width[2:0] | Res | Coord[10:0]
0x0380 <-- (SSt0) 0 | Width[2:0] | Res | Coord[10:0]
0x0050 <-- (SAx1) 0 | Width[2:0] | Res | Coord[10:0]
0x0057 <-- (SSt1) 0 | Width[2:0] | Res | Coord[10:0]
0x02ed <-- (SAx2) 0 | Width[2:0] | Res | Coord[10:0]
0x02ab <-- (SSt2) 0 | Width[2:0] | Res | Coord[10:0]
0x0579 <-- (SAx3) 0 | Width[2:0] | Res | Coord[10:0]
0x0580 <-- (SSt3) 0 | Width[2:0] | Res | Coord[10:0]
0x0bda <-- Res[3:0] | L | 0xb | 0xd | 0xa, word=0xbda2f1c
0x2f1c <-- Sector Number
0x0016 <-- Res[3:0] | TFNum[3:0] | Res | Tower[6:0], word=0x160fff
0x0fff <-- Res[3:0] | Layermap[11:0]
0x0000 <-- Res[7:0] | RoadID[23:16], word=0x26
0x0026 <-- RoadID[15:0]
0x33b3 <-- Track chi2
0x8054 <-- Track d0
0x7762 <-- Track z0
0x8500 <-- Track coth
0x33ad <-- Track phi
0x5070 <-- Track curv
0x24f2 <-- (IBLa) 0 | ColWidth[2:0] | ColCoord[11:0]
0x2455 <-- (IBLb) s | RowWidth[2:0] | RowCoord[11:0]
0x23dd <-- (PL0a) 0 | ColWidth[2:0] | ColCoord[11:0]
0x26e2 <-- (PL0b) s | RowWidth[2:0] | RowCoord[11:0]
0x15c0 <-- (PL1a) 0 | ColWidth[2:0] | ColCoord[11:0]
0x27b4 <-- (PL1b) s | RowWidth[2:0] | RowCoord[11:0]
0x278a <-- (PL2a) 0 | ColWidth[2:0] | ColCoord[11:0]
0x5a18 <-- (PL2b) s | RowWidth[2:0] | RowCoord[11:0]
0x032c <-- (SAx0) 0 | Width[2:0] | Res | Coord[10:0]
0x031a <-- (SSt0) 0 | Width[2:0] | Res | Coord[10:0]
0x012d <-- (SAx1) 0 | Width[2:0] | Res | Coord[10:0]
0x0156 <-- (SSt1) 0 | Width[2:0] | Res | Coord[10:0]
0x0530 <-- (SAx2) 0 | Width[2:0] | Res | Coord[10:0]
0x04f4 <-- (SSt2) 0 | Width[2:0] | Res | Coord[10:0]
0x03a0 <-- (SAx3) 0 | Width[2:0] | Res | Coord[10:0]
0x0378 <-- (SSt3) 0 | Width[2:0] | Res | Coord[10:0]
0x0bda <-- Res[3:0] | L | 0xb | 0xd | 0xa, word=0xbda297f
0x297f <-- Sector Number
0x0016 <-- Res[3:0] | TFNum[3:0] | Res | Tower[6:0], word=0x160fff
0x0fff <-- Res[3:0] | Layermap[11:0]
0x0000 <-- Res[7:0] | RoadID[23:16], word=0x1e
0x001e <-- RoadID[15:0]
0x4aed <-- Track chi2
0x8033 <-- Track d0
0x6f58 <-- Track z0
0x8c80 <-- Track coth
0x354c <-- Track phi
0xa340 <-- Track curv
0x243b <-- (IBLa) 0 | ColWidth[2:0] | ColCoord[11:0]
0x14f9 <-- (IBLb) s | RowWidth[2:0] | RowCoord[11:0]
0x248a <-- (PL0a) 0 | ColWidth[2:0] | ColCoord[11:0]
0x27c3 <-- (PL0b) s | RowWidth[2:0] | RowCoord[11:0]
0x2957 <-- (PL1a) 0 | ColWidth[2:0] | ColCoord[11:0]
0x289b <-- (PL1b) s | RowWidth[2:0] | RowCoord[11:0]
0x1384 <-- (PL2a) 0 | ColWidth[2:0] | ColCoord[11:0]
0x10c0 <-- (PL2b) s | RowWidth[2:0] | RowCoord[11:0]
0x019e <-- (SAx0) 0 | Width[2:0] | Res | Coord[10:0]
0x0187 <-- (SSt0) 0 | Width[2:0] | Res | Coord[10:0]
0x044c <-- (SAx1) 0 | Width[2:0] | Res | Coord[10:0]
0x0419 <-- (SSt1) 0 | Width[2:0] | Res | Coord[10:0]
0x010f <-- (SAx2) 0 | Width[2:0] | Res | Coord[10:0]
0x00ff <-- (SSt2) 0 | Width[2:0] | Res | Coord[10:0]
0x035c <-- (SAx3) 0 | Width[2:0] | Res | Coord[10:0]
0x0324 <-- (SSt3) 0 | Width[2:0] | Res | Coord[10:0]
0x0bda <-- Res[3:0] | L | 0xb | 0xd | 0xa, word=0xbda2d51
0x2d51 <-- Sector Number
0x0016 <-- Res[3:0] | TFNum[3:0] | Res | Tower[6:0], word=0x160fff
0x0fff <-- Res[3:0] | Layermap[11:0]
0x0000 <-- Res[7:0] | RoadID[23:16], word=0x11
0x0011 <-- RoadID[15:0]
0x2667 <-- Track chi2
0x8007 <-- Track d0
0x6c4d <-- Track z0
0x9049 <-- Track coth
0x31b9 <-- Track phi
0x3e16 <-- Track curv
0x2430 <-- (IBLa) 0 | ColWidth[2:0] | ColCoord[11:0]
0x234d <-- (IBLb) s | RowWidth[2:0] | RowCoord[11:0]
0x2508 <-- (PL0a) 0 | ColWidth[2:0] | ColCoord[11:0]
0x2544 <-- (PL0b) s | RowWidth[2:0] | RowCoord[11:0]
0x21ba <-- (PL1a) 0 | ColWidth[2:0] | ColCoord[11:0]
0x1568 <-- (PL1b) s | RowWidth[2:0] | RowCoord[11:0]
0x2749 <-- (PL2a) 0 | ColWidth[2:0] | ColCoord[11:0]
0x26d2 <-- (PL2b) s | RowWidth[2:0] | RowCoord[11:0]
0x025c <-- (SAx0) 0 | Width[2:0] | Res | Coord[10:0]
0x0284 <-- (SSt0) 0 | Width[2:0] | Res | Coord[10:0]
0x0059 <-- (SAx1) 0 | Width[2:0] | Res | Coord[10:0]
0x0080 <-- (SSt1) 0 | Width[2:0] | Res | Coord[10:0]
0x0468 <-- (SAx2) 0 | Width[2:0] | Res | Coord[10:0]
0x0478 <-- (SSt2) 0 | Width[2:0] | Res | Coord[10:0]
0x02fa <-- (SAx3) 0 | Width[2:0] | Res | Coord[10:0]
0x0334 <-- (SSt3) 0 | Width[2:0] | Res | Coord[10:0]
0x0bda <-- Res[3:0] | L | 0xb | 0xd | 0xa, word=0xbda835a
0x835a <-- Sector Number
0x0016 <-- Res[3:0] | TFNum[3:0] | Res | Tower[6:0], word=0x1607ff
0x07ff <-- Res[3:0] | Layermap[11:0]
0x0000 <-- Res[7:0] | RoadID[23:16], word=0xd
0x000d <-- RoadID[15:0]
0x283a <-- Track chi2
0x801f <-- Track d0
0x775b <-- Track z0
0x846b <-- Track coth
0x39c9 <-- Track phi
0x54dc <-- Track curv
0x24d1 <-- (IBLa) 0 | ColWidth[2:0] | ColCoord[11:0]
0x17b9 <-- (IBLb) s | RowWidth[2:0] | RowCoord[11:0]
0x1370 <-- (PL0a) 0 | ColWidth[2:0] | ColCoord[11:0]
0x1290 <-- (PL0b) s | RowWidth[2:0] | RowCoord[11:0]
0x1540 <-- (PL1a) 0 | ColWidth[2:0] | ColCoord[11:0]
0x272c <-- (PL1b) s | RowWidth[2:0] | RowCoord[11:0]
0x16a0 <-- (PL2a) 0 | ColWidth[2:0] | ColCoord[11:0]
0x1300 <-- (PL2b) s | RowWidth[2:0] | RowCoord[11:0]
0x01f3 <-- (SAx0) 0 | Width[2:0] | Res | Coord[10:0]
0x01ec <-- (SSt0) 0 | Width[2:0] | Res | Coord[10:0]
0x010a <-- (SAx1) 0 | Width[2:0] | Res | Coord[10:0]
0x0128 <-- (SSt1) 0 | Width[2:0] | Res | Coord[10:0]
0x0070 <-- (SAx2) 0 | Width[2:0] | Res | Coord[10:0]
0x0040 <-- (SSt2) 0 | Width[2:0] | Res | Coord[10:0]
0x058e <-- (SAx3) 0 | Width[2:0] | Res | Coord[10:0]
0x0000 <-- (SSt3) 0 | Width[2:0] | Res | Coord[10:0]
0x0bda <-- Res[3:0] | L | 0xb | 0xd | 0xa, word=0xbda0042
0x0042 <-- Sector Number
0x0016 <-- Res[3:0] | TFNum[3:0] | Res | Tower[6:0], word=0x160fff
0x0fff <-- Res[3:0] | Layermap[11:0]
0x0000 <-- Res[7:0] | RoadID[23:16], word=0x0
0x0000 <-- RoadID[15:0]
0x131a <-- Track chi2
0x8031 <-- Track d0
0x776a <-- Track z0
0x81f4 <-- Track coth
0x403f <-- Track phi
0x42a8 <-- Track curv
0x13f3 <-- (IBLa) 0 | ColWidth[2:0] | ColCoord[11:0]
0x21bd <-- (IBLb) s | RowWidth[2:0] | RowCoord[11:0]
0x1254 <-- (PL0a) 0 | ColWidth[2:0] | ColCoord[11:0]
0x2844 <-- (PL0b) s | RowWidth[2:0] | RowCoord[11:0]
0x1310 <-- (PL1a) 0 | ColWidth[2:0] | ColCoord[11:0]
0x278e <-- (PL1b) s | RowWidth[2:0] | RowCoord[11:0]
0x13c0 <-- (PL2a) 0 | ColWidth[2:0] | ColCoord[11:0]
0x275b <-- (PL2b) s | RowWidth[2:0] | RowCoord[11:0]
0x01a5 <-- (SAx0) 0 | Width[2:0] | Res | Coord[10:0]
0x01ce <-- (SSt0) 0 | Width[2:0] | Res | Coord[10:0]
0x0250 <-- (SAx1) 0 | Width[2:0] | Res | Coord[10:0]
0x022e <-- (SSt1) 0 | Width[2:0] | Res | Coord[10:0]
0x034e <-- (SAx2) 0 | Width[2:0] | Res | Coord[10:0]
0x0368 <-- (SSt2) 0 | Width[2:0] | Res | Coord[10:0]
0x0472 <-- (SAx3) 0 | Width[2:0] | Res | Coord[10:0]
0x0460 <-- (SSt3) 0 | Width[2:0] | Res | Coord[10:0]
0xe0da <-- Begin trailer debug block
0x0000 <-- Length of debug block | Indeterminate[3:0]
0xe0df <-- End debug block
0x0000 <-- Length of debug block | Indeterminate[3:0]
0x0000 <-- L1ID[31:16]
0x0000 <-- L1ID[15:0]
0x0000 <-- ErrorFlag[31:16]
0x0001 <-- ErrorFlag[15:0]
0x0000 <-- Res
0x0000 <-- Res
0x0000 <-- Res
0x0000 <-- Res
0xe0f0 <-- stripped by FLI in CoreCrateRcvr machine
0xa5a5 <-- stripped by FLI in CoreCrateRcvr machine
0x5a5a <-- stripped by FLI in CoreCrateRcvr machine
0x0e0f <-- stripped by FLI in CoreCrateRcvr machine
