0xb0f0 <-- stripped by FLIC in CoreCrate machine
0xcaf0 <-- stripped by FLIC in CoreCrate machine, Bits[3:0] are indeterminate
0xff12 <-- stripped by FLIC in CoreCrate machine
0x34ff <-- stripped by FLIC in CoreCrate machine
0x0003 <-- 0 | RunNumber[30:16], RunNumber=0x3652e
0x652e <-- RunNumber[15:0], RunNumber=0x3652e
0x0008 <-- ExtendedLevel1ID[31:16], word=0x84dab
0x4dab <-- ExtendedLevel1ID[15:0], word=0x84dab
0x0000 <-- Res
0x0a14 <-- Res[3:0] | BCID[11:0], word=0xa14
0x0000 <-- Res
0x0000 <-- Res[7:0] | L1TriggerType[7:0], word=0x0
0x0000 <-- Res[7:0] | DetectorEventType[7:0]
0x0000 <-- Res[11:0] | TIM[3:0]
0x0bda <-- Res[3:0] | L | 0xb | 0xd | 0xa, word=0xbda1dfb
0x1dfb <-- Sector Number
0x0016 <-- Res[3:0] | TFNum[3:0] | Res | Tower[6:0], word=0x160ffb
0x0ffb <-- Res[3:0] | Layermap[11:0]
0x0000 <-- Res[7:0] | RoadID[23:16], word=0x44
0x0044 <-- RoadID[15:0]
0x1493 <-- Track chi2
0x803d <-- Track d0
0x5e1a <-- Track z0
0x8edc <-- Track coth
0x2848 <-- Track phi
0x4613 <-- Track curv
0x24cc <-- (IBLa) 0 | ColWidth[2:0] | ColCoord[11:0]
0x27cc <-- (IBLb) s | RowWidth[2:0] | RowCoord[11:0]
0x1890 <-- (PL0a) 0 | ColWidth[2:0] | ColCoord[11:0]
0x1708 <-- (PL0b) s | RowWidth[2:0] | RowCoord[11:0]
0x0000 <-- (PL1a) 0 | ColWidth[2:0] | ColCoord[11:0]
0x0000 <-- (PL1b) s | RowWidth[2:0] | RowCoord[11:0]
0x296d <-- (PL2a) 0 | ColWidth[2:0] | ColCoord[11:0]
0x1688 <-- (PL2b) s | RowWidth[2:0] | RowCoord[11:0]
0x00d8 <-- (SAx0) 0 | Width[2:0] | Res | Coord[10:0]
0x00c0 <-- (SSt0) 0 | Width[2:0] | Res | Coord[10:0]
0x02ce <-- (SAx1) 0 | Width[2:0] | Res | Coord[10:0]
0x02a6 <-- (SSt1) 0 | Width[2:0] | Res | Coord[10:0]
0x04f6 <-- (SAx2) 0 | Width[2:0] | Res | Coord[10:0]
0x04dd <-- (SSt2) 0 | Width[2:0] | Res | Coord[10:0]
0x019e <-- (SAx3) 0 | Width[2:0] | Res | Coord[10:0]
0x0188 <-- (SSt3) 0 | Width[2:0] | Res | Coord[10:0]
0x0bda <-- Res[3:0] | L | 0xb | 0xd | 0xa, word=0xbda0efe
0x0efe <-- Sector Number
0x0016 <-- Res[3:0] | TFNum[3:0] | Res | Tower[6:0], word=0x160fef
0x0fef <-- Res[3:0] | Layermap[11:0]
0x0000 <-- Res[7:0] | RoadID[23:16], word=0x8
0x0008 <-- RoadID[15:0]
0x3243 <-- Track chi2
0x800f <-- Track d0
0x88a5 <-- Track z0
0x8f10 <-- Track coth
0x2d4b <-- Track phi
0x384c <-- Track curv
0x221b <-- (IBLa) 0 | ColWidth[2:0] | ColCoord[11:0]
0x1101 <-- (IBLb) s | RowWidth[2:0] | RowCoord[11:0]
0x15e4 <-- (PL0a) 0 | ColWidth[2:0] | ColCoord[11:0]
0x11b8 <-- (PL0b) s | RowWidth[2:0] | RowCoord[11:0]
0x229d <-- (PL1a) 0 | ColWidth[2:0] | ColCoord[11:0]
0x289c <-- (PL1b) s | RowWidth[2:0] | RowCoord[11:0]
0x1790 <-- (PL2a) 0 | ColWidth[2:0] | ColCoord[11:0]
0x278a <-- (PL2b) s | RowWidth[2:0] | RowCoord[11:0]
0x0000 <-- (SAx0) 0 | Width[2:0] | Res | Coord[10:0]
0x04ec <-- (SSt0) 0 | Width[2:0] | Res | Coord[10:0]
0x022f <-- (SAx1) 0 | Width[2:0] | Res | Coord[10:0]
0x0202 <-- (SSt1) 0 | Width[2:0] | Res | Coord[10:0]
0x0586 <-- (SAx2) 0 | Width[2:0] | Res | Coord[10:0]
0x0574 <-- (SSt2) 0 | Width[2:0] | Res | Coord[10:0]
0x037a <-- (SAx3) 0 | Width[2:0] | Res | Coord[10:0]
0x0358 <-- (SSt3) 0 | Width[2:0] | Res | Coord[10:0]
0x0bda <-- Res[3:0] | L | 0xb | 0xd | 0xa, word=0xbda22ea
0x22ea <-- Sector Number
0x0016 <-- Res[3:0] | TFNum[3:0] | Res | Tower[6:0], word=0x160fff
0x0fff <-- Res[3:0] | Layermap[11:0]
0x0000 <-- Res[7:0] | RoadID[23:16], word=0x4
0x0004 <-- RoadID[15:0]
0x1f52 <-- Track chi2
0x7fcf <-- Track d0
0xa1d4 <-- Track z0
0x878f <-- Track coth
0x367c <-- Track phi
0xb64a <-- Track curv
0x2359 <-- (IBLa) 0 | ColWidth[2:0] | ColCoord[11:0]
0x1581 <-- (IBLb) s | RowWidth[2:0] | RowCoord[11:0]
0x1300 <-- (PL0a) 0 | ColWidth[2:0] | ColCoord[11:0]
0x28e3 <-- (PL0b) s | RowWidth[2:0] | RowCoord[11:0]
0x1580 <-- (PL1a) 0 | ColWidth[2:0] | ColCoord[11:0]
0x2063 <-- (PL1b) s | RowWidth[2:0] | RowCoord[11:0]
0x1820 <-- (PL2a) 0 | ColWidth[2:0] | ColCoord[11:0]
0x1230 <-- (PL2b) s | RowWidth[2:0] | RowCoord[11:0]
0x01d4 <-- (SAx0) 0 | Width[2:0] | Res | Coord[10:0]
0x019b <-- (SSt0) 0 | Width[2:0] | Res | Coord[10:0]
0x0462 <-- (SAx1) 0 | Width[2:0] | Res | Coord[10:0]
0x043d <-- (SSt1) 0 | Width[2:0] | Res | Coord[10:0]
0x00d8 <-- (SAx2) 0 | Width[2:0] | Res | Coord[10:0]
0x00d3 <-- (SSt2) 0 | Width[2:0] | Res | Coord[10:0]
0x02e0 <-- (SAx3) 0 | Width[2:0] | Res | Coord[10:0]
0x0304 <-- (SSt3) 0 | Width[2:0] | Res | Coord[10:0]
0x0bda <-- Res[3:0] | L | 0xb | 0xd | 0xa, word=0xbda2c0b
0x2c0b <-- Sector Number
0x0016 <-- Res[3:0] | TFNum[3:0] | Res | Tower[6:0], word=0x160fff
0x0fff <-- Res[3:0] | Layermap[11:0]
0x0000 <-- Res[7:0] | RoadID[23:16], word=0x2
0x0002 <-- RoadID[15:0]
0x34b4 <-- Track chi2
0x7fdd <-- Track d0
0x74d3 <-- Track z0
0x8ea4 <-- Track coth
0x43c9 <-- Track phi
0xbb4d <-- Track curv
0x2093 <-- (IBLa) 0 | ColWidth[2:0] | ColCoord[11:0]
0x1339 <-- (IBLb) s | RowWidth[2:0] | RowCoord[11:0]
0x1750 <-- (PL0a) 0 | ColWidth[2:0] | ColCoord[11:0]
0x1100 <-- (PL0b) s | RowWidth[2:0] | RowCoord[11:0]
0x1350 <-- (PL1a) 0 | ColWidth[2:0] | ColCoord[11:0]
0x10e8 <-- (PL1b) s | RowWidth[2:0] | RowCoord[11:0]
0x1830 <-- (PL2a) 0 | ColWidth[2:0] | ColCoord[11:0]
0x205c <-- (PL2b) s | RowWidth[2:0] | RowCoord[11:0]
0x0013 <-- (SAx0) 0 | Width[2:0] | Res | Coord[10:0]
0x0039 <-- (SSt0) 0 | Width[2:0] | Res | Coord[10:0]
0x0509 <-- (SAx1) 0 | Width[2:0] | Res | Coord[10:0]
0x0518 <-- (SSt1) 0 | Width[2:0] | Res | Coord[10:0]
0x03e6 <-- (SAx2) 0 | Width[2:0] | Res | Coord[10:0]
0x0406 <-- (SSt2) 0 | Width[2:0] | Res | Coord[10:0]
0x027b <-- (SAx3) 0 | Width[2:0] | Res | Coord[10:0]
0x02a0 <-- (SSt3) 0 | Width[2:0] | Res | Coord[10:0]
0x0bda <-- Res[3:0] | L | 0xb | 0xd | 0xa, word=0xbda2ad8
0x2ad8 <-- Sector Number
0x0016 <-- Res[3:0] | TFNum[3:0] | Res | Tower[6:0], word=0x160fff
0x0fff <-- Res[3:0] | Layermap[11:0]
0x0000 <-- Res[7:0] | RoadID[23:16], word=0x0
0x0000 <-- RoadID[15:0]
0x248e <-- Track chi2
0x7fe1 <-- Track d0
0xa1ef <-- Track z0
0x9130 <-- Track coth
0x3be2 <-- Track phi
0x5ff0 <-- Track curv
0x206a <-- (IBLa) 0 | ColWidth[2:0] | ColCoord[11:0]
0x28e6 <-- (IBLb) s | RowWidth[2:0] | RowCoord[11:0]
0x2794 <-- (PL0a) 0 | ColWidth[2:0] | ColCoord[11:0]
0x243c <-- (PL0b) s | RowWidth[2:0] | RowCoord[11:0]
0x1440 <-- (PL1a) 0 | ColWidth[2:0] | ColCoord[11:0]
0x2086 <-- (PL1b) s | RowWidth[2:0] | RowCoord[11:0]
0x2114 <-- (PL2a) 0 | ColWidth[2:0] | ColCoord[11:0]
0x270c <-- (PL2b) s | RowWidth[2:0] | RowCoord[11:0]
0x030c <-- (SAx0) 0 | Width[2:0] | Res | Coord[10:0]
0x0312 <-- (SSt0) 0 | Width[2:0] | Res | Coord[10:0]
0x0258 <-- (SAx1) 0 | Width[2:0] | Res | Coord[10:0]
0x0224 <-- (SSt1) 0 | Width[2:0] | Res | Coord[10:0]
0x01d8 <-- (SAx2) 0 | Width[2:0] | Res | Coord[10:0]
0x01ba <-- (SSt2) 0 | Width[2:0] | Res | Coord[10:0]
0x015a <-- (SAx3) 0 | Width[2:0] | Res | Coord[10:0]
0x014a <-- (SSt3) 0 | Width[2:0] | Res | Coord[10:0]
0xe0da <-- Begin trailer debug block
0x0000 <-- Length of debug block | Indeterminate[3:0]
0xe0df <-- End debug block
0x0000 <-- Length of debug block | Indeterminate[3:0]
0x0000 <-- L1ID[31:16]
0x0000 <-- L1ID[15:0]
0x0000 <-- ErrorFlag[31:16]
0x0001 <-- ErrorFlag[15:0]
0x0000 <-- Res
0x0000 <-- Res
0x0000 <-- Res
0x0000 <-- Res
0xe0f0 <-- stripped by FLI in CoreCrateRcvr machine
0xa5a5 <-- stripped by FLI in CoreCrateRcvr machine
0x5a5a <-- stripped by FLI in CoreCrateRcvr machine
0x0e0f <-- stripped by FLI in CoreCrateRcvr machine
