0xee12
0x34ee <-- Start of Header Marker
0x0000
0x0009 <-- Header size - fixed
0x0301
0x0000 <-- Format version number - formed within FLIC from firmware
0x0000
0x007f <-- Source identifier - fixed
0x0003
0x652e <-- 0 | RunNumber[30:0]
0x0008
0x6706 <-- Extended level 1 ID
0x0000
0x0c24 <-- Res[31:12] | BCID[11:0]
0x0000
0x0000 <-- Res[31:8] | L1TriggerType[7:0]
0x0000
0x0000 <-- Res[31:24] | DetectorEventType[23:16] | Res[15:4] | TIM[3:0]
0x0bda
0x055f <-- Res[3:0] | L | 0xbda | sector
0x0016
0x0fff <-- 
0x0000
0x0005 <-- RoadID[23:0]
0x1ce6
0x8040 <-- Track chi2[31:16] | Track d0[15:0]
0x767f
0x8be7 <-- Track z0[31:16] | Track coth[15:0]
0x2f97
0xcff5 <-- Track phi0[31:16] | Track curv[15:0]
0x0000
0x015a <-- Res[31:12] | Module L0
0x2051
0x11d9 <-- IBL
0x0000
0x027d <-- Res[31:12] | Module L1
0x16c0
0x12a0 <-- PL0b
0x0000
0x041e <-- Res[31:12] | Module L2
0x222c
0x291a <-- PL1b
0x0000
0x0681 <-- Res[31:12] | Module L3
0x15fc
0x16b0 <-- PL2b
0x0194
0x09bf <-- SAx0
0x0174
0x09be <-- SSt0
0x025e
0x0d38 <-- SAx1
0x0236
0x0d39 <-- SSt1
0x02d8
0x1171 <-- SAx2
0x02c9
0x1170 <-- SSt2
0x02bf
0x166a <-- SAx3
0x028b
0x166b <-- SSt3
0x0bda
0x1c90 <-- Res[3:0] | L | 0xbda | sector
0x0016
0x0fff <-- 
0x0000
0x0002 <-- RoadID[23:0]
0x3c42
0x7fd9 <-- Track chi2[31:16] | Track d0[15:0]
0x8dad
0x8cd4 <-- Track z0[31:16] | Track coth[15:0]
0x32be
0xccc9 <-- Track phi0[31:16] | Track curv[15:0]
0x0000
0x015b <-- Res[31:12] | Module L0
0x1371
0x1371 <-- IBL
0x0000
0x027e <-- Res[31:12] | Module L1
0x270a
0x1540 <-- PL0b
0x0000
0x042c <-- Res[31:12] | Module L2
0x1240
0x1410 <-- PL1b
0x0000
0x068f <-- Res[31:12] | Module L3
0x268c
0x2385 <-- PL2b
0x0444
0x09c1 <-- SAx0
0x045a
0x09c0 <-- SSt0
0x0590
0x0d38 <-- SAx1
0x05b2
0x0d39 <-- SSt1
0x00aa
0x118b <-- SAx2
0x00b9
0x118a <-- SSt2
0x0159
0x1682 <-- SAx3
0x0183
0x1683 <-- SSt3
0xe0da
0x0000 <-- E0DA (begin debug block) | Length of debug block | Indeterminate[3:0]
0xe0df
0x0000 <-- E0DF (end debug block)   | Length of debug block | Indeterminate[3:0]
0x0000
0x0000 <-- L1ID
0x0000
0x0001 <-- ErrorFlag
0x0000
0x0000 <-- Res
0x0000
0x0000 <-- Res
