0xee12
0x34ee <-- Start of Header Marker
0x0000
0x0009 <-- Header size - fixed
0x0301
0x0000 <-- Format version number - formed within FLIC from firmware
0x0000
0x007f <-- Source identifier - fixed
0x0003
0x652e <-- 0 | RunNumber[30:0]
0x0008
0x6754 <-- Extended level 1 ID
0x0000
0x07f9 <-- Res[31:12] | BCID[11:0]
0x0000
0x0000 <-- Res[31:8] | L1TriggerType[7:0]
0x0000
0x0000 <-- Res[31:24] | DetectorEventType[23:16] | Res[15:4] | TIM[3:0]
0x0bda
0x749e <-- Res[3:0] | L | 0xbda | sector
0x0016
0x0fee <-- 
0x0000
0x0012 <-- RoadID[23:0]
0x0aea
0x7fd1 <-- Track chi2[31:16] | Track d0[15:0]
0x5661
0x8762 <-- Track z0[31:16] | Track coth[15:0]
0x29e3
0x9b23 <-- Track phi0[31:16] | Track curv[15:0]
0x0000
0x0143 <-- Res[31:12] | Module L0
0x0000
0x0000 <-- IBL
0x0000
0x026f <-- Res[31:12] | Module L1
0x1190
0x2794 <-- PL0b
0x0000
0x041c <-- Res[31:12] | Module L2
0x2425
0x1168 <-- PL1b
0x0000
0x0672 <-- Res[31:12] | Module L3
0x16e0
0x26a3 <-- PL2b
0x0000
0x09a5 <-- SAx0
0x0506
0x09a4 <-- SSt0
0x057e
0x0d1c <-- SAx1
0x0588
0x0d1d <-- SSt1
0x0041
0x116d <-- SAx2
0x000d
0x116c <-- SSt2
0x0092
0x1666 <-- SAx3
0x006e
0x1667 <-- SSt3
0x0bda
0x4154 <-- Res[3:0] | L | 0xbda | sector
0x0016
0x0fff <-- 
0x0000
0x0001 <-- RoadID[23:0]
0x2ce0
0x800b <-- Track chi2[31:16] | Track d0[15:0]
0x5654
0x83c4 <-- Track z0[31:16] | Track coth[15:0]
0x3f74
0x4ea1 <-- Track phi0[31:16] | Track curv[15:0]
0x0000
0x016b <-- Res[31:12] | Module L0
0x1443
0x2147 <-- IBL
0x0000
0x0288 <-- Res[31:12] | Module L1
0x1960
0x27c4 <-- PL0b
0x0000
0x0443 <-- Res[31:12] | Module L2
0x1110
0x1620 <-- PL1b
0x0000
0x06b3 <-- Res[31:12] | Module L3
0x1254
0x1550 <-- PL2b
0x0095
0x0a03 <-- SAx0
0x0072
0x0a02 <-- SSt0
0x00e4
0x0d92 <-- SAx1
0x0118
0x0d93 <-- SSt1
0x0188
0x11e5 <-- SAx2
0x01c2
0x11e4 <-- SSt2
0x023c
0x16f4 <-- SAx3
0x0214
0x16f5 <-- SSt3
0xe0da
0x0000 <-- E0DA (begin debug block) | Length of debug block | Indeterminate[3:0]
0xe0df
0x0000 <-- E0DF (end debug block)   | Length of debug block | Indeterminate[3:0]
0x0000
0x0000 <-- L1ID
0x0000
0x0001 <-- ErrorFlag
0x0000
0x0000 <-- Res
0x0000
0x0000 <-- Res
