0xee12
0x34ee <-- Start of Header Marker
0x0000
0x0009 <-- Header size - fixed
0x0301
0x0000 <-- Format version number - formed within FLIC from firmware
0x0000
0x007f <-- Source identifier - fixed
0x0003
0x652e <-- 0 | RunNumber[30:0]
0x0008
0x6a77 <-- Extended level 1 ID
0x0000
0x0d18 <-- Res[31:12] | BCID[11:0]
0x0000
0x0000 <-- Res[31:8] | L1TriggerType[7:0]
0x0000
0x0000 <-- Res[31:24] | DetectorEventType[23:16] | Res[15:4] | TIM[3:0]
0x0bda
0x4de1 <-- Res[3:0] | L | 0xbda | sector
0x0016
0x07f7 <-- 
0x0000
0x011a <-- RoadID[23:0]
0x4412
0x8010 <-- Track chi2[31:16] | Track d0[15:0]
0x855c
0x9280 <-- Track z0[31:16] | Track coth[15:0]
0x3234
0xd4c8 <-- Track phi0[31:16] | Track curv[15:0]
0x0000
0x015b <-- Res[31:12] | Module L0
0x21f4
0x232c <-- IBL
0x0000
0x027e <-- Res[31:12] | Module L1
0x2684
0x14d0 <-- PL0b
0x0000
0x042c <-- Res[31:12] | Module L2
0x23cc
0x1320 <-- PL1b
0x0000
0x068f <-- Res[31:12] | Module L3
0x0000
0x0000 <-- PL2b
0x038e
0x09c1 <-- SAx0
0x034d
0x09c0 <-- SSt0
0x048c
0x0d3a <-- SAx1
0x04a4
0x0d3b <-- SSt1
0x0556
0x1173 <-- SAx2
0x04e8
0x1172 <-- SSt2
0x05cd
0x166c <-- SAx3
0x0000
0x166d <-- SSt3
0x0bda
0x0259 <-- Res[3:0] | L | 0xbda | sector
0x0016
0x0fee <-- 
0x0000
0x00f8 <-- RoadID[23:0]
0x3ab6
0x8102 <-- Track chi2[31:16] | Track d0[15:0]
0x798d
0x8423 <-- Track z0[31:16] | Track coth[15:0]
0x3b03
0xc139 <-- Track phi0[31:16] | Track curv[15:0]
0x0000
0x015a <-- Res[31:12] | Module L0
0x0000
0x0000 <-- IBL
0x0000
0x028a <-- Res[31:12] | Module L1
0x1430
0x1310 <-- PL0b
0x0000
0x0437 <-- Res[31:12] | Module L2
0x15e4
0x16f8 <-- PL1b
0x0000
0x06a7 <-- Res[31:12] | Module L3
0x271e
0x21ad <-- PL2b
0x0000
0x09d5 <-- SAx0
0x0502
0x09d4 <-- SSt0
0x0251
0x0d64 <-- SAx1
0x026e
0x0d65 <-- SSt1
0x054c
0x119d <-- SAx2
0x051e
0x119c <-- SSt2
0x0211
0x16ac <-- SAx3
0x0254
0x16ad <-- SSt3
0x0bda
0x49fa <-- Res[3:0] | L | 0xbda | sector
0x0016
0x0fff <-- 
0x0000
0x003d <-- RoadID[23:0]
0x3648
0x7fc4 <-- Track chi2[31:16] | Track d0[15:0]
0x625a
0x867f <-- Track z0[31:16] | Track coth[15:0]
0x41a7
0xd389 <-- Track phi0[31:16] | Track curv[15:0]
0x0000
0x016c <-- Res[31:12] | Module L0
0x137b
0x1209 <-- IBL
0x0000
0x0289 <-- Res[31:12] | Module L1
0x15fc
0x28a5 <-- PL0b
0x0000
0x0443 <-- Res[31:12] | Module L2
0x185c
0x56e9 <-- PL1b
0x0000
0x06b4 <-- Res[31:12] | Module L3
0x10d0
0x1490 <-- PL2b
0x037e
0x09ed <-- SAx0
0x0383
0x09ec <-- SSt0
0x0192
0x0d7c <-- SAx1
0x01af
0x0d7d <-- SSt1
0x055a
0x11b5 <-- SAx2
0x0524
0x11b4 <-- SSt2
0x02b2
0x16c6 <-- SAx3
0x0290
0x16c7 <-- SSt3
0x0bda
0x0033 <-- Res[3:0] | L | 0xbda | sector
0x0016
0x07ff <-- 
0x0000
0x0013 <-- RoadID[23:0]
0x8f78
0x7ffd <-- Track chi2[31:16] | Track d0[15:0]
0xa4f7
0x7cab <-- Track z0[31:16] | Track coth[15:0]
0x3fae
0x3088 <-- Track phi0[31:16] | Track curv[15:0]
0x0000
0x0170 <-- Res[31:12] | Module L0
0x10ff
0x2176 <-- IBL
0x0000
0x028b <-- Res[31:12] | Module L1
0x1830
0x27e4 <-- PL0b
0x0000
0x0445 <-- Res[31:12] | Module L2
0x16f0
0x2725 <-- PL1b
0x0000
0x06b5 <-- Res[31:12] | Module L3
0x15c0
0x2704 <-- PL2b
0x01f2
0x0a05 <-- SAx0
0x020c
0x0a04 <-- SSt0
0x02e4
0x0d94 <-- SAx1
0x02ba
0x0d95 <-- SSt1
0x0440
0x11e5 <-- SAx2
0x047a
0x11e4 <-- SSt2
0x05c6
0x16f4 <-- SAx3
0x0000
0x16f5 <-- SSt3
0xe0da
0x0000 <-- E0DA (begin debug block) | Length of debug block | Indeterminate[3:0]
0xe0df
0x0000 <-- E0DF (end debug block)   | Length of debug block | Indeterminate[3:0]
0x0000
0x0000 <-- L1ID
0x0000
0x0001 <-- ErrorFlag
0x0000
0x0000 <-- Res
0x0000
0x0000 <-- Res
