0xb0f0 <-- stripped by FLIC in CoreCrate machine
0xcaf0 <-- stripped by FLIC in CoreCrate machine, Bits[3:0] are indeterminate
0xff12 <-- stripped by FLIC in CoreCrate machine
0x34ff <-- stripped by FLIC in CoreCrate machine
0x0003 <-- 0 | RunNumber[30:16], RunNumber=0x3652e
0x652e <-- RunNumber[15:0], RunNumber=0x3652e
0x0008 <-- ExtendedLevel1ID[31:16], word=0x866ff
0x66ff <-- ExtendedLevel1ID[15:0], word=0x866ff
0x0000 <-- Res
0x03f9 <-- Res[3:0] | BCID[11:0], word=0x3f9
0x0000 <-- Res
0x0000 <-- Res[7:0] | L1TriggerType[7:0], word=0x0
0x0000 <-- Res[7:0] | DetectorEventType[7:0]
0x0000 <-- Res[11:0] | TIM[3:0]
0x0bda <-- Res[3:0] | L | 0xb | 0xd | 0xa, word=0xbda5086
0x5086 <-- Sector Number
0x0016 <-- Res[3:0] | TFNum[3:0] | Res | Tower[6:0], word=0x160fbf
0x0fbf <-- Res[3:0] | Layermap[11:0]
0x0000 <-- Res[7:0] | RoadID[23:16], word=0x19
0x0019 <-- RoadID[15:0]
0x5956 <-- Track chi2
0x8003 <-- Track d0
0x7aed <-- Track z0
0x892c <-- Track coth
0x327d <-- Track phi
0xd1ad <-- Track curv
0x113b <-- (IBLa) 0 | ColWidth[2:0] | ColCoord[11:0]
0x1351 <-- (IBLb) s | RowWidth[2:0] | RowCoord[11:0]
0x1750 <-- (PL0a) 0 | ColWidth[2:0] | ColCoord[11:0]
0x14f8 <-- (PL0b) s | RowWidth[2:0] | RowCoord[11:0]
0x1124 <-- (PL1a) 0 | ColWidth[2:0] | ColCoord[11:0]
0x2354 <-- (PL1b) s | RowWidth[2:0] | RowCoord[11:0]
0x2436 <-- (PL2a) 0 | ColWidth[2:0] | ColCoord[11:0]
0x1260 <-- (PL2b) s | RowWidth[2:0] | RowCoord[11:0]
0x0379 <-- (SAx0) 0 | Width[2:0] | Res | Coord[10:0]
0x0386 <-- (SSt0) 0 | Width[2:0] | Res | Coord[10:0]
0x0000 <-- (SAx1) 0 | Width[2:0] | Res | Coord[10:0]
0x04a6 <-- (SSt1) 0 | Width[2:0] | Res | Coord[10:0]
0x057c <-- (SAx2) 0 | Width[2:0] | Res | Coord[10:0]
0x05b2 <-- (SSt2) 0 | Width[2:0] | Res | Coord[10:0]
0x05e6 <-- (SAx3) 0 | Width[2:0] | Res | Coord[10:0]
0x05da <-- (SSt3) 0 | Width[2:0] | Res | Coord[10:0]
0x0bda <-- Res[3:0] | L | 0xb | 0xd | 0xa, word=0xbda0082
0x0082 <-- Sector Number
0x0016 <-- Res[3:0] | TFNum[3:0] | Res | Tower[6:0], word=0x160ffc
0x0ffc <-- Res[3:0] | Layermap[11:0]
0x0000 <-- Res[7:0] | RoadID[23:16], word=0xe
0x000e <-- RoadID[15:0]
0x30a6 <-- Track chi2
0x8012 <-- Track d0
0x8de6 <-- Track z0
0x7ef3 <-- Track coth
0x39cd <-- Track phi
0x28ec <-- Track curv
0x0000 <-- (IBLa) 0 | ColWidth[2:0] | ColCoord[11:0]
0x0000 <-- (IBLb) s | RowWidth[2:0] | RowCoord[11:0]
0x0000 <-- (PL0a) 0 | ColWidth[2:0] | ColCoord[11:0]
0x0000 <-- (PL0b) s | RowWidth[2:0] | RowCoord[11:0]
0x1960 <-- (PL1a) 0 | ColWidth[2:0] | ColCoord[11:0]
0x281c <-- (PL1b) s | RowWidth[2:0] | RowCoord[11:0]
0x1910 <-- (PL2a) 0 | ColWidth[2:0] | ColCoord[11:0]
0x24b3 <-- (PL2b) s | RowWidth[2:0] | RowCoord[11:0]
0x0394 <-- (SAx0) 0 | Width[2:0] | Res | Coord[10:0]
0x03c0 <-- (SSt0) 0 | Width[2:0] | Res | Coord[10:0]
0x038e <-- (SAx1) 0 | Width[2:0] | Res | Coord[10:0]
0x035e <-- (SSt1) 0 | Width[2:0] | Res | Coord[10:0]
0x03f6 <-- (SAx2) 0 | Width[2:0] | Res | Coord[10:0]
0x042c <-- (SSt2) 0 | Width[2:0] | Res | Coord[10:0]
0x049e <-- (SAx3) 0 | Width[2:0] | Res | Coord[10:0]
0x0462 <-- (SSt3) 0 | Width[2:0] | Res | Coord[10:0]
0x0bda <-- Res[3:0] | L | 0xb | 0xd | 0xa, word=0xbda1c25
0x1c25 <-- Sector Number
0x0016 <-- Res[3:0] | TFNum[3:0] | Res | Tower[6:0], word=0x160fff
0x0fff <-- Res[3:0] | Layermap[11:0]
0x0000 <-- Res[7:0] | RoadID[23:16], word=0x0
0x0000 <-- RoadID[15:0]
0x2d51 <-- Track chi2
0x804a <-- Track d0
0x7ad8 <-- Track z0
0x8c98 <-- Track coth
0x340a <-- Track phi
0x2f10 <-- Track curv
0x125d <-- (IBLa) 0 | ColWidth[2:0] | ColCoord[11:0]
0x249e <-- (IBLb) s | RowWidth[2:0] | RowCoord[11:0]
0x2928 <-- (PL0a) 0 | ColWidth[2:0] | ColCoord[11:0]
0x2772 <-- (PL0b) s | RowWidth[2:0] | RowCoord[11:0]
0x2487 <-- (PL1a) 0 | ColWidth[2:0] | ColCoord[11:0]
0x2935 <-- (PL1b) s | RowWidth[2:0] | RowCoord[11:0]
0x1844 <-- (PL2a) 0 | ColWidth[2:0] | ColCoord[11:0]
0x1220 <-- (PL2b) s | RowWidth[2:0] | RowCoord[11:0]
0x0470 <-- (SAx0) 0 | Width[2:0] | Res | Coord[10:0]
0x0440 <-- (SSt0) 0 | Width[2:0] | Res | Coord[10:0]
0x0324 <-- (SAx1) 0 | Width[2:0] | Res | Coord[10:0]
0x0313 <-- (SSt1) 0 | Width[2:0] | Res | Coord[10:0]
0x0248 <-- (SAx2) 0 | Width[2:0] | Res | Coord[10:0]
0x021b <-- (SSt2) 0 | Width[2:0] | Res | Coord[10:0]
0x01ae <-- (SAx3) 0 | Width[2:0] | Res | Coord[10:0]
0x019c <-- (SSt3) 0 | Width[2:0] | Res | Coord[10:0]
0xe0da <-- Begin trailer debug block
0x0000 <-- Length of debug block | Indeterminate[3:0]
0xe0df <-- End debug block
0x0000 <-- Length of debug block | Indeterminate[3:0]
0x0000 <-- L1ID[31:16]
0x0000 <-- L1ID[15:0]
0x0000 <-- ErrorFlag[31:16]
0x0001 <-- ErrorFlag[15:0]
0x0000 <-- Res
0x0000 <-- Res
0x0000 <-- Res
0x0000 <-- Res
0xe0f0 <-- stripped by FLI in CoreCrateRcvr machine
0xa5a5 <-- stripped by FLI in CoreCrateRcvr machine
0x5a5a <-- stripped by FLI in CoreCrateRcvr machine
0x0e0f <-- stripped by FLI in CoreCrateRcvr machine
