0xee12
0x34ee <-- Start of Header Marker
0x0000
0x0009 <-- Header size - fixed
0x0301
0x0000 <-- Format version number - formed within FLIC from firmware
0x0000
0x007f <-- Source identifier - fixed
0x0003
0x652e <-- 0 | RunNumber[30:0]
0x0008
0x4dc1 <-- Extended level 1 ID
0x0000
0x0304 <-- Res[31:12] | BCID[11:0]
0x0000
0x0000 <-- Res[31:8] | L1TriggerType[7:0]
0x0000
0x0000 <-- Res[31:24] | DetectorEventType[23:16] | Res[15:4] | TIM[3:0]
0x0bda
0x0c57 <-- Res[3:0] | L | 0xbda | sector
0x0016
0x0fef <-- 
0x0000
0x0008 <-- RoadID[23:0]
0x49dc
0x7fb4 <-- Track chi2[31:16] | Track d0[15:0]
0x9b6e
0x8da1 <-- Track z0[31:16] | Track coth[15:0]
0x2e28
0x2955 <-- Track phi0[31:16] | Track curv[15:0]
0x0000
0x015c <-- Res[31:12] | Module L0
0x22a9
0x216e <-- IBL
0x0000
0x027f <-- Res[31:12] | Module L1
0x2327
0x227e <-- PL0b
0x0000
0x042c <-- Res[31:12] | Module L2
0x281d
0x1038 <-- PL1b
0x0000
0x0690 <-- Res[31:12] | Module L3
0x1320
0x1020 <-- PL2b
0x0000
0x09d9 <-- SAx0
0x0035
0x09d8 <-- SSt0
0x03c8
0x0d52 <-- SAx1
0x03a2
0x0d53 <-- SSt1
0x0200
0x11a3 <-- SAx2
0x01e4
0x11a2 <-- SSt2
0x008c
0x16b4 <-- SAx3
0x0070
0x16b5 <-- SSt3
0x0bda
0x5ffe <-- Res[3:0] | L | 0xbda | sector
0x0016
0x0ffc <-- 
0x0000
0x0002 <-- RoadID[23:0]
0x176d
0x7dd3 <-- Track chi2[31:16] | Track d0[15:0]
0x77be
0x900a <-- Track z0[31:16] | Track coth[15:0]
0x4536
0xd048 <-- Track phi0[31:16] | Track curv[15:0]
0x0000
0x016e <-- Res[31:12] | Module L0
0x0000
0x0000 <-- IBL
0x0000
0x0298 <-- Res[31:12] | Module L1
0x0000
0x0000 <-- PL0b
0x0000
0x0452 <-- Res[31:12] | Module L2
0x25c1
0x3231 <-- PL1b
0x0000
0x06c3 <-- Res[31:12] | Module L3
0x21a3
0x223d <-- PL2b
0x006e
0x0a09 <-- SAx0
0x0073
0x0a08 <-- SSt0
0x053a
0x0d80 <-- SAx1
0x0570
0x0d81 <-- SSt1
0x03ce
0x11d3 <-- SAx2
0x03c1
0x11d2 <-- SSt2
0x0221
0x16e4 <-- SAx3
0x0201
0x16e5 <-- SSt3
0xe0da
0x0000 <-- E0DA (begin debug block) | Length of debug block | Indeterminate[3:0]
0xe0df
0x0000 <-- E0DF (end debug block)   | Length of debug block | Indeterminate[3:0]
0x0000
0x0000 <-- L1ID
0x0000
0x0001 <-- ErrorFlag
0x0000
0x0000 <-- Res
0x0000
0x0000 <-- Res
