0xb0f0 <-- stripped by FLIC in CoreCrate machine
0xcaf0 <-- stripped by FLIC in CoreCrate machine, Bits[3:0] are indeterminate
0xff12 <-- stripped by FLIC in CoreCrate machine
0x34ff <-- stripped by FLIC in CoreCrate machine
0x0003 <-- 0 | RunNumber[30:16], RunNumber=0x3652e
0x652e <-- RunNumber[15:0], RunNumber=0x3652e
0x0008 <-- ExtendedLevel1ID[31:16], word=0x84dc1
0x4dc1 <-- ExtendedLevel1ID[15:0], word=0x84dc1
0x0000 <-- Res
0x0304 <-- Res[3:0] | BCID[11:0], word=0x304
0x0000 <-- Res
0x0000 <-- Res[7:0] | L1TriggerType[7:0], word=0x0
0x0000 <-- Res[7:0] | DetectorEventType[7:0]
0x0000 <-- Res[11:0] | TIM[3:0]
0x0bda <-- Res[3:0] | L | 0xb | 0xd | 0xa, word=0xbda0c57
0x0c57 <-- Sector Number
0x0016 <-- Res[3:0] | TFNum[3:0] | Res | Tower[6:0], word=0x160fef
0x0fef <-- Res[3:0] | Layermap[11:0]
0x0000 <-- Res[7:0] | RoadID[23:16], word=0x8
0x0008 <-- RoadID[15:0]
0x49dc <-- Track chi2
0x7fb4 <-- Track d0
0x9b6e <-- Track z0
0x8da1 <-- Track coth
0x2e28 <-- Track phi
0x2955 <-- Track curv
0x22a9 <-- (IBLa) 0 | ColWidth[2:0] | ColCoord[11:0]
0x216e <-- (IBLb) s | RowWidth[2:0] | RowCoord[11:0]
0x2327 <-- (PL0a) 0 | ColWidth[2:0] | ColCoord[11:0]
0x227e <-- (PL0b) s | RowWidth[2:0] | RowCoord[11:0]
0x281d <-- (PL1a) 0 | ColWidth[2:0] | ColCoord[11:0]
0x1038 <-- (PL1b) s | RowWidth[2:0] | RowCoord[11:0]
0x1320 <-- (PL2a) 0 | ColWidth[2:0] | ColCoord[11:0]
0x1020 <-- (PL2b) s | RowWidth[2:0] | RowCoord[11:0]
0x0000 <-- (SAx0) 0 | Width[2:0] | Res | Coord[10:0]
0x0035 <-- (SSt0) 0 | Width[2:0] | Res | Coord[10:0]
0x03c8 <-- (SAx1) 0 | Width[2:0] | Res | Coord[10:0]
0x03a2 <-- (SSt1) 0 | Width[2:0] | Res | Coord[10:0]
0x0200 <-- (SAx2) 0 | Width[2:0] | Res | Coord[10:0]
0x01e4 <-- (SSt2) 0 | Width[2:0] | Res | Coord[10:0]
0x008c <-- (SAx3) 0 | Width[2:0] | Res | Coord[10:0]
0x0070 <-- (SSt3) 0 | Width[2:0] | Res | Coord[10:0]
0x0bda <-- Res[3:0] | L | 0xb | 0xd | 0xa, word=0xbda5ffe
0x5ffe <-- Sector Number
0x0016 <-- Res[3:0] | TFNum[3:0] | Res | Tower[6:0], word=0x160ffc
0x0ffc <-- Res[3:0] | Layermap[11:0]
0x0000 <-- Res[7:0] | RoadID[23:16], word=0x2
0x0002 <-- RoadID[15:0]
0x176d <-- Track chi2
0x7dd3 <-- Track d0
0x77be <-- Track z0
0x900a <-- Track coth
0x4536 <-- Track phi
0xd048 <-- Track curv
0x0000 <-- (IBLa) 0 | ColWidth[2:0] | ColCoord[11:0]
0x0000 <-- (IBLb) s | RowWidth[2:0] | RowCoord[11:0]
0x0000 <-- (PL0a) 0 | ColWidth[2:0] | ColCoord[11:0]
0x0000 <-- (PL0b) s | RowWidth[2:0] | RowCoord[11:0]
0x25c1 <-- (PL1a) 0 | ColWidth[2:0] | ColCoord[11:0]
0x3231 <-- (PL1b) s | RowWidth[2:0] | RowCoord[11:0]
0x21a3 <-- (PL2a) 0 | ColWidth[2:0] | ColCoord[11:0]
0x223d <-- (PL2b) s | RowWidth[2:0] | RowCoord[11:0]
0x006e <-- (SAx0) 0 | Width[2:0] | Res | Coord[10:0]
0x0073 <-- (SSt0) 0 | Width[2:0] | Res | Coord[10:0]
0x053a <-- (SAx1) 0 | Width[2:0] | Res | Coord[10:0]
0x0570 <-- (SSt1) 0 | Width[2:0] | Res | Coord[10:0]
0x03ce <-- (SAx2) 0 | Width[2:0] | Res | Coord[10:0]
0x03c1 <-- (SSt2) 0 | Width[2:0] | Res | Coord[10:0]
0x0221 <-- (SAx3) 0 | Width[2:0] | Res | Coord[10:0]
0x0201 <-- (SSt3) 0 | Width[2:0] | Res | Coord[10:0]
0xe0da <-- Begin trailer debug block
0x0000 <-- Length of debug block | Indeterminate[3:0]
0xe0df <-- End debug block
0x0000 <-- Length of debug block | Indeterminate[3:0]
0x0000 <-- L1ID[31:16]
0x0000 <-- L1ID[15:0]
0x0000 <-- ErrorFlag[31:16]
0x0001 <-- ErrorFlag[15:0]
0x0000 <-- Res
0x0000 <-- Res
0x0000 <-- Res
0x0000 <-- Res
0xe0f0 <-- stripped by FLI in CoreCrateRcvr machine
0xa5a5 <-- stripped by FLI in CoreCrateRcvr machine
0x5a5a <-- stripped by FLI in CoreCrateRcvr machine
0x0e0f <-- stripped by FLI in CoreCrateRcvr machine
