0xee12
0x34ee <-- Start of Header Marker
0x0000
0x0009 <-- Header size - fixed
0x0301
0x0000 <-- Format version number - formed within FLIC from firmware
0x0000
0x007f <-- Source identifier - fixed
0x0003
0x652e <-- 0 | RunNumber[30:0]
0x0008
0x66ff <-- Extended level 1 ID
0x0000
0x03f9 <-- Res[31:12] | BCID[11:0]
0x0000
0x0000 <-- Res[31:8] | L1TriggerType[7:0]
0x0000
0x0000 <-- Res[31:24] | DetectorEventType[23:16] | Res[15:4] | TIM[3:0]
0x0bda
0x5086 <-- Res[3:0] | L | 0xbda | sector
0x0016
0x0fbf <-- 
0x0000
0x0019 <-- RoadID[23:0]
0x5956
0x8003 <-- Track chi2[31:16] | Track d0[15:0]
0x7aed
0x892c <-- Track z0[31:16] | Track coth[15:0]
0x327d
0xd1ad <-- Track phi0[31:16] | Track curv[15:0]
0x0000
0x015a <-- Res[31:12] | Module L0
0x113b
0x1351 <-- IBL
0x0000
0x027d <-- Res[31:12] | Module L1
0x1750
0x14f8 <-- PL0b
0x0000
0x042b <-- Res[31:12] | Module L2
0x1124
0x2354 <-- PL1b
0x0000
0x068e <-- Res[31:12] | Module L3
0x2436
0x1260 <-- PL2b
0x0379
0x09bf <-- SAx0
0x0386
0x09be <-- SSt0
0x0000
0x0d36 <-- SAx1
0x04a6
0x0d37 <-- SSt1
0x057c
0x1171 <-- SAx2
0x05b2
0x1170 <-- SSt2
0x05e6
0x1668 <-- SAx3
0x05da
0x1669 <-- SSt3
0x0bda
0x0082 <-- Res[3:0] | L | 0xbda | sector
0x0016
0x0ffc <-- 
0x0000
0x000e <-- RoadID[23:0]
0x30a6
0x8012 <-- Track chi2[31:16] | Track d0[15:0]
0x8de6
0x7ef3 <-- Track z0[31:16] | Track coth[15:0]
0x39cd
0x28ec <-- Track phi0[31:16] | Track curv[15:0]
0x0000
0x015a <-- Res[31:12] | Module L0
0x0000
0x0000 <-- IBL
0x0000
0x028a <-- Res[31:12] | Module L1
0x0000
0x0000 <-- PL0b
0x0000
0x0437 <-- Res[31:12] | Module L2
0x1960
0x281c <-- PL1b
0x0000
0x06a7 <-- Res[31:12] | Module L3
0x1910
0x24b3 <-- PL2b
0x0394
0x09ed <-- SAx0
0x03c0
0x09ec <-- SSt0
0x038e
0x0d7c <-- SAx1
0x035e
0x0d7d <-- SSt1
0x03f6
0x11cd <-- SAx2
0x042c
0x11cc <-- SSt2
0x049e
0x16dc <-- SAx3
0x0462
0x16dd <-- SSt3
0x0bda
0x1c25 <-- Res[3:0] | L | 0xbda | sector
0x0016
0x0fff <-- 
0x0000
0x0000 <-- RoadID[23:0]
0x2d51
0x804a <-- Track chi2[31:16] | Track d0[15:0]
0x7ad8
0x8c98 <-- Track z0[31:16] | Track coth[15:0]
0x340a
0x2f10 <-- Track phi0[31:16] | Track curv[15:0]
0x0000
0x015a <-- Res[31:12] | Module L0
0x125d
0x249e <-- IBL
0x0000
0x027d <-- Res[31:12] | Module L1
0x2928
0x2772 <-- PL0b
0x0000
0x042b <-- Res[31:12] | Module L2
0x2487
0x2935 <-- PL1b
0x0000
0x069b <-- Res[31:12] | Module L3
0x1844
0x1220 <-- PL2b
0x0470
0x09d7 <-- SAx0
0x0440
0x09d6 <-- SSt0
0x0324
0x0d68 <-- SAx1
0x0313
0x0d69 <-- SSt1
0x0248
0x11b9 <-- SAx2
0x021b
0x11b8 <-- SSt2
0x01ae
0x16ca <-- SAx3
0x019c
0x16cb <-- SSt3
0xe0da
0x0000 <-- E0DA (begin debug block) | Length of debug block | Indeterminate[3:0]
0xe0df
0x0000 <-- E0DF (end debug block)   | Length of debug block | Indeterminate[3:0]
0x0000
0x0000 <-- L1ID
0x0000
0x0001 <-- ErrorFlag
0x0000
0x0000 <-- Res
0x0000
0x0000 <-- Res
