0xee12
0x34ee <-- Start of Header Marker
0x0000
0x0009 <-- Header size - fixed
0x0301
0x0000 <-- Format version number - formed within FLIC from firmware
0x0000
0x007f <-- Source identifier - fixed
0x0003
0x652e <-- 0 | RunNumber[30:0]
0x0008
0x4dab <-- Extended level 1 ID
0x0000
0x0a14 <-- Res[31:12] | BCID[11:0]
0x0000
0x0000 <-- Res[31:8] | L1TriggerType[7:0]
0x0000
0x0000 <-- Res[31:24] | DetectorEventType[23:16] | Res[15:4] | TIM[3:0]
0x0bda
0x1dfb <-- Res[3:0] | L | 0xbda | sector
0x0016
0x0ffb <-- 
0x0000
0x0044 <-- RoadID[23:0]
0x1493
0x803d <-- Track chi2[31:16] | Track d0[15:0]
0x5e1a
0x8edc <-- Track z0[31:16] | Track coth[15:0]
0x2848
0x4613 <-- Track phi0[31:16] | Track curv[15:0]
0x0000
0x0144 <-- Res[31:12] | Module L0
0x24cc
0x27cc <-- IBL
0x0000
0x026f <-- Res[31:12] | Module L1
0x1890
0x1708 <-- PL0b
0x0000
0x041d <-- Res[31:12] | Module L2
0x0000
0x0000 <-- PL1b
0x0000
0x0673 <-- Res[31:12] | Module L3
0x296d
0x1688 <-- PL2b
0x00d8
0x09bf <-- SAx0
0x00c0
0x09be <-- SSt0
0x02ce
0x0d38 <-- SAx1
0x02a6
0x0d39 <-- SSt1
0x04f6
0x1171 <-- SAx2
0x04dd
0x1170 <-- SSt2
0x019e
0x1682 <-- SAx3
0x0188
0x1683 <-- SSt3
0x0bda
0x0efe <-- Res[3:0] | L | 0xbda | sector
0x0016
0x0fef <-- 
0x0000
0x0008 <-- RoadID[23:0]
0x3243
0x800f <-- Track chi2[31:16] | Track d0[15:0]
0x88a5
0x8f10 <-- Track z0[31:16] | Track coth[15:0]
0x2d4b
0x384c <-- Track phi0[31:16] | Track curv[15:0]
0x0000
0x015b <-- Res[31:12] | Module L0
0x221b
0x1101 <-- IBL
0x0000
0x027e <-- Res[31:12] | Module L1
0x15e4
0x11b8 <-- PL0b
0x0000
0x041f <-- Res[31:12] | Module L2
0x229d
0x289c <-- PL1b
0x0000
0x0682 <-- Res[31:12] | Module L3
0x1790
0x278a <-- PL2b
0x0000
0x09c1 <-- SAx0
0x04ec
0x09c0 <-- SSt0
0x022f
0x0d52 <-- SAx1
0x0202
0x0d53 <-- SSt1
0x0586
0x118b <-- SAx2
0x0574
0x118a <-- SSt2
0x037a
0x169c <-- SAx3
0x0358
0x169d <-- SSt3
0x0bda
0x22ea <-- Res[3:0] | L | 0xbda | sector
0x0016
0x0fff <-- 
0x0000
0x0004 <-- RoadID[23:0]
0x1f52
0x7fcf <-- Track chi2[31:16] | Track d0[15:0]
0xa1d4
0x878f <-- Track z0[31:16] | Track coth[15:0]
0x367c
0xb64a <-- Track phi0[31:16] | Track curv[15:0]
0x0000
0x015c <-- Res[31:12] | Module L0
0x2359
0x1581 <-- IBL
0x0000
0x027f <-- Res[31:12] | Module L1
0x1300
0x28e3 <-- PL0b
0x0000
0x0439 <-- Res[31:12] | Module L2
0x1580
0x2063 <-- PL1b
0x0000
0x069c <-- Res[31:12] | Module L3
0x1820
0x1230 <-- PL2b
0x01d4
0x09d7 <-- SAx0
0x019b
0x09d6 <-- SSt0
0x0462
0x0d50 <-- SAx1
0x043d
0x0d51 <-- SSt1
0x00d8
0x11a1 <-- SAx2
0x00d3
0x11a0 <-- SSt2
0x02e0
0x1698 <-- SAx3
0x0304
0x1699 <-- SSt3
0x0bda
0x2c0b <-- Res[3:0] | L | 0xbda | sector
0x0016
0x0fff <-- 
0x0000
0x0002 <-- RoadID[23:0]
0x34b4
0x7fdd <-- Track chi2[31:16] | Track d0[15:0]
0x74d3
0x8ea4 <-- Track z0[31:16] | Track coth[15:0]
0x43c9
0xbb4d <-- Track phi0[31:16] | Track curv[15:0]
0x0000
0x016e <-- Res[31:12] | Module L0
0x2093
0x1339 <-- IBL
0x0000
0x0297 <-- Res[31:12] | Module L1
0x1750
0x1100 <-- PL0b
0x0000
0x0452 <-- Res[31:12] | Module L2
0x1350
0x10e8 <-- PL1b
0x0000
0x06c2 <-- Res[31:12] | Module L3
0x1830
0x205c <-- PL2b
0x0013
0x0a09 <-- SAx0
0x0039
0x0a08 <-- SSt0
0x0509
0x0d80 <-- SAx1
0x0518
0x0d81 <-- SSt1
0x03e6
0x11d3 <-- SAx2
0x0406
0x11d2 <-- SSt2
0x027b
0x16e2 <-- SAx3
0x02a0
0x16e3 <-- SSt3
0x0bda
0x2ad8 <-- Res[3:0] | L | 0xbda | sector
0x0016
0x0fff <-- 
0x0000
0x0000 <-- RoadID[23:0]
0x248e
0x7fe1 <-- Track chi2[31:16] | Track d0[15:0]
0xa1ef
0x9130 <-- Track z0[31:16] | Track coth[15:0]
0x3be2
0x5ff0 <-- Track phi0[31:16] | Track curv[15:0]
0x0000
0x015d <-- Res[31:12] | Module L0
0x206a
0x28e6 <-- IBL
0x0000
0x028c <-- Res[31:12] | Module L1
0x2794
0x243c <-- PL0b
0x0000
0x0447 <-- Res[31:12] | Module L2
0x1440
0x2086 <-- PL1b
0x0000
0x06ab <-- Res[31:12] | Module L3
0x2114
0x270c <-- PL2b
0x030c
0x09f3 <-- SAx0
0x0312
0x09f2 <-- SSt0
0x0258
0x0d84 <-- SAx1
0x0224
0x0d85 <-- SSt1
0x01d8
0x11d5 <-- SAx2
0x01ba
0x11d4 <-- SSt2
0x015a
0x16e6 <-- SAx3
0x014a
0x16e7 <-- SSt3
0xe0da
0x0000 <-- E0DA (begin debug block) | Length of debug block | Indeterminate[3:0]
0xe0df
0x0000 <-- E0DF (end debug block)   | Length of debug block | Indeterminate[3:0]
0x0000
0x0000 <-- L1ID
0x0000
0x0001 <-- ErrorFlag
0x0000
0x0000 <-- Res
0x0000
0x0000 <-- Res
