0xb0f0 <-- stripped by FLIC in CoreCrate machine
0xcaf0 <-- stripped by FLIC in CoreCrate machine, Bits[3:0] are indeterminate
0xff12 <-- stripped by FLIC in CoreCrate machine
0x34ff <-- stripped by FLIC in CoreCrate machine
0x0003 <-- 0 | RunNumber[30:16], RunNumber=0x3652e
0x652e <-- RunNumber[15:0], RunNumber=0x3652e
0x0008 <-- ExtendedLevel1ID[31:16], word=0x8670d
0x670d <-- ExtendedLevel1ID[15:0], word=0x8670d
0x0000 <-- Res
0x0aed <-- Res[3:0] | BCID[11:0], word=0xaed
0x0000 <-- Res
0x0000 <-- Res[7:0] | L1TriggerType[7:0], word=0x0
0x0000 <-- Res[7:0] | DetectorEventType[7:0]
0x0000 <-- Res[11:0] | TIM[3:0]
0x0bda <-- Res[3:0] | L | 0xb | 0xd | 0xa, word=0xbda01fc
0x01fc <-- Sector Number
0x0016 <-- Res[3:0] | TFNum[3:0] | Res | Tower[6:0], word=0x160fef
0x0fef <-- Res[3:0] | Layermap[11:0]
0x0000 <-- Res[7:0] | RoadID[23:16], word=0x1d
0x001d <-- RoadID[15:0]
0x1bc1 <-- Track chi2
0x7ffe <-- Track d0
0xae6f <-- Track z0
0x82aa <-- Track coth
0x27f3 <-- Track phi
0xaa0f <-- Track curv
0x104b <-- (IBLa) 0 | ColWidth[2:0] | ColCoord[11:0]
0x2744 <-- (IBLb) s | RowWidth[2:0] | RowCoord[11:0]
0x1560 <-- (PL0a) 0 | ColWidth[2:0] | ColCoord[11:0]
0x15e0 <-- (PL0b) s | RowWidth[2:0] | RowCoord[11:0]
0x1670 <-- (PL1a) 0 | ColWidth[2:0] | ColCoord[11:0]
0x17e0 <-- (PL1b) s | RowWidth[2:0] | RowCoord[11:0]
0x1740 <-- (PL2a) 0 | ColWidth[2:0] | ColCoord[11:0]
0x2214 <-- (PL2b) s | RowWidth[2:0] | RowCoord[11:0]
0x0000 <-- (SAx0) 0 | Width[2:0] | Res | Coord[10:0]
0x02f6 <-- (SSt0) 0 | Width[2:0] | Res | Coord[10:0]
0x02da <-- (SAx1) 0 | Width[2:0] | Res | Coord[10:0]
0x02de <-- (SSt1) 0 | Width[2:0] | Res | Coord[10:0]
0x02b9 <-- (SAx2) 0 | Width[2:0] | Res | Coord[10:0]
0x02a8 <-- (SSt2) 0 | Width[2:0] | Res | Coord[10:0]
0x0252 <-- (SAx3) 0 | Width[2:0] | Res | Coord[10:0]
0x026f <-- (SSt3) 0 | Width[2:0] | Res | Coord[10:0]
0x0bda <-- Res[3:0] | L | 0xb | 0xd | 0xa, word=0xbda45a1
0x45a1 <-- Sector Number
0x0016 <-- Res[3:0] | TFNum[3:0] | Res | Tower[6:0], word=0x160ff6
0x0ff6 <-- Res[3:0] | Layermap[11:0]
0x0000 <-- Res[7:0] | RoadID[23:16], word=0xd
0x000d <-- RoadID[15:0]
0x0a39 <-- Track chi2
0x7fd0 <-- Track d0
0x6b62 <-- Track z0
0x8284 <-- Track coth
0x3e4f <-- Track phi
0xc089 <-- Track curv
0x0000 <-- (IBLa) 0 | ColWidth[2:0] | ColCoord[11:0]
0x0000 <-- (IBLb) s | RowWidth[2:0] | RowCoord[11:0]
0x1770 <-- (PL0a) 0 | ColWidth[2:0] | ColCoord[11:0]
0x25d3 <-- (PL0b) s | RowWidth[2:0] | RowCoord[11:0]
0x185c <-- (PL1a) 0 | ColWidth[2:0] | ColCoord[11:0]
0x224d <-- (PL1b) s | RowWidth[2:0] | RowCoord[11:0]
0x0000 <-- (PL2a) 0 | ColWidth[2:0] | ColCoord[11:0]
0x0000 <-- (PL2b) s | RowWidth[2:0] | RowCoord[11:0]
0x019a <-- (SAx0) 0 | Width[2:0] | Res | Coord[10:0]
0x0157 <-- (SSt0) 0 | Width[2:0] | Res | Coord[10:0]
0x0574 <-- (SAx1) 0 | Width[2:0] | Res | Coord[10:0]
0x0542 <-- (SSt1) 0 | Width[2:0] | Res | Coord[10:0]
0x033e <-- (SAx2) 0 | Width[2:0] | Res | Coord[10:0]
0x0360 <-- (SSt2) 0 | Width[2:0] | Res | Coord[10:0]
0x0099 <-- (SAx3) 0 | Width[2:0] | Res | Coord[10:0]
0x0085 <-- (SSt3) 0 | Width[2:0] | Res | Coord[10:0]
0x0bda <-- Res[3:0] | L | 0xb | 0xd | 0xa, word=0xbda2064
0x2064 <-- Sector Number
0x0016 <-- Res[3:0] | TFNum[3:0] | Res | Tower[6:0], word=0x160fff
0x0fff <-- Res[3:0] | Layermap[11:0]
0x0000 <-- Res[7:0] | RoadID[23:16], word=0x4
0x0004 <-- RoadID[15:0]
0x1d7a <-- Track chi2
0x809d <-- Track d0
0x6ba5 <-- Track z0
0x8c4d <-- Track coth
0x375c <-- Track phi
0xbf3f <-- Track curv
0x22bd <-- (IBLa) 0 | ColWidth[2:0] | ColCoord[11:0]
0x1619 <-- (IBLb) s | RowWidth[2:0] | RowCoord[11:0]
0x231c <-- (PL0a) 0 | ColWidth[2:0] | ColCoord[11:0]
0x298b <-- (PL0b) s | RowWidth[2:0] | RowCoord[11:0]
0x2732 <-- (PL1a) 0 | ColWidth[2:0] | ColCoord[11:0]
0x1190 <-- (PL1b) s | RowWidth[2:0] | RowCoord[11:0]
0x1200 <-- (PL2a) 0 | ColWidth[2:0] | ColCoord[11:0]
0x23fd <-- (PL2b) s | RowWidth[2:0] | RowCoord[11:0]
0x0236 <-- (SAx0) 0 | Width[2:0] | Res | Coord[10:0]
0x022c <-- (SSt0) 0 | Width[2:0] | Res | Coord[10:0]
0x04aa <-- (SAx1) 0 | Width[2:0] | Res | Coord[10:0]
0x04e6 <-- (SSt1) 0 | Width[2:0] | Res | Coord[10:0]
0x012a <-- (SAx2) 0 | Width[2:0] | Res | Coord[10:0]
0x0127 <-- (SSt2) 0 | Width[2:0] | Res | Coord[10:0]
0x0327 <-- (SAx3) 0 | Width[2:0] | Res | Coord[10:0]
0x035e <-- (SSt3) 0 | Width[2:0] | Res | Coord[10:0]
0xe0da <-- Begin trailer debug block
0x0000 <-- Length of debug block | Indeterminate[3:0]
0xe0df <-- End debug block
0x0000 <-- Length of debug block | Indeterminate[3:0]
0x0000 <-- L1ID[31:16]
0x0000 <-- L1ID[15:0]
0x0000 <-- ErrorFlag[31:16]
0x0001 <-- ErrorFlag[15:0]
0x0000 <-- Res
0x0000 <-- Res
0x0000 <-- Res
0x0000 <-- Res
0xe0f0 <-- stripped by FLI in CoreCrateRcvr machine
0xa5a5 <-- stripped by FLI in CoreCrateRcvr machine
0x5a5a <-- stripped by FLI in CoreCrateRcvr machine
0x0e0f <-- stripped by FLI in CoreCrateRcvr machine
