0xb0f0 <-- stripped by FLIC in CoreCrate machine
0xcaf0 <-- stripped by FLIC in CoreCrate machine, Bits[3:0] are indeterminate
0xff12 <-- stripped by FLIC in CoreCrate machine
0x34ff <-- stripped by FLIC in CoreCrate machine
0x0003 <-- 0 | RunNumber[30:16], RunNumber=0x3652e
0x652e <-- RunNumber[15:0], RunNumber=0x3652e
0x0008 <-- ExtendedLevel1ID[31:16], word=0x86a9a
0x6a9a <-- ExtendedLevel1ID[15:0], word=0x86a9a
0x0000 <-- Res
0x0a7c <-- Res[3:0] | BCID[11:0], word=0xa7c
0x0000 <-- Res
0x0000 <-- Res[7:0] | L1TriggerType[7:0], word=0x0
0x0000 <-- Res[7:0] | DetectorEventType[7:0]
0x0000 <-- Res[11:0] | TIM[3:0]
0x0bda <-- Res[3:0] | L | 0xb | 0xd | 0xa, word=0xbda0032
0x0032 <-- Sector Number
0x0016 <-- Res[3:0] | TFNum[3:0] | Res | Tower[6:0], word=0x160ffc
0x0ffc <-- Res[3:0] | Layermap[11:0]
0x0000 <-- Res[7:0] | RoadID[23:16], word=0x84
0x0084 <-- RoadID[15:0]
0x0999 <-- Track chi2
0x7f81 <-- Track d0
0x9bc9 <-- Track z0
0x8094 <-- Track coth
0x3d3e <-- Track phi
0x2669 <-- Track curv
0x0000 <-- (IBLa) 0 | ColWidth[2:0] | ColCoord[11:0]
0x0000 <-- (IBLb) s | RowWidth[2:0] | RowCoord[11:0]
0x0000 <-- (PL0a) 0 | ColWidth[2:0] | ColCoord[11:0]
0x0000 <-- (PL0b) s | RowWidth[2:0] | RowCoord[11:0]
0x16c0 <-- (PL1a) 0 | ColWidth[2:0] | ColCoord[11:0]
0x1378 <-- (PL1b) s | RowWidth[2:0] | RowCoord[11:0]
0x16f0 <-- (PL2a) 0 | ColWidth[2:0] | ColCoord[11:0]
0x220d <-- (PL2b) s | RowWidth[2:0] | RowCoord[11:0]
0x0056 <-- (SAx0) 0 | Width[2:0] | Res | Coord[10:0]
0x003c <-- (SSt0) 0 | Width[2:0] | Res | Coord[10:0]
0x0100 <-- (SAx1) 0 | Width[2:0] | Res | Coord[10:0]
0x011c <-- (SSt1) 0 | Width[2:0] | Res | Coord[10:0]
0x0218 <-- (SAx2) 0 | Width[2:0] | Res | Coord[10:0]
0x01fa <-- (SSt2) 0 | Width[2:0] | Res | Coord[10:0]
0x0372 <-- (SAx3) 0 | Width[2:0] | Res | Coord[10:0]
0x0390 <-- (SSt3) 0 | Width[2:0] | Res | Coord[10:0]
0x0bda <-- Res[3:0] | L | 0xb | 0xd | 0xa, word=0xbda7374
0x7374 <-- Sector Number
0x0016 <-- Res[3:0] | TFNum[3:0] | Res | Tower[6:0], word=0x1603ff
0x03ff <-- Res[3:0] | Layermap[11:0]
0x0000 <-- Res[7:0] | RoadID[23:16], word=0x59
0x0059 <-- RoadID[15:0]
0x5958 <-- Track chi2
0x80fd <-- Track d0
0x722a <-- Track z0
0x8fe2 <-- Track coth
0x3647 <-- Track phi
0xc377 <-- Track curv
0x100a <-- (IBLa) 0 | ColWidth[2:0] | ColCoord[11:0]
0x258e <-- (IBLb) s | RowWidth[2:0] | RowCoord[11:0]
0x1780 <-- (PL0a) 0 | ColWidth[2:0] | ColCoord[11:0]
0x28a2 <-- (PL0b) s | RowWidth[2:0] | RowCoord[11:0]
0x1350 <-- (PL1a) 0 | ColWidth[2:0] | ColCoord[11:0]
0x1040 <-- (PL1b) s | RowWidth[2:0] | RowCoord[11:0]
0x28bb <-- (PL2a) 0 | ColWidth[2:0] | ColCoord[11:0]
0x1190 <-- (PL2b) s | RowWidth[2:0] | RowCoord[11:0]
0x0127 <-- (SAx0) 0 | Width[2:0] | Res | Coord[10:0]
0x0140 <-- (SSt0) 0 | Width[2:0] | Res | Coord[10:0]
0x0354 <-- (SAx1) 0 | Width[2:0] | Res | Coord[10:0]
0x037e <-- (SSt1) 0 | Width[2:0] | Res | Coord[10:0]
0x0534 <-- (SAx2) 0 | Width[2:0] | Res | Coord[10:0]
0x053d <-- (SSt2) 0 | Width[2:0] | Res | Coord[10:0]
0x0000 <-- (SAx3) 0 | Width[2:0] | Res | Coord[10:0]
0x0000 <-- (SSt3) 0 | Width[2:0] | Res | Coord[10:0]
0x0bda <-- Res[3:0] | L | 0xb | 0xd | 0xa, word=0xbda1056
0x1056 <-- Sector Number
0x0016 <-- Res[3:0] | TFNum[3:0] | Res | Tower[6:0], word=0x1603ff
0x03ff <-- Res[3:0] | Layermap[11:0]
0x0000 <-- Res[7:0] | RoadID[23:16], word=0x18
0x0018 <-- RoadID[15:0]
0x0867 <-- Track chi2
0x7ffe <-- Track d0
0x8759 <-- Track z0
0x8bc1 <-- Track coth
0x3fc2 <-- Track phi
0x6ccf <-- Track curv
0x2085 <-- (IBLa) 0 | ColWidth[2:0] | ColCoord[11:0]
0x1159 <-- (IBLb) s | RowWidth[2:0] | RowCoord[11:0]
0x242c <-- (PL0a) 0 | ColWidth[2:0] | ColCoord[11:0]
0x27ac <-- (PL0b) s | RowWidth[2:0] | RowCoord[11:0]
0x1870 <-- (PL1a) 0 | ColWidth[2:0] | ColCoord[11:0]
0x15f0 <-- (PL1b) s | RowWidth[2:0] | RowCoord[11:0]
0x12d0 <-- (PL2a) 0 | ColWidth[2:0] | ColCoord[11:0]
0x24dc <-- (PL2b) s | RowWidth[2:0] | RowCoord[11:0]
0x059c <-- (SAx0) 0 | Width[2:0] | Res | Coord[10:0]
0x055e <-- (SSt0) 0 | Width[2:0] | Res | Coord[10:0]
0x0568 <-- (SAx1) 0 | Width[2:0] | Res | Coord[10:0]
0x055e <-- (SSt1) 0 | Width[2:0] | Res | Coord[10:0]
0x055e <-- (SAx2) 0 | Width[2:0] | Res | Coord[10:0]
0x0530 <-- (SSt2) 0 | Width[2:0] | Res | Coord[10:0]
0x0000 <-- (SAx3) 0 | Width[2:0] | Res | Coord[10:0]
0x0000 <-- (SSt3) 0 | Width[2:0] | Res | Coord[10:0]
0xe0da <-- Begin trailer debug block
0x0000 <-- Length of debug block | Indeterminate[3:0]
0xe0df <-- End debug block
0x0000 <-- Length of debug block | Indeterminate[3:0]
0x0000 <-- L1ID[31:16]
0x0000 <-- L1ID[15:0]
0x0000 <-- ErrorFlag[31:16]
0x0001 <-- ErrorFlag[15:0]
0x0000 <-- Res
0x0000 <-- Res
0x0000 <-- Res
0x0000 <-- Res
0xe0f0 <-- stripped by FLI in CoreCrateRcvr machine
0xa5a5 <-- stripped by FLI in CoreCrateRcvr machine
0x5a5a <-- stripped by FLI in CoreCrateRcvr machine
0x0e0f <-- stripped by FLI in CoreCrateRcvr machine
