0xb0f0 <-- stripped by FLIC in CoreCrate machine
0xcaf0 <-- stripped by FLIC in CoreCrate machine, Bits[3:0] are indeterminate
0xff12 <-- stripped by FLIC in CoreCrate machine
0x34ff <-- stripped by FLIC in CoreCrate machine
0x0003 <-- 0 | RunNumber[30:16], RunNumber=0x3652e
0x652e <-- RunNumber[15:0], RunNumber=0x3652e
0x0008 <-- ExtendedLevel1ID[31:16], word=0x86a77
0x6a77 <-- ExtendedLevel1ID[15:0], word=0x86a77
0x0000 <-- Res
0x0d18 <-- Res[3:0] | BCID[11:0], word=0xd18
0x0000 <-- Res
0x0000 <-- Res[7:0] | L1TriggerType[7:0], word=0x0
0x0000 <-- Res[7:0] | DetectorEventType[7:0]
0x0000 <-- Res[11:0] | TIM[3:0]
0x0bda <-- Res[3:0] | L | 0xb | 0xd | 0xa, word=0xbda4de1
0x4de1 <-- Sector Number
0x0016 <-- Res[3:0] | TFNum[3:0] | Res | Tower[6:0], word=0x1607f7
0x07f7 <-- Res[3:0] | Layermap[11:0]
0x0000 <-- Res[7:0] | RoadID[23:16], word=0x11a
0x011a <-- RoadID[15:0]
0x4412 <-- Track chi2
0x8010 <-- Track d0
0x855c <-- Track z0
0x9280 <-- Track coth
0x3234 <-- Track phi
0xd4c8 <-- Track curv
0x21f4 <-- (IBLa) 0 | ColWidth[2:0] | ColCoord[11:0]
0x232c <-- (IBLb) s | RowWidth[2:0] | RowCoord[11:0]
0x2684 <-- (PL0a) 0 | ColWidth[2:0] | ColCoord[11:0]
0x14d0 <-- (PL0b) s | RowWidth[2:0] | RowCoord[11:0]
0x23cc <-- (PL1a) 0 | ColWidth[2:0] | ColCoord[11:0]
0x1320 <-- (PL1b) s | RowWidth[2:0] | RowCoord[11:0]
0x0000 <-- (PL2a) 0 | ColWidth[2:0] | ColCoord[11:0]
0x0000 <-- (PL2b) s | RowWidth[2:0] | RowCoord[11:0]
0x038e <-- (SAx0) 0 | Width[2:0] | Res | Coord[10:0]
0x034d <-- (SSt0) 0 | Width[2:0] | Res | Coord[10:0]
0x048c <-- (SAx1) 0 | Width[2:0] | Res | Coord[10:0]
0x04a4 <-- (SSt1) 0 | Width[2:0] | Res | Coord[10:0]
0x0556 <-- (SAx2) 0 | Width[2:0] | Res | Coord[10:0]
0x04e8 <-- (SSt2) 0 | Width[2:0] | Res | Coord[10:0]
0x05cd <-- (SAx3) 0 | Width[2:0] | Res | Coord[10:0]
0x0000 <-- (SSt3) 0 | Width[2:0] | Res | Coord[10:0]
0x0bda <-- Res[3:0] | L | 0xb | 0xd | 0xa, word=0xbda0259
0x0259 <-- Sector Number
0x0016 <-- Res[3:0] | TFNum[3:0] | Res | Tower[6:0], word=0x160fee
0x0fee <-- Res[3:0] | Layermap[11:0]
0x0000 <-- Res[7:0] | RoadID[23:16], word=0xf8
0x00f8 <-- RoadID[15:0]
0x3ab6 <-- Track chi2
0x8102 <-- Track d0
0x798d <-- Track z0
0x8423 <-- Track coth
0x3b03 <-- Track phi
0xc139 <-- Track curv
0x0000 <-- (IBLa) 0 | ColWidth[2:0] | ColCoord[11:0]
0x0000 <-- (IBLb) s | RowWidth[2:0] | RowCoord[11:0]
0x1430 <-- (PL0a) 0 | ColWidth[2:0] | ColCoord[11:0]
0x1310 <-- (PL0b) s | RowWidth[2:0] | RowCoord[11:0]
0x15e4 <-- (PL1a) 0 | ColWidth[2:0] | ColCoord[11:0]
0x16f8 <-- (PL1b) s | RowWidth[2:0] | RowCoord[11:0]
0x271e <-- (PL2a) 0 | ColWidth[2:0] | ColCoord[11:0]
0x21ad <-- (PL2b) s | RowWidth[2:0] | RowCoord[11:0]
0x0000 <-- (SAx0) 0 | Width[2:0] | Res | Coord[10:0]
0x0502 <-- (SSt0) 0 | Width[2:0] | Res | Coord[10:0]
0x0251 <-- (SAx1) 0 | Width[2:0] | Res | Coord[10:0]
0x026e <-- (SSt1) 0 | Width[2:0] | Res | Coord[10:0]
0x054c <-- (SAx2) 0 | Width[2:0] | Res | Coord[10:0]
0x051e <-- (SSt2) 0 | Width[2:0] | Res | Coord[10:0]
0x0211 <-- (SAx3) 0 | Width[2:0] | Res | Coord[10:0]
0x0254 <-- (SSt3) 0 | Width[2:0] | Res | Coord[10:0]
0x0bda <-- Res[3:0] | L | 0xb | 0xd | 0xa, word=0xbda49fa
0x49fa <-- Sector Number
0x0016 <-- Res[3:0] | TFNum[3:0] | Res | Tower[6:0], word=0x160fff
0x0fff <-- Res[3:0] | Layermap[11:0]
0x0000 <-- Res[7:0] | RoadID[23:16], word=0x3d
0x003d <-- RoadID[15:0]
0x3648 <-- Track chi2
0x7fc4 <-- Track d0
0x625a <-- Track z0
0x867f <-- Track coth
0x41a7 <-- Track phi
0xd389 <-- Track curv
0x137b <-- (IBLa) 0 | ColWidth[2:0] | ColCoord[11:0]
0x1209 <-- (IBLb) s | RowWidth[2:0] | RowCoord[11:0]
0x15fc <-- (PL0a) 0 | ColWidth[2:0] | ColCoord[11:0]
0x28a5 <-- (PL0b) s | RowWidth[2:0] | RowCoord[11:0]
0x185c <-- (PL1a) 0 | ColWidth[2:0] | ColCoord[11:0]
0x56e9 <-- (PL1b) s | RowWidth[2:0] | RowCoord[11:0]
0x10d0 <-- (PL2a) 0 | ColWidth[2:0] | ColCoord[11:0]
0x1490 <-- (PL2b) s | RowWidth[2:0] | RowCoord[11:0]
0x037e <-- (SAx0) 0 | Width[2:0] | Res | Coord[10:0]
0x0383 <-- (SSt0) 0 | Width[2:0] | Res | Coord[10:0]
0x0192 <-- (SAx1) 0 | Width[2:0] | Res | Coord[10:0]
0x01af <-- (SSt1) 0 | Width[2:0] | Res | Coord[10:0]
0x055a <-- (SAx2) 0 | Width[2:0] | Res | Coord[10:0]
0x0524 <-- (SSt2) 0 | Width[2:0] | Res | Coord[10:0]
0x02b2 <-- (SAx3) 0 | Width[2:0] | Res | Coord[10:0]
0x0290 <-- (SSt3) 0 | Width[2:0] | Res | Coord[10:0]
0x0bda <-- Res[3:0] | L | 0xb | 0xd | 0xa, word=0xbda0033
0x0033 <-- Sector Number
0x0016 <-- Res[3:0] | TFNum[3:0] | Res | Tower[6:0], word=0x1607ff
0x07ff <-- Res[3:0] | Layermap[11:0]
0x0000 <-- Res[7:0] | RoadID[23:16], word=0x13
0x0013 <-- RoadID[15:0]
0x8f78 <-- Track chi2
0x7ffd <-- Track d0
0xa4f7 <-- Track z0
0x7cab <-- Track coth
0x3fae <-- Track phi
0x3088 <-- Track curv
0x10ff <-- (IBLa) 0 | ColWidth[2:0] | ColCoord[11:0]
0x2176 <-- (IBLb) s | RowWidth[2:0] | RowCoord[11:0]
0x1830 <-- (PL0a) 0 | ColWidth[2:0] | ColCoord[11:0]
0x27e4 <-- (PL0b) s | RowWidth[2:0] | RowCoord[11:0]
0x16f0 <-- (PL1a) 0 | ColWidth[2:0] | ColCoord[11:0]
0x2725 <-- (PL1b) s | RowWidth[2:0] | RowCoord[11:0]
0x15c0 <-- (PL2a) 0 | ColWidth[2:0] | ColCoord[11:0]
0x2704 <-- (PL2b) s | RowWidth[2:0] | RowCoord[11:0]
0x01f2 <-- (SAx0) 0 | Width[2:0] | Res | Coord[10:0]
0x020c <-- (SSt0) 0 | Width[2:0] | Res | Coord[10:0]
0x02e4 <-- (SAx1) 0 | Width[2:0] | Res | Coord[10:0]
0x02ba <-- (SSt1) 0 | Width[2:0] | Res | Coord[10:0]
0x0440 <-- (SAx2) 0 | Width[2:0] | Res | Coord[10:0]
0x047a <-- (SSt2) 0 | Width[2:0] | Res | Coord[10:0]
0x05c6 <-- (SAx3) 0 | Width[2:0] | Res | Coord[10:0]
0x0000 <-- (SSt3) 0 | Width[2:0] | Res | Coord[10:0]
0xe0da <-- Begin trailer debug block
0x0000 <-- Length of debug block | Indeterminate[3:0]
0xe0df <-- End debug block
0x0000 <-- Length of debug block | Indeterminate[3:0]
0x0000 <-- L1ID[31:16]
0x0000 <-- L1ID[15:0]
0x0000 <-- ErrorFlag[31:16]
0x0001 <-- ErrorFlag[15:0]
0x0000 <-- Res
0x0000 <-- Res
0x0000 <-- Res
0x0000 <-- Res
0xe0f0 <-- stripped by FLI in CoreCrateRcvr machine
0xa5a5 <-- stripped by FLI in CoreCrateRcvr machine
0x5a5a <-- stripped by FLI in CoreCrateRcvr machine
0x0e0f <-- stripped by FLI in CoreCrateRcvr machine
