0xb0f0 <-- stripped by FLIC in CoreCrate machine
0xcaf0 <-- stripped by FLIC in CoreCrate machine, Bits[3:0] are indeterminate
0xff12 <-- stripped by FLIC in CoreCrate machine
0x34ff <-- stripped by FLIC in CoreCrate machine
0x0003 <-- 0 | RunNumber[30:16], RunNumber=0x3652e
0x652e <-- RunNumber[15:0], RunNumber=0x3652e
0x0008 <-- ExtendedLevel1ID[31:16], word=0x84d96
0x4d96 <-- ExtendedLevel1ID[15:0], word=0x84d96
0x0000 <-- Res
0x056e <-- Res[3:0] | BCID[11:0], word=0x56e
0x0000 <-- Res
0x0000 <-- Res[7:0] | L1TriggerType[7:0], word=0x0
0x0000 <-- Res[7:0] | DetectorEventType[7:0]
0x0000 <-- Res[11:0] | TIM[3:0]
0x0bda <-- Res[3:0] | L | 0xb | 0xd | 0xa, word=0xbda0efe
0x0efe <-- Sector Number
0x0016 <-- Res[3:0] | TFNum[3:0] | Res | Tower[6:0], word=0x160fef
0x0fef <-- Res[3:0] | Layermap[11:0]
0x0000 <-- Res[7:0] | RoadID[23:16], word=0xe
0x000e <-- RoadID[15:0]
0x33ba <-- Track chi2
0x800e <-- Track d0
0x88a5 <-- Track z0
0x8f10 <-- Track coth
0x2d4b <-- Track phi
0x384c <-- Track curv
0x221b <-- (IBLa) 0 | ColWidth[2:0] | ColCoord[11:0]
0x1101 <-- (IBLb) s | RowWidth[2:0] | RowCoord[11:0]
0x15e4 <-- (PL0a) 0 | ColWidth[2:0] | ColCoord[11:0]
0x11b8 <-- (PL0b) s | RowWidth[2:0] | RowCoord[11:0]
0x229e <-- (PL1a) 0 | ColWidth[2:0] | ColCoord[11:0]
0x289c <-- (PL1b) s | RowWidth[2:0] | RowCoord[11:0]
0x1790 <-- (PL2a) 0 | ColWidth[2:0] | ColCoord[11:0]
0x278b <-- (PL2b) s | RowWidth[2:0] | RowCoord[11:0]
0x0000 <-- (SAx0) 0 | Width[2:0] | Res | Coord[10:0]
0x04ec <-- (SSt0) 0 | Width[2:0] | Res | Coord[10:0]
0x022f <-- (SAx1) 0 | Width[2:0] | Res | Coord[10:0]
0x0202 <-- (SSt1) 0 | Width[2:0] | Res | Coord[10:0]
0x0586 <-- (SAx2) 0 | Width[2:0] | Res | Coord[10:0]
0x0574 <-- (SSt2) 0 | Width[2:0] | Res | Coord[10:0]
0x037a <-- (SAx3) 0 | Width[2:0] | Res | Coord[10:0]
0x0359 <-- (SSt3) 0 | Width[2:0] | Res | Coord[10:0]
0x0bda <-- Res[3:0] | L | 0xb | 0xd | 0xa, word=0xbda22ea
0x22ea <-- Sector Number
0x0016 <-- Res[3:0] | TFNum[3:0] | Res | Tower[6:0], word=0x160fff
0x0fff <-- Res[3:0] | Layermap[11:0]
0x0000 <-- Res[7:0] | RoadID[23:16], word=0x2
0x0002 <-- RoadID[15:0]
0x2584 <-- Track chi2
0x7fc9 <-- Track d0
0xa1d5 <-- Track z0
0x878e <-- Track coth
0x367d <-- Track phi
0xb61a <-- Track curv
0x2359 <-- (IBLa) 0 | ColWidth[2:0] | ColCoord[11:0]
0x1581 <-- (IBLb) s | RowWidth[2:0] | RowCoord[11:0]
0x1300 <-- (PL0a) 0 | ColWidth[2:0] | ColCoord[11:0]
0x28e3 <-- (PL0b) s | RowWidth[2:0] | RowCoord[11:0]
0x1580 <-- (PL1a) 0 | ColWidth[2:0] | ColCoord[11:0]
0x1068 <-- (PL1b) s | RowWidth[2:0] | RowCoord[11:0]
0x1820 <-- (PL2a) 0 | ColWidth[2:0] | ColCoord[11:0]
0x1230 <-- (PL2b) s | RowWidth[2:0] | RowCoord[11:0]
0x01d4 <-- (SAx0) 0 | Width[2:0] | Res | Coord[10:0]
0x019b <-- (SSt0) 0 | Width[2:0] | Res | Coord[10:0]
0x0462 <-- (SAx1) 0 | Width[2:0] | Res | Coord[10:0]
0x043e <-- (SSt1) 0 | Width[2:0] | Res | Coord[10:0]
0x00d8 <-- (SAx2) 0 | Width[2:0] | Res | Coord[10:0]
0x00d3 <-- (SSt2) 0 | Width[2:0] | Res | Coord[10:0]
0x02e0 <-- (SAx3) 0 | Width[2:0] | Res | Coord[10:0]
0x0304 <-- (SSt3) 0 | Width[2:0] | Res | Coord[10:0]
0x0bda <-- Res[3:0] | L | 0xb | 0xd | 0xa, word=0xbda2ad8
0x2ad8 <-- Sector Number
0x0016 <-- Res[3:0] | TFNum[3:0] | Res | Tower[6:0], word=0x160fff
0x0fff <-- Res[3:0] | Layermap[11:0]
0x0000 <-- Res[7:0] | RoadID[23:16], word=0x0
0x0000 <-- RoadID[15:0]
0x237f <-- Track chi2
0x7fe0 <-- Track d0
0xa1ee <-- Track z0
0x9131 <-- Track coth
0x3be2 <-- Track phi
0x5ff6 <-- Track curv
0x206a <-- (IBLa) 0 | ColWidth[2:0] | ColCoord[11:0]
0x28e6 <-- (IBLb) s | RowWidth[2:0] | RowCoord[11:0]
0x2794 <-- (PL0a) 0 | ColWidth[2:0] | ColCoord[11:0]
0x243c <-- (PL0b) s | RowWidth[2:0] | RowCoord[11:0]
0x1440 <-- (PL1a) 0 | ColWidth[2:0] | ColCoord[11:0]
0x2086 <-- (PL1b) s | RowWidth[2:0] | RowCoord[11:0]
0x2115 <-- (PL2a) 0 | ColWidth[2:0] | ColCoord[11:0]
0x270c <-- (PL2b) s | RowWidth[2:0] | RowCoord[11:0]
0x030c <-- (SAx0) 0 | Width[2:0] | Res | Coord[10:0]
0x0312 <-- (SSt0) 0 | Width[2:0] | Res | Coord[10:0]
0x0258 <-- (SAx1) 0 | Width[2:0] | Res | Coord[10:0]
0x0224 <-- (SSt1) 0 | Width[2:0] | Res | Coord[10:0]
0x01d8 <-- (SAx2) 0 | Width[2:0] | Res | Coord[10:0]
0x01ba <-- (SSt2) 0 | Width[2:0] | Res | Coord[10:0]
0x015a <-- (SAx3) 0 | Width[2:0] | Res | Coord[10:0]
0x014a <-- (SSt3) 0 | Width[2:0] | Res | Coord[10:0]
0xe0da <-- Begin trailer debug block
0x0000 <-- Length of debug block | Indeterminate[3:0]
0xe0df <-- End debug block
0x0000 <-- Length of debug block | Indeterminate[3:0]
0x0000 <-- L1ID[31:16]
0x0000 <-- L1ID[15:0]
0x0000 <-- ErrorFlag[31:16]
0x0001 <-- ErrorFlag[15:0]
0x0000 <-- Res
0x0000 <-- Res
0x0000 <-- Res
0x0000 <-- Res
0xe0f0 <-- stripped by FLI in CoreCrateRcvr machine
0xa5a5 <-- stripped by FLI in CoreCrateRcvr machine
0x5a5a <-- stripped by FLI in CoreCrateRcvr machine
0x0e0f <-- stripped by FLI in CoreCrateRcvr machine
