0xb0f0 <-- stripped by FLIC in CoreCrate machine
0xcaf0 <-- stripped by FLIC in CoreCrate machine, Bits[3:0] are indeterminate
0xff12 <-- stripped by FLIC in CoreCrate machine
0x34ff <-- stripped by FLIC in CoreCrate machine
0x0003 <-- 0 | RunNumber[30:16], RunNumber=0x3652e
0x652e <-- RunNumber[15:0], RunNumber=0x3652e
0x0008 <-- ExtendedLevel1ID[31:16], word=0x86a03
0x6a03 <-- ExtendedLevel1ID[15:0], word=0x86a03
0x0000 <-- Res
0x0600 <-- Res[3:0] | BCID[11:0], word=0x600
0x0000 <-- Res
0x0000 <-- Res[7:0] | L1TriggerType[7:0], word=0x0
0x0000 <-- Res[7:0] | DetectorEventType[7:0]
0x0000 <-- Res[11:0] | TIM[3:0]
0x0bda <-- Res[3:0] | L | 0xb | 0xd | 0xa, word=0xbda3e18
0x3e18 <-- Sector Number
0x0016 <-- Res[3:0] | TFNum[3:0] | Res | Tower[6:0], word=0x160dff
0x0dff <-- Res[3:0] | Layermap[11:0]
0x0000 <-- Res[7:0] | RoadID[23:16], word=0xf5
0x00f5 <-- RoadID[15:0]
0x3e8e <-- Track chi2
0x7fef <-- Track d0
0x7e00 <-- Track z0
0x843e <-- Track coth
0x2507 <-- Track phi
0x4245 <-- Track curv
0x10e1 <-- (IBLa) 0 | ColWidth[2:0] | ColCoord[11:0]
0x15e1 <-- (IBLb) s | RowWidth[2:0] | RowCoord[11:0]
0x1610 <-- (PL0a) 0 | ColWidth[2:0] | ColCoord[11:0]
0x13e8 <-- (PL0b) s | RowWidth[2:0] | RowCoord[11:0]
0x17b0 <-- (PL1a) 0 | ColWidth[2:0] | ColCoord[11:0]
0x2544 <-- (PL1b) s | RowWidth[2:0] | RowCoord[11:0]
0x1930 <-- (PL2a) 0 | ColWidth[2:0] | ColCoord[11:0]
0x296b <-- (PL2b) s | RowWidth[2:0] | RowCoord[11:0]
0x040e <-- (SAx0) 0 | Width[2:0] | Res | Coord[10:0]
0x03fc <-- (SSt0) 0 | Width[2:0] | Res | Coord[10:0]
0x0542 <-- (SAx1) 0 | Width[2:0] | Res | Coord[10:0]
0x0566 <-- (SSt1) 0 | Width[2:0] | Res | Coord[10:0]
0x012f <-- (SAx2) 0 | Width[2:0] | Res | Coord[10:0]
0x0000 <-- (SSt2) 0 | Width[2:0] | Res | Coord[10:0]
0x02ea <-- (SAx3) 0 | Width[2:0] | Res | Coord[10:0]
0x02ba <-- (SSt3) 0 | Width[2:0] | Res | Coord[10:0]
0x0bda <-- Res[3:0] | L | 0xb | 0xd | 0xa, word=0xbda0650
0x0650 <-- Sector Number
0x0016 <-- Res[3:0] | TFNum[3:0] | Res | Tower[6:0], word=0x160fff
0x0fff <-- Res[3:0] | Layermap[11:0]
0x0000 <-- Res[7:0] | RoadID[23:16], word=0x20
0x0020 <-- RoadID[15:0]
0x2a8d <-- Track chi2
0x8049 <-- Track d0
0xa07f <-- Track z0
0x877e <-- Track coth
0x2dcc <-- Track phi
0xc3fd <-- Track curv
0x12b7 <-- (IBLa) 0 | ColWidth[2:0] | ColCoord[11:0]
0x20f4 <-- (IBLb) s | RowWidth[2:0] | RowCoord[11:0]
0x1220 <-- (PL0a) 0 | ColWidth[2:0] | ColCoord[11:0]
0x1168 <-- (PL0b) s | RowWidth[2:0] | RowCoord[11:0]
0x2528 <-- (PL1a) 0 | ColWidth[2:0] | ColCoord[11:0]
0x267b <-- (PL1b) s | RowWidth[2:0] | RowCoord[11:0]
0x1790 <-- (PL2a) 0 | ColWidth[2:0] | ColCoord[11:0]
0x236a <-- (PL2b) s | RowWidth[2:0] | RowCoord[11:0]
0x0084 <-- (SAx0) 0 | Width[2:0] | Res | Coord[10:0]
0x004d <-- (SSt0) 0 | Width[2:0] | Res | Coord[10:0]
0x0130 <-- (SAx1) 0 | Width[2:0] | Res | Coord[10:0]
0x010d <-- (SSt1) 0 | Width[2:0] | Res | Coord[10:0]
0x0191 <-- (SAx2) 0 | Width[2:0] | Res | Coord[10:0]
0x0192 <-- (SSt2) 0 | Width[2:0] | Res | Coord[10:0]
0x0194 <-- (SAx3) 0 | Width[2:0] | Res | Coord[10:0]
0x01b6 <-- (SSt3) 0 | Width[2:0] | Res | Coord[10:0]
0x0bda <-- Res[3:0] | L | 0xb | 0xd | 0xa, word=0xbda5e9e
0x5e9e <-- Sector Number
0x0016 <-- Res[3:0] | TFNum[3:0] | Res | Tower[6:0], word=0x160fff
0x0fff <-- Res[3:0] | Layermap[11:0]
0x0000 <-- Res[7:0] | RoadID[23:16], word=0x1c
0x001c <-- RoadID[15:0]
0x35c1 <-- Track chi2
0x7fa5 <-- Track d0
0xa00a <-- Track z0
0x870e <-- Track coth
0x3516 <-- Track phi
0xbf32 <-- Track curv
0x1271 <-- (IBLa) 0 | ColWidth[2:0] | ColCoord[11:0]
0x14b1 <-- (IBLb) s | RowWidth[2:0] | RowCoord[11:0]
0x21f5 <-- (PL0a) 0 | ColWidth[2:0] | ColCoord[11:0]
0x1788 <-- (PL0b) s | RowWidth[2:0] | RowCoord[11:0]
0x14a0 <-- (PL1a) 0 | ColWidth[2:0] | ColCoord[11:0]
0x17a8 <-- (PL1b) s | RowWidth[2:0] | RowCoord[11:0]
0x1714 <-- (PL2a) 0 | ColWidth[2:0] | ColCoord[11:0]
0x28ab <-- (PL2b) s | RowWidth[2:0] | RowCoord[11:0]
0x0053 <-- (SAx0) 0 | Width[2:0] | Res | Coord[10:0]
0x0026 <-- (SSt0) 0 | Width[2:0] | Res | Coord[10:0]
0x0282 <-- (SAx1) 0 | Width[2:0] | Res | Coord[10:0]
0x0251 <-- (SSt1) 0 | Width[2:0] | Res | Coord[10:0]
0x045f <-- (SAx2) 0 | Width[2:0] | Res | Coord[10:0]
0x0470 <-- (SSt2) 0 | Width[2:0] | Res | Coord[10:0]
0x05e0 <-- (SAx3) 0 | Width[2:0] | Res | Coord[10:0]
0x05ed <-- (SSt3) 0 | Width[2:0] | Res | Coord[10:0]
0x0bda <-- Res[3:0] | L | 0xb | 0xd | 0xa, word=0xbda0b8e
0x0b8e <-- Sector Number
0x0016 <-- Res[3:0] | TFNum[3:0] | Res | Tower[6:0], word=0x160fff
0x0fff <-- Res[3:0] | Layermap[11:0]
0x0000 <-- Res[7:0] | RoadID[23:16], word=0x16
0x0016 <-- RoadID[15:0]
0x2771 <-- Track chi2
0x7ffa <-- Track d0
0xa07c <-- Track z0
0x8bc7 <-- Track coth
0x2f2d <-- Track phi
0x2f8d <-- Track curv
0x241a <-- (IBLa) 0 | ColWidth[2:0] | ColCoord[11:0]
0x21fe <-- (IBLb) s | RowWidth[2:0] | RowCoord[11:0]
0x1450 <-- (PL0a) 0 | ColWidth[2:0] | ColCoord[11:0]
0x2355 <-- (PL0b) s | RowWidth[2:0] | RowCoord[11:0]
0x18a0 <-- (PL1a) 0 | ColWidth[2:0] | ColCoord[11:0]
0x11a8 <-- (PL1b) s | RowWidth[2:0] | RowCoord[11:0]
0x1320 <-- (PL2a) 0 | ColWidth[2:0] | ColCoord[11:0]
0x1210 <-- (PL2b) s | RowWidth[2:0] | RowCoord[11:0]
0x00ed <-- (SAx0) 0 | Width[2:0] | Res | Coord[10:0]
0x00e2 <-- (SSt0) 0 | Width[2:0] | Res | Coord[10:0]
0x0472 <-- (SAx1) 0 | Width[2:0] | Res | Coord[10:0]
0x04aa <-- (SSt1) 0 | Width[2:0] | Res | Coord[10:0]
0x02aa <-- (SAx2) 0 | Width[2:0] | Res | Coord[10:0]
0x02b0 <-- (SSt2) 0 | Width[2:0] | Res | Coord[10:0]
0x0132 <-- (SAx3) 0 | Width[2:0] | Res | Coord[10:0]
0x0164 <-- (SSt3) 0 | Width[2:0] | Res | Coord[10:0]
0x0bda <-- Res[3:0] | L | 0xb | 0xd | 0xa, word=0xbda8c2d
0x8c2d <-- Sector Number
0x0016 <-- Res[3:0] | TFNum[3:0] | Res | Tower[6:0], word=0x1603fe
0x03fe <-- Res[3:0] | Layermap[11:0]
0x0000 <-- Res[7:0] | RoadID[23:16], word=0x15
0x0015 <-- RoadID[15:0]
0x18ea <-- Track chi2
0x8048 <-- Track d0
0x7e07 <-- Track z0
0x92fa <-- Track coth
0x2fb3 <-- Track phi
0x596f <-- Track curv
0x0000 <-- (IBLa) 0 | ColWidth[2:0] | ColCoord[11:0]
0x0000 <-- (IBLb) s | RowWidth[2:0] | RowCoord[11:0]
0x23c4 <-- (PL0a) 0 | ColWidth[2:0] | ColCoord[11:0]
0x1398 <-- (PL0b) s | RowWidth[2:0] | RowCoord[11:0]
0x113c <-- (PL1a) 0 | ColWidth[2:0] | ColCoord[11:0]
0x21ec <-- (PL1b) s | RowWidth[2:0] | RowCoord[11:0]
0x1780 <-- (PL2a) 0 | ColWidth[2:0] | ColCoord[11:0]
0x11a8 <-- (PL2b) s | RowWidth[2:0] | RowCoord[11:0]
0x05c2 <-- (SAx0) 0 | Width[2:0] | Res | Coord[10:0]
0x0594 <-- (SSt0) 0 | Width[2:0] | Res | Coord[10:0]
0x02e4 <-- (SAx1) 0 | Width[2:0] | Res | Coord[10:0]
0x02f8 <-- (SSt1) 0 | Width[2:0] | Res | Coord[10:0]
0x0058 <-- (SAx2) 0 | Width[2:0] | Res | Coord[10:0]
0x0060 <-- (SSt2) 0 | Width[2:0] | Res | Coord[10:0]
0x0000 <-- (SAx3) 0 | Width[2:0] | Res | Coord[10:0]
0x0000 <-- (SSt3) 0 | Width[2:0] | Res | Coord[10:0]
0x0bda <-- Res[3:0] | L | 0xb | 0xd | 0xa, word=0xbda0616
0x0616 <-- Sector Number
0x0016 <-- Res[3:0] | TFNum[3:0] | Res | Tower[6:0], word=0x1603ff
0x03ff <-- Res[3:0] | Layermap[11:0]
0x0000 <-- Res[7:0] | RoadID[23:16], word=0x12
0x0012 <-- RoadID[15:0]
0x7ae0 <-- Track chi2
0x7fab <-- Track d0
0x9b02 <-- Track z0
0x7d79 <-- Track coth
0x3ca7 <-- Track phi
0xaf48 <-- Track curv
0x13b7 <-- (IBLa) 0 | ColWidth[2:0] | ColCoord[11:0]
0x290e <-- (IBLb) s | RowWidth[2:0] | RowCoord[11:0]
0x34a2 <-- (PL0a) 0 | ColWidth[2:0] | ColCoord[11:0]
0x7472 <-- (PL0b) s | RowWidth[2:0] | RowCoord[11:0]
0x139c <-- (PL1a) 0 | ColWidth[2:0] | ColCoord[11:0]
0x29bb <-- (PL1b) s | RowWidth[2:0] | RowCoord[11:0]
0x12e0 <-- (PL2a) 0 | ColWidth[2:0] | ColCoord[11:0]
0x2574 <-- (PL2b) s | RowWidth[2:0] | RowCoord[11:0]
0x00f4 <-- (SAx0) 0 | Width[2:0] | Res | Coord[10:0]
0x0115 <-- (SSt0) 0 | Width[2:0] | Res | Coord[10:0]
0x04bf <-- (SAx1) 0 | Width[2:0] | Res | Coord[10:0]
0x0492 <-- (SSt1) 0 | Width[2:0] | Res | Coord[10:0]
0x029c <-- (SAx2) 0 | Width[2:0] | Res | Coord[10:0]
0x02d3 <-- (SSt2) 0 | Width[2:0] | Res | Coord[10:0]
0x0000 <-- (SAx3) 0 | Width[2:0] | Res | Coord[10:0]
0x0000 <-- (SSt3) 0 | Width[2:0] | Res | Coord[10:0]
0x0bda <-- Res[3:0] | L | 0xb | 0xd | 0xa, word=0xbda1060
0x1060 <-- Sector Number
0x0016 <-- Res[3:0] | TFNum[3:0] | Res | Tower[6:0], word=0x160ffe
0x0ffe <-- Res[3:0] | Layermap[11:0]
0x0000 <-- Res[7:0] | RoadID[23:16], word=0x0
0x0000 <-- RoadID[15:0]
0x46dd <-- Track chi2
0x800c <-- Track d0
0x7d45 <-- Track z0
0x9288 <-- Track coth
0x41d0 <-- Track phi
0xbac5 <-- Track curv
0x0000 <-- (IBLa) 0 | ColWidth[2:0] | ColCoord[11:0]
0x0000 <-- (IBLb) s | RowWidth[2:0] | RowCoord[11:0]
0x23d3 <-- (PL0a) 0 | ColWidth[2:0] | ColCoord[11:0]
0x2903 <-- (PL0b) s | RowWidth[2:0] | RowCoord[11:0]
0x211f <-- (PL1a) 0 | ColWidth[2:0] | ColCoord[11:0]
0x27bb <-- (PL1b) s | RowWidth[2:0] | RowCoord[11:0]
0x1714 <-- (PL2a) 0 | ColWidth[2:0] | ColCoord[11:0]
0x1600 <-- (PL2b) s | RowWidth[2:0] | RowCoord[11:0]
0x0492 <-- (SAx0) 0 | Width[2:0] | Res | Coord[10:0]
0x0466 <-- (SSt0) 0 | Width[2:0] | Res | Coord[10:0]
0x0334 <-- (SAx1) 0 | Width[2:0] | Res | Coord[10:0]
0x033e <-- (SSt1) 0 | Width[2:0] | Res | Coord[10:0]
0x01d9 <-- (SAx2) 0 | Width[2:0] | Res | Coord[10:0]
0x01ed <-- (SSt2) 0 | Width[2:0] | Res | Coord[10:0]
0x000f <-- (SAx3) 0 | Width[2:0] | Res | Coord[10:0]
0x0055 <-- (SSt3) 0 | Width[2:0] | Res | Coord[10:0]
0xe0da <-- Begin trailer debug block
0x0000 <-- Length of debug block | Indeterminate[3:0]
0xe0df <-- End debug block
0x0000 <-- Length of debug block | Indeterminate[3:0]
0x0000 <-- L1ID[31:16]
0x0000 <-- L1ID[15:0]
0x0000 <-- ErrorFlag[31:16]
0x0001 <-- ErrorFlag[15:0]
0x0000 <-- Res
0x0000 <-- Res
0x0000 <-- Res
0x0000 <-- Res
0xe0f0 <-- stripped by FLI in CoreCrateRcvr machine
0xa5a5 <-- stripped by FLI in CoreCrateRcvr machine
0x5a5a <-- stripped by FLI in CoreCrateRcvr machine
0x0e0f <-- stripped by FLI in CoreCrateRcvr machine
