0xee12
0x34ee <-- Start of Header Marker
0x0000
0x0009 <-- Header size - fixed
0x0301
0x0000 <-- Format version number - formed within FLIC from firmware
0x0000
0x007f <-- Source identifier - fixed
0x0003
0x652e <-- 0 | RunNumber[30:0]
0x0008
0x6766 <-- Extended level 1 ID
0x0000
0x0266 <-- Res[31:12] | BCID[11:0]
0x0000
0x0000 <-- Res[31:8] | L1TriggerType[7:0]
0x0000
0x0000 <-- Res[31:24] | DetectorEventType[23:16] | Res[15:4] | TIM[3:0]
0x0bda
0x8b30 <-- Res[3:0] | L | 0xbda | sector
0x0016
0x0ffc <-- 
0x0000
0x0027 <-- RoadID[23:0]
0x1ab1
0x7d26 <-- Track chi2[31:16] | Track d0[15:0]
0x5fef
0x8ee0 <-- Track z0[31:16] | Track coth[15:0]
0x35c7
0x3ecf <-- Track phi0[31:16] | Track curv[15:0]
0x0000
0x0158 <-- Res[31:12] | Module L0
0x0000
0x0000 <-- IBL
0x0000
0x027c <-- Res[31:12] | Module L1
0x0000
0x0000 <-- PL0b
0x0000
0x0437 <-- Res[31:12] | Module L2
0x14b4
0x2115 <-- PL1b
0x0000
0x069b <-- Res[31:12] | Module L3
0x1090
0x1508 <-- PL2b
0x0548
0x09d7 <-- SAx0
0x0534
0x09d6 <-- SSt0
0x0412
0x0d68 <-- SAx1
0x03ee
0x0d69 <-- SSt1
0x0332
0x11b9 <-- SAx2
0x030e
0x11b8 <-- SSt2
0x0280
0x16ca <-- SAx3
0x0270
0x16cb <-- SSt3
0x0bda
0x066f <-- Res[3:0] | L | 0xbda | sector
0x0016
0x0ffe <-- 
0x0000
0x0001 <-- RoadID[23:0]
0x2186
0x7fca <-- Track chi2[31:16] | Track d0[15:0]
0x73b9
0x8aef <-- Track z0[31:16] | Track coth[15:0]
0x41fe
0xaf85 <-- Track phi0[31:16] | Track curv[15:0]
0x0000
0x016d <-- Res[31:12] | Module L0
0x0000
0x0000 <-- IBL
0x0000
0x028a <-- Res[31:12] | Module L1
0x1590
0x2904 <-- PL0b
0x0000
0x0445 <-- Res[31:12] | Module L2
0x1020
0x283b <-- PL1b
0x0000
0x06b5 <-- Res[31:12] | Module L3
0x23bb
0x26eb <-- PL2b
0x050a
0x09ef <-- SAx0
0x050c
0x09ee <-- SSt0
0x03f9
0x0d7e <-- SAx1
0x042a
0x0d7f <-- SSt1
0x02ea
0x11d1 <-- SAx2
0x0300
0x11d0 <-- SSt2
0x0179
0x16e0 <-- SAx3
0x0199
0x16e1 <-- SSt3
0xe0da
0x0000 <-- E0DA (begin debug block) | Length of debug block | Indeterminate[3:0]
0xe0df
0x0000 <-- E0DF (end debug block)   | Length of debug block | Indeterminate[3:0]
0x0000
0x0000 <-- L1ID
0x0000
0x0001 <-- ErrorFlag
0x0000
0x0000 <-- Res
0x0000
0x0000 <-- Res
