0xee12
0x34ee <-- Start of Header Marker
0x0000
0x0009 <-- Header size - fixed
0x0301
0x0000 <-- Format version number - formed within FLIC from firmware
0x0000
0x007f <-- Source identifier - fixed
0x0003
0x652e <-- 0 | RunNumber[30:0]
0x0008
0x676e <-- Extended level 1 ID
0x0000
0x079d <-- Res[31:12] | BCID[11:0]
0x0000
0x0000 <-- Res[31:8] | L1TriggerType[7:0]
0x0000
0x0000 <-- Res[31:24] | DetectorEventType[23:16] | Res[15:4] | TIM[3:0]
0x0bda
0x2bee <-- Res[3:0] | L | 0xbda | sector
0x0016
0x0ffb <-- 
0x0000
0x0092 <-- RoadID[23:0]
0x22c6
0x8104 <-- Track chi2[31:16] | Track d0[15:0]
0x893d
0x8be1 <-- Track z0[31:16] | Track coth[15:0]
0x296d
0xa9d8 <-- Track phi0[31:16] | Track curv[15:0]
0x0000
0x0147 <-- Res[31:12] | Module L0
0x219b
0x684d <-- IBL
0x0000
0x0271 <-- Res[31:12] | Module L1
0x24f5
0x275b <-- PL0b
0x0000
0x041f <-- Res[31:12] | Module L2
0x0000
0x0000 <-- PL1b
0x0000
0x0675 <-- Res[31:12] | Module L3
0x13c0
0x1580 <-- PL2b
0x043b
0x09a9 <-- SAx0
0x0470
0x09a8 <-- SSt0
0x0474
0x0d20 <-- SAx1
0x0474
0x0d21 <-- SSt1
0x049d
0x1159 <-- SAx2
0x0465
0x1158 <-- SSt2
0x0476
0x1652 <-- SAx3
0x0469
0x1653 <-- SSt3
0x0bda
0x3a87 <-- Res[3:0] | L | 0xbda | sector
0x0016
0x0ffb <-- 
0x0000
0x0080 <-- RoadID[23:0]
0x2305
0x802a <-- Track chi2[31:16] | Track d0[15:0]
0x6e2d
0x8289 <-- Track z0[31:16] | Track coth[15:0]
0x23f7
0x2e78 <-- Track phi0[31:16] | Track curv[15:0]
0x0000
0x0145 <-- Res[31:12] | Module L0
0x2075
0x2566 <-- IBL
0x0000
0x026f <-- Res[31:12] | Module L1
0x1890
0x1368 <-- PL0b
0x0000
0x0410 <-- Res[31:12] | Module L2
0x0000
0x0000 <-- PL1b
0x0000
0x0666 <-- Res[31:12] | Module L3
0x10c0
0x284e <-- PL2b
0x042e
0x09a5 <-- SAx0
0x0466
0x09a4 <-- SSt0
0x059c
0x0d1c <-- SAx1
0x056c
0x0d1d <-- SSt1
0x01dc
0x116d <-- SAx2
0x01fc
0x116c <-- SSt2
0x03f8
0x1664 <-- SAx3
0x03df
0x1665 <-- SSt3
0x0bda
0x3c0a <-- Res[3:0] | L | 0xbda | sector
0x0016
0x0fff <-- 
0x0000
0x0028 <-- RoadID[23:0]
0x2b72
0x8004 <-- Track chi2[31:16] | Track d0[15:0]
0x893b
0x8bf3 <-- Track z0[31:16] | Track coth[15:0]
0x21c5
0x55db <-- Track phi0[31:16] | Track curv[15:0]
0x0000
0x0147 <-- Res[31:12] | Module L0
0x2165
0x1411 <-- IBL
0x0000
0x0271 <-- Res[31:12] | Module L1
0x14a0
0x1140 <-- PL0b
0x0000
0x0411 <-- Res[31:12] | Module L2
0x2907
0x1040 <-- PL1b
0x0000
0x0668 <-- Res[31:12] | Module L3
0x139c
0x1238 <-- PL2b
0x012b
0x09a9 <-- SAx0
0x0158
0x09a8 <-- SSt0
0x0187
0x0d20 <-- SAx1
0x018e
0x0d21 <-- SSt1
0x0224
0x1159 <-- SAx2
0x01e7
0x1158 <-- SSt2
0x02ca
0x1652 <-- SAx3
0x02c2
0x1653 <-- SSt3
0x0bda
0x2323 <-- Res[3:0] | L | 0xbda | sector
0x0016
0x0fff <-- 
0x0000
0x0023 <-- RoadID[23:0]
0x14e2
0x7ff7 <-- Track chi2[31:16] | Track d0[15:0]
0x7dbb
0x83d6 <-- Track z0[31:16] | Track coth[15:0]
0x31b8
0xc8c2 <-- Track phi0[31:16] | Track curv[15:0]
0x0000
0x015a <-- Res[31:12] | Module L0
0x109b
0x22ed <-- IBL
0x0000
0x027d <-- Res[31:12] | Module L1
0x15c0
0x1460 <-- PL0b
0x0000
0x042a <-- Res[31:12] | Module L2
0x172c
0x1268 <-- PL1b
0x0000
0x068d <-- Res[31:12] | Module L3
0x1870
0x215d <-- PL2b
0x0376
0x09bd <-- SAx0
0x0368
0x09bc <-- SSt0
0x04a2
0x0d34 <-- SAx1
0x04c0
0x0d35 <-- SSt1
0x059a
0x116d <-- SAx2
0x056a
0x116c <-- SSt2
0x0044
0x167c <-- SAx3
0x008b
0x167d <-- SSt3
0x0bda
0x75d3 <-- Res[3:0] | L | 0xbda | sector
0x0016
0x07ff <-- 
0x0000
0x0001 <-- RoadID[23:0]
0x3255
0x8090 <-- Track chi2[31:16] | Track d0[15:0]
0x92c5
0x7ea4 <-- Track z0[31:16] | Track coth[15:0]
0x44d5
0xa377 <-- Track phi0[31:16] | Track curv[15:0]
0x0000
0x016f <-- Res[31:12] | Module L0
0x10d7
0x13f9 <-- IBL
0x0000
0x0298 <-- Res[31:12] | Module L1
0x11f0
0x1248 <-- PL0b
0x0000
0x0452 <-- Res[31:12] | Module L2
0x1170
0x232d <-- PL1b
0x0000
0x06c2 <-- Res[31:12] | Module L3
0x1100
0x23c5 <-- PL2b
0x01d7
0x0a05 <-- SAx0
0x01f6
0x0a04 <-- SSt0
0x018a
0x0d94 <-- SAx1
0x0166
0x0d95 <-- SSt1
0x0138
0x11e5 <-- SAx2
0x0162
0x11e4 <-- SSt2
0x00a9
0x16f4 <-- SAx3
0x0000
0x16dd <-- SSt3
0xe0da
0x0000 <-- E0DA (begin debug block) | Length of debug block | Indeterminate[3:0]
0xe0df
0x0000 <-- E0DF (end debug block)   | Length of debug block | Indeterminate[3:0]
0x0000
0x0000 <-- L1ID
0x0000
0x0001 <-- ErrorFlag
0x0000
0x0000 <-- Res
0x0000
0x0000 <-- Res
