0xb0f0 <-- stripped by FLIC in CoreCrate machine
0xcaf0 <-- stripped by FLIC in CoreCrate machine, Bits[3:0] are indeterminate
0xff12 <-- stripped by FLIC in CoreCrate machine
0x34ff <-- stripped by FLIC in CoreCrate machine
0x0003 <-- 0 | RunNumber[30:16], RunNumber=0x3652e
0x652e <-- RunNumber[15:0], RunNumber=0x3652e
0x0008 <-- ExtendedLevel1ID[31:16], word=0x86790
0x6790 <-- ExtendedLevel1ID[15:0], word=0x86790
0x0000 <-- Res
0x0861 <-- Res[3:0] | BCID[11:0], word=0x861
0x0000 <-- Res
0x0000 <-- Res[7:0] | L1TriggerType[7:0], word=0x0
0x0000 <-- Res[7:0] | DetectorEventType[7:0]
0x0000 <-- Res[11:0] | TIM[3:0]
0x0bda <-- Res[3:0] | L | 0xb | 0xd | 0xa, word=0xbda17a6
0x17a6 <-- Sector Number
0x0016 <-- Res[3:0] | TFNum[3:0] | Res | Tower[6:0], word=0x160f3e
0x0f3e <-- Res[3:0] | Layermap[11:0]
0x0000 <-- Res[7:0] | RoadID[23:16], word=0x43
0x0043 <-- RoadID[15:0]
0x0774 <-- Track chi2
0x7fa7 <-- Track d0
0x7c59 <-- Track z0
0x95ba <-- Track coth
0x29b2 <-- Track phi
0xaccd <-- Track curv
0x0000 <-- (IBLa) 0 | ColWidth[2:0] | ColCoord[11:0]
0x0000 <-- (IBLb) s | RowWidth[2:0] | RowCoord[11:0]
0x24e8 <-- (PL0a) 0 | ColWidth[2:0] | ColCoord[11:0]
0x275b <-- (PL0b) s | RowWidth[2:0] | RowCoord[11:0]
0x22d3 <-- (PL1a) 0 | ColWidth[2:0] | ColCoord[11:0]
0x10d0 <-- (PL1b) s | RowWidth[2:0] | RowCoord[11:0]
0x1124 <-- (PL2a) 0 | ColWidth[2:0] | ColCoord[11:0]
0x2584 <-- (PL2b) s | RowWidth[2:0] | RowCoord[11:0]
0x041d <-- (SAx0) 0 | Width[2:0] | Res | Coord[10:0]
0x042e <-- (SSt0) 0 | Width[2:0] | Res | Coord[10:0]
0x0000 <-- (SAx1) 0 | Width[2:0] | Res | Coord[10:0]
0x0000 <-- (SSt1) 0 | Width[2:0] | Res | Coord[10:0]
0x0480 <-- (SAx2) 0 | Width[2:0] | Res | Coord[10:0]
0x0446 <-- (SSt2) 0 | Width[2:0] | Res | Coord[10:0]
0x044a <-- (SAx3) 0 | Width[2:0] | Res | Coord[10:0]
0x046a <-- (SSt3) 0 | Width[2:0] | Res | Coord[10:0]
0x0bda <-- Res[3:0] | L | 0xb | 0xd | 0xa, word=0xbda09eb
0x09eb <-- Sector Number
0x0016 <-- Res[3:0] | TFNum[3:0] | Res | Tower[6:0], word=0x160fbf
0x0fbf <-- Res[3:0] | Layermap[11:0]
0x0000 <-- Res[7:0] | RoadID[23:16], word=0x24
0x0024 <-- RoadID[15:0]
0x2f78 <-- Track chi2
0x7fed <-- Track d0
0x886a <-- Track z0
0x80a1 <-- Track coth
0x4312 <-- Track phi
0xae53 <-- Track curv
0x13d5 <-- (IBLa) 0 | ColWidth[2:0] | ColCoord[11:0]
0x22e5 <-- (IBLb) s | RowWidth[2:0] | RowCoord[11:0]
0x1870 <-- (PL0a) 0 | ColWidth[2:0] | ColCoord[11:0]
0x1088 <-- (PL0b) s | RowWidth[2:0] | RowCoord[11:0]
0x18b0 <-- (PL1a) 0 | ColWidth[2:0] | ColCoord[11:0]
0x3996 <-- (PL1b) s | RowWidth[2:0] | RowCoord[11:0]
0x18e0 <-- (PL2a) 0 | ColWidth[2:0] | ColCoord[11:0]
0x18e8 <-- (PL2b) s | RowWidth[2:0] | RowCoord[11:0]
0x05d4 <-- (SAx0) 0 | Width[2:0] | Res | Coord[10:0]
0x05ea <-- (SSt0) 0 | Width[2:0] | Res | Coord[10:0]
0x0000 <-- (SAx1) 0 | Width[2:0] | Res | Coord[10:0]
0x04e2 <-- (SSt1) 0 | Width[2:0] | Res | Coord[10:0]
0x0404 <-- (SAx2) 0 | Width[2:0] | Res | Coord[10:0]
0x0413 <-- (SSt2) 0 | Width[2:0] | Res | Coord[10:0]
0x02cc <-- (SAx3) 0 | Width[2:0] | Res | Coord[10:0]
0x02c1 <-- (SSt3) 0 | Width[2:0] | Res | Coord[10:0]
0x0bda <-- Res[3:0] | L | 0xb | 0xd | 0xa, word=0xbda04de
0x04de <-- Sector Number
0x0016 <-- Res[3:0] | TFNum[3:0] | Res | Tower[6:0], word=0x160ffe
0x0ffe <-- Res[3:0] | Layermap[11:0]
0x0000 <-- Res[7:0] | RoadID[23:16], word=0xd
0x000d <-- RoadID[15:0]
0x11d8 <-- Track chi2
0x807e <-- Track d0
0x8865 <-- Track z0
0x85d3 <-- Track coth
0x326b <-- Track phi
0xaf32 <-- Track curv
0x0000 <-- (IBLa) 0 | ColWidth[2:0] | ColCoord[11:0]
0x0000 <-- (IBLb) s | RowWidth[2:0] | RowCoord[11:0]
0x1170 <-- (PL0a) 0 | ColWidth[2:0] | ColCoord[11:0]
0x2574 <-- (PL0b) s | RowWidth[2:0] | RowCoord[11:0]
0x139c <-- (PL1a) 0 | ColWidth[2:0] | ColCoord[11:0]
0x1438 <-- (PL1b) s | RowWidth[2:0] | RowCoord[11:0]
0x1590 <-- (PL2a) 0 | ColWidth[2:0] | ColCoord[11:0]
0x1408 <-- (PL2b) s | RowWidth[2:0] | RowCoord[11:0]
0x04dc <-- (SAx0) 0 | Width[2:0] | Res | Coord[10:0]
0x050a <-- (SSt0) 0 | Width[2:0] | Res | Coord[10:0]
0x00c0 <-- (SAx1) 0 | Width[2:0] | Res | Coord[10:0]
0x00b2 <-- (SSt1) 0 | Width[2:0] | Res | Coord[10:0]
0x028a <-- (SAx2) 0 | Width[2:0] | Res | Coord[10:0]
0x0280 <-- (SSt2) 0 | Width[2:0] | Res | Coord[10:0]
0x03fe <-- (SAx3) 0 | Width[2:0] | Res | Coord[10:0]
0x0422 <-- (SSt3) 0 | Width[2:0] | Res | Coord[10:0]
0xe0da <-- Begin trailer debug block
0x0000 <-- Length of debug block | Indeterminate[3:0]
0xe0df <-- End debug block
0x0000 <-- Length of debug block | Indeterminate[3:0]
0x0000 <-- L1ID[31:16]
0x0000 <-- L1ID[15:0]
0x0000 <-- ErrorFlag[31:16]
0x0001 <-- ErrorFlag[15:0]
0x0000 <-- Res
0x0000 <-- Res
0x0000 <-- Res
0x0000 <-- Res
0xe0f0 <-- stripped by FLI in CoreCrateRcvr machine
0xa5a5 <-- stripped by FLI in CoreCrateRcvr machine
0x5a5a <-- stripped by FLI in CoreCrateRcvr machine
0x0e0f <-- stripped by FLI in CoreCrateRcvr machine
