{
    "list":[
       {
          "author":"analysis_rk_script",
          "comment":"Outer Barrel Longeron",
          "id":"9d5ed22de3904e118ef08a3fb28c7f64",
          "metadata":{
             "id":"LLS_OB_0001",
             "nMods":36
          },
          "name":"LLS_OB_0001",
          "time":"2024-07-31T14:51:51",
          "type":"Longeron"
       },
       {
          "author":"analysis_rk_script",
          "comment":"Outer Barrel Longeron",
          "id":"18af32172655455d9108a7df4469efc0",
          "metadata":{
             "id":"LLS_OB_0002",
             "nMods":36
          },
          "name":"LLS_OB_0002",
          "time":"2024-07-31T14:51:53",
          "type":"Longeron"
       },
       {
          "author":"analysis_rk_script",
          "comment":"Outer Barrel Half Ring",
          "id":"853ad80c15bd4a6681ddf37e7424a6d5",
          "metadata":{
             "id":"LLS_OB_0003",
             "nMods":28
          },
          "name":"LLS_OB_0003",
          "time":"2024-07-31T14:51:50",
          "type":"Half-Ring-OB"
       },
	   {
          "author":"analysis_rk_script",
          "comment":"Outer Barrel Longeron",
          "id":"497f01096ab04bbe868030b3e3d6a83a",
          "metadata":{
             "id":"LLS_OB_0004",
             "nMods":36
          },
          "name":"LLS_OB_0004",
          "time":"2024-07-31T14:51:51",
          "type":"Longeron"
       },
       {
          "author":"analysis_rk_script",
          "comment":"Outer Barrel Longeron",
          "id":"3a86f22843c24a70a0d5260bd9259177",
          "metadata":{
             "id":"LLS_OB_0005",
             "nMods":36
          },
          "name":"LLS_OB_0005",
          "time":"2024-07-31T14:51:53",
          "type":"Longeron"
       },
       {
          "author":"analysis_rk_script",
          "comment":"Outer Barrel Half Ring",
          "id":"fddc3cc54ad74dda87d6223f21c72346",
          "metadata":{
             "id":"LLS_OB_0006",
             "nMods":28
          },
          "name":"LLS_OB_0006",
          "time":"2024-07-31T14:51:50",
          "type":"Half-Ring-OB"
       },
       {
          "author":"analysis_rk_script",
          "comment":"End Cap Half Ring",
          "id":"02b1165897c0487a8907c5479a171e31",
          "metadata":{
             "id":"LLS_EC_0001",
             "nMods":26
          },
          "name":"LLS_EC_0001",
          "time":"2024-07-31T14:51:49",
          "type":"Half-Ring-EC"
       },
	   {
          "author":"analysis_rk_script",
          "comment":"End Cap Half Ring",
          "id":"b62bbd4c19c344ec849e61c7773fabb6",
          "metadata":{
             "id":"LLS_EC_0002",
             "nMods":26
          },
          "name":"LLS_EC_0002",
          "time":"2024-07-31T14:51:49",
          "type":"Half-Ring-EC"
       }
    ]
 }