fixed noexcept

15 jobs for python-executable in 10 minutes and 29 seconds (queued for 52 seconds)
Status Name Job ID Coverage
  Compilation
failed cmp:cc7-docker #16961045
docker

00:02:51

failed cmp:cc7-gcc #16961043
docker

00:02:37

failed cmp:cc7-llvm #16961046
docker

00:02:12

failed cmp:cc8-gcc #16961042
docker

00:03:05

failed cmp:lxplus-gcc #16961044
docker

00:02:14

passed cmp:mac1015-clang #16961047
mac

00:03:08

 
  Testing
skipped tst:align #16961050
docker
skipped tst:io #16961051
docker
skipped tst:sim #16961052
docker
skipped tst:tracking #16961048
docker
 
  Formatting
passed fmt:cc7-llvm-lint #16961054
docker

00:10:29

passed fmt:centos7-llvm-format #16961053
docker

00:01:42

passed fmt:codespell #16961055
docker

00:01:41

 
  Documentation
passed cmp:doxygen #16961056
docker

00:01:21

passed cmp:usermanual #16961057
docker

00:01:39

 
Name Stage Failure
failed
cmp:cc8-gcc Compilation
[154/162] Linking CXX shared library src/modules/TrackingSpatial/libCorryvreckanModuleTrackingSpatial.so
[155/162] Building CXX object src/modules/OnlineMonitor/CMakeFiles/CorryvreckanModuleOnlineMonitor.dir/OnlineMonitor.cpp.o
[156/162] Linking CXX shared library src/modules/OnlineMonitor/libCorryvreckanModuleOnlineMonitor.so
[157/162] Building CXX object src/modules/TrackingMultiplet/CMakeFiles/CorryvreckanModuleTrackingMultiplet.dir/TrackingMultiplet.cpp.o
[158/162] Linking CXX shared library src/modules/TrackingMultiplet/libCorryvreckanModuleTrackingMultiplet.so
[159/162] Building CXX object src/modules/Tracking4D/CMakeFiles/CorryvreckanModuleTracking4D.dir/Tracking4D.cpp.o
[160/162] Linking CXX shared library src/modules/Tracking4D/libCorryvreckanModuleTracking4D.so
ninja: build stopped: cannot make progress due to previous errors.
Cleaning up file based variables
ERROR: Job failed: exit code 1
failed
cmp:cc7-docker Compilation
                            ~~~~~^~~
/builds/atlas-itk-strip-testbeam/corryvreckan/src/modules/AnalysisEfficiency/AnalysisEfficiency.cpp:377:85: error: conversion from 'double' to 'int' may change value [-Werror=float-conversion]
(pitch_x - abs(xmod * 2) > m_inpixelEdgeCut.x()) && (pitch_y - abs(ymod * 2) > m_inpixelEdgeCut.y());
~~~~~^~~
cc1plus: all warnings being treated as errors
make[2]: *** [src/modules/AnalysisEfficiency/CMakeFiles/CorryvreckanModuleAnalysisEfficiency.dir/build.make:97: src/modules/AnalysisEfficiency/CMakeFiles/CorryvreckanModuleAnalysisEfficiency.dir/AnalysisEfficiency.cpp.o] Error 1
make[1]: *** [CMakeFiles/Makefile2:1440: src/modules/AnalysisEfficiency/CMakeFiles/CorryvreckanModuleAnalysisEfficiency.dir/all] Error 2
make: *** [Makefile:183: all] Error 2
Cleaning up file based variables
ERROR: Job failed: exit code 1
failed
cmp:cc7-gcc Compilation
[154/162] Linking CXX shared library src/modules/TrackingSpatial/libCorryvreckanModuleTrackingSpatial.so
[155/162] Building CXX object src/modules/OnlineMonitor/CMakeFiles/CorryvreckanModuleOnlineMonitor.dir/OnlineMonitor.cpp.o
[156/162] Linking CXX shared library src/modules/OnlineMonitor/libCorryvreckanModuleOnlineMonitor.so
[157/162] Building CXX object src/modules/TrackingMultiplet/CMakeFiles/CorryvreckanModuleTrackingMultiplet.dir/TrackingMultiplet.cpp.o
[158/162] Building CXX object src/modules/Tracking4D/CMakeFiles/CorryvreckanModuleTracking4D.dir/Tracking4D.cpp.o
[159/162] Linking CXX shared library src/modules/TrackingMultiplet/libCorryvreckanModuleTrackingMultiplet.so
[160/162] Linking CXX shared library src/modules/Tracking4D/libCorryvreckanModuleTracking4D.so
ninja: build stopped: cannot make progress due to previous errors.
Cleaning up file based variables
ERROR: Job failed: exit code 1
failed
cmp:lxplus-gcc Compilation
[154/162] Linking CXX shared library src/modules/TrackingSpatial/libCorryvreckanModuleTrackingSpatial.so
[155/162] Building CXX object src/modules/OnlineMonitor/CMakeFiles/CorryvreckanModuleOnlineMonitor.dir/OnlineMonitor.cpp.o
[156/162] Linking CXX shared library src/modules/OnlineMonitor/libCorryvreckanModuleOnlineMonitor.so
[157/162] Building CXX object src/modules/TrackingMultiplet/CMakeFiles/CorryvreckanModuleTrackingMultiplet.dir/TrackingMultiplet.cpp.o
[158/162] Linking CXX shared library src/modules/TrackingMultiplet/libCorryvreckanModuleTrackingMultiplet.so
[159/162] Building CXX object src/modules/Tracking4D/CMakeFiles/CorryvreckanModuleTracking4D.dir/Tracking4D.cpp.o
[160/162] Linking CXX shared library src/modules/Tracking4D/libCorryvreckanModuleTracking4D.so
ninja: build stopped: cannot make progress due to previous errors.
Cleaning up file based variables
ERROR: Job failed: exit code 1
failed
cmp:cc7-llvm Compilation
[154/162] Linking CXX shared library src/modules/TrackingSpatial/libCorryvreckanModuleTrackingSpatial.so
[155/162] Building CXX object src/modules/Tracking4D/CMakeFiles/CorryvreckanModuleTracking4D.dir/Tracking4D.cpp.o
[156/162] Linking CXX shared library src/modules/Tracking4D/libCorryvreckanModuleTracking4D.so
[157/162] Building CXX object src/modules/OnlineMonitor/CMakeFiles/CorryvreckanModuleOnlineMonitor.dir/OnlineMonitor.cpp.o
[158/162] Linking CXX shared library src/modules/OnlineMonitor/libCorryvreckanModuleOnlineMonitor.so
[159/162] Building CXX object src/modules/TrackingMultiplet/CMakeFiles/CorryvreckanModuleTrackingMultiplet.dir/TrackingMultiplet.cpp.o
[160/162] Linking CXX shared library src/modules/TrackingMultiplet/libCorryvreckanModuleTrackingMultiplet.so
ninja: build stopped: cannot make progress due to previous errors.
Cleaning up file based variables
ERROR: Job failed: exit code 1