cleanup of python script

15 jobs for python-executable-added in 9 minutes and 25 seconds (queued for 1 second)
Status Name Job ID Coverage
  Compilation
failed cmp:cc7-docker #17371127
docker

00:02:16

failed cmp:cc7-gcc #17371125
docker

00:02:23

failed cmp:cc7-llvm #17371128
docker

00:03:07

failed cmp:cc8-gcc #17371124
docker

00:02:03

failed cmp:lxplus-gcc #17371126
docker

00:02:56

passed cmp:mac1015-clang #17371129
mac

00:03:01

 
  Testing
skipped tst:align #17371131
docker
skipped tst:io #17371132
docker
skipped tst:sim #17371133
docker
skipped tst:tracking #17371130
docker
 
  Formatting
passed fmt:cc7-llvm-lint #17371135
docker

00:09:22

passed fmt:centos7-llvm-format #17371134
docker

00:01:04

passed fmt:codespell #17371136
docker

00:00:33

 
  Documentation
passed cmp:doxygen #17371137
docker

00:01:20

passed cmp:usermanual #17371138
docker

00:00:44

 
Name Stage Failure
failed
cmp:cc7-llvm Compilation
[155/162] Building CXX object src/modules/Tracking4D/CMakeFiles/CorryvreckanModuleTracking4D.dir/Tracking4D.cpp.o
[156/162] Building CXX object src/modules/TrackingMultiplet/CMakeFiles/CorryvreckanModuleTrackingMultiplet.dir/TrackingMultiplet.cpp.o
[157/162] Linking CXX shared library src/modules/Tracking4D/libCorryvreckanModuleTracking4D.so
[158/162] Linking CXX shared library src/modules/TrackingMultiplet/libCorryvreckanModuleTrackingMultiplet.so
[159/162] Building CXX object src/modules/OnlineMonitor/CMakeFiles/CorryvreckanModuleOnlineMonitor.dir/OnlineMonitor.cpp.o
[160/162] Linking CXX shared library src/modules/OnlineMonitor/libCorryvreckanModuleOnlineMonitor.so
ninja: build stopped: cannot make progress due to previous errors.
Cleaning up project directory and file based variables
ERROR: Job failed: exit code 1

failed
cmp:lxplus-gcc Compilation
[155/162] Building CXX object src/modules/OnlineMonitor/CMakeFiles/CorryvreckanModuleOnlineMonitor.dir/OnlineMonitor.cpp.o
[156/162] Building CXX object src/modules/TrackingMultiplet/CMakeFiles/CorryvreckanModuleTrackingMultiplet.dir/TrackingMultiplet.cpp.o
[157/162] Linking CXX shared library src/modules/OnlineMonitor/libCorryvreckanModuleOnlineMonitor.so
[158/162] Linking CXX shared library src/modules/TrackingMultiplet/libCorryvreckanModuleTrackingMultiplet.so
[159/162] Building CXX object src/modules/Tracking4D/CMakeFiles/CorryvreckanModuleTracking4D.dir/Tracking4D.cpp.o
[160/162] Linking CXX shared library src/modules/Tracking4D/libCorryvreckanModuleTracking4D.so
ninja: build stopped: cannot make progress due to previous errors.
Cleaning up project directory and file based variables
ERROR: Job failed: exit code 1

failed
cmp:cc7-gcc Compilation
[155/162] Building CXX object src/modules/TrackingMultiplet/CMakeFiles/CorryvreckanModuleTrackingMultiplet.dir/TrackingMultiplet.cpp.o
[156/162] Building CXX object src/modules/OnlineMonitor/CMakeFiles/CorryvreckanModuleOnlineMonitor.dir/OnlineMonitor.cpp.o
[157/162] Linking CXX shared library src/modules/TrackingMultiplet/libCorryvreckanModuleTrackingMultiplet.so
[158/162] Linking CXX shared library src/modules/OnlineMonitor/libCorryvreckanModuleOnlineMonitor.so
[159/162] Building CXX object src/modules/Tracking4D/CMakeFiles/CorryvreckanModuleTracking4D.dir/Tracking4D.cpp.o
[160/162] Linking CXX shared library src/modules/Tracking4D/libCorryvreckanModuleTracking4D.so
ninja: build stopped: cannot make progress due to previous errors.
Cleaning up project directory and file based variables
ERROR: Job failed: exit code 1

failed
cmp:cc7-docker Compilation
/builds/atlas-itk-strip-testbeam/corryvreckan/src/modules/AnalysisEfficiency/AnalysisEfficiency.cpp:377:85: error: conversion from 'double' to 'int' may change value [-Werror=float-conversion]
(pitch_x - abs(xmod * 2) > m_inpixelEdgeCut.x()) && (pitch_y - abs(ymod * 2) > m_inpixelEdgeCut.y());
~~~~~^~~
cc1plus: all warnings being treated as errors
make[2]: *** [src/modules/AnalysisEfficiency/CMakeFiles/CorryvreckanModuleAnalysisEfficiency.dir/build.make:97: src/modules/AnalysisEfficiency/CMakeFiles/CorryvreckanModuleAnalysisEfficiency.dir/AnalysisEfficiency.cpp.o] Error 1
make[1]: *** [CMakeFiles/Makefile2:1440: src/modules/AnalysisEfficiency/CMakeFiles/CorryvreckanModuleAnalysisEfficiency.dir/all] Error 2
make: *** [Makefile:183: all] Error 2
Cleaning up project directory and file based variables
ERROR: Job failed: exit code 1

failed
cmp:cc8-gcc Compilation
[155/162] Building CXX object src/modules/OnlineMonitor/CMakeFiles/CorryvreckanModuleOnlineMonitor.dir/OnlineMonitor.cpp.o
[156/162] Linking CXX shared library src/modules/OnlineMonitor/libCorryvreckanModuleOnlineMonitor.so
[157/162] Building CXX object src/modules/Tracking4D/CMakeFiles/CorryvreckanModuleTracking4D.dir/Tracking4D.cpp.o
[158/162] Linking CXX shared library src/modules/Tracking4D/libCorryvreckanModuleTracking4D.so
[159/162] Building CXX object src/modules/TrackingMultiplet/CMakeFiles/CorryvreckanModuleTrackingMultiplet.dir/TrackingMultiplet.cpp.o
[160/162] Linking CXX shared library src/modules/TrackingMultiplet/libCorryvreckanModuleTrackingMultiplet.so
ninja: build stopped: cannot make progress due to previous errors.
Cleaning up project directory and file based variables
ERROR: Job failed: exit code 1