{0.10: {450.0: {'exp': 0.3927436020606512,
                'obs': 0.2730114384735599,
                'theory': 0.09014752740040421},
        550.0: {'exp': 0.7257598030951818,
                'obs': 1.1248817538386224,
                'theory': 0.08172408805694431}},
 0.20: {350.0: {'exp': 0.4400472593305629,
                'obs': 0.44830628262075634,
                'theory': 0.44233512971550226},
        450.0: {'exp': 0.43454853402771965,
                'obs': 0.32190991295607513,
                'theory': 0.35215031262487173},
        550.0: {'exp': 0.7518019460589731,
                'obs': 1.2102384905426162,
                'theory': 0.33009787648916245}},
 0.30: {350.0: {'exp': 0.5043411393456235,
                'obs': 0.5070136749493483,
                'theory': 0.9802852291613817},
        450.0: {'exp': 0.49367424656717,
                'obs': 0.38954847399772424,
                'theory': 0.8026809263974428},
        550.0: {'exp': 0.8425731588923303,
                'obs': 1.3300308849855542,
                'theory': 0.7374715190380812}},
 0.40: {350.0: {'exp': 0.5172367935248213,
                'obs': 0.5447976798923164,
                'theory': 1.6870262660086155},
        450.0: {'exp': 0.5360462100891683,
                'obs': 0.42858415006241024,
                'theory': 1.4666528012603521},
        550.0: {'exp': 0.876751089272652,
                'obs': 1.2677458686058576,
                'theory': 1.2986689563840628}}}
