/global/cfs/projectdirs/atlas/kkrizka/rucio/20200105-02/user.kkrizka.mc16a.Higgs_VHbb.fatjet.20200105-02_tree.root/user.kkrizka.asciandr.346399.20373213._000030.tree.root
/global/cfs/projectdirs/atlas/kkrizka/rucio/20200105-02/user.kkrizka.mc16a.Higgs_VHbb.fatjet.20200105-02_tree.root/user.kkrizka.asciandr.346399.20373213._000007.tree.root
/global/cfs/projectdirs/atlas/kkrizka/rucio/20200105-02/user.kkrizka.mc16a.Higgs_VHbb.fatjet.20200105-02_tree.root/user.kkrizka.asciandr.346399.20373213._000038.tree.root
/global/cfs/projectdirs/atlas/kkrizka/rucio/20200105-02/user.kkrizka.mc16a.Higgs_VHbb.fatjet.20200105-02_tree.root/user.kkrizka.asciandr.346399.20373213._000033.tree.root
/global/cfs/projectdirs/atlas/kkrizka/rucio/20200105-02/user.kkrizka.mc16a.Higgs_VHbb.fatjet.20200105-02_tree.root/user.kkrizka.asciandr.346399.20373213._000036.tree.root
/global/cfs/projectdirs/atlas/kkrizka/rucio/20200105-02/user.kkrizka.mc16a.Higgs_VHbb.fatjet.20200105-02_tree.root/user.kkrizka.asciandr.346399.20373213._000004.tree.root
/global/cfs/projectdirs/atlas/kkrizka/rucio/20200105-02/user.kkrizka.mc16a.Higgs_VHbb.fatjet.20200105-02_tree.root/user.kkrizka.asciandr.346399.20373213._000019.tree.root
/global/cfs/projectdirs/atlas/kkrizka/rucio/20200105-02/user.kkrizka.mc16a.Higgs_VHbb.fatjet.20200105-02_tree.root/user.kkrizka.asciandr.346399.20373213._000005.tree.root
/global/cfs/projectdirs/atlas/kkrizka/rucio/20200105-02/user.kkrizka.mc16a.Higgs_VHbb.fatjet.20200105-02_tree.root/user.kkrizka.asciandr.346399.20373213._000035.tree.root
