Run, Good, Bad, LDelivered, LRecorded,LAr Corrected, Prescale Corrected, Live Fraction, LAr Fraction, Prescale Fraction
276262, 295, 0, 6.727643, 6.254209, 6.253800, 6.253800, 92.96, 99.99, 100.00
276329, 403, 0, 12.476186, 11.910045, 11.909006, 11.909006, 95.46, 99.99, 100.00
276336, 31, 0, 0.719092, 0.663090, 0.663047, 0.663047, 92.21, 99.99, 100.00
276416, 109, 0, 4.403370, 4.226970, 4.221030, 4.221030, 95.99, 99.86, 100.00
276511, 290, 0, 9.307698, 9.009898, 9.003851, 9.003851, 96.80, 99.93, 100.00
276689, 265, 0, 11.192468, 10.883611, 10.871979, 10.871979, 97.24, 99.89, 100.00
276731, 612, 0, 25.508360, 24.760190, 24.746460, 24.746460, 97.07, 99.94, 100.00
276778, 17, 0, 0.747056, 0.675490, 0.675452, 0.675452, 90.42, 99.99, 100.00
276790, 35, 0, 1.769720, 1.596180, 1.595770, 1.595770, 90.19, 99.97, 100.00
276952, 140, 0, 7.234170, 6.648620, 6.647790, 6.647790, 91.91, 99.99, 100.00
276954, 17, 0, 0.858822, 0.742651, 0.742574, 0.742574, 86.47, 99.99, 100.00
278880, 462, 0, 23.978070, 21.825280, 21.823200, 21.823200, 91.02, 99.99, 100.00
278912, 410, 0, 20.530894, 19.958466, 19.956595, 19.956595, 97.21, 99.99, 100.00
278968, 123, 0, 10.459120, 9.958732, 9.956749, 9.956749, 95.22, 99.98, 100.00
279169, 745, 0, 57.446470, 55.589497, 55.581667, 55.581667, 96.77, 99.99, 100.00
279259, 102, 0, 7.855450, 7.324610, 7.323130, 7.323130, 93.24, 99.98, 100.00
279279, 227, 0, 17.747492, 17.112354, 17.103949, 17.103949, 96.42, 99.95, 100.00
279284, 456, 0, 33.142400, 32.041100, 32.034200, 32.034200, 96.68, 99.98, 100.00
279345, 628, 0, 54.706417, 52.820788, 52.808190, 52.808190, 96.55, 99.98, 100.00
279515, 5, 0, 0.418627, 0.348682, 0.348306, 0.348306, 83.29, 99.89, 100.00
279598, 692, 0, 70.788039, 68.701310, 68.677998, 68.677998, 97.05, 99.97, 100.00
279685, 780, 0, 77.138006, 75.247588, 75.217857, 75.217857, 97.55, 99.96, 100.00
279764, 69, 0, 7.596340, 6.775780, 6.773480, 6.773480, 89.20, 99.97, 100.00
279813, 507, 0, 49.969070, 48.467208, 48.459837, 48.459837, 96.99, 99.98, 100.00
279867, 252, 0, 31.192970, 30.074590, 30.069770, 30.069770, 96.41, 99.98, 100.00
279928, 8, 0, 1.064630, 1.022760, 1.022760, 1.022760, 96.07, 100.00, 100.00
279932, 405, 0, 46.367460, 45.112090, 45.108210, 45.108210, 97.29, 99.99, 100.00
279984, 546, 0, 68.629038, 66.187441, 66.182771, 66.182771, 96.44, 99.99, 100.00
280231, 780, 0, 92.881979, 89.727974, 89.716174, 89.716174, 96.60, 99.99, 100.00
280319, 696, 0, 99.531160, 95.191860, 95.188810, 95.188810, 95.64, 100.00, 100.00
280368, 60, 0, 8.953804, 8.426174, 8.425114, 8.425114, 94.11, 99.99, 100.00
280423, 502, 0, 73.515880, 69.691030, 69.687860, 69.687860, 94.80, 100.00, 100.00
280464, 409, 0, 62.854496, 59.283191, 59.277091, 59.277091, 94.32, 99.99, 100.00
280500, 76, 0, 8.054260, 7.450460, 7.450180, 7.450180, 92.50, 100.00, 100.00
280520, 123, 0, 13.052166, 12.419550, 12.416022, 12.416022, 95.15, 99.97, 100.00
280614, 168, 0, 25.942210, 24.847010, 24.827410, 24.827410, 95.78, 99.92, 100.00
280673, 1052, 0, 157.461940, 151.174510, 151.139740, 151.139740, 96.01, 99.98, 100.00
280753, 307, 0, 48.646201, 45.650939, 45.639069, 45.639069, 93.84, 99.97, 100.00
280853, 59, 0, 8.149021, 7.158735, 7.156615, 7.156615, 87.85, 99.97, 100.00
280862, 940, 0, 139.017220, 132.769011, 132.735921, 132.735921, 95.51, 99.98, 100.00
280950, 905, 0, 130.836759, 126.602238, 126.585412, 126.585412, 96.76, 99.99, 100.00
280977, 202, 0, 36.831128, 35.206373, 35.185357, 35.185357, 95.59, 99.94, 100.00
281070, 68, 0, 13.340090, 12.454090, 12.449780, 12.449780, 93.36, 99.97, 100.00
281074, 269, 0, 48.386018, 46.346484, 46.301596, 46.301596, 95.78, 99.90, 100.00
281075, 5, 0, 1.056723, 0.855086, 0.854704, 0.854704, 80.92, 99.96, 100.00
281317, 127, 0, 25.342252, 24.199590, 24.194470, 24.194470, 95.49, 99.98, 100.00
281385, 389, 0, 66.977960, 64.074950, 64.071260, 64.071260, 95.67, 99.99, 100.00
281411, 735, 0, 145.990715, 136.978856, 136.958544, 136.958544, 93.83, 99.99, 100.00
282625, 136, 0, 11.000095, 10.555335, 10.554773, 10.554773, 95.96, 99.99, 100.00
282631, 163, 0, 28.425358, 26.531325, 26.523675, 26.523675, 93.34, 99.97, 100.00
282712, 466, 0, 98.095692, 93.463132, 93.409616, 93.409616, 95.28, 99.94, 100.00
282784, 33, 0, 3.040200, 2.966990, 2.966990, 2.966990, 97.59, 100.00, 100.00
282992, 569, 0, 112.943290, 108.650710, 108.621790, 108.621790, 96.20, 99.97, 100.00
283074, 284, 0, 60.003440, 57.183520, 57.154090, 57.154090, 95.30, 99.95, 100.00
283155, 144, 0, 30.888200, 29.449300, 29.438700, 29.438700, 95.34, 99.96, 100.00
283270, 65, 0, 14.858500, 13.523000, 13.515700, 13.515700, 91.01, 99.95, 100.00
283429, 1269, 0, 246.212200, 236.061360, 235.906970, 235.906970, 95.88, 99.93, 100.00
283608, 167, 0, 24.620473, 24.084742, 24.079692, 24.079692, 97.82, 99.98, 100.00
283780, 775, 0, 152.389822, 146.985224, 146.915894, 146.915894, 96.45, 99.95, 100.00
284006, 176, 0, 42.311870, 39.544780, 39.539430, 39.539430, 93.46, 99.99, 100.00
284154, 141, 0, 10.533900, 10.207600, 10.207300, 10.207300, 96.90, 100.00, 100.00
284213, 976, 0, 209.529937, 202.214790, 202.201361, 202.201361, 96.51, 99.99, 100.00
284285, 1185, 0, 266.715361, 249.382605, 249.354465, 249.354465, 93.50, 99.99, 100.00
284420, 237, 0, 61.811976, 57.511073, 57.504933, 57.504933, 93.04, 99.99, 100.00
284427, 137, 0, 36.847300, 35.372900, 35.369500, 35.369500, 96.00, 99.99, 100.00
284484, 478, 0, 110.880455, 104.507603, 104.501543, 104.501543, 94.25, 99.99, 100.00
