"coupling(Mass), created by Plot Digitizer, 2.6.6"
"Date: 07.08.14, 10:05:39"


13
Mass,coupling
320.126,1747.84,
339.124,1376.11,
380.238,1091.46,
399.376,1091.44,
425.893,1136.03,
458.344,1301.68,
501.028,1278.28,
580.400,942.619,
623.110,987.191,
754.285,1384.28,
804.359,1435.22,
848.533,1456.43,
904.524,1583.83,
