%!PS-Adobe-2.0 EPSF-2.0
%%BoundingBox:  0 0 567 395
%%Title: couplingLimit.eps: c1
%%Creator: ROOT Version 5.34/14
%%CreationDate: Wed Dec 10 13:08:56 2014
%%EndComments
%%BeginProlog
80 dict begin
/s {stroke} def /l {lineto} def /m {moveto} def /t {translate} def
/r {rotate} def /rl {roll}  def /R {repeat} def
/d {rlineto} def /rm {rmoveto} def /gr {grestore} def /f {eofill} def
/c {setrgbcolor} def /black {0 setgray} def /sd {setdash} def
/cl {closepath} def /sf {scalefont setfont} def /lw {setlinewidth} def
/box {m dup 0 exch d exch 0 d 0 exch neg d cl} def
/NC{systemdict begin initclip end}def/C{NC box clip newpath}def
/bl {box s} def /bf {box f} def /Y { 0 exch d} def /X { 0 d} def 
/K {{pop pop 0 moveto} exch kshow} bind def
/ita {/ang 15 def gsave [1 0 ang dup sin exch cos div 1 0 0] concat} def 
/mp {newpath /y exch def /x exch def} def
/side {[w .77 mul w .23 mul] .385 w mul sd w 0 l currentpoint t -144 r} def
/mr {mp x y w2 0 360 arc} def /m24 {mr s} def /m20 {mr f} def
/mb {mp x y w2 add m w2 neg 0 d 0 w neg d w 0 d 0 w d cl} def
/mt {mp x y w2 add m w2 neg w neg d w 0 d cl} def
/m21 {mb f} def /m25 {mb s} def /m22 {mt f} def /m26{mt s} def
/m23 {mp x y w2 sub m w2 w d w neg 0 d cl f} def
/m27 {mp x y w2 add m w3 neg w2 neg d w3 w2 neg d w3 w2 d cl s} def
/m28 {mp x w2 sub y w2 sub w3 add m w3 0 d  0 w3 neg d w3 0 d 0 w3 d w3 0 d  0 w3 d w3 neg 0 d 0 w3 d w3 neg 0 d 0 w3 neg d w3 neg 0 d cl s } def
/m29 {mp gsave x w2 sub y w2 add w3 sub m currentpoint t 4 {side} repeat cl fill gr} def
/m30 {mp gsave x w2 sub y w2 add w3 sub m currentpoint t 4 {side} repeat cl s gr} def
/m31 {mp x y w2 sub m 0 w d x w2 sub y m w 0 d x w2 sub y w2 add m w w neg d x w2 sub y w2 sub m w w d s} def
/m32 {mp x y w2 sub m w2 w d w neg 0 d cl s} def
/m33 {mp x y w2 add m w3 neg w2 neg d w3 w2 neg d w3 w2 d cl f} def
/m34 {mp x w2 sub y w2 sub w3 add m w3 0 d  0 w3 neg d w3 0 d 0 w3 d w3 0 d  0 w3 d w3 neg 0 d 0 w3 d w3 neg 0 d 0 w3 neg d w3 neg 0 d cl f } def
/m2 {mp x y w2 sub m 0 w d x w2 sub y m w 0 d s} def
/m5 {mp x w2 sub y w2 sub m w w d x w2 sub y w2 add m w w neg d s} def
/reEncode {exch findfont dup length dict begin {1 index /FID eq  {pop pop} {def} ifelse } forall /Encoding exch def currentdict end dup /FontName get exch definefont pop } def [/Times-Bold /Times-Italic /Times-BoldItalic /Helvetica /Helvetica-Oblique
 /Helvetica-Bold /Helvetica-BoldOblique /Courier /Courier-Oblique /Courier-Bold /Courier-BoldOblique /Times-Roman /AvantGarde-Book /AvantGarde-BookOblique /AvantGarde-Demi /AvantGarde-DemiOblique /Bookman-Demi /Bookman-DemiItalic /Bookman-Light
 /Bookman-LightItalic /Helvetica-Narrow /Helvetica-Narrow-Bold /Helvetica-Narrow-BoldOblique /Helvetica-Narrow-Oblique /NewCenturySchlbk-Roman /NewCenturySchlbk-Bold /NewCenturySchlbk-BoldItalic /NewCenturySchlbk-Italic /Palatino-Bold
 /Palatino-BoldItalic /Palatino-Italic /Palatino-Roman ] {ISOLatin1Encoding reEncode } forall
%%EndProlog
%%BeginSetup
%%EndSetup
newpath  gsave  .25 .25 scale  gsave  0 0 t black[  ] 0 sd 3 lw 1 1 1 c 2268 1579 0 0 bf black 1 1 1 c 1791 1247 363 253 bf black 1791 1247 363 253 bl 1 1 1 c 1791 1247 363 253 bf black 1791 1247 363 253 bl 363 253 m 1791 X s
 gsave  2268 1579 0 0 C 1972.07 66.602 t 0 r /Helvetica findfont 73.0997 sf 0 0 m ([GeV]) show NC gr 
 gsave  2268 1579 0 0 C 1950.95 29.2399 t 0 r /Helvetica findfont 32.4888 sf 0 0 m (B) show NC gr 
 gsave  2268 1579 0 0 C 1921.71 43.8598 t 0 r /Helvetica findfont 48.7332 sf 0 0 m (Z) show NC gr 
 gsave  2268 1579 0 0 C 1864.86 66.602 t 0 r /Helvetica findfont 73.0997 sf 0 0 m (M) show NC gr  670 290 m -37 Y s 732 271 m -18 Y s 795 271 m -18 Y s 858 271 m -18 Y s 921 271 m -18 Y s 983 290 m -37 Y s 1046 271 m -18 Y s 1109 271 m -18 Y s 1172
 271 m -18 Y s 1234 271 m -18 Y s 1297 290 m -37 Y s 1360 271 m -18 Y s 1423 271 m -18 Y s 1485 271 m -18 Y s 1548 271 m -18 Y s 1611 290 m -37 Y s 1674 271 m -18 Y s 1736 271 m -18 Y s 1799 271 m -18 Y s 1862 271 m -18 Y s 1925 290 m -37 Y s 670 290
 m -37 Y s 607 271 m -18 Y s 544 271 m -18 Y s 481 271 m -18 Y s 419 271 m -18 Y s 1925 290 m -37 Y s 1987 271 m -18 Y s 2050 271 m -18 Y s 2113 271 m -18 Y s
 gsave  2268 1579 0 0 C 609.165 181.937 t 0 r /Helvetica findfont 73.0997 sf 0 0 m (500) show NC gr 
 gsave  2268 1579 0 0 C 903.188 181.937 t 0 r /Helvetica findfont 73.0997 sf 0 0 m (1000) show NC gr 
 gsave  2268 1579 0 0 C 1216.7 181.937 t 0 r /Helvetica findfont 73.0997 sf 0 0 m (1500) show NC gr 
 gsave  2268 1579 0 0 C 1530.22 181.937 t 0 r /Helvetica findfont 73.0997 sf 0 0 m (2000) show NC gr 
 gsave  2268 1579 0 0 C 1843.74 181.937 t 0 r /Helvetica findfont 73.0997 sf 0 0 m (2500) show NC gr  363 1500 m 1791 X s 670 1463 m 37 Y s 732 1481 m 19 Y s 795 1481 m 19 Y s 858 1481 m 19 Y s 921 1481 m 19 Y s 983 1463 m 37 Y s 1046 1481 m 19 Y s
 1109 1481 m 19 Y s 1172 1481 m 19 Y s 1234 1481 m 19 Y s 1297 1463 m 37 Y s 1360 1481 m 19 Y s 1423 1481 m 19 Y s 1485 1481 m 19 Y s 1548 1481 m 19 Y s 1611 1463 m 37 Y s 1674 1481 m 19 Y s 1736 1481 m 19 Y s 1799 1481 m 19 Y s 1862 1481 m 19 Y s
 1925 1463 m 37 Y s 670 1463 m 37 Y s 607 1481 m 19 Y s 544 1481 m 19 Y s 481 1481 m 19 Y s 419 1481 m 19 Y s 1925 1463 m 37 Y s 1987 1481 m 19 Y s 2050 1481 m 19 Y s 2113 1481 m 19 Y s 363 253 m 1247 Y s
 gsave  2268 1579 0 0 C 149.448 1470.12 t 90 r /Helvetica findfont 48.7332 sf 0 0 m (B) show NC gr 
 gsave  2268 1579 0 0 C 110.462 1432.76 t 90 r /Helvetica findfont 73.0997 sf 0 0 m (g) show NC gr  417 345 m -54 X s 390 397 m -27 X s 390 450 m -27 X s 390 502 m -27 X s 390 555 m -27 X s 417 607 m -54 X s 390 660 m -27 X s 390 712 m -27 X s 390
 765 m -27 X s 390 817 m -27 X s 417 870 m -54 X s 390 922 m -27 X s 390 975 m -27 X s 390 1027 m -27 X s 390 1080 m -27 X s 417 1132 m -54 X s 390 1185 m -27 X s 390 1237 m -27 X s 390 1290 m -27 X s 390 1342 m -27 X s 417 1395 m -54 X s 417 345 m
 -54 X s 390 292 m -27 X s 417 1395 m -54 X s 390 1447 m -27 X s 390 1500 m -27 X s
 gsave  2268 1579 0 0 C 251.788 320.014 t 0 r /Helvetica findfont 73.0997 sf 0 0 m (0.5) show NC gr 
 gsave  2268 1579 0 0 C 324.888 579.925 t 0 r /Helvetica findfont 73.0997 sf 0 0 m (1) show NC gr 
 gsave  2268 1579 0 0 C 251.788 844.708 t 0 r /Helvetica findfont 73.0997 sf 0 0 m (1.5) show NC gr 
 gsave  2268 1579 0 0 C 313.517 1106.24 t 0 r /Helvetica findfont 73.0997 sf 0 0 m (2) show NC gr 
 gsave  2268 1579 0 0 C 251.788 1369.4 t 0 r /Helvetica findfont 73.0997 sf 0 0 m (2.5) show NC gr  2154 253 m 1247 Y s 2101 345 m 53 X s 2127 397 m 27 X s 2127 450 m 27 X s 2127 502 m 27 X s 2127 555 m 27 X s 2101 607 m 53 X s 2127 660 m 27 X s 2127
 712 m 27 X s 2127 765 m 27 X s 2127 817 m 27 X s 2101 870 m 53 X s 2127 922 m 27 X s 2127 975 m 27 X s 2127 1027 m 27 X s 2127 1080 m 27 X s 2101 1132 m 53 X s 2127 1185 m 27 X s 2127 1237 m 27 X s 2127 1290 m 27 X s 2127 1342 m 27 X s 2101 1395 m
 53 X s 2101 345 m 53 X s 2127 292 m 27 X s 2101 1395 m 53 X s 2127 1447 m 27 X s 2127 1500 m 27 X s
 0 0.8 0.8 c 6 lw black % makes stuff bold
 0 0.8 0.8 c 444 1309 m 6 -223 d 6 -51 d 7 36 d 6 -7 d 13 181 d 11 -252 d 8 17 d 5 -11 d 9 396 d s % UA2
 0 0 1 c[  12 12 ] 0 sd black % makes stuff dashed
 0 0 1 c 1360 853 m 124 -54 d 67 157 d 2 61 d 17 106 d 16 142 d 13 116 d s % CMS 5fb
 0 0.8 0 c black
 0 0.8 0 c 526 1393 m 18 -563 d 33 -26 d 18 -37 d 11 -39 d 30 180 d s % CDS 1
 0 0 1 c[  ] 0 sd black
 0 0 1 c 1106 523 m 15 -5 d 51 -15 d 64 -48 d 61 -14 d 74 204 d 51 179 d 128 181 d 63 -27 d 62 -138 d 63 40 d 124 363 d 64 12 d 64 -40 d 64 107 d 19 72 d s % CMS 20fb
 0 0.8 0 c black
 0 0.8 0 c 557 1000 m 12 -195 d 26 -150 d 12 X 16 24 d 21 87 d 26 -13 d 50 -176 d 27 24 d 82 208 d 32 27 d 27 11 d 36 67 d s % CDF 1.1
 1 0 0 c[ 4 8] 0 sd black
 1 0 0 c 920 559 m 39 82 d 28 71 d 26 85 d 34 30 d 63 192 d s % ATLAS 1fb
 0 0 1 c[ 12 16 4 16] 0 sd black
 0 0 1 c 733 773 m 63 317 d 58 -37 d 69 -138 d 55 129 d s % CMS 0.13fb
 1 0 0 c[  12 12 ] 0 sd black
 1 0 0 c 1297 670 m 32 66 d 31 -2 d 31 77 d 32 24 d 31 28 d 31 47 d 32 -24 d 31 -34 d 32 -42 d 31 -37 d 63 107 d 62 127 d 63 147 d 63 159 d 63 120 d 21 67 d s % ATLAS 13fb
 0 0 1 c[ 4 8] 0 sd black
 0 0 1 c 983 546 m 41 15 d 59 27 d 51 12 d 46 7 d 35 4 d s % CMS 4fb
 1 0 0 c[  ] 0 sd black
 1 0 0 c 576 1044 m 31 -215 d 31 129 d 32 14 d 31 -216 d 31 -124 d 32 -46 d 31 -14 d 32 -118 d 31 -89 d 31 5 d 32 -31 d 31 -16 d 31 5 d 32 75 d 31 37 d 32 7 d 31 -35 d 31 -60 d 32 11 d 31 34 d 31 51 d 32 53 d 31 63 d 32 68 d 31 6 d 31 37 d 32 36 d 31 60 d 31 34 d 32 14 d 31 -28 d 32 -91 d 31 54 d 63 190 d 62 90 d 63 14 d 63 -61 d 63 200 d 62 234 d 63 73 d s % ATLAS 20.3fb
 1 1 1 c 3 lw 907 364 635 1089 bf 645 1089 m -6 Y 904 X 360 Y -7 X -354 Y f 635 1089 m 364 Y 907 X -364 Y -907 X cl s black
 gsave  2268 1579 0 0 C 747.242 1400.27 t 0 r /Helvetica-Bold findfont 40.611 sf 0 0 m (UA2) show NC gr  0 0.8 0.8 c 6 lw 652 1416 m 79 X s black
 gsave  2268 1579 0 0 C 1169.6 1400.27 t 0 r /Helvetica-Bold findfont 40.611 sf 0 0 m (CMS 5/fb) show NC gr  0 0 1 c[  12 12 ] 0 sd 1075 1416 m 79 X s black
 gsave  2268 1579 0 0 C 747.242 1328.79 t 0 r /Helvetica-Bold findfont 40.611 sf 0 0 m (CDF Run I) show NC gr  0 0.8 0 c 652 1344 m 79 X s black
 gsave  2268 1579 0 0 C 1169.6 1328.79 t 0 r /Helvetica-Bold findfont 40.611 sf 0 0 m (CMS 20/fb) show NC gr  0 0 1 c[  ] 0 sd 1075 1344 m 79 X s black
 gsave  2268 1579 0 0 C 747.242 1255.69 t 0 r /Helvetica-Bold findfont 40.611 sf 0 0 m (CDF 1.1/fb) show NC gr  0 0.8 0 c 652 1271 m 79 X s black
 gsave  2268 1579 0 0 C 1169.6 1255.69 t 0 r /Helvetica-Bold findfont 40.611 sf 0 0 m (ATLAS 1/fb) show NC gr  1 0 0 c[ 4 8] 0 sd 1075 1271 m 79 X s black
 gsave  2268 1579 0 0 C 747.242 1182.59 t 0 r /Helvetica-Bold findfont 40.611 sf 0 0 m (CMS 0.13/fb) show NC gr  0 0 1 c[ 12 16 4 16] 0 sd 652 1198 m 79 X s black
 gsave  2268 1579 0 0 C 1169.6 1182.59 t 0 r /Helvetica-Bold findfont 40.611 sf 0 0 m (ATLAS 13/fb) show NC gr  1 0 0 c[  12 12 ] 0 sd 1075 1198 m 79 X s black
 gsave  2268 1579 0 0 C 747.242 1109.49 t 0 r /Helvetica-Bold findfont 40.611 sf 0 0 m (CMS 4/fb) show NC gr  0 0 1 c[ 4 8] 0 sd 652 1126 m 79 X s black
 gsave  2268 1579 0 0 C 1169.6 1109.49 t 0 r /Helvetica-Bold findfont 40.611 sf 0 0 m (ATLAS 20.3/fb) show NC gr  1 0 0 c[  ] 0 sd 1075 1126 m 79 X s black
 gsave  2268 1579 0 0 C 2238.38 292.236 t 90 r /Helvetica findfont 43.8599 sf 0 0 m (All but ATLAS 13/fb+20.3/fb extracted from arxiv:1306.2629) show NC gr 
 gsave  2268 1579 0 0 C 1861.61 346.005 t 0 r /Helvetica-BoldOblique findfont 58.4798 sf 0 0 m (ATLAS ) show NC gr 
 gr  gr showpage
end
%%EOF
