{0.05: {1.5: {'exp': 0.09189826052467562,
                'obs': 0.09664402646682661,
                'theory': 0.022588420157894737}},

 0.10: {1.5: {'exp': 0.0855164768542127,
                'obs': 0.0972017189441975,
                'theory': 0.17614575},
          2.0: {'exp': 0.042872255489021946,
                'obs': 0.04136925515055467,
                'theory': 0.0492217268125},
          2.5: {'exp': 0.023024278738680296,
                'obs': 0.026521437057151334,
                'theory': 0.014392518750000001},
          3.0: {'exp': 0.012262514355715487,
                'obs': 0.022546944132631034,
                'theory': 0.004564949375}},
 0.15: {
          1.5: {'exp': 0.09448068846815831,
                'obs': 0.10580741910023675,
                'theory': 0.388641},
	  2.0: {'exp': 0.048690094222663016,
                'obs': 0.04708286280279421,
                'theory': 0.109906},
          2.5: {'exp': 0.02667749772244153,
                'obs': 0.03072905378061186,
                'theory': 0.0329986},
          3.0: {'exp': 0.014762808415749592,
                'obs': 0.027656493744929758,
                'theory': 0.0105871},
          3.5: {'exp': 0.009277338178514649,
                'obs': 0.010452957002024886,
                'theory': 0.00363144},
          4.0: {'exp': 0.005578758137699742,
                'obs': 0.004844958593272782,
                'theory': 0.00130419}},

0.20: {   3.0: {'exp': 0.013772930157880652,
                'obs': 0.02469039897039897,
                'theory': 0.0186347701875},
          3.5: {'exp': 0.008427259498500468,
                'obs': 0.009551755787218716,
                'theory': 0.0062387485}},

 0.30: {
          3.0: {'exp': 0.01672576719612194,
                'obs': 0.029600604249449925,
                'theory': 0.044370244210526315},
          3.5: {'exp': 0.010843526887897527,
                'obs': 0.012523149236192714,
                'theory': 0.015676155}},

}