%!PS-Adobe-2.0 EPSF-2.0
%%BoundingBox:  0 0 567 384
%%Title: ./summaryPlots/SummaryPlot_mZ-gq_March2017.eps: c1
%%Creator: ROOT Version 6.04/14
%%CreationDate: Fri Mar 31 11:14:07 2017
%%DocumentNeededResources: ProcSet (FontSetInit)
%%EndComments
%%BeginProlog
80 dict begin
/s {stroke} def /l {lineto} def /m {moveto} def /t {translate} def
/r {rotate} def /rl {roll}  def /R {repeat} def
/d {rlineto} def /rm {rmoveto} def /gr {grestore} def /f {eofill} def
/c {setrgbcolor} def /black {0 setgray} def /sd {setdash} def
/cl {closepath} def /sf {scalefont setfont} def /lw {setlinewidth} def
/box {m dup 0 exch d exch 0 d 0 exch neg d cl} def
/NC{systemdict begin initclip end}def/C{NC box clip newpath}def
/bl {box s} def /bf {gsave box gsave f grestore 1 lw [] 0 sd s grestore} def /Y { 0 exch d} def /X { 0 d} def 
/K {{pop pop 0 moveto} exch kshow} bind def
/ita {/ang 15 def gsave [1 0 ang dup sin exch cos div 1 0 0] concat} def 
/mp {newpath /y exch def /x exch def} def
/side {[w .77 mul w .23 mul] .385 w mul sd w 0 l currentpoint t -144 r} def
/mr {mp x y w2 0 360 arc} def /m24 {mr s} def /m20 {mr f} def
/mb {mp x y w2 add m w2 neg 0 d 0 w neg d w 0 d 0 w d cl} def
/mt {mp x y w2 add m w2 neg w neg d w 0 d cl} def
/m21 {mb f} def /m25 {mb s} def /m22 {mt f} def /m26{mt s} def
/m23 {mp x y w2 sub m w2 w d w neg 0 d cl f} def
/m27 {mp x y w2 add m w3 neg w2 neg d w3 w2 neg d w3 w2 d cl s} def
/m28 {mp x w2 sub y w2 sub w3 add m w3 0 d  0 w3 neg d w3 0 d 0 w3 d w3 0 d  0 w3 d w3 neg 0 d 0 w3 d w3 neg 0 d 0 w3 neg d w3 neg 0 d cl s } def
/m29 {mp gsave x w2 sub y w2 add w3 sub m currentpoint t 4 {side} repeat cl fill gr} def
/m30 {mp gsave x w2 sub y w2 add w3 sub m currentpoint t 4 {side} repeat cl s gr} def
/m31 {mp x y w2 sub m 0 w d x w2 sub y m w 0 d x w2 sub y w2 add m w w neg d x w2 sub y w2 sub m w w d s} def
/m32 {mp x y w2 sub m w2 w d w neg 0 d cl s} def
/m33 {mp x y w2 add m w3 neg w2 neg d w3 w2 neg d w3 w2 d cl f} def
/m34 {mp x w2 sub y w2 sub w3 add m w3 0 d  0 w3 neg d w3 0 d 0 w3 d w3 0 d  0 w3 d w3 neg 0 d 0 w3 d w3 neg 0 d 0 w3 neg d w3 neg 0 d cl f } def
/m2 {mp x y w2 sub m 0 w d x w2 sub y m w 0 d s} def
/m5 {mp x w2 sub y w2 sub m w w d x w2 sub y w2 add m w w neg d s} def
%%IncludeResource: ProcSet (FontSetInit)
%%IncludeResource: font Times-Roman
%%IncludeResource: font Times-Italic
%%IncludeResource: font Times-Bold
%%IncludeResource: font Times-BoldItalic
%%IncludeResource: font Helvetica
%%IncludeResource: font Helvetica-Oblique
%%IncludeResource: font Helvetica-Bold
%%IncludeResource: font Helvetica-BoldOblique
%%IncludeResource: font Courier
%%IncludeResource: font Courier-Oblique
%%IncludeResource: font Courier-Bold
%%IncludeResource: font Courier-BoldOblique
%%IncludeResource: font Symbol
%%IncludeResource: font ZapfDingbats
/reEncode {exch findfont dup length dict begin {1 index /FID eq  {pop pop} {def} ifelse } forall /Encoding exch def currentdict end dup /FontName get exch definefont pop } def [/Times-Bold /Times-Italic /Times-BoldItalic /Helvetica /Helvetica-Oblique
 /Helvetica-Bold /Helvetica-BoldOblique /Courier /Courier-Oblique /Courier-Bold /Courier-BoldOblique /Times-Roman /AvantGarde-Book /AvantGarde-BookOblique /AvantGarde-Demi /AvantGarde-DemiOblique /Bookman-Demi /Bookman-DemiItalic /Bookman-Light
 /Bookman-LightItalic /Helvetica-Narrow /Helvetica-Narrow-Bold /Helvetica-Narrow-BoldOblique /Helvetica-Narrow-Oblique /NewCenturySchlbk-Roman /NewCenturySchlbk-Bold /NewCenturySchlbk-BoldItalic /NewCenturySchlbk-Italic /Palatino-Bold
 /Palatino-BoldItalic /Palatino-Italic /Palatino-Roman ] {ISOLatin1Encoding reEncode } forall
%%EndProlog
%%BeginSetup
%%EndSetup
newpath  gsave  .25 .25 scale  gsave  0 0 t black[  ] 0 sd 3 lw 1 1 1 c 2268 1538 0 0 bf black 1 1 1 c 1791 1215 363 246 bf black 1791 1215 363 246 bl 1 1 1 c 1791 1215 363 246 bf black 1791 1215 363 246 bl 6 lw 1 1 1 c black 363 246 m 1791 X s 3 lw
 363 246 m 1791 X s
 gsave  2268 1538 0 0 C 1954.93 55.3896 t 0 r /Helvetica findfont 71.6807 sf 0 0 m ( [GeV]) show NC gr 
 gsave  2268 1538 0 0 C 1915.83 35.8403 t 0 r /Helvetica findfont 48.8732 sf 0 0 m (Z') show NC gr 
 gsave  2268 1538 0 0 C 1860.44 55.3896 t 0 r /Helvetica findfont 71.6807 sf 0 0 m (m) show NC gr  605 264 m -18 Y s
 gsave  2268 1538 0 0 C 544.122 175.944 t 0 r /Helvetica findfont 71.6807 sf 0 0 m (300) show NC gr  777 264 m -18 Y s
 gsave  2268 1538 0 0 C 716.807 175.944 t 0 r /Helvetica findfont 71.6807 sf 0 0 m (400) show NC gr  911 264 m -18 Y s 1020 264 m -18 Y s 1112 264 m -18 Y s 1192 264 m -18 Y s 1262 264 m -18 Y s 1325 283 m -37 Y s
 gsave  2268 1538 0 0 C 1325.3 175.318 t 0 r  -79 0 t /Helvetica findfont 71.6807 sf 0 0 m (1000) show NC gr  1740 264 m -18 Y s
 gsave  2268 1538 0 0 C 1658.43 175.944 t 0 r /Helvetica findfont 71.6807 sf 0 0 m (2000) show NC gr  1982 264 m -18 Y s
 gsave  2268 1538 0 0 C 1902.8 175.944 t 0 r /Helvetica findfont 71.6807 sf 0 0 m (3000) show NC gr  2154 264 m -18 Y s 363 1461 m 1791 X s 605 1443 m 18 Y s 777 1443 m 18 Y s 911 1443 m 18 Y s 1020 1443 m 18 Y s 1112 1443 m 18 Y s 1192 1443 m 18 Y s
 1262 1443 m 18 Y s 1325 1425 m 36 Y s 1740 1443 m 18 Y s 1982 1443 m 18 Y s 2154 1443 m 18 Y s 363 246 m 1215 Y s
 gsave  2268 1538 0 0 C 140.103 1436.87 t 90 r /Helvetica findfont 48.8732 sf 0 0 m (q) show NC gr 
 gsave  2268 1538 0 0 C 104.263 1401.03 t 90 r /Helvetica findfont 71.6807 sf 0 0 m (g) show NC gr  417 333 m -54 X s 390 368 m -27 X s 390 402 m -27 X s 390 437 m -27 X s 390 472 m -27 X s 417 506 m -54 X s 390 541 m -27 X s 390 576 m -27 X s 390
 611 m -27 X s 390 645 m -27 X s 417 680 m -54 X s 390 715 m -27 X s 390 749 m -27 X s 390 784 m -27 X s 390 819 m -27 X s 417 854 m -54 X s 390 888 m -27 X s 390 923 m -27 X s 390 958 m -27 X s 390 992 m -27 X s 417 1027 m -54 X s 390 1062 m -27 X s
 390 1097 m -27 X s 390 1131 m -27 X s 390 1166 m -27 X s 417 1201 m -54 X s 390 1235 m -27 X s 390 1270 m -27 X s 390 1305 m -27 X s 390 1339 m -27 X s 417 1374 m -54 X s 417 333 m -54 X s 390 298 m -27 X s 390 263 m -27 X s 417 1374 m -54 X s 390
 1409 m -27 X s 390 1444 m -27 X s
 gsave  2268 1538 0 0 C 211.784 309.53 t 0 r /Helvetica findfont 71.6807 sf 0 0 m (0.05) show NC gr 
 gsave  2268 1538 0 0 C 263.915 482.216 t 0 r /Helvetica findfont 71.6807 sf 0 0 m (0.1) show NC gr 
 gsave  2268 1538 0 0 C 211.784 654.901 t 0 r /Helvetica findfont 71.6807 sf 0 0 m (0.15) show NC gr 
 gsave  2268 1538 0 0 C 250.882 827.586 t 0 r /Helvetica findfont 71.6807 sf 0 0 m (0.2) show NC gr 
 gsave  2268 1538 0 0 C 211.784 1003.53 t 0 r /Helvetica findfont 71.6807 sf 0 0 m (0.25) show NC gr 
 gsave  2268 1538 0 0 C 250.882 1176.21 t 0 r /Helvetica findfont 71.6807 sf 0 0 m (0.3) show NC gr 
 gsave  2268 1538 0 0 C 211.784 1348.9 t 0 r /Helvetica findfont 71.6807 sf 0 0 m (0.35) show NC gr  2154 246 m 1215 Y s 2101 333 m 53 X s 2127 368 m 27 X s 2127 402 m 27 X s 2127 437 m 27 X s 2127 472 m 27 X s 2101 506 m 53 X s 2127 541 m 27 X s
 2127 576 m 27 X s 2127 611 m 27 X s 2127 645 m 27 X s 2101 680 m 53 X s 2127 715 m 27 X s 2127 749 m 27 X s 2127 784 m 27 X s 2127 819 m 27 X s 2101 854 m 53 X s 2127 888 m 27 X s 2127 923 m 27 X s 2127 958 m 27 X s 2127 992 m 27 X s 2101 1027 m 53
 X s 2127 1062 m 27 X s 2127 1097 m 27 X s 2127 1131 m 27 X s 2127 1166 m 27 X s 2101 1201 m 53 X s 2127 1235 m 27 X s 2127 1270 m 27 X s 2127 1305 m 27 X s 2127 1339 m 27 X s 2101 1374 m 53 X s 2101 333 m 53 X s 2127 298 m 27 X s 2127 263 m 27 X s
 2101 1374 m 53 X s 2127 1409 m 27 X s 2127 1444 m 27 X s 1 0 0 c[  12 12 ] 0 sd 15 lw black[  ] 0 sd 3 lw 1 0 0 c 1 lw << /PatternType 1 /PaintType 2 /TilingType 1 /BBox [ 0 0 96 16 ] /XStep 96 /YStep 16 /PaintProc { begin gsave [1 3] 0 sd 2 13 m 98
 13 l s 0 9 m 96 9 l s 2 5 m 98 5 l s 0 1 m 96 1 l s gr end } >> [ 2.0 0 0 2.0 0 0 ] makepattern /P03 exch def /cs {[/Pattern /DeviceRGB] setcolorspace} def /FA {f [/DeviceRGB] setcolorspace} def cs 1 0 0 P03 setcolor 363 939 m 9 -18 d 9 -17 d 9 -16
 d 10 -16 d 9 -14 d 10 -13 d 10 -11 d 10 -11 d 9 -9 d 10 -8 d 9 -6 d 10 -6 d 10 -4 d 9 -2 d 7 -1 d 7 X 8 2 d 8 3 d 10 6 d 11 7 d 18 14 d 16 12 d 11 6 d 9 5 d 4 1 d 16 5 d 20 5 d 54 9 d 2 1 d 19 6 d 32 10 d 15 4 d 13 2 d 10 X 10 -1 d 29 -7 d 7 -1 d 7
 1 d 6 1 d 3 2 d 6 3 d 7 6 d 8 8 d 13 15 d 13 15 d 9 8 d 7 5 d 9 6 d 48 21 d 43 22 d 31 17 d 28 17 d 28 18 d 22 15 d 23 17 d 10 8 d 26 21 d 26 23 d 25 23 d 25 24 d 26 26 d 14 15 d -42 39 d -13 -15 d -25 -25 d -24 -23 d -24 -22 d -25 -22 d -24 -20 d
 -9 -7 d -22 -16 d -21 -14 d -26 -17 d -26 -16 d -30 -16 d -40 -21 d -50 -21 d -16 -10 d -12 -10 d -12 -11 d -14 -17 d -12 -13 d -2 -2 d -19 5 d -17 3 d -15 X -7 -1 d -16 -2 d -20 -6 d -33 -10 d -16 -5 d -53 -10 d -23 -5 d -20 -6 d -9 -3 d -13 -7 d
 -16 -10 d -18 -13 d -17 -13 d -7 -5 d -3 -1 d -2 X -5 3 d -6 4 d -6 5 d -6 6 d -8 8 d -7 9 d -9 11 d -8 12 d -8 14 d -8 14 d -9 16 d -8 17 d FA[  12 12 ] 0 sd 15 lw 1 0 0 c 363 939 m 9 -18 d 9 -17 d 9 -16 d 10 -16 d 9 -14 d 10 -13 d 10 -11 d 10 -11
 d 9 -9 d 10 -8 d 9 -6 d 10 -6 d 10 -4 d 9 -2 d 7 -1 d 7 X 8 2 d 8 3 d 10 6 d 11 7 d 18 14 d 16 12 d 11 6 d 9 5 d 4 1 d 16 5 d 20 5 d 54 9 d 2 1 d 19 6 d 32 10 d 15 4 d 13 2 d 10 X 10 -1 d 29 -7 d 7 -1 d 7 1 d 6 1 d 3 2 d 6 3 d 7 6 d 8 8 d 13 15 d 13
 15 d 9 8 d 7 5 d 9 6 d 48 21 d 43 22 d 31 17 d 28 17 d 28 18 d 22 15 d 23 17 d 10 8 d 26 21 d 26 23 d 25 23 d 25 24 d 26 26 d 14 15 d s[  ] 0 sd 6 lw black 1 0 0 c 363 1328 m 6 -54 d 6 -50 d 6 -47 d 5 -43 d 6 -40 d 6 -38 d 5 -36 d 6 -34 d 5 -32 d 6
 -30 d 6 -29 d 6 -28 d 6 -26 d 6 -25 d 6 -23 d 7 -24 d 6 -18 d 6 -17 d 6 -15 d 7 -14 d 6 -11 d 7 -9 d 1 -2 d 5 -5 d 5 -3 d 6 X 5 2 d 5 3 d 6 6 d 6 8 d 7 12 d 8 15 d 9 19 d 17 42 d 12 26 d 7 15 d 7 12 d 4 7 d 9 14 d 10 20 d 28 56 d 11 18 d 8 12 d 7 10
 d 6 6 d 6 4 d 6 3 d 1 X 6 -1 d 5 -2 d 7 -5 d 7 -8 d 8 -11 d 15 -24 d 13 -19 d 7 -9 d 6 -6 d 6 -5 d 11 -6 d 12 -3 d 12 -2 d 13 X 14 2 d 9 2 d 10 4 d 12 7 d 15 10 d 22 18 d 4 4 d 10 9 d 16 19 d 16 18 d 10 9 d 5 4 d 7 4 d 8 3 d 7 1 d 10 -1 d 10 -3 d 11
 -6 d 14 -9 d 54 -43 d 10 -6 d 10 -4 d 10 -2 d 9 1 d 8 2 d 7 4 d 7 6 d 3 3 d 11 12 d 12 15 d 11 17 d 12 18 d 12 21 d 13 26 d 11 23 d s 1235 1072 m 11 27 d 12 29 d 12 33 d 11 30 d 12 35 d 2 6 d s 0.6 0.2 0.6 c[  12 12 ] 0 sd 15 lw black[  ] 0 sd 3 lw
 0.6 0.2 0.6 c cs 0.6 0.2 0.6 P03 setcolor 697 722 m 8 6 d 8 6 d 8 5 d 7 5 d 7 4 d 7 5 d 7 4 d 8 4 d 7 4 d 7 3 d 8 4 d 7 3 d 8 3 d 8 3 d 7 3 d 8 2 d 8 2 d 8 3 d 7 1 d 8 2 d 7 1 d 7 1 d 8 1 d 7 1 d 7 X 8 1 d 7 X -1 57 d -8 -1 d -9 X -9 -1 d -9 X -8 -2
 d -9 -1 d -9 -1 d -10 -2 d -8 -2 d -10 -3 d -9 -3 d -9 -3 d -8 -2 d -10 -4 d -9 -4 d -8 -4 d -9 -4 d -9 -4 d -8 -4 d -8 -5 d -8 -4 d -9 -5 d -8 -6 d -8 -5 d -8 -6 d -9 -6 d -8 -6 d FA[  12 12 ] 0 sd 15 lw 0.6 0.2 0.6 c 697 722 m 8 6 d 8 6 d 8 5 d 7
 5 d 7 4 d 7 5 d 7 4 d 8 4 d 7 4 d 7 3 d 8 4 d 7 3 d 8 3 d 8 3 d 7 3 d 8 2 d 8 2 d 8 3 d 7 1 d 8 2 d 7 1 d 7 1 d 8 1 d 7 1 d 7 X 8 1 d 7 X s[  ] 0 sd 3 lw cs 0.6 0.2 0.6 P03 setcolor 899 799 m 8 X 7 -1 d 8 X 7 -1 d 8 -1 d 8 -1 d 8 -1 d 7 -2 d 8 -2 d
 13 55 d -9 2 d -8 2 d -10 2 d -9 1 d -9 2 d -9 X -10 1 d -9 X -8 1 d FA[  12 12 ] 0 sd 15 lw 0.6 0.2 0.6 c 899 799 m 8 X 7 -1 d 8 X 7 -1 d 8 -1 d 8 -1 d 8 -1 d 7 -2 d 8 -2 d s[  ] 0 sd 6 lw black 0.6 0.2 0.6 c 697 700 m 7 -3 d 7 -3 d 7 -2 d 7 -3 d 7
 -2 d 6 -2 d 7 -1 d 6 -2 d 6 -1 d 6 -1 d 7 -1 d 6 X 6 -1 d 13 X 7 1 d 7 X 6 1 d 7 1 d 6 1 d 7 1 d 6 2 d 7 2 d 6 2 d 7 2 d 6 3 d 6 2 d s 873 696 m 7 3 d 6 3 d 6 3 d 6 4 d 7 3 d 6 4 d 7 5 d 6 4 d 7 5 d 6 4 d 7 6 d 6 5 d 7 6 d 6 5 d 5 5 d s 0.2 0.2 1 c[
  12 12 ] 0 sd 15 lw black[  ] 0 sd 3 lw 0.2 0.2 1 c cs 0.2 0.2 1 P03 setcolor 968 416 m 8 4 d 8 4 d 9 4 d 8 4 d 9 3 d 8 4 d 8 3 d 10 3 d 8 3 d 9 2 d 8 2 d 7 2 d 7 2 d 7 1 d 8 1 d 8 1 d 9 1 d 10 1 d 13 1 d 23 2 d 23 X 23 -1 d 19 X 4 1 d 5 X 1 1 d 7 1
 d 7 2 d 7 1 d 7 2 d 7 2 d 7 3 d 7 2 d 7 3 d 7 3 d 4 2 d -24 51 d -3 -1 d -6 -3 d -5 -2 d -6 -2 d -5 -2 d -6 -1 d -5 -2 d -6 -1 d -5 -1 d -6 -1 d -2 -1 d -38 X -11 1 d -9 X -8 -1 d -24 -1 d -13 -1 d -12 -1 d -10 -1 d -10 -2 d -9 -1 d -9 -2 d -8 -2 d
 -8 -2 d -10 -2 d -9 -3 d -10 -3 d -11 -4 d -9 -3 d -10 -4 d -9 -4 d -10 -5 d -9 -4 d -10 -5 d -8 -4 d FA[  12 12 ] 0 sd 15 lw 0.2 0.2 1 c 968 416 m 8 4 d 8 4 d 9 4 d 8 4 d 9 3 d 8 4 d 8 3 d 10 3 d 8 3 d 9 2 d 8 2 d 7 2 d 7 2 d 7 1 d 8 1 d 8 1 d 9 1
 d 10 1 d 13 1 d 23 2 d 23 X 23 -1 d 19 X 4 1 d 5 X 1 1 d 7 1 d 7 2 d 7 1 d 7 2 d 7 2 d 7 3 d 7 2 d 7 3 d 7 3 d 4 2 d s[  ] 0 sd 6 lw black 0.2 0.2 1 c 968 370 m 4 19 d 5 20 d 4 19 d 5 18 d 4 16 d 4 15 d 4 14 d 4 13 d 4 12 d 4 11 d 4 11 d 4 10 d 4 10
 d 5 9 d 4 9 d 4 7 d 4 7 d 5 7 d 3 5 d 5 4 d 4 5 d 4 3 d 4 2 d 4 2 d 3 1 d 3 X 3 -1 d 3 -1 d 4 -3 d 4 -3 d 3 -5 d 5 -5 d 4 -7 d 5 -8 d 6 -11 d 13 -25 d 9 -18 d 6 -11 d 5 -7 d 4 -6 d 4 -5 d 1 -2 d 20 -22 d 12 -13 d 10 -10 d 8 -8 d 9 -6 d s 1212 442 m
 6 -5 d 7 -5 d 3 -1 d 8 -4 d 9 -4 d 8 -2 d 8 -2 d 9 -1 d 16 X 9 1 d s[  12 12 ] 0 sd 15 lw black[  ] 0 sd 3 lw 0.2 0.2 1 c cs 0.2 0.2 1 P03 setcolor 848 456 m 120 -13 d 6 56 d -120 13 d FA[  12 12 ] 0 sd 15 lw 0.2 0.2 1 c 848 456 m 120 -13 d s[  ] 0
 sd 6 lw black 0.2 0.2 1 c 848 438 m 120 -1 d s 0.2 0.2 0.6 c[  12 12 ] 0 sd 15 lw black[  ] 0 sd 3 lw 0.2 0.2 0.6 c cs 0.2 0.2 0.6 P03 setcolor 1568 401 m 22 4 d 23 6 d 19 7 d 22 10 d 22 11 d 23 14 d 21 14 d 20 16 d 20 18 d 22 21 d 22 22 d 24 26 d
 20 25 d 21 27 d 4 5 d 34 46 d 19 28 d 18 28 d 13 22 d 12 22 d 13 26 d 14 30 d 15 33 d 15 34 d 16 41 d 14 37 d 14 40 d 4 11 d -53 19 d -4 -11 d -14 -40 d -14 -36 d -16 -39 d -14 -34 d -14 -32 d -14 -28 d -12 -24 d -11 -20 d -12 -21 d -17 -27 d -18
 -26 d -33 -45 d -4 -4 d -20 -27 d -19 -23 d -22 -24 d -20 -21 d -21 -19 d -18 -16 d -18 -14 d -18 -13 d -20 -11 d -18 -10 d -19 -8 d -15 -6 d -19 -5 d -19 -3 d FA[  12 12 ] 0 sd 15 lw 0.2 0.2 0.6 c 1568 401 m 22 4 d 23 6 d 19 7 d 22 10 d 22 11 d 23
 14 d 21 14 d 20 16 d 20 18 d 22 21 d 22 22 d 24 26 d 20 25 d 21 27 d 4 5 d 34 46 d 19 28 d 18 28 d 13 22 d 12 22 d 13 26 d 14 30 d 15 33 d 15 34 d 16 41 d 14 37 d 14 40 d 4 11 d s[  ] 0 sd 6 lw black 0.2 0.2 0.6 c 1568 417 m 17 -3 d 17 -1 d 18 1 d
 18 4 d 16 4 d 17 8 d 18 9 d 18 11 d 16 13 d 17 15 d 36 34 d 18 18 d 14 18 d 13 17 d 12 18 d 11 18 d 10 19 d 9 20 d 10 22 d 7 16 d 7 20 d 7 24 d 10 32 d 12 43 d 22 83 d 10 34 d 8 27 d 7 22 d 7 18 d 6 14 d 6 15 d 10 17 d 9 15 d 9 13 d 10 11 d 9 8 d 10
 8 d 10 5 d 9 3 d 9 1 d 7 -1 d s 1 0 0 c black 1 0 0 c
 gsave  2268 1538 0 0 C 795.004 1029.6 t 0 r /Helvetica findfont 52.1314 sf 0 0 m (| < 0.8) show NC gr  black 1 0 0 c
 gsave  2268 1538 0 0 C 755.906 1003.53 t 0 r /Helvetica findfont 35.8403 sf 0 0 m (12) show NC gr  black 1 0 0 c
 gsave  2268 1538 0 0 C 697.258 1029.6 t 0 r /Helvetica findfont 52.1314 sf 0 0 m (|y*) show NC gr  0.6 0.2 0.6 c black 0.6 0.2 0.6 c
 gsave  2268 1538 0 0 C 1094.76 749.389 t 0 r /Helvetica findfont 52.1314 sf 0 0 m (| < 0.6) show NC gr  black 0.6 0.2 0.6 c
 gsave  2268 1538 0 0 C 1055.66 723.323 t 0 r /Helvetica findfont 35.8403 sf 0 0 m (23) show NC gr  black 0.6 0.2 0.6 c
 gsave  2268 1538 0 0 C 997.013 749.389 t 0 r /Helvetica findfont 52.1314 sf 0 0 m (|y*) show NC gr  0.2 0.2 1 c black 0.2 0.2 1 c
 gsave  2268 1538 0 0 C 795.004 351.887 t 0 r /Helvetica findfont 52.1314 sf 0 0 m (| < 0.3) show NC gr  black 0.2 0.2 1 c
 gsave  2268 1538 0 0 C 755.906 325.821 t 0 r /Helvetica findfont 35.8403 sf 0 0 m (12) show NC gr  black 0.2 0.2 1 c
 gsave  2268 1538 0 0 C 697.258 351.887 t 0 r /Helvetica findfont 52.1314 sf 0 0 m (|y*) show NC gr  black 0.2 0.2 1 c
 gsave  2268 1538 0 0 C 1094.76 351.887 t 0 r /Helvetica findfont 52.1314 sf 0 0 m (| < 0.6) show NC gr  black 0.2 0.2 1 c
 gsave  2268 1538 0 0 C 1055.66 325.821 t 0 r /Helvetica findfont 35.8403 sf 0 0 m (12) show NC gr  black 0.2 0.2 1 c
 gsave  2268 1538 0 0 C 997.013 351.887 t 0 r /Helvetica findfont 52.1314 sf 0 0 m (|y*) show NC gr  0.2 0.2 0.6 c black 0.2 0.2 0.6 c
 gsave  2268 1538 0 0 C 1919.09 491.99 t 0 r /Helvetica findfont 52.1314 sf 0 0 m (| < 0.6) show NC gr  black 0.2 0.2 0.6 c
 gsave  2268 1538 0 0 C 1879.99 465.924 t 0 r /Helvetica findfont 35.8403 sf 0 0 m (12) show NC gr  black 0.2 0.2 0.6 c
 gsave  2268 1538 0 0 C 1821.34 491.99 t 0 r /Helvetica findfont 52.1314 sf 0 0 m (|y*) show NC gr  black 3 lw 968 333 m 312 Y s
 gsave  2268 1538 0 0 C 632.093 1371.71 t 0 r /Helvetica findfont 58.6478 sf 0 0 m ( Internal March 2017) show NC gr 
 gsave  2268 1538 0 0 C 430.084 1371.71 t 0 r /Helvetica-BoldOblique findfont 58.6478 sf 0 0 m (ATLAS) show NC gr 
 gsave  2268 1538 0 0 C 1078.47 1306.54 t 0 r /Helvetica findfont 39.0986 sf 0 0 m (1) show NC gr 
 gsave  2268 1538 0 0 C 1058.92 1306.54 t 0 r /Symbol findfont 39.0986 sf 0 0 m (-) show NC gr 
 gsave  2268 1538 0 0 C 488.732 1277.22 t 0 r /Helvetica findfont 58.6478 sf 0 0 m ( = 13 TeV; 3.4\25537.0 fb) show NC gr 
 gsave  2268 1538 0 0 C 459.408 1277.22 t 0 r /Helvetica findfont 58.6478 sf 0 0 m (s) show NC gr  6 lw 440 1310 m 6 -36 d s 3 lw 446 1274 m 7 52 d s 453 1326 m 36 X s 1 1 1 c black
 gsave  2268 1538 0 0 C 1495.52 1322.83 t 0 r /Helvetica findfont 42.3568 sf 0 0 m (ATLAS\255CONF\2552016\255070) show NC gr 
 gsave  2268 1538 0 0 C 1902.8 1397.77 t 0 r /Helvetica findfont 29.3239 sf 0 0 m (1) show NC gr 
 gsave  2268 1538 0 0 C 1889.76 1397.77 t 0 r /Symbol findfont 29.3239 sf 0 0 m (-) show NC gr 
 gsave  2268 1538 0 0 C 1723.59 1378.22 t 0 r /Helvetica findfont 42.3568 sf 0 0 m (\), 15.5 fb) show NC gr 
 gsave  2268 1538 0 0 C 1700.79 1378.22 t 0 r /Symbol findfont 42.3568 sf 0 0 m (g) show NC gr 
 gsave  2268 1538 0 0 C 1495.52 1378.22 t 0 r /Helvetica findfont 42.3568 sf 0 0 m (Dijet+ISR \() show NC gr  1 0 0 c 6 lw 1342 1369 m 127 X s black
 gsave  2268 1538 0 0 C 1495.52 1199.02 t 0 r /Helvetica findfont 42.3568 sf 0 0 m (ATLAS\255CONF\2552016\255070) show NC gr 
 gsave  2268 1538 0 0 C 1925.6 1273.96 t 0 r /Helvetica findfont 29.3239 sf 0 0 m (1) show NC gr 
 gsave  2268 1538 0 0 C 1912.57 1273.96 t 0 r /Symbol findfont 29.3239 sf 0 0 m (-) show NC gr 
 gsave  2268 1538 0 0 C 1495.52 1254.41 t 0 r /Helvetica findfont 42.3568 sf 0 0 m (Dijet+ISR \(jet\), 15.5 fb) show NC gr  0.6 0.2 0.6 c 1342 1246 m 127 X s black
 gsave  2268 1538 0 0 C 1495.52 1075.21 t 0 r /Helvetica findfont 42.3568 sf 0 0 m (ATLAS\255CONF\2552016\255030) show NC gr 
 gsave  2268 1538 0 0 C 1811.57 1150.15 t 0 r /Helvetica findfont 29.3239 sf 0 0 m (1) show NC gr 
 gsave  2268 1538 0 0 C 1798.53 1150.15 t 0 r /Symbol findfont 29.3239 sf 0 0 m (-) show NC gr 
 gsave  2268 1538 0 0 C 1495.52 1130.6 t 0 r /Helvetica findfont 42.3568 sf 0 0 m (Dijet TLA, 3.4 fb) show NC gr  0.2 0.2 1 c 1342 1123 m 127 X s black
 gsave  2268 1538 0 0 C 1495.52 951.398 t 0 r /Helvetica findfont 42.3568 sf 0 0 m (arXiv: 1703.09127) show NC gr 
 gsave  2268 1538 0 0 C 1746.4 1026.34 t 0 r /Helvetica findfont 29.3239 sf 0 0 m (1) show NC gr 
 gsave  2268 1538 0 0 C 1733.37 1026.34 t 0 r /Symbol findfont 29.3239 sf 0 0 m (-) show NC gr 
 gsave  2268 1538 0 0 C 1495.52 1006.79 t 0 r /Helvetica findfont 42.3568 sf 0 0 m (Dijet, 37.0 fb) show NC gr  0.2 0.2 0.6 c 1342 1000 m 127 X s black 3 lw 1 1 1 c black
 gsave  2268 1538 0 0 C 1332.61 830.844 t 0 r /Helvetica findfont 42.3568 sf 0 0 m (95% CL upper limits) show NC gr 
 gsave  2268 1538 0 0 C 1495.52 762.422 t 0 r /Helvetica findfont 42.3568 sf 0 0 m (Expected) show NC gr [  12 12 ] 0 sd 15 lw 1342 777 m 127 X s
 gsave  2268 1538 0 0 C 1495.52 697.258 t 0 r /Helvetica findfont 42.3568 sf 0 0 m (Observed) show NC gr [  ] 0 sd 6 lw 1342 710 m 127 X s 3 lw 363 246 m 1791 X s 605 264 m -18 Y s 777 264 m -18 Y s 911 264 m -18 Y s 1020 264 m -18 Y s 1112 264 m -18
 Y s 1192 264 m -18 Y s 1262 264 m -18 Y s 1325 283 m -37 Y s 1740 264 m -18 Y s 1982 264 m -18 Y s 2154 264 m -18 Y s 363 1461 m 1791 X s 605 1443 m 18 Y s 777 1443 m 18 Y s 911 1443 m 18 Y s 1020 1443 m 18 Y s 1112 1443 m 18 Y s 1192 1443 m 18 Y s
 1262 1443 m 18 Y s 1325 1425 m 36 Y s 1740 1443 m 18 Y s 1982 1443 m 18 Y s 2154 1443 m 18 Y s 363 246 m 1215 Y s 417 333 m -54 X s 390 368 m -27 X s 390 402 m -27 X s 390 437 m -27 X s 390 472 m -27 X s 417 506 m -54 X s 390 541 m -27 X s 390 576 m
 -27 X s 390 611 m -27 X s 390 645 m -27 X s 417 680 m -54 X s 390 715 m -27 X s 390 749 m -27 X s 390 784 m -27 X s 390 819 m -27 X s 417 854 m -54 X s 390 888 m -27 X s 390 923 m -27 X s 390 958 m -27 X s 390 992 m -27 X s 417 1027 m -54 X s 390
 1062 m -27 X s 390 1097 m -27 X s 390 1131 m -27 X s 390 1166 m -27 X s 417 1201 m -54 X s 390 1235 m -27 X s 390 1270 m -27 X s 390 1305 m -27 X s 390 1339 m -27 X s 417 1374 m -54 X s 417 333 m -54 X s 390 298 m -27 X s 390 263 m -27 X s 417 1374
 m -54 X s 390 1409 m -27 X s 390 1444 m -27 X s 2154 246 m 1215 Y s 2101 333 m 53 X s 2127 368 m 27 X s 2127 402 m 27 X s 2127 437 m 27 X s 2127 472 m 27 X s 2101 506 m 53 X s 2127 541 m 27 X s 2127 576 m 27 X s 2127 611 m 27 X s 2127 645 m 27 X s
 2101 680 m 53 X s 2127 715 m 27 X s 2127 749 m 27 X s 2127 784 m 27 X s 2127 819 m 27 X s 2101 854 m 53 X s 2127 888 m 27 X s 2127 923 m 27 X s 2127 958 m 27 X s 2127 992 m 27 X s 2101 1027 m 53 X s 2127 1062 m 27 X s 2127 1097 m 27 X s 2127 1131 m
 27 X s 2127 1166 m 27 X s 2101 1201 m 53 X s 2127 1235 m 27 X s 2127 1270 m 27 X s 2127 1305 m 27 X s 2127 1339 m 27 X s 2101 1374 m 53 X s 2101 333 m 53 X s 2127 298 m 27 X s 2127 263 m 27 X s 2101 1374 m 53 X s 2127 1409 m 27 X s 2127 1444 m 27 X
 s
 gr  gr showpage
end
%%EOF
