{0.10: {0.45: {'exp': 0.3833179268978013,
                  'obs': 0.36240511549364246,
                  'theory': 0.09014752740040421},
          0.55: {'exp': 0.4208055883581302,
                  'obs': 0.3516069113972979,
                  'theory': 0.08172408805694431}},
 0.20: {0.35: {'exp': 0.4536865734027565,
                  'obs': 0.444051657038204,
                  'theory': 0.44233512971550226},
          0.45: {'exp': 0.4465687643751918,
                  'obs': 0.559606579341505,
                  'theory': 0.35215031262487173},
          0.55: {'exp': 0.4230880956262413,
                  'obs': 0.3492554175650021,
                  'theory': 0.33009787648916245}},
 0.30: {0.35: {'exp': 0.48428984672318626,
                  'obs': 0.44998454896736934,
                  'theory': 0.9802852291613817},
          0.45: {'exp': 0.5153965525229397,
                  'obs': 0.5786885207831626,
                  'theory': 0.8026809263974428},
          0.55: {'exp': 0.457601519681116,
                  'obs': 0.3976499391742974,
                  'theory': 0.7374715190380812}},
 0.40: {0.35: {'exp': 0.4986902425428969,
                  'obs': 0.45314697260885595,
                  'theory': 1.6870262660086155},
          0.45: {'exp': 0.613002941435395,
                  'obs': 0.650678522349197,
                  'theory': 1.4666528012603521},
          0.55: {'exp': 0.45759895432067055,
                  'obs': 0.3901535742665142,
                  'theory': 1.2986689563840628}}}
