{
    0.05: {
        1.25: {
            'acc': 0.2,
            'exp-2': 0.176311264158,
            'exp-1': 0.200942493835,
            'exp': 0.300489149463,
            'exp+1': 0.410188023407,
            'exp+2': 0.569564257468,
            'obs': 0.288509526401,
            'theory': 0.259465,
        },
        1.5: {
            'acc': 0.2,
            'exp-2': 0.0831253939262,
            'exp-1': 0.109841614998,
            'exp': 0.148124628607,
            'exp+1': 0.220141038566,
            'exp+2': 0.331592864823,
            'obs': 0.335509278872,
            'theory': 0.11359,
        },
    },
    0.1: {
        1.25: {
            'acc': 0.2,
            'exp-2': 0.176311264158,
            'exp-1': 0.200942493835,
            'exp': 0.300489149463,
            'exp+1': 0.410188023407,
            'exp+2': 0.569564257468,
            'obs': 0.288509526401,
            'theory': 1.03765,
        },
        1.5: {
            'acc': 0.2,
            'exp-2': 0.0831253939262,
            'exp-1': 0.109841614998,
            'exp': 0.148124628607,
            'exp+1': 0.220141038566,
            'exp+2': 0.331592864823,
            'obs': 0.335509278872,
            'theory': 0.45454,
        },
        1.75: {
            'acc': 0.2,
            'exp-2': 0.0745714519242,
            'exp-1': 0.0816887062383,
            'exp': 0.129511511553,
            'exp+1': 0.179626916558,
            'exp+2': 0.267133020966,
            'obs': 0.143671028509,
            'theory': 0.216015,
        },
        2.0: {
            'acc': 0.2,
            'exp-2': 0.0623285714693,
            'exp-1': 0.0870259198042,
            'exp': 0.125649832037,
            'exp+1': 0.168925311199,
            'exp+2': 0.199580395131,
            'obs': 0.0965127532351,
            'theory': 0.108865,
        },
    },
    0.15: {
        1.25: {
            'acc': 0.2,
            'exp-2': 0.176311264158,
            'exp-1': 0.200942493835,
            'exp': 0.300489149463,
            'exp+1': 0.410188023407,
            'exp+2': 0.569564257468,
            'obs': 0.288509526401,
            'theory': 2.33825,
        },
        1.5: {
            'acc': 0.2,
            'exp-2': 0.0831253939262,
            'exp-1': 0.109841614998,
            'exp': 0.148124628607,
            'exp+1': 0.220141038566,
            'exp+2': 0.331592864823,
            'obs': 0.335509278872,
            'theory': 1.02425,
        },
        1.75: {
            'acc': 0.2,
            'exp-2': 0.0745714519242,
            'exp-1': 0.0816887062383,
            'exp': 0.129511511553,
            'exp+1': 0.179626916558,
            'exp+2': 0.267133020966,
            'obs': 0.143671028509,
            'theory': 0.48694,
        },
        2.0: {
            'acc': 0.2,
            'exp-2': 0.0623285714693,
            'exp-1': 0.0870259198042,
            'exp': 0.125649832037,
            'exp+1': 0.168925311199,
            'exp+2': 0.199580395131,
            'obs': 0.0965127532351,
            'theory': 0.245325,
        },
        2.25: {
            'acc': 0.2,
            'exp-2': 0.067195801916,
            'exp-1': 0.074562437879,
            'exp': 0.104240070387,
            'exp+1': 0.150930664008,
            'exp+2': 0.203055599751,
            'obs': 0.0931302584046,
            'theory': 0.1576625,
        },
        2.5: {
            'acc': 0.2,
            'exp-2': 0.0528507827874,
            'exp-1': 0.0635601105888,
            'exp': 0.0940319808357,
            'exp+1': 0.12921005958,
            'exp+2': 0.152366351105,
            'obs': 0.0940715940837,
            'theory': 0.07,
        },
    },
    0.2: {
        1.25: {
            'acc': 0.2,
            'exp-2': 0.176311264158,
            'exp-1': 0.200942493835,
            'exp': 0.300489149463,
            'exp+1': 0.410188023407,
            'exp+2': 0.569564257468,
            'obs': 0.288509526401,
            'theory': 4.1699,
        },
        1.5: {
            'acc': 0.2,
            'exp-2': 0.0831253939262,
            'exp-1': 0.109841614998,
            'exp': 0.148124628607,
            'exp+1': 0.220141038566,
            'exp+2': 0.331592864823,
            'obs': 0.335509278872,
            'theory': 1.82865,
        },
        1.75: {
            'acc': 0.2,
            'exp-2': 0.0745714519242,
            'exp-1': 0.0816887062383,
            'exp': 0.129511511553,
            'exp+1': 0.179626916558,
            'exp+2': 0.267133020966,
            'obs': 0.143671028509,
            'theory': 0.8699,
        },
        2.0: {
            'acc': 0.2,
            'exp-2': 0.0623285714693,
            'exp-1': 0.0870259198042,
            'exp': 0.125649832037,
            'exp+1': 0.168925311199,
            'exp+2': 0.199580395131,
            'obs': 0.0965127532351,
            'theory': 0.43879,
        },
        2.25: {
            'acc': 0.2,
            'exp-2': 0.067195801916,
            'exp-1': 0.074562437879,
            'exp': 0.104240070387,
            'exp+1': 0.150930664008,
            'exp+2': 0.203055599751,
            'obs': 0.0931302584046,
            'theory': 0.2822025,
        },
        2.5: {
            'acc': 0.2,
            'exp-2': 0.0528507827874,
            'exp-1': 0.0635601105888,
            'exp': 0.0940319808357,
            'exp+1': 0.12921005958,
            'exp+2': 0.152366351105,
            'obs': 0.0940715940837,
            'theory': 0.125615,
        },
        2.75: {
            'acc': 0.2,
            'exp-2': 0.0547201187522,
            'exp-1': 0.0629140297428,
            'exp': 0.0951369741119,
            'exp+1': 0.119383736447,
            'exp+2': 0.149050898563,
            'obs': 0.0862433646274,
            'theory': 0.0826875,
        },
        3.0: {
            'acc': 0.2,
            'exp-2': 0.0510044211958,
            'exp-1': 0.060134857087,
            'exp': 0.0871516790656,
            'exp+1': 0.128135828288,
            'exp+2': 0.148761899373,
            'obs': 0.0859713407255,
            'theory': 0.03976,
        },
        3.25: {
            'acc': 0.2,
            'exp-2': 0.0490077637082,
            'exp-1': 0.0546161900741,
            'exp': 0.0823125800351,
            'exp+1': 0.11729547216,
            'exp+2': 0.147469164486,
            'obs': 0.0992897153749,
            'theory': 0.03099565,
        },
        3.5: {
            'acc': 0.2,
            'exp-2': 0.0337042977034,
            'exp-1': 0.0550700024206,
            'exp': 0.0683527227043,
            'exp+1': 0.0886874369884,
            'exp+2': 0.118015876803,
            'obs': 0.0697002487291,
            'theory': 0.02223135,
        },
        3.75: {
            'acc': 0.2,
            'exp-2': 0.0328012030466,
            'exp-1': 0.0407338049933,
            'exp': 0.0687234909959,
            'exp+1': 0.0931663752004,
            'exp+2': 0.112752680894,
            'obs': 0.0519922109865,
            'theory': 0.013467,
        },
        4.0: {
            'acc': 0.2,
            'exp-2': 0.0306971662256,
            'exp-1': 0.0416165689624,
            'exp': 0.06129263799,
            'exp+1': 0.0868127124512,
            'exp+2': 0.112094648977,
            'obs': 0.0551118532579,
            'theory': 0.00470265,
        },
        4.25: {
            'acc': 0.2,
            'exp-2': 0.0330221910169,
            'exp-1': 0.0410162213433,
            'exp': 0.0550905008009,
            'exp+1': 0.0660230738214,
            'exp+2': 0.104282072224,
            'obs': 0.117472954461,
            'theory': 0.00368809,
        },
        4.5: {
            'acc': 0.2,
            'exp-2': 0.031312892377,
            'exp-1': 0.0373871352575,
            'exp': 0.0511382889495,
            'exp+1': 0.0673697557442,
            'exp+2': 0.0922113100117,
            'obs': 0.055472442315,
            'theory': 0.002673525,
        },
        4.75: {
            'acc': 0.2,
            'exp-2': 0.0234820609775,
            'exp-1': 0.0303838110202,
            'exp': 0.0407519288663,
            'exp+1': 0.062776520106,
            'exp+2': 0.104193290483,
            'obs': 0.0397167504777,
            'theory': 0.00165896,
        },
        5.0: {
            'acc': 0.2,
            'exp-2': 0.0186950427234,
            'exp-1': 0.0228304785056,
            'exp': 0.0315494624187,
            'exp+1': 0.0460066156469,
            'exp+2': 0.066896210475,
            'obs': 0.0274686668286,
            'theory': 0.0006444,
        },
    },
    0.25: {
        1.25: {
            'acc': 0.2,
            'exp-2': 0.176311264158,
            'exp-1': 0.200942493835,
            'exp': 0.300489149463,
            'exp+1': 0.410188023407,
            'exp+2': 0.569564257468,
            'obs': 0.288509526401,
            'theory': 6.5625,
        },
        1.5: {
            'acc': 0.2,
            'exp-2': 0.0831253939262,
            'exp-1': 0.109841614998,
            'exp': 0.148124628607,
            'exp+1': 0.220141038566,
            'exp+2': 0.331592864823,
            'obs': 0.335509278872,
            'theory': 2.8829,
        },
        1.75: {
            'acc': 0.2,
            'exp-2': 0.0745714519242,
            'exp-1': 0.0816887062383,
            'exp': 0.129511511553,
            'exp+1': 0.179626916558,
            'exp+2': 0.267133020966,
            'obs': 0.143671028509,
            'theory': 1.37415,
        },
        2.0: {
            'acc': 0.2,
            'exp-2': 0.0623285714693,
            'exp-1': 0.0870259198042,
            'exp': 0.125649832037,
            'exp+1': 0.168925311199,
            'exp+2': 0.199580395131,
            'obs': 0.0965127532351,
            'theory': 0.6954,
        },
        2.25: {
            'acc': 0.2,
            'exp-2': 0.067195801916,
            'exp-1': 0.074562437879,
            'exp': 0.104240070387,
            'exp+1': 0.150930664008,
            'exp+2': 0.203055599751,
            'obs': 0.0931302584046,
            'theory': 0.4478825,
        },
        2.5: {
            'acc': 0.2,
            'exp-2': 0.0528507827874,
            'exp-1': 0.0635601105888,
            'exp': 0.0940319808357,
            'exp+1': 0.12921005958,
            'exp+2': 0.152366351105,
            'obs': 0.0940715940837,
            'theory': 0.200365,
        },
        2.75: {
            'acc': 0.2,
            'exp-2': 0.0547201187522,
            'exp-1': 0.0629140297428,
            'exp': 0.0951369741119,
            'exp+1': 0.119383736447,
            'exp+2': 0.149050898563,
            'obs': 0.0862433646274,
            'theory': 0.132195,
        },
        3.0: {
            'acc': 0.2,
            'exp-2': 0.0510044211958,
            'exp-1': 0.060134857087,
            'exp': 0.0871516790656,
            'exp+1': 0.128135828288,
            'exp+2': 0.148761899373,
            'obs': 0.0859713407255,
            'theory': 0.064025,
        },
        3.25: {
            'acc': 0.2,
            'exp-2': 0.0490077637082,
            'exp-1': 0.0546161900741,
            'exp': 0.0823125800351,
            'exp+1': 0.11729547216,
            'exp+2': 0.147469164486,
            'obs': 0.0992897153749,
            'theory': 0.04996735,
        },
        3.5: {
            'acc': 0.2,
            'exp-2': 0.0337042977034,
            'exp-1': 0.0550700024206,
            'exp': 0.0683527227043,
            'exp+1': 0.0886874369884,
            'exp+2': 0.118015876803,
            'obs': 0.0697002487291,
            'theory': 0.03590975,
        },
        3.75: {
            'acc': 0.2,
            'exp-2': 0.0328012030466,
            'exp-1': 0.0407338049933,
            'exp': 0.0687234909959,
            'exp+1': 0.0931663752004,
            'exp+2': 0.112752680894,
            'obs': 0.0519922109865,
            'theory': 0.0218521,
        },
        4.0: {
            'acc': 0.2,
            'exp-2': 0.0306971662256,
            'exp-1': 0.0416165689624,
            'exp': 0.06129263799,
            'exp+1': 0.0868127124512,
            'exp+2': 0.112094648977,
            'obs': 0.0551118532579,
            'theory': 0.0077945,
        },
        4.25: {
            'acc': 0.2,
            'exp-2': 0.0330221910169,
            'exp-1': 0.0410162213433,
            'exp': 0.0550905008009,
            'exp+1': 0.0660230738214,
            'exp+2': 0.104282072224,
            'obs': 0.117472954461,
            'theory': 0.0061255,
        },
        4.5: {
            'acc': 0.2,
            'exp-2': 0.031312892377,
            'exp-1': 0.0373871352575,
            'exp': 0.0511382889495,
            'exp+1': 0.0673697557442,
            'exp+2': 0.0922113100117,
            'obs': 0.055472442315,
            'theory': 0.004456525,
        },
        4.75: {
            'acc': 0.2,
            'exp-2': 0.0234820609775,
            'exp-1': 0.0303838110202,
            'exp': 0.0407519288663,
            'exp+1': 0.062776520106,
            'exp+2': 0.104193290483,
            'obs': 0.0397167504777,
            'theory': 0.00278754,
        },
        5.0: {
            'acc': 0.2,
            'exp-2': 0.0186950427234,
            'exp-1': 0.0228304785056,
            'exp': 0.0315494624187,
            'exp+1': 0.0460066156469,
            'exp+2': 0.066896210475,
            'obs': 0.0274686668286,
            'theory': 0.00111855,
        },
    },
}
