#  ISAJET SUSY parameters in Les Houches accord format
#  Created by ISALHA3. Last revision by C. Balazs on 2005 Jan. 10
Block SPINFO   # Program information
     1   ISASUGRA from ISAJET          # Spectrum Calculator
     2   7.79   16-DEC-2008 15:42:00   # Version number
Block MODSEL   # Model selection
     1     1   # Minimal supergravity (mSUGRA,CMSSM) model         
Block SMINPUTS   # Standard Model inputs
     1     1.27838524E+02   # alpha_em^(-1)
     2     1.16570000E-05   # G_Fermi
     3     1.17200002E-01   # alpha_s(M_Z)
     4     9.11699982E+01   # m_{Z}(pole)
     5     4.19999981E+00   # m_{b}(m_{b})
     6     1.72500000E+02   # m_{top}(pole)
     7     1.77699995E+00   # m_{tau}(pole)
Block MINPAR   # SUSY breaking input parameters
     1     7.60000000E+02   # m_0
     2     2.20000000E+02   # m_{1/2}
     3     3.00000000E+00   # tan(beta)
     4     1.00000000E+00   # sign(mu)
     5     0.00000000E+00   # A_0
#  
#  M_{GUT} =   0.24366612E+17
Block MASS   # Scalar and gaugino mass spectrum
#  PDG code   mass                 particle
        24     8.04229965E+01   #  W^+
        25     9.74141235E+01   #  h^0            
        35     9.75959961E+02   #  H^0            
        36     9.67952454E+02   #  A^0            
        37     9.77519348E+02   #  H^+            
   1000001     8.94792419E+02   #  dnl            
   1000002     8.91874329E+02   #  upl            
   1000003     8.94792419E+02   #  stl            
   1000004     8.91875366E+02   #  chl            
   1000005     7.49573303E+02   #  b1             
   1000006     5.43357239E+02   #  t1             
   1000011     7.73159729E+02   #  el-            
   1000012     7.69782532E+02   #  nuel           
   1000013     7.73159729E+02   #  mul-           
   1000014     7.69782532E+02   #  numl           
   1000015     7.63059021E+02   #  tau1           
   1000016     7.69483887E+02   #  nutl           
   1000021     5.82764832E+02   #  glss           
   1000022     8.68832550E+01   #  z1ss           
   1000023     1.64869003E+02   #  z2ss           
   1000024     1.64433731E+02   #  w1ss           
   1000025    -4.98610901E+02   #  z3ss           
   1000035     5.16157471E+02   #  z4ss           
   1000037     5.13636536E+02   #  w2ss           
   2000001     8.87386047E+02   #  dnr            
   2000002     8.87112183E+02   #  upr            
   2000003     8.87386108E+02   #  str            
   2000004     8.87113281E+02   #  chr            
   2000005     8.83692749E+02   #  b2             
   2000006     7.73823608E+02   #  t2             
   2000011     7.64264954E+02   #  er-            
   2000013     7.64264954E+02   #  mur-           
   2000015     7.73123108E+02   #  tau2           
#  Higgs mixing
Block ALPHA   # Effective Higgs mixing parameter
         -3.27025801E-01   # alpha
Block STOPMIX   # stop mixing matrix
  1  1     2.70036906E-01   # O_{11}
  1  2    -9.62849975E-01   # O_{12}
  2  1     9.62849975E-01   # O_{21}
  2  2     2.70036906E-01   # O_{22}
Block SBOTMIX   # sbottom mixing matrix
  1  1     9.99737620E-01   # O_{11}
  1  2    -2.29055621E-02   # O_{12}
  2  1     2.29055621E-02   # O_{21}
  2  2     9.99737620E-01   # O_{22}
Block STAUMIX   # stau mixing matrix
  1  1     1.95213586E-01   # O_{11}
  1  2    -9.80760753E-01   # O_{12}
  2  1     9.80760753E-01   # O_{21}
  2  2     1.95213586E-01   # O_{22}
Block NMIX   # neutralino mixing matrix
  1  1     9.91647243E-01   #
  1  2    -6.49026185E-02   #
  1  3     1.00370914E-01   #
  1  4    -4.84702513E-02   #
  2  1    -8.66673440E-02   #
  2  2    -9.75088358E-01   #
  2  3     1.74689516E-01   #
  2  4    -1.05711877E-01   #
  3  1     3.30445990E-02   #
  3  2    -5.19127622E-02   #
  3  3    -7.02456892E-01   #
  3  4    -7.09061146E-01   #
  4  1     8.96262228E-02   #
  4  2    -2.05658421E-01   #
  4  3    -6.82615399E-01   #
  4  4     6.95491374E-01   #
Block UMIX   # chargino U mixing matrix
  1  1    -9.66922522E-01   # U_{11}
  1  2     2.55070210E-01   # U_{12}
  2  1    -2.55070210E-01   # U_{21}
  2  2    -9.66922522E-01   # U_{22}
Block VMIX   # chargino V mixing matrix
  1  1    -9.87639546E-01   # V_{11}
  1  2     1.56742230E-01   # V_{12}
  2  1    -1.56742230E-01   # V_{21}
  2  2    -9.87639546E-01   # V_{22}
Block GAUGE Q=  6.16394775E+02   #
     1     3.57521057E-01   # g`
     2     6.52377427E-01   # g_2
     3     1.21905243E+00   # g_3
Block YU Q=  6.16394775E+02   #
  3  3     9.17639911E-01   # y_t
Block YD Q=  6.16394775E+02   #
  3  3     4.37207781E-02   # y_b
Block YE Q=  6.16394775E+02   #
  3  3     3.17688510E-02   # y_tau
Block HMIX Q=  6.16394775E+02   # Higgs mixing parameters
     1     4.95621552E+02   # mu(Q)
     2     3.00000000E+00   # tan(beta)(M_{GUT})
     3     2.50638626E+02   # Higgs vev at Q
     4     9.36931938E+05   # m_A^2(Q)
Block MSOFT Q=  6.16394775E+02   # DRbar SUSY breaking parameters
     1     9.06134796E+01   # M_1(Q)          
     2     1.70257141E+02   # M_2(Q)          
     3     5.17427490E+02   # M_3(Q)          
    31     7.69925171E+02   # MeL(Q)          
    32     7.69925171E+02   # MmuL(Q)         
    33     7.69632202E+02   # MtauL(Q)        
    34     7.62652588E+02   # MeR(Q)          
    35     7.62652588E+02   # MmuR(Q)         
    36     7.61978333E+02   # MtauR(Q)        
    41     8.68133972E+02   # MqL1(Q)         
    42     8.68133972E+02   # MqL2(Q)         
    43     7.24853149E+02   # MqL3(Q)         
    44     8.62606628E+02   # MuR(Q)          
    45     8.62606628E+02   # McR(Q)          
    46     5.24164856E+02   # MtR(Q)          
    47     8.61988098E+02   # MdR(Q)          
    48     8.61988098E+02   # MsR(Q)          
    49     8.64757141E+02   # MbR(Q)          
Block AU Q=  6.16394775E+02   #
  1  1    -3.79352356E+02   # A_u
  2  2    -3.79352356E+02   # A_c
  3  3    -3.79352356E+02   # A_t
Block AD Q=  6.16394775E+02   #
  1  1    -6.04272705E+02   # A_d
  2  2    -6.04272705E+02   # A_s
  3  3    -6.04272705E+02   # A_b
Block AE Q=  6.16394775E+02   #
  1  1    -1.37261429E+02   # A_e
  2  2    -1.37261429E+02   # A_mu
  3  3    -1.37261429E+02   # A_tau
#  ISAJET decay tables in SUSY Les Houches accord format
#  Created by ISALHD. Last revision: C. Balazs, 2005 May 25
Block DCINFO                           # Program information
     1   ISASUGRA from ISAJET          # Spectrum Calculator
     2   7.79   16-DEC-2008 15:42:00   # Version number
#         PDG         Width
DECAY         6  1.14680767E+00   # TP    decays
#          BR          NDA       ID1       ID2       ID3       ID4
      3.33333343E-01    3            2        -1         5             # TP     -->  UP     DB     BT          
      3.33333343E-01    3            4        -3         5             # TP     -->  CH     SB     BT          
      1.11111112E-01    3          -11        12         5             # TP     -->  E+     NUE    BT          
      1.11111112E-01    3          -13        14         5             # TP     -->  MU+    NUM    BT          
      1.11111112E-01    3          -15        16         5             # TP     -->  TAU+   NUT    BT          
#         PDG         Width
DECAY   1000021  6.84404187E-03   # GLSS  decays
#          BR          NDA       ID1       ID2       ID3       ID4
      9.57172960E-02    3      1000024         1        -2             # GLSS   -->  W1SS+  DN     UB          
      9.57172960E-02    3     -1000024         2        -1             # GLSS   -->  W1SS-  UP     DB          
      9.57170054E-02    3      1000024         3        -4             # GLSS   -->  W1SS+  ST     CB          
      9.57170054E-02    3     -1000024         4        -3             # GLSS   -->  W1SS-  CH     SB          
      6.74558952E-02    3      1000024         5        -6             # GLSS   -->  W1SS+  BT     TB          
      6.74558952E-02    3     -1000024         6        -5             # GLSS   -->  W1SS-  TP     BB          
      3.49296238E-06    3      1000037         1        -2             # GLSS   -->  W2SS+  DN     UB          
      3.49296238E-06    3     -1000037         2        -1             # GLSS   -->  W2SS-  UP     DB          
      3.49295374E-06    3      1000037         3        -4             # GLSS   -->  W2SS+  ST     CB          
      3.49295374E-06    3     -1000037         4        -3             # GLSS   -->  W2SS-  CH     SB          
      8.91418240E-05    2      1000022        21                       # GLSS   -->  Z1SS   GL                 
      3.69260460E-02    3      1000022         2        -2             # GLSS   -->  Z1SS   UP     UB          
      1.29638650E-02    3      1000022         1        -1             # GLSS   -->  Z1SS   DN     DB          
      1.29638612E-02    3      1000022         3        -3             # GLSS   -->  Z1SS   ST     SB          
      3.69258188E-02    3      1000022         4        -4             # GLSS   -->  Z1SS   CH     CB          
      1.92863476E-02    3      1000022         5        -5             # GLSS   -->  Z1SS   BT     BB          
      4.61209714E-02    3      1000022         6        -6             # GLSS   -->  Z1SS   TP     TB          
      2.62952736E-03    2      1000023        21                       # GLSS   -->  Z2SS   GL                 
      4.97035310E-02    3      1000023         2        -2             # GLSS   -->  Z2SS   UP     UB          
      4.56616245E-02    3      1000023         1        -1             # GLSS   -->  Z2SS   DN     DB          
      4.56616245E-02    3      1000023         3        -3             # GLSS   -->  Z2SS   ST     SB          
      4.97032441E-02    3      1000023         4        -4             # GLSS   -->  Z2SS   CH     CB          
      1.19112253E-01    3      1000023         5        -5             # GLSS   -->  Z2SS   BT     BB          
      2.00139871E-03    3      1000023         6        -6             # GLSS   -->  Z2SS   TP     TB          
      1.46547589E-03    2      1000025        21                       # GLSS   -->  Z3SS   GL                 
      9.32880653E-08    3      1000025         2        -2             # GLSS   -->  Z3SS   UP     UB          
      1.18503024E-07    3      1000025         1        -1             # GLSS   -->  Z3SS   DN     DB          
      1.18503024E-07    3      1000025         3        -3             # GLSS   -->  Z3SS   ST     SB          
      9.32873832E-08    3      1000025         4        -4             # GLSS   -->  Z3SS   CH     CB          
      2.30487649E-06    3      1000025         5        -5             # GLSS   -->  Z3SS   BT     BB          
      9.74532450E-04    2      1000035        21                       # GLSS   -->  Z4SS   GL                 
      1.38792711E-06    3      1000035         2        -2             # GLSS   -->  Z4SS   UP     UB          
      1.70245858E-06    3      1000035         1        -1             # GLSS   -->  Z4SS   DN     DB          
      1.70245835E-06    3      1000035         3        -3             # GLSS   -->  Z4SS   ST     SB          
      1.38791643E-06    3      1000035         4        -4             # GLSS   -->  Z4SS   CH     CB          
      7.44915314E-06    3      1000035         5        -5             # GLSS   -->  Z4SS   BT     BB          
#         PDG         Width
DECAY   1000002  2.86672707E+01   # UPL   decays
#          BR          NDA       ID1       ID2       ID3       ID4
      1.75202498E-03    2      1000022         2                       # UPL    -->  Z1SS   UP                 
      1.19962879E-01    2      1000023         2                       # UPL    -->  Z2SS   UP                 
      1.30154513E-04    2      1000025         2                       # UPL    -->  Z3SS   UP                 
      2.07433547E-03    2      1000035         2                       # UPL    -->  Z4SS   UP                 
      6.34799957E-01    2      1000021         2                       # UPL    -->  GLSS   UP                 
      2.38406435E-01    2      1000024         1                       # UPL    -->  W1SS+  DN                 
      2.87418743E-03    2      1000037         1                       # UPL    -->  W2SS+  DN                 
#         PDG         Width
DECAY   1000001  2.87719669E+01   # DNL   decays
#          BR          NDA       ID1       ID2       ID3       ID4
      7.80998496E-03    2      1000022         1                       # DNL    -->  Z1SS   DN                 
      1.12406686E-01    2      1000023         1                       # DNL    -->  Z2SS   DN                 
      2.09110513E-04    2      1000025         1                       # DNL    -->  Z3SS   DN                 
      2.87444214E-03    2      1000035         1                       # DNL    -->  Z4SS   DN                 
      6.40514374E-01    2      1000021         1                       # DNL    -->  GLSS   DN                 
      2.28527650E-01    2     -1000024         2                       # DNL    -->  W1SS-  UP                 
      7.65773375E-03    2     -1000037         2                       # DNL    -->  W2SS-  UP                 
#         PDG         Width
DECAY   1000003  2.87719345E+01   # STL   decays
#          BR          NDA       ID1       ID2       ID3       ID4
      7.80999428E-03    2      1000022         3                       # STL    -->  Z1SS   ST                 
      1.12406820E-01    2      1000023         3                       # STL    -->  Z2SS   ST                 
      2.09110760E-04    2      1000025         3                       # STL    -->  Z3SS   ST                 
      2.87444564E-03    2      1000035         3                       # STL    -->  Z4SS   ST                 
      6.40515149E-01    2      1000021         3                       # STL    -->  GLSS   ST                 
      2.28526816E-01    2     -1000024         4                       # STL    -->  W1SS-  CH                 
      7.65766529E-03    2     -1000037         4                       # STL    -->  W2SS-  CH                 
#         PDG         Width
DECAY   1000004  2.86670952E+01   # CHL   decays
#          BR          NDA       ID1       ID2       ID3       ID4
      1.75202964E-03    2      1000022         4                       # CHL    -->  Z1SS   CH                 
      1.19963184E-01    2      1000023         4                       # CHL    -->  Z2SS   CH                 
      1.30154483E-04    2      1000025         4                       # CHL    -->  Z3SS   CH                 
      2.07433384E-03    2      1000035         4                       # CHL    -->  Z4SS   CH                 
      6.34797871E-01    2      1000021         4                       # CHL    -->  GLSS   CH                 
      2.38408208E-01    2      1000024         3                       # CHL    -->  W1SS+  ST                 
      2.87421490E-03    2      1000037         3                       # CHL    -->  W2SS+  ST                 
#         PDG         Width
DECAY   1000005  1.92946033E+01   # BT1   decays
#          BR          NDA       ID1       ID2       ID3       ID4
      9.73833632E-03    2      1000022         5                       # BT1    -->  Z1SS   BT                 
      1.36302873E-01    2      1000023         5                       # BT1    -->  Z2SS   BT                 
      3.88071319E-04    2      1000025         5                       # BT1    -->  Z3SS   BT                 
      2.41306471E-03    2      1000035         5                       # BT1    -->  Z4SS   BT                 
      3.84865820E-01    2      1000021         5                       # BT1    -->  GLSS   BT                 
      2.45626152E-01    2     -1000024         6                       # BT1    -->  W1SS-  TP                 
      1.34788111E-01    2     -1000037         6                       # BT1    -->  W2SS-  TP                 
      8.58776122E-02    2          -24   1000006                       # BT1    -->  W-     TP1                
#         PDG         Width
DECAY   1000006  2.15927553E+00   # TP1   decays
#          BR          NDA       ID1       ID2       ID3       ID4
      4.17338610E-01    2      1000022         6                       # TP1    -->  Z1SS   TP                 
      1.47345737E-01    2      1000023         6                       # TP1    -->  Z2SS   TP                 
      3.96808505E-01    2      1000024         5                       # TP1    -->  W1SS+  BT                 
      3.85071449E-02    2      1000037         5                       # TP1    -->  W2SS+  BT                 
#         PDG         Width
DECAY   2000002  1.97779999E+01   # UPR   decays
#          BR          NDA       ID1       ID2       ID3       ID4
      9.78036225E-02    2      1000022         2                       # UPR    -->  Z1SS   UP                 
      7.09891669E-04    2      1000023         2                       # UPR    -->  Z2SS   UP                 
      5.18127890E-05    2      1000025         2                       # UPR    -->  Z3SS   UP                 
      3.56362900E-04    2      1000035         2                       # UPR    -->  Z4SS   UP                 
      9.01078284E-01    2      1000021         2                       # UPR    -->  GLSS   UP                 
#         PDG         Width
DECAY   2000001  1.83324432E+01   # DNR   decays
#          BR          NDA       ID1       ID2       ID3       ID4
      2.63873823E-02    2      1000022         1                       # DNR    -->  Z1SS   DN                 
      1.91534651E-04    2      1000023         1                       # DNR    -->  Z2SS   DN                 
      1.39868753E-05    2      1000025         1                       # DNR    -->  Z3SS   DN                 
      9.62061677E-05    2      1000035         1                       # DNR    -->  Z4SS   DN                 
      9.73310888E-01    2      1000021         1                       # DNR    -->  GLSS   DN                 
#         PDG         Width
DECAY   2000003  1.83324471E+01   # STR   decays
#          BR          NDA       ID1       ID2       ID3       ID4
      2.63873786E-02    2      1000022         3                       # STR    -->  Z1SS   ST                 
      1.91534622E-04    2      1000023         3                       # STR    -->  Z2SS   ST                 
      1.39868735E-05    2      1000025         3                       # STR    -->  Z3SS   ST                 
      9.62061677E-05    2      1000035         3                       # STR    -->  Z4SS   ST                 
      9.73310888E-01    2      1000021         3                       # STR    -->  GLSS   ST                 
#         PDG         Width
DECAY   2000004  1.97778263E+01   # CHR   decays
#          BR          NDA       ID1       ID2       ID3       ID4
      9.78041589E-02    2      1000022         4                       # CHR    -->  Z1SS   CH                 
      7.09895336E-04    2      1000023         4                       # CHR    -->  Z2SS   CH                 
      5.18129236E-05    2      1000025         4                       # CHR    -->  Z3SS   CH                 
      3.56363598E-04    2      1000035         4                       # CHR    -->  Z4SS   CH                 
      9.01077747E-01    2      1000021         4                       # CHR    -->  GLSS   CH                 
#         PDG         Width
DECAY   2000005  1.80755653E+01   # BT2   decays
#          BR          NDA       ID1       ID2       ID3       ID4
      2.66010109E-02    2      1000022         5                       # BT2    -->  Z1SS   BT                 
      2.02760159E-04    2      1000023         5                       # BT2    -->  Z2SS   BT                 
      4.74845030E-04    2      1000025         5                       # BT2    -->  Z3SS   BT                 
      5.61312132E-04    2      1000035         5                       # BT2    -->  Z4SS   BT                 
      9.70224321E-01    2      1000021         5                       # BT2    -->  GLSS   BT                 
      1.52951161E-05    2     -1000024         6                       # BT2    -->  W1SS-  TP                 
      1.16679654E-03    2     -1000037         6                       # BT2    -->  W2SS-  TP                 
      2.08794649E-04    2          -24   1000006                       # BT2    -->  W-     TP1                
      4.83021613E-05    2          -24   2000006                       # BT2    -->  W-     TP2                
      5.72085264E-05    2           23   1000005                       # BT2    -->  Z0     BT1                
      4.39335039E-04    2           25   1000005                       # BT2    -->  HL0    BT1                
#         PDG         Width
DECAY   2000006  1.48132477E+01   # TP2   decays
#          BR          NDA       ID1       ID2       ID3       ID4
      1.26818284E-01    2      1000021         6                       # TP2    -->  GLSS   TP                 
      3.19160134E-01    2      1000024         5                       # TP2    -->  W1SS+  BT                 
      3.81373540E-02    2      1000037         5                       # TP2    -->  W2SS+  BT                 
      6.98665977E-02    2           23   1000006                       # TP2    -->  Z0     TP1                
      8.57338831E-02    2           25   1000006                       # TP2    -->  HL0    TP1                
      5.49620017E-03    2      1000022         6                       # TP2    -->  Z1SS   TP                 
      1.45527408E-01    2      1000023         6                       # TP2    -->  Z2SS   TP                 
      7.53114522E-02    2      1000025         6                       # TP2    -->  Z3SS   TP                 
      1.33948728E-01    2      1000035         6                       # TP2    -->  Z4SS   TP                 
#         PDG         Width
DECAY   1000011  9.53823090E+00   # EL-   decays
#          BR          NDA       ID1       ID2       ID3       ID4
      7.66811147E-02    2      1000022        11                       # EL-    -->  Z1SS   E-                 
      3.25167358E-01    2      1000023        11                       # EL-    -->  Z2SS   E-                 
      1.32605128E-04    2      1000025        11                       # EL-    -->  Z3SS   E-                 
      2.56443815E-03    2      1000035        11                       # EL-    -->  Z4SS   E-                 
      5.81597865E-01    2     -1000024        12                       # EL-    -->  W1SS-  NUE                
      1.38566429E-02    2     -1000037        12                       # EL-    -->  W2SS-  NUE                
#         PDG         Width
DECAY   1000013  9.53823090E+00   # MUL-  decays
#          BR          NDA       ID1       ID2       ID3       ID4
      7.66811147E-02    2      1000022        13                       # MUL-   -->  Z1SS   MU-                
      3.25167358E-01    2      1000023        13                       # MUL-   -->  Z2SS   MU-                
      1.32605128E-04    2      1000025        13                       # MUL-   -->  Z3SS   MU-                
      2.56443792E-03    2      1000035        13                       # MUL-   -->  Z4SS   MU-                
      5.81597865E-01    2     -1000024        14                       # MUL-   -->  W1SS-  NUM                
      1.38566429E-02    2     -1000037        14                       # MUL-   -->  W2SS-  NUM                
#         PDG         Width
DECAY   1000015  4.01120615E+00   # TAU1- decays
#          BR          NDA       ID1       ID2       ID3       ID4
      8.99882376E-01    2      1000022        15                       # TAU1-  -->  Z1SS   TAU-               
      3.86729389E-02    2      1000023        15                       # TAU1-  -->  Z2SS   TAU-               
      6.34787255E-04    2      1000025        15                       # TAU1-  -->  Z3SS   TAU-               
      1.86221348E-03    2      1000035        15                       # TAU1-  -->  Z4SS   TAU-               
      5.89442924E-02    2     -1000024        16                       # TAU1-  -->  W1SS-  NUT                
      3.37718416E-06    2     -1000037        16                       # TAU1-  -->  W2SS-  NUT                
#         PDG         Width
DECAY   1000012  9.58800697E+00   # NUEL  decays
#          BR          NDA       ID1       ID2       ID3       ID4
      1.22540511E-01    2      1000022        12                       # NUEL   -->  Z1SS   NUE                
      2.64636993E-01    2      1000023        12                       # NUEL   -->  Z2SS   NUE                
      5.59112814E-04    2      1000025        12                       # NUEL   -->  Z3SS   NUE                
      6.65287441E-03    2      1000035        12                       # NUEL   -->  Z4SS   NUE                
      6.00499630E-01    2      1000024        11                       # NUEL   -->  W1SS+  E-                 
      5.11085615E-03    2      1000037        11                       # NUEL   -->  W2SS+  E-                 
#         PDG         Width
DECAY   1000014  9.58800697E+00   # NUML  decays
#          BR          NDA       ID1       ID2       ID3       ID4
      1.22540519E-01    2      1000022        14                       # NUML   -->  Z1SS   NUM                
      2.64637023E-01    2      1000023        14                       # NUML   -->  Z2SS   NUM                
      5.59112872E-04    2      1000025        14                       # NUML   -->  Z3SS   NUM                
      6.65287487E-03    2      1000035        14                       # NUML   -->  Z4SS   NUM                
      6.00499630E-01    2      1000024        13                       # NUML   -->  W1SS+  MU-                
      5.11085615E-03    2      1000037        13                       # NUML   -->  W2SS+  MU-                
#         PDG         Width
DECAY   1000016  9.58899307E+00   # NUTL  decays
#          BR          NDA       ID1       ID2       ID3       ID4
      1.22477934E-01    2      1000022        16                       # NUTL   -->  Z1SS   NUT                
      2.64487416E-01    2      1000023        16                       # NUTL   -->  Z2SS   NUT                
      5.58211468E-04    2      1000025        16                       # NUTL   -->  Z3SS   NUT                
      6.64117839E-03    2      1000035        16                       # NUTL   -->  Z4SS   NUT                
      6.00236356E-01    2      1000024        15                       # NUTL   -->  W1SS+  TAU-               
      5.59890270E-03    2      1000037        15                       # NUTL   -->  W2SS+  TAU-               
      1.23339308E-11    3      1000015        16       -15             # NUTL   -->  TAU1-  NUT    TAU+        
      1.23339290E-11    3      1000015        12       -11             # NUTL   -->  TAU1-  NUE    E+          
      1.23339290E-11    3      1000015        14       -13             # NUTL   -->  TAU1-  NUM    MU+         
      3.70017905E-11    3      1000015         2        -1             # NUTL   -->  TAU1-  UP     DB          
      3.70017905E-11    3      1000015         4        -3             # NUTL   -->  TAU1-  CH     SB          
#         PDG         Width
DECAY   2000011  3.76160145E+00   # ER-   decays
#          BR          NDA       ID1       ID2       ID3       ID4
      9.90115702E-01    2      1000022        11                       # ER-    -->  Z1SS   E-                 
      7.05650169E-03    2      1000023        11                       # ER-    -->  Z2SS   E-                 
      3.72262613E-04    2      1000025        11                       # ER-    -->  Z3SS   E-                 
      2.45556049E-03    2      1000035        11                       # ER-    -->  Z4SS   E-                 
#         PDG         Width
DECAY   2000013  3.76160145E+00   # MUR-  decays
#          BR          NDA       ID1       ID2       ID3       ID4
      9.90115702E-01    2      1000022        13                       # MUR-   -->  Z1SS   MU-                
      7.05650076E-03    2      1000023        13                       # MUR-   -->  Z2SS   MU-                
      3.72262584E-04    2      1000025        13                       # MUR-   -->  Z3SS   MU-                
      2.45556026E-03    2      1000035        13                       # MUR-   -->  Z4SS   MU-                
#         PDG         Width
DECAY   2000015  9.29436874E+00   # TAU2- decays
#          BR          NDA       ID1       ID2       ID3       ID4
      9.05660987E-02    2      1000022        15                       # TAU2-  -->  Z1SS   TAU-               
      3.19707543E-01    2      1000023        15                       # TAU2-  -->  Z2SS   TAU-               
      5.83494606E-04    2      1000025        15                       # TAU2-  -->  Z3SS   TAU-               
      3.33499443E-03    2      1000035        15                       # TAU2-  -->  Z4SS   TAU-               
      5.71087241E-01    2     -1000024        16                       # TAU2-  -->  W1SS-  NUT                
      1.47206597E-02    2     -1000037        16                       # TAU2-  -->  W2SS-  NUT                
#         PDG         Width
DECAY   1000023  1.86836542E-06   # Z2SS  decays
#          BR          NDA       ID1       ID2       ID3       ID4
      5.73374791E-06    2      1000022        22                       # Z2SS   -->  Z1SS   GM                 
      1.32189199E-01    3      1000022         2        -2             # Z2SS   -->  Z1SS   UP     UB          
      1.82375550E-01    3      1000022         1        -1             # Z2SS   -->  Z1SS   DN     DB          
      1.82375550E-01    3      1000022         3        -3             # Z2SS   -->  Z1SS   ST     SB          
      1.32189155E-01    3      1000022         4        -4             # Z2SS   -->  Z1SS   CH     CB          
      2.01523647E-01    3      1000022         5        -5             # Z2SS   -->  Z1SS   BT     BB          
      1.85804740E-02    3      1000022        11       -11             # Z2SS   -->  Z1SS   E-     E+          
      1.85804740E-02    3      1000022        13       -13             # Z2SS   -->  Z1SS   MU-    MU+         
      2.04104222E-02    3      1000022        15       -15             # Z2SS   -->  Z1SS   TAU-   TAU+        
      3.72634865E-02    3      1000022        12       -12             # Z2SS   -->  Z1SS   NUE    ANUE        
      3.72634865E-02    3      1000022        14       -14             # Z2SS   -->  Z1SS   NUM    ANUM        
      3.72428559E-02    3      1000022        16       -16             # Z2SS   -->  Z1SS   NUT    ANUT        
#         PDG         Width
DECAY   1000025  3.98423004E+00   # Z3SS  decays
#          BR          NDA       ID1       ID2       ID3       ID4
      3.16737044E-07    2      1000022        22                       # Z3SS   -->  Z1SS   GM                 
      2.32239074E-07    2      1000023        22                       # Z3SS   -->  Z2SS   GM                 
      3.06787938E-01    2      1000024       -24                       # Z3SS   -->  W1SS+  W-                 
      3.06787938E-01    2     -1000024        24                       # Z3SS   -->  W1SS-  W+                 
      9.87893417E-02    2      1000022        23                       # Z3SS   -->  Z1SS   Z0                 
      2.59126425E-01    2      1000023        23                       # Z3SS   -->  Z2SS   Z0                 
      4.85911977E-09    3      1000022         2        -2             # Z3SS   -->  Z1SS   UP     UB          
      3.10004600E-09    3      1000022         1        -1             # Z3SS   -->  Z1SS   DN     DB          
      3.10004600E-09    3      1000022         3        -3             # Z3SS   -->  Z1SS   ST     SB          
      4.85909135E-09    3      1000022         4        -4             # Z3SS   -->  Z1SS   CH     CB          
      5.17743359E-08    3      1000022         5        -5             # Z3SS   -->  Z1SS   BT     BB          
      1.82158093E-08    3      1000022        11       -11             # Z3SS   -->  Z1SS   E-     E+          
      1.82158093E-08    3      1000022        13       -13             # Z3SS   -->  Z1SS   MU-    MU+         
      8.52965982E-08    3      1000022        15       -15             # Z3SS   -->  Z1SS   TAU-   TAU+        
      1.76646680E-08    3      1000022        12       -12             # Z3SS   -->  Z1SS   NUE    ANUE        
      1.76646680E-08    3      1000022        14       -14             # Z3SS   -->  Z1SS   NUM    ANUM        
      1.76999624E-08    3      1000022        16       -16             # Z3SS   -->  Z1SS   NUT    ANUT        
      1.45371013E-08    3      1000023         2        -2             # Z3SS   -->  Z2SS   UP     UB          
      2.13941984E-08    3      1000023         1        -1             # Z3SS   -->  Z2SS   DN     DB          
      2.13941984E-08    3      1000023         3        -3             # Z3SS   -->  Z2SS   ST     SB          
      1.45370169E-08    3      1000023         4        -4             # Z3SS   -->  Z2SS   CH     CB          
      2.10591168E-07    3      1000023         5        -5             # Z3SS   -->  Z2SS   BT     BB          
      5.82733461E-09    3      1000023        11       -11             # Z3SS   -->  Z2SS   E-     E+          
      5.82733461E-09    3      1000023        13       -13             # Z3SS   -->  Z2SS   MU-    MU+         
      3.36450370E-08    3      1000023        15       -15             # Z3SS   -->  Z2SS   TAU-   TAU+        
      2.09213038E-08    3      1000023        12       -12             # Z3SS   -->  Z2SS   NUE    ANUE        
      2.09213038E-08    3      1000023        14       -14             # Z3SS   -->  Z2SS   NUM    ANUM        
      2.09645989E-08    3      1000023        16       -16             # Z3SS   -->  Z2SS   NUT    ANUT        
      1.21201575E-02    2      1000022        25                       # Z3SS   -->  Z1SS   HL0                
      1.63869932E-02    2      1000023        25                       # Z3SS   -->  Z2SS   HL0                
#         PDG         Width
DECAY   1000035  4.09395075E+00   # Z4SS  decays
#          BR          NDA       ID1       ID2       ID3       ID4
      9.90910621E-07    2      1000022        22                       # Z4SS   -->  Z1SS   GM                 
      3.24615172E-07    2      1000023        22                       # Z4SS   -->  Z2SS   GM                 
      6.07006168E-10    2      1000025        22                       # Z4SS   -->  Z3SS   GM                 
      3.25091869E-01    2      1000024       -24                       # Z4SS   -->  W1SS+  W-                 
      3.25091869E-01    2     -1000024        24                       # Z4SS   -->  W1SS-  W+                 
      1.12797280E-11    3     -1000037         2        -1             # Z4SS   -->  W2SS-  UP     DB          
      3.75990905E-12    3     -1000037        12       -11             # Z4SS   -->  W2SS-  NUE    E+          
      3.75990905E-12    3     -1000037        14       -13             # Z4SS   -->  W2SS-  NUM    MU+         
      1.12797280E-11    3      1000037         1        -2             # Z4SS   -->  W2SS+  DN     UB          
      3.75990905E-12    3      1000037        11       -12             # Z4SS   -->  W2SS+  E-     ANUE        
      3.75990905E-12    3      1000037        13       -14             # Z4SS   -->  W2SS+  MU-    ANUM        
      1.26636429E-02    2      1000022        23                       # Z4SS   -->  Z1SS   Z0                 
      1.78798437E-02    2      1000023        23                       # Z4SS   -->  Z2SS   Z0                 
      7.81535618E-08    3      1000022         2        -2             # Z4SS   -->  Z1SS   UP     UB          
      8.57331273E-08    3      1000022         1        -1             # Z4SS   -->  Z1SS   DN     DB          
      8.57331273E-08    3      1000022         3        -3             # Z4SS   -->  Z1SS   ST     SB          
      7.81531000E-08    3      1000022         4        -4             # Z4SS   -->  Z1SS   CH     CB          
      2.39642759E-07    3      1000022         5        -5             # Z4SS   -->  Z1SS   BT     BB          
      3.30360109E-07    3      1000022        11       -11             # Z4SS   -->  Z1SS   E-     E+          
      3.30360109E-07    3      1000022        13       -13             # Z4SS   -->  Z1SS   MU-    MU+         
      4.03167832E-07    3      1000022        15       -15             # Z4SS   -->  Z1SS   TAU-   TAU+        
      4.56944264E-07    3      1000022        12       -12             # Z4SS   -->  Z1SS   NUE    ANUE        
      4.56944264E-07    3      1000022        14       -14             # Z4SS   -->  Z1SS   NUM    ANUM        
      4.57844607E-07    3      1000022        16       -16             # Z4SS   -->  Z1SS   NUT    ANUT        
      6.59530485E-07    3      1000023         2        -2             # Z4SS   -->  Z2SS   UP     UB          
      8.37354833E-07    3      1000023         1        -1             # Z4SS   -->  Z2SS   DN     DB          
      8.37354833E-07    3      1000023         3        -3             # Z4SS   -->  Z2SS   ST     SB          
      6.59527018E-07    3      1000023         4        -4             # Z4SS   -->  Z2SS   CH     CB          
      2.20323113E-06    3      1000023         5        -5             # Z4SS   -->  Z2SS   BT     BB          
      3.27291843E-07    3      1000023        11       -11             # Z4SS   -->  Z2SS   E-     E+          
      3.27291843E-07    3      1000023        13       -13             # Z4SS   -->  Z2SS   MU-    MU+         
      3.56475908E-07    3      1000023        15       -15             # Z4SS   -->  Z2SS   TAU-   TAU+        
      7.28902648E-07    3      1000023        12       -12             # Z4SS   -->  Z2SS   NUE    ANUE        
      7.28902648E-07    3      1000023        14       -14             # Z4SS   -->  Z2SS   NUM    ANUM        
      7.30380975E-07    3      1000023        16       -16             # Z4SS   -->  Z2SS   NUT    ANUT        
      4.72589683E-08    3      1000025         2        -2             # Z4SS   -->  Z3SS   UP     UB          
      6.09790689E-08    3      1000025         1        -1             # Z4SS   -->  Z3SS   DN     DB          
      6.09790689E-08    3      1000025         3        -3             # Z4SS   -->  Z3SS   ST     SB          
      4.72589683E-08    3      1000025         4        -4             # Z4SS   -->  Z3SS   CH     CB          
      2.38231674E-08    3      1000025         5        -5             # Z4SS   -->  Z3SS   BT     BB          
      1.38329597E-08    3      1000025        11       -11             # Z4SS   -->  Z3SS   E-     E+          
      1.38329597E-08    3      1000025        13       -13             # Z4SS   -->  Z3SS   MU-    MU+         
      1.20690817E-08    3      1000025        15       -15             # Z4SS   -->  Z3SS   TAU-   TAU+        
      2.74946395E-08    3      1000025        12       -12             # Z4SS   -->  Z3SS   NUE    ANUE        
      2.74946395E-08    3      1000025        14       -14             # Z4SS   -->  Z3SS   NUM    ANUM        
      2.74946128E-08    3      1000025        16       -16             # Z4SS   -->  Z3SS   NUT    ANUT        
      8.75575617E-02    2      1000022        25                       # Z4SS   -->  Z1SS   HL0                
      2.31702164E-01    2      1000023        25                       # Z4SS   -->  Z2SS   HL0                
#         PDG         Width
DECAY   1000024  1.18135125E-04   # W1SS+ decays
#          BR          NDA       ID1       ID2       ID3       ID4
      3.34683627E-01    3      1000022         2        -1             # W1SS+  -->  Z1SS   UP     DB          
      3.34683627E-01    3      1000022         4        -3             # W1SS+  -->  Z1SS   CH     SB          
      1.10211082E-01    3      1000022       -11        12             # W1SS+  -->  Z1SS   E+     NUE         
      1.10211082E-01    3      1000022       -13        14             # W1SS+  -->  Z1SS   MU+    NUM         
      1.10210575E-01    3      1000022       -15        16             # W1SS+  -->  Z1SS   TAU+   NUT         
#         PDG         Width
DECAY   1000037  4.05240345E+00   # W2SS+ decays
#          BR          NDA       ID1       ID2       ID3       ID4
      1.04667336E-07    3      1000022         2        -1             # W2SS+  -->  Z1SS   UP     DB          
      1.04667279E-07    3      1000022         4        -3             # W2SS+  -->  Z1SS   CH     SB          
      4.38612318E-07    3      1000022       -11        12             # W2SS+  -->  Z1SS   E+     NUE         
      4.38612318E-07    3      1000022       -13        14             # W2SS+  -->  Z1SS   MU+    NUM         
      5.16561840E-07    3      1000022       -15        16             # W2SS+  -->  Z1SS   TAU+   NUT         
      6.38741031E-02    2      1000022        24                       # W2SS+  -->  Z1SS   W+                 
      7.56036115E-07    3      1000023         2        -1             # W2SS+  -->  Z2SS   UP     DB          
      7.56035206E-07    3      1000023         4        -3             # W2SS+  -->  Z2SS   CH     SB          
      5.82608152E-07    3      1000023       -11        12             # W2SS+  -->  Z2SS   E+     NUE         
      5.82608152E-07    3      1000023       -13        14             # W2SS+  -->  Z2SS   MU+    NUM         
      6.09201436E-07    3      1000023       -15        16             # W2SS+  -->  Z2SS   TAU+   NUT         
      3.41325819E-01    2      1000023        24                       # W2SS+  -->  Z2SS   W+                 
      7.65766899E-08    3      1000025         2        -1             # W2SS+  -->  Z3SS   UP     DB          
      7.65766899E-08    3      1000025         4        -3             # W2SS+  -->  Z3SS   CH     SB          
      2.55220751E-08    3      1000025       -11        12             # W2SS+  -->  Z3SS   E+     NUE         
      2.55220751E-08    3      1000025       -13        14             # W2SS+  -->  Z3SS   MU+    NUM         
      2.55232493E-08    3      1000025       -15        16             # W2SS+  -->  Z3SS   TAU+   NUT         
      3.14515740E-01    2      1000024        23                       # W2SS+  -->  W1SS+  Z0                 
      6.48373884E-07    3      1000024         1        -1             # W2SS+  -->  W1SS+  DN     DB          
      6.48370246E-07    3      1000024         3        -3             # W2SS+  -->  W1SS+  ST     SB          
      1.61990010E-06    3      1000024         2        -2             # W2SS+  -->  W1SS+  UP     UB          
      1.61990010E-06    3      1000024         4        -4             # W2SS+  -->  W1SS+  CH     CB          
      1.12644443E-06    3      1000024        12       -12             # W2SS+  -->  W1SS+  NUE    ANUE        
      1.12644443E-06    3      1000024        14       -14             # W2SS+  -->  W1SS+  NUM    ANUM        
      1.20757568E-06    3      1000024        16       -16             # W2SS+  -->  W1SS+  NUT    ANUT        
      4.54149131E-07    3      1000024        11       -11             # W2SS+  -->  W1SS+  E-     E+          
      4.54149131E-07    3      1000024        13       -13             # W2SS+  -->  W1SS+  MU-    MU+         
      4.55080794E-07    3      1000024        15       -15             # W2SS+  -->  W1SS+  TAU-   TAU+        
      2.80269861E-01    2      1000024        25                       # W2SS+  -->  W1SS+  HL0                
#         PDG         Width
DECAY        25  3.36626428E-03   # HL0   decays
#          BR          NDA       ID1       ID2       ID3       ID4
      5.07450171E-09    2           11       -11                       # HL0    -->  E-     E+                 
      2.14253116E-04    2           13       -13                       # HL0    -->  MU-    MU+                
      6.12433255E-02    2           15       -15                       # HL0    -->  TAU-   TAU+               
      6.38535130E-06    2            1        -1                       # HL0    -->  DN     DB                 
      2.58000032E-03    2            3        -3                       # HL0    -->  ST     SB                 
      8.65797162E-01    2            5        -5                       # HL0    -->  BT     BB                 
      1.97298277E-06    2            2        -2                       # HL0    -->  UP     UB                 
      3.81117016E-02    2            4        -4                       # HL0    -->  CH     CB                 
      1.24514534E-03    2           22        22                       # HL0    -->  GM     GM                 
      2.85316408E-02    2           21        21                       # HL0    -->  GL     GL                 
      1.26024155E-04    3           24        11       -12             # HL0    -->  W+     E-     ANUE        
      1.26024155E-04    3           24        13       -14             # HL0    -->  W+     MU-    ANUM        
      1.26024155E-04    3           24        15       -16             # HL0    -->  W+     TAU-   ANUT        
      3.78072436E-04    3           24        -2         1             # HL0    -->  W+     UB     DN          
      3.78072436E-04    3           24        -4         3             # HL0    -->  W+     CB     ST          
      1.26024155E-04    3          -24       -11        12             # HL0    -->  W-     E+     NUE         
      1.26024155E-04    3          -24       -13        14             # HL0    -->  W-     MU+    NUM         
      1.26024155E-04    3          -24       -15        16             # HL0    -->  W-     TAU+   NUT         
      3.78072436E-04    3          -24         2        -1             # HL0    -->  W-     UP     DB          
      3.78072436E-04    3          -24         4        -3             # HL0    -->  W-     CH     SB          
#         PDG         Width
DECAY        35  1.23486795E+01   # HH0   decays
#          BR          NDA       ID1       ID2       ID3       ID4
      1.20449886E-10    2           11       -11                       # HH0    -->  E-     E+                 
      5.08561197E-06    2           13       -13                       # HH0    -->  MU-    MU+                
      1.45656825E-03    2           15       -15                       # HH0    -->  TAU-   TAU+               
      1.47589645E-07    2            1        -1                       # HH0    -->  DN     DB                 
      5.96336904E-05    2            3        -3                       # HH0    -->  ST     SB                 
      8.63482524E-03    2            5        -5                       # HH0    -->  BT     BB                 
      6.03731565E-10    2            2        -2                       # HH0    -->  UP     UB                 
      8.53353231E-06    2            4        -4                       # HH0    -->  CH     CB                 
      3.85258645E-01    2            6        -6                       # HH0    -->  TP     TB                 
      3.57259296E-06    2           22        22                       # HH0    -->  GM     GM                 
      2.94659898E-04    2           21        21                       # HH0    -->  GL     GL                 
      6.54454401E-04    2           24       -24                       # HH0    -->  W+     W-                 
      3.32045602E-04    2           23        23                       # HH0    -->  Z0     Z0                 
      1.48992229E-03    2      1000022   1000022                       # HH0    -->  Z1SS   Z1SS               
      7.08409864E-03    2      1000022   1000023                       # HH0    -->  Z1SS   Z2SS               
      5.76519072E-02    2      1000022   1000025                       # HH0    -->  Z1SS   Z3SS               
      8.20918009E-03    2      1000022   1000035                       # HH0    -->  Z1SS   Z4SS               
      8.24815594E-03    2      1000023   1000023                       # HH0    -->  Z2SS   Z2SS               
      1.35802180E-01    2      1000023   1000025                       # HH0    -->  Z2SS   Z3SS               
      1.46866366E-02    2      1000023   1000035                       # HH0    -->  Z2SS   Z4SS               
      2.00218037E-02    2      1000024  -1000024                       # HH0    -->  W1SS+  W1SS-              
      1.74047902E-01    2      1000024  -1000037                       # HH0    -->  W1SS+  W2SS-              
      1.74047902E-01    2     -1000024   1000037                       # HH0    -->  W1SS-  W2SS+              
      2.00212398E-03    2           25        25                       # HH0    -->  HL0    HL0                
#         PDG         Width
DECAY        36  1.23562679E+01   # HA0   decays
#          BR          NDA       ID1       ID2       ID3       ID4
      1.19812590E-10    2           11       -11                       # HA0    -->  E-     E+                 
      5.05870366E-06    2           13       -13                       # HA0    -->  MU-    MU+                
      1.44888053E-03    2           15       -15                       # HA0    -->  TAU-   TAU+               
      1.46818834E-07    2            1        -1                       # HA0    -->  DN     DB                 
      5.93222467E-05    2            3        -3                       # HA0    -->  ST     SB                 
      8.59013945E-03    2            5        -5                       # HA0    -->  BT     BB                 
      5.79966186E-10    2            2        -2                       # HA0    -->  UP     UB                 
      8.20563764E-06    2            4        -4                       # HA0    -->  CH     CB                 
      4.14561450E-01    2            6        -6                       # HA0    -->  TP     TB                 
      8.06264097E-07    2           22        22                       # HA0    -->  GM     GM                 
      2.95897451E-04    2           21        21                       # HA0    -->  GL     GL                 
      2.94957939E-03    2      1000022   1000022                       # HA0    -->  Z1SS   Z1SS               
      1.58204120E-02    2      1000022   1000023                       # HA0    -->  Z1SS   Z2SS               
      1.03408126E-02    2      1000022   1000025                       # HA0    -->  Z1SS   Z3SS               
      4.66040149E-02    2      1000022   1000035                       # HA0    -->  Z1SS   Z4SS               
      2.11537238E-02    2      1000023   1000023                       # HA0    -->  Z2SS   Z2SS               
      1.87511966E-02    2      1000023   1000025                       # HA0    -->  Z2SS   Z3SS               
      1.07732184E-01    2      1000023   1000035                       # HA0    -->  Z2SS   Z4SS               
      5.10605127E-02    2      1000024  -1000024                       # HA0    -->  W1SS+  W1SS-              
      1.49991140E-01    2      1000024  -1000037                       # HA0    -->  W1SS+  W2SS-              
      1.49991140E-01    2     -1000024   1000037                       # HA0    -->  W1SS-  W2SS+              
      6.35375094E-04    2           25        23                       # HA0    -->  HL0    Z0                 
#         PDG         Width
DECAY        37  1.21547699E+01   # H+    decays
#          BR          NDA       ID1       ID2       ID3       ID4
      1.23002622E-10    2           12       -11                       # H+     -->  NUE    E+                 
      5.19339255E-06    2           14       -13                       # H+     -->  NUM    MU+                
      1.48745731E-03    2           16       -15                       # H+     -->  NUT    TAU+               
      1.39051721E-07    2            2        -1                       # H+     -->  UP     DB                 
      6.36945260E-05    2            4        -3                       # H+     -->  CH     SB                 
      3.89390290E-01    2            6        -5                       # H+     -->  TP     BB                 
      1.99406054E-02    2      1000024   1000022                       # H+     -->  W1SS+  Z1SS               
      1.38671108E-04    2      1000024   1000023                       # H+     -->  W1SS+  Z2SS               
      1.79723755E-01    2      1000024   1000025                       # H+     -->  W1SS+  Z3SS               
      1.72947600E-01    2      1000024   1000035                       # H+     -->  W1SS+  Z4SS               
      3.47403809E-02    2      1000037   1000022                       # H+     -->  W2SS+  Z1SS               
      2.00900927E-01    2      1000037   1000023                       # H+     -->  W2SS+  Z2SS               
      6.61306200E-04    2           25        24                       # H+     -->  HL0    W+                 
