  65
  401    403.8563    0.22691E-24
  402    396.8215    0.23385E-24
  403    403.8563    0.22691E-24
  404    396.8238    0.23385E-24
  405    390.2925    0.90066E-24
  406    388.3788    0.44016E-24
  407    403.8563    0.22691E-24
  408    396.8215    0.23385E-24
  409    403.8563    0.22691E-24
  410    396.8238    0.23385E-24
  411    390.2925    0.90066E-24
  412    388.3788    0.44016E-24
  413    400.7083    0.33181E-23
  414    398.5796    0.83515E-24
  415    400.7084    0.33181E-23
  416    398.5818    0.83517E-24
  417    413.9519    0.60340E-24
  418    459.9644    0.42308E-24
  419    400.7083    0.33181E-23
  420    398.5796    0.83515E-24
  421    400.7084    0.33181E-23
  422    398.5818    0.83517E-24
  423    413.9519    0.60340E-24
  424    459.9644    0.42308E-24
  425    156.4146    0.10495E-22
  426    137.2332    0.15657E-22
  427    156.4147    0.10495E-22
  428    137.2332    0.15657E-22
  429    136.9109    0.67757E-23
  430    137.2332    0.15657E-22
  431    156.4146    0.10495E-22
  432    137.2332    0.15657E-22
  433    156.4147    0.10495E-22
  434    137.2332    0.15657E-22
  435    136.9109    0.67757E-23
  436    137.2332    0.15657E-22
  437    155.5683    0.24253E-23
  438      0.0000    0.10000E+31
  439    155.5684    0.24253E-23
  440      0.0000    0.10000E+31
  441    172.9987    0.28587E-23
  442      0.0000    0.10000E+31
  443    155.5683    0.24253E-23
  444      0.0000    0.10000E+31
  445    155.5684    0.24253E-23
  446      0.0000    0.10000E+31
  447    172.9987    0.28587E-23
  448      0.0000    0.10000E+31
  449   3000.0000    0.91667E-27
  450     99.9758    0.10000E+31
  451    199.9117    0.61099E-24
  452   -802.2791    0.26021E-25
  453    809.9247    0.24298E-25
  454    199.8060    0.60474E-24
  455    809.6004    0.23781E-25
  456    199.8060    0.60474E-24
  457    809.6004    0.23781E-25
  203     95.7448    0.18403E-21
  204    504.9943    0.55870E-24
  205    500.0000    0.38378E-24
  206    509.0668    0.50172E-24
  207    509.0668    0.50172E-24
  458      0.0000    0.10000E+31
    6    172.5000    0.57395E-24
   12    172.5000    0.57395E-24
   3
   401  0.22622716E-01     0   450     1     0     0     0
   401  0.32482591E+00     0   451     1     0     0     0
   401  0.65255135E+00     0   456     2     0     0     0
   3
   402  0.12709808E-01     0   450     2     0     0     0
   402  0.32945973E+00     0   451     2     0     0     0
   402  0.65783048E+00     0   454     1     0     0     0
   3
   403  0.22623291E-01     0   450     3     0     0     0
   403  0.32483423E+00     0   451     3     0     0     0
   403  0.65254253E+00     0   456     4     0     0     0
   3
   404  0.12709570E-01     0   450     4     0     0     0
   404  0.32945067E+00     0   451     4     0     0     0
   404  0.65783972E+00     0   454     3     0     0     0
   3
   405  0.19478236E+00     0   450     5     0     0     0
   405  0.53462678E+00     0   451     5     0     0     0
   405  0.27059087E+00     0   456     6     0     0     0
   3
   406  0.18431409E+00     0   450     6     0     0     0
   406  0.90722576E-01     0   451     6     0     0     0
   406  0.72496331E+00     0   454     5     0     0     0
   3
   407  0.22622716E-01     0   450     7     0     0     0
   407  0.32482591E+00     0   451     7     0     0     0
   407  0.65255135E+00     0   454     8     0     0     0
   3
   408  0.12709808E-01     0   450     8     0     0     0
   408  0.32945973E+00     0   451     8     0     0     0
   408  0.65783048E+00     0   456     7     0     0     0
   3
   409  0.22623291E-01     0   450     9     0     0     0
   409  0.32483423E+00     0   451     9     0     0     0
   409  0.65254253E+00     0   454    10     0     0     0
   3
   410  0.12709570E-01     0   450    10     0     0     0
   410  0.32945067E+00     0   451    10     0     0     0
   410  0.65783972E+00     0   456     9     0     0     0
   3
   411  0.19478236E+00     0   450    11     0     0     0
   411  0.53462678E+00     0   451    11     0     0     0
   411  0.27059087E+00     0   454    12     0     0     0
   3
   412  0.18431409E+00     0   450    12     0     0     0
   412  0.90722576E-01     0   451    12     0     0     0
   412  0.72496331E+00     0   456    11     0     0     0
   2
   413  0.99926436E+00     0   450     1     0     0     0
   413  0.73560933E-03     0   451     1     0     0     0
   2
   414  0.99926853E+00     0   450     2     0     0     0
   414  0.73143956E-03     0   451     2     0     0     0
   2
   415  0.99926436E+00     0   450     3     0     0     0
   415  0.73560933E-03     0   451     3     0     0     0
   2
   416  0.99926859E+00     0   450     4     0     0     0
   416  0.73143333E-03     0   451     4     0     0     0
   3
   417  0.11072288E+00     0   450     5     0     0     0
   417  0.50249249E+00     0   451     5     0     0     0
   417  0.38678464E+00     0   456     6     0     0     0
   3
   418  0.64022708E+00     0   454     5     0     0     0
   418  0.18947974E+00     0   450     6     0     0     0
   418  0.17029320E+00     0   451     6     0     0     0
   2
   419  0.99926436E+00     0   450     7     0     0     0
   419  0.73560933E-03     0   451     7     0     0     0
   2
   420  0.99926853E+00     0   450     8     0     0     0
   420  0.73143956E-03     0   451     8     0     0     0
   2
   421  0.99926436E+00     0   450     9     0     0     0
   421  0.73560933E-03     0   451     9     0     0     0
   2
   422  0.99926859E+00     0   450    10     0     0     0
   422  0.73143333E-03     0   451    10     0     0     0
   3
   423  0.11072288E+00     0   450    11     0     0     0
   423  0.50249249E+00     0   451    11     0     0     0
   423  0.38678464E+00     0   454    12     0     0     0
   3
   424  0.64022708E+00     0   456    11     0     0     0
   424  0.18947974E+00     0   450    12     0     0     0
   424  0.17029320E+00     0   451    12     0     0     0
   1
   425  0.10000000E+01     0   450   121     0     0     0
   1
   426  0.10000000E+01     0   450   122     0     0     0
   1
   427  0.10000000E+01     0   450   123     0     0     0
   1
   428  0.10000000E+01     0   450   124     0     0     0
   1
   429  0.10000000E+01     0   450   125     0     0     0
   1
   430  0.10000000E+01     0   450   126     0     0     0
   1
   431  0.10000000E+01     0   450   127     0     0     0
   1
   432  0.10000000E+01     0   450   128     0     0     0
   1
   433  0.10000000E+01     0   450   129     0     0     0
   1
   434  0.10000000E+01     0   450   130     0     0     0
   1
   435  0.10000000E+01     0   450   131     0     0     0
   1
   436  0.10000000E+01     0   450   132     0     0     0
   1
   437  0.10000000E+01     0   450   121     0     0     0
   0
   1
   439  0.10000000E+01     0   450   123     0     0     0
   0
   1
   441  0.10000000E+01     0   450   125     0     0     0
   0
   1
   443  0.10000000E+01     0   450   127     0     0     0
   0
   1
   445  0.10000000E+01     0   450   129     0     0     0
   0
   1
   447  0.10000000E+01     0   450   131     0     0     0
   0
  24
   449  0.41730564E-01     0   408     2     0     0     0
   449  0.41730564E-01     0   402     8     0     0     0
   449  0.41677419E-01     0   407     1     0     0     0
   449  0.41677419E-01     0   401     7     0     0     0
   449  0.41717365E-01     0   420     2     0     0     0
   449  0.41717365E-01     0   414     8     0     0     0
   449  0.41701309E-01     0   419     1     0     0     0
   449  0.41701309E-01     0   413     7     0     0     0
   449  0.41677419E-01     0   409     3     0     0     0
   449  0.41677419E-01     0   403     9     0     0     0
   449  0.41701309E-01     0   421     3     0     0     0
   449  0.41701309E-01     0   415     9     0     0     0
   449  0.41730545E-01     0   410     4     0     0     0
   449  0.41730545E-01     0   404    10     0     0     0
   449  0.41717347E-01     0   422     4     0     0     0
   449  0.41717347E-01     0   416    10     0     0     0
   449  0.41638687E-01     0   411     5     0     0     0
   449  0.41638687E-01     0   405    11     0     0     0
   449  0.41739665E-01     0   423     5     0     0     0
   449  0.41739665E-01     0   417    11     0     0     0
   449  0.36918011E-01     0   412     6     0     0     0
   449  0.36918011E-01     0   406    12     0     0     0
   449  0.46050344E-01     0   424     6     0     0     0
   449  0.46050344E-01     0   418    12     0     0     0
   0
  20
   451  0.26709891E-04     0   450   200     0     0     0
   451  0.99767279E-03     0   450   203     0     0     0
   451  0.60029902E-01     0   425   127     0     0     0
   451  0.60029902E-01     0   431   121     0     0     0
   451  0.60029697E-01     0   427   129     0     0     0
   451  0.60029697E-01     0   433   123     0     0     0
   451  0.83858060E-04     0   437   127     0     0     0
   451  0.83858060E-04     0   443   121     0     0     0
   451  0.83857776E-04     0   439   129     0     0     0
   451  0.83857776E-04     0   445   123     0     0     0
   451  0.55912986E-01     0   429   131     0     0     0
   451  0.55912986E-01     0   435   125     0     0     0
   451  0.12733180E-01     0   441   131     0     0     0
   451  0.12733180E-01     0   447   125     0     0     0
   451  0.10353812E+00     0   426   128     0     0     0
   451  0.10353812E+00     0   432   122     0     0     0
   451  0.10353812E+00     0   428   130     0     0     0
   451  0.10353812E+00     0   434   124     0     0     0
   451  0.10353812E+00     0   430   132     0     0     0
   451  0.10353812E+00     0   436   126     0     0     0
  50
   452  0.79365723E-01     0   454   199     0     0     0
   452  0.79365723E-01     0   456   198     0     0     0
   452  0.11949113E-01     0   454   207     0     0     0
   452  0.11949113E-01     0   456   206     0     0     0
   452  0.20291703E-01     0   450   200     0     0     0
   452  0.67718796E-01     0   451   200     0     0     0
   452  0.41336990E-02     0   450   203     0     0     0
   452  0.34058543E-02     0   450   204     0     0     0
   452  0.28476045E-02     0   450   205     0     0     0
   452  0.82660355E-02     0   451   203     0     0     0
   452  0.34436339E-02     0   451   204     0     0     0
   452  0.85853981E-02     0   451   205     0     0     0
   452  0.15246388E-03     0   402     8     0     0     0
   452  0.15246388E-03     0   408     2     0     0     0
   452  0.23389386E-03     0   401     7     0     0     0
   452  0.23389386E-03     0   407     1     0     0     0
   452  0.23389382E-03     0   403     9     0     0     0
   452  0.23389382E-03     0   409     3     0     0     0
   452  0.15246237E-03     0   404    10     0     0     0
   452  0.15246237E-03     0   410     4     0     0     0
   452  0.38843566E-04     0   414     8     0     0     0
   452  0.38843566E-04     0   420     2     0     0     0
   452  0.38843184E-04     0   416    10     0     0     0
   452  0.38843184E-04     0   422     4     0     0     0
   452  0.74370240E-03     0   405    11     0     0     0
   452  0.74370240E-03     0   411     5     0     0     0
   452  0.20114034E-02     0   417    11     0     0     0
   452  0.20114034E-02     0   423     5     0     0     0
   452  0.10392214E+00     0   406    12     0     0     0
   452  0.10392214E+00     0   412     6     0     0     0
   452  0.24047311E+00     0   418    12     0     0     0
   452  0.24047311E+00     0   424     6     0     0     0
   452  0.45984114E-04     0   425   127     0     0     0
   452  0.45984114E-04     0   431   121     0     0     0
   452  0.45984114E-04     0   427   129     0     0     0
   452  0.45984114E-04     0   433   123     0     0     0
   452  0.47565594E-04     0   437   127     0     0     0
   452  0.47565594E-04     0   443   121     0     0     0
   452  0.47565594E-04     0   439   129     0     0     0
   452  0.47565594E-04     0   445   123     0     0     0
   452  0.79347534E-04     0   429   131     0     0     0
   452  0.79347534E-04     0   435   125     0     0     0
   452  0.50032814E-03     0   441   131     0     0     0
   452  0.50032814E-03     0   447   125     0     0     0
   452  0.19042339E-03     0   426   128     0     0     0
   452  0.19042339E-03     0   432   122     0     0     0
   452  0.19042339E-03     0   428   130     0     0     0
   452  0.19042339E-03     0   434   124     0     0     0
   452  0.19042339E-03     0   430   132     0     0     0
   452  0.19042339E-03     0   436   126     0     0     0
  54
   453  0.75116940E-01     0   454   199     0     0     0
   453  0.75116940E-01     0   456   198     0     0     0
   453  0.11904022E-01     0   454   207     0     0     0
   453  0.11904022E-01     0   456   206     0     0     0
   453  0.42165993E-02     0   450   200     0     0     0
   453  0.85533876E-02     0   451   200     0     0     0
   453  0.18240439E-01     0   450   203     0     0     0
   453  0.24306029E-02     0   450   204     0     0     0
   453  0.32669757E-02     0   450   205     0     0     0
   453  0.61123006E-01     0   451   203     0     0     0
   453  0.73569422E-02     0   451   204     0     0     0
   453  0.35912029E-02     0   451   205     0     0     0
   453  0.11745343E-02     0   402     8     0     0     0
   453  0.11745343E-02     0   408     2     0     0     0
   453  0.16198995E-02     0   401     7     0     0     0
   453  0.16198995E-02     0   407     1     0     0     0
   453  0.16198994E-02     0   403     9     0     0     0
   453  0.16198994E-02     0   409     3     0     0     0
   453  0.11745231E-02     0   404    10     0     0     0
   453  0.11745231E-02     0   410     4     0     0     0
   453  0.16478311E-03     0   414     8     0     0     0
   453  0.16478311E-03     0   420     2     0     0     0
   453  0.40914252E-04     0   413     7     0     0     0
   453  0.40914252E-04     0   419     1     0     0     0
   453  0.40914249E-04     0   415     9     0     0     0
   453  0.40914249E-04     0   421     3     0     0     0
   453  0.16478154E-03     0   416    10     0     0     0
   453  0.16478154E-03     0   422     4     0     0     0
   453  0.33416873E-03     0   405    11     0     0     0
   453  0.33416873E-03     0   411     5     0     0     0
   453  0.35394656E-02     0   417    11     0     0     0
   453  0.35394656E-02     0   423     5     0     0     0
   453  0.27459741E+00     0   406    12     0     0     0
   453  0.27459741E+00     0   412     6     0     0     0
   453  0.68211466E-01     0   418    12     0     0     0
   453  0.68211466E-01     0   424     6     0     0     0
   453  0.41445458E-03     0   425   127     0     0     0
   453  0.41445458E-03     0   431   121     0     0     0
   453  0.41445458E-03     0   427   129     0     0     0
   453  0.41445458E-03     0   433   123     0     0     0
   453  0.19961435E-03     0   437   127     0     0     0
   453  0.19961435E-03     0   443   121     0     0     0
   453  0.19961435E-03     0   439   129     0     0     0
   453  0.19961435E-03     0   445   123     0     0     0
   453  0.12023720E-04     0   429   131     0     0     0
   453  0.12023720E-04     0   435   125     0     0     0
   453  0.10358464E-02     0   441   131     0     0     0
   453  0.10358464E-02     0   447   125     0     0     0
   453  0.12102250E-02     0   426   128     0     0     0
   453  0.12102250E-02     0   432   122     0     0     0
   453  0.12102250E-02     0   428   130     0     0     0
   453  0.12102250E-02     0   434   124     0     0     0
   453  0.12102250E-02     0   430   132     0     0     0
   453  0.12102250E-02     0   436   126     0     0     0
   8
   454  0.86487585E-03     0   450   198     0     0     0
   454  0.21448833E+00     0   426   127     0     0     0
   454  0.21448812E+00     0   428   129     0     0     0
   454  0.21459314E+00     0   430   131     0     0     0
   454  0.11306905E+00     0   431   122     0     0     0
   454  0.11306891E+00     0   433   124     0     0     0
   454  0.10569166E+00     0   435   126     0     0     0
   454  0.23735968E-01     0   447   126     0     0     0
  23
   455  0.18216483E-01     0   450   198     0     0     0
   455  0.44439286E-02     0   450   206     0     0     0
   455  0.75975902E-01     0   451   198     0     0     0
   455  0.12475086E-01     0   451   206     0     0     0
   455  0.11354471E-02     0   402     7     0     0     0
   455  0.49746200E-02     0   407     2     0     0     0
   455  0.11354388E-02     0   404     9     0     0     0
   455  0.50890422E-02     0   409     4     0     0     0
   455  0.18168618E+00     0   406    11     0     0     0
   455  0.18091401E+00     0   418    11     0     0     0
   455  0.16526257E+00     0   411     6     0     0     0
   455  0.17007764E+00     0   423     6     0     0     0
   455  0.61854691E-03     0   426   127     0     0     0
   455  0.61854685E-03     0   428   129     0     0     0
   455  0.10681399E-02     0   430   131     0     0     0
   455  0.27234962E-02     0   431   122     0     0     0
   455  0.27234962E-02     0   433   124     0     0     0
   455  0.46361843E-03     0   435   126     0     0     0
   455  0.26677516E-02     0   447   126     0     0     0
   455  0.73583454E-01     0   454   200     0     0     0
   455  0.70016399E-01     0   454   203     0     0     0
   455  0.11534413E-01     0   454   204     0     0     0
   455  0.12595774E-01     0   454   205     0     0     0
   8
   456  0.86487585E-03     0   450   199     0     0     0
   456  0.21448833E+00     0   432   121     0     0     0
   456  0.21448812E+00     0   434   123     0     0     0
   456  0.21459314E+00     0   436   125     0     0     0
   456  0.11306905E+00     0   425   128     0     0     0
   456  0.11306891E+00     0   427   130     0     0     0
   456  0.10569166E+00     0   429   132     0     0     0
   456  0.23735968E-01     0   441   132     0     0     0
  23
   457  0.18216483E-01     0   450   199     0     0     0
   457  0.44439286E-02     0   450   207     0     0     0
   457  0.75975902E-01     0   451   199     0     0     0
   457  0.12475086E-01     0   451   207     0     0     0
   457  0.11354471E-02     0   408     1     0     0     0
   457  0.49746200E-02     0   401     8     0     0     0
   457  0.11354388E-02     0   410     3     0     0     0
   457  0.50890422E-02     0   403    10     0     0     0
   457  0.18168618E+00     0   412     5     0     0     0
   457  0.18091401E+00     0   424     5     0     0     0
   457  0.16526257E+00     0   405    12     0     0     0
   457  0.17007764E+00     0   417    12     0     0     0
   457  0.61854691E-03     0   432   121     0     0     0
   457  0.61854685E-03     0   434   123     0     0     0
   457  0.10681399E-02     0   436   125     0     0     0
   457  0.27234962E-02     0   425   128     0     0     0
   457  0.27234962E-02     0   427   130     0     0     0
   457  0.46361843E-03     0   429   132     0     0     0
   457  0.26677516E-02     0   441   132     0     0     0
   457  0.73583454E-01     0   456   200     0     0     0
   457  0.70016399E-01     0   456   203     0     0     0
   457  0.11534413E-01     0   456   204     0     0     0
   457  0.12595774E-01     0   456   205     0     0     0
  17
   203  0.21499362E-03     0   123   129     0     0     0
   203  0.61450686E-01     0   125   131     0     0     0
   203  0.25896258E-02     0     3     9     0     0     0
   203  0.87113094E+00     0     5    11     0     0     0
   203  0.35222538E-01     0     4    10     0     0     0
   203  0.10322024E-02     0    59    59     0     0     0
   203  0.27050139E-01     0    13    13     0     0     0
   203  0.72715484E-04     0   198   121   128     0     0
   203  0.72715484E-04     0   198   123   130     0     0
   203  0.72715484E-04     0   198   125   132     0     0
   203  0.21814642E-03     0   198     8     1     0     0
   203  0.21814642E-03     0   198    10     3     0     0
   203  0.72715484E-04     0   199   127   122     0     0
   203  0.72715484E-04     0   199   129   124     0     0
   203  0.72715484E-04     0   199   131   126     0     0
   203  0.21814642E-03     0   199     2     7     0     0
   203  0.21814642E-03     0   199     4     9     0     0
  23
   204  0.48843878E-04     0   123   129     0     0     0
   204  0.13988600E-01     0   125   131     0     0     0
   204  0.57611603E-03     0     3     9     0     0     0
   204  0.15455885E+00     0     5    11     0     0     0
   204  0.30796953E-04     0     4    10     0     0     0
   204  0.73839021E+00     0     6    12     0     0     0
   204  0.13847342E-02     0    13    13     0     0     0
   204  0.64433538E-02     0   198   199     0     0     0
   204  0.31678367E-02     0   200   200     0     0     0
   204  0.24290937E-02     0   450   450     0     0     0
   204  0.96348776E-02     0   450   451     0     0     0
   204  0.64623207E-02     0   451   451     0     0     0
   204  0.14029566E-01     0   454   456     0     0     0
   204  0.13824892E-01     0   203   203     0     0     0
   204  0.20440589E-02     0   425   431     0     0     0
   204  0.15369299E-02     0   437   443     0     0     0
   204  0.20438938E-02     0   427   433     0     0     0
   204  0.15367866E-02     0   439   445     0     0     0
   204  0.11629700E-03     0   429   435     0     0     0
   204  0.49287598E-02     0   441   447     0     0     0
   204  0.76077390E-02     0   426   432     0     0     0
   204  0.76077390E-02     0   428   434     0     0     0
   204  0.76077390E-02     0   430   436     0     0     0
  14
   205  0.33468827E-04     0   123   129     0     0     0
   205  0.95857438E-02     0   125   131     0     0     0
   205  0.39480391E-03     0     3     9     0     0     0
   205  0.10607139E+00     0     5    11     0     0     0
   205  0.18738223E-04     0     4    10     0     0     0
   205  0.79980129E+00     0     6    12     0     0     0
   205  0.78626489E-03     0    13    13     0     0     0
   205  0.28725420E-02     0   450   450     0     0     0
   205  0.15041555E-01     0   450   451     0     0     0
   205  0.19027054E-01     0   451   451     0     0     0
   205  0.41124526E-01     0   454   456     0     0     0
   205  0.40421137E-02     0   203   200     0     0     0
   205  0.60023426E-03     0   429   447     0     0     0
   205  0.60023426E-03     0   441   435     0     0     0
  11
   206  0.44547050E-04     0   124   129     0     0     0
   206  0.12758647E-01     0   126   131     0     0     0
   206  0.50275255E-03     0     4     9     0     0     0
   206  0.93017989E+00     0     6    11     0     0     0
   206  0.27362198E-01     0   454   450     0     0     0
   206  0.24445166E-04     0   454   451     0     0     0
   206  0.56902384E-02     0   203   198     0     0     0
   206  0.73690764E-02     0   431   426     0     0     0
   206  0.73688612E-02     0   433   428     0     0     0
   206  0.99386391E-03     0   435   430     0     0     0
   206  0.77054524E-02     0   447   430     0     0     0
  11
   207  0.44547050E-04     0   130   123     0     0     0
   207  0.12758647E-01     0   132   125     0     0     0
   207  0.50275255E-03     0    10     3     0     0     0
   207  0.93017989E+00     0    12     5     0     0     0
   207  0.27362198E-01     0   456   450     0     0     0
   207  0.24445166E-04     0   456   451     0     0     0
   207  0.56902384E-02     0   203   199     0     0     0
   207  0.73690764E-02     0   425   432     0     0     0
   207  0.73688612E-02     0   427   434     0     0     0
   207  0.99386391E-03     0   429   436     0     0     0
   207  0.77054524E-02     0   441   436     0     0     0
   0
   5
     6  0.33333334E+00   100     2     7     5     0     0
     6  0.33333334E+00   100     4     9     5     0     0
     6  0.11111111E+00   100   122   127     5     0     0
     6  0.11111111E+00   100   124   129     5     0     0
     6  0.11111111E+00   100   126   131     5     0     0
   5
    12  0.33333334E+00   100     8     1    11     0     0
    12  0.33333334E+00   100    10     3    11     0     0
    12  0.11111111E+00   100   128   121    11     0     0
    12  0.11111111E+00   100   130   123    11     0     0
    12  0.11111111E+00   100   132   125    11     0     0
      4.00000000     -0.25949988
      0.99769294     -0.02651933      0.05873465     -0.02135647
     -0.03379623     -0.99232638      0.10762036     -0.05063500
     -0.02523227      0.04115119      0.70460618      0.70795506
     -0.05320036      0.11354090      0.69892669     -0.70411640
     -0.99733377      0.07297537     -0.07297537     -0.99733377
     -0.98799366      0.15449448     -0.15449448     -0.98799366
     -0.77390343     -0.85232514     -0.79740429
      0.00000000      0.00000000      0.00000000
    800.00000000
    T
