  65
  401    384.6849    0.18275E-24
  402    377.4080    0.17204E-24
  403    384.6850    0.18275E-24
  404    377.4106    0.17204E-24
  405    352.1668    0.29935E-24
  406    248.2020    0.46252E-24
  407    384.6849    0.18275E-24
  408    377.4080    0.17204E-24
  409    384.6850    0.18275E-24
  410    377.4106    0.17204E-24
  411    352.1668    0.29935E-24
  412    248.2020    0.46252E-24
  413    369.3138    0.34087E-23
  414    368.3521    0.85470E-24
  415    369.3139    0.34087E-23
  416    368.3549    0.85472E-24
  417    369.3414    0.18392E-23
  418    432.4861    0.16499E-24
  419    369.3138    0.34087E-23
  420    368.3521    0.85470E-24
  421    369.3139    0.34087E-23
  422    368.3549    0.85472E-24
  423    369.3414    0.18392E-23
  424    432.4861    0.16499E-24
  425    141.9316    0.13530E-23
  426    121.6348    0.18738E-23
  427    141.9316    0.13530E-23
  428    121.6348    0.18738E-23
  429    105.8940    0.25732E-23
  430    120.8508    0.19352E-23
  431    141.9316    0.13530E-23
  432    121.6348    0.18738E-23
  433    141.9316    0.13530E-23
  434    121.6348    0.18738E-23
  435    105.8940    0.25732E-23
  436    120.8508    0.19352E-23
  437    106.4821    0.24989E-23
  438      0.0000    0.10000E+31
  439    106.4822    0.24989E-23
  440      0.0000    0.10000E+31
  441    141.9790    0.13698E-23
  442      0.0000    0.10000E+31
  443    106.4821    0.24989E-23
  444      0.0000    0.10000E+31
  445    106.4822    0.24989E-23
  446      0.0000    0.10000E+31
  447    141.9790    0.13698E-23
  448      0.0000    0.10000E+31
  449    406.8575    0.22696E-24
  450     53.5248    0.10000E+31
  451     99.1840    0.33034E-19
  452   -250.5960    0.49160E-24
  453    286.7292    0.26953E-24
  454     94.9301    0.16580E-19
  455    281.3860    0.26966E-24
  456     94.9301    0.16580E-19
  457    281.3860    0.26966E-24
  203     91.9878    0.15919E-21
  204    300.3242    0.14400E-23
  205    293.0078    0.66637E-24
  206    305.2664    0.58841E-24
  207    305.2664    0.58841E-24
  458      0.0000    0.10000E+31
    6    172.5000    0.57395E-24
   12    172.5000    0.57395E-24
   6
   401  0.69060832E-01     0   450     1     0     0     0
   401  0.26636383E+00     0   451     1     0     0     0
   401  0.16966575E-02     0   452     1     0     0     0
   401  0.16211675E-01     0   453     1     0     0     0
   401  0.59916103E+00     0   456     2     0     0     0
   401  0.47505978E-01     0   457     2     0     0     0
   6
   402  0.13589837E-02     0   450     2     0     0     0
   402  0.31931052E+00     0   451     2     0     0     0
   402  0.90609054E-03     0   452     2     0     0     0
   402  0.10082169E-01     0   453     2     0     0     0
   402  0.65084404E+00     0   454     1     0     0     0
   402  0.17498193E-01     0   455     1     0     0     0
   6
   403  0.69062352E-01     0   450     3     0     0     0
   403  0.26636973E+00     0   451     3     0     0     0
   403  0.16966957E-02     0   452     3     0     0     0
   403  0.16212046E-01     0   453     3     0     0     0
   403  0.59915751E+00     0   456     4     0     0     0
   403  0.47501646E-01     0   457     4     0     0     0
   6
   404  0.13589594E-02     0   450     4     0     0     0
   404  0.31930432E+00     0   451     4     0     0     0
   404  0.90604345E-03     0   452     4     0     0     0
   404  0.10081188E-01     0   453     4     0     0     0
   404  0.65085053E+00     0   454     3     0     0     0
   404  0.17498938E-01     0   455     3     0     0     0
   6
   405  0.10704300E+00     0   450     5     0     0     0
   405  0.36837074E+00     0   451     5     0     0     0
   405  0.17120891E-02     0   452     5     0     0     0
   405  0.12302094E-01     0   453     5     0     0     0
   405  0.36981621E+00     0   456     6     0     0     0
   405  0.14075586E+00     0   199   406     0     0     0
   2
   406  0.41798182E-01     0   450     6     0     0     0
   406  0.95820183E+00     0   454     5     0     0     0
   6
   407  0.69060832E-01     0   450     7     0     0     0
   407  0.26636383E+00     0   451     7     0     0     0
   407  0.16966575E-02     0   452     7     0     0     0
   407  0.16211675E-01     0   453     7     0     0     0
   407  0.59916103E+00     0   454     8     0     0     0
   407  0.47505978E-01     0   455     8     0     0     0
   6
   408  0.13589837E-02     0   450     8     0     0     0
   408  0.31931052E+00     0   451     8     0     0     0
   408  0.90609054E-03     0   452     8     0     0     0
   408  0.10082169E-01     0   453     8     0     0     0
   408  0.65084404E+00     0   456     7     0     0     0
   408  0.17498193E-01     0   457     7     0     0     0
   6
   409  0.69062352E-01     0   450     9     0     0     0
   409  0.26636973E+00     0   451     9     0     0     0
   409  0.16966957E-02     0   452     9     0     0     0
   409  0.16212046E-01     0   453     9     0     0     0
   409  0.59915751E+00     0   454    10     0     0     0
   409  0.47501646E-01     0   455    10     0     0     0
   6
   410  0.13589594E-02     0   450    10     0     0     0
   410  0.31930432E+00     0   451    10     0     0     0
   410  0.90604345E-03     0   452    10     0     0     0
   410  0.10081188E-01     0   453    10     0     0     0
   410  0.65085053E+00     0   456     9     0     0     0
   410  0.17498938E-01     0   457     9     0     0     0
   6
   411  0.10704300E+00     0   450    11     0     0     0
   411  0.36837074E+00     0   451    11     0     0     0
   411  0.17120891E-02     0   452    11     0     0     0
   411  0.12302094E-01     0   453    11     0     0     0
   411  0.36981621E+00     0   454    12     0     0     0
   411  0.14075586E+00     0   198   412     0     0     0
   2
   412  0.41798182E-01     0   450    12     0     0     0
   412  0.95820183E+00     0   456    11     0     0     0
   4
   413  0.89875388E+00     0   450     1     0     0     0
   413  0.95607035E-01     0   451     1     0     0     0
   413  0.12584524E-02     0   452     1     0     0     0
   413  0.43806355E-02     0   453     1     0     0     0
   4
   414  0.89887559E+00     0   450     2     0     0     0
   414  0.95563732E-01     0   451     2     0     0     0
   414  0.12476982E-02     0   452     2     0     0     0
   414  0.43129562E-02     0   453     2     0     0     0
   4
   415  0.89875388E+00     0   450     3     0     0     0
   415  0.95607042E-01     0   451     3     0     0     0
   415  0.12584535E-02     0   452     3     0     0     0
   415  0.43806420E-02     0   453     3     0     0     0
   4
   416  0.89887619E+00     0   450     4     0     0     0
   416  0.95563643E-01     0   451     4     0     0     0
   416  0.12476486E-02     0   452     4     0     0     0
   416  0.43125264E-02     0   453     4     0     0     0
   6
   417  0.46138030E+00     0   450     5     0     0     0
   417  0.18725140E+00     0   451     5     0     0     0
   417  0.13100015E-01     0   452     5     0     0     0
   417  0.24735309E-01     0   453     5     0     0     0
   417  0.15551938E+00     0   456     6     0     0     0
   417  0.15801360E+00     0   199   406     0     0     0
   7
   418  0.17901845E+00     0   454     5     0     0     0
   418  0.35781395E+00     0   455     5     0     0     0
   418  0.30042389E+00     0   200   406     0     0     0
   418  0.37022043E-01     0   203   406     0     0     0
   418  0.15446191E-01     0   450     6     0     0     0
   418  0.98597102E-01     0   451     6     0     0     0
   418  0.11678382E-01     0   452     6     0     0     0
   4
   419  0.89875388E+00     0   450     7     0     0     0
   419  0.95607035E-01     0   451     7     0     0     0
   419  0.12584524E-02     0   452     7     0     0     0
   419  0.43806355E-02     0   453     7     0     0     0
   4
   420  0.89887559E+00     0   450     8     0     0     0
   420  0.95563732E-01     0   451     8     0     0     0
   420  0.12476982E-02     0   452     8     0     0     0
   420  0.43129562E-02     0   453     8     0     0     0
   4
   421  0.89875388E+00     0   450     9     0     0     0
   421  0.95607042E-01     0   451     9     0     0     0
   421  0.12584535E-02     0   452     9     0     0     0
   421  0.43806420E-02     0   453     9     0     0     0
   4
   422  0.89887619E+00     0   450    10     0     0     0
   422  0.95563643E-01     0   451    10     0     0     0
   422  0.12476486E-02     0   452    10     0     0     0
   422  0.43125264E-02     0   453    10     0     0     0
   6
   423  0.46138030E+00     0   450    11     0     0     0
   423  0.18725140E+00     0   451    11     0     0     0
   423  0.13100015E-01     0   452    11     0     0     0
   423  0.24735309E-01     0   453    11     0     0     0
   423  0.15551938E+00     0   454    12     0     0     0
   423  0.15801360E+00     0   198   412     0     0     0
   7
   424  0.17901845E+00     0   456    11     0     0     0
   424  0.35781395E+00     0   457    11     0     0     0
   424  0.30042389E+00     0   200   412     0     0     0
   424  0.37022043E-01     0   203   412     0     0     0
   424  0.15446191E-01     0   450    12     0     0     0
   424  0.98597102E-01     0   451    12     0     0     0
   424  0.11678382E-01     0   452    12     0     0     0
   3
   425  0.72322503E-01     0   450   121     0     0     0
   425  0.36085844E+00     0   451   121     0     0     0
   425  0.56681907E+00     0   456   122     0     0     0
   3
   426  0.52033234E+00     0   450   122     0     0     0
   426  0.81825390E-01     0   451   122     0     0     0
   426  0.39784229E+00     0   454   121     0     0     0
   3
   427  0.72322451E-01     0   450   123     0     0     0
   427  0.36085752E+00     0   451   123     0     0     0
   427  0.56682003E+00     0   456   124     0     0     0
   3
   428  0.52033436E+00     0   450   124     0     0     0
   428  0.81825711E-01     0   451   124     0     0     0
   428  0.39783993E+00     0   454   123     0     0     0
   3
   429  0.99132448E+00     0   450   125     0     0     0
   429  0.48378347E-02     0   451   125     0     0     0
   429  0.38376993E-02     0   456   126     0     0     0
   3
   430  0.53059047E+00     0   450   126     0     0     0
   430  0.79681329E-01     0   451   126     0     0     0
   430  0.38972822E+00     0   454   125     0     0     0
   3
   431  0.72322503E-01     0   450   127     0     0     0
   431  0.36085844E+00     0   451   127     0     0     0
   431  0.56681907E+00     0   454   128     0     0     0
   3
   432  0.52033234E+00     0   450   128     0     0     0
   432  0.81825390E-01     0   451   128     0     0     0
   432  0.39784229E+00     0   456   127     0     0     0
   3
   433  0.72322451E-01     0   450   129     0     0     0
   433  0.36085752E+00     0   451   129     0     0     0
   433  0.56682003E+00     0   454   130     0     0     0
   3
   434  0.52033436E+00     0   450   130     0     0     0
   434  0.81825711E-01     0   451   130     0     0     0
   434  0.39783993E+00     0   456   129     0     0     0
   3
   435  0.99132448E+00     0   450   131     0     0     0
   435  0.48378347E-02     0   451   131     0     0     0
   435  0.38376993E-02     0   454   132     0     0     0
   3
   436  0.53059047E+00     0   450   132     0     0     0
   436  0.79681329E-01     0   451   132     0     0     0
   436  0.38972822E+00     0   456   131     0     0     0
   2
   437  0.99629796E+00     0   450   121     0     0     0
   437  0.37020582E-02     0   451   121     0     0     0
   0
   2
   439  0.99629831E+00     0   450   123     0     0     0
   439  0.37017018E-02     0   451   123     0     0     0
   0
   3
   441  0.93355179E-01     0   450   125     0     0     0
   441  0.35324949E+00     0   451   125     0     0     0
   441  0.55339533E+00     0   456   126     0     0     0
   0
   2
   443  0.99629796E+00     0   450   127     0     0     0
   443  0.37020582E-02     0   451   127     0     0     0
   0
   2
   445  0.99629831E+00     0   450   129     0     0     0
   445  0.37017018E-02     0   451   129     0     0     0
   0
   3
   447  0.93355179E-01     0   450   131     0     0     0
   447  0.35324949E+00     0   451   131     0     0     0
   447  0.55339533E+00     0   454   132     0     0     0
   0
  25
   449  0.25557334E-03     0   454     5    12     0     0
   449  0.25557334E-03     0   456     6    11     0     0
   449  0.22161086E-04     0   451    13     0     0     0
   449  0.56471861E-04     0   452    13     0     0     0
   449  0.46478628E-04     0   453    13     0     0     0
   449  0.34642261E-01     0   408     2     0     0     0
   449  0.34642261E-01     0   402     8     0     0     0
   449  0.20003373E-01     0   407     1     0     0     0
   449  0.20003373E-01     0   401     7     0     0     0
   449  0.57863384E-01     0   420     2     0     0     0
   449  0.57863384E-01     0   414     8     0     0     0
   449  0.55145860E-01     0   419     1     0     0     0
   449  0.55145860E-01     0   413     7     0     0     0
   449  0.20002505E-01     0   409     3     0     0     0
   449  0.20002505E-01     0   403     9     0     0     0
   449  0.55144902E-01     0   421     3     0     0     0
   449  0.55144902E-01     0   415     9     0     0     0
   449  0.34602661E-01     0   410     4     0     0     0
   449  0.34602661E-01     0   404    10     0     0     0
   449  0.57823509E-01     0   422     4     0     0     0
   449  0.57823509E-01     0   416    10     0     0     0
   449  0.10595880E+00     0   411     5     0     0     0
   449  0.10595880E+00     0   405    11     0     0     0
   449  0.58494613E-01     0   423     5     0     0     0
   449  0.58494613E-01     0   417    11     0     0     0
   0
  22
   451  0.40330600E-04     0   450    59     0     0     0
   451  0.86264838E-04     0   456     2     7     0     0
   451  0.28754946E-04     0   456   122   127     0     0
   451  0.28754946E-04     0   456   124   129     0     0
   451  0.86264845E-04     0   454     1     8     0     0
   451  0.28754946E-04     0   454   121   128     0     0
   451  0.28754946E-04     0   454   123   130     0     0
   451  0.86264845E-04     0   456     4     9     0     0
   451  0.28754946E-04     0   456   126   131     0     0
   451  0.86264845E-04     0   454     3    10     0     0
   451  0.28754946E-04     0   454   125   132     0     0
   451  0.51678792E-02     0   450     2     8     0     0
   451  0.10523779E-01     0   450     1     7     0     0
   451  0.10523779E-01     0   450     3     9     0     0
   451  0.51678694E-02     0   450     4    10     0     0
   451  0.10643775E-01     0   450     5    11     0     0
   451  0.20122540E+00     0   450   121   127     0     0
   451  0.20122446E+00     0   450   123   129     0     0
   451  0.22756873E+00     0   450   125   131     0     0
   451  0.10715079E+00     0   450   122   128     0     0
   451  0.10715079E+00     0   450   124   130     0     0
   451  0.11309485E+00     0   450   126   132     0     0
  24
   452  0.30512106E+00     0   454   199     0     0     0
   452  0.30512106E+00     0   456   198     0     0     0
   452  0.18727973E+00     0   450   200     0     0     0
   452  0.14264582E+00     0   451   200     0     0     0
   452  0.16768722E-01     0   450   203     0     0     0
   452  0.62138024E-02     0   451   203     0     0     0
   452  0.66249428E-03     0   425   127     0     0     0
   452  0.66249428E-03     0   431   121     0     0     0
   452  0.66249375E-03     0   427   129     0     0     0
   452  0.66249375E-03     0   433   123     0     0     0
   452  0.12781677E-02     0   437   127     0     0     0
   452  0.12781677E-02     0   443   121     0     0     0
   452  0.12781670E-02     0   439   129     0     0     0
   452  0.12781670E-02     0   445   123     0     0     0
   452  0.13673856E-02     0   429   131     0     0     0
   452  0.13673856E-02     0   435   125     0     0     0
   452  0.14951139E-02     0   441   131     0     0     0
   452  0.14951139E-02     0   447   125     0     0     0
   452  0.38834242E-02     0   426   128     0     0     0
   452  0.38834242E-02     0   432   122     0     0     0
   452  0.38834242E-02     0   428   130     0     0     0
   452  0.38834242E-02     0   434   124     0     0     0
   452  0.39142431E-02     0   430   132     0     0     0
   452  0.39142431E-02     0   436   126     0     0     0
  25
   453  0.24295926E+00     0   454   199     0     0     0
   453  0.24295926E+00     0   456   198     0     0     0
   453  0.14406824E-01     0   450   200     0     0     0
   453  0.68984115E-02     0   451   200     0     0     0
   453  0.12259223E-04     0   451     5    11     0     0
   453  0.74513353E-01     0   450   203     0     0     0
   453  0.66365458E-01     0   451   203     0     0     0
   453  0.13521508E-01     0   425   127     0     0     0
   453  0.13521508E-01     0   431   121     0     0     0
   453  0.13521501E-01     0   427   129     0     0     0
   453  0.13521501E-01     0   433   123     0     0     0
   453  0.57003470E-02     0   437   127     0     0     0
   453  0.57003470E-02     0   443   121     0     0     0
   453  0.57003447E-02     0   439   129     0     0     0
   453  0.57003447E-02     0   445   123     0     0     0
   453  0.51365220E-02     0   429   131     0     0     0
   453  0.51365220E-02     0   435   125     0     0     0
   453  0.14383140E-01     0   441   131     0     0     0
   453  0.14383140E-01     0   447   125     0     0     0
   453  0.39252520E-01     0   426   128     0     0     0
   453  0.39252520E-01     0   432   122     0     0     0
   453  0.39252520E-01     0   428   130     0     0     0
   453  0.39252520E-01     0   434   124     0     0     0
   453  0.39474197E-01     0   430   132     0     0     0
   453  0.39474197E-01     0   436   126     0     0     0
   5
   454  0.23276569E+00     0   450     2     7     0     0
   454  0.23276566E+00     0   450     4     9     0     0
   454  0.17503437E+00     0   450   127   122     0     0
   454  0.17503439E+00     0   450   129   124     0     0
   454  0.18439989E+00     0   450   131   126     0     0
  14
   455  0.90800161E-02     0   450   198     0     0     0
   455  0.29804325E+00     0   451   198     0     0     0
   455  0.55296652E-01     0   406    11     0     0     0
   455  0.34277219E-01     0   426   127     0     0     0
   455  0.34277216E-01     0   428   129     0     0     0
   455  0.34933846E-01     0   430   131     0     0     0
   455  0.65929919E-01     0   431   122     0     0     0
   455  0.65929882E-01     0   433   124     0     0     0
   455  0.57465298E-03     0   435   126     0     0     0
   455  0.65963507E-01     0   447   126     0     0     0
   455  0.21456140E+00     0   454   200     0     0     0
   455  0.14748189E-04     0   454     2     8     0     0
   455  0.14748175E-04     0   454     4    10     0     0
   455  0.12110295E+00     0   454   203     0     0     0
   5
   456  0.23276569E+00     0   450     8     1     0     0
   456  0.23276566E+00     0   450    10     3     0     0
   456  0.17503437E+00     0   450   121   128     0     0
   456  0.17503439E+00     0   450   123   130     0     0
   456  0.18439989E+00     0   450   125   132     0     0
  14
   457  0.90800161E-02     0   450   199     0     0     0
   457  0.29804325E+00     0   451   199     0     0     0
   457  0.55296652E-01     0   412     5     0     0     0
   457  0.34277219E-01     0   432   121     0     0     0
   457  0.34277216E-01     0   434   123     0     0     0
   457  0.34933846E-01     0   436   125     0     0     0
   457  0.65929919E-01     0   425   128     0     0     0
   457  0.65929882E-01     0   427   130     0     0     0
   457  0.57465298E-03     0   429   132     0     0     0
   457  0.65963507E-01     0   441   132     0     0     0
   457  0.21456140E+00     0   456   200     0     0     0
   457  0.14748189E-04     0   456     8     2     0     0
   457  0.14748175E-04     0   456    10     4     0     0
   457  0.12110295E+00     0   456   203     0     0     0
  17
   203  0.21724992E-03     0   123   129     0     0     0
   203  0.62084917E-01     0   125   131     0     0     0
   203  0.26184758E-02     0     3     9     0     0     0
   203  0.88576436E+00     0     5    11     0     0     0
   203  0.28507149E-01     0     4    10     0     0     0
   203  0.85421145E-03     0    59    59     0     0     0
   203  0.19657342E-01     0    13    13     0     0     0
   203  0.16460188E-04     0   198   121   128     0     0
   203  0.16460188E-04     0   198   123   130     0     0
   203  0.16460188E-04     0   198   125   132     0     0
   203  0.49380567E-04     0   198     8     1     0     0
   203  0.49380567E-04     0   198    10     3     0     0
   203  0.16460188E-04     0   199   127   122     0     0
   203  0.16460188E-04     0   199   129   124     0     0
   203  0.16460188E-04     0   199   131   126     0     0
   203  0.49380567E-04     0   199     2     7     0     0
   203  0.49380567E-04     0   199     4     9     0     0
  24
   204  0.40728435E-04     0   123   129     0     0     0
   204  0.11662805E-01     0   125   131     0     0     0
   204  0.48298790E-03     0     3     9     0     0     0
   204  0.83383277E-01     0     5    11     0     0     0
   204  0.10980954E-03     0     4    10     0     0     0
   204  0.16575764E-02     0    13    13     0     0     0
   204  0.39659847E-01     0   198   199     0     0     0
   204  0.18126335E-01     0   200   200     0     0     0
   204  0.85260861E-01     0   450   450     0     0     0
   204  0.13396294E+00     0   450   451     0     0     0
   204  0.45363966E-01     0   451   451     0     0     0
   204  0.27927268E+00     0   454   456     0     0     0
   204  0.12662642E+00     0   203   203     0     0     0
   204  0.65393015E-02     0   425   431     0     0     0
   204  0.10582039E-01     0   437   443     0     0     0
   204  0.65389941E-02     0   427   433     0     0     0
   204  0.10581491E-01     0   439   445     0     0     0
   204  0.10645188E-01     0   429   435     0     0     0
   204  0.63531548E-02     0   441   447     0     0     0
   204  0.10245520E-04     0   429   447     0     0     0
   204  0.10245520E-04     0   441   435     0     0     0
   204  0.40877022E-01     0   426   432     0     0     0
   204  0.40877022E-01     0   428   434     0     0     0
   204  0.41375097E-01     0   430   436     0     0     0
  11
   205  0.19156299E-04     0   123   129     0     0     0
   205  0.54862560E-02     0   125   131     0     0     0
   205  0.22723545E-03     0     3     9     0     0     0
   205  0.39252859E-01     0     5    11     0     0     0
   205  0.36560243E-04     0     4    10     0     0     0
   205  0.37268249E-03     0    13    13     0     0     0
   205  0.99617757E-01     0   450   450     0     0     0
   205  0.20128714E+00     0   450   451     0     0     0
   205  0.10059131E+00     0   451   451     0     0     0
   205  0.54055935E+00     0   454   456     0     0     0
   205  0.12549685E-01     0   203   200     0     0     0
  11
   206  0.17622297E-04     0   124   129     0     0     0
   206  0.50469544E-02     0   126   131     0     0     0
   206  0.22026766E-03     0     4     9     0     0     0
   206  0.74424571E+00     0     6    11     0     0     0
   206  0.17109209E+00     0   454   450     0     0     0
   206  0.21217346E-01     0   454   451     0     0     0
   206  0.14584529E-01     0   203   198     0     0     0
   206  0.14448623E-01     0   431   426     0     0     0
   206  0.14448370E-01     0   433   428     0     0     0
   206  0.72309439E-03     0   435   430     0     0     0
   206  0.13955410E-01     0   447   430     0     0     0
  11
   207  0.17622297E-04     0   130   123     0     0     0
   207  0.50469544E-02     0   132   125     0     0     0
   207  0.22026766E-03     0    10     3     0     0     0
   207  0.74424571E+00     0    12     5     0     0     0
   207  0.17109209E+00     0   456   450     0     0     0
   207  0.21217346E-01     0   456   451     0     0     0
   207  0.14584529E-01     0   203   199     0     0     0
   207  0.14448623E-01     0   425   432     0     0     0
   207  0.14448370E-01     0   427   434     0     0     0
   207  0.72309439E-03     0   429   436     0     0     0
   207  0.13955410E-01     0   441   436     0     0     0
   0
   5
     6  0.33333334E+00   100     2     7     5     0     0
     6  0.33333334E+00   100     4     9     5     0     0
     6  0.11111111E+00   100   122   127     5     0     0
     6  0.11111111E+00   100   124   129     5     0     0
     6  0.11111111E+00   100   126   131     5     0     0
   5
    12  0.33333334E+00   100     8     1    11     0     0
    12  0.33333334E+00   100    10     3    11     0     0
    12  0.11111111E+00   100   128   121    11     0     0
    12  0.11111111E+00   100   130   123    11     0     0
    12  0.11111111E+00   100   132   125    11     0     0
      3.00000000     -0.37784111
      0.93143737     -0.22902945      0.25117710     -0.12992291
     -0.32053080     -0.88326758      0.28623271     -0.18753444
      0.06323814     -0.09513535     -0.69063693     -0.71412277
      0.16026635     -0.39791095     -0.61481875      0.66180038
     -0.94507772      0.32684565     -0.32684565     -0.94507772
     -0.86925024      0.49437237     -0.49437237     -0.86925024
     -0.91639125     -0.26626778     -1.40329134
   -296.57037354   -477.15408325   -102.92835236
    247.25549316
    T
