  65
  401    503.0903    0.73750E-24
  402    497.4608    0.79768E-24
  403    503.0904    0.73755E-24
  404    497.4627    0.79769E-24
  405   2000.1373    0.68344E-26
  406   2004.0999    0.48276E-26
  407    503.0903    0.73750E-24
  408    497.4608    0.79768E-24
  409    503.0904    0.73755E-24
  410    497.4627    0.79769E-24
  411   2000.1373    0.68344E-26
  412   2004.0999    0.48276E-26
  413   2000.1418    0.68507E-26
  414   1999.7164    0.66204E-26
  415   2000.1418    0.68507E-26
  416   1999.7168    0.66204E-26
  417   2000.7828    0.47902E-26
  418   2004.4734    0.48348E-26
  419   2000.1418    0.68507E-26
  420   1999.7164    0.66204E-26
  421   2000.1418    0.68507E-26
  422   1999.7168    0.66204E-26
  423   2000.7828    0.47902E-26
  424   2004.4734    0.48348E-26
  425    253.9007    0.29699E-23
  426    242.5551    0.30056E-23
  427    253.9007    0.29699E-23
  428    242.5551    0.30056E-23
  429   2000.4075    0.64450E-25
  430   1999.0830    0.25626E-25
  431    253.9007    0.29699E-23
  432    242.5551    0.30056E-23
  433    253.9007    0.29699E-23
  434    242.5551    0.30056E-23
  435   2000.4075    0.64450E-25
  436   1999.0830    0.25626E-25
  437   2000.4253    0.65085E-25
  438      0.0000    0.10000E+31
  439   2000.4253    0.65085E-25
  440      0.0000    0.10000E+31
  441   2000.5106    0.25663E-25
  442      0.0000    0.10000E+31
  443   2000.4253    0.65085E-25
  444      0.0000    0.10000E+31
  445   2000.4253    0.65085E-25
  446      0.0000    0.10000E+31
  447   2000.5106    0.25663E-25
  448      0.0000    0.10000E+31
  449    600.0000    0.12143E-24
  450     99.9753    0.10000E+31
  451    399.8297    0.26767E-24
  452   -752.0847    0.10960E-24
  453    765.6602    0.95543E-25
  454    399.7271    0.26736E-24
  455    764.9924    0.94897E-25
  456    399.7271    0.26736E-24
  457    764.9924    0.94897E-25
  203    105.4013    0.17894E-21
  204   1007.7592    0.18206E-24
  205   1000.0000    0.15881E-24
  206   1004.4804    0.21526E-24
  207   1004.4804    0.21526E-24
  458      0.0000    0.10000E+31
    6    172.5000    0.57395E-24
   12    172.5000    0.57395E-24
   3
   401  0.80947600E-01     0   450     1     0     0     0
   401  0.30722943E+00     0   451     1     0     0     0
   401  0.61182302E+00     0   456     2     0     0     0
   3
   402  0.70199862E-01     0   450     2     0     0     0
   402  0.30837002E+00     0   451     2     0     0     0
   402  0.62143016E+00     0   454     1     0     0     0
   3
   403  0.80952808E-01     0   450     3     0     0     0
   403  0.30724934E+00     0   451     3     0     0     0
   403  0.61179787E+00     0   456     4     0     0     0
   3
   404  0.70199639E-01     0   450     4     0     0     0
   404  0.30834594E+00     0   451     4     0     0     0
   404  0.62145448E+00     0   454     3     0     0     0
   7
   405  0.11633483E-01     0   450     5     0     0     0
   405  0.43664742E-04     0   451     5     0     0     0
   405  0.60795387E-03     0   452     5     0     0     0
   405  0.59528148E-03     0   453     5     0     0     0
   405  0.98592931E+00     0   449     5     0     0     0
   405  0.76944118E-04     0   456     6     0     0     0
   405  0.11133808E-02     0   457     6     0     0     0
   7
   406  0.68579632E+00     0   449     6     0     0     0
   406  0.32497458E-01     0   450     6     0     0     0
   406  0.21554120E-02     0   451     6     0     0     0
   406  0.70212260E-01     0   452     6     0     0     0
   406  0.67492083E-01     0   453     6     0     0     0
   406  0.44074957E-02     0   454     5     0     0     0
   406  0.13743895E+00     0   455     5     0     0     0
   3
   407  0.80947600E-01     0   450     7     0     0     0
   407  0.30722943E+00     0   451     7     0     0     0
   407  0.61182302E+00     0   454     8     0     0     0
   3
   408  0.70199862E-01     0   450     8     0     0     0
   408  0.30837002E+00     0   451     8     0     0     0
   408  0.62143016E+00     0   456     7     0     0     0
   3
   409  0.80952808E-01     0   450     9     0     0     0
   409  0.30724934E+00     0   451     9     0     0     0
   409  0.61179787E+00     0   454    10     0     0     0
   3
   410  0.70199639E-01     0   450    10     0     0     0
   410  0.30834594E+00     0   451    10     0     0     0
   410  0.62145448E+00     0   456     9     0     0     0
   7
   411  0.11633483E-01     0   450    11     0     0     0
   411  0.43664742E-04     0   451    11     0     0     0
   411  0.60795387E-03     0   452    11     0     0     0
   411  0.59528148E-03     0   453    11     0     0     0
   411  0.98592931E+00     0   449    11     0     0     0
   411  0.76944118E-04     0   454    12     0     0     0
   411  0.11133808E-02     0   455    12     0     0     0
   7
   412  0.68579632E+00     0   449    12     0     0     0
   412  0.32497458E-01     0   450    12     0     0     0
   412  0.21554120E-02     0   451    12     0     0     0
   412  0.70212260E-01     0   452    12     0     0     0
   412  0.67492083E-01     0   453    12     0     0     0
   412  0.44074957E-02     0   456    11     0     0     0
   412  0.13743895E+00     0   457    11     0     0     0
   3
   413  0.11655643E-01     0   450     1     0     0     0
   413  0.27004386E-04     0   453     1     0     0     0
   413  0.98831737E+00     0   449     1     0     0     0
   5
   414  0.45044567E-01     0   450     2     0     0     0
   414  0.19538096E-04     0   451     2     0     0     0
   414  0.23920122E-04     0   452     2     0     0     0
   414  0.10434652E-03     0   453     2     0     0     0
   414  0.95480764E+00     0   449     2     0     0     0
   3
   415  0.11655643E-01     0   450     3     0     0     0
   415  0.27004386E-04     0   453     3     0     0     0
   415  0.98831737E+00     0   449     3     0     0     0
   5
   416  0.45044567E-01     0   450     4     0     0     0
   416  0.19538096E-04     0   451     4     0     0     0
   416  0.23920116E-04     0   452     4     0     0     0
   416  0.10434650E-03     0   453     4     0     0     0
   416  0.95480758E+00     0   449     4     0     0     0
   7
   417  0.22593439E-02     0   450     5     0     0     0
   417  0.53928398E-01     0   451     5     0     0     0
   417  0.49572811E-03     0   452     5     0     0     0
   417  0.22229152E-02     0   453     5     0     0     0
   417  0.69132584E+00     0   449     5     0     0     0
   417  0.10819850E+00     0   456     6     0     0     0
   417  0.14156926E+00     0   457     6     0     0     0
   7
   418  0.68698859E+00     0   449     6     0     0     0
   418  0.11150963E+00     0   454     5     0     0     0
   418  0.30517580E-02     0   455     5     0     0     0
   418  0.19298263E-02     0   450     6     0     0     0
   418  0.55880800E-01     0   451     6     0     0     0
   418  0.70460461E-01     0   452     6     0     0     0
   418  0.70178971E-01     0   453     6     0     0     0
   3
   419  0.11655643E-01     0   450     7     0     0     0
   419  0.27004386E-04     0   453     7     0     0     0
   419  0.98831737E+00     0   449     7     0     0     0
   5
   420  0.45044567E-01     0   450     8     0     0     0
   420  0.19538096E-04     0   451     8     0     0     0
   420  0.23920122E-04     0   452     8     0     0     0
   420  0.10434652E-03     0   453     8     0     0     0
   420  0.95480764E+00     0   449     8     0     0     0
   3
   421  0.11655643E-01     0   450     9     0     0     0
   421  0.27004386E-04     0   453     9     0     0     0
   421  0.98831737E+00     0   449     9     0     0     0
   5
   422  0.45044567E-01     0   450    10     0     0     0
   422  0.19538096E-04     0   451    10     0     0     0
   422  0.23920116E-04     0   452    10     0     0     0
   422  0.10434650E-03     0   453    10     0     0     0
   422  0.95480758E+00     0   449    10     0     0     0
   7
   423  0.22593439E-02     0   450    11     0     0     0
   423  0.53928398E-01     0   451    11     0     0     0
   423  0.49572811E-03     0   452    11     0     0     0
   423  0.22229152E-02     0   453    11     0     0     0
   423  0.69132584E+00     0   449    11     0     0     0
   423  0.10819850E+00     0   454    12     0     0     0
   423  0.14156926E+00     0   455    12     0     0     0
   7
   424  0.68698859E+00     0   449    12     0     0     0
   424  0.11150963E+00     0   456    11     0     0     0
   424  0.30517580E-02     0   457    11     0     0     0
   424  0.19298263E-02     0   450    12     0     0     0
   424  0.55880800E-01     0   451    12     0     0     0
   424  0.70460461E-01     0   452    12     0     0     0
   424  0.70178971E-01     0   453    12     0     0     0
   1
   425  0.10000000E+01     0   450   121     0     0     0
   1
   426  0.10000000E+01     0   450   122     0     0     0
   1
   427  0.10000000E+01     0   450   123     0     0     0
   1
   428  0.10000000E+01     0   450   124     0     0     0
   6
   429  0.98701817E+00     0   450   125     0     0     0
   429  0.58347895E-03     0   451   125     0     0     0
   429  0.29426010E-02     0   452   125     0     0     0
   429  0.45729536E-02     0   453   125     0     0     0
   429  0.31439838E-03     0   456   126     0     0     0
   429  0.45684152E-02     0   457   126     0     0     0
   6
   430  0.10146566E+00     0   450   126     0     0     0
   430  0.28343579E+00     0   451   126     0     0     0
   430  0.61174261E-03     0   452   126     0     0     0
   430  0.11809992E-01     0   453   126     0     0     0
   430  0.58902991E+00     0   454   125     0     0     0
   430  0.13646921E-01     0   455   125     0     0     0
   1
   431  0.10000000E+01     0   450   127     0     0     0
   1
   432  0.10000000E+01     0   450   128     0     0     0
   1
   433  0.10000000E+01     0   450   129     0     0     0
   1
   434  0.10000000E+01     0   450   130     0     0     0
   6
   435  0.98701817E+00     0   450   131     0     0     0
   435  0.58347895E-03     0   451   131     0     0     0
   435  0.29426010E-02     0   452   131     0     0     0
   435  0.45729536E-02     0   453   131     0     0     0
   435  0.31439838E-03     0   454   132     0     0     0
   435  0.45684152E-02     0   455   132     0     0     0
   6
   436  0.10146566E+00     0   450   132     0     0     0
   436  0.28343579E+00     0   451   132     0     0     0
   436  0.61174261E-03     0   452   132     0     0     0
   436  0.11809992E-01     0   453   132     0     0     0
   436  0.58902991E+00     0   456   131     0     0     0
   436  0.13646921E-01     0   457   131     0     0     0
   4
   437  0.99672872E+00     0   450   121     0     0     0
   437  0.43235545E-03     0   451   121     0     0     0
   437  0.52941690E-03     0   452   121     0     0     0
   437  0.23094935E-02     0   453   121     0     0     0
   0
   4
   439  0.99672872E+00     0   450   123     0     0     0
   439  0.43235545E-03     0   451   123     0     0     0
   439  0.52941690E-03     0   452   123     0     0     0
   439  0.23094935E-02     0   453   123     0     0     0
   0
   6
   441  0.94895892E-01     0   450   125     0     0     0
   441  0.29822713E+00     0   451   125     0     0     0
   441  0.10696796E-02     0   452   125     0     0     0
   441  0.70968848E-02     0   453   125     0     0     0
   441  0.57401276E+00     0   456   126     0     0     0
   441  0.24697632E-01     0   457   126     0     0     0
   0
   4
   443  0.99672872E+00     0   450   127     0     0     0
   443  0.43235545E-03     0   451   127     0     0     0
   443  0.52941690E-03     0   452   127     0     0     0
   443  0.23094935E-02     0   453   127     0     0     0
   0
   4
   445  0.99672872E+00     0   450   129     0     0     0
   445  0.43235545E-03     0   451   129     0     0     0
   445  0.52941690E-03     0   452   129     0     0     0
   445  0.23094935E-02     0   453   129     0     0     0
   0
   6
   447  0.94895892E-01     0   450   131     0     0     0
   447  0.29822713E+00     0   451   131     0     0     0
   447  0.10696796E-02     0   452   131     0     0     0
   447  0.70968848E-02     0   453   131     0     0     0
   447  0.57401276E+00     0   454   132     0     0     0
   447  0.24697632E-01     0   455   132     0     0     0
   0
   8
   449  0.13141665E+00     0   408     2     0     0     0
   449  0.13141665E+00     0   402     8     0     0     0
   449  0.11859031E+00     0   407     1     0     0     0
   449  0.11859031E+00     0   401     7     0     0     0
   449  0.11859003E+00     0   409     3     0     0     0
   449  0.11859003E+00     0   403     9     0     0     0
   449  0.13140301E+00     0   410     4     0     0     0
   449  0.13140301E+00     0   404    10     0     0     0
   0
  10
   451  0.39779386E-03     0   450   200     0     0     0
   451  0.60504130E-02     0   450   203     0     0     0
   451  0.12007682E+00     0   425   127     0     0     0
   451  0.12007682E+00     0   431   121     0     0     0
   451  0.12007678E+00     0   427   129     0     0     0
   451  0.12007678E+00     0   433   123     0     0     0
   451  0.12831116E+00     0   426   128     0     0     0
   451  0.12831116E+00     0   432   122     0     0     0
   451  0.12831116E+00     0   428   130     0     0     0
   451  0.12831116E+00     0   434   124     0     0     0
  22
   452  0.30474779E+00     0   454   199     0     0     0
   452  0.30474779E+00     0   456   198     0     0     0
   452  0.76265596E-01     0   450   200     0     0     0
   452  0.28475183E+00     0   451   200     0     0     0
   452  0.15348140E-01     0   450   203     0     0     0
   452  0.90959528E-02     0   451   203     0     0     0
   452  0.23670096E-03     0   402     8     0     0     0
   452  0.23670096E-03     0   408     2     0     0     0
   452  0.39689892E-03     0   401     7     0     0     0
   452  0.39689892E-03     0   407     1     0     0     0
   452  0.39689880E-03     0   403     9     0     0     0
   452  0.39689880E-03     0   409     3     0     0     0
   452  0.23669617E-03     0   404    10     0     0     0
   452  0.23669617E-03     0   410     4     0     0     0
   452  0.90989546E-04     0   425   127     0     0     0
   452  0.90989546E-04     0   431   121     0     0     0
   452  0.90989546E-04     0   427   129     0     0     0
   452  0.90989546E-04     0   433   123     0     0     0
   452  0.53613918E-03     0   426   128     0     0     0
   452  0.53613918E-03     0   432   122     0     0     0
   452  0.53613918E-03     0   428   130     0     0     0
   452  0.53613918E-03     0   434   124     0     0     0
  22
   453  0.27992839E+00     0   454   199     0     0     0
   453  0.27992839E+00     0   456   198     0     0     0
   453  0.14210557E-01     0   450   200     0     0     0
   453  0.97113010E-02     0   451   200     0     0     0
   453  0.60969532E-01     0   450   203     0     0     0
   453  0.23080045E+00     0   451   203     0     0     0
   453  0.77082650E-02     0   402     8     0     0     0
   453  0.77082650E-02     0   408     2     0     0     0
   453  0.92406524E-02     0   401     7     0     0     0
   453  0.92406524E-02     0   407     1     0     0     0
   453  0.92406487E-02     0   403     9     0     0     0
   453  0.92406487E-02     0   409     3     0     0     0
   453  0.77081211E-02     0   404    10     0     0     0
   453  0.77081211E-02     0   410     4     0     0     0
   453  0.47911000E-02     0   425   127     0     0     0
   453  0.47911000E-02     0   431   121     0     0     0
   453  0.47911000E-02     0   427   129     0     0     0
   453  0.47911000E-02     0   433   123     0     0     0
   453  0.93729058E-02     0   426   128     0     0     0
   453  0.93729058E-02     0   432   122     0     0     0
   453  0.93729058E-02     0   428   130     0     0     0
   453  0.93729058E-02     0   434   124     0     0     0
   7
   454  0.10556903E-04     0   450     2     7     0     0
   454  0.10556791E-04     0   450     4     9     0     0
   454  0.65545253E-02     0   450   198     0     0     0
   454  0.26604918E+00     0   426   127     0     0     0
   454  0.26604915E+00     0   428   129     0     0     0
   454  0.23066303E+00     0   431   122     0     0     0
   454  0.23066302E+00     0   433   124     0     0     0
  12
   455  0.71228094E-01     0   450   198     0     0     0
   455  0.28368890E+00     0   451   198     0     0     0
   455  0.11491504E-01     0   402     7     0     0     0
   455  0.23145765E-01     0   407     2     0     0     0
   455  0.11491379E-01     0   404     9     0     0     0
   455  0.23937076E-01     0   409     4     0     0     0
   455  0.93041034E-02     0   426   127     0     0     0
   455  0.93041034E-02     0   428   129     0     0     0
   455  0.18968470E-01     0   431   122     0     0     0
   455  0.18968469E-01     0   433   124     0     0     0
   455  0.27523756E+00     0   454   200     0     0     0
   455  0.24323462E+00     0   454   203     0     0     0
   7
   456  0.10556903E-04     0   450     8     1     0     0
   456  0.10556791E-04     0   450    10     3     0     0
   456  0.65545253E-02     0   450   199     0     0     0
   456  0.26604918E+00     0   432   121     0     0     0
   456  0.26604915E+00     0   434   123     0     0     0
   456  0.23066303E+00     0   425   128     0     0     0
   456  0.23066302E+00     0   427   130     0     0     0
  12
   457  0.71228094E-01     0   450   199     0     0     0
   457  0.28368890E+00     0   451   199     0     0     0
   457  0.11491504E-01     0   408     1     0     0     0
   457  0.23145765E-01     0   401     8     0     0     0
   457  0.11491379E-01     0   410     3     0     0     0
   457  0.23937076E-01     0   403    10     0     0     0
   457  0.93041034E-02     0   432   121     0     0     0
   457  0.93041034E-02     0   434   123     0     0     0
   457  0.18968470E-01     0   425   128     0     0     0
   457  0.18968469E-01     0   427   130     0     0     0
   457  0.27523756E+00     0   456   200     0     0     0
   457  0.24323462E+00     0   456   203     0     0     0
  28
   203  0.21321719E-03     0   123   129     0     0     0
   203  0.60964916E-01     0   125   131     0     0     0
   203  0.25643678E-02     0     3     9     0     0     0
   203  0.85107255E+00     0     5    11     0     0     0
   203  0.37275903E-01     0     4    10     0     0     0
   203  0.14708581E-02     0    59    59     0     0     0
   203  0.33301320E-01     0    13    13     0     0     0
   203  0.70844503E-03     0   198   121   128     0     0
   203  0.70844503E-03     0   198   123   130     0     0
   203  0.70844503E-03     0   198   125   132     0     0
   203  0.21253349E-02     0   198     8     1     0     0
   203  0.21253349E-02     0   198    10     3     0     0
   203  0.70844503E-03     0   199   127   122     0     0
   203  0.70844503E-03     0   199   129   124     0     0
   203  0.70844503E-03     0   199   131   126     0     0
   203  0.21253349E-02     0   199     2     7     0     0
   203  0.21253349E-02     0   199     4     9     0     0
   203  0.26320671E-04     0   200   122   128     0     0
   203  0.26320671E-04     0   200   124   130     0     0
   203  0.26320671E-04     0   200   126   132     0     0
   203  0.13246929E-04     0   200   121   127     0     0
   203  0.13246929E-04     0   200   123   129     0     0
   203  0.13246929E-04     0   200   125   131     0     0
   203  0.45382858E-04     0   200     2     8     0     0
   203  0.45382858E-04     0   200     4    10     0     0
   203  0.58464302E-04     0   200     1     7     0     0
   203  0.58464302E-04     0   200     3     9     0     0
   203  0.58464302E-04     0   200     5    11     0     0
  24
   204  0.31925916E-04     0   123   129     0     0     0
   204  0.91439011E-02     0   125   131     0     0     0
   204  0.37426237E-03     0     3     9     0     0     0
   204  0.92281364E-01     0     5    11     0     0     0
   204  0.16945392E-04     0     4    10     0     0     0
   204  0.77327871E+00     0     6    12     0     0     0
   204  0.44003697E-03     0    13    13     0     0     0
   204  0.18693910E-02     0   198   199     0     0     0
   204  0.94914233E-03     0   200   200     0     0     0
   204  0.19738232E-02     0   450   450     0     0     0
   204  0.11093607E-01     0   450   451     0     0     0
   204  0.62881224E-01     0   450   452     0     0     0
   204  0.82581919E-02     0   450   453     0     0     0
   204  0.80587761E-02     0   451   451     0     0     0
   204  0.17066946E-01     0   454   456     0     0     0
   204  0.80800205E-02     0   203   203     0     0     0
   204  0.35412112E-03     0   425   431     0     0     0
   204  0.35409204E-03     0   427   433     0     0     0
   204  0.32491697E-03     0   402   408     0     0     0
   204  0.32465282E-03     0   404   410     0     0     0
   204  0.17115579E-03     0   401   407     0     0     0
   204  0.17118441E-03     0   403   409     0     0     0
   204  0.12507912E-02     0   426   432     0     0     0
   204  0.12507912E-02     0   428   434     0     0     0
  14
   205  0.27699001E-04     0   123   129     0     0     0
   205  0.79333689E-02     0   125   131     0     0     0
   205  0.32473175E-03     0     3     9     0     0     0
   205  0.80145314E-01     0     5    11     0     0     0
   205  0.14157642E-04     0     4    10     0     0     0
   205  0.71735728E+00     0     6    12     0     0     0
   205  0.41894737E-03     0    13    13     0     0     0
   205  0.25955534E-02     0   450   450     0     0     0
   205  0.20544050E-01     0   450   451     0     0     0
   205  0.88063376E-02     0   450   452     0     0     0
   205  0.43287989E-01     0   450   453     0     0     0
   205  0.37743092E-01     0   451   451     0     0     0
   205  0.79221070E-01     0   454   456     0     0     0
   205  0.15804700E-02     0   203   200     0     0     0
  12
   206  0.37713642E-04     0   124   129     0     0     0
   206  0.10801699E-01     0   126   131     0     0     0
   206  0.42410093E-03     0     4     9     0     0     0
   206  0.87664062E+00     0     6    11     0     0     0
   206  0.40009916E-01     0   454   450     0     0     0
   206  0.19257908E-04     0   454   451     0     0     0
   206  0.65457284E-01     0   455   450     0     0     0
   206  0.21563703E-02     0   203   198     0     0     0
   206  0.52036345E-03     0   402   407     0     0     0
   206  0.52003126E-03     0   404   409     0     0     0
   206  0.17063740E-02     0   431   426     0     0     0
   206  0.17063244E-02     0   433   428     0     0     0
  12
   207  0.37713642E-04     0   130   123     0     0     0
   207  0.10801699E-01     0   132   125     0     0     0
   207  0.42410093E-03     0    10     3     0     0     0
   207  0.87664062E+00     0    12     5     0     0     0
   207  0.40009916E-01     0   456   450     0     0     0
   207  0.19257908E-04     0   456   451     0     0     0
   207  0.65457284E-01     0   457   450     0     0     0
   207  0.21563703E-02     0   203   199     0     0     0
   207  0.52036345E-03     0   408   401     0     0     0
   207  0.52003126E-03     0   410   403     0     0     0
   207  0.17063740E-02     0   425   432     0     0     0
   207  0.17063244E-02     0   427   434     0     0     0
   0
   5
     6  0.33333334E+00   100     2     7     5     0     0
     6  0.33333334E+00   100     4     9     5     0     0
     6  0.11111111E+00   100   122   127     5     0     0
     6  0.11111111E+00   100   124   129     5     0     0
     6  0.11111111E+00   100   126   131     5     0     0
   5
    12  0.33333334E+00   100     8     1    11     0     0
    12  0.33333334E+00   100    10     3    11     0     0
    12  0.11111111E+00   100   128   121    11     0     0
    12  0.11111111E+00   100   130   123    11     0     0
    12  0.11111111E+00   100   132   125    11     0     0
      4.00000000     -0.24957040
      0.99783212     -0.00948712      0.06105867     -0.02264903
     -0.02159280     -0.98076916      0.15958039     -0.11027171
      0.02671557     -0.03565333     -0.70476854     -0.70803690
     -0.05613529      0.19165295      0.68855429     -0.69714481
     -0.98753667      0.15738915     -0.15738915     -0.98753667
     -0.97385818      0.22715689     -0.22715689     -0.97385818
      1.57073224     -1.57079589     -1.57079446
    187.50000000   3000.00000000   3000.00000000
    750.00000000
    T
