  65
  401  11923.7686    0.89941E-27
  402  11923.4941    0.89941E-27
  403  11923.7686    0.89941E-27
  404  11923.4941    0.89941E-27
  405   2639.3838    0.50857E-26
  406   2147.0361    0.64206E-26
  407  11923.7686    0.89941E-27
  408  11923.4941    0.89941E-27
  409  11923.7686    0.89941E-27
  410  11923.4941    0.89941E-27
  411   2639.3838    0.50857E-26
  412   2147.0361    0.64206E-26
  413  11366.6729    0.11736E-26
  414  11933.7598    0.10841E-26
  415  11366.6729    0.11736E-26
  416  11933.7598    0.10841E-26
  417   3683.6624    0.15958E-26
  418   3604.9937    0.16528E-26
  419  11366.6729    0.11736E-26
  420  11933.7598    0.10841E-26
  421  11366.6729    0.11736E-26
  422  11933.7598    0.10841E-26
  423   3683.6624    0.15958E-26
  424   3604.9937    0.16528E-26
  425  11337.9092    0.41805E-26
  426  11341.8770    0.41787E-26
  427  11337.9092    0.41805E-26
  428  11341.8770    0.41787E-26
  429   5038.9951    0.12323E-25
  430   6090.4771    0.61075E-26
  431  11337.9092    0.41805E-26
  432  11341.8770    0.41787E-26
  433  11337.9092    0.41805E-26
  434  11341.8770    0.41787E-26
  435   5038.9951    0.12323E-25
  436   6090.4771    0.61075E-26
  437  11970.0391    0.10813E-25
  438      0.0000    0.10000E+31
  439  11970.0391    0.10813E-25
  440      0.0000    0.10000E+31
  441   6113.4717    0.60986E-26
  442      0.0000    0.10000E+31
  443  11970.0391    0.10813E-25
  444      0.0000    0.10000E+31
  445  11970.0391    0.10813E-25
  446      0.0000    0.10000E+31
  447   6113.4717    0.60986E-26
  448      0.0000    0.10000E+31
  449    700.0948    0.66601E-19
  450    107.3372    0.10000E+31
  451    232.8142    0.94182E-18
  452  -2564.5688    0.30355E-25
  453   2565.4998    0.31744E-25
  454    233.0638    0.58441E-19
  455   2567.4888    0.30096E-25
  456    233.0638    0.58441E-19
  457   2567.4888    0.30096E-25
  203    128.0605    0.12090E-21
  204   3062.4595    0.50117E-26
  205   3042.5295    0.50535E-26
  206   3064.1794    0.53721E-26
  207   3064.1794    0.53721E-26
  458      0.0000    0.10000E+31
    6    172.5000    0.57395E-24
   12    172.5000    0.57395E-24
   7
   401  0.23356203E-02     0   450     1     0     0     0
   401  0.68418026E-01     0   451     1     0     0     0
   401  0.32460302E-04     0   452     1     0     0     0
   401  0.39405561E-04     0   453     1     0     0     0
   401  0.79213607E+00     0   449     1     0     0     0
   401  0.13680282E+00     0   456     2     0     0     0
   401  0.23561108E-03     0   457     2     0     0     0
   6
   402  0.22664762E-02     0   450     2     0     0     0
   402  0.68511635E-01     0   451     2     0     0     0
   402  0.21117174E-04     0   452     2     0     0     0
   402  0.26961317E-04     0   453     2     0     0     0
   402  0.79211915E+00     0   449     2     0     0     0
   402  0.13705485E+00     0   454     1     0     0     0
   7
   403  0.23356203E-02     0   450     3     0     0     0
   403  0.68418026E-01     0   451     3     0     0     0
   403  0.32460302E-04     0   452     3     0     0     0
   403  0.39405561E-04     0   453     3     0     0     0
   403  0.79213607E+00     0   449     3     0     0     0
   403  0.13680282E+00     0   456     4     0     0     0
   403  0.23561108E-03     0   457     4     0     0     0
   6
   404  0.22664762E-02     0   450     4     0     0     0
   404  0.68511643E-01     0   451     4     0     0     0
   404  0.21117174E-04     0   452     4     0     0     0
   404  0.26961316E-04     0   453     4     0     0     0
   404  0.79211915E+00     0   449     4     0     0     0
   404  0.13705485E+00     0   454     3     0     0     0
   7
   405  0.11670173E-01     0   450     5     0     0     0
   405  0.10511784E-02     0   451     5     0     0     0
   405  0.33823549E-03     0   452     5     0     0     0
   405  0.32470908E-03     0   453     5     0     0     0
   405  0.98434442E+00     0   449     5     0     0     0
   405  0.20799499E-02     0   456     6     0     0     0
   405  0.19138918E-03     0   199   406     0     0     0
   4
   406  0.95014536E+00     0   449     6     0     0     0
   406  0.45888387E-01     0   450     6     0     0     0
   406  0.12597586E-02     0   451     6     0     0     0
   406  0.27065128E-02     0   454     5     0     0     0
   7
   407  0.23356203E-02     0   450     7     0     0     0
   407  0.68418026E-01     0   451     7     0     0     0
   407  0.32460302E-04     0   452     7     0     0     0
   407  0.39405561E-04     0   453     7     0     0     0
   407  0.79213607E+00     0   449     7     0     0     0
   407  0.13680282E+00     0   454     8     0     0     0
   407  0.23561108E-03     0   455     8     0     0     0
   6
   408  0.22664762E-02     0   450     8     0     0     0
   408  0.68511635E-01     0   451     8     0     0     0
   408  0.21117174E-04     0   452     8     0     0     0
   408  0.26961317E-04     0   453     8     0     0     0
   408  0.79211915E+00     0   449     8     0     0     0
   408  0.13705485E+00     0   456     7     0     0     0
   7
   409  0.23356203E-02     0   450     9     0     0     0
   409  0.68418026E-01     0   451     9     0     0     0
   409  0.32460302E-04     0   452     9     0     0     0
   409  0.39405561E-04     0   453     9     0     0     0
   409  0.79213607E+00     0   449     9     0     0     0
   409  0.13680282E+00     0   454    10     0     0     0
   409  0.23561108E-03     0   455    10     0     0     0
   6
   410  0.22664762E-02     0   450    10     0     0     0
   410  0.68511643E-01     0   451    10     0     0     0
   410  0.21117174E-04     0   452    10     0     0     0
   410  0.26961316E-04     0   453    10     0     0     0
   410  0.79211915E+00     0   449    10     0     0     0
   410  0.13705485E+00     0   456     9     0     0     0
   7
   411  0.11670173E-01     0   450    11     0     0     0
   411  0.10511784E-02     0   451    11     0     0     0
   411  0.33823549E-03     0   452    11     0     0     0
   411  0.32470908E-03     0   453    11     0     0     0
   411  0.98434442E+00     0   449    11     0     0     0
   411  0.20799499E-02     0   454    12     0     0     0
   411  0.19138918E-03     0   198   412     0     0     0
   4
   412  0.95014536E+00     0   449    12     0     0     0
   412  0.45888387E-01     0   450    12     0     0     0
   412  0.12597586E-02     0   451    12     0     0     0
   412  0.27065128E-02     0   456    11     0     0     0
   2
   413  0.11448723E-01     0   450     1     0     0     0
   413  0.98855126E+00     0   449     1     0     0     0
   2
   414  0.44414110E-01     0   450     2     0     0     0
   414  0.95558590E+00     0   449     2     0     0     0
   2
   415  0.11448723E-01     0   450     3     0     0     0
   415  0.98855126E+00     0   449     3     0     0     0
   2
   416  0.44414110E-01     0   450     4     0     0     0
   416  0.95558590E+00     0   449     4     0     0     0
  10
   417  0.12505319E-02     0   450     5     0     0     0
   417  0.36945261E-01     0   451     5     0     0     0
   417  0.12598338E-01     0   452     5     0     0     0
   417  0.12598351E-01     0   453     5     0     0     0
   417  0.44934562E+00     0   449     5     0     0     0
   417  0.73367916E-01     0   456     6     0     0     0
   417  0.30706754E-01     0   457     6     0     0     0
   417  0.31810766E+00     0   199   406     0     0     0
   417  0.17869983E-01     0   200   405     0     0     0
   417  0.47209587E-01     0   203   405     0     0     0
  10
   418  0.45054629E+00     0   449     6     0     0     0
   418  0.74562326E-01     0   454     5     0     0     0
   418  0.23394082E-01     0   455     5     0     0     0
   418  0.14426427E+00     0   200   406     0     0     0
   418  0.21127485E+00     0   203   406     0     0     0
   418  0.29408524E-01     0   198   405     0     0     0
   418  0.15186606E-02     0   450     6     0     0     0
   418  0.37043907E-01     0   451     6     0     0     0
   418  0.13469121E-01     0   452     6     0     0     0
   418  0.14518043E-01     0   453     6     0     0     0
   2
   419  0.11448723E-01     0   450     7     0     0     0
   419  0.98855126E+00     0   449     7     0     0     0
   2
   420  0.44414110E-01     0   450     8     0     0     0
   420  0.95558590E+00     0   449     8     0     0     0
   2
   421  0.11448723E-01     0   450     9     0     0     0
   421  0.98855126E+00     0   449     9     0     0     0
   2
   422  0.44414110E-01     0   450    10     0     0     0
   422  0.95558590E+00     0   449    10     0     0     0
  10
   423  0.12505319E-02     0   450    11     0     0     0
   423  0.36945261E-01     0   451    11     0     0     0
   423  0.12598338E-01     0   452    11     0     0     0
   423  0.12598351E-01     0   453    11     0     0     0
   423  0.44934562E+00     0   449    11     0     0     0
   423  0.73367916E-01     0   454    12     0     0     0
   423  0.30706754E-01     0   455    12     0     0     0
   423  0.31810766E+00     0   198   412     0     0     0
   423  0.17869983E-01     0   200   411     0     0     0
   423  0.47209587E-01     0   203   411     0     0     0
  10
   424  0.45054629E+00     0   449    12     0     0     0
   424  0.74562326E-01     0   456    11     0     0     0
   424  0.23394082E-01     0   457    11     0     0     0
   424  0.14426427E+00     0   200   412     0     0     0
   424  0.21127485E+00     0   203   412     0     0     0
   424  0.29408524E-01     0   199   411     0     0     0
   424  0.15186606E-02     0   450    12     0     0     0
   424  0.37043907E-01     0   451    12     0     0     0
   424  0.13469121E-01     0   452    12     0     0     0
   424  0.14518043E-01     0   453    12     0     0     0
   6
   425  0.91065720E-01     0   450   121     0     0     0
   425  0.30320221E+00     0   451   121     0     0     0
   425  0.53384185E-04     0   452   121     0     0     0
   425  0.73805342E-04     0   453   121     0     0     0
   425  0.60457432E+00     0   456   122     0     0     0
   425  0.10306159E-02     0   457   122     0     0     0
   6
   426  0.91974549E-01     0   450   122     0     0     0
   426  0.30191675E+00     0   451   122     0     0     0
   426  0.20223185E-03     0   452   122     0     0     0
   426  0.23709951E-03     0   453   122     0     0     0
   426  0.60565460E+00     0   454   121     0     0     0
   426  0.14744445E-04     0   455   121     0     0     0
   6
   427  0.91065720E-01     0   450   123     0     0     0
   427  0.30320221E+00     0   451   123     0     0     0
   427  0.53384185E-04     0   452   123     0     0     0
   427  0.73805342E-04     0   453   123     0     0     0
   427  0.60457432E+00     0   456   124     0     0     0
   427  0.10306159E-02     0   457   124     0     0     0
   6
   428  0.91974549E-01     0   450   124     0     0     0
   428  0.30191675E+00     0   451   124     0     0     0
   428  0.20223185E-03     0   452   124     0     0     0
   428  0.23709951E-03     0   453   124     0     0     0
   428  0.60565460E+00     0   454   123     0     0     0
   428  0.14744445E-04     0   455   123     0     0     0
   6
   429  0.47939536E+00     0   450   125     0     0     0
   429  0.13260266E-02     0   451   125     0     0     0
   429  0.12946294E+00     0   452   125     0     0     0
   429  0.12934992E+00     0   453   125     0     0     0
   429  0.26426713E-02     0   456   126     0     0     0
   429  0.25782305E+00     0   457   126     0     0     0
   7
   430  0.72154023E-01     0   450   126     0     0     0
   430  0.23646565E+00     0   451   126     0     0     0
   430  0.11931492E-03     0   452   126     0     0     0
   430  0.13985366E-03     0   453   126     0     0     0
   430  0.47488800E+00     0   454   125     0     0     0
   430  0.19114564E+00     0   455   125     0     0     0
   430  0.25087480E-01     0   198   429     0     0     0
   6
   431  0.91065720E-01     0   450   127     0     0     0
   431  0.30320221E+00     0   451   127     0     0     0
   431  0.53384185E-04     0   452   127     0     0     0
   431  0.73805342E-04     0   453   127     0     0     0
   431  0.60457432E+00     0   454   128     0     0     0
   431  0.10306159E-02     0   455   128     0     0     0
   6
   432  0.91974549E-01     0   450   128     0     0     0
   432  0.30191675E+00     0   451   128     0     0     0
   432  0.20223185E-03     0   452   128     0     0     0
   432  0.23709951E-03     0   453   128     0     0     0
   432  0.60565460E+00     0   456   127     0     0     0
   432  0.14744445E-04     0   457   127     0     0     0
   6
   433  0.91065720E-01     0   450   129     0     0     0
   433  0.30320221E+00     0   451   129     0     0     0
   433  0.53384185E-04     0   452   129     0     0     0
   433  0.73805342E-04     0   453   129     0     0     0
   433  0.60457432E+00     0   454   130     0     0     0
   433  0.10306159E-02     0   455   130     0     0     0
   6
   434  0.91974549E-01     0   450   130     0     0     0
   434  0.30191675E+00     0   451   130     0     0     0
   434  0.20223185E-03     0   452   130     0     0     0
   434  0.23709951E-03     0   453   130     0     0     0
   434  0.60565460E+00     0   456   129     0     0     0
   434  0.14744445E-04     0   457   129     0     0     0
   6
   435  0.47939536E+00     0   450   131     0     0     0
   435  0.13260266E-02     0   451   131     0     0     0
   435  0.12946294E+00     0   452   131     0     0     0
   435  0.12934992E+00     0   453   131     0     0     0
   435  0.26426713E-02     0   454   132     0     0     0
   435  0.25782305E+00     0   455   132     0     0     0
   7
   436  0.72154023E-01     0   450   132     0     0     0
   436  0.23646565E+00     0   451   132     0     0     0
   436  0.11931492E-03     0   452   132     0     0     0
   436  0.13985366E-03     0   453   132     0     0     0
   436  0.47488800E+00     0   456   131     0     0     0
   436  0.19114564E+00     0   457   131     0     0     0
   436  0.25087480E-01     0   199   435     0     0     0
   3
   437  0.99974006E+00     0   450   121     0     0     0
   437  0.13200790E-03     0   452   121     0     0     0
   437  0.12794201E-03     0   453   121     0     0     0
   0
   3
   439  0.99974006E+00     0   450   123     0     0     0
   439  0.13200790E-03     0   452   123     0     0     0
   439  0.12794201E-03     0   453   123     0     0     0
   0
   8
   441  0.71692504E-01     0   450   125     0     0     0
   441  0.23774888E+00     0   451   125     0     0     0
   441  0.96461333E-01     0   452   125     0     0     0
   441  0.96442938E-01     0   453   125     0     0     0
   441  0.47352543E+00     0   456   126     0     0     0
   441  0.12508692E-02     0   457   126     0     0     0
   441  0.13437057E-01     0   200   429     0     0     0
   441  0.94409846E-02     0   203   429     0     0     0
   0
   3
   443  0.99974006E+00     0   450   127     0     0     0
   443  0.13200790E-03     0   452   127     0     0     0
   443  0.12794201E-03     0   453   127     0     0     0
   0
   3
   445  0.99974006E+00     0   450   129     0     0     0
   445  0.13200790E-03     0   452   129     0     0     0
   445  0.12794201E-03     0   453   129     0     0     0
   0
   8
   447  0.71692504E-01     0   450   131     0     0     0
   447  0.23774888E+00     0   451   131     0     0     0
   447  0.96461333E-01     0   452   131     0     0     0
   447  0.96442938E-01     0   453   131     0     0     0
   447  0.47352543E+00     0   454   132     0     0     0
   447  0.12508692E-02     0   455   132     0     0     0
   447  0.13437057E-01     0   200   435     0     0     0
   447  0.94409846E-02     0   203   435     0     0     0
   0
  20
   449  0.28012018E-02     0   454     1     8     0     0
   449  0.28012018E-02     0   456     2     7     0     0
   449  0.28012018E-02     0   454     3    10     0     0
   449  0.28012018E-02     0   456     4     9     0     0
   449  0.14717156E+00     0   454     5    12     0     0
   449  0.14717156E+00     0   456     6    11     0     0
   449  0.40992867E-03     0   450    13     0     0     0
   449  0.13323561E-02     0   450     2     8     0     0
   449  0.46114059E-03     0   450     1     7     0     0
   449  0.46114059E-03     0   450     3     9     0     0
   449  0.13323561E-02     0   450     4    10     0     0
   449  0.14862369E+00     0   450     5    11     0     0
   449  0.35195962E+00     0   450     6    12     0     0
   449  0.22960857E-02     0   451    13     0     0     0
   449  0.14038222E-02     0   451     2     8     0     0
   449  0.14017407E-02     0   451     1     7     0     0
   449  0.14017407E-02     0   451     3     9     0     0
   449  0.14038222E-02     0   451     4    10     0     0
   449  0.16290517E+00     0   451     5    11     0     0
   449  0.19059440E-01     0   451     6    12     0     0
   0
   4
   451  0.99972641E+00     0   450   200     0     0     0
   451  0.19727055E-03     0   450     5    11     0     0
   451  0.44978115E-04     0   450   125   131     0     0
   451  0.31208241E-04     0   450   126   132     0     0
  12
   452  0.26647958E+00     0   454   199     0     0     0
   452  0.26647958E+00     0   456   198     0     0     0
   452  0.36028076E-01     0   450   200     0     0     0
   452  0.13145033E+00     0   451   200     0     0     0
   452  0.24284334E-03     0   450     5    11     0     0
   452  0.19383453E-04     0   450   125   131     0     0
   452  0.40316401E-03     0   451     5    11     0     0
   452  0.38616872E-04     0   451   125   131     0     0
   452  0.33057921E-01     0   450   203     0     0     0
   452  0.97126320E-01     0   451   203     0     0     0
   452  0.84337041E-01     0   406    12     0     0     0
   452  0.84337041E-01     0   412     6     0     0     0
  12
   453  0.21510950E+00     0   454   199     0     0     0
   453  0.21510950E+00     0   456   198     0     0     0
   453  0.38899425E-01     0   450   200     0     0     0
   453  0.11089511E+00     0   451   200     0     0     0
   453  0.25405191E-03     0   450     5    11     0     0
   453  0.20210091E-04     0   450   125   131     0     0
   453  0.41934315E-03     0   451     5    11     0     0
   453  0.39940081E-04     0   451   125   131     0     0
   453  0.44319604E-01     0   450   203     0     0     0
   453  0.15853296E+00     0   451   203     0     0     0
   453  0.10820024E+00     0   406    12     0     0     0
   453  0.10820024E+00     0   412     6     0     0     0
   1
   454  0.10000000E+01     0   450   198     0     0     0
   7
   455  0.18848719E-04     0   450   131   126     0     0
   455  0.71098559E-01     0   450   198     0     0     0
   455  0.37954411E-04     0   451   131   126     0     0
   455  0.23915645E+00     0   451   198     0     0     0
   455  0.20466486E+00     0   406    11     0     0     0
   455  0.23792373E+00     0   454   200     0     0     0
   455  0.24709965E+00     0   454   203     0     0     0
   1
   456  0.10000000E+01     0   450   199     0     0     0
   7
   457  0.18848719E-04     0   450   125   132     0     0
   457  0.71098559E-01     0   450   199     0     0     0
   457  0.37954411E-04     0   451   125   132     0     0
   457  0.23915645E+00     0   451   199     0     0     0
   457  0.20466486E+00     0   412     5     0     0     0
   457  0.23792373E+00     0   456   200     0     0     0
   457  0.24709965E+00     0   456   203     0     0     0
  28
   203  0.16976516E-03     0   123   129     0     0     0
   203  0.48567377E-01     0   125   131     0     0     0
   203  0.20358022E-02     0     3     9     0     0     0
   203  0.65727782E+00     0     5    11     0     0     0
   203  0.29680012E-01     0     4    10     0     0     0
   203  0.21231438E-02     0    59    59     0     0     0
   203  0.40498503E-01     0    13    13     0     0     0
   203  0.10899557E-01     0   198   121   128     0     0
   203  0.10899557E-01     0   198   123   130     0     0
   203  0.10899557E-01     0   198   125   132     0     0
   203  0.32698669E-01     0   198     8     1     0     0
   203  0.32698669E-01     0   198    10     3     0     0
   203  0.10899557E-01     0   199   127   122     0     0
   203  0.10899557E-01     0   199   129   124     0     0
   203  0.10899557E-01     0   199   131   126     0     0
   203  0.32698669E-01     0   199     2     7     0     0
   203  0.32698669E-01     0   199     4     9     0     0
   203  0.16041322E-02     0   200   122   128     0     0
   203  0.16041322E-02     0   200   124   130     0     0
   203  0.16041322E-02     0   200   126   132     0     0
   203  0.80734363E-03     0   200   121   127     0     0
   203  0.80734363E-03     0   200   123   129     0     0
   203  0.80734363E-03     0   200   125   131     0     0
   203  0.27658907E-02     0   200     2     8     0     0
   203  0.27658907E-02     0   200     4    10     0     0
   203  0.35631489E-02     0   200     1     7     0     0
   203  0.35631489E-02     0   200     3     9     0     0
   203  0.35631489E-02     0   200     5    11     0     0
  16
   204  0.41827594E-03     0   123   129     0     0     0
   204  0.11980040E+00     0   125   131     0     0     0
   204  0.12035262E-04     0     1     7     0     0     0
   204  0.48628547E-02     0     3     9     0     0     0
   204  0.84838039E+00     0     5    11     0     0     0
   204  0.40075294E-03     0     6    12     0     0     0
   204  0.16984386E-04     0   450   450     0     0     0
   204  0.11033177E-03     0   450   451     0     0     0
   204  0.16039159E-02     0   450   452     0     0     0
   204  0.98782452E-03     0   450   453     0     0     0
   204  0.17854551E-03     0   451   451     0     0     0
   204  0.56232680E-02     0   451   452     0     0     0
   204  0.20326402E-02     0   451   453     0     0     0
   204  0.35610478E-03     0   454   456     0     0     0
   204  0.76078395E-02     0   454   457     0     0     0
   204  0.76078395E-02     0   456   455     0     0     0
  16
   205  0.41902155E-03     0   123   129     0     0     0
   205  0.12001412E+00     0   125   131     0     0     0
   205  0.12057246E-04     0     1     7     0     0     0
   205  0.48717372E-02     0     3     9     0     0     0
   205  0.84993368E+00     0     5    11     0     0     0
   205  0.40320845E-03     0     6    12     0     0     0
   205  0.17087725E-04     0   450   450     0     0     0
   205  0.11191730E-03     0   450   451     0     0     0
   205  0.92113821E-03     0   450   452     0     0     0
   205  0.15112696E-02     0   450   453     0     0     0
   205  0.18386455E-03     0   451   451     0     0     0
   205  0.18318233E-02     0   451   452     0     0     0
   205  0.52748695E-02     0   451   453     0     0     0
   205  0.36865586E-03     0   454   456     0     0     0
   205  0.70627560E-02     0   454   457     0     0     0
   205  0.70627560E-02     0   456   455     0     0     0
  10
   206  0.44860423E-03     0   124   129     0     0     0
   206  0.12848704E+00     0   126   131     0     0     0
   206  0.11964002E-04     0     2     7     0     0     0
   206  0.48340675E-02     0     4     9     0     0     0
   206  0.83840340E+00     0     6    11     0     0     0
   206  0.23674808E-03     0   454   450     0     0     0
   206  0.83116107E-02     0   454   452     0     0     0
   206  0.82792593E-02     0   454   453     0     0     0
   206  0.27353955E-02     0   455   450     0     0     0
   206  0.82520209E-02     0   455   451     0     0     0
  10
   207  0.44860423E-03     0   130   123     0     0     0
   207  0.12848704E+00     0   132   125     0     0     0
   207  0.11964002E-04     0     8     1     0     0     0
   207  0.48340675E-02     0    10     3     0     0     0
   207  0.83840340E+00     0    12     5     0     0     0
   207  0.23674808E-03     0   456   450     0     0     0
   207  0.83116107E-02     0   456   452     0     0     0
   207  0.82792593E-02     0   456   453     0     0     0
   207  0.27353955E-02     0   457   450     0     0     0
   207  0.82520209E-02     0   457   451     0     0     0
   0
   5
     6  0.33333334E+00   100     2     7     5     0     0
     6  0.33333334E+00   100     4     9     5     0     0
     6  0.11111111E+00   100   122   127     5     0     0
     6  0.11111111E+00   100   124   129     5     0     0
     6  0.11111111E+00   100   126   131     5     0     0
   5
    12  0.33333334E+00   100     8     1    11     0     0
    12  0.33333334E+00   100    10     3    11     0     0
    12  0.11111111E+00   100   128   121    11     0     0
    12  0.11111111E+00   100   130   123    11     0     0
    12  0.11111111E+00   100   132   125    11     0     0
     50.00000000     -0.02005617
      0.99985540     -0.00137512      0.01694717      0.00012871
      0.00189613      0.99952310     -0.03077833      0.00166785
      0.01204109     -0.02060461     -0.70670557     -0.70710522
     -0.01185462      0.02296176      0.70663488     -0.70710653
     -0.99998647      0.00519826     -0.00519826     -0.99998647
     -0.99905515      0.04346019     -0.04346019     -0.99905515
     -1.45164979     -1.50796080     -1.54648614
  -7131.16357422  -8028.44921875  -9917.63574219
   2564.59179688
    T
