  65
  401    459.7340    0.15043E-24
  402    453.6654    0.14428E-24
  403    459.7340    0.15043E-24
  404    453.6676    0.14428E-24
  405    421.3986    0.20178E-24
  406    304.9089    0.38963E-24
  407    459.7340    0.15043E-24
  408    453.6654    0.14428E-24
  409    459.7340    0.15043E-24
  410    453.6676    0.14428E-24
  411    421.3986    0.20178E-24
  412    304.9089    0.38963E-24
  413    442.0005    0.28417E-23
  414    441.7436    0.71089E-24
  415    442.0005    0.28417E-23
  416    441.7458    0.71090E-24
  417    442.0127    0.16544E-23
  418    495.0038    0.13729E-24
  419    442.0005    0.28417E-23
  420    441.7436    0.71089E-24
  421    442.0005    0.28417E-23
  422    441.7458    0.71090E-24
  423    442.0127    0.16544E-23
  424    495.0038    0.13729E-24
  425    171.6948    0.14139E-23
  426    154.9635    0.17996E-23
  427    171.6948    0.14139E-23
  428    154.9635    0.17996E-23
  429    128.5917    0.22372E-23
  430    154.0802    0.18595E-23
  431    171.6948    0.14139E-23
  432    154.9635    0.17996E-23
  433    171.6948    0.14139E-23
  434    154.9635    0.17996E-23
  435    128.5917    0.22372E-23
  436    154.0802    0.18595E-23
  437    128.8852    0.21933E-23
  438      0.0000    0.10000E+31
  439    128.8853    0.21933E-23
  440      0.0000    0.10000E+31
  441    171.5355    0.14287E-23
  442      0.0000    0.10000E+31
  443    128.8852    0.21933E-23
  444      0.0000    0.10000E+31
  445    128.8853    0.21933E-23
  446      0.0000    0.10000E+31
  447    171.5355    0.14287E-23
  448      0.0000    0.10000E+31
  449    486.6306    0.19154E-24
  450     70.3054    0.10000E+31
  451    128.7113    0.23657E-19
  452   -301.5994    0.36611E-24
  453    333.9659    0.23641E-24
  454    126.2689    0.72522E-20
  455    328.9654    0.23900E-24
  456    126.2689    0.72522E-20
  457    328.9654    0.23900E-24
  203     94.5925    0.16941E-21
  204    364.6269    0.12041E-23
  205    357.8949    0.34178E-24
  206    368.7617    0.42323E-24
  207    368.7617    0.42323E-24
  458      0.0000    0.10000E+31
    6    172.5000    0.57395E-24
   12    172.5000    0.57395E-24
   6
   401  0.46077687E-01     0   450     1     0     0     0
   401  0.28802976E+00     0   451     1     0     0     0
   401  0.10919762E-02     0   452     1     0     0     0
   401  0.14797327E-01     0   453     1     0     0     0
   401  0.60902476E+00     0   456     2     0     0     0
   401  0.40978499E-01     0   457     2     0     0     0
   6
   402  0.20064176E-03     0   450     2     0     0     0
   402  0.32417187E+00     0   451     2     0     0     0
   402  0.60678308E-03     0   452     2     0     0     0
   402  0.98750582E-02     0   453     2     0     0     0
   402  0.64814872E+00     0   454     1     0     0     0
   402  0.16996924E-01     0   455     1     0     0     0
   6
   403  0.46078388E-01     0   450     3     0     0     0
   403  0.28803414E+00     0   451     3     0     0     0
   403  0.10919929E-02     0   452     3     0     0     0
   403  0.14797556E-01     0   453     3     0     0     0
   403  0.60902178E+00     0   456     4     0     0     0
   403  0.40976167E-01     0   457     4     0     0     0
   6
   404  0.20063923E-03     0   450     4     0     0     0
   404  0.32416740E+00     0   451     4     0     0     0
   404  0.60676120E-03     0   452     4     0     0     0
   404  0.98745059E-02     0   453     4     0     0     0
   404  0.64815331E+00     0   454     3     0     0     0
   404  0.16997382E-01     0   455     3     0     0     0
   6
   405  0.59397567E-01     0   450     5     0     0     0
   405  0.33119538E+00     0   451     5     0     0     0
   405  0.11152123E-02     0   452     5     0     0     0
   405  0.10306021E-01     0   453     5     0     0     0
   405  0.40204844E+00     0   456     6     0     0     0
   405  0.19593738E+00     0   199   406     0     0     0
   3
   406  0.11280549E+00     0   450     6     0     0     0
   406  0.35735112E-01     0   451     6     0     0     0
   406  0.85145938E+00     0   454     5     0     0     0
   6
   407  0.46077687E-01     0   450     7     0     0     0
   407  0.28802976E+00     0   451     7     0     0     0
   407  0.10919762E-02     0   452     7     0     0     0
   407  0.14797327E-01     0   453     7     0     0     0
   407  0.60902476E+00     0   454     8     0     0     0
   407  0.40978499E-01     0   455     8     0     0     0
   6
   408  0.20064176E-03     0   450     8     0     0     0
   408  0.32417187E+00     0   451     8     0     0     0
   408  0.60678308E-03     0   452     8     0     0     0
   408  0.98750582E-02     0   453     8     0     0     0
   408  0.64814872E+00     0   456     7     0     0     0
   408  0.16996924E-01     0   457     7     0     0     0
   6
   409  0.46078388E-01     0   450     9     0     0     0
   409  0.28803414E+00     0   451     9     0     0     0
   409  0.10919929E-02     0   452     9     0     0     0
   409  0.14797556E-01     0   453     9     0     0     0
   409  0.60902178E+00     0   454    10     0     0     0
   409  0.40976167E-01     0   455    10     0     0     0
   6
   410  0.20063923E-03     0   450    10     0     0     0
   410  0.32416740E+00     0   451    10     0     0     0
   410  0.60676120E-03     0   452    10     0     0     0
   410  0.98745059E-02     0   453    10     0     0     0
   410  0.64815331E+00     0   456     9     0     0     0
   410  0.16997382E-01     0   457     9     0     0     0
   6
   411  0.59397567E-01     0   450    11     0     0     0
   411  0.33119538E+00     0   451    11     0     0     0
   411  0.11152123E-02     0   452    11     0     0     0
   411  0.10306021E-01     0   453    11     0     0     0
   411  0.40204844E+00     0   454    12     0     0     0
   411  0.19593738E+00     0   198   412     0     0     0
   3
   412  0.11280549E+00     0   450    12     0     0     0
   412  0.35735112E-01     0   451    12     0     0     0
   412  0.85145938E+00     0   456    11     0     0     0
   4
   413  0.95055735E+00     0   450     1     0     0     0
   413  0.44617541E-01     0   451     1     0     0     0
   413  0.82832045E-03     0   452     1     0     0     0
   413  0.39967825E-02     0   453     1     0     0     0
   4
   414  0.95057702E+00     0   450     2     0     0     0
   414  0.44611536E-01     0   451     2     0     0     0
   414  0.82670938E-03     0   452     2     0     0     0
   414  0.39847447E-02     0   453     2     0     0     0
   4
   415  0.95055735E+00     0   450     3     0     0     0
   415  0.44617541E-01     0   451     3     0     0     0
   415  0.82832063E-03     0   452     3     0     0     0
   415  0.39967839E-02     0   453     3     0     0     0
   4
   416  0.95057732E+00     0   450     4     0     0     0
   416  0.44611491E-01     0   451     4     0     0     0
   416  0.82668575E-03     0   452     4     0     0     0
   416  0.39845239E-02     0   453     4     0     0     0
   6
   417  0.52767825E+00     0   450     5     0     0     0
   417  0.13082919E+00     0   451     5     0     0     0
   417  0.11175002E-01     0   452     5     0     0     0
   417  0.22237051E-01     0   453     5     0     0     0
   417  0.13881730E+00     0   456     6     0     0     0
   417  0.16926321E+00     0   199   406     0     0     0
   7
   418  0.20881870E+00     0   454     5     0     0     0
   418  0.29195565E+00     0   455     5     0     0     0
   418  0.29737371E+00     0   200   406     0     0     0
   418  0.50510645E-01     0   203   406     0     0     0
   418  0.22777308E-01     0   450     6     0     0     0
   418  0.10311960E+00     0   451     6     0     0     0
   418  0.25444383E-01     0   452     6     0     0     0
   4
   419  0.95055735E+00     0   450     7     0     0     0
   419  0.44617541E-01     0   451     7     0     0     0
   419  0.82832045E-03     0   452     7     0     0     0
   419  0.39967825E-02     0   453     7     0     0     0
   4
   420  0.95057702E+00     0   450     8     0     0     0
   420  0.44611536E-01     0   451     8     0     0     0
   420  0.82670938E-03     0   452     8     0     0     0
   420  0.39847447E-02     0   453     8     0     0     0
   4
   421  0.95055735E+00     0   450     9     0     0     0
   421  0.44617541E-01     0   451     9     0     0     0
   421  0.82832063E-03     0   452     9     0     0     0
   421  0.39967839E-02     0   453     9     0     0     0
   4
   422  0.95057732E+00     0   450    10     0     0     0
   422  0.44611491E-01     0   451    10     0     0     0
   422  0.82668575E-03     0   452    10     0     0     0
   422  0.39845239E-02     0   453    10     0     0     0
   6
   423  0.52767825E+00     0   450    11     0     0     0
   423  0.13082919E+00     0   451    11     0     0     0
   423  0.11175002E-01     0   452    11     0     0     0
   423  0.22237051E-01     0   453    11     0     0     0
   423  0.13881730E+00     0   454    12     0     0     0
   423  0.16926321E+00     0   198   412     0     0     0
   7
   424  0.20881870E+00     0   456    11     0     0     0
   424  0.29195565E+00     0   457    11     0     0     0
   424  0.29737371E+00     0   200   412     0     0     0
   424  0.50510645E-01     0   203   412     0     0     0
   424  0.22777308E-01     0   450    12     0     0     0
   424  0.10311960E+00     0   451    12     0     0     0
   424  0.25444383E-01     0   452    12     0     0     0
   3
   425  0.15153903E+00     0   450   121     0     0     0
   425  0.32123908E+00     0   451   121     0     0     0
   425  0.52722192E+00     0   456   122     0     0     0
   3
   426  0.52538180E+00     0   450   122     0     0     0
   426  0.10818414E+00     0   451   122     0     0     0
   426  0.36643404E+00     0   454   121     0     0     0
   3
   427  0.15153894E+00     0   450   123     0     0     0
   427  0.32123834E+00     0   451   123     0     0     0
   427  0.52722269E+00     0   456   124     0     0     0
   3
   428  0.52538341E+00     0   450   124     0     0     0
   428  0.10818446E+00     0   451   124     0     0     0
   428  0.36643216E+00     0   454   123     0     0     0
   2
   429  0.99989879E+00     0   450   125     0     0     0
   429  0.10118187E-03     0   456   126     0     0     0
   3
   430  0.53655487E+00     0   450   126     0     0     0
   430  0.10553312E+00     0   451   126     0     0     0
   430  0.35791200E+00     0   454   125     0     0     0
   3
   431  0.15153903E+00     0   450   127     0     0     0
   431  0.32123908E+00     0   451   127     0     0     0
   431  0.52722192E+00     0   454   128     0     0     0
   3
   432  0.52538180E+00     0   450   128     0     0     0
   432  0.10818414E+00     0   451   128     0     0     0
   432  0.36643404E+00     0   456   127     0     0     0
   3
   433  0.15153894E+00     0   450   129     0     0     0
   433  0.32123834E+00     0   451   129     0     0     0
   433  0.52722269E+00     0   454   130     0     0     0
   3
   434  0.52538341E+00     0   450   130     0     0     0
   434  0.10818446E+00     0   451   130     0     0     0
   434  0.36643216E+00     0   456   129     0     0     0
   2
   435  0.99989879E+00     0   450   131     0     0     0
   435  0.10118187E-03     0   454   132     0     0     0
   3
   436  0.53655487E+00     0   450   132     0     0     0
   436  0.10553312E+00     0   451   132     0     0     0
   436  0.35791200E+00     0   456   131     0     0     0
   1
   437  0.10000000E+01     0   450   121     0     0     0
   0
   1
   439  0.10000000E+01     0   450   123     0     0     0
   0
   3
   441  0.16970628E+00     0   450   125     0     0     0
   441  0.31418315E+00     0   451   125     0     0     0
   441  0.51611060E+00     0   456   126     0     0     0
   0
   1
   443  0.10000000E+01     0   450   127     0     0     0
   0
   1
   445  0.10000000E+01     0   450   129     0     0     0
   0
   3
   447  0.16970628E+00     0   450   131     0     0     0
   447  0.31418315E+00     0   451   131     0     0     0
   447  0.51611060E+00     0   454   132     0     0     0
   0
  26
   449  0.60181676E-04     0   454     5    12     0     0
   449  0.60181676E-04     0   456     6    11     0     0
   449  0.21473314E-04     0   452    13     0     0     0
   449  0.10325539E-04     0   453    13     0     0     0
   449  0.30164560E-01     0   408     2     0     0     0
   449  0.30164560E-01     0   402     8     0     0     0
   449  0.20340772E-01     0   407     1     0     0     0
   449  0.20340772E-01     0   401     7     0     0     0
   449  0.54518335E-01     0   420     2     0     0     0
   449  0.54518335E-01     0   414     8     0     0     0
   449  0.53926062E-01     0   419     1     0     0     0
   449  0.53926062E-01     0   413     7     0     0     0
   449  0.20340204E-01     0   409     3     0     0     0
   449  0.20340204E-01     0   403     9     0     0     0
   449  0.53925507E-01     0   421     3     0     0     0
   449  0.53925507E-01     0   415     9     0     0     0
   449  0.30137120E-01     0   410     4     0     0     0
   449  0.30137120E-01     0   404    10     0     0     0
   449  0.54490857E-01     0   422     4     0     0     0
   449  0.54490857E-01     0   416    10     0     0     0
   449  0.10606707E+00     0   411     5     0     0     0
   449  0.10606707E+00     0   405    11     0     0     0
   449  0.56240290E-01     0   423     5     0     0     0
   449  0.56240290E-01     0   417    11     0     0     0
   449  0.19773152E-01     0   412     6     0     0     0
   449  0.19773152E-01     0   406    12     0     0     0
   0
  12
   451  0.98542951E-03     0   450    59     0     0     0
   451  0.89217154E-02     0   450     2     8     0     0
   451  0.15265170E-01     0   450     1     7     0     0
   451  0.15265170E-01     0   450     3     9     0     0
   451  0.89217024E-02     0   450     4    10     0     0
   451  0.16055411E-01     0   450     5    11     0     0
   451  0.28605387E+00     0   450   121   127     0     0
   451  0.28605136E+00     0   450   123   129     0     0
   451  0.29289858E-01     0   450   125   131     0     0
   451  0.10914344E+00     0   450   122   128     0     0
   451  0.10914344E+00     0   450   124   130     0     0
   451  0.11490344E+00     0   450   126   132     0     0
  24
   452  0.30581018E+00     0   454   199     0     0     0
   452  0.30581018E+00     0   456   198     0     0     0
   452  0.15646815E+00     0   450   200     0     0     0
   452  0.18961270E+00     0   451   200     0     0     0
   452  0.13458300E-01     0   450   203     0     0     0
   452  0.71665482E-02     0   451   203     0     0     0
   452  0.39087966E-03     0   425   127     0     0     0
   452  0.39087966E-03     0   431   121     0     0     0
   452  0.39087940E-03     0   427   129     0     0     0
   452  0.39087940E-03     0   433   123     0     0     0
   452  0.76662167E-03     0   437   127     0     0     0
   452  0.76662167E-03     0   443   121     0     0     0
   452  0.76662144E-03     0   439   129     0     0     0
   452  0.76662144E-03     0   445   123     0     0     0
   452  0.10027308E-02     0   429   131     0     0     0
   452  0.10027308E-02     0   435   125     0     0     0
   452  0.10261418E-02     0   441   131     0     0     0
   452  0.10261418E-02     0   447   125     0     0     0
   452  0.21584856E-02     0   426   128     0     0     0
   452  0.21584856E-02     0   432   122     0     0     0
   452  0.21584856E-02     0   428   130     0     0     0
   452  0.21584856E-02     0   434   124     0     0     0
   452  0.21761232E-02     0   430   132     0     0     0
   452  0.21761234E-02     0   436   126     0     0     0
  24
   453  0.26094723E+00     0   454   199     0     0     0
   453  0.26094723E+00     0   456   198     0     0     0
   453  0.12138001E-01     0   450   200     0     0     0
   453  0.81271464E-02     0   451   200     0     0     0
   453  0.78290358E-01     0   450   203     0     0     0
   453  0.10595544E+00     0   451   203     0     0     0
   453  0.10968220E-01     0   425   127     0     0     0
   453  0.10968220E-01     0   431   121     0     0     0
   453  0.10968215E-01     0   427   129     0     0     0
   453  0.10968215E-01     0   433   123     0     0     0
   453  0.44474346E-02     0   437   127     0     0     0
   453  0.44474346E-02     0   443   121     0     0     0
   453  0.44474341E-02     0   439   129     0     0     0
   453  0.44474341E-02     0   445   123     0     0     0
   453  0.40267813E-02     0   429   131     0     0     0
   453  0.40267813E-02     0   435   125     0     0     0
   453  0.11763853E-01     0   441   131     0     0     0
   453  0.11763853E-01     0   447   125     0     0     0
   453  0.29995989E-01     0   426   128     0     0     0
   453  0.29995989E-01     0   432   122     0     0     0
   453  0.29995989E-01     0   428   130     0     0     0
   453  0.29995989E-01     0   434   124     0     0     0
   453  0.30183394E-01     0   430   132     0     0     0
   453  0.30183394E-01     0   436   126     0     0     0
   5
   454  0.25758651E+00     0   450     2     7     0     0
   454  0.25758651E+00     0   450     4     9     0     0
   454  0.15726845E+00     0   450   127   122     0     0
   454  0.15726846E+00     0   450   129   124     0     0
   454  0.17029007E+00     0   450   131   126     0     0
  12
   455  0.24683170E-01     0   450   198     0     0     0
   455  0.31278735E+00     0   451   198     0     0     0
   455  0.25412632E-01     0   406    11     0     0     0
   455  0.27488321E-01     0   426   127     0     0     0
   455  0.27488317E-01     0   428   129     0     0     0
   455  0.28158050E-01     0   430   131     0     0     0
   455  0.51788423E-01     0   431   122     0     0     0
   455  0.51788401E-01     0   433   124     0     0     0
   455  0.10872033E-03     0   435   126     0     0     0
   455  0.52306417E-01     0   447   126     0     0     0
   455  0.24127278E+00     0   454   200     0     0     0
   455  0.15671740E+00     0   454   203     0     0     0
   5
   456  0.25758651E+00     0   450     8     1     0     0
   456  0.25758651E+00     0   450    10     3     0     0
   456  0.15726845E+00     0   450   121   128     0     0
   456  0.15726846E+00     0   450   123   130     0     0
   456  0.17029007E+00     0   450   125   132     0     0
  12
   457  0.24683170E-01     0   450   199     0     0     0
   457  0.31278735E+00     0   451   199     0     0     0
   457  0.25412632E-01     0   412     5     0     0     0
   457  0.27488321E-01     0   432   121     0     0     0
   457  0.27488317E-01     0   434   123     0     0     0
   457  0.28158050E-01     0   436   125     0     0     0
   457  0.51788423E-01     0   425   128     0     0     0
   457  0.51788401E-01     0   427   130     0     0     0
   457  0.10872033E-03     0   429   132     0     0     0
   457  0.52306417E-01     0   441   132     0     0     0
   457  0.24127278E+00     0   456   200     0     0     0
   457  0.15671740E+00     0   456   203     0     0     0
  17
   203  0.21657014E-03     0   123   129     0     0     0
   203  0.61898172E-01     0   125   131     0     0     0
   203  0.26091177E-02     0     3     9     0     0     0
   203  0.87917316E+00     0     5    11     0     0     0
   203  0.31480733E-01     0     4    10     0     0     0
   203  0.97178377E-03     0    59    59     0     0     0
   203  0.22819830E-01     0    13    13     0     0     0
   203  0.46146743E-04     0   198   121   128     0     0
   203  0.46146743E-04     0   198   123   130     0     0
   203  0.46146743E-04     0   198   125   132     0     0
   203  0.13844023E-03     0   198     8     1     0     0
   203  0.13844023E-03     0   198    10     3     0     0
   203  0.46146743E-04     0   199   127   122     0     0
   203  0.46146743E-04     0   199   129   124     0     0
   203  0.46146743E-04     0   199   131   126     0     0
   203  0.13844023E-03     0   199     2     7     0     0
   203  0.13844023E-03     0   199     4     9     0     0
  26
   204  0.41928295E-04     0   123   129     0     0     0
   204  0.12007202E-01     0   125   131     0     0     0
   204  0.49613969E-03     0     3     9     0     0     0
   204  0.79017155E-01     0     5    11     0     0     0
   204  0.98745208E-04     0     4    10     0     0     0
   204  0.27702379E+00     0     6    12     0     0     0
   204  0.24104595E-04     0    59    59     0     0     0
   204  0.32885014E-02     0    13    13     0     0     0
   204  0.31277131E-01     0   198   199     0     0     0
   204  0.14804315E-01     0   200   200     0     0     0
   204  0.43743409E-01     0   450   450     0     0     0
   204  0.99931113E-01     0   450   451     0     0     0
   204  0.46824306E-01     0   451   451     0     0     0
   204  0.18817386E+00     0   454   456     0     0     0
   204  0.95970191E-01     0   203   203     0     0     0
   204  0.44405172E-02     0   425   431     0     0     0
   204  0.69984538E-02     0   437   443     0     0     0
   204  0.44403034E-02     0   427   433     0     0     0
   204  0.69980822E-02     0   439   445     0     0     0
   204  0.70475298E-02     0   429   435     0     0     0
   204  0.43378239E-02     0   441   447     0     0     0
   204  0.11620306E-04     0   429   447     0     0     0
   204  0.11620306E-04     0   441   435     0     0     0
   204  0.24212170E-01     0   426   432     0     0     0
   204  0.24212170E-01     0   428   434     0     0     0
   204  0.24567805E-01     0   430   436     0     0     0
  12
   205  0.12001046E-04     0   123   129     0     0     0
   205  0.34371149E-02     0   125   131     0     0     0
   205  0.14203609E-03     0     3     9     0     0     0
   205  0.22629963E-01     0     5    11     0     0     0
   205  0.22249558E-04     0     4    10     0     0     0
   205  0.50783324E+00     0     6    12     0     0     0
   205  0.62879612E-03     0    13    13     0     0     0
   205  0.31692799E-01     0   450   450     0     0     0
   205  0.95818155E-01     0   450   451     0     0     0
   205  0.70571385E-01     0   451   451     0     0     0
   205  0.26011482E+00     0   454   456     0     0     0
   205  0.70974519E-02     0   203   200     0     0     0
  11
   206  0.15311971E-04     0   124   129     0     0     0
   206  0.43853801E-02     0   126   131     0     0     0
   206  0.19073721E-03     0     4     9     0     0     0
   206  0.83511645E+00     0     6    11     0     0     0
   206  0.11944127E+00     0   454   450     0     0     0
   206  0.65971110E-02     0   454   451     0     0     0
   206  0.10340113E-01     0   203   198     0     0     0
   206  0.79219351E-02     0   431   426     0     0     0
   206  0.79217963E-02     0   433   428     0     0     0
   206  0.32496519E-03     0   435   430     0     0     0
   206  0.77449502E-02     0   447   430     0     0     0
  11
   207  0.15311971E-04     0   130   123     0     0     0
   207  0.43853801E-02     0   132   125     0     0     0
   207  0.19073721E-03     0    10     3     0     0     0
   207  0.83511645E+00     0    12     5     0     0     0
   207  0.11944127E+00     0   456   450     0     0     0
   207  0.65971110E-02     0   456   451     0     0     0
   207  0.10340113E-01     0   203   199     0     0     0
   207  0.79219351E-02     0   425   432     0     0     0
   207  0.79217963E-02     0   427   434     0     0     0
   207  0.32496519E-03     0   429   436     0     0     0
   207  0.77449502E-02     0   441   436     0     0     0
   0
   5
     6  0.33333334E+00   100     2     7     5     0     0
     6  0.33333334E+00   100     4     9     5     0     0
     6  0.11111111E+00   100   122   127     5     0     0
     6  0.11111111E+00   100   124   129     5     0     0
     6  0.11111111E+00   100   126   131     5     0     0
   5
    12  0.33333334E+00   100     8     1    11     0     0
    12  0.33333334E+00   100    10     3    11     0     0
    12  0.11111111E+00   100   128   121    11     0     0
    12  0.11111111E+00   100   130   123    11     0     0
    12  0.11111111E+00   100   132   125    11     0     0
      3.00000000     -0.35981688
      0.96321708     -0.15403563      0.19450848     -0.10320903
     -0.22224998     -0.91635025      0.27613840     -0.18615746
     -0.05186096      0.07772990      0.69609046      0.71184719
     -0.14187334      0.36129388      0.63353902     -0.66930354
     -0.95378542      0.30048862     -0.30048862     -0.95378542
     -0.89746892      0.44107774     -0.44107774     -0.89746892
     -0.94571656     -0.21747155     -1.43122685
   -354.88403320   -567.82537842   -124.30543518
    299.03262329
    T
