#  ISAJET SUSY parameters in SUSY Les Houches Accord 2 format
#  Created by ISALHA 2.0 Last revision: C. Balazs 21 Apr 2009
Block SPINFO   # Program information
     1   ISASUGRA from ISAJET          # Spectrum Calculator
     2   7.80   29-OCT-2009 12:50:36   # Version number
Block MODSEL   # Model selection
     1     1   # Minimal supergravity (mSUGRA) model               
Block SMINPUTS   # Standard Model inputs
     1     1.27835800E+02   # alpha_em^(-1)
     2     1.16570000E-05   # G_Fermi
     3     1.17200002E-01   # alpha_s(M_Z)
     4     9.11699982E+01   # m_{Z}(pole)
     5     4.19999981E+00   # m_{b}(m_{b})
     6     1.72500000E+02   # m_{top}(pole)
     7     1.77699995E+00   # m_{tau}(pole)
Block MINPAR   # SUSY breaking input parameters
     1     2.40000000E+02   # m_0
     2     2.20000000E+02   # m_{1/2}
     3     4.00000000E+01   # tan(beta)
     4     1.00000000E+00   # sign(mu)
     5     0.00000000E+00   # A_0
Block EXTPAR   # Non-universal SUSY breaking parameters
     0     2.38195837E+16   # Input scale
Block MASS   # Scalar and gaugino mass spectrum
#  PDG code   mass                 particle
        24     8.04229965E+01   #  W^+
        25     1.09280762E+02   #  h^0            
        35     2.98390839E+02   #  H^0            
        36     2.96490082E+02   #  A^0            
        37     3.10267212E+02   #  H^+            
   1000001     5.54314331E+02   #  dnl            
   1000002     5.48140076E+02   #  upl            
   1000003     5.54314331E+02   #  stl            
   1000004     5.48141907E+02   #  chl            
   1000005     4.59564026E+02   #  b1             
   1000006     3.90221283E+02   #  t1             
   1000011     2.85957062E+02   #  el-            
   1000012     2.73992523E+02   #  nuel           
   1000013     2.85957062E+02   #  mul-           
   1000014     2.73992523E+02   #  numl           
   1000015     1.79462158E+02   #  tau1           
   1000016     2.53463287E+02   #  nutl           
   1000021     5.50279541E+02   #  glss           
   1000022     8.57795410E+01   #  z1ss           
   1000023     1.56503342E+02   #  z2ss           
   1000024     1.56579529E+02   #  w1ss           
   1000025    -2.97025879E+02   #  z3ss           
   1000035     3.17602478E+02   #  z4ss           
   1000037     3.18014740E+02   #  w2ss           
   2000001     5.36420837E+02   #  dnr            
   2000002     5.36147766E+02   #  upr            
   2000003     5.36420898E+02   #  str            
   2000004     5.36149597E+02   #  chr            
   2000005     5.17144531E+02   #  b2             
   2000006     5.40954956E+02   #  t2             
   2000011     2.56881927E+02   #  er-            
   2000013     2.56881958E+02   #  mur-           
   2000015     2.87388550E+02   #  tau2           
Block ALPHA   # Effective Higgs mixing parameter
         -2.72957459E-02   # alpha
Block STOPMIX   # stop mixing matrix
  1  1     5.60969889E-01   # O_{11}
  1  2     8.27836215E-01   # O_{12}
  2  1    -8.27836215E-01   # O_{21}
  2  2     5.60969889E-01   # O_{22}
Block SBOTMIX   # sbottom mixing matrix
  1  1     7.75597215E-01   # O_{11}
  1  2     6.31228149E-01   # O_{12}
  2  1    -6.31228149E-01   # O_{21}
  2  2     7.75597215E-01   # O_{22}
Block STAUMIX   # stau mixing matrix
  1  1     4.82517153E-01   # O_{11}
  1  2     8.75886500E-01   # O_{12}
  2  1    -8.75886500E-01   # O_{21}
  2  2     4.82517153E-01   # O_{22}
Block NMIX   # neutralino mixing matrix
  1  1    -9.80466425E-01   #
  1  2     5.65182008E-02   #
  1  3    -1.79584473E-01   #
  1  4     5.69288470E-02   #
  2  1     1.23871006E-01   #
  2  2     9.17738736E-01   #
  2  3    -3.28689247E-01   #
  2  4     1.85404718E-01   #
  3  1    -7.85423815E-02   #
  3  2     1.14185013E-01   #
  3  3     6.89964652E-01   #
  3  4     7.10451484E-01   #
  4  1    -1.31045148E-01   #
  4  2     3.76195490E-01   #
  4  3     6.19404197E-01   #
  4  4    -6.76492929E-01   #
Block UMIX   # chargino U mixing matrix
  1  1    -8.78454089E-01   # U_{11}
  1  2     4.77826774E-01   # U_{12}
  2  1    -4.77826774E-01   # U_{21}
  2  2    -8.78454089E-01   # U_{22}
Block VMIX   # chargino V mixing matrix
  1  1    -9.62962747E-01   # V_{11}
  1  2     2.69634455E-01   # V_{12}
  2  1    -2.69634455E-01   # V_{21}
  2  2    -9.62962747E-01   # V_{22}
Block GAUGE Q=  4.30092865E+02   #
     1     3.57526541E-01   # g`
     2     6.52374148E-01   # g_2
     3     1.21942031E+00   # g_3
Block YU Q=  4.30092865E+02   #
  3  3     8.82904112E-01   # y_t
Block YD Q=  4.30092865E+02   #
  3  3     4.99813974E-01   # y_b
Block YE Q=  4.30092865E+02   #
  3  3     4.24584061E-01   # y_tau
Block HMIX Q=  4.30092865E+02   # Higgs mixing parameters
     1     2.88577606E+02   # mu(Q)
     2     4.00000000E+01   # tan(beta)(M_GUT)
     3     2.50133835E+02   # Higgs vev at Q
     4     8.79063672E+04   # m_A^2(Q)
Block MSOFT Q=  4.30092865E+02   # DRbar SUSY breaking parameters
     1     8.92964554E+01   # M_1(Q)          
     2     1.68965683E+02   # M_2(Q)          
     3     5.15072998E+02   # M_3(Q)          
    31     2.81234344E+02   # MeL(Q)          
    32     2.81234344E+02   # MmuL(Q)         
    33     2.61487549E+02   # MtauL(Q)        
    34     2.52933868E+02   # MeR(Q)          
    35     2.52933868E+02   # MmuR(Q)         
    36     2.06451584E+02   # MtauR(Q)        
    41     5.24273254E+02   # MqL1(Q)         
    42     5.24273254E+02   # MqL2(Q)         
    43     4.58888336E+02   # MqL3(Q)         
    44     5.11033020E+02   # MuR(Q)          
    45     5.11033020E+02   # McR(Q)          
    46     4.03104309E+02   # MtR(Q)          
    47     5.09412537E+02   # MdR(Q)          
    48     5.09412537E+02   # MsR(Q)          
    49     4.75281555E+02   # MbR(Q)          
Block AU Q=  4.30092865E+02   #
  1  1    -4.07014679E+02   # A_u
  2  2    -4.07014679E+02   # A_c
  3  3    -4.07014679E+02   # A_t
Block AD Q=  4.30092865E+02   #
  1  1    -5.44358215E+02   # A_d
  2  2    -5.44358215E+02   # A_s
  3  3    -5.44358215E+02   # A_b
Block AE Q=  4.30092865E+02   #
  1  1    -7.95796280E+01   # A_e
  2  2    -7.95796280E+01   # A_mu
  3  3    -7.95796280E+01   # A_tau
#  ISAJET decay tables in SUSY Les Houches accord format
#  Created by ISALHD. Last revision: C. Balazs, 2005 May 25
Block DCINFO                           # Program information
     1   ISASUGRA from ISAJET          # Spectrum Calculator
     2   7.80   29-OCT-2009 12:50:36   # Version number
#         PDG         Width
DECAY         6  1.14680779E+00   # TP    decays
#          BR          NDA       ID1       ID2       ID3       ID4
      3.33333343E-01    3            2        -1         5             # TP     -->  UP     DB     BT          
      3.33333343E-01    3            4        -3         5             # TP     -->  CH     SB     BT          
      1.11111112E-01    3          -11        12         5             # TP     -->  E+     NUE    BT          
      1.11111112E-01    3          -13        14         5             # TP     -->  MU+    NUM    BT          
      1.11111112E-01    3          -15        16         5             # TP     -->  TAU+   NUT    BT          
#         PDG         Width
DECAY   1000021  1.54832327E+00   # GLSS  decays
#          BR          NDA       ID1       ID2       ID3       ID4
      2.68214080E-03    3      1000024         1        -2             # GLSS   -->  W1SS+  DN     UB          
      2.68214080E-03    3     -1000024         2        -1             # GLSS   -->  W1SS-  UP     DB          
      2.68214080E-03    3      1000024         3        -4             # GLSS   -->  W1SS+  ST     CB          
      2.68214080E-03    3     -1000024         4        -3             # GLSS   -->  W1SS-  CH     SB          
      1.08277693E-03    3      1000024         5        -6             # GLSS   -->  W1SS+  BT     TB          
      1.08277693E-03    3     -1000024         6        -5             # GLSS   -->  W1SS-  TP     BB          
      2.45512347E-04    3      1000037         1        -2             # GLSS   -->  W2SS+  DN     UB          
      2.45512347E-04    3     -1000037         2        -1             # GLSS   -->  W2SS-  UP     DB          
      2.45512347E-04    3      1000037         3        -4             # GLSS   -->  W2SS+  ST     CB          
      2.45512347E-04    3     -1000037         4        -3             # GLSS   -->  W2SS-  CH     SB          
      1.45890794E-04    3      1000037         5        -6             # GLSS   -->  W2SS+  BT     TB          
      1.45890794E-04    3     -1000037         6        -5             # GLSS   -->  W2SS-  TP     BB          
      6.96321058E-06    2      1000022        21                       # GLSS   -->  Z1SS   GL                 
      2.71391211E-04    3      1000022         1        -1             # GLSS   -->  Z1SS   DN     DB          
      2.71391211E-04    3      1000022         3        -3             # GLSS   -->  Z1SS   ST     SB          
      8.30179895E-04    3      1000022         6        -6             # GLSS   -->  Z1SS   TP     TB          
      1.86596415E-04    2      1000023        21                       # GLSS   -->  Z2SS   GL                 
      3.87156731E-03    3      1000023         1        -1             # GLSS   -->  Z2SS   DN     DB          
      3.87156731E-03    3      1000023         3        -3             # GLSS   -->  Z2SS   ST     SB          
      1.89910323E-04    3      1000023         6        -6             # GLSS   -->  Z2SS   TP     TB          
      2.31552636E-04    2      1000025        21                       # GLSS   -->  Z3SS   GL                 
      7.25732752E-05    3      1000025         1        -1             # GLSS   -->  Z3SS   DN     DB          
      7.25732752E-05    3      1000025         3        -3             # GLSS   -->  Z3SS   ST     SB          
      1.63148565E-04    2      1000035        21                       # GLSS   -->  Z4SS   GL                 
      6.79917983E-04    3      1000035         1        -1             # GLSS   -->  Z4SS   DN     DB          
      6.79917983E-04    3      1000035         3        -3             # GLSS   -->  Z4SS   ST     SB          
      2.62552727E-04    2     -1000002         2                       # GLSS   -->  UBL    UP                 
      2.62552727E-04    2      1000002        -2                       # GLSS   -->  UPL    UB                 
      1.12063037E-02    2     -2000002         2                       # GLSS   -->  UBR    UP                 
      1.12063037E-02    2      2000002        -2                       # GLSS   -->  UPR    UB                 
      1.07828369E-02    2     -2000001         1                       # GLSS   -->  DBR    DN                 
      1.07828369E-02    2      2000001        -1                       # GLSS   -->  DNR    DB                 
      1.07816784E-02    2     -2000003         3                       # GLSS   -->  SBR    ST                 
      1.07816784E-02    2      2000003        -3                       # GLSS   -->  STR    SB                 
      2.03370597E-04    2     -1000004         4                       # GLSS   -->  CBL    CH                 
      2.03370597E-04    2      1000004        -4                       # GLSS   -->  CHL    CB                 
      1.11535378E-02    2     -2000004         4                       # GLSS   -->  CBR    CH                 
      1.11535378E-02    2      2000004        -4                       # GLSS   -->  CHR    CB                 
      3.75037402E-01    2     -1000005         5                       # GLSS   -->  BB1    BT                 
      3.75037402E-01    2      1000005        -5                       # GLSS   -->  BT1    BB                 
      6.77887276E-02    2     -2000005         5                       # GLSS   -->  BB2    BT                 
      6.77887276E-02    2      2000005        -5                       # GLSS   -->  BT2    BB                 
#         PDG         Width
DECAY   1000002  5.64939451E+00   # UPL   decays
#          BR          NDA       ID1       ID2       ID3       ID4
      5.89051051E-03    2      1000022         2                       # UPL    -->  Z1SS   UP                 
      3.04716974E-01    2      1000023         2                       # UPL    -->  Z2SS   UP                 
      2.02947599E-03    2      1000025         2                       # UPL    -->  Z3SS   UP                 
      2.23533902E-02    2      1000035         2                       # UPL    -->  Z4SS   UP                 
      6.38873816E-01    2      1000024         1                       # UPL    -->  W1SS+  DN                 
      2.61358246E-02    2      1000037         1                       # UPL    -->  W2SS+  DN                 
#         PDG         Width
DECAY   1000001  5.43175411E+00   # DNL   decays
#          BR          NDA       ID1       ID2       ID3       ID4
      2.28211638E-02    2      1000022         1                       # DNL    -->  Z1SS   DN                 
      2.91449338E-01    2      1000023         1                       # DNL    -->  Z2SS   DN                 
      3.60878021E-03    2      1000025         1                       # DNL    -->  Z3SS   DN                 
      3.10424715E-02    2      1000035         1                       # DNL    -->  Z4SS   DN                 
      1.40336831E-03    2      1000021         1                       # DNL    -->  GLSS   DN                 
      5.61395049E-01    2     -1000024         2                       # DNL    -->  W1SS-  UP                 
      8.82797837E-02    2     -1000037         2                       # DNL    -->  W2SS-  UP                 
#         PDG         Width
DECAY   1000003  5.43169785E+00   # STL   decays
#          BR          NDA       ID1       ID2       ID3       ID4
      2.28213985E-02    2      1000022         3                       # STL    -->  Z1SS   ST                 
      2.91452348E-01    2      1000023         3                       # STL    -->  Z2SS   ST                 
      3.60881747E-03    2      1000025         3                       # STL    -->  Z3SS   ST                 
      3.10427938E-02    2      1000035         3                       # STL    -->  Z4SS   ST                 
      1.40338286E-03    2      1000021         3                       # STL    -->  GLSS   ST                 
      5.61392903E-01    2     -1000024         4                       # STL    -->  W1SS-  CH                 
      8.82783607E-02    2     -1000037         4                       # STL    -->  W2SS-  CH                 
#         PDG         Width
DECAY   1000004  5.64939308E+00   # CHL   decays
#          BR          NDA       ID1       ID2       ID3       ID4
      5.89045836E-03    2      1000022         4                       # CHL    -->  Z1SS   CH                 
      3.04714113E-01    2      1000023         4                       # CHL    -->  Z2SS   CH                 
      2.02944549E-03    2      1000025         4                       # CHL    -->  Z3SS   CH                 
      2.23530065E-02    2      1000035         4                       # CHL    -->  Z4SS   CH                 
      6.38876855E-01    2      1000024         3                       # CHL    -->  W1SS+  ST                 
      2.61360966E-02    2      1000037         3                       # CHL    -->  W2SS+  ST                 
#         PDG         Width
DECAY   1000005  3.71281886E+00   # BT1   decays
#          BR          NDA       ID1       ID2       ID3       ID4
      1.14672169E-01    2      1000022         5                       # BT1    -->  Z1SS   BT                 
      3.68388146E-01    2      1000023         5                       # BT1    -->  Z2SS   BT                 
      8.29084367E-02    2      1000025         5                       # BT1    -->  Z3SS   BT                 
      3.59648652E-02    2      1000035         5                       # BT1    -->  Z4SS   BT                 
      3.98066401E-01    2     -1000024         6                       # BT1    -->  W1SS-  TP                 
#         PDG         Width
DECAY   1000006  2.78283429E+00   # TP1   decays
#          BR          NDA       ID1       ID2       ID3       ID4
      1.38079122E-01    2      1000022         6                       # TP1    -->  Z1SS   TP                 
      1.17552169E-01    2      1000023         6                       # TP1    -->  Z2SS   TP                 
      6.18451297E-01    2      1000024         5                       # TP1    -->  W1SS+  BT                 
      1.25917464E-01    2      1000037         5                       # TP1    -->  W2SS+  BT                 
#         PDG         Width
DECAY   2000002  1.13414693E+00   # UPR   decays
#          BR          NDA       ID1       ID2       ID3       ID4
      9.75379527E-01    2      1000022         2                       # UPR    -->  Z1SS   UP                 
      1.37219541E-02    2      1000023         2                       # UPR    -->  Z2SS   UP                 
      3.16673215E-03    2      1000025         2                       # UPR    -->  Z3SS   UP                 
      7.73178833E-03    2      1000035         2                       # UPR    -->  Z4SS   UP                 
#         PDG         Width
DECAY   2000001  2.83699930E-01   # DNR   decays
#          BR          NDA       ID1       ID2       ID3       ID4
      9.75367129E-01    2      1000022         1                       # DNR    -->  Z1SS   DN                 
      1.37236472E-02    2      1000023         1                       # DNR    -->  Z2SS   DN                 
      3.16937710E-03    2      1000025         1                       # DNR    -->  Z3SS   DN                 
      7.73978652E-03    2      1000035         1                       # DNR    -->  Z4SS   DN                 
#         PDG         Width
DECAY   2000003  2.83699989E-01   # STR   decays
#          BR          NDA       ID1       ID2       ID3       ID4
      9.75367129E-01    2      1000022         3                       # STR    -->  Z1SS   ST                 
      1.37236454E-02    2      1000023         3                       # STR    -->  Z2SS   ST                 
      3.16937780E-03    2      1000025         3                       # STR    -->  Z3SS   ST                 
      7.73978839E-03    2      1000035         3                       # STR    -->  Z4SS   ST                 
#         PDG         Width
DECAY   2000004  1.13413608E+00   # CHR   decays
#          BR          NDA       ID1       ID2       ID3       ID4
      9.75379586E-01    2      1000022         4                       # CHR    -->  Z1SS   CH                 
      1.37219438E-02    2      1000023         4                       # CHR    -->  Z2SS   CH                 
      3.16670816E-03    2      1000025         4                       # CHR    -->  Z3SS   CH                 
      7.73171289E-03    2      1000035         4                       # CHR    -->  Z4SS   CH                 
#         PDG         Width
DECAY   2000005  3.99011254E+00   # BT2   decays
#          BR          NDA       ID1       ID2       ID3       ID4
      1.24185234E-02    2      1000022         5                       # BT2    -->  Z1SS   BT                 
      6.74202591E-02    2      1000023         5                       # BT2    -->  Z2SS   BT                 
      1.65770754E-01    2      1000025         5                       # BT2    -->  Z3SS   BT                 
      1.75649688E-01    2      1000035         5                       # BT2    -->  Z4SS   BT                 
      6.27328083E-02    2     -1000024         6                       # BT2    -->  W1SS-  TP                 
      4.12655979E-01    2     -1000037         6                       # BT2    -->  W2SS-  TP                 
      1.03352025E-01    2          -24   1000006                       # BT2    -->  W-     TP1                
#         PDG         Width
DECAY   2000006  8.07539368E+00   # TP2   decays
#          BR          NDA       ID1       ID2       ID3       ID4
      2.09816635E-01    2      1000024         5                       # TP2    -->  W1SS+  BT                 
      2.97746062E-01    2      1000037         5                       # TP2    -->  W2SS+  BT                 
      7.65586644E-02    2           23   1000006                       # TP2    -->  Z0     TP1                
      1.91775635E-02    2           25   1000006                       # TP2    -->  HL0    TP1                
      4.08039108E-04    2           24   1000005                       # TP2    -->  W+     BT1                
      2.41057780E-02    2      1000022         6                       # TP2    -->  Z1SS   TP                 
      6.64463490E-02    2      1000023         6                       # TP2    -->  Z2SS   TP                 
      6.30505458E-02    2      1000025         6                       # TP2    -->  Z3SS   TP                 
      2.42690489E-01    2      1000035         6                       # TP2    -->  Z4SS   TP                 
#         PDG         Width
DECAY   1000011  1.71663642E+00   # EL-   decays
#          BR          NDA       ID1       ID2       ID3       ID4
      1.35109946E-01    2      1000022        11                       # EL-    -->  Z1SS   E-                 
      3.34352911E-01    2      1000023        11                       # EL-    -->  Z2SS   E-                 
      5.30536890E-01    2     -1000024        12                       # EL-    -->  W1SS-  NUE                
      2.01469732E-07    3      1000015        11       -15             # EL-    -->  TAU1-  E-     TAU+        
      7.82915635E-08    3     -1000015        11        15             # EL-    -->  TAU1+  E-     TAU-        
#         PDG         Width
DECAY   1000013  1.71663618E+00   # MUL-  decays
#          BR          NDA       ID1       ID2       ID3       ID4
      1.35109931E-01    2      1000022        13                       # MUL-   -->  Z1SS   MU-                
      3.34352791E-01    2      1000023        13                       # MUL-   -->  Z2SS   MU-                
      5.30536950E-01    2     -1000024        14                       # MUL-   -->  W1SS-  NUM                
      2.01469760E-07    3      1000015        13       -15             # MUL-   -->  TAU1-  MU-    TAU+        
      7.82915777E-08    3     -1000015        13        15             # MUL-   -->  TAU1+  MU-    TAU-        
#         PDG         Width
DECAY   1000015  5.41556120E-01   # TAU1- decays
#          BR          NDA       ID1       ID2       ID3       ID4
      8.78840029E-01    2      1000022        15                       # TAU1-  -->  Z1SS   TAU-               
      4.37371023E-02    2      1000023        15                       # TAU1-  -->  Z2SS   TAU-               
      7.74229243E-02    2     -1000024        16                       # TAU1-  -->  W1SS-  NUT                
#         PDG         Width
DECAY   1000012  1.68056786E+00   # NUEL  decays
#          BR          NDA       ID1       ID2       ID3       ID4
      1.97932109E-01    2      1000022        12                       # NUEL   -->  Z1SS   NUE                
      2.24885002E-01    2      1000023        12                       # NUEL   -->  Z2SS   NUE                
      5.77182174E-01    2      1000024        11                       # NUEL   -->  W1SS+  E-                 
      2.72004826E-07    3      1000015        12       -15             # NUEL   -->  TAU1-  NUE    TAU+        
      7.01443383E-08    3     -1000015        12        15             # NUEL   -->  TAU1+  NUE    TAU-        
      4.41515368E-07    3     -1000015        11        16             # NUEL   -->  TAU1+  E-     NUT         
#         PDG         Width
DECAY   1000014  1.68056738E+00   # NUML  decays
#          BR          NDA       ID1       ID2       ID3       ID4
      1.97932169E-01    2      1000022        14                       # NUML   -->  Z1SS   NUM                
      2.24885076E-01    2      1000023        14                       # NUML   -->  Z2SS   NUM                
      5.77182055E-01    2      1000024        13                       # NUML   -->  W1SS+  MU-                
      2.72004911E-07    3      1000015        14       -15             # NUML   -->  TAU1-  NUM    TAU+        
      7.01443597E-08    3     -1000015        14        15             # NUML   -->  TAU1+  NUM    TAU-        
      4.42557422E-07    3     -1000015        13        16             # NUML   -->  TAU1+  MU-    NUT         
#         PDG         Width
DECAY   1000016  1.42259932E+00   # NUTL  decays
#          BR          NDA       ID1       ID2       ID3       ID4
      2.08453879E-01    2      1000022        16                       # NUTL   -->  Z1SS   NUT                
      2.07277849E-01    2      1000023        16                       # NUTL   -->  Z2SS   NUT                
      5.82943499E-01    2      1000024        15                       # NUTL   -->  W1SS+  TAU-               
      1.80954572E-07    3     -1000015        16        15             # NUTL   -->  TAU1+  NUT    TAU-        
      1.47211627E-04    3      1000015        16       -15             # NUTL   -->  TAU1-  NUT    TAU+        
      1.47189086E-04    3      1000015        12       -11             # NUTL   -->  TAU1-  NUE    E+          
      1.47189086E-04    3      1000015        14       -13             # NUTL   -->  TAU1-  NUM    MU+         
      4.41567216E-04    3      1000015         2        -1             # NUTL   -->  TAU1-  UP     DB          
      4.41567216E-04    3      1000015         4        -3             # NUTL   -->  TAU1-  CH     SB          
#         PDG         Width
DECAY   2000011  9.99458551E-01   # ER-   decays
#          BR          NDA       ID1       ID2       ID3       ID4
      9.92068350E-01    2      1000022        11                       # ER-    -->  Z1SS   E-                 
      7.93167390E-03    2      1000023        11                       # ER-    -->  Z2SS   E-                 
      4.57879379E-09    3      1000015        11       -15             # ER-    -->  TAU1-  E-     TAU+        
      2.39018370E-08    3     -1000015        11        15             # ER-    -->  TAU1+  E-     TAU-        
      5.23925117E-20    3      1000015        12       -16             # ER-    -->  TAU1-  NUE    ANUT        
#         PDG         Width
DECAY   2000013  9.99458194E-01   # MUR-  decays
#          BR          NDA       ID1       ID2       ID3       ID4
      9.92068350E-01    2      1000022        13                       # MUR-   -->  Z1SS   MU-                
      7.93167390E-03    2      1000023        13                       # MUR-   -->  Z2SS   MU-                
      4.57880489E-09    3      1000015        13       -15             # MUR-   -->  TAU1-  MU-    TAU+        
      2.39018938E-08    3     -1000015        13        15             # MUR-   -->  TAU1+  MU-    TAU-        
      2.46246750E-15    3      1000015        14       -16             # MUR-   -->  TAU1-  NUM    ANUT        
#         PDG         Width
DECAY   2000015  1.26713157E+00   # TAU2- decays
#          BR          NDA       ID1       ID2       ID3       ID4
      3.10024053E-01    2      1000022        15                       # TAU2-  -->  Z1SS   TAU-               
      2.92566061E-01    2      1000023        15                       # TAU2-  -->  Z2SS   TAU-               
      3.61195773E-01    2     -1000024        16                       # TAU2-  -->  W1SS-  NUT                
      3.62141207E-02    2           23   1000015                       # TAU2-  -->  Z0     TAU1-              
#         PDG         Width
DECAY   1000023  2.23241987E-05   # Z2SS  decays
#          BR          NDA       ID1       ID2       ID3       ID4
      2.18079961E-03    2      1000022        22                       # Z2SS   -->  Z1SS   GM                 
      7.77794346E-02    3      1000022         2        -2             # Z2SS   -->  Z1SS   UP     UB          
      1.03550099E-01    3      1000022         1        -1             # Z2SS   -->  Z1SS   DN     DB          
      1.03550099E-01    3      1000022         3        -3             # Z2SS   -->  Z1SS   ST     SB          
      7.77793899E-02    3      1000022         4        -4             # Z2SS   -->  Z1SS   CH     CB          
      1.35932907E-01    3      1000022         5        -5             # Z2SS   -->  Z1SS   BT     BB          
      3.26316361E-03    3      1000022        11       -11             # Z2SS   -->  Z1SS   E-     E+          
      3.26316548E-03    3      1000022        13       -13             # Z2SS   -->  Z1SS   MU-    MU+         
      4.80702013E-01    3      1000022        15       -15             # Z2SS   -->  Z1SS   TAU-   TAU+        
      4.63984208E-03    3      1000022        12       -12             # Z2SS   -->  Z1SS   NUE    ANUE        
      4.63984208E-03    3      1000022        14       -14             # Z2SS   -->  Z1SS   NUM    ANUM        
      2.71920674E-03    3      1000022        16       -16             # Z2SS   -->  Z1SS   NUT    ANUT        
#         PDG         Width
DECAY   1000025  1.18481481E+00   # Z3SS  decays
#          BR          NDA       ID1       ID2       ID3       ID4
      2.77146569E-07    2      1000022        22                       # Z3SS   -->  Z1SS   GM                 
      1.37110334E-07    2      1000023        22                       # Z3SS   -->  Z2SS   GM                 
      2.67890781E-01    2      1000024       -24                       # Z3SS   -->  W1SS+  W-                 
      2.67890781E-01    2     -1000024        24                       # Z3SS   -->  W1SS-  W+                 
      1.20406657E-01    2      1000022        23                       # Z3SS   -->  Z1SS   Z0                 
      1.64823353E-01    2      1000023        23                       # Z3SS   -->  Z2SS   Z0                 
      3.06832817E-08    3      1000022         2        -2             # Z3SS   -->  Z1SS   UP     UB          
      1.48336339E-08    3      1000022         1        -1             # Z3SS   -->  Z1SS   DN     DB          
      1.48336339E-08    3      1000022         3        -3             # Z3SS   -->  Z1SS   ST     SB          
      3.06827772E-08    3      1000022         4        -4             # Z3SS   -->  Z1SS   CH     CB          
      9.05525958E-05    3      1000022         5        -5             # Z3SS   -->  Z1SS   BT     BB          
      1.56197184E-05    3      1000022        15       -15             # Z3SS   -->  Z1SS   TAU-   TAU+        
      2.88700193E-08    3      1000023         2        -2             # Z3SS   -->  Z2SS   UP     UB          
      4.09289633E-08    3      1000023         1        -1             # Z3SS   -->  Z2SS   DN     DB          
      4.09289633E-08    3      1000023         3        -3             # Z3SS   -->  Z2SS   ST     SB          
      2.88695396E-08    3      1000023         4        -4             # Z3SS   -->  Z2SS   CH     CB          
      3.57842619E-05    3      1000023         5        -5             # Z3SS   -->  Z2SS   BT     BB          
      4.68470171E-06    3      1000023        15       -15             # Z3SS   -->  Z2SS   TAU-   TAU+        
      2.60888357E-02    2      1000022        25                       # Z3SS   -->  Z1SS   HL0                
      7.85651244E-03    2      1000023        25                       # Z3SS   -->  Z2SS   HL0                
      1.42358003E-05    2      1000011       -11                       # Z3SS   -->  EL-    E+                 
      1.42358003E-05    2     -1000011        11                       # Z3SS   -->  EL+    E-                 
      1.42351828E-05    2      1000013       -13                       # Z3SS   -->  MUL-   MU+                
      1.42351828E-05    2     -1000013        13                       # Z3SS   -->  MUL+   MU-                
      2.49838136E-04    2      2000011       -11                       # Z3SS   -->  ER-    E+                 
      2.49838136E-04    2     -2000011        11                       # Z3SS   -->  ER+    E-                 
      2.49837030E-04    2      2000013       -13                       # Z3SS   -->  MUR-   MU+                
      2.49837030E-04    2     -2000013        13                       # Z3SS   -->  MUR+   MU-                
      6.91440105E-02    2      1000015       -15                       # Z3SS   -->  TAU1-  TAU+               
      6.91440105E-02    2     -1000015        15                       # Z3SS   -->  TAU1+  TAU-               
      1.22988271E-03    2      2000015       -15                       # Z3SS   -->  TAU2-  TAU+               
      1.22988271E-03    2     -2000015        15                       # Z3SS   -->  TAU2+  TAU-               
      2.90346390E-04    2      1000012       -12                       # Z3SS   -->  NUEL   ANUE               
      2.90346390E-04    2     -1000012        12                       # Z3SS   -->  ANUEL  NUE                
      2.90346390E-04    2      1000014       -14                       # Z3SS   -->  NUML   ANUM               
      2.90346390E-04    2     -1000014        14                       # Z3SS   -->  ANUML  NUM                
      9.65221494E-04    2      1000016       -16                       # Z3SS   -->  NUTL   ANUT               
      9.65221494E-04    2     -1000016        16                       # Z3SS   -->  ANUTL  NUT                
#         PDG         Width
DECAY   1000035  1.51051426E+00   # Z4SS  decays
#          BR          NDA       ID1       ID2       ID3       ID4
      1.97619357E-07    2      1000022        22                       # Z4SS   -->  Z1SS   GM                 
      1.12090266E-08    2      1000023        22                       # Z4SS   -->  Z2SS   GM                 
      5.34695488E-09    2      1000025        22                       # Z4SS   -->  Z3SS   GM                 
      3.01622599E-01    2      1000024       -24                       # Z4SS   -->  W1SS+  W-                 
      3.01622599E-01    2     -1000024        24                       # Z4SS   -->  W1SS-  W+                 
      3.27879339E-02    2      1000022        23                       # Z4SS   -->  Z1SS   Z0                 
      2.37080883E-02    2      1000023        23                       # Z4SS   -->  Z2SS   Z0                 
      2.66171554E-07    3      1000022         2        -2             # Z4SS   -->  Z1SS   UP     UB          
      3.26410088E-07    3      1000022         1        -1             # Z4SS   -->  Z1SS   DN     DB          
      3.26410088E-07    3      1000022         3        -3             # Z4SS   -->  Z1SS   ST     SB          
      2.66167234E-07    3      1000022         4        -4             # Z4SS   -->  Z1SS   CH     CB          
      7.02775869E-05    3      1000022         5        -5             # Z4SS   -->  Z1SS   BT     BB          
      1.23474319E-05    3      1000022        15       -15             # Z4SS   -->  Z1SS   TAU-   TAU+        
      1.39955887E-06    3      1000023         2        -2             # Z4SS   -->  Z2SS   UP     UB          
      1.54690974E-06    3      1000023         1        -1             # Z4SS   -->  Z2SS   DN     DB          
      1.54690974E-06    3      1000023         3        -3             # Z4SS   -->  Z2SS   ST     SB          
      1.39953568E-06    3      1000023         4        -4             # Z4SS   -->  Z2SS   CH     CB          
      3.28044225E-05    3      1000023         5        -5             # Z4SS   -->  Z2SS   BT     BB          
      3.60316176E-06    3      1000023        15       -15             # Z4SS   -->  Z2SS   TAU-   TAU+        
      2.37494490E-07    3      1000025         2        -2             # Z4SS   -->  Z3SS   UP     UB          
      3.08379441E-07    3      1000025         1        -1             # Z4SS   -->  Z3SS   DN     DB          
      3.08379441E-07    3      1000025         3        -3             # Z4SS   -->  Z3SS   ST     SB          
      2.37494490E-07    3      1000025         4        -4             # Z4SS   -->  Z3SS   CH     CB          
      1.69107551E-07    3      1000025         5        -5             # Z4SS   -->  Z3SS   BT     BB          
      6.96864859E-08    3      1000025        11       -11             # Z4SS   -->  Z3SS   E-     E+          
      6.96864859E-08    3      1000025        13       -13             # Z4SS   -->  Z3SS   MU-    MU+         
      6.31028172E-08    3      1000025        15       -15             # Z4SS   -->  Z3SS   TAU-   TAU+        
      1.38654187E-07    3      1000025        12       -12             # Z4SS   -->  Z3SS   NUE    ANUE        
      1.38654187E-07    3      1000025        14       -14             # Z4SS   -->  Z3SS   NUM    ANUM        
      1.38654187E-07    3      1000025        16       -16             # Z4SS   -->  Z3SS   NUT    ANUT        
      7.71613866E-02    2      1000022        25                       # Z4SS   -->  Z1SS   HL0                
      1.27301544E-01    2      1000023        25                       # Z4SS   -->  Z2SS   HL0                
      1.46791665E-03    2      1000011       -11                       # Z4SS   -->  EL-    E+                 
      1.46791665E-03    2     -1000011        11                       # Z4SS   -->  EL+    E-                 
      1.46790943E-03    2      1000013       -13                       # Z4SS   -->  MUL-   MU+                
      1.46790943E-03    2     -1000013        13                       # Z4SS   -->  MUL+   MU-                
      1.09815085E-03    2      2000011       -11                       # Z4SS   -->  ER-    E+                 
      1.09815085E-03    2     -2000011        11                       # Z4SS   -->  ER+    E-                 
      1.09814852E-03    2      2000013       -13                       # Z4SS   -->  MUR-   MU+                
      1.09814852E-03    2     -2000013        13                       # Z4SS   -->  MUR+   MU-                
      3.08855809E-02    2      1000015       -15                       # Z4SS   -->  TAU1-  TAU+               
      3.08855809E-02    2     -1000015        15                       # Z4SS   -->  TAU1+  TAU-               
      8.46223533E-03    2      2000015       -15                       # Z4SS   -->  TAU2-  TAU+               
      8.46223533E-03    2     -2000015        15                       # Z4SS   -->  TAU2+  TAU-               
      5.81580075E-03    2      1000012       -12                       # Z4SS   -->  NUEL   ANUE               
      5.81580075E-03    2     -1000012        12                       # Z4SS   -->  ANUEL  NUE                
      5.81580075E-03    2      1000014       -14                       # Z4SS   -->  NUML   ANUM               
      5.81580075E-03    2     -1000014        14                       # Z4SS   -->  ANUML  NUM                
      1.17221866E-02    2      1000016       -16                       # Z4SS   -->  NUTL   ANUT               
      1.17221866E-02    2     -1000016        16                       # Z4SS   -->  ANUTL  NUT                
#         PDG         Width
DECAY   1000024  9.94708971E-05   # W1SS+ decays
#          BR          NDA       ID1       ID2       ID3       ID4
      3.16383213E-01    3      1000022         2        -1             # W1SS+  -->  Z1SS   UP     DB          
      3.16383213E-01    3      1000022         4        -3             # W1SS+  -->  Z1SS   CH     SB          
      9.06539336E-02    3      1000022       -11        12             # W1SS+  -->  Z1SS   E+     NUE         
      9.06539336E-02    3      1000022       -13        14             # W1SS+  -->  Z1SS   MU+    NUM         
      1.85925722E-01    3      1000022       -15        16             # W1SS+  -->  Z1SS   TAU+   NUT         
      2.06750883E-14    3      1000023       -11        12             # W1SS+  -->  Z2SS   E+     NUE         
#         PDG         Width
DECAY   1000037  1.33975530E+00   # W2SS+ decays
#          BR          NDA       ID1       ID2       ID3       ID4
      4.94891140E-07    3      1000022         2        -1             # W2SS+  -->  Z1SS   UP     DB          
      4.94890003E-07    3      1000022         4        -3             # W2SS+  -->  Z1SS   CH     SB          
      5.98036013E-06    3      1000022       -15        16             # W2SS+  -->  Z1SS   TAU+   NUT         
      8.88967142E-02    2      1000022        24                       # W2SS+  -->  Z1SS   W+                 
      1.48320555E-06    3      1000023         2        -1             # W2SS+  -->  Z2SS   UP     DB          
      1.48320225E-06    3      1000023         4        -3             # W2SS+  -->  Z2SS   CH     SB          
      1.43753768E-05    3      1000023       -15        16             # W2SS+  -->  Z2SS   TAU+   NUT         
      3.46154392E-01    2      1000023        24                       # W2SS+  -->  Z2SS   W+                 
      1.08719451E-06    3      1000025         2        -1             # W2SS+  -->  Z3SS   UP     DB          
      1.08719451E-06    3      1000025         4        -3             # W2SS+  -->  Z3SS   CH     SB          
      3.61908974E-07    3      1000025       -11        12             # W2SS+  -->  Z3SS   E+     NUE         
      3.61908974E-07    3      1000025       -13        14             # W2SS+  -->  Z3SS   MU+    NUM         
      3.62028885E-07    3      1000025       -15        16             # W2SS+  -->  Z3SS   TAU+   NUT         
      1.30910954E-15    3      1000035       -11        12             # W2SS+  -->  Z4SS   E+     NUE         
      1.30910954E-15    3      1000035       -13        14             # W2SS+  -->  Z4SS   MU+    NUM         
      4.82384581E-03    2      1000012       -11                       # W2SS+  -->  NUEL   E+                 
      4.82383370E-03    2      1000014       -13                       # W2SS+  -->  NUML   MU+                
      5.23168370E-02    2      1000016       -15                       # W2SS+  -->  NUTL   TAU+               
      8.36148672E-03    2     -1000011        12                       # W2SS+  -->  EL+    NUE                
      8.36148672E-03    2     -1000013        14                       # W2SS+  -->  MUL+   NUM                
      3.45745273E-02    2     -1000015        16                       # W2SS+  -->  TAU1+  NUT                
      1.62632801E-02    2     -2000015        16                       # W2SS+  -->  TAU2+  NUT                
      2.63373017E-01    2      1000024        23                       # W2SS+  -->  W1SS+  Z0                 
      1.36741392E-06    3      1000024         1        -1             # W2SS+  -->  W1SS+  DN     DB          
      1.36739072E-06    3      1000024         3        -3             # W2SS+  -->  W1SS+  ST     SB          
      3.37809843E-06    3      1000024         2        -2             # W2SS+  -->  W1SS+  UP     UB          
      3.37809843E-06    3      1000024         4        -4             # W2SS+  -->  W1SS+  CH     CB          
      1.72013670E-01    2      1000024        25                       # W2SS+  -->  W1SS+  HL0                
#         PDG         Width
DECAY        25  4.37704893E-03   # HL0   decays
#          BR          NDA       ID1       ID2       ID3       ID4
      5.05974462E-09    2           11       -11                       # HL0    -->  E-     E+                 
      2.13630366E-04    2           13       -13                       # HL0    -->  MU-    MU+                
      6.10903054E-02    2           15       -15                       # HL0    -->  TAU-   TAU+               
      6.35542756E-06    2            1        -1                       # HL0    -->  DN     DB                 
      2.56791082E-03    2            3        -3                       # HL0    -->  ST     SB                 
      8.47910881E-01    2            5        -5                       # HL0    -->  BT     BB                 
      1.70500311E-06    2            2        -2                       # HL0    -->  UP     UB                 
      3.23499925E-02    2            4        -4                       # HL0    -->  CH     CB                 
      1.37827254E-03    2           22        22                       # HL0    -->  GM     GM                 
      3.22891213E-02    2           21        21                       # HL0    -->  GL     GL                 
      1.17645238E-03    3           24        11       -12             # HL0    -->  W+     E-     ANUE        
      1.17645238E-03    3           24        13       -14             # HL0    -->  W+     MU-    ANUM        
      1.17645238E-03    3           24        15       -16             # HL0    -->  W+     TAU-   ANUT        
      3.52935726E-03    3           24        -2         1             # HL0    -->  W+     UB     DN          
      3.52935726E-03    3           24        -4         3             # HL0    -->  W+     CB     ST          
      1.17645238E-03    3          -24       -11        12             # HL0    -->  W-     E+     NUE         
      1.17645238E-03    3          -24       -13        14             # HL0    -->  W-     MU+    NUM         
      1.17645238E-03    3          -24       -15        16             # HL0    -->  W-     TAU+   NUT         
      3.52935726E-03    3          -24         2        -1             # HL0    -->  W-     UP     DB          
      3.52935726E-03    3          -24         4        -3             # HL0    -->  W-     CH     SB          
      6.94554474E-05    3           23        12       -12             # HL0    -->  Z0     NUE    ANUE        
      6.94554474E-05    3           23        14       -14             # HL0    -->  Z0     NUM    ANUM        
      6.94554474E-05    3           23        16       -16             # HL0    -->  Z0     NUT    ANUT        
      3.49562288E-05    3           23        11       -11             # HL0    -->  Z0     E-     E+          
      3.49562288E-05    3           23        13       -13             # HL0    -->  Z0     MU-    MU+         
      3.49562288E-05    3           23        15       -15             # HL0    -->  Z0     TAU-   TAU+        
      1.19757067E-04    3           23         2        -2             # HL0    -->  Z0     UP     UB          
      1.19757067E-04    3           23         4        -4             # HL0    -->  Z0     CH     CB          
      1.54276611E-04    3           23         1        -1             # HL0    -->  Z0     DN     DB          
      1.54276611E-04    3           23         3        -3             # HL0    -->  Z0     ST     SB          
      1.54276611E-04    3           23         5        -5             # HL0    -->  Z0     BT     BB          
#         PDG         Width
DECAY        35  8.06283665E+00   # HH0   decays
#          BR          NDA       ID1       ID2       ID3       ID4
      1.00613953E-08    2           11       -11                       # HH0    -->  E-     E+                 
      4.24809958E-04    2           13       -13                       # HH0    -->  MU-    MU+                
      1.21646293E-01    2           15       -15                       # HH0    -->  TAU-   TAU+               
      1.24689659E-05    2            1        -1                       # HH0    -->  DN     DB                 
      5.03809284E-03    2            3        -3                       # HH0    -->  ST     SB                 
      8.67291152E-01    2            5        -5                       # HH0    -->  BT     BB                 
      1.85875555E-12    2            2        -2                       # HH0    -->  UP     UB                 
      3.05133057E-08    2            4        -4                       # HH0    -->  CH     CB                 
      1.54898103E-07    2           22        22                       # HH0    -->  GM     GM                 
      3.69701884E-05    2           21        21                       # HH0    -->  GL     GL                 
      3.69484201E-06    2           24       -24                       # HH0    -->  W+     W-                 
      1.68641634E-06    2           23        23                       # HH0    -->  Z0     Z0                 
      1.91596942E-03    2      1000022   1000022                       # HH0    -->  Z1SS   Z1SS               
      3.55805899E-03    2      1000022   1000023                       # HH0    -->  Z1SS   Z2SS               
      7.06268838E-05    2           25        25                       # HH0    -->  HL0    HL0                
#         PDG         Width
DECAY        36  8.07829475E+00   # HA0   decays
#          BR          NDA       ID1       ID2       ID3       ID4
      9.97937555E-09    2           11       -11                       # HA0    -->  E-     E+                 
      4.21347126E-04    2           13       -13                       # HA0    -->  MU-    MU+                
      1.20671637E-01    2           15       -15                       # HA0    -->  TAU-   TAU+               
      1.23682485E-05    2            1        -1                       # HA0    -->  DN     DB                 
      4.99739870E-03    2            3        -3                       # HA0    -->  ST     SB                 
      8.60798717E-01    2            5        -5                       # HA0    -->  BT     BB                 
      1.54587638E-12    2            2        -2                       # HA0    -->  UP     UB                 
      2.53997605E-08    2            4        -4                       # HA0    -->  CH     CB                 
      1.02664437E-07    2           22        22                       # HA0    -->  GM     GM                 
      5.73113794E-05    2           21        21                       # HA0    -->  GL     GL                 
      2.92515103E-03    2      1000022   1000022                       # HA0    -->  Z1SS   Z1SS               
      1.01136491E-02    2      1000022   1000023                       # HA0    -->  Z1SS   Z2SS               
      2.24028008E-06    2           25        23                       # HA0    -->  HL0    Z0                 
#         PDG         Width
DECAY        37  4.31730652E+00   # H+    decays
#          BR          NDA       ID1       ID2       ID3       ID4
      1.95405097E-08    2           12       -11                       # H+     -->  NUE    E+                 
      8.25035386E-04    2           14       -13                       # H+     -->  NUM    MU+                
      2.36287326E-01    2           16       -15                       # H+     -->  NUT    TAU+               
      2.20031980E-05    2            2        -1                       # H+     -->  UP     DB                 
      8.89010541E-03    2            4        -3                       # H+     -->  CH     SB                 
      7.28433728E-01    2            6        -5                       # H+     -->  TP     BB                 
      2.55358778E-02    2      1000024   1000022                       # H+     -->  W1SS+  Z1SS               
      5.82906659E-06    2           25        24                       # H+     -->  HL0    W+                 
