  65
  401    503.0903    0.93510E-25
  402    497.4608    0.99337E-25
  403    503.0904    0.93511E-25
  404    497.4627    0.99342E-25
  405   2000.1373    0.61483E-26
  406   2004.0999    0.43381E-26
  407    503.0903    0.93510E-25
  408    497.4608    0.99337E-25
  409    503.0904    0.93511E-25
  410    497.4627    0.99342E-25
  411   2000.1373    0.61483E-26
  412   2004.0999    0.43381E-26
  413    500.5668    0.14366E-24
  414    498.8644    0.12566E-24
  415    500.5669    0.14366E-24
  416    498.8662    0.12567E-24
  417   2000.7828    0.43483E-26
  418   2004.4734    0.43859E-26
  419    500.5668    0.14366E-24
  420    498.8644    0.12566E-24
  421    500.5669    0.14366E-24
  422    498.8662    0.12567E-24
  423   2000.7828    0.43483E-26
  424   2004.4734    0.43859E-26
  425    204.8549    0.47029E-23
  426    190.6121    0.48677E-23
  427    204.8549    0.47029E-23
  428    190.6121    0.48677E-23
  429    204.0348    0.11070E-23
  430   1999.0830    0.24712E-25
  431    204.8549    0.47029E-23
  432    190.6121    0.48677E-23
  433    204.8549    0.47029E-23
  434    190.6121    0.48677E-23
  435    204.0348    0.11070E-23
  436   1999.0830    0.24712E-25
  437    204.2095    0.11045E-23
  438      0.0000    0.10000E+31
  439    204.2095    0.11045E-23
  440      0.0000    0.10000E+31
  441   2000.5107    0.24748E-25
  442      0.0000    0.10000E+31
  443    204.2095    0.11045E-23
  444      0.0000    0.10000E+31
  445    204.2095    0.11045E-23
  446      0.0000    0.10000E+31
  447   2000.5107    0.24748E-25
  448      0.0000    0.10000E+31
  449    400.0000    0.44476E-21
  450     99.9659    0.10000E+31
  451    299.8095    0.42681E-24
  452   -602.6187    0.13973E-24
  453    618.4748    0.12210E-24
  454    299.5957    0.42583E-24
  455    617.6038    0.12230E-24
  456    299.5957    0.42583E-24
  457    617.6038    0.12230E-24
  203    105.4009    0.17896E-21
  204   1007.7203    0.86845E-25
  205   1000.0000    0.87468E-25
  206   1006.3821    0.95350E-25
  207   1006.3821    0.95350E-25
  458      0.0000    0.10000E+31
    6    172.5000    0.57395E-24
   12    172.5000    0.57395E-24
   4
   401  0.11241907E-01     0   450     1     0     0     0
   401  0.11704549E+00     0   451     1     0     0     0
   401  0.63886732E+00     0   449     1     0     0     0
   401  0.23284532E+00     0   456     2     0     0     0
   4
   402  0.78054154E-02     0   450     2     0     0     0
   402  0.12326588E+00     0   451     2     0     0     0
   402  0.62037742E+00     0   449     2     0     0     0
   402  0.24855123E+00     0   454     1     0     0     0
   4
   403  0.11241994E-01     0   450     3     0     0     0
   403  0.11704642E+00     0   451     3     0     0     0
   403  0.63887244E+00     0   449     3     0     0     0
   403  0.23283909E+00     0   456     4     0     0     0
   4
   404  0.78057502E-02     0   450     4     0     0     0
   404  0.12326962E+00     0   451     4     0     0     0
   404  0.62035680E+00     0   449     4     0     0     0
   404  0.24856780E+00     0   454     3     0     0     0
   7
   405  0.10435166E-01     0   450     5     0     0     0
   405  0.62692627E-04     0   451     5     0     0     0
   405  0.61397505E-03     0   452     5     0     0     0
   405  0.60683506E-03     0   453     5     0     0     0
   405  0.98707837E+00     0   449     5     0     0     0
   405  0.98633987E-04     0   456     6     0     0     0
   405  0.11043386E-02     0   457     6     0     0     0
   7
   406  0.68677270E+00     0   449     6     0     0     0
   406  0.29178558E-01     0   450     6     0     0     0
   406  0.25607138E-02     0   451     6     0     0     0
   406  0.70969641E-01     0   452     6     0     0     0
   406  0.67639709E-01     0   453     6     0     0     0
   406  0.52627139E-02     0   454     5     0     0     0
   406  0.13761593E+00     0   455     5     0     0     0
   4
   407  0.11241907E-01     0   450     7     0     0     0
   407  0.11704549E+00     0   451     7     0     0     0
   407  0.63886732E+00     0   449     7     0     0     0
   407  0.23284532E+00     0   454     8     0     0     0
   4
   408  0.78054154E-02     0   450     8     0     0     0
   408  0.12326588E+00     0   451     8     0     0     0
   408  0.62037742E+00     0   449     8     0     0     0
   408  0.24855123E+00     0   456     7     0     0     0
   4
   409  0.11241994E-01     0   450     9     0     0     0
   409  0.11704642E+00     0   451     9     0     0     0
   409  0.63887244E+00     0   449     9     0     0     0
   409  0.23283909E+00     0   454    10     0     0     0
   4
   410  0.78057502E-02     0   450    10     0     0     0
   410  0.12326962E+00     0   451    10     0     0     0
   410  0.62035680E+00     0   449    10     0     0     0
   410  0.24856780E+00     0   456     9     0     0     0
   7
   411  0.10435166E-01     0   450    11     0     0     0
   411  0.62692627E-04     0   451    11     0     0     0
   411  0.61397505E-03     0   452    11     0     0     0
   411  0.60683506E-03     0   453    11     0     0     0
   411  0.98707837E+00     0   449    11     0     0     0
   411  0.98633987E-04     0   454    12     0     0     0
   411  0.11043386E-02     0   455    12     0     0     0
   7
   412  0.68677270E+00     0   449    12     0     0     0
   412  0.29178558E-01     0   450    12     0     0     0
   412  0.25607138E-02     0   451    12     0     0     0
   412  0.70969641E-01     0   452    12     0     0     0
   412  0.67639709E-01     0   453    12     0     0     0
   412  0.52627139E-02     0   456    11     0     0     0
   412  0.13761593E+00     0   457    11     0     0     0
   3
   413  0.56486629E-01     0   450     1     0     0     0
   413  0.34706318E-04     0   451     1     0     0     0
   413  0.94347864E+00     0   449     1     0     0     0
   3
   414  0.19685541E+00     0   450     2     0     0     0
   414  0.12009599E-03     0   451     2     0     0     0
   414  0.80302453E+00     0   449     2     0     0     0
   3
   415  0.56486584E-01     0   450     3     0     0     0
   415  0.34706300E-04     0   451     3     0     0     0
   415  0.94347870E+00     0   449     3     0     0     0
   3
   416  0.19686702E+00     0   450     4     0     0     0
   416  0.12010161E-03     0   451     4     0     0     0
   416  0.80301285E+00     0   449     4     0     0     0
   7
   417  0.22485657E-02     0   450     5     0     0     0
   417  0.49772147E-01     0   451     5     0     0     0
   417  0.54844865E-03     0   452     5     0     0     0
   417  0.28981175E-02     0   453     5     0     0     0
   417  0.69833660E+00     0   449     5     0     0     0
   417  0.10126182E+00     0   456     6     0     0     0
   417  0.14493431E+00     0   457     6     0     0     0
   7
   418  0.69448495E+00     0   449     6     0     0     0
   418  0.10413220E+00     0   454     5     0     0     0
   418  0.37319262E-02     0   455     5     0     0     0
   418  0.16583678E-02     0   450     6     0     0     0
   418  0.52825071E-01     0   451     6     0     0     0
   418  0.71920209E-01     0   452     6     0     0     0
   418  0.71247242E-01     0   453     6     0     0     0
   3
   419  0.56486629E-01     0   450     7     0     0     0
   419  0.34706318E-04     0   451     7     0     0     0
   419  0.94347864E+00     0   449     7     0     0     0
   3
   420  0.19685541E+00     0   450     8     0     0     0
   420  0.12009599E-03     0   451     8     0     0     0
   420  0.80302453E+00     0   449     8     0     0     0
   3
   421  0.56486584E-01     0   450     9     0     0     0
   421  0.34706300E-04     0   451     9     0     0     0
   421  0.94347870E+00     0   449     9     0     0     0
   3
   422  0.19686702E+00     0   450    10     0     0     0
   422  0.12010161E-03     0   451    10     0     0     0
   422  0.80301285E+00     0   449    10     0     0     0
   7
   423  0.22485657E-02     0   450    11     0     0     0
   423  0.49772147E-01     0   451    11     0     0     0
   423  0.54844865E-03     0   452    11     0     0     0
   423  0.28981175E-02     0   453    11     0     0     0
   423  0.69833660E+00     0   449    11     0     0     0
   423  0.10126182E+00     0   454    12     0     0     0
   423  0.14493431E+00     0   455    12     0     0     0
   7
   424  0.69448495E+00     0   449    12     0     0     0
   424  0.10413220E+00     0   456    11     0     0     0
   424  0.37319262E-02     0   457    11     0     0     0
   424  0.16583678E-02     0   450    12     0     0     0
   424  0.52825071E-01     0   451    12     0     0     0
   424  0.71920209E-01     0   452    12     0     0     0
   424  0.71247242E-01     0   453    12     0     0     0
   1
   425  0.10000000E+01     0   450   121     0     0     0
   1
   426  0.10000000E+01     0   450   122     0     0     0
   1
   427  0.10000000E+01     0   450   123     0     0     0
   1
   428  0.10000000E+01     0   450   124     0     0     0
   1
   429  0.10000000E+01     0   450   125     0     0     0
   7
   430  0.10080110E+00     0   450   126     0     0     0
   430  0.27456483E+00     0   451   126     0     0     0
   430  0.10424480E-02     0   452   126     0     0     0
   430  0.17537510E-01     0   453   126     0     0     0
   430  0.58478272E+00     0   454   125     0     0     0
   430  0.18344339E-01     0   455   125     0     0     0
   430  0.29270442E-02     0   206   429     0     0     0
   1
   431  0.10000000E+01     0   450   127     0     0     0
   1
   432  0.10000000E+01     0   450   128     0     0     0
   1
   433  0.10000000E+01     0   450   129     0     0     0
   1
   434  0.10000000E+01     0   450   130     0     0     0
   1
   435  0.10000000E+01     0   450   131     0     0     0
   7
   436  0.10080110E+00     0   450   132     0     0     0
   436  0.27456483E+00     0   451   132     0     0     0
   436  0.10424480E-02     0   452   132     0     0     0
   436  0.17537510E-01     0   453   132     0     0     0
   436  0.58478272E+00     0   456   131     0     0     0
   436  0.18344339E-01     0   457   131     0     0     0
   436  0.29270442E-02     0   207   435     0     0     0
   1
   437  0.10000000E+01     0   450   121     0     0     0
   0
   1
   439  0.10000000E+01     0   450   123     0     0     0
   0
   8
   441  0.88108517E-01     0   450   125     0     0     0
   441  0.29921734E+00     0   451   125     0     0     0
   441  0.12364457E-02     0   452   125     0     0     0
   441  0.95116775E-02     0   453   125     0     0     0
   441  0.56225532E+00     0   456   126     0     0     0
   441  0.36734559E-01     0   457   126     0     0     0
   441  0.14721130E-02     0   205   429     0     0     0
   441  0.14640030E-02     0   204   429     0     0     0
   0
   1
   443  0.10000000E+01     0   450   127     0     0     0
   0
   1
   445  0.10000000E+01     0   450   129     0     0     0
   0
   8
   447  0.88108517E-01     0   450   131     0     0     0
   447  0.29921734E+00     0   451   131     0     0     0
   447  0.12364457E-02     0   452   131     0     0     0
   447  0.95116775E-02     0   453   131     0     0     0
   447  0.56225532E+00     0   454   132     0     0     0
   447  0.36734559E-01     0   455   132     0     0     0
   447  0.14721130E-02     0   205   435     0     0     0
   447  0.14640030E-02     0   204   435     0     0     0
   0
  14
   449  0.29825764E-01     0   454     1     8     0     0
   449  0.29825764E-01     0   456     2     7     0     0
   449  0.29825285E-01     0   454     3    10     0     0
   449  0.29825285E-01     0   456     4     9     0     0
   449  0.31549343E+00     0   450     2     8     0     0
   449  0.95161952E-01     0   450     1     7     0     0
   449  0.95161907E-01     0   450     3     9     0     0
   449  0.31548640E+00     0   450     4    10     0     0
   449  0.18496061E-03     0   450     5    11     0     0
   449  0.15681088E-01     0   451     2     8     0     0
   449  0.13916458E-01     0   451     1     7     0     0
   449  0.13916451E-01     0   451     3     9     0     0
   449  0.15680613E-01     0   451     4    10     0     0
   449  0.14690357E-04     0   451     5    11     0     0
   0
  16
   451  0.54473715E-03     0   450   200     0     0     0
   451  0.99069746E-02     0   450   203     0     0     0
   451  0.11498050E+00     0   425   127     0     0     0
   451  0.11498050E+00     0   431   121     0     0     0
   451  0.11498043E+00     0   427   129     0     0     0
   451  0.11498043E+00     0   433   123     0     0     0
   451  0.19419800E-03     0   437   127     0     0     0
   451  0.19419800E-03     0   443   121     0     0     0
   451  0.19419784E-03     0   439   129     0     0     0
   451  0.19419784E-03     0   445   123     0     0     0
   451  0.22390198E-03     0   429   131     0     0     0
   451  0.22390198E-03     0   435   125     0     0     0
   451  0.13210046E+00     0   426   128     0     0     0
   451  0.13210046E+00     0   432   122     0     0     0
   451  0.13210046E+00     0   428   130     0     0     0
   451  0.13210046E+00     0   434   124     0     0     0
  36
   452  0.30418688E+00     0   454   199     0     0     0
   452  0.30418688E+00     0   456   198     0     0     0
   452  0.83229706E-01     0   450   200     0     0     0
   452  0.27450612E+00     0   451   200     0     0     0
   452  0.14511631E-01     0   450   203     0     0     0
   452  0.10448067E-01     0   451   203     0     0     0
   452  0.12744404E-03     0   402     8     0     0     0
   452  0.12744404E-03     0   408     2     0     0     0
   452  0.19527132E-03     0   401     7     0     0     0
   452  0.19527132E-03     0   407     1     0     0     0
   452  0.19527091E-03     0   403     9     0     0     0
   452  0.19527091E-03     0   409     3     0     0     0
   452  0.12743144E-03     0   404    10     0     0     0
   452  0.12743144E-03     0   410     4     0     0     0
   452  0.45130419E-04     0   414     8     0     0     0
   452  0.45130419E-04     0   420     2     0     0     0
   452  0.10949150E-04     0   413     7     0     0     0
   452  0.10949150E-04     0   419     1     0     0     0
   452  0.10949121E-04     0   415     9     0     0     0
   452  0.10949121E-04     0   421     3     0     0     0
   452  0.45125846E-04     0   416    10     0     0     0
   452  0.45125846E-04     0   422     4     0     0     0
   452  0.15992043E-03     0   425   127     0     0     0
   452  0.15992043E-03     0   431   121     0     0     0
   452  0.15992041E-03     0   427   129     0     0     0
   452  0.15992041E-03     0   433   123     0     0     0
   452  0.26778330E-03     0   437   127     0     0     0
   452  0.26778330E-03     0   443   121     0     0     0
   452  0.26778327E-03     0   439   129     0     0     0
   452  0.26778327E-03     0   445   123     0     0     0
   452  0.11112783E-02     0   429   131     0     0     0
   452  0.11112783E-02     0   435   125     0     0     0
   452  0.87055221E-03     0   426   128     0     0     0
   452  0.87055221E-03     0   432   122     0     0     0
   452  0.87055221E-03     0   428   130     0     0     0
   452  0.87055221E-03     0   434   124     0     0     0
  36
   453  0.28525621E+00     0   454   199     0     0     0
   453  0.28525621E+00     0   456   198     0     0     0
   453  0.13843396E-01     0   450   200     0     0     0
   453  0.11797056E-01     0   451   200     0     0     0
   453  0.64484559E-01     0   450   203     0     0     0
   453  0.21680255E+00     0   451   203     0     0     0
   453  0.39040721E-02     0   402     8     0     0     0
   453  0.39040721E-02     0   408     2     0     0     0
   453  0.45496156E-02     0   401     7     0     0     0
   453  0.45496156E-02     0   407     1     0     0     0
   453  0.45496076E-02     0   403     9     0     0     0
   453  0.45496076E-02     0   409     3     0     0     0
   453  0.39037741E-02     0   404    10     0     0     0
   453  0.39037741E-02     0   410     4     0     0     0
   453  0.24474700E-03     0   414     8     0     0     0
   453  0.24474700E-03     0   420     2     0     0     0
   453  0.59638685E-04     0   413     7     0     0     0
   453  0.59638685E-04     0   419     1     0     0     0
   453  0.59638558E-04     0   415     9     0     0     0
   453  0.59638558E-04     0   421     3     0     0     0
   453  0.24472785E-03     0   416    10     0     0     0
   453  0.24472785E-03     0   422     4     0     0     0
   453  0.63142781E-02     0   425   127     0     0     0
   453  0.63142781E-02     0   431   121     0     0     0
   453  0.63142776E-02     0   427   129     0     0     0
   453  0.63142776E-02     0   433   123     0     0     0
   453  0.11936971E-02     0   437   127     0     0     0
   453  0.11936971E-02     0   443   121     0     0     0
   453  0.11936969E-02     0   439   129     0     0     0
   453  0.11936969E-02     0   445   123     0     0     0
   453  0.18960884E-02     0   429   131     0     0     0
   453  0.18960884E-02     0   435   125     0     0     0
   453  0.13426065E-01     0   426   128     0     0     0
   453  0.13426065E-01     0   432   122     0     0     0
   453  0.13426065E-01     0   428   130     0     0     0
   453  0.13426065E-01     0   434   124     0     0     0
   6
   454  0.10373862E-01     0   450   198     0     0     0
   454  0.27986667E+00     0   426   127     0     0     0
   454  0.27986661E+00     0   428   129     0     0     0
   454  0.21491314E+00     0   431   122     0     0     0
   454  0.21491309E+00     0   433   124     0     0     0
   454  0.66629960E-04     0   435   126     0     0     0
  13
   455  0.70839643E-01     0   450   198     0     0     0
   455  0.29578042E+00     0   451   198     0     0     0
   455  0.56749294E-02     0   402     7     0     0     0
   455  0.11627114E-01     0   407     2     0     0     0
   455  0.56747692E-02     0   404     9     0     0     0
   455  0.12669155E-01     0   409     4     0     0     0
   455  0.12552677E-01     0   426   127     0     0     0
   455  0.12552679E-01     0   428   129     0     0     0
   455  0.27118366E-01     0   431   122     0     0     0
   455  0.27118366E-01     0   433   124     0     0     0
   455  0.14275073E-02     0   435   126     0     0     0
   455  0.28027031E+00     0   454   200     0     0     0
   455  0.23669404E+00     0   454   203     0     0     0
   6
   456  0.10373862E-01     0   450   199     0     0     0
   456  0.27986667E+00     0   432   121     0     0     0
   456  0.27986661E+00     0   434   123     0     0     0
   456  0.21491314E+00     0   425   128     0     0     0
   456  0.21491309E+00     0   427   130     0     0     0
   456  0.66629960E-04     0   429   132     0     0     0
  13
   457  0.70839643E-01     0   450   199     0     0     0
   457  0.29578042E+00     0   451   199     0     0     0
   457  0.56749294E-02     0   408     1     0     0     0
   457  0.11627114E-01     0   401     8     0     0     0
   457  0.56747692E-02     0   410     3     0     0     0
   457  0.12669155E-01     0   403    10     0     0     0
   457  0.12552677E-01     0   432   121     0     0     0
   457  0.12552679E-01     0   434   123     0     0     0
   457  0.27118366E-01     0   425   128     0     0     0
   457  0.27118366E-01     0   427   130     0     0     0
   457  0.14275073E-02     0   429   132     0     0     0
   457  0.28027031E+00     0   456   200     0     0     0
   457  0.23669404E+00     0   456   203     0     0     0
  28
   203  0.21323362E-03     0   123   129     0     0     0
   203  0.60969613E-01     0   125   131     0     0     0
   203  0.25645655E-02     0     3     9     0     0     0
   203  0.85113865E+00     0     5    11     0     0     0
   203  0.37278645E-01     0     4    10     0     0     0
   203  0.14689447E-02     0    59    59     0     0     0
   203  0.33229563E-01     0    13    13     0     0     0
   203  0.70844253E-03     0   198   121   128     0     0
   203  0.70844253E-03     0   198   123   130     0     0
   203  0.70844253E-03     0   198   125   132     0     0
   203  0.21253277E-02     0   198     8     1     0     0
   203  0.21253277E-02     0   198    10     3     0     0
   203  0.70844253E-03     0   199   127   122     0     0
   203  0.70844253E-03     0   199   129   124     0     0
   203  0.70844253E-03     0   199   131   126     0     0
   203  0.21253277E-02     0   199     2     7     0     0
   203  0.21253277E-02     0   199     4     9     0     0
   203  0.26318938E-04     0   200   122   128     0     0
   203  0.26318938E-04     0   200   124   130     0     0
   203  0.26318938E-04     0   200   126   132     0     0
   203  0.13246056E-04     0   200   121   127     0     0
   203  0.13246056E-04     0   200   123   129     0     0
   203  0.13246056E-04     0   200   125   131     0     0
   203  0.45379868E-04     0   200     2     8     0     0
   203  0.45379868E-04     0   200     4    10     0     0
   203  0.58460450E-04     0   200     1     7     0     0
   203  0.58460450E-04     0   200     3     9     0     0
   203  0.58460450E-04     0   200     5    11     0     0
  32
   204  0.15229042E-04     0   123   129     0     0     0
   204  0.43617501E-02     0   125   131     0     0     0
   204  0.17852768E-03     0     3     9     0     0     0
   204  0.44019524E-01     0     5    11     0     0     0
   204  0.36886197E+00     0     6    12     0     0     0
   204  0.20743602E-03     0    13    13     0     0     0
   204  0.89184748E-03     0   198   199     0     0     0
   204  0.45281564E-03     0   200   200     0     0     0
   204  0.15930277E-02     0   450   450     0     0     0
   204  0.95688058E-02     0   450   451     0     0     0
   204  0.60378123E-01     0   450   452     0     0     0
   204  0.11099192E-01     0   450   453     0     0     0
   204  0.11823657E-01     0   451   451     0     0     0
   204  0.14093205E+00     0   451   452     0     0     0
   204  0.67736856E-02     0   451   453     0     0     0
   204  0.26009073E-01     0   454   456     0     0     0
   204  0.15324572E+00     0   454   457     0     0     0
   204  0.15324572E+00     0   456   455     0     0     0
   204  0.38003027E-02     0   203   203     0     0     0
   204  0.17868335E-03     0   425   431     0     0     0
   204  0.13398642E-03     0   437   443     0     0     0
   204  0.17866863E-03     0   427   433     0     0     0
   204  0.13397368E-03     0   439   445     0     0     0
   204  0.13038768E-03     0   429   435     0     0     0
   204  0.15477143E-03     0   402   408     0     0     0
   204  0.27450249E-04     0   414   420     0     0     0
   204  0.15464553E-03     0   404   410     0     0     0
   204  0.27404065E-04     0   416   422     0     0     0
   204  0.80641767E-04     0   401   407     0     0     0
   204  0.80655220E-04     0   403   409     0     0     0
   204  0.63016010E-03     0   426   432     0     0     0
   204  0.63016010E-03     0   428   434     0     0     0
  17
   205  0.15256127E-04     0   123   129     0     0     0
   205  0.43695611E-02     0   125   131     0     0     0
   205  0.17885657E-03     0     3     9     0     0     0
   205  0.44142641E-01     0     5    11     0     0     0
   205  0.39510784E+00     0     6    12     0     0     0
   205  0.23074889E-03     0    13    13     0     0     0
   205  0.24915205E-02     0   450   450     0     0     0
   205  0.19188119E-01     0   450   451     0     0     0
   205  0.14035781E-01     0   450   452     0     0     0
   205  0.48766896E-01     0   450   453     0     0     0
   205  0.36060002E-01     0   451   451     0     0     0
   205  0.95649138E-02     0   451   452     0     0     0
   205  0.10221905E+00     0   451   453     0     0     0
   205  0.78371145E-01     0   454   456     0     0     0
   205  0.12219347E+00     0   454   457     0     0     0
   205  0.12219347E+00     0   456   455     0     0     0
   205  0.87068765E-03     0   203   200     0     0     0
  15
   206  0.16736682E-04     0   124   129     0     0     0
   206  0.47936123E-02     0   126   131     0     0     0
   206  0.18820711E-03     0     4     9     0     0     0
   206  0.38904384E+00     0     6    11     0     0     0
   206  0.29969379E-01     0   454   450     0     0     0
   206  0.51165345E-04     0   454   451     0     0     0
   206  0.17529915E+00     0   454   452     0     0     0
   206  0.16188851E+00     0   454   453     0     0     0
   206  0.57794929E-01     0   455   450     0     0     0
   206  0.17783800E+00     0   455   451     0     0     0
   206  0.96099643E-03     0   203   198     0     0     0
   206  0.27985664E-03     0   402   407     0     0     0
   206  0.27969951E-03     0   404   409     0     0     0
   206  0.79796254E-03     0   431   426     0     0     0
   206  0.79793925E-03     0   433   428     0     0     0
  15
   207  0.16736682E-04     0   130   123     0     0     0
   207  0.47936123E-02     0   132   125     0     0     0
   207  0.18820711E-03     0    10     3     0     0     0
   207  0.38904384E+00     0    12     5     0     0     0
   207  0.29969379E-01     0   456   450     0     0     0
   207  0.51165345E-04     0   456   451     0     0     0
   207  0.17529915E+00     0   456   452     0     0     0
   207  0.16188851E+00     0   456   453     0     0     0
   207  0.57794929E-01     0   457   450     0     0     0
   207  0.17783800E+00     0   457   451     0     0     0
   207  0.96099643E-03     0   203   199     0     0     0
   207  0.27985664E-03     0   408   401     0     0     0
   207  0.27969951E-03     0   410   403     0     0     0
   207  0.79796254E-03     0   425   432     0     0     0
   207  0.79793925E-03     0   427   434     0     0     0
   0
   5
     6  0.33333334E+00   100     2     7     5     0     0
     6  0.33333334E+00   100     4     9     5     0     0
     6  0.11111111E+00   100   122   127     5     0     0
     6  0.11111111E+00   100   124   129     5     0     0
     6  0.11111111E+00   100   126   131     5     0     0
   5
    12  0.33333334E+00   100     8     1    11     0     0
    12  0.33333334E+00   100    10     3    11     0     0
    12  0.11111111E+00   100   128   121    11     0     0
    12  0.11111111E+00   100   130   123    11     0     0
    12  0.11111111E+00   100   132   125    11     0     0
      4.00000000     -0.24957091
     -0.99620754      0.01873938     -0.07889357      0.03155365
     -0.03697126     -0.97401696      0.18593092     -0.12391019
      0.03241186     -0.04537013     -0.70344007     -0.70856428
      0.07178839     -0.22109117     -0.68145245      0.69396526
     -0.98399889      0.17817450     -0.17817450     -0.98399889
     -0.96390969      0.26622936     -0.26622936     -0.96390969
      1.57074499     -1.57079601     -1.57079637
    150.00000000   2400.00000000   2400.00000000
    600.00000000
    T
