  65
  401    801.9351    0.13497E-24
  402    798.4155    0.14094E-24
  403    801.9351    0.13497E-24
  404    798.4166    0.14094E-24
  405   2000.1373    0.73477E-26
  406   2004.0999    0.55543E-26
  407    801.9351    0.13497E-24
  408    798.4155    0.14094E-24
  409    801.9351    0.13497E-24
  410    798.4166    0.14094E-24
  411   2000.1373    0.73477E-26
  412   2004.0999    0.55543E-26
  413    800.3544    0.20465E-24
  414    799.2907    0.14709E-24
  415    800.3544    0.20465E-24
  416    799.2919    0.14710E-24
  417   2000.7828    0.53649E-26
  418   2004.4734    0.54189E-26
  419    800.3544    0.20465E-24
  420    799.2907    0.14709E-24
  421    800.3544    0.20465E-24
  422    799.2919    0.14710E-24
  423   2000.7828    0.53649E-26
  424   2004.4734    0.54189E-26
  425    352.7967    0.17627E-23
  426    344.7216    0.17691E-23
  427    352.7968    0.17627E-23
  428    344.7216    0.17691E-23
  429    352.3212    0.43538E-24
  430   1999.0830    0.27966E-25
  431    352.7967    0.17627E-23
  432    344.7216    0.17691E-23
  433    352.7968    0.17627E-23
  434    344.7216    0.17691E-23
  435    352.3212    0.43538E-24
  436   1999.0830    0.27966E-25
  437    352.4223    0.43518E-24
  438      0.0000    0.10000E+31
  439    352.4224    0.43518E-24
  440      0.0000    0.10000E+31
  441   2000.5107    0.28003E-25
  442      0.0000    0.10000E+31
  443    352.4223    0.43518E-24
  444      0.0000    0.10000E+31
  445    352.4224    0.43518E-24
  446      0.0000    0.10000E+31
  447   2000.5107    0.28003E-25
  448      0.0000    0.10000E+31
  449    700.0000    0.15218E-21
  450     99.9839    0.10000E+31
  451    599.8620    0.15182E-24
  452  -1051.4829    0.76776E-25
  453   1062.0250    0.71711E-25
  454    599.8259    0.15180E-24
  455   1061.5713    0.71601E-25
  456    599.8259    0.15180E-24
  457   1061.5713    0.71601E-25
  203    105.4012    0.17896E-21
  204   1007.8633    0.20357E-24
  205   1000.0000    0.19461E-24
  206    999.3905    0.23883E-24
  207    999.3905    0.23883E-24
  458      0.0000    0.10000E+31
    6    172.5000    0.57395E-24
   12    172.5000    0.57395E-24
   4
   401  0.23418276E-01     0   450     1     0     0     0
   401  0.13065352E+00     0   451     1     0     0     0
   401  0.58554965E+00     0   449     1     0     0     0
   401  0.26037857E+00     0   456     2     0     0     0
   4
   402  0.22390684E-01     0   450     2     0     0     0
   402  0.13381810E+00     0   451     2     0     0     0
   402  0.57507342E+00     0   449     2     0     0     0
   402  0.26871777E+00     0   454     1     0     0     0
   4
   403  0.23418438E-01     0   450     3     0     0     0
   403  0.13065445E+00     0   451     3     0     0     0
   403  0.58555424E+00     0   449     3     0     0     0
   403  0.26037285E+00     0   456     4     0     0     0
   4
   404  0.22391710E-01     0   450     4     0     0     0
   404  0.13382198E+00     0   451     4     0     0     0
   404  0.57505262E+00     0   449     4     0     0     0
   404  0.26873368E+00     0   454     3     0     0     0
   7
   405  0.12532843E-01     0   450     5     0     0     0
   405  0.23591436E-04     0   451     5     0     0     0
   405  0.46357818E-03     0   452     5     0     0     0
   405  0.45201922E-03     0   453     5     0     0     0
   405  0.98562509E+00     0   449     5     0     0     0
   405  0.44371336E-04     0   456     6     0     0     0
   405  0.85848273E-03     0   457     6     0     0     0
   7
   406  0.73291039E+00     0   449     6     0     0     0
   406  0.37421476E-01     0   450     6     0     0     0
   406  0.14427742E-02     0   451     6     0     0     0
   406  0.56950286E-01     0   452     6     0     0     0
   406  0.55187676E-01     0   453     6     0     0     0
   406  0.29393076E-02     0   454     5     0     0     0
   406  0.11314806E+00     0   455     5     0     0     0
   4
   407  0.23418276E-01     0   450     7     0     0     0
   407  0.13065352E+00     0   451     7     0     0     0
   407  0.58554965E+00     0   449     7     0     0     0
   407  0.26037857E+00     0   454     8     0     0     0
   4
   408  0.22390684E-01     0   450     8     0     0     0
   408  0.13381810E+00     0   451     8     0     0     0
   408  0.57507342E+00     0   449     8     0     0     0
   408  0.26871777E+00     0   456     7     0     0     0
   4
   409  0.23418438E-01     0   450     9     0     0     0
   409  0.13065445E+00     0   451     9     0     0     0
   409  0.58555424E+00     0   449     9     0     0     0
   409  0.26037285E+00     0   454    10     0     0     0
   4
   410  0.22391710E-01     0   450    10     0     0     0
   410  0.13382198E+00     0   451    10     0     0     0
   410  0.57505262E+00     0   449    10     0     0     0
   410  0.26873368E+00     0   456     9     0     0     0
   7
   411  0.12532843E-01     0   450    11     0     0     0
   411  0.23591436E-04     0   451    11     0     0     0
   411  0.46357818E-03     0   452    11     0     0     0
   411  0.45201922E-03     0   453    11     0     0     0
   411  0.98562509E+00     0   449    11     0     0     0
   411  0.44371336E-04     0   454    12     0     0     0
   411  0.85848273E-03     0   455    12     0     0     0
   7
   412  0.73291039E+00     0   449    12     0     0     0
   412  0.37421476E-01     0   450    12     0     0     0
   412  0.14427742E-02     0   451    12     0     0     0
   412  0.56950286E-01     0   452    12     0     0     0
   412  0.55187676E-01     0   453    12     0     0     0
   412  0.29393076E-02     0   456    11     0     0     0
   412  0.11314806E+00     0   457    11     0     0     0
   2
   413  0.13600290E+00     0   450     1     0     0     0
   413  0.86399710E+00     0   449     1     0     0     0
   2
   414  0.39045221E+00     0   450     2     0     0     0
   414  0.60954779E+00     0   449     2     0     0     0
   2
   415  0.13600290E+00     0   450     3     0     0     0
   415  0.86399710E+00     0   449     3     0     0     0
   2
   416  0.39047131E+00     0   450     4     0     0     0
   416  0.60952872E+00     0   449     4     0     0     0
   7
   417  0.23866121E-02     0   450     5     0     0     0
   417  0.55329852E-01     0   451     5     0     0     0
   417  0.36568695E-03     0   452     5     0     0     0
   417  0.12099851E-02     0   453     5     0     0     0
   417  0.71999085E+00     0   449     5     0     0     0
   417  0.10903630E+00     0   456     6     0     0     0
   417  0.11168072E+00     0   457     6     0     0     0
   7
   418  0.71526116E+00     0   449     6     0     0     0
   418  0.11334864E+00     0   454     5     0     0     0
   418  0.18091608E-02     0   455     5     0     0     0
   418  0.22358231E-02     0   450     6     0     0     0
   418  0.55838868E-01     0   451     6     0     0     0
   418  0.55677116E-01     0   452     6     0     0     0
   418  0.55829208E-01     0   453     6     0     0     0
   2
   419  0.13600290E+00     0   450     7     0     0     0
   419  0.86399710E+00     0   449     7     0     0     0
   2
   420  0.39045221E+00     0   450     8     0     0     0
   420  0.60954779E+00     0   449     8     0     0     0
   2
   421  0.13600290E+00     0   450     9     0     0     0
   421  0.86399710E+00     0   449     9     0     0     0
   2
   422  0.39047131E+00     0   450    10     0     0     0
   422  0.60952872E+00     0   449    10     0     0     0
   7
   423  0.23866121E-02     0   450    11     0     0     0
   423  0.55329852E-01     0   451    11     0     0     0
   423  0.36568695E-03     0   452    11     0     0     0
   423  0.12099851E-02     0   453    11     0     0     0
   423  0.71999085E+00     0   449    11     0     0     0
   423  0.10903630E+00     0   454    12     0     0     0
   423  0.11168072E+00     0   455    12     0     0     0
   7
   424  0.71526116E+00     0   449    12     0     0     0
   424  0.11334864E+00     0   456    11     0     0     0
   424  0.18091608E-02     0   457    11     0     0     0
   424  0.22358231E-02     0   450    12     0     0     0
   424  0.55838868E-01     0   451    12     0     0     0
   424  0.55677116E-01     0   452    12     0     0     0
   424  0.55829208E-01     0   453    12     0     0     0
   1
   425  0.10000000E+01     0   450   121     0     0     0
   1
   426  0.10000000E+01     0   450   122     0     0     0
   1
   427  0.10000000E+01     0   450   123     0     0     0
   1
   428  0.10000000E+01     0   450   124     0     0     0
   1
   429  0.10000000E+01     0   450   125     0     0     0
   7
   430  0.10874356E+00     0   450   126     0     0     0
   430  0.28581622E+00     0   451   126     0     0     0
   430  0.23989870E-03     0   452   126     0     0     0
   430  0.54647275E-02     0   453   126     0     0     0
   430  0.58270413E+00     0   454   125     0     0     0
   430  0.73302430E-02     0   455   125     0     0     0
   430  0.97012641E-02     0   206   429     0     0     0
   1
   431  0.10000000E+01     0   450   127     0     0     0
   1
   432  0.10000000E+01     0   450   128     0     0     0
   1
   433  0.10000000E+01     0   450   129     0     0     0
   1
   434  0.10000000E+01     0   450   130     0     0     0
   1
   435  0.10000000E+01     0   450   131     0     0     0
   7
   436  0.10874356E+00     0   450   132     0     0     0
   436  0.28581622E+00     0   451   132     0     0     0
   436  0.23989870E-03     0   452   132     0     0     0
   436  0.54647275E-02     0   453   132     0     0     0
   436  0.58270413E+00     0   456   131     0     0     0
   436  0.73302430E-02     0   457   131     0     0     0
   436  0.97012641E-02     0   207   435     0     0     0
   1
   437  0.10000000E+01     0   450   121     0     0     0
   0
   1
   439  0.10000000E+01     0   450   123     0     0     0
   0
   8
   441  0.10598272E+00     0   450   125     0     0     0
   441  0.29316345E+00     0   451   125     0     0     0
   441  0.78635558E-03     0   452   125     0     0     0
   441  0.38121569E-02     0   453   125     0     0     0
   441  0.57516545E+00     0   456   126     0     0     0
   441  0.11411609E-01     0   457   126     0     0     0
   441  0.48545571E-02     0   205   429     0     0     0
   441  0.48236623E-02     0   204   429     0     0     0
   0
   1
   443  0.10000000E+01     0   450   127     0     0     0
   0
   1
   445  0.10000000E+01     0   450   129     0     0     0
   0
   8
   447  0.10598272E+00     0   450   131     0     0     0
   447  0.29316345E+00     0   451   131     0     0     0
   447  0.78635558E-03     0   452   131     0     0     0
   447  0.38121569E-02     0   453   131     0     0     0
   447  0.57516545E+00     0   454   132     0     0     0
   447  0.11411609E-01     0   455   132     0     0     0
   447  0.48545571E-02     0   205   435     0     0     0
   447  0.48236623E-02     0   204   435     0     0     0
   0
  14
   449  0.40675956E-02     0   454     1     8     0     0
   449  0.40675956E-02     0   456     2     7     0     0
   449  0.40675565E-02     0   454     3    10     0     0
   449  0.40675565E-02     0   456     4     9     0     0
   449  0.37617362E+00     0   450     2     8     0     0
   449  0.11044516E+00     0   450     1     7     0     0
   449  0.11044515E+00     0   450     3     9     0     0
   449  0.37616980E+00     0   450     4    10     0     0
   449  0.12755751E-02     0   450     5    11     0     0
   449  0.10962210E-02     0   450     6    12     0     0
   449  0.20932255E-02     0   451     2     8     0     0
   449  0.19688869E-02     0   451     1     7     0     0
   449  0.19688853E-02     0   451     3     9     0     0
   449  0.20931882E-02     0   451     4    10     0     0
   0
  16
   451  0.24465038E-03     0   450   200     0     0     0
   451  0.28527835E-02     0   450   203     0     0     0
   451  0.12308008E+00     0   425   127     0     0     0
   451  0.12308008E+00     0   431   121     0     0     0
   451  0.12308007E+00     0   427   129     0     0     0
   451  0.12308007E+00     0   433   123     0     0     0
   451  0.16054410E-04     0   437   127     0     0     0
   451  0.16054410E-04     0   443   121     0     0     0
   451  0.16054404E-04     0   439   129     0     0     0
   451  0.16054404E-04     0   445   123     0     0     0
   451  0.31145559E-04     0   429   131     0     0     0
   451  0.31145559E-04     0   435   125     0     0     0
   451  0.12611394E+00     0   426   128     0     0     0
   451  0.12611394E+00     0   432   122     0     0     0
   451  0.12611394E+00     0   428   130     0     0     0
   451  0.12611394E+00     0   434   124     0     0     0
  32
   452  0.30453861E+00     0   454   199     0     0     0
   452  0.30453861E+00     0   456   198     0     0     0
   452  0.69611050E-01     0   450   200     0     0     0
   452  0.29305094E+00     0   451   200     0     0     0
   452  0.16464775E-01     0   450   203     0     0     0
   452  0.75636432E-02     0   451   203     0     0     0
   452  0.63169093E-04     0   402     8     0     0     0
   452  0.63169093E-04     0   408     2     0     0     0
   452  0.11062425E-03     0   401     7     0     0     0
   452  0.11062425E-03     0   407     1     0     0     0
   452  0.11062417E-03     0   403     9     0     0     0
   452  0.11062417E-03     0   409     3     0     0     0
   452  0.63167921E-04     0   404    10     0     0     0
   452  0.63167921E-04     0   410     4     0     0     0
   452  0.28943010E-04     0   414     8     0     0     0
   452  0.28943010E-04     0   420     2     0     0     0
   452  0.28942470E-04     0   416    10     0     0     0
   452  0.28942470E-04     0   422     4     0     0     0
   452  0.40353829E-04     0   425   127     0     0     0
   452  0.40353829E-04     0   431   121     0     0     0
   452  0.40353829E-04     0   427   129     0     0     0
   452  0.40353829E-04     0   433   123     0     0     0
   452  0.95971060E-04     0   437   127     0     0     0
   452  0.95971060E-04     0   443   121     0     0     0
   452  0.95971052E-04     0   439   129     0     0     0
   452  0.95971052E-04     0   445   123     0     0     0
   452  0.91065920E-03     0   429   131     0     0     0
   452  0.91065920E-03     0   435   125     0     0     0
   452  0.26370530E-03     0   426   128     0     0     0
   452  0.26370530E-03     0   432   122     0     0     0
   452  0.26370530E-03     0   428   130     0     0     0
   452  0.26370530E-03     0   434   124     0     0     0
  36
   453  0.29367790E+00     0   454   199     0     0     0
   453  0.29367790E+00     0   456   198     0     0     0
   453  0.16018445E-01     0   450   200     0     0     0
   453  0.81181470E-02     0   451   200     0     0     0
   453  0.61692700E-01     0   450   203     0     0     0
   453  0.26174107E+00     0   451   203     0     0     0
   453  0.28496208E-02     0   402     8     0     0     0
   453  0.28496208E-02     0   408     2     0     0     0
   453  0.33668061E-02     0   401     7     0     0     0
   453  0.33668061E-02     0   407     1     0     0     0
   453  0.33668040E-02     0   403     9     0     0     0
   453  0.33668040E-02     0   409     3     0     0     0
   453  0.28495716E-02     0   404    10     0     0     0
   453  0.28495716E-02     0   410     4     0     0     0
   453  0.11241667E-03     0   414     8     0     0     0
   453  0.11241667E-03     0   420     2     0     0     0
   453  0.27908936E-04     0   413     7     0     0     0
   453  0.27908936E-04     0   419     1     0     0     0
   453  0.27908929E-04     0   415     9     0     0     0
   453  0.27908929E-04     0   421     3     0     0     0
   453  0.11241473E-03     0   416    10     0     0     0
   453  0.11241473E-03     0   422     4     0     0     0
   453  0.32237738E-02     0   425   127     0     0     0
   453  0.32237738E-02     0   431   121     0     0     0
   453  0.32237736E-02     0   427   129     0     0     0
   453  0.32237736E-02     0   433   123     0     0     0
   453  0.35515864E-03     0   437   127     0     0     0
   453  0.35515864E-03     0   443   121     0     0     0
   453  0.35515864E-03     0   439   129     0     0     0
   453  0.35515864E-03     0   445   123     0     0     0
   453  0.11003867E-02     0   429   131     0     0     0
   453  0.11003867E-02     0   435   125     0     0     0
   453  0.57826070E-02     0   426   128     0     0     0
   453  0.57826075E-02     0   432   122     0     0     0
   453  0.57826070E-02     0   428   130     0     0     0
   453  0.57826075E-02     0   434   124     0     0     0
   6
   454  0.31374414E-02     0   450   198     0     0     0
   454  0.25699839E+00     0   426   127     0     0     0
   454  0.25699839E+00     0   428   129     0     0     0
   454  0.24141748E+00     0   431   122     0     0     0
   454  0.24141744E+00     0   433   124     0     0     0
   454  0.30894680E-04     0   435   126     0     0     0
  13
   455  0.76132111E-01     0   450   198     0     0     0
   455  0.29602364E+00     0   451   198     0     0     0
   455  0.43960195E-02     0   402     7     0     0     0
   455  0.82947630E-02     0   407     2     0     0     0
   455  0.43959850E-02     0   404     9     0     0     0
   455  0.84888674E-02     0   409     4     0     0     0
   455  0.62158499E-02     0   426   127     0     0     0
   455  0.62158499E-02     0   428   129     0     0     0
   455  0.11869472E-01     0   431   122     0     0     0
   455  0.11869472E-01     0   433   124     0     0     0
   455  0.14949718E-02     0   435   126     0     0     0
   455  0.29303828E+00     0   454   200     0     0     0
   455  0.27156472E+00     0   454   203     0     0     0
   6
   456  0.31374414E-02     0   450   199     0     0     0
   456  0.25699839E+00     0   432   121     0     0     0
   456  0.25699839E+00     0   434   123     0     0     0
   456  0.24141748E+00     0   425   128     0     0     0
   456  0.24141744E+00     0   427   130     0     0     0
   456  0.30894680E-04     0   429   132     0     0     0
  13
   457  0.76132111E-01     0   450   199     0     0     0
   457  0.29602364E+00     0   451   199     0     0     0
   457  0.43960195E-02     0   408     1     0     0     0
   457  0.82947630E-02     0   401     8     0     0     0
   457  0.43959850E-02     0   410     3     0     0     0
   457  0.84888674E-02     0   403    10     0     0     0
   457  0.62158499E-02     0   432   121     0     0     0
   457  0.62158499E-02     0   434   123     0     0     0
   457  0.11869472E-01     0   425   128     0     0     0
   457  0.11869472E-01     0   427   130     0     0     0
   457  0.14949718E-02     0   429   132     0     0     0
   457  0.29303828E+00     0   456   200     0     0     0
   457  0.27156472E+00     0   456   203     0     0     0
  28
   203  0.21323228E-03     0   123   129     0     0     0
   203  0.60969230E-01     0   125   131     0     0     0
   203  0.25645494E-02     0     3     9     0     0     0
   203  0.85113287E+00     0     5    11     0     0     0
   203  0.37278824E-01     0     4    10     0     0     0
   203  0.14655220E-02     0    59    59     0     0     0
   203  0.33238076E-01     0    13    13     0     0     0
   203  0.70849038E-03     0   198   121   128     0     0
   203  0.70849038E-03     0   198   123   130     0     0
   203  0.70849038E-03     0   198   125   132     0     0
   203  0.21254714E-02     0   198     8     1     0     0
   203  0.21254714E-02     0   198    10     3     0     0
   203  0.70849038E-03     0   199   127   122     0     0
   203  0.70849038E-03     0   199   129   124     0     0
   203  0.70849038E-03     0   199   131   126     0     0
   203  0.21254714E-02     0   199     2     7     0     0
   203  0.21254714E-02     0   199     4     9     0     0
   203  0.26322066E-04     0   200   122   128     0     0
   203  0.26322066E-04     0   200   124   130     0     0
   203  0.26322066E-04     0   200   126   132     0     0
   203  0.13247633E-04     0   200   121   127     0     0
   203  0.13247633E-04     0   200   123   129     0     0
   203  0.13247633E-04     0   200   125   131     0     0
   203  0.45385263E-04     0   200     2     8     0     0
   203  0.45385263E-04     0   200     4    10     0     0
   203  0.58467398E-04     0   200     1     7     0     0
   203  0.58467398E-04     0   200     3     9     0     0
   203  0.58467398E-04     0   200     5    11     0     0
  19
   204  0.35702109E-04     0   123   129     0     0     0
   204  0.10225441E-01     0   125   131     0     0     0
   204  0.41852970E-03     0     3     9     0     0     0
   204  0.10319503E+00     0     5    11     0     0     0
   204  0.18949317E-04     0     4    10     0     0     0
   204  0.86475366E+00     0     6    12     0     0     0
   204  0.50639134E-03     0    13    13     0     0     0
   204  0.20901270E-02     0   198   199     0     0     0
   204  0.10612186E-02     0   200   200     0     0     0
   204  0.10675099E-02     0   450   450     0     0     0
   204  0.35270732E-02     0   450   451     0     0     0
   204  0.93882922E-02     0   203   203     0     0     0
   204  0.32730066E-03     0   425   431     0     0     0
   204  0.24552489E-03     0   437   443     0     0     0
   204  0.32727371E-03     0   427   433     0     0     0
   204  0.24550152E-03     0   439   445     0     0     0
   204  0.23895617E-03     0   429   435     0     0     0
   204  0.11637610E-02     0   426   432     0     0     0
   204  0.11637610E-02     0   428   434     0     0     0
  10
   205  0.33942444E-04     0   123   129     0     0     0
   205  0.97215744E-02     0   125   131     0     0     0
   205  0.39792727E-03     0     3     9     0     0     0
   205  0.98210320E-01     0     5    11     0     0     0
   205  0.17348830E-04     0     4    10     0     0     0
   205  0.87905240E+00     0     6    12     0     0     0
   205  0.51337975E-03     0    13    13     0     0     0
   205  0.14861966E-02     0   450   450     0     0     0
   205  0.86310022E-02     0   450   451     0     0     0
   205  0.19359505E-02     0   203   200     0     0     0
   8
   206  0.41630647E-04     0   124   129     0     0     0
   206  0.11923580E-01     0   126   131     0     0     0
   206  0.46816046E-03     0     4     9     0     0     0
   206  0.96764958E+00     0     6    11     0     0     0
   206  0.14427829E-01     0   454   450     0     0     0
   206  0.23540442E-02     0   203   198     0     0     0
   206  0.15676121E-02     0   431   426     0     0     0
   206  0.15675667E-02     0   433   428     0     0     0
   8
   207  0.41630647E-04     0   130   123     0     0     0
   207  0.11923580E-01     0   132   125     0     0     0
   207  0.46816046E-03     0    10     3     0     0     0
   207  0.96764958E+00     0    12     5     0     0     0
   207  0.14427829E-01     0   456   450     0     0     0
   207  0.23540442E-02     0   203   199     0     0     0
   207  0.15676121E-02     0   425   432     0     0     0
   207  0.15675667E-02     0   427   434     0     0     0
   0
   5
     6  0.33333334E+00   100     2     7     5     0     0
     6  0.33333334E+00   100     4     9     5     0     0
     6  0.11111111E+00   100   122   127     5     0     0
     6  0.11111111E+00   100   124   129     5     0     0
     6  0.11111111E+00   100   126   131     5     0     0
   5
    12  0.33333334E+00   100     8     1    11     0     0
    12  0.33333334E+00   100    10     3    11     0     0
    12  0.11111111E+00   100   128   121    11     0     0
    12  0.11111111E+00   100   130   123    11     0     0
    12  0.11111111E+00   100   132   125    11     0     0
      4.00000000     -0.24956954
      0.99898893     -0.00381781      0.04244567     -0.01431248
     -0.01031506     -0.98824400      0.12386724     -0.08901796
      0.01976062     -0.02494994     -0.70591706     -0.70757896
     -0.03904068      0.15078664      0.69608647     -0.70085883
     -0.99197787      0.12641175     -0.12641175     -0.99197787
     -0.98444992      0.17566542     -0.17566542     -0.98444992
      1.57070661     -1.57079577     -1.57079637
    262.50000000   4200.00000000   4200.00000000
   1050.00000000
    T
