#  ISAJET SUSY parameters in Les Houches accord format
#  Created by ISALHA3. Last revision by C. Balazs on 2005 Jan. 10
Block SPINFO   # Program information
     1   ISASUGRA from ISAJET          # Spectrum Calculator
     2   7.79   16-DEC-2008 15:42:00   # Version number
Block MODSEL   # Model selection
     1     1   # Minimal supergravity (mSUGRA,CMSSM) model         
Block SMINPUTS   # Standard Model inputs
     1     1.27833954E+02   # alpha_em^(-1)
     2     1.16570000E-05   # G_Fermi
     3     1.17200002E-01   # alpha_s(M_Z)
     4     9.11699982E+01   # m_{Z}(pole)
     5     4.19999981E+00   # m_{b}(m_{b})
     6     1.72500000E+02   # m_{top}(pole)
     7     1.77699995E+00   # m_{tau}(pole)
Block MINPAR   # SUSY breaking input parameters
     1     2.80000000E+02   # m_0
     2     2.20000000E+02   # m_{1/2}
     3     3.00000000E+00   # tan(beta)
     4     1.00000000E+00   # sign(mu)
     5     0.00000000E+00   # A_0
#  
#  M_{GUT} =   0.23819575E+17
Block MASS   # Scalar and gaugino mass spectrum
#  PDG code   mass                 particle
        24     8.04229965E+01   #  W^+
        25     9.62618408E+01   #  h^0            
        35     5.08244537E+02   #  H^0            
        36     5.01843964E+02   #  A^0            
        37     5.11261749E+02   #  H^+            
   1000001     5.71502686E+02   #  dnl            
   1000002     5.66753235E+02   #  upl            
   1000003     5.71502747E+02   #  stl            
   1000004     5.66754944E+02   #  chl            
   1000005     5.11805267E+02   #  b1             
   1000006     3.78399902E+02   #  t1             
   1000011     3.19239075E+02   #  el-            
   1000012     3.10533356E+02   #  nuel           
   1000013     3.19239105E+02   #  mul-           
   1000014     3.10533356E+02   #  numl           
   1000015     2.93126343E+02   #  tau1           
   1000016     3.10191956E+02   #  nutl           
   1000021     5.52723267E+02   #  glss           
   1000022     8.30193329E+01   #  z1ss           
   1000023     1.53229034E+02   #  z2ss           
   1000024     1.51855240E+02   #  w1ss           
   1000025    -3.59459991E+02   #  z3ss           
   1000035     3.87102112E+02   #  z4ss           
   1000037     3.82759827E+02   #  w2ss           
   2000001     5.54696838E+02   #  dnr            
   2000002     5.54782043E+02   #  upr            
   2000003     5.54696838E+02   #  str            
   2000004     5.54783813E+02   #  chr            
   2000005     5.53496948E+02   #  b2             
   2000006     5.70081665E+02   #  t2             
   2000011     2.93692352E+02   #  er-            
   2000013     2.93692352E+02   #  mur-           
   2000015     3.19369446E+02   #  tau2           
#  Higgs mixing
Block ALPHA   # Effective Higgs mixing parameter
         -3.41106117E-01   # alpha
Block STOPMIX   # stop mixing matrix
  1  1     5.17085850E-01   # O_{11}
  1  2    -8.55933547E-01   # O_{12}
  2  1     8.55933547E-01   # O_{21}
  2  2     5.17085850E-01   # O_{22}
Block SBOTMIX   # sbottom mixing matrix
  1  1     9.95359480E-01   # O_{11}
  1  2    -9.62263420E-02   # O_{12}
  2  1     9.62263420E-02   # O_{21}
  2  2     9.95359480E-01   # O_{22}
Block STAUMIX   # stau mixing matrix
  1  1     1.33951291E-01   # O_{11}
  1  2    -9.90987897E-01   # O_{12}
  2  1     9.90987897E-01   # O_{21}
  2  2     1.33951291E-01   # O_{22}
Block NMIX   # neutralino mixing matrix
  1  1     9.78637218E-01   #
  1  2    -1.08969033E-01   #
  1  3     1.54170781E-01   #
  1  4    -8.14027190E-02   #
  2  1    -1.57896012E-01   #
  2  2    -9.40783381E-01   #
  2  3     2.48944029E-01   #
  2  4    -1.67398989E-01   #
  3  1    -4.37129661E-02   #
  3  2     6.59391880E-02   #
  3  3     6.99232817E-01   #
  3  4     7.10502982E-01   #
  4  1    -1.24206759E-01   #
  4  2     3.14172745E-01   #
  4  3     6.52174473E-01   #
  4  4    -6.78628504E-01   #
Block UMIX   # chargino U mixing matrix
  1  1    -9.24554467E-01   # U_{11}
  1  2     3.81049931E-01   # U_{12}
  2  1    -3.81049931E-01   # U_{21}
  2  2    -9.24554467E-01   # U_{22}
Block VMIX   # chargino V mixing matrix
  1  1    -9.65811610E-01   # V_{11}
  1  2     2.59244829E-01   # V_{12}
  2  1    -2.59244829E-01   # V_{21}
  2  2    -9.65811610E-01   # V_{22}
Block GAUGE Q=  4.39400391E+02   #
     1     3.57526600E-01   # g`
     2     6.52394235E-01   # g_2
     3     1.21948743E+00   # g_3
Block YU Q=  4.39400391E+02   #
  3  3     9.26951945E-01   # y_t
Block YD Q=  4.39400391E+02   #
  3  3     4.44459692E-02   # y_b
Block YE Q=  4.39400391E+02   #
  3  3     3.17669734E-02   # y_tau
Block HMIX Q=  4.39400391E+02   # Higgs mixing parameters
     1     3.57117706E+02   # mu(Q)
     2     3.00000000E+00   # tan(beta)(M_{GUT})
     3     2.50169662E+02   # Higgs vev at Q
     4     2.51847359E+05   # m_A^2(Q)
Block MSOFT Q=  4.39400391E+02   # DRbar SUSY breaking parameters
     1     8.93667755E+01   # M_1(Q)          
     2     1.68869720E+02   # M_2(Q)          
     3     5.14765442E+02   # M_3(Q)          
    31     3.15522491E+02   # MeL(Q)          
    32     3.15522491E+02   # MmuL(Q)         
    33     3.15190552E+02   # MtauL(Q)        
    34     2.90972504E+02   # MeR(Q)          
    35     2.90972504E+02   # MmuR(Q)         
    36     2.90667267E+02   # MtauR(Q)        
    41     5.41931946E+02   # MqL1(Q)         
    42     5.41931946E+02   # MqL2(Q)         
    43     4.86108978E+02   # MqL3(Q)         
    44     5.28960754E+02   # MuR(Q)          
    45     5.28960754E+02   # McR(Q)          
    46     3.97179840E+02   # MtR(Q)          
    47     5.27416504E+02   # MdR(Q)          
    48     5.27416504E+02   # MsR(Q)          
    49     5.31006226E+02   # MbR(Q)          
Block AU Q=  4.39400391E+02   #
  1  1    -3.92951050E+02   # A_u
  2  2    -3.92951050E+02   # A_c
  3  3    -3.92951050E+02   # A_t
Block AD Q=  4.39400391E+02   #
  1  1    -6.27132507E+02   # A_d
  2  2    -6.27132507E+02   # A_s
  3  3    -6.27132507E+02   # A_b
Block AE Q=  4.39400391E+02   #
  1  1    -1.39109406E+02   # A_e
  2  2    -1.39109406E+02   # A_mu
  3  3    -1.39109406E+02   # A_tau
#  ISAJET decay tables in SUSY Les Houches accord format
#  Created by ISALHD. Last revision: C. Balazs, 2005 May 25
Block DCINFO                           # Program information
     1   ISASUGRA from ISAJET          # Spectrum Calculator
     2   7.79   16-DEC-2008 15:42:00   # Version number
#         PDG         Width
DECAY         6  1.14680767E+00   # TP    decays
#          BR          NDA       ID1       ID2       ID3       ID4
      3.33333343E-01    3            2        -1         5             # TP     -->  UP     DB     BT          
      3.33333343E-01    3            4        -3         5             # TP     -->  CH     SB     BT          
      1.11111112E-01    3          -11        12         5             # TP     -->  E+     NUE    BT          
      1.11111112E-01    3          -13        14         5             # TP     -->  MU+    NUM    BT          
      1.11111112E-01    3          -15        16         5             # TP     -->  TAU+   NUT    BT          
#         PDG         Width
DECAY   1000021  4.09592986E-01   # GLSS  decays
#          BR          NDA       ID1       ID2       ID3       ID4
      2.05774605E-02    3      1000024         1        -2             # GLSS   -->  W1SS+  DN     UB          
      2.05774605E-02    3     -1000024         2        -1             # GLSS   -->  W1SS-  UP     DB          
      2.05770191E-02    3      1000024         3        -4             # GLSS   -->  W1SS+  ST     CB          
      2.05770191E-02    3     -1000024         4        -3             # GLSS   -->  W1SS-  CH     SB          
      1.02758873E-03    3      1000024         5        -6             # GLSS   -->  W1SS+  BT     TB          
      1.02758873E-03    3     -1000024         6        -5             # GLSS   -->  W1SS-  TP     BB          
      2.77564599E-04    3      1000037         1        -2             # GLSS   -->  W2SS+  DN     UB          
      2.77564599E-04    3     -1000037         2        -1             # GLSS   -->  W2SS-  UP     DB          
      2.77558167E-04    3      1000037         3        -4             # GLSS   -->  W2SS+  ST     CB          
      2.77558167E-04    3     -1000037         4        -3             # GLSS   -->  W2SS-  CH     SB          
      4.98665372E-07    2      1000022        21                       # GLSS   -->  Z1SS   GL                 
      1.03337569E-02    3      1000022         2        -2             # GLSS   -->  Z1SS   UP     UB          
      3.65809188E-03    3      1000022         1        -1             # GLSS   -->  Z1SS   DN     DB          
      3.65809049E-03    3      1000022         3        -3             # GLSS   -->  Z1SS   ST     SB          
      1.03330398E-02    3      1000022         4        -4             # GLSS   -->  Z1SS   CH     CB          
      2.63324147E-03    3      1000022         5        -5             # GLSS   -->  Z1SS   BT     BB          
      4.60681731E-05    3      1000022         6        -6             # GLSS   -->  Z1SS   TP     TB          
      8.00058478E-06    2      1000023        21                       # GLSS   -->  Z2SS   GL                 
      1.15175061E-02    3      1000023         2        -2             # GLSS   -->  Z2SS   UP     UB          
      9.08196811E-03    3      1000023         1        -1             # GLSS   -->  Z2SS   DN     DB          
      9.08195600E-03    3      1000023         3        -3             # GLSS   -->  Z2SS   ST     SB          
      1.15170563E-02    3      1000023         4        -4             # GLSS   -->  Z2SS   CH     CB          
      1.18347642E-04    3      1000023         5        -5             # GLSS   -->  Z2SS   BT     BB          
      7.82602001E-05    3      1000023         6        -6             # GLSS   -->  Z2SS   TP     TB          
      1.63473669E-04    2      1000025        21                       # GLSS   -->  Z3SS   GL                 
      5.79840662E-06    3      1000025         2        -2             # GLSS   -->  Z3SS   UP     UB          
      5.54160124E-06    3      1000025         1        -1             # GLSS   -->  Z3SS   DN     DB          
      5.54159169E-06    3      1000025         3        -3             # GLSS   -->  Z3SS   ST     SB          
      5.79784455E-06    3      1000025         4        -4             # GLSS   -->  Z3SS   CH     CB          
      1.78744576E-05    3      1000025         5        -5             # GLSS   -->  Z3SS   BT     BB          
      8.19145280E-05    2      1000035        21                       # GLSS   -->  Z4SS   GL                 
      1.34262256E-04    3      1000035         2        -2             # GLSS   -->  Z4SS   UP     UB          
      1.36693066E-04    3      1000035         1        -1             # GLSS   -->  Z4SS   DN     DB          
      1.36692819E-04    3      1000035         3        -3             # GLSS   -->  Z4SS   ST     SB          
      1.34253205E-04    3      1000035         4        -4             # GLSS   -->  Z4SS   CH     CB          
      2.62376398E-05    3      1000035         5        -5             # GLSS   -->  Z4SS   BT     BB          
      3.25862736E-01    2     -1000005         5                       # GLSS   -->  BB1    BT                 
      3.25862736E-01    2      1000005        -5                       # GLSS   -->  BT1    BB                 
      9.49400887E-02    2     -1000006         6                       # GLSS   -->  TB1    TP                 
      9.49400887E-02    2      1000006        -6                       # GLSS   -->  TP1    TB                 
#         PDG         Width
DECAY   1000002  6.01691675E+00   # UPL   decays
#          BR          NDA       ID1       ID2       ID3       ID4
      1.87759160E-03    2      1000022         2                       # UPL    -->  Z1SS   UP                 
      3.20321590E-01    2      1000023         2                       # UPL    -->  Z2SS   UP                 
      4.75406792E-04    2      1000025         2                       # UPL    -->  Z3SS   UP                 
      9.58321616E-03    2      1000035         2                       # UPL    -->  Z4SS   UP                 
      1.46848187E-02    2      1000021         2                       # UPL    -->  GLSS   UP                 
      6.37291670E-01    2      1000024         1                       # UPL    -->  W1SS+  DN                 
      1.57656800E-02    2      1000037         1                       # UPL    -->  W2SS+  DN                 
#         PDG         Width
DECAY   1000001  5.91979122E+00   # DNL   decays
#          BR          NDA       ID1       ID2       ID3       ID4
      3.23574580E-02    2      1000022         1                       # DNL    -->  Z1SS   DN                 
      2.91057408E-01    2      1000023         1                       # DNL    -->  Z2SS   DN                 
      8.11729813E-04    2      1000025         1                       # DNL    -->  Z3SS   DN                 
      1.35123096E-02    2      1000035         1                       # DNL    -->  Z4SS   DN                 
      2.62782741E-02    2      1000021         1                       # DNL    -->  GLSS   DN                 
      6.00097120E-01    2     -1000024         2                       # DNL    -->  W1SS-  UP                 
      3.58856991E-02    2     -1000037         2                       # DNL    -->  W2SS-  UP                 
#         PDG         Width
DECAY   1000003  5.91973925E+00   # STL   decays
#          BR          NDA       ID1       ID2       ID3       ID4
      3.23577486E-02    2      1000022         3                       # STL    -->  Z1SS   ST                 
      2.91060001E-01    2      1000023         3                       # STL    -->  Z2SS   ST                 
      8.11737264E-04    2      1000025         3                       # STL    -->  Z3SS   ST                 
      1.35124344E-02    2      1000035         3                       # STL    -->  Z4SS   ST                 
      2.62786672E-02    2      1000021         3                       # STL    -->  GLSS   ST                 
      6.00094676E-01    2     -1000024         4                       # STL    -->  W1SS-  CH                 
      3.58847156E-02    2     -1000037         4                       # STL    -->  W2SS-  CH                 
#         PDG         Width
DECAY   1000004  6.01651478E+00   # CHL   decays
#          BR          NDA       ID1       ID2       ID3       ID4
      1.87770126E-03    2      1000022         4                       # CHL    -->  Z1SS   CH                 
      3.20340067E-01    2      1000023         4                       # CHL    -->  Z2SS   CH                 
      4.75428737E-04    2      1000025         4                       # CHL    -->  Z3SS   CH                 
      9.58360452E-03    2      1000035         4                       # CHL    -->  Z4SS   CH                 
      1.46194259E-02    2      1000021         4                       # CHL    -->  GLSS   CH                 
      6.37336850E-01    2      1000024         3                       # CHL    -->  W1SS+  ST                 
      1.57669410E-02    2      1000037         3                       # CHL    -->  W2SS+  ST                 
#         PDG         Width
DECAY   1000005  4.95145988E+00   # BT1   decays
#          BR          NDA       ID1       ID2       ID3       ID4
      3.52722555E-02    2      1000022         5                       # BT1    -->  Z1SS   BT                 
      2.98567653E-01    2      1000023         5                       # BT1    -->  Z2SS   BT                 
      9.71232774E-04    2      1000025         5                       # BT1    -->  Z3SS   BT                 
      9.01380088E-03    2      1000035         5                       # BT1    -->  Z4SS   BT                 
      4.37944353E-01    2     -1000024         6                       # BT1    -->  W1SS-  TP                 
      2.18230724E-01    2          -24   1000006                       # BT1    -->  W-     TP1                
#         PDG         Width
DECAY   1000006  2.14953804E+00   # TP1   decays
#          BR          NDA       ID1       ID2       ID3       ID4
      1.81289017E-01    2      1000022         6                       # TP1    -->  Z1SS   TP                 
      1.31673589E-01    2      1000023         6                       # TP1    -->  Z2SS   TP                 
      6.87037408E-01    2      1000024         5                       # TP1    -->  W1SS+  BT                 
#         PDG         Width
DECAY   2000002  1.18248677E+00   # UPR   decays
#          BR          NDA       ID1       ID2       ID3       ID4
      9.70765650E-01    2      1000022         2                       # UPR    -->  Z1SS   UP                 
      2.25611385E-02    2      1000023         2                       # UPR    -->  Z2SS   UP                 
      6.82178943E-04    2      1000025         2                       # UPR    -->  Z3SS   UP                 
      4.30824514E-03    2      1000035         2                       # UPR    -->  Z4SS   UP                 
      1.68282702E-03    2      1000021         2                       # UPR    -->  GLSS   UP                 
#         PDG         Width
DECAY   2000001  2.96902925E-01   # DNR   decays
#          BR          NDA       ID1       ID2       ID3       ID4
      9.66414571E-01    2      1000022         1                       # DNR    -->  Z1SS   DN                 
      2.24591903E-02    2      1000023         1                       # DNR    -->  Z2SS   DN                 
      6.78828917E-04    2      1000025         1                       # DNR    -->  Z3SS   DN                 
      4.28649504E-03    2      1000035         1                       # DNR    -->  Z4SS   DN                 
      6.16097124E-03    2      1000021         1                       # DNR    -->  GLSS   DN                 
#         PDG         Width
DECAY   2000003  2.96902925E-01   # STR   decays
#          BR          NDA       ID1       ID2       ID3       ID4
      9.66414571E-01    2      1000022         3                       # STR    -->  Z1SS   ST                 
      2.24591903E-02    2      1000023         3                       # STR    -->  Z2SS   ST                 
      6.78828917E-04    2      1000025         3                       # STR    -->  Z3SS   ST                 
      4.28649504E-03    2      1000035         3                       # STR    -->  Z4SS   ST                 
      6.16097124E-03    2      1000021         3                       # STR    -->  GLSS   ST                 
#         PDG         Width
DECAY   2000004  1.18199098E+00   # CHR   decays
#          BR          NDA       ID1       ID2       ID3       ID4
      9.71164167E-01    2      1000022         4                       # CHR    -->  Z1SS   CH                 
      2.25703847E-02    2      1000023         4                       # CHR    -->  Z2SS   CH                 
      6.82449492E-04    2      1000025         4                       # CHR    -->  Z3SS   CH                 
      4.30992479E-03    2      1000035         4                       # CHR    -->  Z4SS   CH                 
      1.27305288E-03    2      1000021         4                       # CHR    -->  GLSS   CH                 
#         PDG         Width
DECAY   2000005  3.50726515E-01   # BT2   decays
#          BR          NDA       ID1       ID2       ID3       ID4
      8.03079009E-01    2      1000022         5                       # BT2    -->  Z1SS   BT                 
      4.28983495E-02    2      1000023         5                       # BT2    -->  Z2SS   BT                 
      1.35912299E-02    2      1000025         5                       # BT2    -->  Z3SS   BT                 
      2.10117847E-02    2      1000035         5                       # BT2    -->  Z4SS   BT                 
      3.78425978E-02    2     -1000024         6                       # BT2    -->  W1SS-  TP                 
      8.15770701E-02    2          -24   1000006                       # BT2    -->  W-     TP1                
#         PDG         Width
DECAY   2000006  6.85105896E+00   # TP2   decays
#          BR          NDA       ID1       ID2       ID3       ID4
      2.46235013E-01    2      1000024         5                       # TP2    -->  W1SS+  BT                 
      1.81816891E-01    2      1000037         5                       # TP2    -->  W2SS+  BT                 
      2.05237553E-01    2           23   1000006                       # TP2    -->  Z0     TP1                
      7.26069063E-02    2           25   1000006                       # TP2    -->  HL0    TP1                
      1.86477602E-02    2      1000022         6                       # TP2    -->  Z1SS   TP                 
      1.11303374E-01    2      1000023         6                       # TP2    -->  Z2SS   TP                 
      4.10102159E-02    2      1000025         6                       # TP2    -->  Z3SS   TP                 
      1.23142324E-01    2      1000035         6                       # TP2    -->  Z4SS   TP                 
#         PDG         Width
DECAY   1000011  2.43063736E+00   # EL-   decays
#          BR          NDA       ID1       ID2       ID3       ID4
      8.84137824E-02    2      1000022        11                       # EL-    -->  Z1SS   E-                 
      3.45761955E-01    2      1000023        11                       # EL-    -->  Z2SS   E-                 
      5.65824211E-01    2     -1000024        12                       # EL-    -->  W1SS-  NUE                
      5.53713369E-12    3      1000015        11       -15             # EL-    -->  TAU1-  E-     TAU+        
      4.95029538E-12    3     -1000015        11        15             # EL-    -->  TAU1+  E-     TAU-        
#         PDG         Width
DECAY   1000013  2.43063736E+00   # MUL-  decays
#          BR          NDA       ID1       ID2       ID3       ID4
      8.84137601E-02    2      1000022        13                       # MUL-   -->  Z1SS   MU-                
      3.45761895E-01    2      1000023        13                       # MUL-   -->  Z2SS   MU-                
      5.65824330E-01    2     -1000024        14                       # MUL-   -->  W1SS-  NUM                
      5.53716708E-12    3      1000015        13       -15             # MUL-   -->  TAU1-  MU-    TAU+        
      4.95032531E-12    3     -1000015        13        15             # MUL-   -->  TAU1+  MU-    TAU-        
#         PDG         Width
DECAY   1000015  1.25367045E+00   # TAU1- decays
#          BR          NDA       ID1       ID2       ID3       ID4
      9.50908899E-01    2      1000022        15                       # TAU1-  -->  Z1SS   TAU-               
      2.76763532E-02    2      1000023        15                       # TAU1-  -->  Z2SS   TAU-               
      2.14146990E-02    2     -1000024        16                       # TAU1-  -->  W1SS-  NUT                
#         PDG         Width
DECAY   1000012  2.42886400E+00   # NUEL  decays
#          BR          NDA       ID1       ID2       ID3       ID4
      1.94138467E-01    2      1000022        12                       # NUEL   -->  Z1SS   NUE                
      2.24632517E-01    2      1000023        12                       # NUEL   -->  Z2SS   NUE                
      5.81229031E-01    2      1000024        11                       # NUEL   -->  W1SS+  E-                 
      1.52846529E-12    3      1000015        12       -15             # NUEL   -->  TAU1-  NUE    TAU+        
      1.54790850E-12    3     -1000015        12        15             # NUEL   -->  TAU1+  NUE    TAU-        
      1.75310748E-14    3     -1000015        11        16             # NUEL   -->  TAU1+  E-     NUT         
#         PDG         Width
DECAY   1000014  2.42886353E+00   # NUML  decays
#          BR          NDA       ID1       ID2       ID3       ID4
      1.94138512E-01    2      1000022        14                       # NUML   -->  Z1SS   NUM                
      2.24632561E-01    2      1000023        14                       # NUML   -->  Z2SS   NUM                
      5.81228912E-01    2      1000024        13                       # NUML   -->  W1SS+  MU-                
      1.52846561E-12    3      1000015        14       -15             # NUML   -->  TAU1-  NUM    TAU+        
      1.54790883E-12    3     -1000015        14        15             # NUML   -->  TAU1+  NUM    TAU-        
      1.75316033E-14    3     -1000015        13        16             # NUML   -->  TAU1+  MU-    NUT         
#         PDG         Width
DECAY   1000016  2.42328262E+00   # NUTL  decays
#          BR          NDA       ID1       ID2       ID3       ID4
      1.94305792E-01    2      1000022        16                       # NUTL   -->  Z1SS   NUT                
      2.24583656E-01    2      1000023        16                       # NUTL   -->  Z2SS   NUT                
      5.81110477E-01    2      1000024        15                       # NUTL   -->  W1SS+  TAU-               
      1.38172579E-12    3     -1000015        16        15             # NUTL   -->  TAU1+  NUT    TAU-        
      2.91105873E-09    3      1000015        16       -15             # NUTL   -->  TAU1-  NUT    TAU+        
      2.90965940E-09    3      1000015        12       -11             # NUTL   -->  TAU1-  NUE    E+          
      2.90965940E-09    3      1000015        14       -13             # NUTL   -->  TAU1-  NUM    MU+         
      8.72897843E-09    3      1000015         2        -1             # NUTL   -->  TAU1-  UP     DB          
      8.72897843E-09    3      1000015         4        -3             # NUTL   -->  TAU1-  CH     SB          
#         PDG         Width
DECAY   2000011  1.23088324E+00   # ER-   decays
#          BR          NDA       ID1       ID2       ID3       ID4
      9.83973682E-01    2      1000022        11                       # ER-    -->  Z1SS   E-                 
      1.60263423E-02    2      1000023        11                       # ER-    -->  Z2SS   E-                 
      5.99343932E-34    3      1000015        12       -16             # ER-    -->  TAU1-  NUE    ANUT        
#         PDG         Width
DECAY   2000013  1.23088300E+00   # MUR-  decays
#          BR          NDA       ID1       ID2       ID3       ID4
      9.83973682E-01    2      1000022        13                       # MUR-   -->  Z1SS   MU-                
      1.60263367E-02    2      1000023        13                       # MUR-   -->  Z2SS   MU-                
      2.84077465E-29    3      1000015        14       -16             # MUR-   -->  TAU1-  NUM    ANUT        
#         PDG         Width
DECAY   2000015  2.40040350E+00   # TAU2- decays
#          BR          NDA       ID1       ID2       ID3       ID4
      9.70521718E-02    2      1000022        15                       # TAU2-  -->  Z1SS   TAU-               
      3.42885137E-01    2      1000023        15                       # TAU2-  -->  Z2SS   TAU-               
      5.60062766E-01    2     -1000024        16                       # TAU2-  -->  W1SS-  NUT                
#         PDG         Width
DECAY   1000023  3.08533276E-06   # Z2SS  decays
#          BR          NDA       ID1       ID2       ID3       ID4
      5.31165242E-05    2      1000022        22                       # Z2SS   -->  Z1SS   GM                 
      2.36053324E-06    3     -1000024         2        -1             # Z2SS   -->  W1SS-  UP     DB          
      7.86844453E-07    3     -1000024        12       -11             # Z2SS   -->  W1SS-  NUE    E+          
      7.86844453E-07    3     -1000024        14       -13             # Z2SS   -->  W1SS-  NUM    MU+         
      2.36053324E-06    3      1000024         1        -2             # Z2SS   -->  W1SS+  DN     UB          
      7.86844453E-07    3      1000024        11       -12             # Z2SS   -->  W1SS+  E-     ANUE        
      7.86844453E-07    3      1000024        13       -14             # Z2SS   -->  W1SS+  MU-    ANUM        
      1.41793624E-01    3      1000022         2        -2             # Z2SS   -->  Z1SS   UP     UB          
      2.14632541E-01    3      1000022         1        -1             # Z2SS   -->  Z1SS   DN     DB          
      2.14632526E-01    3      1000022         3        -3             # Z2SS   -->  Z1SS   ST     SB          
      1.41793489E-01    3      1000022         4        -4             # Z2SS   -->  Z1SS   CH     CB          
      2.31422305E-01    3      1000022         5        -5             # Z2SS   -->  Z1SS   BT     BB          
      1.07497368E-02    3      1000022        11       -11             # Z2SS   -->  Z1SS   E-     E+          
      1.07497228E-02    3      1000022        13       -13             # Z2SS   -->  Z1SS   MU-    MU+         
      1.42537495E-02    3      1000022        15       -15             # Z2SS   -->  Z1SS   TAU-   TAU+        
      6.60879537E-03    3      1000022        12       -12             # Z2SS   -->  Z1SS   NUE    ANUE        
      6.60879537E-03    3      1000022        14       -14             # Z2SS   -->  Z1SS   NUM    ANUM        
      6.69370126E-03    3      1000022        16       -16             # Z2SS   -->  Z1SS   NUT    ANUT        
#         PDG         Width
DECAY   1000025  2.40869761E+00   # Z3SS  decays
#          BR          NDA       ID1       ID2       ID3       ID4
      2.82616583E-07    2      1000022        22                       # Z3SS   -->  Z1SS   GM                 
      2.30263552E-07    2      1000023        22                       # Z3SS   -->  Z2SS   GM                 
      3.09555233E-01    2      1000024       -24                       # Z3SS   -->  W1SS+  W-                 
      3.09555233E-01    2     -1000024        24                       # Z3SS   -->  W1SS-  W+                 
      1.32174417E-01    2      1000022        23                       # Z3SS   -->  Z1SS   Z0                 
      2.25820377E-01    2      1000023        23                       # Z3SS   -->  Z2SS   Z0                 
      1.51712705E-08    3      1000022         2        -2             # Z3SS   -->  Z1SS   UP     UB          
      1.18224222E-08    3      1000022         1        -1             # Z3SS   -->  Z1SS   DN     DB          
      1.18224168E-08    3      1000022         3        -3             # Z3SS   -->  Z1SS   ST     SB          
      1.51710218E-08    3      1000022         4        -4             # Z3SS   -->  Z1SS   CH     CB          
      1.54121508E-07    3      1000022         5        -5             # Z3SS   -->  Z1SS   BT     BB          
      8.76051320E-09    3      1000022        15       -15             # Z3SS   -->  Z1SS   TAU-   TAU+        
      2.90680795E-08    3      1000023         2        -2             # Z3SS   -->  Z2SS   UP     UB          
      3.98674338E-08    3      1000023         1        -1             # Z3SS   -->  Z2SS   DN     DB          
      3.98674089E-08    3      1000023         3        -3             # Z3SS   -->  Z2SS   ST     SB          
      2.90676070E-08    3      1000023         4        -4             # Z3SS   -->  Z2SS   CH     CB          
      2.44885086E-07    3      1000023         5        -5             # Z3SS   -->  Z2SS   BT     BB          
      4.00194278E-09    3      1000023        15       -15             # Z3SS   -->  Z2SS   TAU-   TAU+        
      1.21664405E-02    2      1000022        25                       # Z3SS   -->  Z1SS   HL0                
      8.91025644E-03    2      1000023        25                       # Z3SS   -->  Z2SS   HL0                
      2.46273066E-05    2      1000011       -11                       # Z3SS   -->  EL-    E+                 
      2.46273066E-05    2     -1000011        11                       # Z3SS   -->  EL+    E-                 
      2.46271939E-05    2      1000013       -13                       # Z3SS   -->  MUL-   MU+                
      2.46271939E-05    2     -1000013        13                       # Z3SS   -->  MUL+   MU-                
      8.01509741E-05    2      2000011       -11                       # Z3SS   -->  ER-    E+                 
      8.01509741E-05    2     -2000011        11                       # Z3SS   -->  ER+    E-                 
      8.01508941E-05    2      2000013       -13                       # Z3SS   -->  MUR-   MU+                
      8.01508941E-05    2     -2000013        13                       # Z3SS   -->  MUR+   MU-                
      1.28119937E-04    2      1000015       -15                       # Z3SS   -->  TAU1-  TAU+               
      1.28119937E-04    2     -1000015        15                       # Z3SS   -->  TAU1+  TAU-               
      7.78069225E-05    2      2000015       -15                       # Z3SS   -->  TAU2-  TAU+               
      7.78069225E-05    2     -2000015        15                       # Z3SS   -->  TAU2+  TAU-               
      1.63615550E-04    2      1000012       -12                       # Z3SS   -->  NUEL   ANUE               
      1.63615550E-04    2     -1000012        12                       # Z3SS   -->  ANUEL  NUE                
      1.63615550E-04    2      1000014       -14                       # Z3SS   -->  NUML   ANUM               
      1.63615550E-04    2     -1000014        14                       # Z3SS   -->  ANUML  NUM                
      1.65737831E-04    2      1000016       -16                       # Z3SS   -->  NUTL   ANUT               
      1.65737831E-04    2     -1000016        16                       # Z3SS   -->  ANUTL  NUT                
#         PDG         Width
DECAY   1000035  2.74063993E+00   # Z4SS  decays
#          BR          NDA       ID1       ID2       ID3       ID4
      7.37749986E-07    2      1000022        22                       # Z4SS   -->  Z1SS   GM                 
      4.12001754E-07    2      1000023        22                       # Z4SS   -->  Z2SS   GM                 
      6.82782852E-09    2      1000025        22                       # Z4SS   -->  Z3SS   GM                 
      3.27946097E-01    2      1000024       -24                       # Z4SS   -->  W1SS+  W-                 
      3.27946097E-01    2     -1000024        24                       # Z4SS   -->  W1SS-  W+                 
      2.84699292E-10    3     -1000037         2        -1             # Z4SS   -->  W2SS-  UP     DB          
      9.48997547E-11    3     -1000037        12       -11             # Z4SS   -->  W2SS-  NUE    E+          
      9.48997547E-11    3     -1000037        14       -13             # Z4SS   -->  W2SS-  NUM    MU+         
      2.84699264E-10    3      1000037         1        -2             # Z4SS   -->  W2SS+  DN     UB          
      9.48997547E-11    3      1000037        11       -12             # Z4SS   -->  W2SS+  E-     ANUE        
      9.48997547E-11    3      1000037        13       -14             # Z4SS   -->  W2SS+  MU-    ANUM        
      2.84699264E-10    3     -1000037         4        -3             # Z4SS   -->  W2SS-  CH     SB          
      9.48997547E-11    3     -1000037        16       -15             # Z4SS   -->  W2SS-  NUT    TAU+        
      2.84699264E-10    3      1000037         3        -4             # Z4SS   -->  W2SS+  ST     CB          
      9.48997547E-11    3      1000037        15       -16             # Z4SS   -->  W2SS+  TAU-   ANUT        
      1.32143144E-02    2      1000022        23                       # Z4SS   -->  Z1SS   Z0                 
      1.14382915E-02    2      1000023        23                       # Z4SS   -->  Z2SS   Z0                 
      3.35055290E-07    3      1000022         2        -2             # Z4SS   -->  Z1SS   UP     UB          
      6.03432284E-07    3      1000022         1        -1             # Z4SS   -->  Z1SS   DN     DB          
      6.03431999E-07    3      1000022         3        -3             # Z4SS   -->  Z1SS   ST     SB          
      3.35049748E-07    3      1000022         4        -4             # Z4SS   -->  Z1SS   CH     CB          
      1.16803767E-06    3      1000022         5        -5             # Z4SS   -->  Z1SS   BT     BB          
      8.37733261E-09    3      1000022        15       -15             # Z4SS   -->  Z1SS   TAU-   TAU+        
      2.81289999E-06    3      1000023         2        -2             # Z4SS   -->  Z2SS   UP     UB          
      3.17392892E-06    3      1000023         1        -1             # Z4SS   -->  Z2SS   DN     DB          
      3.17392710E-06    3      1000023         3        -3             # Z4SS   -->  Z2SS   ST     SB          
      2.81285452E-06    3      1000023         4        -4             # Z4SS   -->  Z2SS   CH     CB          
      6.01792726E-06    3      1000023         5        -5             # Z4SS   -->  Z2SS   BT     BB          
      3.82283005E-09    3      1000023        15       -15             # Z4SS   -->  Z2SS   TAU-   TAU+        
      6.21296010E-07    3      1000025         2        -2             # Z4SS   -->  Z3SS   UP     UB          
      8.04088415E-07    3      1000025         1        -1             # Z4SS   -->  Z3SS   DN     DB          
      8.04088415E-07    3      1000025         3        -3             # Z4SS   -->  Z3SS   ST     SB          
      6.21296010E-07    3      1000025         4        -4             # Z4SS   -->  Z3SS   CH     CB          
      5.57688679E-07    3      1000025         5        -5             # Z4SS   -->  Z3SS   BT     BB          
      1.82036828E-07    3      1000025        11       -11             # Z4SS   -->  Z3SS   E-     E+          
      1.82036828E-07    3      1000025        13       -13             # Z4SS   -->  Z3SS   MU-    MU+         
      1.71461295E-07    3      1000025        15       -15             # Z4SS   -->  Z3SS   TAU-   TAU+        
      3.62196033E-07    3      1000025        12       -12             # Z4SS   -->  Z3SS   NUE    ANUE        
      3.62196033E-07    3      1000025        14       -14             # Z4SS   -->  Z3SS   NUM    ANUM        
      3.62196033E-07    3      1000025        16       -16             # Z4SS   -->  Z3SS   NUT    ANUT        
      9.51698422E-02    2      1000022        25                       # Z4SS   -->  Z1SS   HL0                
      1.73883051E-01    2      1000023        25                       # Z4SS   -->  Z2SS   HL0                
      1.83944916E-03    2      1000011       -11                       # Z4SS   -->  EL-    E+                 
      1.83944916E-03    2     -1000011        11                       # Z4SS   -->  EL+    E-                 
      1.83944579E-03    2      1000013       -13                       # Z4SS   -->  MUL-   MU+                
      1.83944579E-03    2     -1000013        13                       # Z4SS   -->  MUL+   MU-                
      9.98038333E-04    2      2000011       -11                       # Z4SS   -->  ER-    E+                 
      9.98038333E-04    2     -2000011        11                       # Z4SS   -->  ER+    E-                 
      9.98037984E-04    2      2000013       -13                       # Z4SS   -->  MUR-   MU+                
      9.98037984E-04    2     -2000013        13                       # Z4SS   -->  MUR+   MU-                
      9.07200621E-04    2      1000015       -15                       # Z4SS   -->  TAU1-  TAU+               
      9.07200621E-04    2     -1000015        15                       # Z4SS   -->  TAU1+  TAU-               
      1.98616297E-03    2      2000015       -15                       # Z4SS   -->  TAU2-  TAU+               
      1.98616297E-03    2     -2000015        15                       # Z4SS   -->  TAU2+  TAU-               
      5.52508608E-03    2      1000012       -12                       # Z4SS   -->  NUEL   ANUE               
      5.52508608E-03    2     -1000012        12                       # Z4SS   -->  ANUEL  NUE                
      5.52508608E-03    2      1000014       -14                       # Z4SS   -->  NUML   ANUM               
      5.52508608E-03    2     -1000014        14                       # Z4SS   -->  ANUML  NUM                
      5.56901097E-03    2      1000016       -16                       # Z4SS   -->  NUTL   ANUT               
      5.56901097E-03    2     -1000016        16                       # Z4SS   -->  ANUTL  NUT                
#         PDG         Width
DECAY   1000024  1.32920090E-04   # W1SS+ decays
#          BR          NDA       ID1       ID2       ID3       ID4
      3.32317680E-01    3      1000022         2        -1             # W1SS+  -->  Z1SS   UP     DB          
      3.32317680E-01    3      1000022         4        -3             # W1SS+  -->  Z1SS   CH     SB          
      1.11774653E-01    3      1000022       -11        12             # W1SS+  -->  Z1SS   E+     NUE         
      1.11774653E-01    3      1000022       -13        14             # W1SS+  -->  Z1SS   MU+    NUM         
      1.11815348E-01    3      1000022       -15        16             # W1SS+  -->  Z1SS   TAU+   NUT         
#         PDG         Width
DECAY   1000037  2.72256064E+00   # W2SS+ decays
#          BR          NDA       ID1       ID2       ID3       ID4
      6.15567558E-07    3      1000022         2        -1             # W2SS+  -->  Z1SS   UP     DB          
      6.15566478E-07    3      1000022         4        -3             # W2SS+  -->  Z1SS   CH     SB          
      2.78858070E-09    3      1000022       -15        16             # W2SS+  -->  Z1SS   TAU+   NUT         
      4.68225963E-02    2      1000022        24                       # W2SS+  -->  Z1SS   W+                 
      2.62134131E-06    3      1000023         2        -1             # W2SS+  -->  Z2SS   UP     DB          
      2.62132858E-06    3      1000023         4        -3             # W2SS+  -->  Z2SS   CH     SB          
      1.08434852E-08    3      1000023       -15        16             # W2SS+  -->  Z2SS   TAU+   NUT         
      3.76120150E-01    2      1000023        24                       # W2SS+  -->  Z2SS   W+                 
      9.42880206E-07    3      1000025         2        -1             # W2SS+  -->  Z3SS   UP     DB          
      9.42880206E-07    3      1000025         4        -3             # W2SS+  -->  Z3SS   CH     SB          
      3.14130602E-07    3      1000025       -11        12             # W2SS+  -->  Z3SS   E+     NUE         
      3.14130602E-07    3      1000025       -13        14             # W2SS+  -->  Z3SS   MU+    NUM         
      3.14130602E-07    3      1000025       -15        16             # W2SS+  -->  Z3SS   TAU+   NUT         
      4.64624679E-03    2      1000012       -11                       # W2SS+  -->  NUEL   E+                 
      4.64624306E-03    2      1000014       -13                       # W2SS+  -->  NUML   MU+                
      4.78615006E-03    2      1000016       -15                       # W2SS+  -->  NUTL   TAU+               
      7.96018820E-03    2     -1000011        12                       # W2SS+  -->  EL+    NUE                
      7.96018168E-03    2     -1000013        14                       # W2SS+  -->  MUL+   NUM                
      3.19755577E-06    2     -1000015        16                       # W2SS+  -->  TAU1+  NUT                
      8.04350432E-03    2     -2000015        16                       # W2SS+  -->  TAU2+  NUT                
      3.10452551E-01    2      1000024        23                       # W2SS+  -->  W1SS+  Z0                 
      2.97178440E-06    3      1000024         1        -1             # W2SS+  -->  W1SS+  DN     DB          
      2.97173460E-06    3      1000024         3        -3             # W2SS+  -->  W1SS+  ST     SB          
      5.62347395E-06    3      1000024         2        -2             # W2SS+  -->  W1SS+  UP     UB          
      5.62347122E-06    3      1000024         4        -4             # W2SS+  -->  W1SS+  CH     CB          
      2.28532478E-01    2      1000024        25                       # W2SS+  -->  W1SS+  HL0                
#         PDG         Width
DECAY        25  3.58923175E-03   # HL0   decays
#          BR          NDA       ID1       ID2       ID3       ID4
      5.10052933E-09    2           11       -11                       # HL0    -->  E-     E+                 
      2.15352004E-04    2           13       -13                       # HL0    -->  MU-    MU+                
      6.15544841E-02    2           15       -15                       # HL0    -->  TAU-   TAU+               
      6.41930956E-06    2            1        -1                       # HL0    -->  DN     DB                 
      2.59372103E-03    2            3        -3                       # HL0    -->  ST     SB                 
      8.71852040E-01    2            5        -5                       # HL0    -->  BT     BB                 
      1.81108624E-06    2            2        -2                       # HL0    -->  UP     UB                 
      3.50499451E-02    2            4        -4                       # HL0    -->  CH     CB                 
      1.12294289E-03    2           22        22                       # HL0    -->  GM     GM                 
      2.60773543E-02    2           21        21                       # HL0    -->  GL     GL                 
      8.47725023E-05    3           24        11       -12             # HL0    -->  W+     E-     ANUE        
      8.47725023E-05    3           24        13       -14             # HL0    -->  W+     MU-    ANUM        
      8.47725023E-05    3           24        15       -16             # HL0    -->  W+     TAU-   ANUT        
      2.54317507E-04    3           24        -2         1             # HL0    -->  W+     UB     DN          
      2.54317507E-04    3           24        -4         3             # HL0    -->  W+     CB     ST          
      8.47725023E-05    3          -24       -11        12             # HL0    -->  W-     E+     NUE         
      8.47725023E-05    3          -24       -13        14             # HL0    -->  W-     MU+    NUM         
      8.47725023E-05    3          -24       -15        16             # HL0    -->  W-     TAU+   NUT         
      2.54317507E-04    3          -24         2        -1             # HL0    -->  W-     UP     DB          
      2.54317507E-04    3          -24         4        -3             # HL0    -->  W-     CH     SB          
#         PDG         Width
DECAY        35  2.21197724E+00   # HH0   decays
#          BR          NDA       ID1       ID2       ID3       ID4
      3.46770529E-10    2           11       -11                       # HH0    -->  E-     E+                 
      1.46412740E-05    2           13       -13                       # HH0    -->  MU-    MU+                
      4.19317838E-03    2           15       -15                       # HH0    -->  TAU-   TAU+               
      4.27382133E-07    2            1        -1                       # HH0    -->  DN     DB                 
      1.72684013E-04    2            3        -3                       # HH0    -->  ST     SB                 
      2.64437366E-02    2            5        -5                       # HH0    -->  BT     BB                 
      1.91466176E-09    2            2        -2                       # HH0    -->  UP     UB                 
      2.93158628E-05    2            4        -4                       # HH0    -->  CH     CB                 
      7.13169038E-01    2            6        -6                       # HH0    -->  TP     TB                 
      1.31441766E-05    2           22        22                       # HH0    -->  GM     GM                 
      1.26730336E-03    2           21        21                       # HH0    -->  GL     GL                 
      6.22703834E-03    2           24       -24                       # HH0    -->  W+     W-                 
      3.06314463E-03    2           23        23                       # HH0    -->  Z0     Z0                 
      9.52350534E-03    2      1000022   1000022                       # HH0    -->  Z1SS   Z1SS               
      3.11203450E-02    2      1000022   1000023                       # HH0    -->  Z1SS   Z2SS               
      9.11469683E-02    2      1000022   1000025                       # HH0    -->  Z1SS   Z3SS               
      1.79661892E-03    2      1000022   1000035                       # HH0    -->  Z1SS   Z4SS               
      2.28474494E-02    2      1000023   1000023                       # HH0    -->  Z2SS   Z2SS               
      7.08928853E-02    2      1000024  -1000024                       # HH0    -->  W1SS+  W1SS-              
      1.80785730E-02    2           25        25                       # HH0    -->  HL0    HL0                
#         PDG         Width
DECAY        36  3.69395804E+00   # HA0   decays
#          BR          NDA       ID1       ID2       ID3       ID4
      2.07784193E-10    2           11       -11                       # HA0    -->  E-     E+                 
      8.77302227E-06    2           13       -13                       # HA0    -->  MU-    MU+                
      2.51266523E-03    2           15       -15                       # HA0    -->  TAU-   TAU+               
      2.56117460E-07    2            1        -1                       # HA0    -->  DN     DB                 
      1.03484417E-04    2            3        -3                       # HA0    -->  ST     SB                 
      1.58499740E-02    2            5        -5                       # HA0    -->  BT     BB                 
      1.01171937E-09    2            2        -2                       # HA0    -->  UP     UB                 
      1.55157977E-05    2            4        -4                       # HA0    -->  CH     CB                 
      6.63733304E-01    2            6        -6                       # HA0    -->  TP     TB                 
      1.14319300E-06    2           22        22                       # HA0    -->  GM     GM                 
      6.54817733E-04    2           21        21                       # HA0    -->  GL     GL                 
      1.33601548E-02    2      1000022   1000022                       # HA0    -->  Z1SS   Z1SS               
      5.46049550E-02    2      1000022   1000023                       # HA0    -->  Z1SS   Z2SS               
      3.60752293E-03    2      1000022   1000025                       # HA0    -->  Z1SS   Z3SS               
      2.25605164E-02    2      1000022   1000035                       # HA0    -->  Z1SS   Z4SS               
      5.52092269E-02    2      1000023   1000023                       # HA0    -->  Z2SS   Z2SS               
      1.64405227E-01    2      1000024  -1000024                       # HA0    -->  W1SS+  W1SS-              
      3.37249902E-03    2           25        23                       # HA0    -->  HL0    Z0                 
#         PDG         Width
DECAY        37  2.52440906E+00   # H+    decays
#          BR          NDA       ID1       ID2       ID3       ID4
      3.09755666E-10    2           12       -11                       # H+     -->  NUE    E+                 
      1.30784429E-05    2           14       -13                       # H+     -->  NUM    MU+                
      3.74577590E-03    2           16       -15                       # H+     -->  NUT    TAU+               
      3.50171916E-07    2            2        -1                       # H+     -->  UP     DB                 
      1.62008146E-04    2            4        -3                       # H+     -->  CH     SB                 
      8.84661317E-01    2            6        -5                       # H+     -->  TP     BB                 
      8.64743218E-02    2      1000024   1000022                       # H+     -->  W1SS+  Z1SS               
      2.47040740E-03    2      1000024   1000023                       # H+     -->  W1SS+  Z2SS               
      1.71483811E-02    2      1000037   1000022                       # H+     -->  W2SS+  Z1SS               
      5.32436417E-03    2           25        24                       # H+     -->  HL0    W+                 
