  65
  401    602.5777    0.28552E-23
  402    597.8857    0.35433E-23
  403    602.5777    0.28558E-23
  404    597.8872    0.35436E-23
  405   2000.1373    0.80148E-26
  406   2004.0999    0.56486E-26
  407    602.5777    0.28552E-23
  408    597.8857    0.35433E-23
  409    602.5777    0.28558E-23
  410    597.8872    0.35436E-23
  411   2000.1373    0.80148E-26
  412   2004.0999    0.56486E-26
  413    600.4725    0.10194E-22
  414    599.0540    0.25860E-23
  415    600.4725    0.10194E-22
  416    599.0555    0.25861E-23
  417   2000.7828    0.55367E-26
  418   2004.4734    0.55944E-26
  419    600.4725    0.10194E-22
  420    599.0540    0.25860E-23
  421    600.4725    0.10194E-22
  422    599.0555    0.25861E-23
  423   2000.7828    0.55367E-26
  424   2004.4734    0.55944E-26
  425    501.9617    0.32667E-22
  426    496.3194    0.27944E-22
  427    501.9617    0.32667E-22
  428    496.3194    0.27944E-22
  429   2000.4075    0.71266E-25
  430   1999.0830    0.27757E-25
  431    501.9617    0.32667E-22
  432    496.3194    0.27944E-22
  433    501.9617    0.32667E-22
  434    496.3194    0.27944E-22
  435   2000.4075    0.71266E-25
  436   1999.0830    0.27757E-25
  437   2000.4253    0.71934E-25
  438      0.0000    0.10000E+31
  439   2000.4253    0.71934E-25
  440      0.0000    0.10000E+31
  441   2000.5106    0.27798E-25
  442      0.0000    0.10000E+31
  443   2000.4253    0.71934E-25
  444      0.0000    0.10000E+31
  445   2000.4253    0.71934E-25
  446      0.0000    0.10000E+31
  447   2000.5106    0.27798E-25
  448      0.0000    0.10000E+31
  449    800.0000    0.22799E-25
  450    449.9507    0.10000E+31
  451    549.8345    0.24018E-23
  452   -901.5555    0.94947E-25
  453    916.5579    0.84085E-25
  454    549.4230    0.23683E-23
  455    914.6907    0.83545E-25
  456    549.4230    0.23683E-23
  457    914.6907    0.83545E-25
  203    105.4012    0.17895E-21
  204   1007.8071    0.20512E-24
  205   1000.0000    0.19583E-24
  206   1002.1505    0.24149E-24
  207   1002.1505    0.24149E-24
  458      0.0000    0.10000E+31
    6    172.5000    0.57395E-24
   12    172.5000    0.57395E-24
   3
   401  0.11567675E+00     0   450     1     0     0     0
   401  0.28878322E+00     0   451     1     0     0     0
   401  0.59554005E+00     0   456     2     0     0     0
   3
   402  0.44800915E-01     0   450     2     0     0     0
   402  0.31741011E+00     0   451     2     0     0     0
   402  0.63778901E+00     0   454     1     0     0     0
   3
   403  0.11570109E+00     0   450     3     0     0     0
   403  0.28884396E+00     0   451     3     0     0     0
   403  0.59545493E+00     0   456     4     0     0     0
   3
   404  0.44802871E-01     0   450     4     0     0     0
   404  0.31731877E+00     0   451     4     0     0     0
   404  0.63787836E+00     0   454     3     0     0     0
   7
   405  0.12277341E-01     0   450     5     0     0     0
   405  0.89299065E-04     0   451     5     0     0     0
   405  0.61194121E-03     0   452     5     0     0     0
   405  0.62596763E-03     0   453     5     0     0     0
   405  0.98519665E+00     0   449     5     0     0     0
   405  0.78433579E-04     0   456     6     0     0     0
   405  0.11203819E-02     0   457     6     0     0     0
   7
   406  0.68208379E+00     0   449     6     0     0     0
   406  0.34284253E-01     0   450     6     0     0     0
   406  0.25993914E-02     0   451     6     0     0     0
   406  0.70472114E-01     0   452     6     0     0     0
   406  0.67551233E-01     0   453     6     0     0     0
   406  0.52302028E-02     0   454     5     0     0     0
   406  0.13777904E+00     0   455     5     0     0     0
   3
   407  0.11567675E+00     0   450     7     0     0     0
   407  0.28878322E+00     0   451     7     0     0     0
   407  0.59554005E+00     0   454     8     0     0     0
   3
   408  0.44800915E-01     0   450     8     0     0     0
   408  0.31741011E+00     0   451     8     0     0     0
   408  0.63778901E+00     0   456     7     0     0     0
   3
   409  0.11570109E+00     0   450     9     0     0     0
   409  0.28884396E+00     0   451     9     0     0     0
   409  0.59545493E+00     0   454    10     0     0     0
   3
   410  0.44802871E-01     0   450    10     0     0     0
   410  0.31731877E+00     0   451    10     0     0     0
   410  0.63787836E+00     0   456     9     0     0     0
   7
   411  0.12277341E-01     0   450    11     0     0     0
   411  0.89299065E-04     0   451    11     0     0     0
   411  0.61194121E-03     0   452    11     0     0     0
   411  0.62596763E-03     0   453    11     0     0     0
   411  0.98519665E+00     0   449    11     0     0     0
   411  0.78433579E-04     0   454    12     0     0     0
   411  0.11203819E-02     0   455    12     0     0     0
   7
   412  0.68208379E+00     0   449    12     0     0     0
   412  0.34284253E-01     0   450    12     0     0     0
   412  0.25993914E-02     0   451    12     0     0     0
   412  0.70472114E-01     0   452    12     0     0     0
   412  0.67551233E-01     0   453    12     0     0     0
   412  0.52302028E-02     0   456    11     0     0     0
   412  0.13777904E+00     0   457    11     0     0     0
   2
   413  0.99939495E+00     0   450     1     0     0     0
   413  0.60504890E-03     0   451     1     0     0     0
   2
   414  0.99941730E+00     0   450     2     0     0     0
   414  0.58270339E-03     0   451     2     0     0     0
   2
   415  0.99939495E+00     0   450     3     0     0     0
   415  0.60504890E-03     0   451     3     0     0     0
   2
   416  0.99941748E+00     0   450     4     0     0     0
   416  0.58252050E-03     0   451     4     0     0     0
   7
   417  0.34367447E-02     0   450     5     0     0     0
   417  0.56732375E-01     0   451     5     0     0     0
   417  0.46507642E-03     0   452     5     0     0     0
   417  0.22663902E-02     0   453     5     0     0     0
   417  0.68095583E+00     0   449     5     0     0     0
   417  0.11582744E+00     0   456     6     0     0     0
   417  0.14031616E+00     0   457     6     0     0     0
   7
   418  0.67576593E+00     0   449     6     0     0     0
   418  0.11941231E+00     0   454     5     0     0     0
   418  0.32449984E-02     0   455     5     0     0     0
   418  0.17123858E-02     0   450     6     0     0     0
   418  0.60479347E-01     0   451     6     0     0     0
   418  0.69987752E-01     0   452     6     0     0     0
   418  0.69397278E-01     0   453     6     0     0     0
   2
   419  0.99939495E+00     0   450     7     0     0     0
   419  0.60504890E-03     0   451     7     0     0     0
   2
   420  0.99941730E+00     0   450     8     0     0     0
   420  0.58270339E-03     0   451     8     0     0     0
   2
   421  0.99939495E+00     0   450     9     0     0     0
   421  0.60504890E-03     0   451     9     0     0     0
   2
   422  0.99941748E+00     0   450    10     0     0     0
   422  0.58252050E-03     0   451    10     0     0     0
   7
   423  0.34367447E-02     0   450    11     0     0     0
   423  0.56732375E-01     0   451    11     0     0     0
   423  0.46507642E-03     0   452    11     0     0     0
   423  0.22663902E-02     0   453    11     0     0     0
   423  0.68095583E+00     0   449    11     0     0     0
   423  0.11582744E+00     0   454    12     0     0     0
   423  0.14031616E+00     0   455    12     0     0     0
   7
   424  0.67576593E+00     0   449    12     0     0     0
   424  0.11941231E+00     0   456    11     0     0     0
   424  0.32449984E-02     0   457    11     0     0     0
   424  0.17123858E-02     0   450    12     0     0     0
   424  0.60479347E-01     0   451    12     0     0     0
   424  0.69987752E-01     0   452    12     0     0     0
   424  0.69397278E-01     0   453    12     0     0     0
   1
   425  0.10000000E+01     0   450   121     0     0     0
   1
   426  0.10000000E+01     0   450   122     0     0     0
   1
   427  0.10000000E+01     0   450   123     0     0     0
   1
   428  0.10000000E+01     0   450   124     0     0     0
   6
   429  0.98195022E+00     0   450   125     0     0     0
   429  0.42949356E-02     0   451   125     0     0     0
   429  0.25075835E-02     0   452   125     0     0     0
   429  0.65948325E-02     0   453   125     0     0     0
   429  0.30260364E-03     0   456   126     0     0     0
   429  0.43498441E-02     0   457   126     0     0     0
   6
   430  0.11364931E+00     0   450   126     0     0     0
   430  0.26988271E+00     0   451   126     0     0     0
   430  0.31790847E-03     0   452   126     0     0     0
   430  0.12213458E-01     0   453   126     0     0     0
   430  0.59021962E+00     0   454   125     0     0     0
   430  0.13716973E-01     0   455   125     0     0     0
   1
   431  0.10000000E+01     0   450   127     0     0     0
   1
   432  0.10000000E+01     0   450   128     0     0     0
   1
   433  0.10000000E+01     0   450   129     0     0     0
   1
   434  0.10000000E+01     0   450   130     0     0     0
   6
   435  0.98195022E+00     0   450   131     0     0     0
   435  0.42949356E-02     0   451   131     0     0     0
   435  0.25075835E-02     0   452   131     0     0     0
   435  0.65948325E-02     0   453   131     0     0     0
   435  0.30260364E-03     0   454   132     0     0     0
   435  0.43498441E-02     0   455   132     0     0     0
   6
   436  0.11364931E+00     0   450   132     0     0     0
   436  0.26988271E+00     0   451   132     0     0     0
   436  0.31790847E-03     0   452   132     0     0     0
   436  0.12213458E-01     0   453   132     0     0     0
   436  0.59021962E+00     0   456   131     0     0     0
   436  0.13716973E-01     0   457   131     0     0     0
   4
   437  0.99113744E+00     0   450   121     0     0     0
   437  0.41917725E-02     0   451   121     0     0     0
   437  0.19977445E-03     0   452   121     0     0     0
   437  0.44710189E-02     0   453   121     0     0     0
   0
   4
   439  0.99113744E+00     0   450   123     0     0     0
   439  0.41917725E-02     0   451   123     0     0     0
   439  0.19977445E-03     0   452   123     0     0     0
   439  0.44710189E-02     0   453   123     0     0     0
   0
   6
   441  0.79191826E-01     0   450   125     0     0     0
   441  0.31408039E+00     0   451   125     0     0     0
   441  0.98325324E-03     0   452   125     0     0     0
   441  0.56225942E-02     0   453   125     0     0     0
   441  0.57857382E+00     0   456   126     0     0     0
   441  0.21548107E-01     0   457   126     0     0     0
   0
   4
   443  0.99113744E+00     0   450   127     0     0     0
   443  0.41917725E-02     0   451   127     0     0     0
   443  0.19977445E-03     0   452   127     0     0     0
   443  0.44710189E-02     0   453   127     0     0     0
   0
   4
   445  0.99113744E+00     0   450   129     0     0     0
   445  0.41917725E-02     0   451   129     0     0     0
   445  0.19977445E-03     0   452   129     0     0     0
   445  0.44710189E-02     0   453   129     0     0     0
   0
   6
   447  0.79191826E-01     0   450   131     0     0     0
   447  0.31408039E+00     0   451   131     0     0     0
   447  0.98325324E-03     0   452   131     0     0     0
   447  0.56225942E-02     0   453   131     0     0     0
   447  0.57857382E+00     0   454   132     0     0     0
   447  0.21548107E-01     0   455   132     0     0     0
   0
  16
   449  0.63632697E-01     0   408     2     0     0     0
   449  0.63632697E-01     0   402     8     0     0     0
   449  0.61120804E-01     0   407     1     0     0     0
   449  0.61120804E-01     0   401     7     0     0     0
   449  0.63004375E-01     0   420     2     0     0     0
   449  0.63004375E-01     0   414     8     0     0     0
   449  0.62244013E-01     0   419     1     0     0     0
   449  0.62244013E-01     0   413     7     0     0     0
   449  0.61120786E-01     0   409     3     0     0     0
   449  0.61120786E-01     0   403     9     0     0     0
   449  0.62243991E-01     0   421     3     0     0     0
   449  0.62243991E-01     0   415     9     0     0     0
   449  0.63630834E-01     0   410     4     0     0     0
   449  0.63630834E-01     0   404    10     0     0     0
   449  0.63002504E-01     0   422     4     0     0     0
   449  0.63002504E-01     0   416    10     0     0     0
   0
   9
   451  0.26573651E-03     0   450   200     0     0     0
   451  0.12103114E+00     0   425   127     0     0     0
   451  0.12103114E+00     0   431   121     0     0     0
   451  0.12103087E+00     0   427   129     0     0     0
   451  0.12103087E+00     0   433   123     0     0     0
   451  0.12890255E+00     0   426   128     0     0     0
   451  0.12890255E+00     0   432   122     0     0     0
   451  0.12890255E+00     0   428   130     0     0     0
   451  0.12890255E+00     0   434   124     0     0     0
  26
   452  0.30068773E+00     0   454   199     0     0     0
   452  0.30068773E+00     0   456   198     0     0     0
   452  0.11627659E+00     0   450   200     0     0     0
   452  0.26973367E+00     0   451   200     0     0     0
   452  0.44707423E-02     0   450   203     0     0     0
   452  0.53982460E-02     0   451   203     0     0     0
   452  0.16426359E-03     0   402     8     0     0     0
   452  0.16426359E-03     0   408     2     0     0     0
   452  0.24799822E-03     0   401     7     0     0     0
   452  0.24799822E-03     0   407     1     0     0     0
   452  0.24799819E-03     0   403     9     0     0     0
   452  0.24799819E-03     0   409     3     0     0     0
   452  0.16426123E-03     0   404    10     0     0     0
   452  0.16426123E-03     0   410     4     0     0     0
   452  0.38914171E-04     0   414     8     0     0     0
   452  0.38914171E-04     0   420     2     0     0     0
   452  0.38913615E-04     0   416    10     0     0     0
   452  0.38913615E-04     0   422     4     0     0     0
   452  0.47461974E-04     0   425   127     0     0     0
   452  0.47461974E-04     0   431   121     0     0     0
   452  0.47461974E-04     0   427   129     0     0     0
   452  0.47461974E-04     0   433   123     0     0     0
   452  0.18769268E-03     0   426   128     0     0     0
   452  0.18769268E-03     0   432   122     0     0     0
   452  0.18769268E-03     0   428   130     0     0     0
   452  0.18769268E-03     0   434   124     0     0     0
  30
   453  0.27970079E+00     0   454   199     0     0     0
   453  0.27970079E+00     0   456   198     0     0     0
   453  0.44950452E-02     0   450   200     0     0     0
   453  0.59141237E-02     0   451   200     0     0     0
   453  0.95137686E-01     0   450   203     0     0     0
   453  0.22278263E+00     0   451   203     0     0     0
   453  0.75651137E-02     0   402     8     0     0     0
   453  0.75651137E-02     0   408     2     0     0     0
   453  0.10063928E-01     0   401     7     0     0     0
   453  0.10063928E-01     0   407     1     0     0     0
   453  0.10063926E-01     0   403     9     0     0     0
   453  0.10063926E-01     0   409     3     0     0     0
   453  0.75650136E-02     0   404    10     0     0     0
   453  0.75650136E-02     0   410     4     0     0     0
   453  0.83914760E-03     0   414     8     0     0     0
   453  0.83914760E-03     0   420     2     0     0     0
   453  0.20830592E-03     0   413     7     0     0     0
   453  0.20830592E-03     0   419     1     0     0     0
   453  0.20830589E-03     0   415     9     0     0     0
   453  0.20830589E-03     0   421     3     0     0     0
   453  0.83913642E-03     0   416    10     0     0     0
   453  0.83913642E-03     0   422     4     0     0     0
   453  0.25983695E-02     0   425   127     0     0     0
   453  0.25983695E-02     0   431   121     0     0     0
   453  0.25983695E-02     0   427   129     0     0     0
   453  0.25983695E-02     0   433   123     0     0     0
   453  0.67924201E-02     0   426   128     0     0     0
   453  0.67924201E-02     0   432   122     0     0     0
   453  0.67924201E-02     0   428   130     0     0     0
   453  0.67924201E-02     0   434   124     0     0     0
   5
   454  0.19265745E-01     0   450   198     0     0     0
   454  0.27399138E+00     0   426   127     0     0     0
   454  0.27399087E+00     0   428   129     0     0     0
   454  0.21637601E+00     0   431   122     0     0     0
   454  0.21637601E+00     0   433   124     0     0     0
  12
   455  0.68675414E-01     0   450   198     0     0     0
   455  0.29866812E+00     0   451   198     0     0     0
   455  0.13025525E-01     0   402     7     0     0     0
   455  0.22745527E-01     0   407     2     0     0     0
   455  0.13025423E-01     0   404     9     0     0     0
   455  0.23289513E-01     0   409     4     0     0     0
   455  0.65892991E-02     0   426   127     0     0     0
   455  0.65892991E-02     0   428   129     0     0     0
   455  0.11558002E-01     0   431   122     0     0     0
   455  0.11558002E-01     0   433   124     0     0     0
   455  0.27760905E+00     0   454   200     0     0     0
   455  0.24666680E+00     0   454   203     0     0     0
   5
   456  0.19265745E-01     0   450   199     0     0     0
   456  0.27399138E+00     0   432   121     0     0     0
   456  0.27399087E+00     0   434   123     0     0     0
   456  0.21637601E+00     0   425   128     0     0     0
   456  0.21637601E+00     0   427   130     0     0     0
  12
   457  0.68675414E-01     0   450   199     0     0     0
   457  0.29866812E+00     0   451   199     0     0     0
   457  0.13025525E-01     0   408     1     0     0     0
   457  0.22745527E-01     0   401     8     0     0     0
   457  0.13025423E-01     0   410     3     0     0     0
   457  0.23289513E-01     0   403    10     0     0     0
   457  0.65892991E-02     0   432   121     0     0     0
   457  0.65892991E-02     0   434   123     0     0     0
   457  0.11558002E-01     0   425   128     0     0     0
   457  0.11558002E-01     0   427   130     0     0     0
   457  0.27760905E+00     0   456   200     0     0     0
   457  0.24666680E+00     0   456   203     0     0     0
  28
   203  0.21323137E-03     0   123   129     0     0     0
   203  0.60968969E-01     0   125   131     0     0     0
   203  0.25645383E-02     0     3     9     0     0     0
   203  0.85112929E+00     0     5    11     0     0     0
   203  0.37278511E-01     0     4    10     0     0     0
   203  0.14734485E-02     0    59    59     0     0     0
   203  0.33234619E-01     0    13    13     0     0     0
   203  0.70847583E-03     0   198   121   128     0     0
   203  0.70847583E-03     0   198   123   130     0     0
   203  0.70847583E-03     0   198   125   132     0     0
   203  0.21254276E-02     0   198     8     1     0     0
   203  0.21254276E-02     0   198    10     3     0     0
   203  0.70847583E-03     0   199   127   122     0     0
   203  0.70847583E-03     0   199   129   124     0     0
   203  0.70847583E-03     0   199   131   126     0     0
   203  0.21254276E-02     0   199     2     7     0     0
   203  0.21254276E-02     0   199     4     9     0     0
   203  0.26321261E-04     0   200   122   128     0     0
   203  0.26321261E-04     0   200   124   130     0     0
   203  0.26321261E-04     0   200   126   132     0     0
   203  0.13247227E-04     0   200   121   127     0     0
   203  0.13247227E-04     0   200   123   129     0     0
   203  0.13247227E-04     0   200   125   131     0     0
   203  0.45383877E-04     0   200     2     8     0     0
   203  0.45383877E-04     0   200     4    10     0     0
   203  0.58465608E-04     0   200     1     7     0     0
   203  0.58465608E-04     0   200     3     9     0     0
   203  0.58465608E-04     0   200     5    11     0     0
  16
   204  0.35972134E-04     0   123   129     0     0     0
   204  0.10302779E-01     0   125   131     0     0     0
   204  0.42169538E-03     0     3     9     0     0     0
   204  0.10397626E+00     0     5    11     0     0     0
   204  0.19092851E-04     0     4    10     0     0     0
   204  0.87128824E+00     0     6    12     0     0     0
   204  0.51025953E-03     0    13    13     0     0     0
   204  0.21061567E-02     0   198   199     0     0     0
   204  0.10693560E-02     0   200   200     0     0     0
   204  0.33326139E-03     0   450   450     0     0     0
   204  0.43828233E-04     0   450   451     0     0     0
   204  0.92562903E-02     0   203   203     0     0     0
   204  0.40510509E-04     0   425   431     0     0     0
   204  0.40507184E-04     0   427   433     0     0     0
   204  0.27788273E-03     0   426   432     0     0     0
   204  0.27788273E-03     0   428   434     0     0     0
  10
   205  0.34156565E-04     0   123   129     0     0     0
   205  0.97829020E-02     0   125   131     0     0     0
   205  0.40043757E-03     0     3     9     0     0     0
   205  0.98829865E-01     0     5    11     0     0     0
   205  0.17458273E-04     0     4    10     0     0     0
   205  0.88459784E+00     0     6    12     0     0     0
   205  0.51661837E-03     0    13    13     0     0     0
   205  0.29875000E-02     0   450   450     0     0     0
   205  0.88468194E-03     0   450   451     0     0     0
   205  0.19485933E-02     0   203   200     0     0     0
   8
   206  0.42209638E-04     0   124   129     0     0     0
   206  0.12089413E-01     0   126   131     0     0     0
   206  0.47466514E-03     0     4     9     0     0     0
   206  0.98113090E+00     0     6    11     0     0     0
   206  0.34740355E-02     0   454   450     0     0     0
   206  0.24012369E-02     0   203   198     0     0     0
   206  0.19377362E-03     0   431   426     0     0     0
   206  0.19376801E-03     0   433   428     0     0     0
   8
   207  0.42209638E-04     0   130   123     0     0     0
   207  0.12089413E-01     0   132   125     0     0     0
   207  0.47466514E-03     0    10     3     0     0     0
   207  0.98113090E+00     0    12     5     0     0     0
   207  0.34740355E-02     0   456   450     0     0     0
   207  0.24012369E-02     0   203   199     0     0     0
   207  0.19377362E-03     0   425   432     0     0     0
   207  0.19376801E-03     0   427   434     0     0     0
   0
   5
     6  0.33333334E+00   100     2     7     5     0     0
     6  0.33333334E+00   100     4     9     5     0     0
     6  0.11111111E+00   100   122   127     5     0     0
     6  0.11111111E+00   100   124   129     5     0     0
     6  0.11111111E+00   100   126   131     5     0     0
   5
    12  0.33333334E+00   100     8     1    11     0     0
    12  0.33333334E+00   100    10     3    11     0     0
    12  0.11111111E+00   100   128   121    11     0     0
    12  0.11111111E+00   100   130   123    11     0     0
    12  0.11111111E+00   100   132   125    11     0     0
      4.00000000     -0.24957004
      0.99441671     -0.04957278      0.07751133     -0.05167104
     -0.06641533     -0.97996914      0.15042518     -0.11234624
     -0.01682008      0.02832863      0.70570487      0.70773911
     -0.08025867      0.19078900      0.68800026     -0.69556707
     -0.98636502      0.16457228     -0.16457228     -0.98636502
     -0.97548622      0.22006056     -0.22006056     -0.97548622
      1.57071936     -1.57079589     -1.57079399
    225.00000000   3600.00000000   3600.00000000
    900.00000000
    T
