  65
  401    503.0903    0.10778E-24
  402    497.4608    0.11614E-24
  403    503.0904    0.10778E-24
  404    497.4627    0.11615E-24
  405   2000.1373    0.61500E-26
  406   2004.0999    0.43415E-26
  407    503.0903    0.10778E-24
  408    497.4608    0.11614E-24
  409    503.0904    0.10778E-24
  410    497.4627    0.11615E-24
  411   2000.1373    0.61500E-26
  412   2004.0999    0.43415E-26
  413    500.5668    0.14693E-24
  414    498.8644    0.13630E-24
  415    500.5669    0.14693E-24
  416    498.8662    0.13631E-24
  417   2000.7828    0.43612E-26
  418   2004.4734    0.43989E-26
  419    500.5668    0.14693E-24
  420    498.8644    0.13630E-24
  421    500.5669    0.14693E-24
  422    498.8662    0.13631E-24
  423   2000.7828    0.43612E-26
  424   2004.4734    0.43989E-26
  425    303.2582    0.21377E-22
  426    293.8247    0.19048E-22
  427    303.2582    0.21377E-22
  428    293.8247    0.19048E-22
  429   2000.4075    0.66136E-25
  430   1999.0830    0.25265E-25
  431    303.2582    0.21377E-22
  432    293.8247    0.19048E-22
  433    303.2582    0.21377E-22
  434    293.8247    0.19048E-22
  435   2000.4075    0.66136E-25
  436   1999.0830    0.25265E-25
  437   2000.4253    0.66887E-25
  438      0.0000    0.10000E+31
  439   2000.4253    0.66887E-25
  440      0.0000    0.10000E+31
  441   2000.5106    0.25303E-25
  442      0.0000    0.10000E+31
  443   2000.4253    0.66887E-25
  444      0.0000    0.10000E+31
  445   2000.4253    0.66887E-25
  446      0.0000    0.10000E+31
  447   2000.5106    0.25303E-25
  448      0.0000    0.10000E+31
  449    400.0000    0.37548E-20
  450    249.9375    0.10000E+31
  451    349.7840    0.16489E-23
  452   -602.3849    0.15405E-24
  453    622.5872    0.12941E-24
  454    349.0544    0.16248E-23
  455    620.5877    0.12851E-24
  456    349.0544    0.16248E-23
  457    620.5877    0.12851E-24
  203    105.4009    0.17895E-21
  204   1007.7203    0.10309E-24
  205   1000.0000    0.10263E-24
  206   1006.3821    0.11659E-24
  207   1006.3821    0.11659E-24
  458      0.0000    0.10000E+31
    6    172.5000    0.57395E-24
   12    172.5000    0.57395E-24
   4
   401  0.11493809E-01     0   450     1     0     0     0
   401  0.82870074E-01     0   451     1     0     0     0
   401  0.73636830E+00     0   449     1     0     0     0
   401  0.16926785E+00     0   456     2     0     0     0
   4
   402  0.30359086E-02     0   450     2     0     0     0
   402  0.90573914E-01     0   451     2     0     0     0
   402  0.72531986E+00     0   449     2     0     0     0
   402  0.18107031E+00     0   454     1     0     0     0
   4
   403  0.11493910E-01     0   450     3     0     0     0
   403  0.82870811E-01     0   451     3     0     0     0
   403  0.73637497E+00     0   449     3     0     0     0
   403  0.16926029E+00     0   456     4     0     0     0
   4
   404  0.30360494E-02     0   450     4     0     0     0
   404  0.90576142E-01     0   451     4     0     0     0
   404  0.72530264E+00     0   449     4     0     0     0
   404  0.18108517E+00     0   454     3     0     0     0
   7
   405  0.10058185E-01     0   450     5     0     0     0
   405  0.13958446E-03     0   451     5     0     0     0
   405  0.61205897E-03     0   452     5     0     0     0
   405  0.63008326E-03     0   453     5     0     0     0
   405  0.98735672E+00     0   449     5     0     0     0
   405  0.12669385E-03     0   456     6     0     0     0
   405  0.10766383E-02     0   457     6     0     0     0
   7
   406  0.68731755E+00     0   449     6     0     0     0
   406  0.28462350E-01     0   450     6     0     0     0
   406  0.38871979E-02     0   451     6     0     0     0
   406  0.70995554E-01     0   452     6     0     0     0
   406  0.66338651E-01     0   453     6     0     0     0
   406  0.80307564E-02     0   454     5     0     0     0
   406  0.13496798E+00     0   455     5     0     0     0
   4
   407  0.11493809E-01     0   450     7     0     0     0
   407  0.82870074E-01     0   451     7     0     0     0
   407  0.73636830E+00     0   449     7     0     0     0
   407  0.16926785E+00     0   454     8     0     0     0
   4
   408  0.30359086E-02     0   450     8     0     0     0
   408  0.90573914E-01     0   451     8     0     0     0
   408  0.72531986E+00     0   449     8     0     0     0
   408  0.18107031E+00     0   456     7     0     0     0
   4
   409  0.11493910E-01     0   450     9     0     0     0
   409  0.82870811E-01     0   451     9     0     0     0
   409  0.73637497E+00     0   449     9     0     0     0
   409  0.16926029E+00     0   454    10     0     0     0
   4
   410  0.30360494E-02     0   450    10     0     0     0
   410  0.90576142E-01     0   451    10     0     0     0
   410  0.72530264E+00     0   449    10     0     0     0
   410  0.18108517E+00     0   456     9     0     0     0
   7
   411  0.10058185E-01     0   450    11     0     0     0
   411  0.13958446E-03     0   451    11     0     0     0
   411  0.61205897E-03     0   452    11     0     0     0
   411  0.63008326E-03     0   453    11     0     0     0
   411  0.98735672E+00     0   449    11     0     0     0
   411  0.12669385E-03     0   454    12     0     0     0
   411  0.10766383E-02     0   455    12     0     0     0
   7
   412  0.68731755E+00     0   449    12     0     0     0
   412  0.28462350E-01     0   450    12     0     0     0
   412  0.38871979E-02     0   451    12     0     0     0
   412  0.70995554E-01     0   452    12     0     0     0
   412  0.66338651E-01     0   453    12     0     0     0
   412  0.80307564E-02     0   456    11     0     0     0
   412  0.13496798E+00     0   457    11     0     0     0
   3
   413  0.34921885E-01     0   450     1     0     0     0
   413  0.13391752E-03     0   451     1     0     0     0
   413  0.96494424E+00     0   449     1     0     0     0
   3
   414  0.12854984E+00     0   450     2     0     0     0
   414  0.48876548E-03     0   451     2     0     0     0
   414  0.87096143E+00     0   449     2     0     0     0
   3
   415  0.34921858E-01     0   450     3     0     0     0
   415  0.13391748E-03     0   451     3     0     0     0
   415  0.96494424E+00     0   449     3     0     0     0
   3
   416  0.12855740E+00     0   450     4     0     0     0
   416  0.48878387E-03     0   451     4     0     0     0
   416  0.87095386E+00     0   449     4     0     0     0
   7
   417  0.31703906E-02     0   450     5     0     0     0
   417  0.47000289E-01     0   451     5     0     0     0
   417  0.53464709E-03     0   452     5     0     0     0
   417  0.39120526E-02     0   453     5     0     0     0
   417  0.70040810E+00     0   449     5     0     0     0
   417  0.99927112E-01     0   456     6     0     0     0
   417  0.14504741E+00     0   457     6     0     0     0
   7
   418  0.69655150E+00     0   449     6     0     0     0
   418  0.10091289E+00     0   454     5     0     0     0
   418  0.53266506E-02     0   455     5     0     0     0
   418  0.14992668E-02     0   450     6     0     0     0
   418  0.52848104E-01     0   451     6     0     0     0
   418  0.72125018E-01     0   452     6     0     0     0
   418  0.70736580E-01     0   453     6     0     0     0
   3
   419  0.34921885E-01     0   450     7     0     0     0
   419  0.13391752E-03     0   451     7     0     0     0
   419  0.96494424E+00     0   449     7     0     0     0
   3
   420  0.12854984E+00     0   450     8     0     0     0
   420  0.48876548E-03     0   451     8     0     0     0
   420  0.87096143E+00     0   449     8     0     0     0
   3
   421  0.34921858E-01     0   450     9     0     0     0
   421  0.13391748E-03     0   451     9     0     0     0
   421  0.96494424E+00     0   449     9     0     0     0
   3
   422  0.12855740E+00     0   450    10     0     0     0
   422  0.48878387E-03     0   451    10     0     0     0
   422  0.87095386E+00     0   449    10     0     0     0
   7
   423  0.31703906E-02     0   450    11     0     0     0
   423  0.47000289E-01     0   451    11     0     0     0
   423  0.53464709E-03     0   452    11     0     0     0
   423  0.39120526E-02     0   453    11     0     0     0
   423  0.70040810E+00     0   449    11     0     0     0
   423  0.99927112E-01     0   454    12     0     0     0
   423  0.14504741E+00     0   455    12     0     0     0
   7
   424  0.69655150E+00     0   449    12     0     0     0
   424  0.10091289E+00     0   456    11     0     0     0
   424  0.53266506E-02     0   457    11     0     0     0
   424  0.14992668E-02     0   450    12     0     0     0
   424  0.52848104E-01     0   451    12     0     0     0
   424  0.72125018E-01     0   452    12     0     0     0
   424  0.70736580E-01     0   453    12     0     0     0
   1
   425  0.10000000E+01     0   450   121     0     0     0
   1
   426  0.10000000E+01     0   450   122     0     0     0
   1
   427  0.10000000E+01     0   450   123     0     0     0
   1
   428  0.10000000E+01     0   450   124     0     0     0
   6
   429  0.97221792E+00     0   450   125     0     0     0
   429  0.80528064E-02     0   451   125     0     0     0
   429  0.33779631E-02     0   452   125     0     0     0
   429  0.10734877E-01     0   453   125     0     0     0
   429  0.59010170E-03     0   456   126     0     0     0
   429  0.50263111E-02     0   457   126     0     0     0
   6
   430  0.11444187E+00     0   450   126     0     0     0
   430  0.25318536E+00     0   451   126     0     0     0
   430  0.88474754E-03     0   452   126     0     0     0
   430  0.26062919E-01     0   453   126     0     0     0
   430  0.57754523E+00     0   454   125     0     0     0
   430  0.27879894E-01     0   455   125     0     0     0
   1
   431  0.10000000E+01     0   450   127     0     0     0
   1
   432  0.10000000E+01     0   450   128     0     0     0
   1
   433  0.10000000E+01     0   450   129     0     0     0
   1
   434  0.10000000E+01     0   450   130     0     0     0
   6
   435  0.97221792E+00     0   450   131     0     0     0
   435  0.80528064E-02     0   451   131     0     0     0
   435  0.33779631E-02     0   452   131     0     0     0
   435  0.10734877E-01     0   453   131     0     0     0
   435  0.59010170E-03     0   454   132     0     0     0
   435  0.50263111E-02     0   455   132     0     0     0
   6
   436  0.11444187E+00     0   450   132     0     0     0
   436  0.25318536E+00     0   451   132     0     0     0
   436  0.88474754E-03     0   452   132     0     0     0
   436  0.26062919E-01     0   453   132     0     0     0
   436  0.57754523E+00     0   456   131     0     0     0
   436  0.27879894E-01     0   457   131     0     0     0
   4
   437  0.98319423E+00     0   450   121     0     0     0
   437  0.78694522E-02     0   451   121     0     0     0
   437  0.60825580E-03     0   452   121     0     0     0
   437  0.83280113E-02     0   453   121     0     0     0
   0
   4
   439  0.98319423E+00     0   450   123     0     0     0
   439  0.78694522E-02     0   451   123     0     0     0
   439  0.60825580E-03     0   452   123     0     0     0
   439  0.83280113E-02     0   453   123     0     0     0
   0
   6
   441  0.73581703E-01     0   450   125     0     0     0
   441  0.31182304E+00     0   451   125     0     0     0
   441  0.12759168E-02     0   452   125     0     0     0
   441  0.12091799E-01     0   453   125     0     0     0
   441  0.55228388E+00     0   456   126     0     0     0
   441  0.48943676E-01     0   457   126     0     0     0
   0
   4
   443  0.98319423E+00     0   450   127     0     0     0
   443  0.78694522E-02     0   451   127     0     0     0
   443  0.60825580E-03     0   452   127     0     0     0
   443  0.83280113E-02     0   453   127     0     0     0
   0
   4
   445  0.98319423E+00     0   450   129     0     0     0
   445  0.78694522E-02     0   451   129     0     0     0
   445  0.60825580E-03     0   452   129     0     0     0
   445  0.83280113E-02     0   453   129     0     0     0
   0
   6
   447  0.73581703E-01     0   450   131     0     0     0
   447  0.31182304E+00     0   451   131     0     0     0
   447  0.12759168E-02     0   452   131     0     0     0
   447  0.12091799E-01     0   453   131     0     0     0
   447  0.55228388E+00     0   454   132     0     0     0
   447  0.48943676E-01     0   455   132     0     0     0
   0
  14
   449  0.13608086E-01     0   454     1     8     0     0
   449  0.13608086E-01     0   456     2     7     0     0
   449  0.13607836E-01     0   454     3    10     0     0
   449  0.13607836E-01     0   456     4     9     0     0
   449  0.24488532E-04     0   450    13     0     0     0
   449  0.34361476E+00     0   450     2     8     0     0
   449  0.11629684E+00     0   450     1     7     0     0
   449  0.11629675E+00     0   450     3     9     0     0
   449  0.34360555E+00     0   450     4    10     0     0
   449  0.15013915E-03     0   450     5    11     0     0
   449  0.69547133E-02     0   451     2     8     0     0
   449  0.58352253E-02     0   451     1     7     0     0
   449  0.58352221E-02     0   451     3     9     0     0
   449  0.69544739E-02     0   451     4    10     0     0
   0
   9
   451  0.64238888E-03     0   450   200     0     0     0
   451  0.11653423E+00     0   425   127     0     0     0
   451  0.11653423E+00     0   431   121     0     0     0
   451  0.11653396E+00     0   427   129     0     0     0
   451  0.11653396E+00     0   433   123     0     0     0
   451  0.13330530E+00     0   426   128     0     0     0
   451  0.13330530E+00     0   432   122     0     0     0
   451  0.13330530E+00     0   428   130     0     0     0
   451  0.13330530E+00     0   434   124     0     0     0
  26
   452  0.30185729E+00     0   454   199     0     0     0
   452  0.30185729E+00     0   456   198     0     0     0
   452  0.12396441E+00     0   450   200     0     0     0
   452  0.25497788E+00     0   451   200     0     0     0
   452  0.71982858E-02     0   450   203     0     0     0
   452  0.59338259E-02     0   451   203     0     0     0
   452  0.13012845E-03     0   402     8     0     0     0
   452  0.13012845E-03     0   408     2     0     0     0
   452  0.18605193E-03     0   401     7     0     0     0
   452  0.18605193E-03     0   407     1     0     0     0
   452  0.18605150E-03     0   403     9     0     0     0
   452  0.18605150E-03     0   409     3     0     0     0
   452  0.13011554E-03     0   404    10     0     0     0
   452  0.13011554E-03     0   410     4     0     0     0
   452  0.33572436E-04     0   414     8     0     0     0
   452  0.33572436E-04     0   420     2     0     0     0
   452  0.33569013E-04     0   416    10     0     0     0
   452  0.33569013E-04     0   422     4     0     0     0
   452  0.13193038E-03     0   425   127     0     0     0
   452  0.13193038E-03     0   431   121     0     0     0
   452  0.13193036E-03     0   427   129     0     0     0
   452  0.13193036E-03     0   433   123     0     0     0
   452  0.57105918E-03     0   426   128     0     0     0
   452  0.57105918E-03     0   432   122     0     0     0
   452  0.57105918E-03     0   428   130     0     0     0
   452  0.57105918E-03     0   434   124     0     0     0
  30
   453  0.28209105E+00     0   454   199     0     0     0
   453  0.28209105E+00     0   456   198     0     0     0
   453  0.71909805E-02     0   450   200     0     0     0
   453  0.72035710E-02     0   451   200     0     0     0
   453  0.89911565E-01     0   450   203     0     0     0
   453  0.18959180E+00     0   451   203     0     0     0
   453  0.59046834E-02     0   402     8     0     0     0
   453  0.59046834E-02     0   408     2     0     0     0
   453  0.72015906E-02     0   401     7     0     0     0
   453  0.72015906E-02     0   407     1     0     0     0
   453  0.72015799E-02     0   403     9     0     0     0
   453  0.72015799E-02     0   409     3     0     0     0
   453  0.59042596E-02     0   404    10     0     0     0
   453  0.59042596E-02     0   410     4     0     0     0
   453  0.52516442E-03     0   414     8     0     0     0
   453  0.52516442E-03     0   420     2     0     0     0
   453  0.12809079E-03     0   413     7     0     0     0
   453  0.12809079E-03     0   419     1     0     0     0
   453  0.12809054E-03     0   415     9     0     0     0
   453  0.12809054E-03     0   421     3     0     0     0
   453  0.52512577E-03     0   416    10     0     0     0
   453  0.52512577E-03     0   422     4     0     0     0
   453  0.63192467E-02     0   425   127     0     0     0
   453  0.63192467E-02     0   431   121     0     0     0
   453  0.63192467E-02     0   427   129     0     0     0
   453  0.63192467E-02     0   433   123     0     0     0
   453  0.15401450E-01     0   426   128     0     0     0
   453  0.15401450E-01     0   432   122     0     0     0
   453  0.15401450E-01     0   428   130     0     0     0
   453  0.15401450E-01     0   434   124     0     0     0
   5
   454  0.18571319E-01     0   450   198     0     0     0
   454  0.29285640E+00     0   426   127     0     0     0
   454  0.29285595E+00     0   428   129     0     0     0
   454  0.19785817E+00     0   431   122     0     0     0
   454  0.19785817E+00     0   433   124     0     0     0
  12
   455  0.62261656E-01     0   450   198     0     0     0
   455  0.30665535E+00     0   451   198     0     0     0
   455  0.96186418E-02     0   402     7     0     0     0
   455  0.16643172E-01     0   407     2     0     0     0
   455  0.96183773E-02     0   404     9     0     0     0
   455  0.18092176E-01     0   409     4     0     0     0
   455  0.15104818E-01     0   426   127     0     0     0
   455  0.15104818E-01     0   428   129     0     0     0
   455  0.27352355E-01     0   431   122     0     0     0
   455  0.27352355E-01     0   433   124     0     0     0
   455  0.27410391E+00     0   454   200     0     0     0
   455  0.21809235E+00     0   454   203     0     0     0
   5
   456  0.18571319E-01     0   450   199     0     0     0
   456  0.29285640E+00     0   432   121     0     0     0
   456  0.29285595E+00     0   434   123     0     0     0
   456  0.19785817E+00     0   425   128     0     0     0
   456  0.19785817E+00     0   427   130     0     0     0
  12
   457  0.62261656E-01     0   450   199     0     0     0
   457  0.30665535E+00     0   451   199     0     0     0
   457  0.96186418E-02     0   408     1     0     0     0
   457  0.16643172E-01     0   401     8     0     0     0
   457  0.96183773E-02     0   410     3     0     0     0
   457  0.18092176E-01     0   403    10     0     0     0
   457  0.15104818E-01     0   432   121     0     0     0
   457  0.15104818E-01     0   434   123     0     0     0
   457  0.27352355E-01     0   425   128     0     0     0
   457  0.27352355E-01     0   427   130     0     0     0
   457  0.27410391E+00     0   456   200     0     0     0
   457  0.21809235E+00     0   456   203     0     0     0
  28
   203  0.21323102E-03     0   123   129     0     0     0
   203  0.60968868E-01     0   125   131     0     0     0
   203  0.25645343E-02     0     3     9     0     0     0
   203  0.85112828E+00     0     5    11     0     0     0
   203  0.37278187E-01     0     4    10     0     0     0
   203  0.14811025E-02     0    59    59     0     0     0
   203  0.33229157E-01     0    13    13     0     0     0
   203  0.70843386E-03     0   198   121   128     0     0
   203  0.70843386E-03     0   198   123   130     0     0
   203  0.70843386E-03     0   198   125   132     0     0
   203  0.21253019E-02     0   198     8     1     0     0
   203  0.21253019E-02     0   198    10     3     0     0
   203  0.70843386E-03     0   199   127   122     0     0
   203  0.70843386E-03     0   199   129   124     0     0
   203  0.70843386E-03     0   199   131   126     0     0
   203  0.21253019E-02     0   199     2     7     0     0
   203  0.21253019E-02     0   199     4     9     0     0
   203  0.26318616E-04     0   200   122   128     0     0
   203  0.26318616E-04     0   200   124   130     0     0
   203  0.26318616E-04     0   200   126   132     0     0
   203  0.13245894E-04     0   200   121   127     0     0
   203  0.13245894E-04     0   200   123   129     0     0
   203  0.13245894E-04     0   200   125   131     0     0
   203  0.45379311E-04     0   200     2     8     0     0
   203  0.45379311E-04     0   200     4    10     0     0
   203  0.58459733E-04     0   200     1     7     0     0
   203  0.58459733E-04     0   200     3     9     0     0
   203  0.58459733E-04     0   200     5    11     0     0
  29
   204  0.18078452E-04     0   123   129     0     0     0
   204  0.51778490E-02     0   125   131     0     0     0
   204  0.21193085E-03     0     3     9     0     0     0
   204  0.52255735E-01     0     5    11     0     0     0
   204  0.43787736E+00     0     6    12     0     0     0
   204  0.24624803E-03     0    13    13     0     0     0
   204  0.10587154E-02     0   198   199     0     0     0
   204  0.53753913E-03     0   200   200     0     0     0
   204  0.23597255E-02     0   450   450     0     0     0
   204  0.10758121E-01     0   450   451     0     0     0
   204  0.76792583E-01     0   450   452     0     0     0
   204  0.53835409E-02     0   450   453     0     0     0
   204  0.10945321E-01     0   451   451     0     0     0
   204  0.11805685E+00     0   451   452     0     0     0
   204  0.17450695E-02     0   451   453     0     0     0
   204  0.27586067E-01     0   454   456     0     0     0
   204  0.12108511E+00     0   454   457     0     0     0
   204  0.12108511E+00     0   456   455     0     0     0
   204  0.45113526E-02     0   203   203     0     0     0
   204  0.18541022E-03     0   425   431     0     0     0
   204  0.18539495E-03     0   427   433     0     0     0
   204  0.18372973E-03     0   402   408     0     0     0
   204  0.32586289E-04     0   414   420     0     0     0
   204  0.18358028E-03     0   404   410     0     0     0
   204  0.32531465E-04     0   416   422     0     0     0
   204  0.95730131E-04     0   401   407     0     0     0
   204  0.95746094E-04     0   403   409     0     0     0
   204  0.65649266E-03     0   426   432     0     0     0
   204  0.65649266E-03     0   428   434     0     0     0
  17
   205  0.17900224E-04     0   123   129     0     0     0
   205  0.51268660E-02     0   125   131     0     0     0
   205  0.20985489E-03     0     3     9     0     0     0
   205  0.51793166E-01     0     5    11     0     0     0
   205  0.46358550E+00     0     6    12     0     0     0
   205  0.27074086E-03     0    13    13     0     0     0
   205  0.57192948E-02     0   450   450     0     0     0
   205  0.32342825E-01     0   450   451     0     0     0
   205  0.80278199E-02     0   450   452     0     0     0
   205  0.53702660E-01     0   450   453     0     0     0
   205  0.43696217E-01     0   451   451     0     0     0
   205  0.37200651E-02     0   451   452     0     0     0
   205  0.61764371E-01     0   451   453     0     0     0
   205  0.10803178E+00     0   454   456     0     0     0
   205  0.80484681E-01     0   454   457     0     0     0
   205  0.80484681E-01     0   456   455     0     0     0
   205  0.10215899E-02     0   203   200     0     0     0
  15
   206  0.20465124E-04     0   124   129     0     0     0
   206  0.58614886E-02     0   126   131     0     0     0
   206  0.23013416E-03     0     4     9     0     0     0
   206  0.47571144E+00     0     6    11     0     0     0
   206  0.42375747E-01     0   454   450     0     0     0
   206  0.39392803E-03     0   454   451     0     0     0
   206  0.15612893E+00     0   454   452     0     0     0
   206  0.12419198E+00     0   454   453     0     0     0
   206  0.43674685E-01     0   455   450     0     0     0
   206  0.14784352E+00     0   455   451     0     0     0
   206  0.11750783E-02     0   203   198     0     0     0
   206  0.34220054E-03     0   402   407     0     0     0
   206  0.34200840E-03     0   404   409     0     0     0
   206  0.85420295E-03     0   431   426     0     0     0
   206  0.85417804E-03     0   433   428     0     0     0
  15
   207  0.20465124E-04     0   130   123     0     0     0
   207  0.58614886E-02     0   132   125     0     0     0
   207  0.23013416E-03     0    10     3     0     0     0
   207  0.47571144E+00     0    12     5     0     0     0
   207  0.42375747E-01     0   456   450     0     0     0
   207  0.39392803E-03     0   456   451     0     0     0
   207  0.15612893E+00     0   456   452     0     0     0
   207  0.12419198E+00     0   456   453     0     0     0
   207  0.43674685E-01     0   457   450     0     0     0
   207  0.14784352E+00     0   457   451     0     0     0
   207  0.11750783E-02     0   203   199     0     0     0
   207  0.34220054E-03     0   408   401     0     0     0
   207  0.34200840E-03     0   410   403     0     0     0
   207  0.85420295E-03     0   425   432     0     0     0
   207  0.85417804E-03     0   427   434     0     0     0
   0
   5
     6  0.33333334E+00   100     2     7     5     0     0
     6  0.33333334E+00   100     4     9     5     0     0
     6  0.11111111E+00   100   122   127     5     0     0
     6  0.11111111E+00   100   124   129     5     0     0
     6  0.11111111E+00   100   126   131     5     0     0
   5
    12  0.33333334E+00   100     8     1    11     0     0
    12  0.33333334E+00   100    10     3    11     0     0
    12  0.11111111E+00   100   128   121    11     0     0
    12  0.11111111E+00   100   130   123    11     0     0
    12  0.11111111E+00   100   132   125    11     0     0
      4.00000000     -0.24957091
      0.99061340     -0.06023243      0.10504968     -0.06341787
     -0.08999308     -0.96278483      0.20612884     -0.14985886
     -0.02667332      0.04290385      0.70386559      0.70853454
     -0.09937296      0.25995550      0.67160177     -0.68665808
     -0.97508895      0.22181427     -0.22181427     -0.97508895
     -0.95260036      0.30422443     -0.30422443     -0.95260036
      1.57074499     -1.57079601     -1.57079482
    150.00000000   2400.00000000   2400.00000000
    600.00000000
    T
