#  ISAJET SUSY parameters in Les Houches accord format
#  Created by ISALHA3. Last revision by C. Balazs on 2005 Jan. 10
Block SPINFO   # Program information
     1   ISASUGRA from ISAJET          # Spectrum Calculator
     2   7.79   16-DEC-2008 15:42:00   # Version number
Block MODSEL   # Model selection
     1     1   # Minimal supergravity (mSUGRA,CMSSM) model         
Block SMINPUTS   # Standard Model inputs
     1     1.27836723E+02   # alpha_em^(-1)
     2     1.16570000E-05   # G_Fermi
     3     1.17200002E-01   # alpha_s(M_Z)
     4     9.11699982E+01   # m_{Z}(pole)
     5     4.19999981E+00   # m_{b}(m_{b})
     6     1.72500000E+02   # m_{top}(pole)
     7     1.77699995E+00   # m_{tau}(pole)
Block MINPAR   # SUSY breaking input parameters
     1     7.60000000E+02   # m_0
     2     3.10000000E+02   # m_{1/2}
     3     3.00000000E+00   # tan(beta)
     4     1.00000000E+00   # sign(mu)
     5     0.00000000E+00   # A_0
#  
#  M_{GUT} =   0.21751510E+17
Block MASS   # Scalar and gaugino mass spectrum
#  PDG code   mass                 particle
        24     8.04229965E+01   #  W^+
        25     9.95732651E+01   #  h^0            
        35     1.03869421E+03   #  H^0            
        36     1.03036353E+03   #  A^0            
        37     1.04014990E+03   #  H^+            
   1000001     1.00900922E+03   #  dnl            
   1000002     1.00642041E+03   #  upl            
   1000003     1.00900922E+03   #  stl            
   1000004     1.00642139E+03   #  chl            
   1000005     8.66839294E+02   #  b1             
   1000006     6.46583862E+02   #  t1             
   1000011     7.86975403E+02   #  el-            
   1000012     7.83505737E+02   #  nuel           
   1000013     7.86975403E+02   #  mul-           
   1000014     7.83505737E+02   #  numl           
   1000015     7.67484741E+02   #  tau1           
   1000016     7.83202881E+02   #  nutl           
   1000021     7.80664978E+02   #  glss           
   1000022     1.25301559E+02   #  z1ss           
   1000023     2.37832977E+02   #  z2ss           
   1000024     2.37567215E+02   #  w1ss           
   1000025    -5.80791260E+02   #  z3ss           
   1000035     5.97824585E+02   #  z4ss           
   1000037     5.95472351E+02   #  w2ss           
   2000001     9.94271423E+02   #  dnr            
   2000002     9.94914551E+02   #  upr            
   2000003     9.94271484E+02   #  str            
   2000004     9.94915527E+02   #  chr            
   2000005     9.89973389E+02   #  b2             
   2000006     8.95860413E+02   #  t2             
   2000011     7.68501038E+02   #  er-            
   2000013     7.68501038E+02   #  mur-           
   2000015     7.86875549E+02   #  tau2           
#  Higgs mixing
Block ALPHA   # Effective Higgs mixing parameter
         -3.26521397E-01   # alpha
Block STOPMIX   # stop mixing matrix
  1  1     2.94276923E-01   # O_{11}
  1  2    -9.55720186E-01   # O_{12}
  2  1     9.55720186E-01   # O_{21}
  2  2     2.94276923E-01   # O_{22}
Block SBOTMIX   # sbottom mixing matrix
  1  1     9.99649405E-01   # O_{11}
  1  2    -2.64783595E-02   # O_{12}
  2  1     2.64783595E-02   # O_{21}
  2  2     9.99649405E-01   # O_{22}
Block STAUMIX   # stau mixing matrix
  1  1     1.17036745E-01   # O_{11}
  1  2    -9.93127584E-01   # O_{12}
  2  1     9.93127584E-01   # O_{21}
  2  2     1.17036745E-01   # O_{22}
Block NMIX   # neutralino mixing matrix
  1  1    -9.94571328E-01   #
  1  2     4.06911969E-02   #
  1  3    -8.51869732E-02   #
  1  4     4.37654108E-02   #
  2  1    -5.90833724E-02   #
  2  2    -9.78193879E-01   #
  2  3     1.66291043E-01   #
  2  4    -1.09513640E-01   #
  3  1     2.73997430E-02   #
  3  2    -4.20068540E-02   #
  3  3    -7.03947365E-01   #
  3  4    -7.08479404E-01   #
  4  1    -8.11566859E-02   #
  4  2     1.99289918E-01   #
  4  3     6.85236394E-01   #
  4  4    -6.95807815E-01   #
Block UMIX   # chargino U mixing matrix
  1  1    -9.70760465E-01   # U_{11}
  1  2     2.40050256E-01   # U_{12}
  2  1    -2.40050256E-01   # U_{21}
  2  2    -9.70760465E-01   # U_{22}
Block VMIX   # chargino V mixing matrix
  1  1    -9.87082362E-01   # V_{11}
  1  2     1.60213754E-01   # V_{12}
  2  1    -1.60213754E-01   # V_{21}
  2  2    -9.87082362E-01   # V_{22}
Block GAUGE Q=  7.24964050E+02   #
     1     3.57522607E-01   # g`
     2     6.52387977E-01   # g_2
     3     1.21918941E+00   # g_3
Block YU Q=  7.24964050E+02   #
  3  3     9.09660697E-01   # y_t
Block YD Q=  7.24964050E+02   #
  3  3     4.31464352E-02   # y_b
Block YE Q=  7.24964050E+02   #
  3  3     3.17818224E-02   # y_tau
Block HMIX Q=  7.24964050E+02   # Higgs mixing parameters
     1     5.78234558E+02   # mu(Q)
     2     3.00000000E+00   # tan(beta)(M_{GUT})
     3     2.50738098E+02   # Higgs vev at Q
     4     1.06164900E+06   # m_A^2(Q)
Block MSOFT Q=  7.24964050E+02   # DRbar SUSY breaking parameters
     1     1.28875015E+02   # M_1(Q)          
     2     2.40784760E+02   # M_2(Q)          
     3     7.08515503E+02   # M_3(Q)          
    31     7.83506287E+02   # MeL(Q)          
    32     7.83506287E+02   # MmuL(Q)         
    33     7.83209167E+02   # MtauL(Q)        
    34     7.66884460E+02   # MeR(Q)          
    35     7.66884460E+02   # MmuR(Q)         
    36     7.66204285E+02   # MtauR(Q)        
    41     9.71876465E+02   # MqL1(Q)         
    42     9.71876465E+02   # MqL2(Q)         
    43     8.32365479E+02   # MqL3(Q)         
    44     9.59552673E+02   # MuR(Q)          
    45     9.59552673E+02   # McR(Q)          
    46     6.31420776E+02   # MtR(Q)          
    47     9.58095459E+02   # MdR(Q)          
    48     9.58095459E+02   # MsR(Q)          
    49     9.62429688E+02   # MbR(Q)          
Block AU Q=  7.24964050E+02   #
  1  1    -5.25131104E+02   # A_u
  2  2    -5.25131104E+02   # A_c
  3  3    -5.25131104E+02   # A_t
Block AD Q=  7.24964050E+02   #
  1  1    -8.30509888E+02   # A_d
  2  2    -8.30509888E+02   # A_s
  3  3    -8.30509888E+02   # A_b
Block AE Q=  7.24964050E+02   #
  1  1    -1.91431808E+02   # A_e
  2  2    -1.91431808E+02   # A_mu
  3  3    -1.91431808E+02   # A_tau
#  ISAJET decay tables in SUSY Les Houches accord format
#  Created by ISALHD. Last revision: C. Balazs, 2005 May 25
Block DCINFO                           # Program information
     1   ISASUGRA from ISAJET          # Spectrum Calculator
     2   7.79   16-DEC-2008 15:42:00   # Version number
#         PDG         Width
DECAY         6  1.14680767E+00   # TP    decays
#          BR          NDA       ID1       ID2       ID3       ID4
      3.33333343E-01    3            2        -1         5             # TP     -->  UP     DB     BT          
      3.33333343E-01    3            4        -3         5             # TP     -->  CH     SB     BT          
      1.11111112E-01    3          -11        12         5             # TP     -->  E+     NUE    BT          
      1.11111112E-01    3          -13        14         5             # TP     -->  MU+    NUM    BT          
      1.11111112E-01    3          -15        16         5             # TP     -->  TAU+   NUT    BT          
#         PDG         Width
DECAY   1000021  2.83173192E-02   # GLSS  decays
#          BR          NDA       ID1       ID2       ID3       ID4
      7.17763305E-02    3      1000024         1        -2             # GLSS   -->  W1SS+  DN     UB          
      7.17763305E-02    3     -1000024         2        -1             # GLSS   -->  W1SS-  UP     DB          
      7.17761219E-02    3      1000024         3        -4             # GLSS   -->  W1SS+  ST     CB          
      7.17761219E-02    3     -1000024         4        -3             # GLSS   -->  W1SS-  CH     SB          
      9.81008410E-02    3      1000024         5        -6             # GLSS   -->  W1SS+  BT     TB          
      9.81008410E-02    3     -1000024         6        -5             # GLSS   -->  W1SS-  TP     BB          
      7.46221631E-05    3      1000037         1        -2             # GLSS   -->  W2SS+  DN     UB          
      7.46221631E-05    3     -1000037         2        -1             # GLSS   -->  W2SS-  UP     DB          
      7.46219594E-05    3      1000037         3        -4             # GLSS   -->  W2SS+  ST     CB          
      7.46219594E-05    3     -1000037         4        -3             # GLSS   -->  W2SS-  CH     SB          
      4.65654412E-05    3      1000037         5        -6             # GLSS   -->  W2SS+  BT     TB          
      4.65654412E-05    3     -1000037         6        -5             # GLSS   -->  W2SS-  TP     BB          
      2.50925973E-06    2      1000022        21                       # GLSS   -->  Z1SS   GL                 
      3.00842151E-02    3      1000022         2        -2             # GLSS   -->  Z1SS   UP     UB          
      9.79816075E-03    3      1000022         1        -1             # GLSS   -->  Z1SS   DN     DB          
      9.79815610E-03    3      1000022         3        -3             # GLSS   -->  Z1SS   ST     SB          
      3.00840419E-02    3      1000022         4        -4             # GLSS   -->  Z1SS   CH     CB          
      1.41383223E-02    3      1000022         5        -5             # GLSS   -->  Z1SS   BT     BB          
      1.53167322E-01    3      1000022         6        -6             # GLSS   -->  Z1SS   TP     TB          
      1.74770865E-03    2      1000023        21                       # GLSS   -->  Z2SS   GL                 
      3.69429700E-02    3      1000023         2        -2             # GLSS   -->  Z2SS   UP     UB          
      3.47565636E-02    3      1000023         1        -1             # GLSS   -->  Z2SS   DN     DB          
      3.47565636E-02    3      1000023         3        -3             # GLSS   -->  Z2SS   ST     SB          
      3.69427539E-02    3      1000023         4        -4             # GLSS   -->  Z2SS   CH     CB          
      9.60864946E-02    3      1000023         5        -5             # GLSS   -->  Z2SS   BT     BB          
      2.05342937E-02    3      1000023         6        -6             # GLSS   -->  Z2SS   TP     TB          
      3.39316460E-03    2      1000025        21                       # GLSS   -->  Z3SS   GL                 
      8.26235578E-07    3      1000025         2        -2             # GLSS   -->  Z3SS   UP     UB          
      1.04026833E-06    3      1000025         1        -1             # GLSS   -->  Z3SS   DN     DB          
      1.04026833E-06    3      1000025         3        -3             # GLSS   -->  Z3SS   ST     SB          
      8.26229268E-07    3      1000025         4        -4             # GLSS   -->  Z3SS   CH     CB          
      3.19494720E-05    3      1000025         5        -5             # GLSS   -->  Z3SS   BT     BB          
      3.69467912E-03    2      1000035        21                       # GLSS   -->  Z4SS   GL                 
      3.34159631E-05    3      1000035         2        -2             # GLSS   -->  Z4SS   UP     UB          
      4.05244755E-05    3      1000035         1        -1             # GLSS   -->  Z4SS   DN     DB          
      4.05244755E-05    3      1000035         3        -3             # GLSS   -->  Z4SS   ST     SB          
      3.34157121E-05    3      1000035         4        -4             # GLSS   -->  Z4SS   CH     CB          
      1.90264604E-04    3      1000035         5        -5             # GLSS   -->  Z4SS   BT     BB          
#         PDG         Width
DECAY   1000002  2.10901356E+01   # UPL   decays
#          BR          NDA       ID1       ID2       ID3       ID4
      3.89929628E-03    2      1000022         2                       # UPL    -->  Z1SS   UP                 
      1.75148889E-01    2      1000023         2                       # UPL    -->  Z2SS   UP                 
      1.22243480E-04    2      1000025         2                       # UPL    -->  Z3SS   UP                 
      2.86118872E-03    2      1000035         2                       # UPL    -->  Z4SS   UP                 
      4.64592725E-01    2      1000021         2                       # UPL    -->  GLSS   UP                 
      3.49019885E-01    2      1000024         1                       # UPL    -->  W1SS+  DN                 
      4.35576821E-03    2      1000037         1                       # UPL    -->  W2SS+  DN                 
#         PDG         Width
DECAY   1000001  2.11595936E+01   # DNL   decays
#          BR          NDA       ID1       ID2       ID3       ID4
      9.66796372E-03    2      1000022         1                       # DNL    -->  Z1SS   DN                 
      1.67546123E-01    2      1000023         1                       # DNL    -->  Z2SS   DN                 
      1.98482870E-04    2      1000025         1                       # DNL    -->  Z3SS   DN                 
      3.87708447E-03    2      1000035         1                       # DNL    -->  Z4SS   DN                 
      4.71350580E-01    2      1000021         1                       # DNL    -->  GLSS   DN                 
      3.37534338E-01    2     -1000024         2                       # DNL    -->  W1SS-  UP                 
      9.82543267E-03    2     -1000037         2                       # DNL    -->  W2SS-  UP                 
#         PDG         Width
DECAY   1000003  2.11595612E+01   # STL   decays
#          BR          NDA       ID1       ID2       ID3       ID4
      9.66797769E-03    2      1000022         3                       # STL    -->  Z1SS   ST                 
      1.67546362E-01    2      1000023         3                       # STL    -->  Z2SS   ST                 
      1.98483147E-04    2      1000025         3                       # STL    -->  Z3SS   ST                 
      3.87709006E-03    2      1000035         3                       # STL    -->  Z4SS   ST                 
      4.71351266E-01    2      1000021         3                       # STL    -->  GLSS   ST                 
      3.37533474E-01    2     -1000024         4                       # STL    -->  W1SS-  CH                 
      9.82536469E-03    2     -1000037         4                       # STL    -->  W2SS-  CH                 
#         PDG         Width
DECAY   1000004  2.10899754E+01   # CHL   decays
#          BR          NDA       ID1       ID2       ID3       ID4
      3.89931491E-03    2      1000022         4                       # CHL    -->  Z1SS   CH                 
      1.75149709E-01    2      1000023         4                       # CHL    -->  Z2SS   CH                 
      1.22243771E-04    2      1000025         4                       # CHL    -->  Z3SS   CH                 
      2.86119431E-03    2      1000035         4                       # CHL    -->  Z4SS   CH                 
      4.64588761E-01    2      1000021         4                       # CHL    -->  GLSS   CH                 
      3.49022925E-01    2      1000024         3                       # CHL    -->  W1SS+  ST                 
      4.35581384E-03    2      1000037         3                       # CHL    -->  W2SS+  ST                 
#         PDG         Width
DECAY   1000005  1.62448750E+01   # BT1   decays
#          BR          NDA       ID1       ID2       ID3       ID4
      1.07762534E-02    2      1000022         5                       # BT1    -->  Z1SS   BT                 
      1.79780528E-01    2      1000023         5                       # BT1    -->  Z2SS   BT                 
      4.39568947E-04    2      1000025         5                       # BT1    -->  Z3SS   BT                 
      3.06810928E-03    2      1000035         5                       # BT1    -->  Z4SS   BT                 
      1.18837170E-01    2      1000021         5                       # BT1    -->  GLSS   BT                 
      3.27861577E-01    2     -1000024         6                       # BT1    -->  W1SS-  TP                 
      2.00845420E-01    2     -1000037         6                       # BT1    -->  W2SS-  TP                 
      1.58391371E-01    2          -24   1000006                       # BT1    -->  W-     TP1                
#         PDG         Width
DECAY   1000006  2.72292542E+00   # TP1   decays
#          BR          NDA       ID1       ID2       ID3       ID4
      4.06681448E-01    2      1000022         6                       # TP1    -->  Z1SS   TP                 
      1.46306992E-01    2      1000023         6                       # TP1    -->  Z2SS   TP                 
      3.75501782E-01    2      1000024         5                       # TP1    -->  W1SS+  BT                 
      7.15097487E-02    2      1000037         5                       # TP1    -->  W2SS+  BT                 
#         PDG         Width
DECAY   2000002  1.11965990E+01   # UPR   decays
#          BR          NDA       ID1       ID2       ID3       ID4
      1.92442194E-01    2      1000022         2                       # UPR    -->  Z1SS   UP                 
      6.23357249E-04    2      1000023         2                       # UPR    -->  Z2SS   UP                 
      6.55353069E-05    2      1000025         2                       # UPR    -->  Z3SS   UP                 
      5.40117908E-04    2      1000035         2                       # UPR    -->  Z4SS   UP                 
      8.06328773E-01    2      1000021         2                       # UPR    -->  GLSS   UP                 
#         PDG         Width
DECAY   2000001  9.52726936E+00   # DNR   decays
#          BR          NDA       ID1       ID2       ID3       ID4
      5.65013848E-02    2      1000022         1                       # DNR    -->  Z1SS   DN                 
      1.82997726E-04    2      1000023         1                       # DNR    -->  Z2SS   DN                 
      1.92163534E-05    2      1000025         1                       # DNR    -->  Z3SS   DN                 
      1.58354349E-04    2      1000035         1                       # DNR    -->  Z4SS   DN                 
      9.43138003E-01    2      1000021         1                       # DNR    -->  GLSS   DN                 
#         PDG         Width
DECAY   2000003  9.52727413E+00   # STR   decays
#          BR          NDA       ID1       ID2       ID3       ID4
      5.65013625E-02    2      1000022         3                       # STR    -->  Z1SS   ST                 
      1.82997668E-04    2      1000023         3                       # STR    -->  Z2SS   ST                 
      1.92163479E-05    2      1000025         3                       # STR    -->  Z3SS   ST                 
      1.58354305E-04    2      1000035         3                       # STR    -->  Z4SS   ST                 
      9.43138063E-01    2      1000021         3                       # STR    -->  GLSS   ST                 
#         PDG         Width
DECAY   2000004  1.11964340E+01   # CHR   decays
#          BR          NDA       ID1       ID2       ID3       ID4
      1.92444518E-01    2      1000022         4                       # CHR    -->  Z1SS   CH                 
      6.23364642E-04    2      1000023         4                       # CHR    -->  Z2SS   CH                 
      6.55359181E-05    2      1000025         4                       # CHR    -->  Z3SS   CH                 
      5.40122739E-04    2      1000035         4                       # CHR    -->  Z4SS   CH                 
      8.06326449E-01    2      1000021         4                       # CHR    -->  GLSS   CH                 
#         PDG         Width
DECAY   2000005  9.28505516E+00   # BT2   decays
#          BR          NDA       ID1       ID2       ID3       ID4
      5.75980283E-02    2      1000022         5                       # BT2    -->  Z1SS   BT                 
      2.31245518E-04    2      1000023         5                       # BT2    -->  Z2SS   BT                 
      9.29175643E-04    2      1000025         5                       # BT2    -->  Z3SS   BT                 
      1.10314961E-03    2      1000035         5                       # BT2    -->  Z4SS   BT                 
      9.35827792E-01    2      1000021         5                       # BT2    -->  GLSS   BT                 
      8.47557531E-05    2     -1000024         6                       # BT2    -->  W1SS-  TP                 
      2.56733550E-03    2     -1000037         6                       # BT2    -->  W2SS-  TP                 
      7.12723413E-04    2          -24   1000006                       # BT2    -->  W-     TP1                
      3.61406856E-05    2          -24   2000006                       # BT2    -->  W-     TP2                
      9.27279325E-05    2           23   1000005                       # BT2    -->  Z0     BT1                
      8.16900865E-04    2           25   1000005                       # BT2    -->  HL0    BT1                
#         PDG         Width
DECAY   2000006  1.54284964E+01   # TP2   decays
#          BR          NDA       ID1       ID2       ID3       ID4
      3.26126784E-01    2      1000024         5                       # TP2    -->  W1SS+  BT                 
      4.72485945E-02    2      1000037         5                       # TP2    -->  W2SS+  BT                 
      1.07174881E-01    2           23   1000006                       # TP2    -->  Z0     TP1                
      1.10275663E-01    2           25   1000006                       # TP2    -->  HL0    TP1                
      8.89965426E-03    2      1000022         6                       # TP2    -->  Z1SS   TP                 
      1.51212558E-01    2      1000023         6                       # TP2    -->  Z2SS   TP                 
      9.00711417E-02    2      1000025         6                       # TP2    -->  Z3SS   TP                 
      1.58990756E-01    2      1000035         6                       # TP2    -->  Z4SS   TP                 
#         PDG         Width
DECAY   1000011  8.84122276E+00   # EL-   decays
#          BR          NDA       ID1       ID2       ID3       ID4
      9.11100507E-02    2      1000022        11                       # EL-    -->  Z1SS   E-                 
      3.16000789E-01    2      1000023        11                       # EL-    -->  Z2SS   E-                 
      5.64136135E-05    2      1000025        11                       # EL-    -->  Z3SS   E-                 
      1.60361629E-03    2      1000035        11                       # EL-    -->  Z4SS   E-                 
      5.83338737E-01    2     -1000024        12                       # EL-    -->  W1SS-  NUE                
      7.89040979E-03    2     -1000037        12                       # EL-    -->  W2SS-  NUE                
#         PDG         Width
DECAY   1000013  8.84122276E+00   # MUL-  decays
#          BR          NDA       ID1       ID2       ID3       ID4
      9.11100507E-02    2      1000022        13                       # MUL-   -->  Z1SS   MU-                
      3.16000760E-01    2      1000023        13                       # MUL-   -->  Z2SS   MU-                
      5.64136062E-05    2      1000025        13                       # MUL-   -->  Z3SS   MU-                
      1.60361594E-03    2      1000035        13                       # MUL-   -->  Z4SS   MU-                
      5.83338737E-01    2     -1000024        14                       # MUL-   -->  W1SS-  NUM                
      7.89040979E-03    2     -1000037        14                       # MUL-   -->  W2SS-  NUM                
#         PDG         Width
DECAY   1000015  3.76593089E+00   # TAU1- decays
#          BR          NDA       ID1       ID2       ID3       ID4
      9.61708844E-01    2      1000022        15                       # TAU1-  -->  Z1SS   TAU-               
      1.46420160E-02    2      1000023        15                       # TAU1-  -->  Z2SS   TAU-               
      4.20381606E-04    2      1000025        15                       # TAU1-  -->  Z3SS   TAU-               
      1.03657239E-03    2      1000035        15                       # TAU1-  -->  Z4SS   TAU-               
      2.20847409E-02    2     -1000024        16                       # TAU1-  -->  W1SS-  NUT                
      1.07443360E-04    2     -1000037        16                       # TAU1-  -->  W2SS-  NUT                
#         PDG         Width
DECAY   1000012  8.87738419E+00   # NUEL  decays
#          BR          NDA       ID1       ID2       ID3       ID4
      1.21682361E-01    2      1000022        12                       # NUEL   -->  Z1SS   NUE                
      2.73861021E-01    2      1000023        12                       # NUEL   -->  Z2SS   NUE                
      2.45554431E-04    2      1000025        12                       # NUEL   -->  Z3SS   NUE                
      3.85778723E-03    2      1000035        12                       # NUEL   -->  Z4SS   NUE                
      5.96950591E-01    2      1000024        11                       # NUEL   -->  W1SS+  E-                 
      3.40263080E-03    2      1000037        11                       # NUEL   -->  W2SS+  E-                 
#         PDG         Width
DECAY   1000014  8.87738419E+00   # NUML  decays
#          BR          NDA       ID1       ID2       ID3       ID4
      1.21682376E-01    2      1000022        14                       # NUML   -->  Z1SS   NUM                
      2.73861051E-01    2      1000023        14                       # NUML   -->  Z2SS   NUM                
      2.45554460E-04    2      1000025        14                       # NUML   -->  Z3SS   NUM                
      3.85778770E-03    2      1000035        14                       # NUML   -->  Z4SS   NUM                
      5.96950591E-01    2      1000024        13                       # NUML   -->  W1SS+  MU-                
      3.40263033E-03    2      1000037        13                       # NUML   -->  W2SS+  MU-                
#         PDG         Width
DECAY   1000016  8.87595654E+00   # NUTL  decays
#          BR          NDA       ID1       ID2       ID3       ID4
      1.21649943E-01    2      1000022        16                       # NUTL   -->  Z1SS   NUT                
      2.73756176E-01    2      1000023        16                       # NUTL   -->  Z2SS   NUT                
      2.45035975E-04    2      1000025        16                       # NUTL   -->  Z3SS   NUT                
      3.84860625E-03    2      1000035        16                       # NUTL   -->  Z4SS   NUT                
      5.96780360E-01    2      1000024        15                       # NUTL   -->  W1SS+  TAU-               
      3.71983484E-03    2      1000037        15                       # NUTL   -->  W2SS+  TAU-               
      4.22316293E-10    3      1000015        16       -15             # NUTL   -->  TAU1-  NUT    TAU+        
      4.22316293E-10    3      1000015        12       -11             # NUTL   -->  TAU1-  NUE    E+          
      4.22316293E-10    3      1000015        14       -13             # NUTL   -->  TAU1-  NUM    MU+         
      1.26694899E-09    3      1000015         2        -1             # NUTL   -->  TAU1-  UP     DB          
      1.26694899E-09    3      1000015         4        -3             # NUTL   -->  TAU1-  CH     SB          
#         PDG         Width
DECAY   2000011  3.67934275E+00   # ER-   decays
#          BR          NDA       ID1       ID2       ID3       ID4
      9.95730162E-01    2      1000022        11                       # ER-    -->  Z1SS   E-                 
      3.03218677E-03    2      1000023        11                       # ER-    -->  Z2SS   E-                 
      1.46681079E-04    2      1000025        11                       # ER-    -->  Z3SS   E-                 
      1.09093636E-03    2      1000035        11                       # ER-    -->  Z4SS   E-                 
#         PDG         Width
DECAY   2000013  3.67934275E+00   # MUR-  decays
#          BR          NDA       ID1       ID2       ID3       ID4
      9.95730162E-01    2      1000022        13                       # MUR-   -->  Z1SS   MU-                
      3.03218677E-03    2      1000023        13                       # MUR-   -->  Z2SS   MU-                
      1.46681021E-04    2      1000025        13                       # MUR-   -->  Z3SS   MU-                
      1.09093613E-03    2      1000035        13                       # MUR-   -->  Z4SS   MU-                
#         PDG         Width
DECAY   2000015  8.75443935E+00   # TAU2- decays
#          BR          NDA       ID1       ID2       ID3       ID4
      9.63094234E-02    2      1000022        15                       # TAU2-  -->  Z1SS   TAU-               
      3.13941032E-01    2      1000023        15                       # TAU2-  -->  Z2SS   TAU-               
      2.99088948E-04    2      1000025        15                       # TAU2-  -->  Z3SS   TAU-               
      1.95567566E-03    2      1000035        15                       # TAU2-  -->  Z4SS   TAU-               
      5.79264760E-01    2     -1000024        16                       # TAU2-  -->  W1SS-  NUT                
      8.23004451E-03    2     -1000037        16                       # TAU2-  -->  W2SS-  NUT                
#         PDG         Width
DECAY   1000023  8.82297382E-03   # Z2SS  decays
#          BR          NDA       ID1       ID2       ID3       ID4
      2.47294563E-09    2      1000022        22                       # Z2SS   -->  Z1SS   GM                 
      2.04746015E-02    2      1000022        23                       # Z2SS   -->  Z1SS   Z0                 
      4.94558094E-07    3      1000022         2        -2             # Z2SS   -->  Z1SS   UP     UB          
      1.10414771E-06    3      1000022         1        -1             # Z2SS   -->  Z1SS   DN     DB          
      1.10414771E-06    3      1000022         3        -3             # Z2SS   -->  Z1SS   ST     SB          
      4.94556105E-07    3      1000022         4        -4             # Z2SS   -->  Z1SS   CH     CB          
      2.04859316E-06    3      1000022         5        -5             # Z2SS   -->  Z1SS   BT     BB          
      5.96663176E-06    3      1000022        11       -11             # Z2SS   -->  Z1SS   E-     E+          
      5.96663176E-06    3      1000022        13       -13             # Z2SS   -->  Z1SS   MU-    MU+         
      5.97720009E-06    3      1000022        15       -15             # Z2SS   -->  Z1SS   TAU-   TAU+        
      7.02348416E-06    3      1000022        12       -12             # Z2SS   -->  Z1SS   NUE    ANUE        
      7.02348416E-06    3      1000022        14       -14             # Z2SS   -->  Z1SS   NUM    ANUM        
      7.03499381E-06    3      1000022        16       -16             # Z2SS   -->  Z1SS   NUT    ANUT        
      9.79481161E-01    2      1000022        25                       # Z2SS   -->  Z1SS   HL0                
#         PDG         Width
DECAY   1000025  4.73864174E+00   # Z3SS  decays
#          BR          NDA       ID1       ID2       ID3       ID4
      2.20863157E-07    2      1000022        22                       # Z3SS   -->  Z1SS   GM                 
      2.50368487E-07    2      1000023        22                       # Z3SS   -->  Z2SS   GM                 
      3.06114316E-01    2      1000024       -24                       # Z3SS   -->  W1SS+  W-                 
      3.06114316E-01    2     -1000024        24                       # Z3SS   -->  W1SS-  W+                 
      9.42359418E-02    2      1000022        23                       # Z3SS   -->  Z1SS   Z0                 
      2.71687597E-01    2      1000023        23                       # Z3SS   -->  Z2SS   Z0                 
      3.46600393E-09    3      1000022         2        -2             # Z3SS   -->  Z1SS   UP     UB          
      1.67512637E-09    3      1000022         1        -1             # Z3SS   -->  Z1SS   DN     DB          
      1.67512637E-09    3      1000022         3        -3             # Z3SS   -->  Z1SS   ST     SB          
      3.46598683E-09    3      1000022         4        -4             # Z3SS   -->  Z1SS   CH     CB          
      4.81921170E-08    3      1000022         5        -5             # Z3SS   -->  Z1SS   BT     BB          
      2.37468569E-08    3      1000022        11       -11             # Z3SS   -->  Z1SS   E-     E+          
      2.37468569E-08    3      1000022        13       -13             # Z3SS   -->  Z1SS   MU-    MU+         
      1.52284954E-07    3      1000022        15       -15             # Z3SS   -->  Z1SS   TAU-   TAU+        
      1.91016074E-08    3      1000022        12       -12             # Z3SS   -->  Z1SS   NUE    ANUE        
      1.91016074E-08    3      1000022        14       -14             # Z3SS   -->  Z1SS   NUM    ANUM        
      1.91447800E-08    3      1000022        16       -16             # Z3SS   -->  Z1SS   NUT    ANUT        
      6.86823221E-09    3      1000023         2        -2             # Z3SS   -->  Z2SS   UP     UB          
      1.04798614E-08    3      1000023         1        -1             # Z3SS   -->  Z2SS   DN     DB          
      1.04798614E-08    3      1000023         3        -3             # Z3SS   -->  Z2SS   ST     SB          
      6.86819757E-09    3      1000023         4        -4             # Z3SS   -->  Z2SS   CH     CB          
      1.38244289E-07    3      1000023         5        -5             # Z3SS   -->  Z2SS   BT     BB          
      4.94651964E-09    3      1000023        11       -11             # Z3SS   -->  Z2SS   E-     E+          
      4.94651964E-09    3      1000023        13       -13             # Z3SS   -->  Z2SS   MU-    MU+         
      4.07719050E-08    3      1000023        15       -15             # Z3SS   -->  Z2SS   TAU-   TAU+        
      1.98451193E-08    3      1000023        12       -12             # Z3SS   -->  Z2SS   NUE    ANUE        
      1.98451193E-08    3      1000023        14       -14             # Z3SS   -->  Z2SS   NUM    ANUM        
      1.98929477E-08    3      1000023        16       -16             # Z3SS   -->  Z2SS   NUT    ANUT        
      9.80442110E-03    2      1000022        25                       # Z3SS   -->  Z1SS   HL0                
      1.20423213E-02    2      1000023        25                       # Z3SS   -->  Z2SS   HL0                
#         PDG         Width
DECAY   1000035  4.86545372E+00   # Z4SS  decays
#          BR          NDA       ID1       ID2       ID3       ID4
      8.81249207E-07    2      1000022        22                       # Z4SS   -->  Z1SS   GM                 
      2.30608748E-07    2      1000023        22                       # Z4SS   -->  Z2SS   GM                 
      4.92056784E-10    2      1000025        22                       # Z4SS   -->  Z3SS   GM                 
      3.19745094E-01    2      1000024       -24                       # Z4SS   -->  W1SS+  W-                 
      3.19745094E-01    2     -1000024        24                       # Z4SS   -->  W1SS-  W+                 
      7.11717447E-12    3     -1000037         2        -1             # Z4SS   -->  W2SS-  UP     DB          
      2.37239156E-12    3     -1000037        12       -11             # Z4SS   -->  W2SS-  NUE    E+          
      2.37239156E-12    3     -1000037        14       -13             # Z4SS   -->  W2SS-  NUM    MU+         
      7.11717447E-12    3      1000037         1        -2             # Z4SS   -->  W2SS+  DN     UB          
      2.37239156E-12    3      1000037        11       -12             # Z4SS   -->  W2SS+  E-     ANUE        
      2.37239156E-12    3      1000037        13       -14             # Z4SS   -->  W2SS+  MU-    ANUM        
      1.01520512E-02    2      1000022        23                       # Z4SS   -->  Z1SS   Z0                 
      1.31901186E-02    2      1000023        23                       # Z4SS   -->  Z2SS   Z0                 
      7.57882219E-08    3      1000022         2        -2             # Z4SS   -->  Z1SS   UP     UB          
      6.75109462E-08    3      1000022         1        -1             # Z4SS   -->  Z1SS   DN     DB          
      6.75109462E-08    3      1000022         3        -3             # Z4SS   -->  Z1SS   ST     SB          
      7.57878666E-08    3      1000022         4        -4             # Z4SS   -->  Z1SS   CH     CB          
      1.80703950E-07    3      1000022         5        -5             # Z4SS   -->  Z1SS   BT     BB          
      5.71624525E-07    3      1000022        11       -11             # Z4SS   -->  Z1SS   E-     E+          
      5.71624525E-07    3      1000022        13       -13             # Z4SS   -->  Z1SS   MU-    MU+         
      7.08551170E-07    3      1000022        15       -15             # Z4SS   -->  Z1SS   TAU-   TAU+        
      7.06439096E-07    3      1000022        12       -12             # Z4SS   -->  Z1SS   NUE    ANUE        
      7.06439096E-07    3      1000022        14       -14             # Z4SS   -->  Z1SS   NUM    ANUM        
      7.07993593E-07    3      1000022        16       -16             # Z4SS   -->  Z1SS   NUT    ANUT        
      4.90599177E-07    3      1000023         2        -2             # Z4SS   -->  Z2SS   UP     UB          
      6.24803079E-07    3      1000023         1        -1             # Z4SS   -->  Z2SS   DN     DB          
      6.24803079E-07    3      1000023         3        -3             # Z4SS   -->  Z2SS   ST     SB          
      4.90596904E-07    3      1000023         4        -4             # Z4SS   -->  Z2SS   CH     CB          
      1.48643460E-06    3      1000023         5        -5             # Z4SS   -->  Z2SS   BT     BB          
      4.52203096E-07    3      1000023        11       -11             # Z4SS   -->  Z2SS   E-     E+          
      4.52203096E-07    3      1000023        13       -13             # Z4SS   -->  Z2SS   MU-    MU+         
      4.88810599E-07    3      1000023        15       -15             # Z4SS   -->  Z2SS   TAU-   TAU+        
      1.00924933E-06    3      1000023        12       -12             # Z4SS   -->  Z2SS   NUE    ANUE        
      1.00924933E-06    3      1000023        14       -14             # Z4SS   -->  Z2SS   NUM    ANUM        
      1.01160344E-06    3      1000023        16       -16             # Z4SS   -->  Z2SS   NUT    ANUT        
      3.47262201E-08    3      1000025         2        -2             # Z4SS   -->  Z3SS   UP     UB          
      4.47974919E-08    3      1000025         1        -1             # Z4SS   -->  Z3SS   DN     DB          
      4.47974919E-08    3      1000025         3        -3             # Z4SS   -->  Z3SS   ST     SB          
      3.47262201E-08    3      1000025         4        -4             # Z4SS   -->  Z3SS   CH     CB          
      1.63949903E-08    3      1000025         5        -5             # Z4SS   -->  Z3SS   BT     BB          
      1.01635083E-08    3      1000025        11       -11             # Z4SS   -->  Z3SS   E-     E+          
      1.01635083E-08    3      1000025        13       -13             # Z4SS   -->  Z3SS   MU-    MU+         
      8.80034534E-09    3      1000025        15       -15             # Z4SS   -->  Z3SS   TAU-   TAU+        
      2.02015364E-08    3      1000025        12       -12             # Z4SS   -->  Z3SS   NUE    ANUE        
      2.02015364E-08    3      1000025        14       -14             # Z4SS   -->  Z3SS   NUM    ANUM        
      2.02015116E-08    3      1000025        16       -16             # Z4SS   -->  Z3SS   NUT    ANUT        
      8.56935456E-02    2      1000022        25                       # Z4SS   -->  Z1SS   HL0                
      2.51460165E-01    2      1000023        25                       # Z4SS   -->  Z2SS   HL0                
#         PDG         Width
DECAY   1000024  6.02817163E-03   # W1SS+ decays
#          BR          NDA       ID1       ID2       ID3       ID4
      2.22331937E-06    3      1000022         2        -1             # W1SS+  -->  Z1SS   UP     DB          
      2.22331596E-06    3      1000022         4        -3             # W1SS+  -->  Z1SS   CH     SB          
      1.87962287E-05    3      1000022       -11        12             # W1SS+  -->  Z1SS   E+     NUE         
      1.87962287E-05    3      1000022       -13        14             # W1SS+  -->  Z1SS   MU+    NUM         
      1.88509111E-05    3      1000022       -15        16             # W1SS+  -->  Z1SS   TAU+   NUT         
      9.99939144E-01    2      1000022        24                       # W1SS+  -->  Z1SS   W+                 
#         PDG         Width
DECAY   1000037  4.86484146E+00   # W2SS+ decays
#          BR          NDA       ID1       ID2       ID3       ID4
      8.71125820E-08    3      1000022         2        -1             # W2SS+  -->  Z1SS   UP     DB          
      8.71125039E-08    3      1000022         4        -3             # W2SS+  -->  Z1SS   CH     SB          
      7.73763873E-07    3      1000022       -11        12             # W2SS+  -->  Z1SS   E+     NUE         
      7.73763873E-07    3      1000022       -13        14             # W2SS+  -->  Z1SS   MU+    NUM         
      9.15917667E-07    3      1000022       -15        16             # W2SS+  -->  Z1SS   TAU+   NUT         
      7.12237656E-02    2      1000022        24                       # W2SS+  -->  Z1SS   W+                 
      5.05724245E-07    3      1000023         2        -1             # W2SS+  -->  Z2SS   UP     DB          
      5.05723733E-07    3      1000023         4        -3             # W2SS+  -->  Z2SS   CH     SB          
      7.15535009E-07    3      1000023       -11        12             # W2SS+  -->  Z2SS   E+     NUE         
      7.15535009E-07    3      1000023       -13        14             # W2SS+  -->  Z2SS   MU+    NUM         
      7.49788910E-07    3      1000023       -15        16             # W2SS+  -->  Z2SS   TAU+   NUT         
      3.32066476E-01    2      1000023        24                       # W2SS+  -->  Z2SS   W+                 
      5.71594754E-08    3      1000025         2        -1             # W2SS+  -->  Z3SS   UP     DB          
      5.71594754E-08    3      1000025         4        -3             # W2SS+  -->  Z3SS   CH     SB          
      1.90509422E-08    3      1000025       -11        12             # W2SS+  -->  Z3SS   E+     NUE         
      1.90509422E-08    3      1000025       -13        14             # W2SS+  -->  Z3SS   MU+    NUM         
      1.90521003E-08    3      1000025       -15        16             # W2SS+  -->  Z3SS   TAU+   NUT         
      3.12303483E-01    2      1000024        23                       # W2SS+  -->  W1SS+  Z0                 
      5.13326597E-07    3      1000024         1        -1             # W2SS+  -->  W1SS+  DN     DB          
      5.13324153E-07    3      1000024         3        -3             # W2SS+  -->  W1SS+  ST     SB          
      1.10041367E-06    3      1000024         2        -2             # W2SS+  -->  W1SS+  UP     UB          
      1.10041367E-06    3      1000024         4        -4             # W2SS+  -->  W1SS+  CH     CB          
      1.41802707E-06    3      1000024        12       -12             # W2SS+  -->  W1SS+  NUE    ANUE        
      1.41802707E-06    3      1000024        14       -14             # W2SS+  -->  W1SS+  NUM    ANUM        
      1.65644110E-06    3      1000024        16       -16             # W2SS+  -->  W1SS+  NUT    ANUT        
      6.70956354E-07    3      1000024        11       -11             # W2SS+  -->  W1SS+  E-     E+          
      6.70956354E-07    3      1000024        13       -13             # W2SS+  -->  W1SS+  MU-    MU+         
      6.72549049E-07    3      1000024        15       -15             # W2SS+  -->  W1SS+  TAU-   TAU+        
      2.84390569E-01    2      1000024        25                       # W2SS+  -->  W1SS+  HL0                
#         PDG         Width
DECAY        25  3.43145314E-03   # HL0   decays
#          BR          NDA       ID1       ID2       ID3       ID4
      5.07331421E-09    2           11       -11                       # HL0    -->  E-     E+                 
      2.14203072E-04    2           13       -13                       # HL0    -->  MU-    MU+                
      6.12342507E-02    2           15       -15                       # HL0    -->  TAU-   TAU+               
      6.38165557E-06    2            1        -1                       # HL0    -->  DN     DB                 
      2.57850741E-03    2            3        -3                       # HL0    -->  ST     SB                 
      8.62641037E-01    2            5        -5                       # HL0    -->  BT     BB                 
      1.97839518E-06    2            2        -2                       # HL0    -->  UP     UB                 
      3.80849540E-02    2            4        -4                       # HL0    -->  CH     CB                 
      1.30136590E-03    2           22        22                       # HL0    -->  GM     GM                 
      3.00242677E-02    2           21        21                       # HL0    -->  GL     GL                 
      2.17391338E-04    3           24        11       -12             # HL0    -->  W+     E-     ANUE        
      2.17391338E-04    3           24        13       -14             # HL0    -->  W+     MU-    ANUM        
      2.17391338E-04    3           24        15       -16             # HL0    -->  W+     TAU-   ANUT        
      6.52174000E-04    3           24        -2         1             # HL0    -->  W+     UB     DN          
      6.52174000E-04    3           24        -4         3             # HL0    -->  W+     CB     ST          
      2.17391338E-04    3          -24       -11        12             # HL0    -->  W-     E+     NUE         
      2.17391338E-04    3          -24       -13        14             # HL0    -->  W-     MU+    NUM         
      2.17391338E-04    3          -24       -15        16             # HL0    -->  W-     TAU+   NUT         
      6.52174000E-04    3          -24         2        -1             # HL0    -->  W-     UP     DB          
      6.52174000E-04    3          -24         4        -3             # HL0    -->  W-     CH     SB          
#         PDG         Width
DECAY        35  1.17917309E+01   # HH0   decays
#          BR          NDA       ID1       ID2       ID3       ID4
      1.34293077E-10    2           11       -11                       # HH0    -->  E-     E+                 
      5.67009556E-06    2           13       -13                       # HH0    -->  MU-    MU+                
      1.62397395E-03    2           15       -15                       # HH0    -->  TAU-   TAU+               
      1.64467068E-07    2            1        -1                       # HH0    -->  DN     DB                 
      6.64530235E-05    2            3        -3                       # HH0    -->  ST     SB                 
      9.47175827E-03    2            5        -5                       # HH0    -->  BT     BB                 
      6.70541789E-10    2            2        -2                       # HH0    -->  UP     UB                 
      9.40845894E-06    2            4        -4                       # HH0    -->  CH     CB                 
      4.33394849E-01    2            6        -6                       # HH0    -->  TP     TB                 
      3.74045908E-06    2           22        22                       # HH0    -->  GM     GM                 
      3.05171619E-04    2           21        21                       # HH0    -->  GL     GL                 
      6.78994576E-04    2           24       -24                       # HH0    -->  W+     W-                 
      3.44964821E-04    2           23        23                       # HH0    -->  Z0     Z0                 
      1.03853992E-03    2      1000022   1000022                       # HH0    -->  Z1SS   Z1SS               
      5.51698450E-03    2      1000022   1000023                       # HH0    -->  Z1SS   Z2SS               
      5.36368415E-02    2      1000022   1000025                       # HH0    -->  Z1SS   Z3SS               
      6.68034842E-03    2      1000022   1000035                       # HH0    -->  Z1SS   Z4SS               
      6.97851228E-03    2      1000023   1000023                       # HH0    -->  Z2SS   Z2SS               
      1.34944260E-01    2      1000023   1000025                       # HH0    -->  Z2SS   Z3SS               
      1.01313367E-02    2      1000023   1000035                       # HH0    -->  Z2SS   Z4SS               
      1.58863198E-02    2      1000024  -1000024                       # HH0    -->  W1SS+  W1SS-              
      1.58614054E-01    2      1000024  -1000037                       # HH0    -->  W1SS+  W2SS-              
      1.58614054E-01    2     -1000024   1000037                       # HH0    -->  W1SS-  W2SS+              
      2.05360213E-03    2           25        25                       # HH0    -->  HL0    HL0                
#         PDG         Width
DECAY        36  1.18057232E+01   # HA0   decays
#          BR          NDA       ID1       ID2       ID3       ID4
      1.33485362E-10    2           11       -11                       # HA0    -->  E-     E+                 
      5.63599224E-06    2           13       -13                       # HA0    -->  MU-    MU+                
      1.61422510E-03    2           15       -15                       # HA0    -->  TAU-   TAU+               
      1.63488721E-07    2            1        -1                       # HA0    -->  DN     DB                 
      6.60577207E-05    2            3        -3                       # HA0    -->  ST     SB                 
      9.41580813E-03    2            5        -5                       # HA0    -->  BT     BB                 
      6.45815734E-10    2            2        -2                       # HA0    -->  UP     UB                 
      9.07013418E-06    2            4        -4                       # HA0    -->  CH     CB                 
      4.60723311E-01    2            6        -6                       # HA0    -->  TP     TB                 
      7.37317748E-07    2           22        22                       # HA0    -->  GM     GM                 
      3.07597016E-04    2           21        21                       # HA0    -->  GL     GL                 
      2.20267824E-03    2      1000022   1000022                       # HA0    -->  Z1SS   Z1SS               
      1.38483588E-02    2      1000022   1000023                       # HA0    -->  Z1SS   Z2SS               
      8.29262193E-03    2      1000022   1000025                       # HA0    -->  Z1SS   Z3SS               
      4.37265821E-02    2      1000022   1000035                       # HA0    -->  Z1SS   Z4SS               
      2.15764213E-02    2      1000023   1000023                       # HA0    -->  Z2SS   Z2SS               
      1.29594021E-02    2      1000023   1000025                       # HA0    -->  Z2SS   Z3SS               
      1.06446311E-01    2      1000023   1000035                       # HA0    -->  Z2SS   Z4SS               
      4.89372686E-02    2      1000024  -1000024                       # HA0    -->  W1SS+  W1SS-              
      1.34603962E-01    2      1000024  -1000037                       # HA0    -->  W1SS+  W2SS-              
      1.34603962E-01    2     -1000024   1000037                       # HA0    -->  W1SS-  W2SS+              
      6.59803918E-04    2           25        23                       # HA0    -->  HL0    Z0                 
#         PDG         Width
DECAY        37  1.15129890E+01   # H+    decays
#          BR          NDA       ID1       ID2       ID3       ID4
      1.38179482E-10    2           12       -11                       # H+     -->  NUE    E+                 
      5.83418705E-06    2           14       -13                       # H+     -->  NUM    MU+                
      1.67099084E-03    2           16       -15                       # H+     -->  NUT    TAU+               
      1.56208841E-07    2            2        -1                       # H+     -->  UP     DB                 
      7.14902053E-05    2            4        -3                       # H+     -->  CH     SB                 
      4.37500834E-01    2            6        -5                       # H+     -->  TP     BB                 
      1.79804880E-02    2      1000024   1000022                       # H+     -->  W1SS+  Z1SS               
      6.11014693E-05    2      1000024   1000023                       # H+     -->  W1SS+  Z2SS               
      1.66215837E-01    2      1000024   1000025                       # H+     -->  W1SS+  Z3SS               
      1.58588395E-01    2      1000024   1000035                       # H+     -->  W1SS+  Z4SS               
      3.93681675E-02    2      1000037   1000022                       # H+     -->  W2SS+  Z1SS               
      1.77845418E-01    2      1000037   1000023                       # H+     -->  W2SS+  Z2SS               
      6.91311085E-04    2           25        24                       # H+     -->  HL0    W+                 
