#  ISAJET SUSY parameters in SUSY Les Houches Accord 2 format
#  Created by ISALHA 2.0 Last revision: C. Balazs 21 Apr 2009
Block SPINFO   # Program information
     1   ISASUGRA from ISAJET          # Spectrum Calculator
     2   7.80   29-OCT-2009 12:50:36   # Version number
Block MODSEL   # Model selection
     1     1   # Minimal supergravity (mSUGRA) model               
Block SMINPUTS   # Standard Model inputs
     1     1.27844124E+02   # alpha_em^(-1)
     2     1.16570000E-05   # G_Fermi
     3     1.17200002E-01   # alpha_s(M_Z)
     4     9.11699982E+01   # m_{Z}(pole)
     5     4.19999981E+00   # m_{b}(m_{b})
     6     1.72500000E+02   # m_{top}(pole)
     7     1.77699995E+00   # m_{tau}(pole)
Block MINPAR   # SUSY breaking input parameters
     1     2.80000000E+02   # m_0
     2     2.50000000E+02   # m_{1/2}
     3     4.00000000E+01   # tan(beta)
     4     1.00000000E+00   # sign(mu)
     5    -5.00000000E+02   # A_0
Block EXTPAR   # Non-universal SUSY breaking parameters
     0     2.27620725E+16   # Input scale
Block MASS   # Scalar and gaugino mass spectrum
#  PDG code   mass                 particle
        24     8.04229965E+01   #  W^+
        25     1.13366882E+02   #  h^0            
        35     3.72538757E+02   #  H^0            
        36     3.70364594E+02   #  A^0            
        37     3.82603180E+02   #  H^+            
   1000001     6.28444092E+02   #  dnl            
   1000002     6.23023804E+02   #  upl            
   1000003     6.28444092E+02   #  stl            
   1000004     6.23025391E+02   #  chl            
   1000005     4.85381866E+02   #  b1             
   1000006     3.60569427E+02   #  t1             
   1000011     3.30190491E+02   #  el-            
   1000012     3.19773834E+02   #  nuel           
   1000013     3.30190521E+02   #  mul-           
   1000014     3.19773834E+02   #  numl           
   1000015     1.33425949E+02   #  tau1           
   1000016     2.74280579E+02   #  nutl           
   1000021     6.17263062E+02   #  glss           
   1000022     1.00251038E+02   #  z1ss           
   1000023     1.90123932E+02   #  z2ss           
   1000024     1.90379898E+02   #  w1ss           
   1000025    -4.23984100E+02   #  z3ss           
   1000035     4.36526062E+02   #  z4ss           
   1000037     4.36229095E+02   #  w2ss           
   2000001     6.08307129E+02   #  dnr            
   2000002     6.08482788E+02   #  upr            
   2000003     6.08307190E+02   #  str            
   2000004     6.08484436E+02   #  chr            
   2000005     5.63043762E+02   #  b2             
   2000006     5.84730774E+02   #  t2             
   2000011     2.97911438E+02   #  er-            
   2000013     2.97911469E+02   #  mur-           
   2000015     3.11902313E+02   #  tau2           
Block ALPHA   # Effective Higgs mixing parameter
         -2.50213295E-02   # alpha
Block STOPMIX   # stop mixing matrix
  1  1     5.62925041E-01   # O_{11}
  1  2     8.26507926E-01   # O_{12}
  2  1    -8.26507926E-01   # O_{21}
  2  2     5.62925041E-01   # O_{22}
Block SBOTMIX   # sbottom mixing matrix
  1  1     7.98756123E-01   # O_{11}
  1  2     6.01654947E-01   # O_{12}
  2  1    -6.01654947E-01   # O_{21}
  2  2     7.98756123E-01   # O_{22}
Block STAUMIX   # stau mixing matrix
  1  1     4.43595797E-01   # O_{11}
  1  2     8.96226943E-01   # O_{12}
  2  1    -8.96226943E-01   # O_{21}
  2  2     4.43595797E-01   # O_{22}
Block NMIX   # neutralino mixing matrix
  1  1     9.92602944E-01   #
  1  2    -2.56277900E-02   #
  1  3     1.14946924E-01   #
  1  4    -2.94903480E-02   #
  2  1    -5.38741127E-02   #
  2  2    -9.67754126E-01   #
  2  3     2.22488701E-01   #
  2  4    -1.05112389E-01   #
  3  1    -5.75689301E-02   #
  3  2     8.67899358E-02   #
  3  3     6.98193550E-01   #
  3  4     7.08292902E-01   #
  4  1    -9.23182070E-02   #
  4  2     2.35080764E-01   #
  4  3     6.70679808E-01   #
  4  4    -6.97425902E-01   #
Block UMIX   # chargino U mixing matrix
  1  1    -9.48138952E-01   # U_{11}
  1  2     3.17856163E-01   # U_{12}
  2  1    -3.17856163E-01   # U_{21}
  2  2    -9.48138952E-01   # U_{22}
Block VMIX   # chargino V mixing matrix
  1  1    -9.88361001E-01   # V_{11}
  1  2     1.52126819E-01   # V_{12}
  2  1    -1.52126819E-01   # V_{21}
  2  2    -9.88361001E-01   # V_{22}
Block GAUGE Q=  4.46628082E+02   #
     1     3.57491702E-01   # g`
     2     6.52494133E-01   # g_2
     3     1.22113371E+00   # g_3
Block YU Q=  4.46628082E+02   #
  3  3     8.75791311E-01   # y_t
Block YD Q=  4.46628082E+02   #
  3  3     4.75168437E-01   # y_b
Block YE Q=  4.46628082E+02   #
  3  3     4.26525861E-01   # y_tau
Block HMIX Q=  4.46628082E+02   # Higgs mixing parameters
     1     4.19471466E+02   # mu(Q)
     2     4.00000000E+01   # tan(beta)(M_GUT)
     3     2.50254440E+02   # Higgs vev at Q
     4     1.37169938E+05   # m_A^2(Q)
Block MSOFT Q=  4.46628082E+02   # DRbar SUSY breaking parameters
     1     1.02502365E+02   # M_1(Q)          
     2     1.93722382E+02   # M_2(Q)          
     3     5.81979614E+02   # M_3(Q)          
    31     3.25829041E+02   # MeL(Q)          
    32     3.25829041E+02   # MmuL(Q)         
    33     2.81807404E+02   # MtauL(Q)        
    34     2.94414978E+02   # MeR(Q)          
    35     2.94414978E+02   # MmuR(Q)         
    36     1.81077942E+02   # MtauR(Q)        
    41     5.95462463E+02   # MqL1(Q)         
    42     5.95462463E+02   # MqL2(Q)         
    43     4.89354095E+02   # MqL3(Q)         
    44     5.79860901E+02   # MuR(Q)          
    45     5.79860901E+02   # McR(Q)          
    46     4.07632538E+02   # MtR(Q)          
    47     5.78025391E+02   # MdR(Q)          
    48     5.78025391E+02   # MsR(Q)          
    49     5.18608948E+02   # MbR(Q)          
Block AU Q=  4.46628082E+02   #
  1  1    -6.23178467E+02   # A_u
  2  2    -6.23178467E+02   # A_c
  3  3    -6.23178467E+02   # A_t
Block AD Q=  4.46628082E+02   #
  1  1    -9.46928894E+02   # A_d
  2  2    -9.46928894E+02   # A_s
  3  3    -9.46928894E+02   # A_b
Block AE Q=  4.46628082E+02   #
  1  1    -4.39552032E+02   # A_e
  2  2    -4.39552032E+02   # A_mu
  3  3    -4.39552032E+02   # A_tau
#  ISAJET decay tables in SUSY Les Houches accord format
#  Created by ISALHD. Last revision: C. Balazs, 2005 May 25
Block DCINFO                           # Program information
     1   ISASUGRA from ISAJET          # Spectrum Calculator
     2   7.80   29-OCT-2009 12:50:36   # Version number
#         PDG         Width
DECAY         6  1.14680779E+00   # TP    decays
#          BR          NDA       ID1       ID2       ID3       ID4
      3.33333343E-01    3            2        -1         5             # TP     -->  UP     DB     BT          
      3.33333343E-01    3            4        -3         5             # TP     -->  CH     SB     BT          
      1.11111112E-01    3          -11        12         5             # TP     -->  E+     NUE    BT          
      1.11111112E-01    3          -13        14         5             # TP     -->  MU+    NUM    BT          
      1.11111112E-01    3          -15        16         5             # TP     -->  TAU+   NUT    BT          
#         PDG         Width
DECAY   1000021  4.23131704E+00   # GLSS  decays
#          BR          NDA       ID1       ID2       ID3       ID4
      2.65855552E-03    3      1000024         1        -2             # GLSS   -->  W1SS+  DN     UB          
      2.65855552E-03    3     -1000024         2        -1             # GLSS   -->  W1SS-  UP     DB          
      2.65848916E-03    3      1000024         3        -4             # GLSS   -->  W1SS+  ST     CB          
      2.65848916E-03    3     -1000024         4        -3             # GLSS   -->  W1SS-  CH     SB          
      2.69824814E-04    3      1000024         5        -6             # GLSS   -->  W1SS+  BT     TB          
      2.69824814E-04    3     -1000024         6        -5             # GLSS   -->  W1SS-  TP     BB          
      1.94978056E-05    3      1000037         1        -2             # GLSS   -->  W2SS+  DN     UB          
      1.94978056E-05    3     -1000037         2        -1             # GLSS   -->  W2SS-  UP     DB          
      1.94974382E-05    3      1000037         3        -4             # GLSS   -->  W2SS+  ST     CB          
      1.94974382E-05    3     -1000037         4        -3             # GLSS   -->  W2SS-  CH     SB          
      7.08204384E-09    3      1000037         5        -6             # GLSS   -->  W2SS+  BT     TB          
      7.08204384E-09    3     -1000037         6        -5             # GLSS   -->  W2SS-  TP     BB          
      1.09157020E-06    2      1000022        21                       # GLSS   -->  Z1SS   GL                 
      4.65219091E-05    3      1000022         2        -2             # GLSS   -->  Z1SS   UP     UB          
      7.17576986E-05    3      1000022         1        -1             # GLSS   -->  Z1SS   DN     DB          
      7.17576986E-05    3      1000022         3        -3             # GLSS   -->  Z1SS   ST     SB          
      4.65198646E-05    3      1000022         4        -4             # GLSS   -->  Z1SS   CH     CB          
      4.25644030E-05    3      1000022         6        -6             # GLSS   -->  Z1SS   TP     TB          
      4.53435041E-06    2      1000023        21                       # GLSS   -->  Z2SS   GL                 
      1.80324307E-03    3      1000023         2        -2             # GLSS   -->  Z2SS   UP     UB          
      1.51230232E-03    3      1000023         1        -1             # GLSS   -->  Z2SS   DN     DB          
      1.51230232E-03    3      1000023         3        -3             # GLSS   -->  Z2SS   ST     SB          
      1.80316274E-03    3      1000023         4        -4             # GLSS   -->  Z2SS   CH     CB          
      5.79003645E-05    3      1000023         6        -6             # GLSS   -->  Z2SS   TP     TB          
      2.02846040E-05    2      1000025        21                       # GLSS   -->  Z3SS   GL                 
      8.16791726E-06    3      1000025         2        -2             # GLSS   -->  Z3SS   UP     UB          
      1.12827265E-05    3      1000025         1        -1             # GLSS   -->  Z3SS   DN     DB          
      1.12827265E-05    3      1000025         3        -3             # GLSS   -->  Z3SS   ST     SB          
      8.16747252E-06    3      1000025         4        -4             # GLSS   -->  Z3SS   CH     CB          
      1.14034056E-05    2      1000035        21                       # GLSS   -->  Z4SS   GL                 
      6.40600338E-05    3      1000035         2        -2             # GLSS   -->  Z4SS   UP     UB          
      7.20977332E-05    3      1000035         1        -1             # GLSS   -->  Z4SS   DN     DB          
      7.20977332E-05    3      1000035         3        -3             # GLSS   -->  Z4SS   ST     SB          
      6.40564467E-05    3      1000035         4        -4             # GLSS   -->  Z4SS   CH     CB          
      1.40990957E-03    2     -2000002         2                       # GLSS   -->  UBR    UP                 
      1.40990957E-03    2      2000002        -2                       # GLSS   -->  UPR    UB                 
      1.46646868E-03    2     -2000001         1                       # GLSS   -->  DBR    DN                 
      1.46646868E-03    2      2000001        -1                       # GLSS   -->  DNR    DB                 
      1.46609452E-03    2     -2000003         3                       # GLSS   -->  SBR    ST                 
      1.46609452E-03    2      2000003        -3                       # GLSS   -->  STR    SB                 
      1.39285636E-03    2     -2000004         4                       # GLSS   -->  CBR    CH                 
      1.39285636E-03    2      2000004        -4                       # GLSS   -->  CHR    CB                 
      2.46764496E-01    2     -1000005         5                       # GLSS   -->  BB1    BT                 
      2.46764496E-01    2      1000005        -5                       # GLSS   -->  BT1    BB                 
      5.42591028E-02    2     -2000005         5                       # GLSS   -->  BB2    BT                 
      5.42591028E-02    2      2000005        -5                       # GLSS   -->  BT2    BB                 
      1.83956861E-01    2     -1000006         6                       # GLSS   -->  TB1    TP                 
      1.83956861E-01    2      1000006        -6                       # GLSS   -->  TP1    TB                 
#         PDG         Width
DECAY   1000002  6.41547298E+00   # UPL   decays
#          BR          NDA       ID1       ID2       ID3       ID4
      9.46668163E-03    2      1000022         2                       # UPL    -->  Z1SS   UP                 
      3.21312219E-01    2      1000023         2                       # UPL    -->  Z2SS   UP                 
      6.84932398E-04    2      1000025         2                       # UPL    -->  Z3SS   UP                 
      5.04242210E-03    2      1000035         2                       # UPL    -->  Z4SS   UP                 
      2.12364946E-03    2      1000021         2                       # UPL    -->  GLSS   UP                 
      6.56453788E-01    2      1000024         1                       # UPL    -->  W1SS+  DN                 
      4.91631171E-03    2      1000037         1                       # UPL    -->  W2SS+  DN                 
#         PDG         Width
DECAY   1000001  6.28094816E+00   # DNL   decays
#          BR          NDA       ID1       ID2       ID3       ID4
      1.72192715E-02    2      1000022         1                       # DNL    -->  Z1SS   DN                 
      3.18937212E-01    2      1000023         1                       # DNL    -->  Z2SS   DN                 
      1.18452485E-03    2      1000025         1                       # DNL    -->  Z3SS   DN                 
      7.16265664E-03    2      1000035         1                       # DNL    -->  Z4SS   DN                 
      8.02395679E-03    2      1000021         1                       # DNL    -->  GLSS   DN                 
      6.24622405E-01    2     -1000024         2                       # DNL    -->  W1SS-  UP                 
      2.28499565E-02    2     -1000037         2                       # DNL    -->  W2SS-  UP                 
#         PDG         Width
DECAY   1000003  6.28089952E+00   # STL   decays
#          BR          NDA       ID1       ID2       ID3       ID4
      1.72194038E-02    2      1000022         3                       # STL    -->  Z1SS   ST                 
      3.18939686E-01    2      1000023         3                       # STL    -->  Z2SS   ST                 
      1.18453405E-03    2      1000025         3                       # STL    -->  Z3SS   ST                 
      7.16271205E-03    2      1000035         3                       # STL    -->  Z4SS   ST                 
      8.02401919E-03    2      1000021         3                       # STL    -->  GLSS   ST                 
      6.24620259E-01    2     -1000024         4                       # STL    -->  W1SS-  CH                 
      2.28493493E-02    2     -1000037         4                       # STL    -->  W2SS-  CH                 
#         PDG         Width
DECAY   1000004  6.41509581E+00   # CHL   decays
#          BR          NDA       ID1       ID2       ID3       ID4
      9.46717151E-03    2      1000022         4                       # CHL    -->  Z1SS   CH                 
      3.21328640E-01    2      1000023         4                       # CHL    -->  Z2SS   CH                 
      6.84958010E-04    2      1000025         4                       # CHL    -->  Z3SS   CH                 
      5.04259765E-03    2      1000035         4                       # CHL    -->  Z4SS   CH                 
      2.06525391E-03    2      1000021         4                       # CHL    -->  GLSS   CH                 
      6.56494737E-01    2      1000024         3                       # CHL    -->  W1SS+  ST                 
      4.91666235E-03    2      1000037         3                       # CHL    -->  W2SS+  ST                 
#         PDG         Width
DECAY   1000005  3.60239029E+00   # BT1   decays
#          BR          NDA       ID1       ID2       ID3       ID4
      8.01600516E-02    2      1000022         5                       # BT1    -->  Z1SS   BT                 
      3.42781693E-01    2      1000023         5                       # BT1    -->  Z2SS   BT                 
      1.51620405E-02    2      1000025         5                       # BT1    -->  Z3SS   BT                 
      6.39645942E-03    2      1000035         5                       # BT1    -->  Z4SS   BT                 
      3.89632881E-01    2     -1000024         6                       # BT1    -->  W1SS-  TP                 
      1.65866807E-01    2          -24   1000006                       # BT1    -->  W-     TP1                
#         PDG         Width
DECAY   1000006  1.13320470E+00   # TP1   decays
#          BR          NDA       ID1       ID2       ID3       ID4
      2.51407862E-01    2      1000022         6                       # TP1    -->  Z1SS   TP                 
      7.48592079E-01    2      1000024         5                       # TP1    -->  W1SS+  BT                 
#         PDG         Width
DECAY   2000002  1.28988147E+00   # UPR   decays
#          BR          NDA       ID1       ID2       ID3       ID4
      9.94403481E-01    2      1000022         2                       # UPR    -->  Z1SS   UP                 
      2.52026203E-03    2      1000023         2                       # UPR    -->  Z2SS   UP                 
      9.35484713E-04    2      1000025         2                       # UPR    -->  Z3SS   UP                 
      2.14079279E-03    2      1000035         2                       # UPR    -->  Z4SS   UP                 
#         PDG         Width
DECAY   2000001  3.22365671E-01   # DNR   decays
#          BR          NDA       ID1       ID2       ID3       ID4
      9.94407237E-01    2      1000022         1                       # DNR    -->  Z1SS   DN                 
      2.52003758E-03    2      1000023         1                       # DNR    -->  Z2SS   DN                 
      9.34498850E-04    2      1000025         1                       # DNR    -->  Z3SS   DN                 
      2.13824771E-03    2      1000035         1                       # DNR    -->  Z4SS   DN                 
#         PDG         Width
DECAY   2000003  3.22365701E-01   # STR   decays
#          BR          NDA       ID1       ID2       ID3       ID4
      9.94407237E-01    2      1000022         3                       # STR    -->  Z1SS   ST                 
      2.52003758E-03    2      1000023         3                       # STR    -->  Z2SS   ST                 
      9.34499083E-04    2      1000025         3                       # STR    -->  Z3SS   ST                 
      2.13824888E-03    2      1000035         3                       # STR    -->  Z4SS   ST                 
#         PDG         Width
DECAY   2000004  1.28987157E+00   # CHR   decays
#          BR          NDA       ID1       ID2       ID3       ID4
      9.94403541E-01    2      1000022         4                       # CHR    -->  Z1SS   CH                 
      2.52026040E-03    2      1000023         4                       # CHR    -->  Z2SS   CH                 
      9.35469114E-04    2      1000025         4                       # CHR    -->  Z3SS   CH                 
      2.14075041E-03    2      1000035         4                       # CHR    -->  Z4SS   CH                 
#         PDG         Width
DECAY   2000005  3.45741987E+00   # BT2   decays
#          BR          NDA       ID1       ID2       ID3       ID4
      3.13750617E-02    2      1000022         5                       # BT2    -->  Z1SS   BT                 
      9.51425731E-02    2      1000023         5                       # BT2    -->  Z2SS   BT                 
      7.59453699E-02    2      1000025         5                       # BT2    -->  Z3SS   BT                 
      7.83691779E-02    2      1000035         5                       # BT2    -->  Z4SS   BT                 
      1.14608750E-01    2     -1000024         6                       # BT2    -->  W1SS-  TP                 
      6.04559064E-01    2          -24   1000006                       # BT2    -->  W-     TP1                
#         PDG         Width
DECAY   2000006  7.55076170E+00   # TP2   decays
#          BR          NDA       ID1       ID2       ID3       ID4
      2.75616914E-01    2      1000024         5                       # TP2    -->  W1SS+  BT                 
      1.42397821E-01    2      1000037         5                       # TP2    -->  W2SS+  BT                 
      3.38189900E-01    2           23   1000006                       # TP2    -->  Z0     TP1                
      6.74548522E-02    2           25   1000006                       # TP2    -->  HL0    TP1                
      4.53086607E-02    2           24   1000005                       # TP2    -->  W+     BT1                
      3.65348570E-02    2      1000022         6                       # TP2    -->  Z1SS   TP                 
      9.44970101E-02    2      1000023         6                       # TP2    -->  Z2SS   TP                 
#         PDG         Width
DECAY   1000011  2.04101801E+00   # EL-   decays
#          BR          NDA       ID1       ID2       ID3       ID4
      1.51709497E-01    2      1000022        11                       # EL-    -->  Z1SS   E-                 
      3.02677393E-01    2      1000023        11                       # EL-    -->  Z2SS   E-                 
      5.45612872E-01    2     -1000024        12                       # EL-    -->  W1SS-  NUE                
      1.38008886E-07    3      1000015        11       -15             # EL-    -->  TAU1-  E-     TAU+        
      1.07183297E-07    3     -1000015        11        15             # EL-    -->  TAU1+  E-     TAU-        
#         PDG         Width
DECAY   1000013  2.04101825E+00   # MUL-  decays
#          BR          NDA       ID1       ID2       ID3       ID4
      1.51709467E-01    2      1000022        13                       # MUL-   -->  Z1SS   MU-                
      3.02677363E-01    2      1000023        13                       # MUL-   -->  Z2SS   MU-                
      5.45612931E-01    2     -1000024        14                       # MUL-   -->  W1SS-  NUM                
      1.38008986E-07    3      1000015        13       -15             # MUL-   -->  TAU1-  MU-    TAU+        
      1.07183403E-07    3     -1000015        13        15             # MUL-   -->  TAU1+  MU-    TAU-        
#         PDG         Width
DECAY   1000015  1.15030222E-01   # TAU1- decays
#          BR          NDA       ID1       ID2       ID3       ID4
      1.00000000E+00    2      1000022        15                       # TAU1-  -->  Z1SS   TAU-               
#         PDG         Width
DECAY   1000012  1.94812047E+00   # NUEL  decays
#          BR          NDA       ID1       ID2       ID3       ID4
      1.83285356E-01    2      1000022        12                       # NUEL   -->  Z1SS   NUE                
      2.54165739E-01    2      1000023        12                       # NUEL   -->  Z2SS   NUE                
      5.62546849E-01    2      1000024        11                       # NUEL   -->  W1SS+  E-                 
      3.01758007E-07    3      1000015        12       -15             # NUEL   -->  TAU1-  NUE    TAU+        
      1.51168422E-07    3     -1000015        12        15             # NUEL   -->  TAU1+  NUE    TAU-        
      1.63141169E-06    3     -1000015        11        16             # NUEL   -->  TAU1+  E-     NUT         
#         PDG         Width
DECAY   1000014  1.94812000E+00   # NUML  decays
#          BR          NDA       ID1       ID2       ID3       ID4
      1.83285400E-01    2      1000022        14                       # NUML   -->  Z1SS   NUM                
      2.54165798E-01    2      1000023        14                       # NUML   -->  Z2SS   NUM                
      5.62546730E-01    2      1000024        13                       # NUML   -->  W1SS+  MU-                
      3.01758064E-07    3      1000015        14       -15             # NUML   -->  TAU1-  NUM    TAU+        
      1.51168464E-07    3     -1000015        14        15             # NUML   -->  TAU1+  NUM    TAU-        
      1.63681977E-06    3     -1000015        13        16             # NUML   -->  TAU1+  MU-    NUT         
#         PDG         Width
DECAY   1000016  1.79800737E+00   # NUTL  decays
#          BR          NDA       ID1       ID2       ID3       ID4
      1.57256767E-01    2      1000022        16                       # NUTL   -->  Z1SS   NUT                
      1.52526021E-01    2      1000023        16                       # NUTL   -->  Z2SS   NUT                
      3.49383801E-01    2      1000024        15                       # NUTL   -->  W1SS+  TAU-               
      3.40832800E-01    2           24   1000015                       # NUTL   -->  W+     TAU1-              
      5.44543411E-07    3     -1000015        16        15             # NUTL   -->  TAU1+  NUT    TAU-        
      4.75623629E-08    3      1000015        16       -15             # NUTL   -->  TAU1-  NUT    TAU+        
#         PDG         Width
DECAY   2000011  1.17549169E+00   # ER-   decays
#          BR          NDA       ID1       ID2       ID3       ID4
      9.98685598E-01    2      1000022        11                       # ER-    -->  Z1SS   E-                 
      1.31436938E-03    2      1000023        11                       # ER-    -->  Z2SS   E-                 
      9.99205252E-09    3      1000015        11       -15             # ER-    -->  TAU1-  E-     TAU+        
      4.31971685E-08    3     -1000015        11        15             # ER-    -->  TAU1+  E-     TAU-        
      8.05678596E-15    3      1000015        12       -16             # ER-    -->  TAU1-  NUE    ANUT        
#         PDG         Width
DECAY   2000013  1.17549157E+00   # MUR-  decays
#          BR          NDA       ID1       ID2       ID3       ID4
      9.98685598E-01    2      1000022        13                       # MUR-   -->  Z1SS   MU-                
      1.31436891E-03    2      1000023        13                       # MUR-   -->  Z2SS   MU-                
      9.99207472E-09    3      1000015        13       -15             # MUR-   -->  TAU1-  MU-    TAU+        
      4.31972147E-08    3     -1000015        13        15             # MUR-   -->  TAU1+  MU-    TAU-        
      3.41052048E-10    3      1000015        14       -16             # MUR-   -->  TAU1-  NUM    ANUT        
#         PDG         Width
DECAY   2000015  2.11012316E+00   # TAU2- decays
#          BR          NDA       ID1       ID2       ID3       ID4
      2.06420779E-01    2      1000022        15                       # TAU2-  -->  Z1SS   TAU-               
      1.68143526E-01    2      1000023        15                       # TAU2-  -->  Z2SS   TAU-               
      2.80743271E-01    2     -1000024        16                       # TAU2-  -->  W1SS-  NUT                
      2.43485674E-01    2           23   1000015                       # TAU2-  -->  Z0     TAU1-              
      1.01206757E-01    2           25   1000015                       # TAU2-  -->  HL0    TAU1-              
#         PDG         Width
DECAY   1000023  8.19573700E-02   # Z2SS  decays
#          BR          NDA       ID1       ID2       ID3       ID4
      1.13481306E-07    2      1000022        22                       # Z2SS   -->  Z1SS   GM                 
      8.52190424E-05    3      1000022         2        -2             # Z2SS   -->  Z1SS   UP     UB          
      1.10602246E-04    3      1000022         1        -1             # Z2SS   -->  Z1SS   DN     DB          
      1.10602246E-04    3      1000022         3        -3             # Z2SS   -->  Z1SS   ST     SB          
      8.52190133E-05    3      1000022         4        -4             # Z2SS   -->  Z1SS   CH     CB          
      1.20988298E-04    3      1000022         5        -5             # Z2SS   -->  Z1SS   BT     BB          
      1.44252208E-05    3      1000022        11       -11             # Z2SS   -->  Z1SS   E-     E+          
      1.44252281E-05    3      1000022        13       -13             # Z2SS   -->  Z1SS   MU-    MU+         
      1.52365283E-05    3      1000022        15       -15             # Z2SS   -->  Z1SS   TAU-   TAU+        
      2.41915441E-05    3      1000022        12       -12             # Z2SS   -->  Z1SS   NUE    ANUE        
      2.41915441E-05    3      1000022        14       -14             # Z2SS   -->  Z1SS   NUM    ANUM        
      2.23609150E-05    3      1000022        16       -16             # Z2SS   -->  Z1SS   NUT    ANUT        
      4.99686241E-01    2      1000015       -15                       # Z2SS   -->  TAU1-  TAU+               
      4.99686241E-01    2     -1000015        15                       # Z2SS   -->  TAU1+  TAU-               
#         PDG         Width
DECAY   1000025  3.02087593E+00   # Z3SS  decays
#          BR          NDA       ID1       ID2       ID3       ID4
      7.27935060E-07    2      1000022        22                       # Z3SS   -->  Z1SS   GM                 
      4.70268890E-09    2      1000023        22                       # Z3SS   -->  Z2SS   GM                 
      2.34541118E-01    2      1000024       -24                       # Z3SS   -->  W1SS+  W-                 
      2.34541118E-01    2     -1000024        24                       # Z3SS   -->  W1SS-  W+                 
      6.60623610E-02    2      1000022        23                       # Z3SS   -->  Z1SS   Z0                 
      1.80594712E-01    2      1000023        23                       # Z3SS   -->  Z2SS   Z0                 
      4.04843838E-08    3      1000022         2        -2             # Z3SS   -->  Z1SS   UP     UB          
      1.52252202E-08    3      1000022         1        -1             # Z3SS   -->  Z1SS   DN     DB          
      1.52252184E-08    3      1000022         3        -3             # Z3SS   -->  Z1SS   ST     SB          
      4.04837834E-08    3      1000022         4        -4             # Z3SS   -->  Z1SS   CH     CB          
      1.87241865E-04    3      1000022         5        -5             # Z3SS   -->  Z1SS   BT     BB          
      3.43145766E-05    3      1000022        15       -15             # Z3SS   -->  Z1SS   TAU-   TAU+        
      6.12591506E-08    3      1000023         2        -2             # Z3SS   -->  Z2SS   UP     UB          
      9.11827343E-08    3      1000023         1        -1             # Z3SS   -->  Z2SS   DN     DB          
      9.11827343E-08    3      1000023         3        -3             # Z3SS   -->  Z2SS   ST     SB          
      6.12582554E-08    3      1000023         4        -4             # Z3SS   -->  Z2SS   CH     CB          
      1.35646071E-04    3      1000023         5        -5             # Z3SS   -->  Z2SS   BT     BB          
      1.46979773E-05    3      1000023        15       -15             # Z3SS   -->  Z2SS   TAU-   TAU+        
      2.06950847E-02    2      1000022        25                       # Z3SS   -->  Z1SS   HL0                
      2.06285808E-02    2      1000023        25                       # Z3SS   -->  Z2SS   HL0                
      1.39111653E-04    2      1000011       -11                       # Z3SS   -->  EL-    E+                 
      1.39111653E-04    2     -1000011        11                       # Z3SS   -->  EL+    E-                 
      1.39111478E-04    2      1000013       -13                       # Z3SS   -->  MUL-   MU+                
      1.39111478E-04    2     -1000013        13                       # Z3SS   -->  MUL+   MU-                
      3.03217355E-04    2      2000011       -11                       # Z3SS   -->  ER-    E+                 
      3.03217355E-04    2     -2000011        11                       # Z3SS   -->  ER+    E-                 
      3.03217181E-04    2      2000013       -13                       # Z3SS   -->  MUR-   MU+                
      3.03217181E-04    2     -2000013        13                       # Z3SS   -->  MUR+   MU-                
      8.67701173E-02    2      1000015       -15                       # Z3SS   -->  TAU1-  TAU+               
      8.67701173E-02    2     -1000015        15                       # Z3SS   -->  TAU1+  TAU-               
      3.06857657E-02    2      2000015       -15                       # Z3SS   -->  TAU2-  TAU+               
      3.06857657E-02    2     -2000015        15                       # Z3SS   -->  TAU2+  TAU-               
      7.70221697E-04    2      1000012       -12                       # Z3SS   -->  NUEL   ANUE               
      7.70221697E-04    2     -1000012        12                       # Z3SS   -->  ANUEL  NUE                
      7.70221697E-04    2      1000014       -14                       # Z3SS   -->  NUML   ANUM               
      7.70221697E-04    2     -1000014        14                       # Z3SS   -->  ANUML  NUM                
      1.40099216E-03    2      1000016       -16                       # Z3SS   -->  NUTL   ANUT               
      1.40099216E-03    2     -1000016        16                       # Z3SS   -->  ANUTL  NUT                
#         PDG         Width
DECAY   1000035  3.22455573E+00   # Z4SS  decays
#          BR          NDA       ID1       ID2       ID3       ID4
      1.38356040E-06    2      1000022        22                       # Z4SS   -->  Z1SS   GM                 
      2.44264498E-07    2      1000023        22                       # Z4SS   -->  Z2SS   GM                 
      1.04071023E-10    2      1000025        22                       # Z4SS   -->  Z3SS   GM                 
      2.39171520E-01    2      1000024       -24                       # Z4SS   -->  W1SS+  W-                 
      2.39171520E-01    2     -1000024        24                       # Z4SS   -->  W1SS-  W+                 
      2.44054366E-02    2      1000022        23                       # Z4SS   -->  Z1SS   Z0                 
      2.98831183E-02    2      1000023        23                       # Z4SS   -->  Z2SS   Z0                 
      2.67966101E-07    3      1000022         2        -2             # Z4SS   -->  Z1SS   UP     UB          
      1.90855005E-07    3      1000022         1        -1             # Z4SS   -->  Z1SS   DN     DB          
      1.90854990E-07    3      1000022         3        -3             # Z4SS   -->  Z1SS   ST     SB          
      2.67962264E-07    3      1000022         4        -4             # Z4SS   -->  Z1SS   CH     CB          
      1.97519490E-04    3      1000022         5        -5             # Z4SS   -->  Z1SS   BT     BB          
      3.73724906E-05    3      1000022        15       -15             # Z4SS   -->  Z1SS   TAU-   TAU+        
      1.44209253E-06    3      1000023         2        -2             # Z4SS   -->  Z2SS   UP     UB          
      1.75965818E-06    3      1000023         1        -1             # Z4SS   -->  Z2SS   DN     DB          
      1.75965818E-06    3      1000023         3        -3             # Z4SS   -->  Z2SS   ST     SB          
      1.44207183E-06    3      1000023         4        -4             # Z4SS   -->  Z2SS   CH     CB          
      1.45110491E-04    3      1000023         5        -5             # Z4SS   -->  Z2SS   BT     BB          
      1.46843558E-05    3      1000023        15       -15             # Z4SS   -->  Z2SS   TAU-   TAU+        
      1.09105134E-08    3      1000025         2        -2             # Z4SS   -->  Z3SS   UP     UB          
      1.41142023E-08    3      1000025         1        -1             # Z4SS   -->  Z3SS   DN     DB          
      1.41142023E-08    3      1000025         3        -3             # Z4SS   -->  Z3SS   ST     SB          
      1.09105134E-08    3      1000025         4        -4             # Z4SS   -->  Z3SS   CH     CB          
      1.65415870E-09    3      1000025         5        -5             # Z4SS   -->  Z3SS   BT     BB          
      3.19610982E-09    3      1000025        11       -11             # Z4SS   -->  Z3SS   E-     E+          
      3.19610982E-09    3      1000025        13       -13             # Z4SS   -->  Z3SS   MU-    MU+         
      2.49322873E-09    3      1000025        15       -15             # Z4SS   -->  Z3SS   TAU-   TAU+        
      6.35925357E-09    3      1000025        12       -12             # Z4SS   -->  Z3SS   NUE    ANUE        
      6.35925357E-09    3      1000025        14       -14             # Z4SS   -->  Z3SS   NUM    ANUM        
      6.35925357E-09    3      1000025        16       -16             # Z4SS   -->  Z3SS   NUT    ANUT        
      5.69956638E-02    2      1000022        25                       # Z4SS   -->  Z1SS   HL0                
      1.63676098E-01    2      1000023        25                       # Z4SS   -->  Z2SS   HL0                
      1.77235669E-03    2      1000011       -11                       # Z4SS   -->  EL-    E+                 
      1.77235669E-03    2     -1000011        11                       # Z4SS   -->  EL+    E-                 
      1.77235494E-03    2      1000013       -13                       # Z4SS   -->  MUL-   MU+                
      1.77235494E-03    2     -1000013        13                       # Z4SS   -->  MUL+   MU-                
      8.37473082E-04    2      2000011       -11                       # Z4SS   -->  ER-    E+                 
      8.37473082E-04    2     -2000011        11                       # Z4SS   -->  ER+    E-                 
      8.37472617E-04    2      2000013       -13                       # Z4SS   -->  MUR-   MU+                
      8.37472617E-04    2     -2000013        13                       # Z4SS   -->  MUR+   MU-                
      6.17804863E-02    2      1000015       -15                       # Z4SS   -->  TAU1-  TAU+               
      6.17804863E-02    2     -1000015        15                       # Z4SS   -->  TAU1+  TAU-               
      3.76250260E-02    2      2000015       -15                       # Z4SS   -->  TAU2-  TAU+               
      3.76250260E-02    2     -2000015        15                       # Z4SS   -->  TAU2+  TAU-               
      4.99790208E-03    2      1000012       -12                       # Z4SS   -->  NUEL   ANUE               
      4.99790208E-03    2     -1000012        12                       # Z4SS   -->  ANUEL  NUE                
      4.99790208E-03    2      1000014       -14                       # Z4SS   -->  NUML   ANUM               
      4.99790208E-03    2     -1000014        14                       # Z4SS   -->  ANUML  NUM                
      8.52545351E-03    2      1000016       -16                       # Z4SS   -->  NUTL   ANUT               
      8.52545351E-03    2     -1000016        16                       # Z4SS   -->  ANUTL  NUT                
#         PDG         Width
DECAY   1000024  7.76289031E-02   # W1SS+ decays
#          BR          NDA       ID1       ID2       ID3       ID4
      3.88591815E-07    3      1000022         2        -1             # W1SS+  -->  Z1SS   UP     DB          
      3.88590024E-07    3      1000022         4        -3             # W1SS+  -->  Z1SS   CH     SB          
      2.32284947E-05    3      1000022       -11        12             # W1SS+  -->  Z1SS   E+     NUE         
      2.32284910E-05    3      1000022       -13        14             # W1SS+  -->  Z1SS   MU+    NUM         
      3.85878520E-05    3      1000022       -15        16             # W1SS+  -->  Z1SS   TAU+   NUT         
      1.21878665E-02    2      1000022        24                       # W1SS+  -->  Z1SS   W+                 
      5.69988757E-15    3      1000023       -11        12             # W1SS+  -->  Z2SS   E+     NUE         
      5.69988757E-15    3      1000023       -13        14             # W1SS+  -->  Z2SS   MU+    NUM         
      9.87726271E-01    2     -1000015        16                       # W1SS+  -->  TAU1+  NUT                
#         PDG         Width
DECAY   1000037  3.76237631E+00   # W2SS+ decays
#          BR          NDA       ID1       ID2       ID3       ID4
      2.54950152E-07    3      1000022         2        -1             # W2SS+  -->  Z1SS   UP     DB          
      2.54949526E-07    3      1000022         4        -3             # W2SS+  -->  Z1SS   CH     SB          
      1.91391464E-05    3      1000022       -15        16             # W2SS+  -->  Z1SS   TAU+   NUT         
      5.96966147E-02    2      1000022        24                       # W2SS+  -->  Z1SS   W+                 
      1.45472222E-06    3      1000023         2        -1             # W2SS+  -->  Z2SS   UP     DB          
      1.45472086E-06    3      1000023         4        -3             # W2SS+  -->  Z2SS   CH     SB          
      1.85332774E-05    3      1000023       -15        16             # W2SS+  -->  Z2SS   TAU+   NUT         
      2.08558097E-01    2      1000023        24                       # W2SS+  -->  Z2SS   W+                 
      2.93448679E-08    3      1000025         2        -1             # W2SS+  -->  Z3SS   UP     DB          
      2.93448679E-08    3      1000025         4        -3             # W2SS+  -->  Z3SS   CH     SB          
      9.77524994E-09    3      1000025       -11        12             # W2SS+  -->  Z3SS   E+     NUE         
      9.77524994E-09    3      1000025       -13        14             # W2SS+  -->  Z3SS   MU+    NUM         
      9.77580950E-09    3      1000025       -15        16             # W2SS+  -->  Z3SS   TAU+   NUT         
      1.78657115E-01    2      1000006        -5                       # W2SS+  -->  TP1    BB                 
      2.41759070E-03    2      1000012       -11                       # W2SS+  -->  NUEL   E+                 
      2.41759024E-03    2      1000014       -13                       # W2SS+  -->  NUML   MU+                
      7.30396360E-02    2      1000016       -15                       # W2SS+  -->  NUTL   TAU+               
      8.99349619E-03    2     -1000011        12                       # W2SS+  -->  EL+    NUE                
      8.99349060E-03    2     -1000013        14                       # W2SS+  -->  MUL+   NUM                
      6.99955672E-02    2     -1000015        16                       # W2SS+  -->  TAU1+  NUT                
      3.67547758E-02    2     -2000015        16                       # W2SS+  -->  TAU2+  NUT                
      1.87857017E-01    2      1000024        23                       # W2SS+  -->  W1SS+  Z0                 
      8.70951737E-07    3      1000024         1        -1             # W2SS+  -->  W1SS+  DN     DB          
      8.70939232E-07    3      1000024         3        -3             # W2SS+  -->  W1SS+  ST     SB          
      3.33179514E-06    3      1000024         2        -2             # W2SS+  -->  W1SS+  UP     UB          
      3.33179514E-06    3      1000024         4        -4             # W2SS+  -->  W1SS+  CH     CB          
      1.62569329E-01    2      1000024        25                       # W2SS+  -->  W1SS+  HL0                
#         PDG         Width
DECAY        25  3.95604782E-03   # HL0   decays
#          BR          NDA       ID1       ID2       ID3       ID4
      4.88021579E-09    2           11       -11                       # HL0    -->  E-     E+                 
      2.06050448E-04    2           13       -13                       # HL0    -->  MU-    MU+                
      5.89293316E-02    2           15       -15                       # HL0    -->  TAU-   TAU+               
      6.12650592E-06    2            1        -1                       # HL0    -->  DN     DB                 
      2.47541512E-03    2            3        -3                       # HL0    -->  ST     SB                 
      8.13136637E-01    2            5        -5                       # HL0    -->  BT     BB                 
      1.95612620E-06    2            2        -2                       # HL0    -->  UP     UB                 
      3.69050503E-02    2            4        -4                       # HL0    -->  CH     CB                 
      1.75548717E-03    2           22        22                       # HL0    -->  GM     GM                 
      3.97080742E-02    2           21        21                       # HL0    -->  GL     GL                 
      2.44113058E-03    3           24        11       -12             # HL0    -->  W+     E-     ANUE        
      2.44113058E-03    3           24        13       -14             # HL0    -->  W+     MU-    ANUM        
      2.44113058E-03    3           24        15       -16             # HL0    -->  W+     TAU-   ANUT        
      7.32339174E-03    3           24        -2         1             # HL0    -->  W+     UB     DN          
      7.32339174E-03    3           24        -4         3             # HL0    -->  W+     CB     ST          
      2.44113058E-03    3          -24       -11        12             # HL0    -->  W-     E+     NUE         
      2.44113058E-03    3          -24       -13        14             # HL0    -->  W-     MU+    NUM         
      2.44113058E-03    3          -24       -15        16             # HL0    -->  W-     TAU+   NUT         
      7.32339174E-03    3          -24         2        -1             # HL0    -->  W-     UP     DB          
      7.32339174E-03    3          -24         4        -3             # HL0    -->  W-     CH     SB          
      2.00763738E-04    3           23        12       -12             # HL0    -->  Z0     NUE    ANUE        
      2.00763738E-04    3           23        14       -14             # HL0    -->  Z0     NUM    ANUM        
      2.00763738E-04    3           23        16       -16             # HL0    -->  Z0     NUT    ANUT        
      1.01042373E-04    3           23        11       -11             # HL0    -->  Z0     E-     E+          
      1.01042373E-04    3           23        13       -13             # HL0    -->  Z0     MU-    MU+         
      1.01042373E-04    3           23        15       -15             # HL0    -->  Z0     TAU-   TAU+        
      3.46162618E-04    3           23         2        -2             # HL0    -->  Z0     UP     UB          
      3.46162618E-04    3           23         4        -4             # HL0    -->  Z0     CH     CB          
      4.45942715E-04    3           23         1        -1             # HL0    -->  Z0     DN     DB          
      4.45942715E-04    3           23         3        -3             # HL0    -->  Z0     ST     SB          
      4.45942715E-04    3           23         5        -5             # HL0    -->  Z0     BT     BB          
#         PDG         Width
DECAY        35  1.01519947E+01   # HH0   decays
#          BR          NDA       ID1       ID2       ID3       ID4
      9.97774396E-09    2           11       -11                       # HH0    -->  E-     E+                 
      4.21278150E-04    2           13       -13                       # HH0    -->  MU-    MU+                
      1.20644115E-01    2           15       -15                       # HH0    -->  TAU-   TAU+               
      1.23348764E-05    2            1        -1                       # HH0    -->  DN     DB                 
      4.98391408E-03    2            3        -3                       # HH0    -->  ST     SB                 
      8.35559189E-01    2            5        -5                       # HH0    -->  BT     BB                 
      1.54498040E-12    2            2        -2                       # HH0    -->  UP     UB                 
      2.46239331E-08    2            4        -4                       # HH0    -->  CH     CB                 
      1.03110055E-04    2            6        -6                       # HH0    -->  TP     TB                 
      1.13183248E-07    2           22        22                       # HH0    -->  GM     GM                 
      2.36292544E-05    2           21        21                       # HH0    -->  GL     GL                 
      8.82941387E-10    2           24       -24                       # HH0    -->  W+     W-                 
      4.19275281E-10    2           23        23                       # HH0    -->  Z0     Z0                 
      7.86568446E-04    2      1000022   1000022                       # HH0    -->  Z1SS   Z1SS               
      1.99486082E-03    2      1000022   1000023                       # HH0    -->  Z1SS   Z2SS               
      3.17012396E-04    2           25        25                       # HH0    -->  HL0    HL0                
      3.51536646E-02    2      1000015  -1000015                       # HH0    -->  TAU1-  TAU1+              
#         PDG         Width
DECAY        36  9.77737999E+00   # HA0   decays
#          BR          NDA       ID1       ID2       ID3       ID4
      1.02995878E-08    2           11       -11                       # HA0    -->  E-     E+                 
      4.34867106E-04    2           13       -13                       # HA0    -->  MU-    MU+                
      1.24546893E-01    2           15       -15                       # HA0    -->  TAU-   TAU+               
      1.27335115E-05    2            1        -1                       # HA0    -->  DN     DB                 
      5.14498353E-03    2            3        -3                       # HA0    -->  ST     SB                 
      8.62883329E-01    2            5        -5                       # HA0    -->  BT     BB                 
      1.59152964E-12    2            2        -2                       # HA0    -->  UP     UB                 
      2.53858552E-08    2            4        -4                       # HA0    -->  CH     CB                 
      6.93436770E-04    2            6        -6                       # HA0    -->  TP     TB                 
      6.93334883E-08    2           22        22                       # HA0    -->  GM     GM                 
      3.66493914E-05    2           21        21                       # HA0    -->  GL     GL                 
      1.16993918E-03    2      1000022   1000022                       # HA0    -->  Z1SS   Z1SS               
      5.07713761E-03    2      1000022   1000023                       # HA0    -->  Z1SS   Z2SS               
      6.94502567E-10    2           25        23                       # HA0    -->  HL0    Z0                 
#         PDG         Width
DECAY        37  6.41368294E+00   # H+    decays
#          BR          NDA       ID1       ID2       ID3       ID4
      1.62201168E-08    2           12       -11                       # H+     -->  NUE    E+                 
      6.84842526E-04    2           14       -13                       # H+     -->  NUM    MU+                
      1.96140960E-01    2           16       -15                       # H+     -->  NUT    TAU+               
      1.82643362E-05    2            2        -1                       # H+     -->  UP     DB                 
      7.37956353E-03    2            4        -3                       # H+     -->  CH     SB                 
      7.84627795E-01    2            6        -5                       # H+     -->  TP     BB                 
      1.11438558E-02    2      1000024   1000022                       # H+     -->  W1SS+  Z1SS               
      4.69375209E-06    2      1000024   1000023                       # H+     -->  W1SS+  Z2SS               
      1.26718791E-09    2           25        24                       # H+     -->  HL0    W+                 
