#
#                              ======================
#                              | THE SUSYHIT OUTPUT |
#                              ======================
#
#
#              ------------------------------------------------------
#              |     This is the output of the SUSY-HIT package     |
#              |  created by A.Djouadi, M.Muehlleitner and M.Spira. |
#              |  In case of problems with SUSY-HIT email to        |
#              |           margarete.muehlleitner@cern.ch           |
#              |           michael.spira@psi.ch                     |
#              |           abdelhak.djouadi@cern.ch                 |
#              ------------------------------------------------------
#
#              ------------------------------------------------------
#              |  SUSY Les Houches Accord - MSSM Spectrum + Decays  |
#              |              based on the decay programs           |
#              |                                                    |
#              |                     SDECAY 1.3b                    |
#              |                                                    |
#              |  Authors: M.Muhlleitner, A.Djouadi and Y.Mambrini  |
#              |  Ref.:    Comput.Phys.Commun.168(2005)46           |
#              |           [hep-ph/0311167]                         |
#              |                                                    |
#              |                     HDECAY 3.4                     |
#              |                                                    |
#              |  By: A.Djouadi,J.Kalinowski,M.Muhlleitner,M.Spira  |
#              |  Ref.:    Comput.Phys.Commun.108(1998)56           |
#              |           [hep-ph/9704448]                         |
#              |                                                    |
#              |                                                    |
#              |  If not stated otherwise all DRbar couplings and   |
#              |  soft SUSY breaking masses are given at the scale  |
#              |  Q=  0.50018957E+04
#              |                                                    |
#              ------------------------------------------------------
#
#
BLOCK DCINFO  # Decay Program information
     1   SDECAY/HDECAY # decay calculator
     2   1.3b  /3.4    # version number
#
BLOCK SPINFO  # Spectrum calculator information
     1   SuSpect     # RGE +Spectrum calculator            
     2   2.41        # version number                      
#
BLOCK MODSEL  # Model selection
     1     0   # #general MSSM low scale                           
#
BLOCK SMINPUTS  # Standard Model inputs
         1     1.27934000E+02   # alpha_em^-1(M_Z)^MSbar
         2     1.16639000E-05   # G_F [GeV^-2]
         3     1.17200000E-01   # alpha_S(M_Z)^MSbar
         4     9.11870000E+01   # M_Z pole mass
         5     4.25000000E+00   # mb(mb)^MSbar
         6     1.72500000E+02   # mt pole mass
         7     1.77710000E+00   # mtau pole mass
#
BLOCK MINPAR  # Input parameters - minimal models
#
BLOCK EXTPAR  # Input parameters - non-minimal models
         0     5.00189567E+03   # EWSB                
         1     3.36400000E+02   # M_1                 
         2     5.00000000E+03   # M_2                 
         3     2.54160000E+02   # M_3                 
        11     0.00000000E+00   # A_t                 
        12     0.00000000E+00   # A_b                 
        13     0.00000000E+00   # A_tau               
        14     0.00000000E+00   # A_u                 
        15     0.00000000E+00   # A_d                 
        16     0.00000000E+00   # A_e                 
        23     1.00000000E+03   # mu(EWSB)            
        25     1.05000000E+00   # tanbeta(in)         
        26     1.00000000E+03   # MA_pole             
        31     5.00000000E+03   # M_eL                
        32     5.00000000E+03   # M_muL               
        33     5.00000000E+03   # M_tauL              
        34     5.00000000E+03   # M_eR                
        35     5.00000000E+03   # M_muR               
        36     5.00000000E+03   # M_tauR              
        41     5.00000000E+03   # M_q1L               
        42     5.00000000E+03   # M_q2L               
        43     5.00000000E+03   # M_q3L               
        44     5.00000000E+03   # M_uR                
        45     5.00000000E+03   # M_cR                
        46     5.00000000E+03   # M_tR                
        47     5.00000000E+03   # M_dR                
        48     5.00000000E+03   # M_sR                
        49     5.00000000E+03   # M_bR                
#
BLOCK MASS  # Mass Spectrum
# PDG code           mass       particle
        24     8.05889069E+01   # W+
        25     8.61494276E+01   # h
        35     1.00948555E+03   # H
        36     1.00000000E+03   # A
        37     1.00337515E+03   # H+
         5     4.87877839E+00   # b-quark pole mass calculated from mb(mb)_Msbar
   1000001     5.04422686E+03   # ~d_L
   2000001     5.04424257E+03   # ~d_R
   1000002     5.04426219E+03   # ~u_L
   2000002     5.04425430E+03   # ~u_R
   1000003     5.04422686E+03   # ~s_L
   2000003     5.04424257E+03   # ~s_R
   1000004     5.04426219E+03   # ~c_L
   2000004     5.04425430E+03   # ~c_R
   1000005     5.04401150E+03   # ~b_1
   2000005     5.04445903E+03   # ~b_2
   1000006     4.90975040E+03   # ~t_1
   2000006     5.04328822E+03   # ~t_2
   1000011     4.99998830E+03   # ~e_L
   2000011     4.99998837E+03   # ~e_R
   1000012     5.00002333E+03   # ~nu_eL
   1000013     4.99998830E+03   # ~mu_L
   2000013     4.99998837E+03   # ~mu_R
   1000014     5.00002333E+03   # ~nu_muL
   1000015     4.99982412E+03   # ~tau_1
   2000015     5.00015315E+03   # ~tau_2
   1000016     5.00002333E+03   # ~nu_tauL
   1000021     4.49963699E+02   # ~g
   1000022     3.30085037E+02   # ~chi_10
   1000023    -1.01762653E+03   # ~chi_20
   1000025     1.01903020E+03   # ~chi_30
   1000035     5.02219840E+03   # ~chi_40
   1000024     1.01612682E+03   # ~chi_1+
   1000037     5.02219824E+03   # ~chi_2+
#
BLOCK NMIX  # Neutralino Mixing Matrix
  1  1     9.97889553E-01   # N_11
  1  2    -1.07163628E-03   # N_12
  1  3     4.52205230E-02   # N_13
  1  4    -4.65875038E-02   # N_14
  2  1     9.65935951E-04   # N_21
  2  2    -3.74879094E-04   # N_22
  2  3     7.07131473E-01   # N_23
  2  4     7.07081329E-01   # N_24
  3  1     6.49266711E-02   # N_31
  3  2     1.93134858E-02   # N_32
  3  3    -7.05496854E-01   # N_33
  3  4     7.05468430E-01   # N_34
  4  1     1.84258070E-04   # N_41
  4  2    -9.99812833E-01   # N_42
  4  3    -1.39417617E-02   # N_43
  4  4     1.34124197E-02   # N_44
#
BLOCK UMIX  # Chargino Mixing Matrix U
  1  1    -1.97146334E-02   # U_11
  1  2     9.99805648E-01   # U_12
  2  1     9.99805648E-01   # U_21
  2  2     1.97146334E-02   # U_22
#
BLOCK VMIX  # Chargino Mixing Matrix V
  1  1    -1.89659245E-02   # V_11
  1  2     9.99820131E-01   # V_12
  2  1     9.99820131E-01   # V_21
  2  2     1.89659245E-02   # V_22
#
BLOCK STOPMIX  # Stop Mixing Matrix
  1  1     1.03402869E-01   # cos(theta_t)
  1  2     9.94639556E-01   # sin(theta_t)
  2  1    -9.94639556E-01   # -sin(theta_t)
  2  2     1.03402869E-01   # cos(theta_t)
#
BLOCK SBOTMIX  # Sbottom Mixing Matrix
  1  1     7.19410626E-01   # cos(theta_b)
  1  2     6.94585021E-01   # sin(theta_b)
  2  1    -6.94585021E-01   # -sin(theta_b)
  2  2     7.19410626E-01   # cos(theta_b)
#
BLOCK STAUMIX  # Stau Mixing Matrix
  1  1     7.07173161E-01   # cos(theta_tau)
  1  2     7.07040395E-01   # sin(theta_tau)
  2  1    -7.07040395E-01   # -sin(theta_tau)
  2  2     7.07173161E-01   # cos(theta_tau)
#
BLOCK ALPHA  # Higgs mixing
          -8.22101961E-01   # Mixing angle in the neutral Higgs boson sector
#
BLOCK HMIX Q=  5.00189567E+03  # DRbar Higgs Parameters
         1     1.00000000E+03   # mu(Q)               
         2     9.43282584E-01   # tanbeta(Q)          
         3     2.44136607E+02   # vev(Q)              
         4     1.10437847E+06   # MA^2(Q)             
#
BLOCK GAUGE Q=  5.00189567E+03  # The gauge couplings
     1     3.65893138E-01   # gprime(Q) DRbar
     2     6.34866193E-01   # g(Q) DRbar
     3     1.02334636E+00   # g3(Q) DRbar
#
BLOCK AU Q=  5.00189567E+03  # The trilinear couplings
  1  1     0.00000000E+00   # A_u(Q) DRbar
  2  2     0.00000000E+00   # A_c(Q) DRbar
  3  3     0.00000000E+00   # A_t(Q) DRbar
#
BLOCK AD Q=  5.00189567E+03  # The trilinear couplings
  1  1     0.00000000E+00   # A_d(Q) DRbar
  2  2     0.00000000E+00   # A_s(Q) DRbar
  3  3     0.00000000E+00   # A_b(Q) DRbar
#
BLOCK AE Q=  5.00189567E+03  # The trilinear couplings
  1  1     0.00000000E+00   # A_e(Q) DRbar
  2  2     0.00000000E+00   # A_mu(Q) DRbar
  3  3     0.00000000E+00   # A_tau(Q) DRbar
#
BLOCK Yu Q=  5.00189567E+03  # The Yukawa couplings
  1  1     0.00000000E+00   # y_u(Q) DRbar
  2  2     0.00000000E+00   # y_c(Q) DRbar
  3  3     1.17207964E+00   # y_t(Q) DRbar
#
BLOCK Yd Q=  5.00189567E+03  # The Yukawa couplings
  1  1     0.00000000E+00   # y_d(Q) DRbar
  2  2     0.00000000E+00   # y_s(Q) DRbar
  3  3     1.87164796E-02   # y_b(Q) DRbar
#
BLOCK Ye Q=  5.00189567E+03  # The Yukawa couplings
  1  1     0.00000000E+00   # y_e(Q) DRbar
  2  2     0.00000000E+00   # y_mu(Q) DRbar
  3  3     1.38882295E-02   # y_tau(Q) DRbar
#
BLOCK MSOFT Q=  5.00189567E+03  # The soft SUSY breaking masses at the scale Q
         1     3.36400000E+02   # M_1                 
         2     5.00000000E+03   # M_2                 
         3     2.54160000E+02   # M_3                 
        14     0.00000000E+00   # A_u                 
        15     0.00000000E+00   # A_d                 
        16     0.00000000E+00   # A_e                 
        21    -7.03232466E+05   # M^2_Hd              
        22     6.80104119E+05   # M^2_Hu              
        31     5.00000000E+03   # M_eL                
        32     5.00000000E+03   # M_muL               
        33     5.00000000E+03   # M_tauL              
        34     5.00000000E+03   # M_eR                
        35     5.00000000E+03   # M_muR               
        36     5.00000000E+03   # M_tauR              
        41     5.00000000E+03   # M_q1L               
        42     5.00000000E+03   # M_q2L               
        43     5.00000000E+03   # M_q3L               
        44     5.00000000E+03   # M_uR                
        45     5.00000000E+03   # M_cR                
        46     5.00000000E+03   # M_tR                
        47     5.00000000E+03   # M_dR                
        48     5.00000000E+03   # M_sR                
        49     5.00000000E+03   # M_bR                
#
#
#
#                             =================
#                             |The decay table|
#                             =================
#
# - The QCD corrections to the decays gluino -> squark  + quark
#                                     squark -> gaugino + quark_prime
#                                     squark -> squark_prime + Higgs
#                                     squark -> gluino  + quark
#   are included.
#
# - The multi-body decays for the inos, stops and sbottoms are included.
#
# - The loop induced decays for the gluino, neutralinos and stops
#   are included.
#
# - The SUSY decays of the top quark are included.
#
#
#         PDG            Width
DECAY         6     1.39087510E+00   # top decays
#          BR         NDA      ID1       ID2
     1.00000000E+00    2           5        24   # BR(t ->  b    W+)
#
#         PDG            Width
DECAY   1000021     2.04862718E-09   # gluino decays
#          BR         NDA      ID1       ID2
     7.46330713E-02    2     1000022        21   # BR(~g -> ~chi_10 g)
#           BR         NDA      ID1       ID2       ID3
     9.47770834E-02    3     1000022         1        -1   # BR(~g -> ~chi_10 d  db)
     3.21306354E-01    3     1000022         2        -2   # BR(~g -> ~chi_10 u  ub)
     9.47770834E-02    3     1000022         3        -3   # BR(~g -> ~chi_10 s  sb)
     3.21306354E-01    3     1000022         4        -4   # BR(~g -> ~chi_10 c  cb)
     9.32000536E-02    3     1000022         5        -5   # BR(~g -> ~chi_10 b  bb)
#
#         PDG            Width
DECAY   1000006     5.93069688E+02   # stop1 decays
#          BR         NDA      ID1       ID2
     1.95208708E-02    2     1000022         6   # BR(~t_1 -> ~chi_10 t )
     1.05070146E-01    2     1000023         6   # BR(~t_1 -> ~chi_20 t )
     1.03908181E-01    2     1000025         6   # BR(~t_1 -> ~chi_30 t )
     2.07978869E-01    2     1000024         5   # BR(~t_1 -> ~chi_1+ b )
     5.63521934E-01    2     1000021         6   # BR(~t_1 -> ~g      t )
#
#         PDG            Width
DECAY   2000006     4.72285315E+02   # stop2 decays
#          BR         NDA      ID1       ID2
     1.76725888E-03    2     1000022         6   # BR(~t_2 -> ~chi_10 t )
     1.35485721E-01    2     1000023         6   # BR(~t_2 -> ~chi_20 t )
     1.35814913E-01    2     1000025         6   # BR(~t_2 -> ~chi_30 t )
     2.64389840E-03    2     1000024         5   # BR(~t_2 -> ~chi_1+ b )
     6.63849591E-06    2     1000037         5   # BR(~t_2 -> ~chi_2+ b )
     7.24098128E-01    2     1000021         6   # BR(~t_2 -> ~g      t )
     1.28696636E-04    2     1000006        25   # BR(~t_2 -> ~t_1    h )
     5.47453774E-05    2     1000006        23   # BR(~t_2 -> ~t_1    Z )
#
#         PDG            Width
DECAY   1000005     4.11029474E+02   # sbottom1 decays
#          BR         NDA      ID1       ID2
     4.33305477E-03    2     1000022         5   # BR(~b_1 -> ~chi_10 b )
     4.10990448E-05    2     1000023         5   # BR(~b_1 -> ~chi_20 b )
     3.00472708E-05    2     1000025         5   # BR(~b_1 -> ~chi_30 b )
     2.11258784E-06    2     1000035         5   # BR(~b_1 -> ~chi_40 b )
     1.61226285E-01    2    -1000024         6   # BR(~b_1 -> ~chi_1- t )
     8.34280939E-01    2     1000021         5   # BR(~b_1 -> ~g      b )
     8.64621010E-05    2     1000006       -24   # BR(~b_1 -> ~t_1    W-)
#
#         PDG            Width
DECAY   2000005     4.06855818E+02   # sbottom2 decays
#          BR         NDA      ID1       ID2
     4.44372444E-03    2     1000022         5   # BR(~b_2 -> ~chi_10 b )
     3.90116222E-05    2     1000023         5   # BR(~b_2 -> ~chi_20 b )
     7.95041818E-05    2     1000025         5   # BR(~b_2 -> ~chi_30 b )
     2.08561515E-06    2     1000035         5   # BR(~b_2 -> ~chi_40 b )
     1.52604482E-01    2    -1000024         6   # BR(~b_2 -> ~chi_1- t )
     8.42748491E-01    2     1000021         5   # BR(~b_2 -> ~g      b )
     8.27013697E-05    2     1000006       -24   # BR(~b_2 -> ~t_1    W-)
#
#         PDG            Width
DECAY   1000002     3.43680642E+02   # sup_L decays
#          BR         NDA      ID1       ID2
     2.06410236E-03    2     1000022         2   # BR(~u_L -> ~chi_10 u)
     1.90461697E-09    2     1000023         2   # BR(~u_L -> ~chi_20 u)
     5.36836660E-05    2     1000025         2   # BR(~u_L -> ~chi_30 u)
     4.12761083E-05    2     1000035         2   # BR(~u_L -> ~chi_40 u)
     3.82406293E-05    2     1000024         1   # BR(~u_L -> ~chi_1+ d)
     8.25599333E-05    2     1000037         1   # BR(~u_L -> ~chi_2+ d)
     9.97720135E-01    2     1000021         2   # BR(~u_L -> ~g      u)
#
#         PDG            Width
DECAY   2000002     3.54420231E+02   # sup_R decays
#          BR         NDA      ID1       ID2
     3.23859134E-02    2     1000022         2   # BR(~u_R -> ~chi_10 u)
     2.83923815E-08    2     1000023         2   # BR(~u_R -> ~chi_20 u)
     1.28250308E-04    2     1000025         2   # BR(~u_R -> ~chi_30 u)
     8.02473361E-13    2     1000035         2   # BR(~u_R -> ~chi_40 u)
     9.67485808E-01    2     1000021         2   # BR(~u_R -> ~g      u)
#
#         PDG            Width
DECAY   1000001     3.43677592E+02   # sdown_L decays
#          BR         NDA      ID1       ID2
     2.11078002E-03    2     1000022         1   # BR(~d_L -> ~chi_10 d)
     1.66922449E-08    2     1000023         1   # BR(~d_L -> ~chi_20 d)
     2.48609641E-06    2     1000025         1   # BR(~d_L -> ~chi_30 d)
     4.12088520E-05    2     1000035         1   # BR(~d_L -> ~chi_40 d)
     4.13194706E-05    2    -1000024         2   # BR(~d_L -> ~chi_1- u)
     8.24113496E-05    2    -1000037         2   # BR(~d_L -> ~chi_2- u)
     9.97721778E-01    2     1000021         1   # BR(~d_L -> ~g      d)
#
#         PDG            Width
DECAY   2000001     3.45776635E+02   # sdown_R decays
#          BR         NDA      ID1       ID2
     8.29885152E-03    2     1000022         1   # BR(~d_R -> ~chi_10 d)
     7.27551138E-09    2     1000023         1   # BR(~d_R -> ~chi_20 d)
     3.28639769E-05    2     1000025         1   # BR(~d_R -> ~chi_30 d)
     2.05511768E-13    2     1000035         1   # BR(~d_R -> ~chi_40 d)
     9.91668277E-01    2     1000021         1   # BR(~d_R -> ~g      d)
#
#         PDG            Width
DECAY   1000004     3.43680642E+02   # scharm_L decays
#          BR         NDA      ID1       ID2
     2.06410236E-03    2     1000022         4   # BR(~c_L -> ~chi_10 c)
     1.90461697E-09    2     1000023         4   # BR(~c_L -> ~chi_20 c)
     5.36836660E-05    2     1000025         4   # BR(~c_L -> ~chi_30 c)
     4.12761083E-05    2     1000035         4   # BR(~c_L -> ~chi_40 c)
     3.82406293E-05    2     1000024         3   # BR(~c_L -> ~chi_1+ s)
     8.25599333E-05    2     1000037         3   # BR(~c_L -> ~chi_2+ s)
     9.97720135E-01    2     1000021         4   # BR(~c_L -> ~g      c)
#
#         PDG            Width
DECAY   2000004     3.54420231E+02   # scharm_R decays
#          BR         NDA      ID1       ID2
     3.23859134E-02    2     1000022         4   # BR(~c_R -> ~chi_10 c)
     2.83923815E-08    2     1000023         4   # BR(~c_R -> ~chi_20 c)
     1.28250308E-04    2     1000025         4   # BR(~c_R -> ~chi_30 c)
     8.02473361E-13    2     1000035         4   # BR(~c_R -> ~chi_40 c)
     9.67485808E-01    2     1000021         4   # BR(~c_R -> ~g      c)
#
#         PDG            Width
DECAY   1000003     3.43677592E+02   # sstrange_L decays
#          BR         NDA      ID1       ID2
     2.11078002E-03    2     1000022         3   # BR(~s_L -> ~chi_10 s)
     1.66922449E-08    2     1000023         3   # BR(~s_L -> ~chi_20 s)
     2.48609641E-06    2     1000025         3   # BR(~s_L -> ~chi_30 s)
     4.12088520E-05    2     1000035         3   # BR(~s_L -> ~chi_40 s)
     4.13194706E-05    2    -1000024         4   # BR(~s_L -> ~chi_1- c)
     8.24113496E-05    2    -1000037         4   # BR(~s_L -> ~chi_2- c)
     9.97721778E-01    2     1000021         3   # BR(~s_L -> ~g      s)
#
#         PDG            Width
DECAY   2000003     3.45776635E+02   # sstrange_R decays
#          BR         NDA      ID1       ID2
     8.29885152E-03    2     1000022         3   # BR(~s_R -> ~chi_10 s)
     7.27551138E-09    2     1000023         3   # BR(~s_R -> ~chi_20 s)
     3.28639769E-05    2     1000025         3   # BR(~s_R -> ~chi_30 s)
     2.05511768E-13    2     1000035         3   # BR(~s_R -> ~chi_40 s)
     9.91668277E-01    2     1000021         3   # BR(~s_R -> ~g      s)
#
#         PDG            Width
DECAY   1000011     6.62189870E+00   # selectron_L decays
#          BR         NDA      ID1       ID2
     9.88886122E-01    2     1000022        11   # BR(~e_L -> ~chi_10 e-)
     9.19576396E-08    2     1000023        11   # BR(~e_L -> ~chi_20 e-)
     8.95095220E-03    2     1000025        11   # BR(~e_L -> ~chi_30 e-)
     2.16283404E-03    2    -1000024        12   # BR(~e_L -> ~chi_1- nu_e)
#
#         PDG            Width
DECAY   2000011     2.63942673E+01   # selectron_R decays
#          BR         NDA      ID1       ID2
     9.96091401E-01    2     1000022        11   # BR(~e_R -> ~chi_10 e-)
     8.65125187E-07    2     1000023        11   # BR(~e_R -> ~chi_20 e-)
     3.90773356E-03    2     1000025        11   # BR(~e_R -> ~chi_30 e-)
#
#         PDG            Width
DECAY   1000013     6.62189870E+00   # smuon_L decays
#          BR         NDA      ID1       ID2
     9.88886122E-01    2     1000022        13   # BR(~mu_L -> ~chi_10 mu-)
     9.19576396E-08    2     1000023        13   # BR(~mu_L -> ~chi_20 mu-)
     8.95095220E-03    2     1000025        13   # BR(~mu_L -> ~chi_30 mu-)
     2.16283404E-03    2    -1000024        14   # BR(~mu_L -> ~chi_1- nu_mu)
#
#         PDG            Width
DECAY   2000013     2.63942673E+01   # smuon_R decays
#          BR         NDA      ID1       ID2
     9.96091401E-01    2     1000022        13   # BR(~mu_R -> ~chi_10 mu-)
     8.65125187E-07    2     1000023        13   # BR(~mu_R -> ~chi_20 mu-)
     3.90773356E-03    2     1000025        13   # BR(~mu_R -> ~chi_30 mu-)
#
#         PDG            Width
DECAY   1000015     1.65577438E+01   # stau_1 decays
#          BR         NDA      ID1       ID2
     9.92524797E-01    2     1000022        15   # BR(~tau_1 -> ~chi_10  tau-)
     5.55851912E-04    2     1000023        15   # BR(~tau_1 -> ~chi_20  tau-)
     4.99504084E-03    2     1000025        15   # BR(~tau_1 -> ~chi_30  tau-)
     1.92431022E-03    2    -1000024        16   # BR(~tau_1 -> ~chi_1-  nu_tau)
#
#         PDG            Width
DECAY   2000015     1.65112965E+01   # stau_2 decays
#          BR         NDA      ID1       ID2
     9.93592719E-01    2     1000022        15   # BR(~tau_2 -> ~chi_10  tau-)
     5.11824864E-04    2     1000023        15   # BR(~tau_2 -> ~chi_20  tau-)
     5.89024602E-03    2     1000025        15   # BR(~tau_2 -> ~chi_30  tau-)
     5.21057566E-06    2    -1000024        16   # BR(~tau_2 -> ~chi_1-  nu_tau)
#
#         PDG            Width
DECAY   1000012     6.61664810E+00   # snu_eL decays
#          BR         NDA      ID1       ID2
     9.97081906E-01    2     1000022        12   # BR(~nu_eL -> ~chi_10 nu_e)
     2.41597140E-06    2     1000023        12   # BR(~nu_eL -> ~chi_20 nu_e)
     9.12397130E-04    2     1000025        12   # BR(~nu_eL -> ~chi_30 nu_e)
     2.00328104E-03    2     1000024        11   # BR(~nu_eL -> ~chi_1+ e-)
#
#         PDG            Width
DECAY   1000014     6.61664810E+00   # snu_muL decays
#          BR         NDA      ID1       ID2
     9.97081906E-01    2     1000022        14   # BR(~nu_muL -> ~chi_10 nu_mu)
     2.41597140E-06    2     1000023        14   # BR(~nu_muL -> ~chi_20 nu_mu)
     9.12397130E-04    2     1000025        14   # BR(~nu_muL -> ~chi_30 nu_mu)
     2.00328104E-03    2     1000024        13   # BR(~nu_muL -> ~chi_1+ mu-)
#
#         PDG            Width
DECAY   1000016     6.63427106E+00   # snu_tauL decays
#          BR         NDA      ID1       ID2
     9.94433306E-01    2     1000022        16   # BR(~nu_tauL -> ~chi_10 nu_tau)
     2.40955373E-06    2     1000023        16   # BR(~nu_tauL -> ~chi_20 nu_tau)
     9.09973483E-04    2     1000025        16   # BR(~nu_tauL -> ~chi_30 nu_tau)
     4.65431083E-03    2     1000024        15   # BR(~nu_tauL -> ~chi_1+ tau-)
#
#         PDG            Width
DECAY   1000024     9.62775034E-01   # chargino1+ decays
#          BR         NDA      ID1       ID2
     1.00000000E+00    2     1000022        24   # BR(~chi_1+ -> ~chi_10  W+)
#
#         PDG            Width
DECAY   1000037     7.51418282E+01   # chargino2+ decays
#          BR         NDA      ID1       ID2
     1.09909573E-05    2     1000006        -5   # BR(~chi_2+ -> ~t_1     bb)
     2.07968100E-05    2     1000012       -11   # BR(~chi_2+ -> ~nu_eL   e+  )
     2.07968100E-05    2     1000014       -13   # BR(~chi_2+ -> ~nu_muL  mu+ )
     2.07287811E-05    2     1000016       -15   # BR(~chi_2+ -> ~nu_tau1 tau+)
     2.08618177E-05    2    -1000011        12   # BR(~chi_2+ -> ~e_L+    nu_e)
     2.08618177E-05    2    -1000013        14   # BR(~chi_2+ -> ~mu_L+   nu_mu)
     1.05782038E-05    2    -1000015        16   # BR(~chi_2+ -> ~tau_1+  nu_tau)
     1.02839162E-05    2    -2000015        16   # BR(~chi_2+ -> ~tau_2+  nu_tau)
     1.78567706E-01    2     1000024        23   # BR(~chi_2+ -> ~chi_1+  Z )
     4.04714150E-04    2     1000022        24   # BR(~chi_2+ -> ~chi_10  W+)
     1.71633815E-01    2     1000023        24   # BR(~chi_2+ -> ~chi_20  W+)
     1.71281850E-01    2     1000025        24   # BR(~chi_2+ -> ~chi_30  W+)
     1.85237583E-01    2     1000024        25   # BR(~chi_2+ -> ~chi_1+  h )
     7.31884128E-02    2     1000024        35   # BR(~chi_2+ -> ~chi_1+  H )
     7.31890115E-02    2     1000024        36   # BR(~chi_2+ -> ~chi_1+  A )
     3.09854478E-04    2     1000022        37   # BR(~chi_2+ -> ~chi_10  H+)
     7.31454030E-02    2     1000023        37   # BR(~chi_2+ -> ~chi_20  H+)
     7.29057509E-02    2     1000025        37   # BR(~chi_2+ -> ~chi_30  H+)
#
#         PDG            Width
DECAY   1000022     0.00000000E+00   # neutralino1 decays
#
#         PDG            Width
DECAY   1000023     1.00215885E+00   # neutralino2 decays
#          BR         NDA      ID1       ID2
     9.99634998E-01    2     1000022        23   # BR(~chi_20 -> ~chi_10   Z )
     3.65001528E-04    2     1000022        25   # BR(~chi_20 -> ~chi_10   h )
#
#         PDG            Width
DECAY   1000025     1.03892656E+00   # neutralino3 decays
#          BR         NDA      ID1       ID2
     2.21684881E-04    2     1000022        23   # BR(~chi_30 -> ~chi_10   Z )
     9.99778315E-01    2     1000022        25   # BR(~chi_30 -> ~chi_10   h )
#
#         PDG            Width
DECAY   1000035     7.51416465E+01   # neutralino4 decays
#          BR         NDA      ID1       ID2
     1.67772624E-08    2     1000022        23   # BR(~chi_40 -> ~chi_10   Z )
     1.78538330E-01    2     1000023        23   # BR(~chi_40 -> ~chi_20   Z )
     6.67248705E-05    2     1000025        23   # BR(~chi_40 -> ~chi_30   Z )
     1.71598553E-01    2     1000024       -24   # BR(~chi_40 -> ~chi_1+   W-)
     1.71598553E-01    2    -1000024        24   # BR(~chi_40 -> ~chi_1-   W+)
     4.36493354E-04    2     1000022        25   # BR(~chi_40 -> ~chi_10   h )
     1.39449169E-06    2     1000022        35   # BR(~chi_40 -> ~chi_10   H )
     3.08570478E-04    2     1000022        36   # BR(~chi_40 -> ~chi_10   A )
     1.09998652E-04    2     1000023        25   # BR(~chi_40 -> ~chi_20   h )
     7.28761338E-02    2     1000023        35   # BR(~chi_40 -> ~chi_20   H )
     1.46694544E-04    2     1000023        36   # BR(~chi_40 -> ~chi_20   A )
     1.84787107E-01    2     1000025        25   # BR(~chi_40 -> ~chi_30   h )
     2.30867752E-04    2     1000025        35   # BR(~chi_40 -> ~chi_30   H )
     7.27224526E-02    2     1000025        36   # BR(~chi_40 -> ~chi_30   A )
     7.32265999E-02    2     1000024       -37   # BR(~chi_40 -> ~chi_1+   H-)
     7.32265999E-02    2    -1000024        37   # BR(~chi_40 -> ~chi_1-   H+)
     1.04290178E-05    2     1000011       -11   # BR(~chi_40 -> ~e_L-     e+)
     1.04290178E-05    2    -1000011        11   # BR(~chi_40 -> ~e_L+     e-)
     4.70709193E-13    2     2000011       -11   # BR(~chi_40 -> ~e_R-     e+)
     4.70709193E-13    2    -2000011        11   # BR(~chi_40 -> ~e_R+     e-)
     1.04290178E-05    2     1000013       -13   # BR(~chi_40 -> ~mu_L-    mu+)
     1.04290178E-05    2    -1000013        13   # BR(~chi_40 -> ~mu_L+    mu-)
     4.70709193E-13    2     2000013       -13   # BR(~chi_40 -> ~mu_R-    mu+)
     4.70709193E-13    2    -2000013        13   # BR(~chi_40 -> ~mu_R+    mu-)
     5.27132558E-06    2     1000015       -15   # BR(~chi_40 -> ~tau_1-   tau+)
     5.27132558E-06    2    -1000015        15   # BR(~chi_40 -> ~tau_1+   tau-)
     5.12383878E-06    2     2000015       -15   # BR(~chi_40 -> ~tau_2-   tau+)
     5.12383878E-06    2    -2000015        15   # BR(~chi_40 -> ~tau_2+   tau-)
     1.04006368E-05    2     1000012       -12   # BR(~chi_40 -> ~nu_eL    nu_eb)
     1.04006368E-05    2    -1000012        12   # BR(~chi_40 -> ~nu_eL*   nu_e )
     1.04006368E-05    2     1000014       -14   # BR(~chi_40 -> ~nu_muL   nu_mub)
     1.04006368E-05    2    -1000014        14   # BR(~chi_40 -> ~nu_muL*  nu_mu )
     1.04006368E-05    2     1000016       -16   # BR(~chi_40 -> ~nu_tau1  nu_taub)
     1.04006368E-05    2    -1000016        16   # BR(~chi_40 -> ~nu_tau1* nu_tau )
#
#         PDG            Width
DECAY        25     2.22601178E-03   # h decays
#          BR         NDA      ID1       ID2
     8.45980652E-01    2           5        -5   # BR(h -> b       bb     )
     8.11479522E-02    2         -15        15   # BR(h -> tau+    tau-   )
     2.87585926E-04    2         -13        13   # BR(h -> mu+     mu-    )
     6.56802626E-04    2           3        -3   # BR(h -> s       sb     )
     2.77752471E-02    2           4        -4   # BR(h -> c       cb     )
     4.16709771E-02    2          21        21   # BR(h -> g       g      )
     1.09101583E-03    2          22        22   # BR(h -> gam     gam    )
     1.11278713E-03    2          24       -24   # BR(h -> W+      W-     )
     2.76979993E-04    2          23        23   # BR(h -> Z       Z      )
#
#         PDG            Width
DECAY        35     4.85662968E+01   # H decays
#          BR         NDA      ID1       ID2
     2.47690429E-04    2           5        -5   # BR(H -> b       bb     )
     3.77225505E-05    2         -15        15   # BR(H -> tau+    tau-   )
     1.33350095E-07    2         -13        13   # BR(H -> mu+     mu-    )
     1.85177560E-07    2           3        -3   # BR(H -> s       sb     )
     1.11068039E-05    2           4        -4   # BR(H -> c       cb     )
     9.96310765E-01    2           6        -6   # BR(H -> t       tb     )
     1.42486063E-03    2          21        21   # BR(H -> g       g      )
     4.73424009E-06    2          22        22   # BR(H -> gam     gam    )
     1.68566137E-06    2          23        22   # BR(H -> Z       gam    )
     3.78907387E-04    2          24       -24   # BR(H -> W+      W-     )
     1.87434711E-04    2          23        23   # BR(H -> Z       Z      )
     1.39453061E-03    2          25        25   # BR(H -> h       h      )
     1.07023756E-18    2          36        36   # BR(H -> A       A      )
     1.69756590E-09    2          23        36   # BR(H -> Z       A      )
     4.59046631E-10    2          24       -37   # BR(H -> W+      H-     )
     4.59046631E-10    2         -24        37   # BR(H -> W-      H+     )
     2.41049923E-07    2     1000022   1000022   # BR(H -> ~chi_10 ~chi_10)
#
#         PDG            Width
DECAY        36     5.20381144E+01   # A decays
#          BR         NDA      ID1       ID2
     2.39852944E-04    2           5        -5   # BR(A -> b       bb     )
     3.54406760E-05    2         -15        15   # BR(A -> tau+    tau-   )
     1.25282083E-07    2         -13        13   # BR(A -> mu+     mu-    )
     1.87523424E-07    2           3        -3   # BR(A -> s       sb     )
     1.02308722E-05    2           4        -4   # BR(A -> c       cb     )
     9.97513605E-01    2           6        -6   # BR(A -> t       tb     )
     1.70718005E-03    2          21        21   # BR(A -> g       g      )
     5.53876854E-06    2          22        22   # BR(A -> gam     gam    )
     2.07430516E-06    2          23        22   # BR(A -> Z       gam    )
     3.40423015E-04    2          23        25   # BR(A -> Z       h      )
     1.45341062E-04    2     1000022   1000022   # BR(A -> ~chi_10 ~chi_10)
#
#         PDG            Width
DECAY        37     5.05280735E+01   # H+ decays
#          BR         NDA      ID1       ID2
     3.97972366E-07    2           4        -5   # BR(H+ -> c       bb     )
     3.66230212E-05    2         -15        16   # BR(H+ -> tau+    nu_tau )
     1.29461644E-07    2         -13        14   # BR(H+ -> mu+     nu_mu  )
     2.44355265E-09    2           2        -5   # BR(H+ -> u       bb     )
     8.84189846E-09    2           2        -3   # BR(H+ -> u       sb     )
     1.02837762E-05    2           4        -3   # BR(H+ -> c       sb     )
     9.99596294E-01    2           6        -5   # BR(H+ -> t       bb     )
     3.56260285E-04    2          24        25   # BR(H+ -> W+      h      )
     1.13640664E-11    2          24        36   # BR(H+ -> W+      A      )
