# SUSY Les Houches Accord 2.beta - MSSM spectrum + Decays
# SPheno v3beta20
# W. Porod, Comput. Phys. Commun. 153 (2003) 275-315, hep-ph/0301101
# in case of problems send email to porod@ific.uv.es
# Created: 15.09.2008,  19:00
Block SPINFO         # Program information
    1   SPheno      # spectrum calculator
    2   v3beta20       # version number
#
Block SPhenoINFO     # SPheno specific information
   1      2         # using 2-loop RGEs
   2      2         # using pole masses for boundary conditions at mZ
Block MODSEL  # Model selection
   4    1    # MSSM with explicit R-parity violation
Block MINPAR  # Input parameters
   3    6.00000000E+00  # tanb at m_Z    
   4    1.00000000E+00  # Sign(mu)
Block SMINPUTS  # SM parameters
        1     1.27934000E+02  # alpha_em^-1(MZ)^MSbar
        2     1.16639000E-05  # G_mu [GeV^-2]
        3     1.17200000E-01  # alpha_s(MZ)^MSbar
        4     9.11876000E+01  # m_Z(pole)
        5     4.25000000E+00  # m_b(m_b), MSbar
        6     1.72500000E+02  # m_t(pole)
        7     1.77700000E+00  # m_tau(pole)
Block EXTPAR  # 
  0    5.49279489E+02  # scale Q where the parameters below are defined
  1    1.23129423E+02  # M_1
  2    2.31248221E+02  # M_2
  3    6.94925600E+02  # M_3
 11   -6.48596951E+02  # A_t
 12   -1.10173601E+03  # A_b
 13   -4.84122074E+02  # A_l
 23    4.60188963E+02  # mu 
 31    2.24432143E+02  # M_(L,11)
 32    2.24429975E+02  # M_(L,22)
 33    2.23819342E+02  # M_(L,33)
 34    1.49095771E+02  # M_(E,11)
 35    1.49089154E+02  # M_(E,22)
 36    1.47216100E+02  # M_(E,33)
 41    6.42275090E+02  # M_(Q,11)
 42    6.42273293E+02  # M_(Q,22)
 43    5.79458950E+02  # M_(Q,33)
 44    6.20286406E+02  # M_(U,11)
 45    6.20283731E+02  # M_(U,22)
 46    4.79101026E+02  # M_(U,33)
 47    6.17717576E+02  # M_(D,11)
 48    6.17716481E+02  # M_(D,22)
 49    6.15883964E+02  # M_(D,33)
Block gauge Q=  5.49279489E+02  # (SUSY scale)
  1    3.61406445E-01  # g'(Q)^DRbar
  2    6.45265465E-01  # g(Q)^DRbar
  3    1.08795252E+00  # g3(Q)^DRbar
Block Yu Q=  5.49279489E+02  # (SUSY scale)
 1  1     8.86090263E-06   # Y_u(Q)^DRbar
 2  2     3.54436115E-03   # Y_c(Q)^DRbar
 3  3     8.83554612E-01   # Y_t(Q)^DRbar
Block Yd Q=  5.49279489E+02  # (SUSY scale)
 1  1     1.16874699E-04   # Y_d(Q)^DRbar
 2  2     2.00356631E-03   # Y_s(Q)^DRbar
 3  3     8.48908077E-02   # Y_b(Q)^DRbar
Block Ye Q=  5.49279489E+02  # (SUSY scale)
 1  1     1.73418690E-05   # Y_e(Q)^DRbar
 2  2     3.58573503E-03   # Y_mu(Q)^DRbar
 3  3     6.03067575E-02   # Y_tau(Q)^DRbar
Block Au Q=  5.49279489E+02  # (SUSY scale)
 1  1    -9.19582916E+02   # A_u(Q)^DRbar
 2  2    -9.19578058E+02   # A_c(Q)^DRbar
 3  3    -6.48596951E+02   # A_t(Q)^DRbar
Block Ad Q=  5.49279489E+02  # (SUSY scale)
 1  1    -1.19327037E+03   # A_d(Q)^DRbar
 2  2    -1.19326749E+03   # A_s(Q)^DRbar
 3  3    -1.10173601E+03   # A_b(Q)^DRbar
Block Ae Q=  5.49279489E+02  # (SUSY scale)
 1  1    -4.85423365E+02   # A_e(Q)^DRbar
 2  2    -4.85418765E+02   # A_mu(Q)^DRbar
 3  3    -4.84122074E+02   # A_tau(Q)^DRbar
Block MSOFT Q=  5.49279489E+02  # soft SUSY breaking masses at Q
  1    1.23129423E+02  # M_1
  2    2.31248221E+02  # M_2
  3    6.94925600E+02  # M_3
 21    4.64874282E+04  # M^2_(H,d)
 22   -2.05144587E+05  # M^2_(H,u)
 31    2.24432143E+02  # M_(L,11)
 32    2.24429975E+02  # M_(L,22)
 33    2.23819342E+02  # M_(L,33)
 34    1.49095771E+02  # M_(E,11)
 35    1.49089154E+02  # M_(E,22)
 36    1.47216100E+02  # M_(E,33)
 41    6.42275090E+02  # M_(Q,11)
 42    6.42273293E+02  # M_(Q,22)
 43    5.79458950E+02  # M_(Q,33)
 44    6.20286406E+02  # M_(U,11)
 45    6.20283731E+02  # M_(U,22)
 46    4.79101026E+02  # M_(U,33)
 47    6.17717576E+02  # M_(D,11)
 48    6.17716481E+02  # M_(D,22)
 49    6.15883964E+02  # M_(D,33)
Block RVKAPPA Q=  5.49279489E+02  # bilinear RP parameters at Q
        1     1.01932480E-01  # epsilon_1
        2    -1.01932480E-01  # epsilon_2
        3     1.01932480E-01  # epsilon_3
Block RVD Q=  5.49279489E+02  # bilinear RP parameters at Q
        1     9.53583885E+00  # Re( B_1 epsilon_1)
        2    -9.57249261E+00  # Re( B_2 epsilon_2)
        3     9.49235760E+00  # Re( B_3 epsilon_3)
Block RVSNVEV Q=  5.49279489E+02  # sneutrino vevs at Q
        1    -8.81337508E-03  # v_L_1
        2     9.00161917E-03  # v_L_2
        3    -8.64125493E-03  # v_L_3
Block SPhenoRP  # additional RP parameters
        4     3.71002929E-03  # Lambda_1 = v_d epsilon_1 + mu v_L1
        5     8.29178214E-02  # Lambda_2 = v_d epsilon_2 + mu v_L2
        6     8.29178214E-02  # Lambda_3 = v_d epsilon_3 + mu v_L3
        7     2.20499827E-03  # m^2_atm [eV^2]
        8     2.84701966E-05  # m^2_sol [eV^2]
        9     9.64631197E-01  # tan^2 theta_atm
       10     6.39631517E-01  # tan^2 theta_sol
       11     1.22072071E-03  # U_e3^2
       15     3.98256569E+01  # v_d
       16     2.38953941E+02  # v_u
Block MASS  # Mass spectrum
#   PDG code      mass          particle
        4     1.20000000E+00  # m_c(m_c), MSbar
        5     4.25000000E+00  # m_b(m_b), MSbar
        6     1.72500000E+02  # m_t(pole)
       23     9.11876000E+01  # m_Z(pole)
       24     8.03761791E+01  # W+
       25     1.10608061E+02  # leightest neutral scalar
  1000016     2.16951897E+02  # 2nd neutral scalar
  1000014     2.17631713E+02  # 3rd neutral scalar
  1000012     2.17634123E+02  # 4th neutral scalar
       35     5.15417786E+02  # 5th neutral scalar
  2000016     2.16951897E+02  # leightest pseudoscalar
  2000014     2.17631713E+02  # 2nd pseudoscalar
  2000012     2.17634123E+02  # 3rd pseudoscalar
       36     5.14651857E+02  # 4th pseudoscalar
  1000015     1.51557533E+02  # leightest charged scalar
  2000013     1.56848385E+02  # 2nd charged scalar
  2000011     1.56867417E+02  # 3rd charged scalar
  1000011     2.31115415E+02  # 4th charged scalar
  1000013     2.31121565E+02  # 5th charged scalar
  2000015     2.32740568E+02  # 6th charged scalar
       37     5.21136081E+02  # 7th charged scalar
  1000001     6.70707353E+02  # ~d_L
  2000001     6.43792450E+02  # ~d_R
  1000002     6.66332823E+02  # ~u_L
  2000002     6.44800599E+02  # ~u_R
  1000003     6.70706597E+02  # ~s_L
  2000003     6.43790111E+02  # ~s_R
  1000004     6.66342182E+02  # ~c_L
  2000004     6.44786752E+02  # ~c_R
  1000005     6.01656438E+02  # ~b_1
  2000005     6.43240909E+02  # ~b_2
  1000006     4.48594380E+02  # ~t_1
  2000006     6.72562501E+02  # ~t_2
  1000021     7.15616636E+02  # ~g
       12    -9.17922916E-14  # nu_1
       14    -5.33653655E-12  # nu_2
       16    -4.72596751E-11  # nu_3
  1000022     1.18460810E+02  # chi_10
  1000023     2.22992998E+02  # chi_20
  1000025    -4.65076359E+02  # chi_30
  1000035     4.80177473E+02  # chi_40
      -11     5.10999060E-04  # e+
      -13     1.05658000E-01  # mu+
      -15     1.77700000E+00  # tau+
  1000024     2.22740316E+02  # chi_1+
  1000037     4.80417967E+02  # chi_2+
# Higgs mixing
Block RVHMIX   5.49279489E+02  # neutral scalar Higgs mixing
  1  1    -1.75541712E-01   # R_S0(1,1)
  1  2    -9.84471992E-01   # R_S0(1,2)
  1  3     3.94830316E-05   # R_S0(1,3)
  1  4    -4.06438779E-05   # R_S0(1,4)
  1  5     3.84432813E-05   # R_S0(1,5)
  2  1     2.12211106E-04   # R_S0(2,1)
  2  2     1.21003812E-06   # R_S0(2,2)
  2  3    -1.63046973E-06   # R_S0(2,3)
  2  4     1.63647386E-06   # R_S0(2,4)
  2  5     9.99999977E-01   # R_S0(2,5)
  3  1     2.12825818E-04   # R_S0(3,1)
  3  2     3.31796879E-06   # R_S0(3,2)
  3  3    -4.47744258E-04   # R_S0(3,3)
  3  4    -9.99999877E-01   # R_S0(3,4)
  3  5     1.59057565E-06   # R_S0(3,5)
  4  1    -2.12776892E-04   # R_S0(4,1)
  4  2    -2.18397677E-06   # R_S0(4,2)
  4  3    -9.99999877E-01   # R_S0(4,3)
  4  4     4.47698963E-04   # R_S0(4,4)
  4  5    -1.58604595E-06   # R_S0(4,5)
  5  1    -9.84471925E-01   # R_S0(5,1)
  5  2     1.75541725E-01   # R_S0(5,2)
  5  3     2.08995609E-04   # R_S0(5,3)
  5  4    -2.09031871E-04   # R_S0(5,4)
  5  5     2.08704152E-04   # R_S0(5,5)
Block RVAMIX   5.49279489E+02  # pseudoscalar Higgs mixing
  1  1    -1.64398987E-01   # R_P0(1,1)
  1  2     9.86393922E-01   # R_P0(1,2)
  1  3     3.63813192E-05   # R_P0(1,3)
  1  4    -3.71583845E-05   # R_P0(1,4)
  1  5     3.56708130E-05   # R_P0(1,5)
  2  1     2.12118623E-04   # R_P0(2,1)
  2  2    -8.09621060E-07   # R_P0(2,2)
  2  3    -1.63026116E-06   # R_P0(2,3)
  2  4     1.63616589E-06   # R_P0(2,4)
  2  5     9.99999977E-01   # R_P0(2,5)
  3  1     2.12573045E-04   # R_P0(3,1)
  3  2    -2.22564142E-06   # R_P0(3,2)
  3  3    -4.47598213E-04   # R_P0(3,3)
  3  4    -9.99999877E-01   # R_P0(3,4)
  3  5     1.59034352E-06   # R_P0(3,5)
  4  1     2.12610461E-04   # R_P0(4,1)
  4  2    -1.46499001E-06   # R_P0(4,2)
  4  3     9.99999877E-01   # R_P0(4,3)
  4  4    -4.47553012E-04   # R_P0(4,4)
  4  5     1.58589344E-06   # R_P0(4,5)
  5  1    -9.86393855E-01   # R_P0(5,1)
  5  2    -1.64398999E-01   # R_P0(5,2)
  5  3     2.09382782E-04   # R_P0(5,3)
  5  4    -2.09408265E-04   # R_P0(5,4)
  5  5     2.09100094E-04   # R_P0(5,5)
Block RVLMIX   5.49279489E+02  # charged Higgs mixing
  1  1    -1.64398987E-01   # R_Spm(1,1)
  1  2     9.86393922E-01   # R_Spm(1,2)
  1  3     3.63813192E-05   # R_Spm(1,3)
  1  4    -3.71583845E-05   # R_Spm(1,4)
  1  5     3.56708130E-05   # R_Spm(1,5)
  1  6     2.27830350E-16   # R_Spm(1,6)
  1  7     9.68749445E-19   # R_Spm(1,7)
  1  8     1.01131634E-20   # R_Spm(1,8)
  2  1    -3.89888616E-05   # R_Spm(2,1)
  2  2     1.17530902E-07   # R_Spm(2,2)
  2  3     2.44482690E-09   # R_Spm(2,3)
  2  4    -2.43094509E-09   # R_Spm(2,4)
  2  5    -1.82941199E-01   # R_Spm(2,5)
  2  6    -6.18819667E-12   # R_Spm(2,6)
  2  7     1.28962494E-09   # R_Spm(2,7)
  2  8    -9.83123856E-01   # R_Spm(2,8)
  3  1     2.47439994E-06   # R_Spm(3,1)
  3  2    -2.37201731E-08   # R_Spm(3,2)
  3  3    -1.57348311E-10   # R_Spm(3,3)
  3  4    -1.15770990E-02   # R_Spm(3,4)
  3  5    -4.15144876E-10   # R_Spm(3,5)
  3  6     1.07145056E-10   # R_Spm(3,6)
  3  7    -9.99932983E-01   # R_Spm(3,7)
  3  8    -1.30393031E-09   # R_Spm(3,8)
  4  1    -1.19575947E-08   # R_Spm(4,1)
  4  2     7.26793207E-11   # R_Spm(4,2)
  4  3    -5.60042176E-05   # R_Spm(4,3)
  4  4    -2.00790165E-12   # R_Spm(4,4)
  4  5     2.00429840E-12   # R_Spm(4,5)
  4  6    -9.99999998E-01   # R_Spm(4,6)
  4  7    -1.07149771E-10   # R_Spm(4,7)
  4  8     6.25641292E-12   # R_Spm(4,8)
  5  1    -2.12494791E-04   # R_Spm(5,1)
  5  2     1.46153721E-06   # R_Spm(5,2)
  5  3    -9.99999964E-01   # R_Spm(5,3)
  5  4    -1.53825215E-04   # R_Spm(5,4)
  5  5     6.21218689E-07   # R_Spm(5,5)
  5  6     5.60042182E-05   # R_Spm(5,6)
  5  7     1.78060060E-06   # R_Spm(5,7)
  5  8    -1.09656418E-07   # R_Spm(5,8)
  6  1    -2.12705266E-04   # R_Spm(6,1)
  6  2     2.22318438E-06   # R_Spm(6,2)
  6  3    -1.53790318E-04   # R_Spm(6,3)
  6  4     9.99932949E-01   # R_Spm(6,4)
  6  5     6.23856948E-07   # R_Spm(6,5)
  6  6     8.61468275E-09   # R_Spm(6,6)
  6  7    -1.15770992E-02   # R_Spm(6,7)
  6  8    -1.10140577E-07   # R_Spm(6,8)
  7  1     2.08508169E-04   # R_Spm(7,1)
  7  2    -8.01239581E-07   # R_Spm(7,2)
  7  3     5.86578139E-07   # R_Spm(7,3)
  7  4    -5.88991643E-07   # R_Spm(7,4)
  7  5     9.83123834E-01   # R_Spm(7,5)
  7  6    -3.45182465E-11   # R_Spm(7,6)
  7  7     7.16565031E-09   # R_Spm(7,7)
  7  8    -1.82941203E-01   # R_Spm(7,8)
  8  1    -9.86393855E-01   # R_Spm(8,1)
  8  2    -1.64398999E-01   # R_Spm(8,2)
  8  3     2.09395634E-04   # R_Spm(8,3)
  8  4    -2.09427790E-04   # R_Spm(8,4)
  8  5     2.09102590E-04   # R_Spm(8,5)
  8  6     5.59118028E-11   # R_Spm(8,6)
  8  7    -1.22679932E-08   # R_Spm(8,7)
  8  8     1.88759629E-07   # R_Spm(8,8)
Block stopmix  # stop mixing matrix
  1  1     5.32420528E-01   # R_st(1,1)
  1  2     8.46479995E-01   # R_st(1,2)
  2  1    -8.46479995E-01   # R_st(2,1)
  2  2     5.32420528E-01   # R_st(2,2)
Block sbotmix  # sbottom mixing matrix
  1  1     9.82832601E-01   # R_sb(1,1)
  1  2     1.84499533E-01   # R_sb(1,2)
  2  1    -1.84499533E-01   # R_sb(2,1)
  2  2     9.82832601E-01   # R_sb(2,2)
Block RVNmix  # neutralino mixing matrix
  1  1     1.73308345E-09   # N(1,1)  
  1  2    -1.65901318E-09   # N(1,2)  
  1  3    -2.28396205E-05   # N(1,3)  
  1  4    -1.37131416E-10   # N(1,4)  
  1  5     7.80479719E-01   # N(1,5)  
  1  6     4.26486835E-01   # N(1,6)  
  1  7    -4.57121851E-01   # N(1,7)  
  2  1     4.01526114E-09   # N(2,1)  
  2  2    -1.10820712E-08   # N(2,2)  
  2  3     3.82828775E-04   # N(2,3)  
  2  4    -1.12064283E-09   # N(2,4)  
  2  5     6.24204004E-01   # N(2,5)  
  2  6    -5.72459333E-01   # N(2,6)  
  2  7     5.31657340E-01   # N(2,7)  
  3  1     3.83060302E-07   # N(3,1)  
  3  2    -3.57713378E-07   # N(3,2)  
  3  3     1.06487722E-05   # N(3,3)  
  3  4    -1.56226241E-08   # N(3,4)  
  3  5     3.49388138E-02   # N(3,5)  
  3  6     7.00285115E-01   # N(3,6)  
  3  7     7.13007739E-01   # N(3,7)  
  4  1     9.91965893E-01   # N(4,1)  
  4  2    -3.59004611E-02   # N(4,2)  
  4  3     1.12271971E-01   # N(4,3)  
  4  4    -4.59328413E-02   # N(4,4)  
  4  5    -2.48872159E-05   # N(4,5)  
  4  6     2.45874154E-05   # N(4,6)  
  4  7    -2.51578928E-05   # N(4,7)  
  5  1     6.61482615E-02   # N(5,1)  
  5  2     9.63661288E-01   # N(5,2)  
  5  3    -2.21611092E-01   # N(5,3)  
  5  4     1.33678142E-01   # N(5,4)  
  5  5     4.91079561E-05   # N(5,5)  
  5  6    -4.88533090E-05   # N(5,6)  
  5  7     4.93358202E-05   # N(5,7)  
  6  1    -4.39463156E-02   # N(6,1)  
  6  2     6.54268531E-02   # N(6,2)  
  6  3     6.99707601E-01   # N(6,3)  
  6  4     7.10068482E-01   # N(6,4)  
  6  5    -1.54988795E-04   # N(6,5)  
  6  6     1.54976638E-04   # N(6,6)  
  6  7    -1.54994676E-04   # N(6,7)  
  7  1    -9.84723071E-02   # N(7,1)  
  7  2     2.56490556E-01   # N(7,2)  
  7  3     6.69845246E-01   # N(7,3)  
  7  4    -6.89799304E-01   # N(7,4)  
  7  5    -1.48370996E-04   # N(7,5)  
  7  6     1.48410819E-04   # N(7,6)  
  7  7    -1.48329828E-04   # N(7,7)  
Block RVUmix  # chargino-lepton U mixing matrix
  1  1     1.62086796E-08   # U(1,1)  
  1  2    -2.21505170E-04   # U(1,2)  
  1  3    -9.99999975E-01   # U(1,3)  
  1  4    -5.00717051E-08   # U(1,4)  
  1  5     4.80615500E-08   # U(1,5)  
  2  1     3.62258500E-07   # U(2,1)  
  2  2     2.21415515E-04   # U(2,2)  
  2  3     1.02702634E-09   # U(2,3)  
  2  4    -9.99999975E-01   # U(2,4)  
  2  5    -4.82161653E-08   # U(2,5)  
  3  1    -3.62352974E-07   # U(3,1)  
  3  2     2.21587271E-04   # U(3,2)  
  3  3    -1.02118322E-09   # U(3,3)  
  3  4     8.46564278E-10   # U(3,4)  
  3  5     9.99999975E-01   # U(3,5)  
  4  1    -9.49583146E-01   # U(4,1)  
  4  2     3.13515285E-01   # U(4,2)  
  4  3    -6.94606566E-05   # U(4,3)  
  4  4     6.90731587E-05   # U(4,4)  
  4  5    -6.98150824E-05   # U(4,5)  
  5  1    -3.13515308E-01   # U(5,1)  
  5  2    -9.49583076E-01   # U(5,2)  
  5  3     2.10332505E-04   # U(5,3)  
  5  4    -2.10366014E-04   # U(5,4)  
  5  5     2.10301924E-04   # U(5,5)  
Block RVVmix  # chargino-lepton V mixing matrix
  1  1     1.46583424E-13   # V(1,1)  
  1  2    -2.34827963E-13   # V(1,2)  
  1  3    -1.00000000E+00   # V(1,3)  
  1  4    -2.41918995E-10   # V(1,4)  
  1  5     1.38075679E-11   # V(1,5)  
  2  1     6.77163920E-10   # V(2,1)  
  2  2    -1.08520352E-09   # V(2,2)  
  2  3     2.41918993E-10   # V(2,3)  
  2  4    -1.00000000E+00   # V(2,4)  
  2  5    -2.92761468E-09   # V(2,5)  
  3  1    -1.13897358E-08   # V(3,1)  
  3  2     1.82517963E-08   # V(3,2)  
  3  3     1.38075686E-11   # V(3,3)  
  3  4    -2.92761470E-09   # V(3,4)  
  3  5     1.00000000E+00   # V(3,5)  
  4  1    -9.82335333E-01   # V(4,1)  
  4  2     1.87129083E-01   # V(4,2)  
  4  3    -1.87838695E-13   # V(4,3)  
  4  4    -8.68275147E-10   # V(4,4)  
  4  5    -1.46039818E-08   # V(4,5)  
  5  1    -1.87129083E-01   # V(5,1)  
  5  2    -9.82335333E-01   # V(5,2)  
  5  3     2.03268712E-13   # V(5,3)  
  5  4     9.39316684E-10   # V(5,4)  
  5  5     1.57980336E-08   # V(5,5)  
DECAY   2000001     3.43587711E-01   # ~d_R
#    BR                NDA      ID1      ID2
    9.93787057E-01    2     1000022         1   # BR(~d_R -> chi_10 d)
    3.66753208E-03    2     1000023         1   # BR(~d_R -> chi_20 d)
    4.77748434E-04    2     1000025         1   # BR(~d_R -> chi_30 d)
    2.06546395E-03    2     1000035         1   # BR(~d_R -> chi_40 d)
    2.19088204E-06    2    -1000024         2   # BR(~d_R -> chi_1- u)
DECAY   1000001     6.26529981E+00   # ~d_L
#    BR                NDA      ID1      ID2
    2.03426215E-02    2     1000022         1   # BR(~d_L -> chi_10 d)
    3.17444176E-01    2     1000023         1   # BR(~d_L -> chi_20 d)
    6.47940067E-04    2     1000025         1   # BR(~d_L -> chi_30 d)
    7.95969947E-03    2     1000035         1   # BR(~d_L -> chi_40 d)
    6.32939493E-01    2    -1000024         2   # BR(~d_L -> chi_1- u)
    2.06660700E-02    2    -1000037         2   # BR(~d_L -> chi_2- u)
DECAY   2000003     3.43921057E-01   # ~s_R
#    BR                NDA      ID1      ID2
    9.92820325E-01    2     1000022         3   # BR(~s_R -> chi_10 s)
    3.98346946E-03    2     1000023         3   # BR(~s_R -> chi_20 s)
    4.87745011E-04    2     1000025         3   # BR(~s_R -> chi_30 s)
    2.06306301E-03    2     1000035         3   # BR(~s_R -> chi_40 s)
    6.43172480E-04    2    -1000024         4   # BR(~s_R -> chi_1- c)
    2.22468118E-06    2    -1000037         4   # BR(~s_R -> chi_2- c)
DECAY   1000003     6.26499698E+00   # ~s_L
#    BR                NDA      ID1      ID2
    2.03437205E-02    2     1000022         3   # BR(~s_L -> chi_10 s)
    3.17440871E-01    2     1000023         3   # BR(~s_L -> chi_20 s)
    6.49478374E-04    2     1000025         3   # BR(~s_L -> chi_30 s)
    7.96197856E-03    2     1000035         3   # BR(~s_L -> chi_40 s)
    6.32926028E-01    2    -1000024         4   # BR(~s_L -> chi_1- c)
    2.06779240E-02    2    -1000037         4   # BR(~s_L -> chi_2- c)
DECAY   1000005     6.25393702E+00   # ~b_1
#    BR                NDA      ID1      ID2
    2.08696509E-02    2     1000022         5   # BR(~b_1 -> chi_10 b)
    2.63656871E-01    2     1000023         5   # BR(~b_1 -> chi_20 b)
    1.13625819E-03    2     1000025         5   # BR(~b_1 -> chi_30 b)
    4.00156596E-03    2     1000035         5   # BR(~b_1 -> chi_40 b)
    3.83238131E-01    2    -1000024         6   # BR(~b_1 -> chi_1- t)
    3.27097521E-01    2     1000006       -24   # BR(~b_1 -> ~t_1 W-)
DECAY   2000005     6.20198081E-01   # ~b_2
#    BR                NDA      ID1      ID2
    5.21849166E-01    2     1000022         5   # BR(~b_2 -> chi_10 b)
    6.38176498E-02    2     1000023         5   # BR(~b_2 -> chi_20 b)
    2.09441868E-02    2     1000025         5   # BR(~b_2 -> chi_30 b)
    2.85752742E-02    2     1000035         5   # BR(~b_2 -> chi_40 b)
    9.52535727E-02    2    -1000024         6   # BR(~b_2 -> chi_1- t)
    2.69560110E-01    2     1000006       -24   # BR(~b_2 -> ~t_1 W-)
DECAY   2000002     1.37682916E+00   # ~u_R
#    BR                NDA      ID1      ID2
    9.93769240E-01    2     1000022         2   # BR(~u_R -> chi_10 u)
    3.66870015E-03    2     1000023         2   # BR(~u_R -> chi_20 u)
    4.80862733E-04    2     1000025         2   # BR(~u_R -> chi_30 u)
    2.08118685E-03    2     1000035         2   # BR(~u_R -> chi_40 u)
DECAY   1000002     6.41621099E+00   # ~u_L
#    BR                NDA      ID1      ID2
    8.99064735E-03    2     1000022         2   # BR(~u_L -> chi_10 u)
    3.23094377E-01    2     1000023         2   # BR(~u_L -> chi_20 u)
    3.70419089E-04    2     1000025         2   # BR(~u_L -> chi_30 u)
    5.63472617E-03    2     1000035         2   # BR(~u_L -> chi_40 u)
    6.54964323E-01    2     1000024         1   # BR(~u_L -> chi_1+ d)
    6.94550762E-03    2     1000037         1   # BR(~u_L -> chi_2+ d)
DECAY   2000004     1.37955873E+00   # ~c_R
#    BR                NDA      ID1      ID2
    9.91299455E-01    2     1000022         4   # BR(~c_R -> chi_10 c)
    4.47591994E-03    2     1000023         4   # BR(~c_R -> chi_20 c)
    5.05120125E-04    2     1000025         4   # BR(~c_R -> chi_30 c)
    2.06872689E-03    2     1000035         4   # BR(~c_R -> chi_40 c)
    1.64980498E-03    2     1000024         3   # BR(~c_R -> chi_1+ s)
DECAY   1000004     6.41355609E+00   # ~c_L
#    BR                NDA      ID1      ID2
    9.09988959E-03    2     1000022         4   # BR(~c_L -> chi_10 c)
    3.23047990E-01    2     1000023         4   # BR(~c_L -> chi_20 c)
    3.71639769E-04    2     1000025         4   # BR(~c_L -> chi_30 c)
    5.64689600E-03    2     1000035         4   # BR(~c_L -> chi_40 c)
    6.54877321E-01    2     1000024         3   # BR(~c_L -> chi_1+ s)
    6.95626389E-03    2     1000037         3   # BR(~c_L -> chi_2+ s)
DECAY   1000006     1.90120766E+00   # ~t_1
#    BR                NDA      ID1      ID2
    2.63625505E-01    2     1000022         6   # BR(~t_1 -> chi_10 t)
    1.29032087E-01    2     1000023         6   # BR(~t_1 -> chi_20 t)
    6.07342406E-01    2     1000024         5   # BR(~t_1 -> chi_1+ b)
DECAY   2000006     8.71939673E+00   # ~t_2
#    BR                NDA      ID1      ID2
    3.13563946E-02    2     1000022         6   # BR(~t_2 -> chi_10 t)
    9.86216567E-02    2     1000023         6   # BR(~t_2 -> chi_20 t)
    2.34893274E-02    2     1000025         6   # BR(~t_2 -> chi_30 t)
    1.17708070E-01    2     1000035         6   # BR(~t_2 -> chi_40 t)
    2.45182018E-01    2     1000024         5   # BR(~t_2 -> chi_1+ b)
    1.19416675E-01    2     1000037         5   # BR(~t_2 -> chi_2+ b)
    2.99223111E-01    2     1000006        23   # BR(~t_2 -> ~t_1 Z)
    6.50027455E-02    2     1000006        25   # BR(~t_2 -> ~t_1 S0_1)
DECAY   1000024     2.10768842E-02   # chi_1+
#    BR                NDA      ID1      ID2
    1.98882511E-01    2     1000022        24   # BR(chi_1+ -> chi_10 W+)
    1.08187832E-01    2          12  -1000015   # BR(chi_1+ -> nu_1 S^+_1)
    1.46345098E-01    2          14  -1000015   # BR(chi_1+ -> nu_2 S^+_1)
    2.63210335E-01    2          16  -1000015   # BR(chi_1+ -> nu_3 S^+_1)
    3.28177343E-04    2          12  -2000013   # BR(chi_1+ -> nu_1 S^+_2)
    5.91271171E-04    2          14  -2000013   # BR(chi_1+ -> nu_2 S^+_2)
    8.84804162E-04    2          16  -2000013   # BR(chi_1+ -> nu_3 S^+_2)
    5.39852957E-02    2         -15   2000016   # BR(chi_1+ -> tau+ P0_1)
    4.34160244E-02    2         -13   2000014   # BR(chi_1+ -> mu+ P0_2)
    4.33812537E-02    2         -11   2000012   # BR(chi_1+ -> e+ P0_3)
    5.39852957E-02    2         -15   1000016   # BR(chi_1+ -> tau+ S0_2)
    4.34160244E-02    2         -13   1000014   # BR(chi_1+ -> mu+ S0_3)
    4.33812537E-02    2         -11   1000012   # BR(chi_1+ -> e+ S0_4)
#    BR                NDA      ID1      ID2       ID3
    2.37376180E-06    3     1000022        -1         2   # BR(chi_1+ -> chi_10 d u)
    2.37271692E-06    3     1000022        -3         4   # BR(chi_1+ -> chi_10 s c)
DECAY   1000037     3.54696649E+00   # chi_2+
#    BR                NDA      ID1      ID2
    3.02021056E-02    2    -1000005         6   # BR(chi_2+ -> ~b_1 t)
    7.61502612E-02    2     1000022        24   # BR(chi_2+ -> chi_10 W+)
    2.68581109E-01    2     1000023        24   # BR(chi_2+ -> chi_20 W+)
    8.49513454E-05    2          12  -1000015   # BR(chi_2+ -> nu_1 S^+_1)
    1.14913256E-04    2          14  -1000015   # BR(chi_2+ -> nu_2 S^+_1)
    2.06678249E-04    2          16  -1000015   # BR(chi_2+ -> nu_3 S^+_1)
    1.98435907E-02    2          12  -1000011   # BR(chi_2+ -> nu_1 S^+_4)
    1.26868507E-02    2          14  -1000011   # BR(chi_2+ -> nu_2 S^+_4)
    4.00039521E-05    2          16  -1000011   # BR(chi_2+ -> nu_3 S^+_4)
    5.92225330E-03    2          12  -1000013   # BR(chi_2+ -> nu_1 S^+_5)
    1.06796071E-02    2          14  -1000013   # BR(chi_2+ -> nu_2 S^+_5)
    1.59758687E-02    2          16  -1000013   # BR(chi_2+ -> nu_3 S^+_5)
    7.22758699E-03    2          12  -2000015   # BR(chi_2+ -> nu_1 S^+_6)
    9.77675215E-03    2          14  -2000015   # BR(chi_2+ -> nu_2 S^+_6)
    1.75840035E-02    2          16  -2000015   # BR(chi_2+ -> nu_3 S^+_6)
    2.58818446E-01    2     1000024        23   # BR(chi_2+ -> chi_1+ Z)
    7.56937308E-03    2         -15   2000016   # BR(chi_2+ -> tau+ P0_1)
    6.20903743E-03    2         -13   2000014   # BR(chi_2+ -> mu+ P0_2)
    6.20422692E-03    2         -11   2000012   # BR(chi_2+ -> e+ P0_3)
    2.25775565E-01    2     1000024        25   # BR(chi_2+ -> chi_1+ S0_1)
    7.56937308E-03    2         -15   1000016   # BR(chi_2+ -> tau+ S0_2)
    6.20903743E-03    2         -13   1000014   # BR(chi_2+ -> mu+ S0_3)
    6.20422691E-03    2         -11   1000012   # BR(chi_2+ -> e+ S0_4)
#    BR                NDA      ID1      ID2       ID3
    1.88861629E-04    3     1000022        -5         6   # BR(chi_2+ -> chi_10 b t)
    1.65664163E-06    3     1000023        -1         2   # BR(chi_2+ -> chi_20 d u)
    1.65608198E-06    3     1000023        -3         4   # BR(chi_2+ -> chi_20 s c)
    1.42980580E-04    3     1000023        -5         6   # BR(chi_2+ -> chi_20 b t)
    3.74604815E-06    3     1000024        -2         2   # BR(chi_2+ -> chi_1+ u u)
    3.74390508E-06    3     1000024        -4         4   # BR(chi_2+ -> chi_1+ c c)
    1.48429054E-06    3     1000024        -1         1   # BR(chi_2+ -> chi_1+ d d)
    1.48527099E-06    3     1000024        -3         3   # BR(chi_2+ -> chi_1+ s s)
    1.64086337E-05    3     1000024        -5         5   # BR(chi_2+ -> chi_1+ b b)
DECAY   1000022     3.69199700E-13   # chi_10
#    BR                NDA      ID1      ID2
    2.49145306E-04    2         -11       -24   # BR(chi_10 -> e+ W-)
    2.49145306E-04    2          11        24   # BR(chi_10 -> e- W+)
    5.16520716E-02    2         -13       -24   # BR(chi_10 -> mu+ W-)
    5.16520716E-02    2          13        24   # BR(chi_10 -> mu- W+)
    5.51287798E-02    2         -15       -24   # BR(chi_10 -> tau+ W-)
    5.51287798E-02    2          15        24   # BR(chi_10 -> tau- W+)
    1.71476999E-06    2          12        23   # BR(chi_10 -> nu_1 Z)
    1.07437037E-05    2          14        23   # BR(chi_10 -> nu_2 Z)
    8.30666307E-02    2          16        23   # BR(chi_10 -> nu_3 Z)
    2.61589344E-05    2          12        25   # BR(chi_10 -> nu_1 S0_1)
    5.01739319E-03    2          14        25   # BR(chi_10 -> nu_2 S0_1)
    1.00239495E-02    2          16        25   # BR(chi_10 -> nu_3 S0_1)
    5.98792041E-06    2          14        22   # BR(chi_10 -> nu_2 photon)
    2.72071695E-06    2          16        22   # BR(chi_10 -> nu_3 photon)
#    BR                NDA      ID1      ID2       ID3
    5.48709235E-06    3         -15         3        -4   # BR(chi_10 -> tau+ s c)
    5.48709235E-06    3          15        -3         4   # BR(chi_10 -> tau- s c)
    3.41437032E-04    3          12        -5         5   # BR(chi_10 -> nu_1 b b)
    5.13638727E-05    3          14        -3         3   # BR(chi_10 -> nu_2 s s)
    9.14072935E-02    3          14        -5         5   # BR(chi_10 -> nu_2 b b)
    7.91055454E-05    3          16        -5         5   # BR(chi_10 -> nu_3 b b)
    1.95950090E-05    3          12       -11        11   # BR(chi_10 -> nu_1 e+ e-)
    2.32498088E-04    3          12        13       -11   # BR(chi_10 -> nu_1 mu+ e-)
    2.32498088E-04    3          12       -13        11   # BR(chi_10 -> nu_1 e+ mu-)
    9.48241849E-04    3          12       -13        13   # BR(chi_10 -> nu_1 mu+ mu-)
    7.41901720E-02    3          12        15       -11   # BR(chi_10 -> nu_1 tau+ e-)
    7.41901720E-02    3          12       -15        11   # BR(chi_10 -> nu_1 e+ tau-)
    7.41033990E-02    3          12        15       -13   # BR(chi_10 -> nu_1 tau+ mu-)
    7.41033990E-02    3          12       -15        13   # BR(chi_10 -> nu_1 mu+ tau-)
    2.97865686E-01    3          12       -15        15   # BR(chi_10 -> nu_1 tau+ tau-)
DECAY   1000023     2.20721223E-02   # chi_20
#    BR                NDA      ID1      ID2
    2.94298574E-01    2         -15   1000015   # BR(chi_20 -> tau+ S^-_1)
    2.94298574E-01    2          15  -1000015   # BR(chi_20 -> tau- S^+_1)
    3.02336564E-02    2         -13   2000013   # BR(chi_20 -> mu+ S^-_2)
    3.02336564E-02    2          13  -2000013   # BR(chi_20 -> mu- S^+_2)
    2.93108500E-02    2         -11   2000011   # BR(chi_20 -> e+ S^-_3)
    2.93108500E-02    2          11  -2000011   # BR(chi_20 -> e- S^+_3)
    2.35569444E-02    2     1000022        23   # BR(chi_20 -> chi_10 Z)
    1.07230702E-02    2          12   2000016   # BR(chi_20 -> nu_1 P0_1)
    1.45048971E-02    2          14   2000016   # BR(chi_20 -> nu_2 P0_1)
    2.60881871E-02    2          16   2000016   # BR(chi_20 -> nu_3 P0_1)
    7.38626058E-03    2          12   2000014   # BR(chi_20 -> nu_1 P0_2)
    1.32729469E-02    2          14   2000014   # BR(chi_20 -> nu_2 P0_2)
    1.98823847E-02    2          16   2000014   # BR(chi_20 -> nu_3 P0_2)
    2.46618058E-02    2          12   2000012   # BR(chi_20 -> nu_1 P0_3)
    1.57952214E-02    2          14   2000012   # BR(chi_20 -> nu_2 P0_3)
    4.85660618E-05    2          16   2000012   # BR(chi_20 -> nu_3 P0_3)
    1.07230702E-02    2          12   1000016   # BR(chi_20 -> nu_1 S0_2)
    1.45048971E-02    2          14   1000016   # BR(chi_20 -> nu_2 S0_2)
    2.60881871E-02    2          16   1000016   # BR(chi_20 -> nu_3 S0_2)
    7.38626453E-03    2          12   1000014   # BR(chi_20 -> nu_1 S0_3)
    1.32729427E-02    2          14   1000014   # BR(chi_20 -> nu_2 S0_3)
    1.98823850E-02    2          16   1000014   # BR(chi_20 -> nu_3 S0_3)
    2.46618019E-02    2          12   1000012   # BR(chi_20 -> nu_1 S0_4)
    1.57952257E-02    2          14   1000012   # BR(chi_20 -> nu_2 S0_4)
    4.85657754E-05    2          16   1000012   # BR(chi_20 -> nu_3 S0_4)
    3.98969643E-06    2     1000022        22   # BR(chi_20 -> chi_10 photon)
#    BR                NDA      ID1      ID2       ID3
    1.17794900E-06    3     1000022        -4         4   # BR(chi_20 -> chi_10 c c)
    1.56257723E-06    3     1000022        -1         1   # BR(chi_20 -> chi_10 d d)
    1.56729130E-06    3     1000022        -3         3   # BR(chi_20 -> chi_10 s s)
    1.09192446E-05    3     1000022        -5         5   # BR(chi_20 -> chi_10 b b)
    1.38105469E-03    3          12   1000024        13   # BR(chi_20 -> nu_1 mu+ chi_1-)
    1.38053411E-03    3          12  -1000037       -11   # BR(chi_20 -> nu_1 chi_2+ e-)
    1.24858261E-03    3          12   1000037        15   # BR(chi_20 -> nu_1 tau+ chi_2-)
DECAY   1000025     2.97217039E+00   # chi_30
#    BR                NDA      ID1      ID2
    2.92242381E-01    2     1000024       -24   # BR(chi_30 -> chi_1+ W-)
    2.92242381E-01    2    -1000024        24   # BR(chi_30 -> chi_1- W+)
    2.07110539E-03    2         -15   1000015   # BR(chi_30 -> tau+ S^-_1)
    2.07110539E-03    2          15  -1000015   # BR(chi_30 -> tau- S^+_1)
    6.21610974E-04    2         -13   2000013   # BR(chi_30 -> mu+ S^-_2)
    6.21610974E-04    2          13  -2000013   # BR(chi_30 -> mu- S^+_2)
    6.16755711E-04    2         -11   2000011   # BR(chi_30 -> e+ S^-_3)
    6.16755711E-04    2          11  -2000011   # BR(chi_30 -> e- S^+_3)
    3.06084887E-04    2         -11   1000011   # BR(chi_30 -> e+ S^-_4)
    3.06084887E-04    2          11  -1000011   # BR(chi_30 -> e- S^+_4)
    3.13810201E-04    2         -13   1000013   # BR(chi_30 -> mu+ S^-_5)
    3.13810201E-04    2          13  -1000013   # BR(chi_30 -> mu- S^+_5)
    2.43150093E-03    2         -15   2000015   # BR(chi_30 -> tau+ S^-_6)
    2.43150093E-03    2          15  -2000015   # BR(chi_30 -> tau- S^+_6)
    1.04109633E-01    2     1000022        23   # BR(chi_30 -> chi_10 Z)
    2.57752307E-01    2     1000023        23   # BR(chi_30 -> chi_20 Z)
    3.36037248E-04    2          12   2000016   # BR(chi_30 -> nu_1 P0_1)
    4.54551320E-04    2          14   2000016   # BR(chi_30 -> nu_2 P0_1)
    8.17545950E-04    2          16   2000016   # BR(chi_30 -> nu_3 P0_1)
    2.91963456E-04    2          12   2000014   # BR(chi_30 -> nu_1 P0_2)
    5.24651874E-04    2          14   2000014   # BR(chi_30 -> nu_2 P0_2)
    7.85909148E-04    2          16   2000014   # BR(chi_30 -> nu_3 P0_2)
    9.75683935E-04    2          12   2000012   # BR(chi_30 -> nu_1 P0_3)
    6.24899243E-04    2          14   2000012   # BR(chi_30 -> nu_2 P0_3)
    1.92139727E-06    2          16   2000012   # BR(chi_30 -> nu_3 P0_3)
    1.69060273E-02    2     1000022        25   # BR(chi_30 -> chi_10 S0_1)
    1.41707789E-02    2     1000023        25   # BR(chi_30 -> chi_20 S0_1)
    3.36037248E-04    2          12   1000016   # BR(chi_30 -> nu_1 S0_2)
    4.54551320E-04    2          14   1000016   # BR(chi_30 -> nu_2 S0_2)
    8.17545951E-04    2          16   1000016   # BR(chi_30 -> nu_3 S0_2)
    2.91963612E-04    2          12   1000014   # BR(chi_30 -> nu_1 S0_3)
    5.24651707E-04    2          14   1000014   # BR(chi_30 -> nu_2 S0_3)
    7.85909159E-04    2          16   1000014   # BR(chi_30 -> nu_3 S0_3)
    9.75683779E-04    2          12   1000012   # BR(chi_30 -> nu_1 S0_4)
    6.24899410E-04    2          14   1000012   # BR(chi_30 -> nu_2 S0_4)
    1.92138594E-06    2          16   1000012   # BR(chi_30 -> nu_3 S0_4)
    1.00457668E-05    2     1000023        22   # BR(chi_30 -> chi_20 photon)
#    BR                NDA      ID1      ID2       ID3
    9.93758970E-05    3     1000024         5        -6   # BR(chi_30 -> chi_1+ b t)
    9.93758970E-05    3    -1000024        -5         6   # BR(chi_30 -> chi_1- b t)
    1.32559713E-06    3     1000022        -5         5   # BR(chi_30 -> chi_10 b b)
    1.37911099E-06    3     1000023        -5         5   # BR(chi_30 -> chi_20 b b)
    2.01249595E-06    3     1000023       -11        11   # BR(chi_30 -> chi_20 e+ e-)
    2.01249595E-06    3     1000023       -13        11   # BR(chi_30 -> chi_20 mu+ e-)
    2.01198859E-06    3     1000023        13       -11   # BR(chi_30 -> chi_20 mu- e+)
    2.01198859E-06    3     1000023       -13        13   # BR(chi_30 -> chi_20 mu+ mu-)
    1.88677190E-06    3     1000023       -15        11   # BR(chi_30 -> chi_20 tau+ e-)
    1.88677190E-06    3     1000023        15       -11   # BR(chi_30 -> chi_20 tau- e+)
DECAY   1000035     3.78406113E+00   # chi_40
#    BR                NDA      ID1      ID2
    2.80920196E-01    2     1000024       -24   # BR(chi_40 -> chi_1+ W-)
    2.80920196E-01    2    -1000024        24   # BR(chi_40 -> chi_1- W+)
    2.33362859E-03    2         -15   1000015   # BR(chi_40 -> tau+ S^-_1)
    2.33362859E-03    2          15  -1000015   # BR(chi_40 -> tau- S^+_1)
    2.55004590E-03    2         -13   2000013   # BR(chi_40 -> mu+ S^-_2)
    2.55004590E-03    2          13  -2000013   # BR(chi_40 -> mu- S^+_2)
    2.55132134E-03    2         -11   2000011   # BR(chi_40 -> e+ S^-_3)
    2.55132134E-03    2          11  -2000011   # BR(chi_40 -> e- S^+_3)
    6.28845326E-03    2         -11   1000011   # BR(chi_40 -> e+ S^-_4)
    6.28845326E-03    2          11  -1000011   # BR(chi_40 -> e- S^+_4)
    6.29761791E-03    2         -13   1000013   # BR(chi_40 -> mu+ S^-_5)
    6.29761791E-03    2          13  -1000013   # BR(chi_40 -> mu- S^+_5)
    8.75282281E-03    2         -15   2000015   # BR(chi_40 -> tau+ S^-_6)
    8.75282281E-03    2          15  -2000015   # BR(chi_40 -> tau- S^+_6)
    1.58127019E-02    2     1000022        23   # BR(chi_40 -> chi_10 Z)
    1.66612393E-02    2     1000023        23   # BR(chi_40 -> chi_20 Z)
    3.37791449E-03    2          12   2000016   # BR(chi_40 -> nu_1 P0_1)
    4.56924195E-03    2          14   2000016   # BR(chi_40 -> nu_2 P0_1)
    8.21813750E-03    2          16   2000016   # BR(chi_40 -> nu_3 P0_1)
    2.93567438E-03    2          12   2000014   # BR(chi_40 -> nu_1 P0_2)
    5.27534194E-03    2          14   2000014   # BR(chi_40 -> nu_2 P0_2)
    7.90226757E-03    2          16   2000014   # BR(chi_40 -> nu_3 P0_2)
    9.81045074E-03    2          12   2000012   # BR(chi_40 -> nu_1 P0_3)
    6.28332908E-03    2          14   2000012   # BR(chi_40 -> nu_2 P0_3)
    1.93195486E-05    2          16   2000012   # BR(chi_40 -> nu_3 P0_3)
    7.05074375E-02    2     1000022        25   # BR(chi_40 -> chi_10 S0_1)
    1.80363618E-01    2     1000023        25   # BR(chi_40 -> chi_20 S0_1)
    3.37791449E-03    2          12   1000016   # BR(chi_40 -> nu_1 S0_2)
    4.56924194E-03    2          14   1000016   # BR(chi_40 -> nu_2 S0_2)
    8.21813751E-03    2          16   1000016   # BR(chi_40 -> nu_3 S0_2)
    2.93567595E-03    2          12   1000014   # BR(chi_40 -> nu_1 S0_3)
    5.27534026E-03    2          14   1000014   # BR(chi_40 -> nu_2 S0_3)
    7.90226768E-03    2          16   1000014   # BR(chi_40 -> nu_3 S0_3)
    9.81044917E-03    2          12   1000012   # BR(chi_40 -> nu_1 S0_4)
    6.28333076E-03    2          14   1000012   # BR(chi_40 -> nu_2 S0_4)
    1.93194347E-05    2          16   1000012   # BR(chi_40 -> nu_3 S0_4)
    9.08344752E-06    2     1000023        22   # BR(chi_40 -> chi_20 photon)
#    BR                NDA      ID1      ID2       ID3
    1.47027921E-06    3     1000024         1        -2   # BR(chi_40 -> chi_1+ d u)
    1.47027921E-06    3    -1000024        -1         2   # BR(chi_40 -> chi_1- d u)
    1.47004708E-06    3     1000024         3        -4   # BR(chi_40 -> chi_1+ s c)
    1.47004708E-06    3    -1000024        -3         4   # BR(chi_40 -> chi_1- s c)
    1.23651216E-04    3     1000024         5        -6   # BR(chi_40 -> chi_1+ b t)
    1.23651216E-04    3    -1000024        -5         6   # BR(chi_40 -> chi_1- b t)
    3.13360373E-06    3     1000022        -6         6   # BR(chi_40 -> chi_10 t t)
    1.38483067E-06    3     1000022        -5         5   # BR(chi_40 -> chi_10 b b)
    1.54957323E-06    3     1000023        -2         2   # BR(chi_40 -> chi_20 u u)
    1.54845639E-06    3     1000023        -4         4   # BR(chi_40 -> chi_20 c c)
    1.88840219E-06    3     1000023        -1         1   # BR(chi_40 -> chi_20 d d)
    1.88879003E-06    3     1000023        -3         3   # BR(chi_40 -> chi_20 s s)
    4.35395483E-06    3     1000023        -5         5   # BR(chi_40 -> chi_20 b b)
    2.16787957E-05    3     1000023       -11        11   # BR(chi_40 -> chi_20 e+ e-)
    2.16787957E-05    3     1000023       -13        11   # BR(chi_40 -> chi_20 mu+ e-)
    2.16785888E-05    3     1000023        13       -11   # BR(chi_40 -> chi_20 mu- e+)
    2.16785888E-05    3     1000023       -13        13   # BR(chi_40 -> chi_20 mu+ mu-)
    2.14629335E-05    3     1000023       -15        11   # BR(chi_40 -> chi_20 tau+ e-)
    2.14629335E-05    3     1000023        15       -11   # BR(chi_40 -> chi_20 tau- e+)
    7.41147047E-05    3     1000025        12        12   # BR(chi_40 -> chi_30 nu_1 nu_1)
DECAY   1000021     7.35930508E+00   # ~g
#    BR                NDA      ID1      ID2
    4.05181342E-02    2     2000002        -2   # BR(~g -> ~u_R u^*)
    4.05181342E-02    2    -2000002         2   # BR(~g -> ~u_R u)
    2.02504590E-02    2     1000002        -2   # BR(~g -> ~u_L u^*)
    2.02504590E-02    2    -1000002         2   # BR(~g -> ~u_L u)
    4.04949744E-02    2     2000004        -4   # BR(~g -> ~c_R c^*)
    4.04949744E-02    2    -2000004         4   # BR(~g -> ~c_R c)
    2.02607440E-02    2     1000004        -4   # BR(~g -> ~c_L c^*)
    2.02607440E-02    2    -1000004         4   # BR(~g -> ~c_L c)
    1.20982997E-01    2     1000006        -6   # BR(~g -> ~t_1 t^*)
    1.20982997E-01    2    -1000006         6   # BR(~g -> ~t_1 t)
    4.16182359E-02    2     2000001        -1   # BR(~g -> ~d_R d^*)
    4.16182359E-02    2    -2000001         1   # BR(~g -> ~d_R d)
    1.69216894E-02    2     1000001        -1   # BR(~g -> ~d_L d^*)
    1.69216894E-02    2    -1000001         1   # BR(~g -> ~d_L d)
    4.16197777E-02    2     2000003        -3   # BR(~g -> ~s_R s^*)
    4.16197777E-02    2    -2000003         3   # BR(~g -> ~s_R s)
    1.69228057E-02    2     1000003        -3   # BR(~g -> ~s_L s^*)
    1.69228057E-02    2    -1000003         3   # BR(~g -> ~s_L s)
    9.68766507E-02    2     1000005        -5   # BR(~g -> ~b_1 b^*)
    9.68766507E-02    2    -1000005         5   # BR(~g -> ~b_1 b)
    4.31057559E-02    2     2000005        -5   # BR(~g -> ~b_2 b^*)
    4.31057559E-02    2    -2000005         5   # BR(~g -> ~b_2 b)
    1.58916780E-05    2     1000006        -4   # BR(~g -> ~t_1 c^*)
    1.58916780E-05    2    -1000006         4   # BR(~g -> ~t_1 c)
    4.95048517E-06    2     1000022        21   # BR(~g -> chi_10 gluon)
    3.51182264E-05    2     1000023        21   # BR(~g -> chi_20 gluon)
    4.22342525E-05    2     1000025        21   # BR(~g -> chi_30 gluon)
    7.25753166E-05    2     1000035        21   # BR(~g -> chi_40 gluon)
#    BR                NDA      ID1      ID2       ID3
    4.01363163E-05    3     1000022        -6         6   # BR(~g -> chi_10 t t)
    8.84855952E-05    3     1000023        -6         6   # BR(~g -> chi_20 t t)
    2.28467265E-04    3     1000024         5        -6   # BR(~g -> chi_1+ b t)
    2.28467265E-04    3    -1000024        -5         6   # BR(~g -> chi_1- b t)
    4.16668065E-05    3     1000037         5        -6   # BR(~g -> chi_2+ b t)
    4.16668065E-05    3    -1000037        -5         6   # BR(~g -> chi_2- b t)
DECAY        25     1.98529938E-03   # S0_1      
#    BR                NDA      ID1      ID2
    1.57278108E-06    2          -1         1   # BR(S0_1 -> d d)
    4.62205348E-04    2          -3         3   # BR(S0_1 -> s s)
    8.26538060E-01    2          -5         5   # BR(S0_1 -> b b)
    4.54854417E-02    2          -4         4   # BR(S0_1 -> c c)
    4.39142643E-04    2          13       -13   # BR(S0_1 -> mu- mu+)
    1.24025400E-01    2          15       -15   # BR(S0_1 -> tau- tau+)
# writing decays into V V* as 3-body decays
#    BR                NDA      ID1      ID2       ID3
    6.09576577E-04    3          23        12       -12   # BR(S0_1 -> Z0 nu_i nu_i)
    1.06675901E-04    3          23        11       -11   # BR(S0_1 -> Z0 e- e+)
    1.06675901E-04    3          23        13       -13   # BR(S0_1 -> Z0 mu- mu+)
    9.14364866E-05    3          23        15       -15   # BR(S0_1 -> Z0 tau- tau+)
    4.26703604E-04    3          23         1        -1   # BR(S0_1 -> Z0 d d)
    4.26703604E-04    3          23         3        -3   # BR(S0_1 -> Z0 s s)
    4.26703604E-04    3          23         5        -5   # BR(S0_1 -> Z0 b b)
    4.26703604E-04    3          23         2        -2   # BR(S0_1 -> Z0 u u)
    4.26703604E-04    3          23         4        -4   # BR(S0_1 -> Z0 c c)
DECAY   1000016     1.54858354E-01   # S0_2      
#    BR                NDA      ID1      ID2
    2.08960899E-01    2          12   1000022   # BR(S0_2 -> nu_1 chi_10)
    2.82657511E-01    2          14   1000022   # BR(S0_2 -> nu_2 chi_10)
    5.08381549E-01    2          16   1000022   # BR(S0_2 -> nu_3 chi_10)
DECAY   1000014     1.56167912E-01   # S0_3      
#    BR                NDA      ID1      ID2
    1.82189792E-01    2          12   1000022   # BR(S0_3 -> nu_1 chi_10)
    3.27390749E-01    2          14   1000022   # BR(S0_3 -> nu_2 chi_10)
    4.90419424E-01    2          16   1000022   # BR(S0_3 -> nu_3 chi_10)
DECAY   1000012     1.56172554E-01   # S0_4      
#    BR                NDA      ID1      ID2
    6.08849272E-01    2          12   1000022   # BR(S0_4 -> nu_1 chi_10)
    3.89951703E-01    2          14   1000022   # BR(S0_4 -> nu_2 chi_10)
    1.19898932E-03    2          16   1000022   # BR(S0_4 -> nu_3 chi_10)
DECAY        35     8.25775968E-01   # S0_5      
#    BR                NDA      ID1      ID2
    1.65270461E-04    2          -3         3   # BR(S0_5 -> s s)
    2.96680029E-01    2          -5         5   # BR(S0_5 -> b b)
    1.64444366E-05    2          -4         4   # BR(S0_5 -> c c)
    5.26302786E-01    2          -6         6   # BR(S0_5 -> t t)
    1.33022721E-02    2     1000022   1000022   # BR(S0_5 -> chi_10 chi_10)
    4.69717070E-02    2     1000022   1000023   # BR(S0_5 -> chi_10 chi_20)
    2.11966593E-02    2     1000023   1000023   # BR(S0_5 -> chi_20 chi_20)
    1.54735612E-04    2          13       -13   # BR(S0_5 -> mu- mu+)
    4.37658109E-02    2          15       -15   # BR(S0_5 -> tau- tau+)
    4.86685639E-02    2    -1000024   1000024   # BR(S0_5 -> chi_1- chi_1+)
    2.77515357E-03    2          23        23   # BR(S0_5 -> Z0 Z0)
DECAY   2000016     1.54858354E-01   # P0_1      
#    BR                NDA      ID1      ID2
    2.08960899E-01    2          12   1000022   # BR(P0_1 -> nu_1 chi_10)
    2.82657512E-01    2          14   1000022   # BR(P0_1 -> nu_2 chi_10)
    5.08381549E-01    2          16   1000022   # BR(P0_1 -> nu_3 chi_10)
DECAY   2000014     1.56167912E-01   # P0_2      
#    BR                NDA      ID1      ID2
    1.82189695E-01    2          12   1000022   # BR(P0_2 -> nu_1 chi_10)
    3.27390853E-01    2          14   1000022   # BR(P0_2 -> nu_2 chi_10)
    4.90419417E-01    2          16   1000022   # BR(P0_2 -> nu_3 chi_10)
DECAY   2000012     1.56172554E-01   # P0_3      
#    BR                NDA      ID1      ID2
    6.08849370E-01    2          12   1000022   # BR(P0_3 -> nu_1 chi_10)
    3.89951599E-01    2          14   1000022   # BR(P0_3 -> nu_2 chi_10)
    1.19899639E-03    2          16   1000022   # BR(P0_3 -> nu_3 chi_10)
DECAY        36     1.37726303E+00   # P0_4      
#    BR                NDA      ID1      ID2
    9.93303122E-05    2          -3         3   # BR(P0_4 -> s s)
    1.78319999E-01    2          -5         5   # BR(P0_4 -> b b)
    8.63473898E-06    2          -4         4   # BR(P0_4 -> c c)
    4.60889766E-01    2          -6         6   # BR(P0_4 -> t t)
    1.34530421E-02    2     1000022   1000022   # BR(P0_4 -> chi_10 chi_10)
    6.89830937E-02    2     1000022   1000023   # BR(P0_4 -> chi_10 chi_20)
    7.67587957E-02    2     1000023   1000023   # BR(P0_4 -> chi_20 chi_20)
    9.30002007E-05    2          13       -13   # BR(P0_4 -> mu- mu+)
    2.63056559E-02    2          15       -15   # BR(P0_4 -> tau- tau+)
    1.71872303E-01    2    -1000024   1000024   # BR(P0_4 -> chi_1- chi_1+)
    3.21603871E-03    2          23        25   # BR(P0_4 -> Z0 S0_1)
DECAY   1000015     1.15152412E-01   # S^-_1     
#    BR                NDA      ID1      ID2
    9.99999982E-01    2          15   1000022   # BR(S^-_1 -> tau- chi_10)
DECAY   2000013     1.48011157E-01   # S^-_2     
#    BR                NDA      ID1      ID2
    1.00000000E+00    2          13   1000022   # BR(S^-_2 -> mu- chi_10)
DECAY   2000011     1.48135974E-01   # S^-_3     
#    BR                NDA      ID1      ID2
    1.00000000E+00    2          11   1000022   # BR(S^-_3 -> e- chi_10)
DECAY   1000011     1.53839557E-01   # S^-_4     
#    BR                NDA      ID1      ID2
    9.13463933E-01    2          11   1000022   # BR(S^-_4 -> e- chi_10)
    2.97117760E-02    2          11   1000023   # BR(S^-_4 -> e- chi_20)
    3.46202617E-02    2    -1000024        12   # BR(S^-_4 -> chi_1- nu_1)
    2.21342087E-02    2    -1000024        14   # BR(S^-_4 -> chi_1- nu_2)
    6.97931900E-05    2    -1000024        16   # BR(S^-_4 -> chi_1- nu_3)
DECAY   1000013     1.53921841E-01   # S^-_5     
#    BR                NDA      ID1      ID2
    9.13405932E-01    2          13   1000022   # BR(S^-_5 -> mu- chi_10)
    2.97297519E-02    2          13   1000023   # BR(S^-_5 -> mu- chi_20)
    1.03372676E-02    2    -1000024        12   # BR(S^-_5 -> chi_1- nu_1)
    1.86412117E-02    2    -1000024        14   # BR(S^-_5 -> chi_1- nu_2)
    2.78858091E-02    2    -1000024        16   # BR(S^-_5 -> chi_1- nu_3)
DECAY   2000015     1.75102767E-01   # S^-_6     
#    BR                NDA      ID1      ID2
    8.98573753E-01    2          15   1000022   # BR(S^-_6 -> tau- chi_10)
    3.43543348E-02    2          15   1000023   # BR(S^-_6 -> tau- chi_20)
    1.40153574E-02    2    -1000024        12   # BR(S^-_6 -> chi_1- nu_1)
    1.89585685E-02    2    -1000024        14   # BR(S^-_6 -> chi_1- nu_2)
    3.40979766E-02    2    -1000024        16   # BR(S^-_6 -> chi_1- nu_3)
DECAY       -37     1.64777859E-01   # S^-_7     
#    BR                NDA      ID1      ID2
    1.43169571E-04    2          13        12   # BR(S^-_7 -> mu- nu_1)
    2.57946039E-04    2          13        14   # BR(S^-_7 -> mu- nu_2)
    3.86001801E-04    2          13        16   # BR(S^-_7 -> mu- nu_3)
    4.65231356E-02    2          15        12   # BR(S^-_7 -> tau- nu_1)
    6.29315989E-02    2          15        14   # BR(S^-_7 -> tau- nu_2)
    1.13186204E-01    2          15        16   # BR(S^-_7 -> tau- nu_3)
    7.47251675E-01    2    -1000024   1000022   # BR(S^-_7 -> chi_1- chi_10)
    1.11050510E-03    2    -1000024   1000023   # BR(S^-_7 -> chi_1- chi_20)
Block SPhenoCrossSections  # cross sections
Block SPhenoLowEnergy  # low energy observables
   1    3.86984378E-04   # BR(b -> s gamma)
   2    1.84559853E-06   # BR(b -> s mu+ mu-)
   3    4.59616523E-05   # BR(b -> s nu nu)
   4    4.59015045E-09   # BR(Bs -> mu+ mu-)
   5    7.87385579E-05   # BR(B_u -> tau nu)
   6    2.33972327E-01   # |Delta(M_Bd)| [ps^-1] 
   7    1.69107932E+01   # |Delta(M_Bs)| [ps^-1] 
  10    1.99745345E-14   # Delta(g-2)_electron
  11    1.01540162E-09   # Delta(g-2)_muon
  12    2.12735270E-07   # Delta(g-2)_tau
  13    0.00000000E+00   # electric dipole moment of the electron
  14    0.00000000E+00   # electric dipole moment of the muon
  15    0.00000000E+00   # electric dipole moment of the tau
  16    0.00000000E+00   # Br(mu -> e gamma)
  17    0.00000000E+00   # Br(tau -> e gamma)
  18    0.00000000E+00   # Br(tau -> mu gamma)
  19    0.00000000E+00   # Br(mu -> 3 e)
  20    0.00000000E+00   # Br(tau -> 3 e)
  21    0.00000000E+00   # Br(tau -> 3 mu)
  30    1.74975570E-04   # Delta(rho_parameter)
  40    0.00000000E+00   # BR(Z -> e mu)
  41    0.00000000E+00   # BR(Z -> e tau)
  42    0.00000000E+00   # BR(Z -> mu tau)
