  65
  401    403.8563    0.19964E-23
  402    396.8215    0.25806E-23
  403    403.8563    0.19968E-23
  404    396.8238    0.25808E-23
  405    381.1776    0.16613E-22
  406    357.8764    0.25736E-21
  407    403.8563    0.19964E-23
  408    396.8215    0.25806E-23
  409    403.8563    0.19968E-23
  410    396.8238    0.25808E-23
  411    381.1776    0.16613E-22
  412    357.8764    0.25736E-21
  413    400.7083    0.15081E-22
  414    398.5796    0.38960E-23
  415    400.7084    0.15081E-22
  416    398.5818    0.38964E-23
  417    422.3600    0.51389E-23
  418    484.0762    0.69930E-24
  419    400.7083    0.15081E-22
  420    398.5796    0.38960E-23
  421    400.7084    0.15081E-22
  422    398.5818    0.38964E-23
  423    422.3600    0.51389E-23
  424    484.0762    0.69930E-24
  425   3000.3276    0.16246E-25
  426   2999.3887    0.16236E-25
  427   3000.3276    0.16246E-25
  428   2999.3887    0.16236E-25
  429   2998.6755    0.23744E-25
  430   2999.3887    0.16211E-25
  431   3000.3276    0.16246E-25
  432   2999.3887    0.16236E-25
  433   3000.3276    0.16246E-25
  434   2999.3887    0.16236E-25
  435   2998.6755    0.23744E-25
  436   2999.3887    0.16211E-25
  437   3000.2837    0.44031E-25
  438      0.0000    0.10000E+31
  439   3000.2837    0.44031E-25
  440      0.0000    0.10000E+31
  441   3001.9358    0.23567E-25
  442      0.0000    0.10000E+31
  443   3000.2837    0.44031E-25
  444      0.0000    0.10000E+31
  445   3000.2837    0.44031E-25
  446      0.0000    0.10000E+31
  447   3001.9358    0.23567E-25
  448      0.0000    0.10000E+31
  449   3000.0000    0.91671E-27
  450    299.9830    0.10000E+31
  451    349.9494    0.12594E-17
  452  -1401.2812    0.92762E-26
  453   1405.8237    0.92180E-26
  454    349.8752    0.23145E-18
  455   1405.5004    0.91695E-26
  456    349.8752    0.23145E-18
  457   1405.5004    0.91695E-26
  203     98.4690    0.18824E-21
  204    604.2849    0.42525E-24
  205    600.0000    0.33218E-24
  206    607.8506    0.42030E-24
  207    607.8506    0.42030E-24
  458      0.0000    0.10000E+31
    6    172.5000    0.57395E-24
   12    172.5000    0.57395E-24
   3
   401  0.49803734E-01     0   450     1     0     0     0
   401  0.31354406E+00     0   451     1     0     0     0
   401  0.63665223E+00     0   456     2     0     0     0
   3
   402  0.25855897E-01     0   450     2     0     0     0
   402  0.32620654E+00     0   451     2     0     0     0
   402  0.64793760E+00     0   454     1     0     0     0
   3
   403  0.49815096E-01     0   450     3     0     0     0
   403  0.31361577E+00     0   451     3     0     0     0
   403  0.63656920E+00     0   456     4     0     0     0
   3
   404  0.25855420E-01     0   450     4     0     0     0
   404  0.32610506E+00     0   451     4     0     0     0
   404  0.64803952E+00     0   454     3     0     0     0
   2
   405  0.54408187E+00     0   450     5     0     0     0
   405  0.45591813E+00     0   451     5     0     0     0
   1
   406  0.10000000E+01     0   454     5     0     0     0
   3
   407  0.49803734E-01     0   450     7     0     0     0
   407  0.31354406E+00     0   451     7     0     0     0
   407  0.63665223E+00     0   454     8     0     0     0
   3
   408  0.25855897E-01     0   450     8     0     0     0
   408  0.32620654E+00     0   451     8     0     0     0
   408  0.64793760E+00     0   456     7     0     0     0
   3
   409  0.49815096E-01     0   450     9     0     0     0
   409  0.31361577E+00     0   451     9     0     0     0
   409  0.63656920E+00     0   454    10     0     0     0
   3
   410  0.25855420E-01     0   450    10     0     0     0
   410  0.32610506E+00     0   451    10     0     0     0
   410  0.64803952E+00     0   456     9     0     0     0
   2
   411  0.54408187E+00     0   450    11     0     0     0
   411  0.45591813E+00     0   451    11     0     0     0
   1
   412  0.10000000E+01     0   456    11     0     0     0
   2
   413  0.99955714E+00     0   450     1     0     0     0
   413  0.44287479E-03     0   451     1     0     0     0
   2
   414  0.99957556E+00     0   450     2     0     0     0
   414  0.42442934E-03     0   451     2     0     0     0
   2
   415  0.99955714E+00     0   450     3     0     0     0
   415  0.44287503E-03     0   451     3     0     0     0
   2
   416  0.99957573E+00     0   450     4     0     0     0
   416  0.42431580E-03     0   451     4     0     0     0
   2
   417  0.29671538E+00     0   450     5     0     0     0
   417  0.70328468E+00     0   451     5     0     0     0
   5
   418  0.43059742E+00     0   454     5     0     0     0
   418  0.30072773E+00     0   200   406     0     0     0
   418  0.70822505E-04     0   203   406     0     0     0
   418  0.23481783E+00     0   198   405     0     0     0
   418  0.33786159E-01     0   450     6     0     0     0
   2
   419  0.99955714E+00     0   450     7     0     0     0
   419  0.44287479E-03     0   451     7     0     0     0
   2
   420  0.99957556E+00     0   450     8     0     0     0
   420  0.42442934E-03     0   451     8     0     0     0
   2
   421  0.99955714E+00     0   450     9     0     0     0
   421  0.44287503E-03     0   451     9     0     0     0
   2
   422  0.99957573E+00     0   450    10     0     0     0
   422  0.42431580E-03     0   451    10     0     0     0
   2
   423  0.29671538E+00     0   450    11     0     0     0
   423  0.70328468E+00     0   451    11     0     0     0
   5
   424  0.43059742E+00     0   456    11     0     0     0
   424  0.30072773E+00     0   200   412     0     0     0
   424  0.70822505E-04     0   203   412     0     0     0
   424  0.23481783E+00     0   199   411     0     0     0
   424  0.33786159E-01     0   450    12     0     0     0
   6
   425  0.80250904E-01     0   450   121     0     0     0
   425  0.31450024E+00     0   451   121     0     0     0
   425  0.50336359E-04     0   452   121     0     0     0
   425  0.41193722E-03     0   453   121     0     0     0
   425  0.60177940E+00     0   456   122     0     0     0
   425  0.30071756E-02     0   457   122     0     0     0
   6
   426  0.10450696E+00     0   450   122     0     0     0
   426  0.28835022E+00     0   451   122     0     0     0
   426  0.18231645E-03     0   452   122     0     0     0
   426  0.13449329E-02     0   453   122     0     0     0
   426  0.60494888E+00     0   454   121     0     0     0
   426  0.66671660E-03     0   455   121     0     0     0
   6
   427  0.80250904E-01     0   450   123     0     0     0
   427  0.31450024E+00     0   451   123     0     0     0
   427  0.50336359E-04     0   452   123     0     0     0
   427  0.41193722E-03     0   453   123     0     0     0
   427  0.60177940E+00     0   456   124     0     0     0
   427  0.30071756E-02     0   457   124     0     0     0
   6
   428  0.10450696E+00     0   450   124     0     0     0
   428  0.28835022E+00     0   451   124     0     0     0
   428  0.18231645E-03     0   452   124     0     0     0
   428  0.13449329E-02     0   453   124     0     0     0
   428  0.60494888E+00     0   454   123     0     0     0
   428  0.66671660E-03     0   455   123     0     0     0
   6
   429  0.33119828E+00     0   450   125     0     0     0
   429  0.22937167E+00     0   451   125     0     0     0
   429  0.63509500E-03     0   452   125     0     0     0
   429  0.12577695E-03     0   453   125     0     0     0
   429  0.43849748E+00     0   456   126     0     0     0
   429  0.17169309E-03     0   457   126     0     0     0
   6
   430  0.10434756E+00     0   450   126     0     0     0
   430  0.28791040E+00     0   451   126     0     0     0
   430  0.18203836E-03     0   452   126     0     0     0
   430  0.13428816E-02     0   453   126     0     0     0
   430  0.60404396E+00     0   454   125     0     0     0
   430  0.21730997E-02     0   455   125     0     0     0
   6
   431  0.80250904E-01     0   450   127     0     0     0
   431  0.31450024E+00     0   451   127     0     0     0
   431  0.50336359E-04     0   452   127     0     0     0
   431  0.41193722E-03     0   453   127     0     0     0
   431  0.60177940E+00     0   454   128     0     0     0
   431  0.30071756E-02     0   455   128     0     0     0
   6
   432  0.10450696E+00     0   450   128     0     0     0
   432  0.28835022E+00     0   451   128     0     0     0
   432  0.18231645E-03     0   452   128     0     0     0
   432  0.13449329E-02     0   453   128     0     0     0
   432  0.60494888E+00     0   456   127     0     0     0
   432  0.66671660E-03     0   457   127     0     0     0
   6
   433  0.80250904E-01     0   450   129     0     0     0
   433  0.31450024E+00     0   451   129     0     0     0
   433  0.50336359E-04     0   452   129     0     0     0
   433  0.41193722E-03     0   453   129     0     0     0
   433  0.60177940E+00     0   454   130     0     0     0
   433  0.30071756E-02     0   455   130     0     0     0
   6
   434  0.10450696E+00     0   450   130     0     0     0
   434  0.28835022E+00     0   451   130     0     0     0
   434  0.18231645E-03     0   452   130     0     0     0
   434  0.13449329E-02     0   453   130     0     0     0
   434  0.60494888E+00     0   456   129     0     0     0
   434  0.66671660E-03     0   457   129     0     0     0
   6
   435  0.33119828E+00     0   450   131     0     0     0
   435  0.22937167E+00     0   451   131     0     0     0
   435  0.63509500E-03     0   452   131     0     0     0
   435  0.12577695E-03     0   453   131     0     0     0
   435  0.43849748E+00     0   454   132     0     0     0
   435  0.17169309E-03     0   455   132     0     0     0
   6
   436  0.10434756E+00     0   450   132     0     0     0
   436  0.28791040E+00     0   451   132     0     0     0
   436  0.18203836E-03     0   452   132     0     0     0
   436  0.13428816E-02     0   453   132     0     0     0
   436  0.60404396E+00     0   456   131     0     0     0
   436  0.21730997E-02     0   457   131     0     0     0
   4
   437  0.99765384E+00     0   450   121     0     0     0
   437  0.15055790E-02     0   451   121     0     0     0
   437  0.11157479E-03     0   452   121     0     0     0
   437  0.72898355E-03     0   453   121     0     0     0
   0
   4
   439  0.99765384E+00     0   450   123     0     0     0
   439  0.15055790E-02     0   451   123     0     0     0
   439  0.11157479E-03     0   452   123     0     0     0
   439  0.72898355E-03     0   453   123     0     0     0
   0
   6
   441  0.32167161E+00     0   450   125     0     0     0
   441  0.22939852E+00     0   451   125     0     0     0
   441  0.17135269E-02     0   452   125     0     0     0
   441  0.30585343E-02     0   453   125     0     0     0
   441  0.43776801E+00     0   456   126     0     0     0
   441  0.63898293E-02     0   457   126     0     0     0
   0
   4
   443  0.99765384E+00     0   450   127     0     0     0
   443  0.15055790E-02     0   451   127     0     0     0
   443  0.11157479E-03     0   452   127     0     0     0
   443  0.72898355E-03     0   453   127     0     0     0
   0
   4
   445  0.99765384E+00     0   450   129     0     0     0
   445  0.15055790E-02     0   451   129     0     0     0
   445  0.11157479E-03     0   452   129     0     0     0
   445  0.72898355E-03     0   453   129     0     0     0
   0
   6
   447  0.32167161E+00     0   450   131     0     0     0
   447  0.22939852E+00     0   451   131     0     0     0
   447  0.17135269E-02     0   452   131     0     0     0
   447  0.30585343E-02     0   453   131     0     0     0
   447  0.43776801E+00     0   454   132     0     0     0
   447  0.63898293E-02     0   455   132     0     0     0
   0
  24
   449  0.41732512E-01     0   408     2     0     0     0
   449  0.41732512E-01     0   402     8     0     0     0
   449  0.41679364E-01     0   407     1     0     0     0
   449  0.41679364E-01     0   401     7     0     0     0
   449  0.41719314E-01     0   420     2     0     0     0
   449  0.41719314E-01     0   414     8     0     0     0
   449  0.41703254E-01     0   419     1     0     0     0
   449  0.41703254E-01     0   413     7     0     0     0
   449  0.41679364E-01     0   409     3     0     0     0
   449  0.41679364E-01     0   403     9     0     0     0
   449  0.41703254E-01     0   421     3     0     0     0
   449  0.41703254E-01     0   415     9     0     0     0
   449  0.41732494E-01     0   410     4     0     0     0
   449  0.41732494E-01     0   404    10     0     0     0
   449  0.41719295E-01     0   422     4     0     0     0
   449  0.41719295E-01     0   416    10     0     0     0
   449  0.41706108E-01     0   411     5     0     0     0
   449  0.41706108E-01     0   405    11     0     0     0
   449  0.41676104E-01     0   423     5     0     0     0
   449  0.41676104E-01     0   417    11     0     0     0
   449  0.37122231E-01     0   412     6     0     0     0
   449  0.37122231E-01     0   406    12     0     0     0
   449  0.45826700E-01     0   424     6     0     0     0
   449  0.45826700E-01     0   418    12     0     0     0
   0
  12
   451  0.17745763E-01     0   450    59     0     0     0
   451  0.12842071E+00     0   450     2     8     0     0
   451  0.21741119E+00     0   450     1     7     0     0
   451  0.21741098E+00     0   450     3     9     0     0
   451  0.12841205E+00     0   450     4    10     0     0
   451  0.28921211E+00     0   450     5    11     0     0
   451  0.14889946E-03     0   450   121   127     0     0
   451  0.14889946E-03     0   450   123   129     0     0
   451  0.20942533E-03     0   450   125   131     0     0
   451  0.29333562E-03     0   450   122   128     0     0
   451  0.29333562E-03     0   450   124   130     0     0
   451  0.29333562E-03     0   450   126   132     0     0
  32
   452  0.50189119E-01     0   454   199     0     0     0
   452  0.50189119E-01     0   456   198     0     0     0
   452  0.18913297E-01     0   454   207     0     0     0
   452  0.18913297E-01     0   456   206     0     0     0
   452  0.14836489E-01     0   450   200     0     0     0
   452  0.42889755E-01     0   451   200     0     0     0
   452  0.21501256E-02     0   450   203     0     0     0
   452  0.33803862E-02     0   450   204     0     0     0
   452  0.35993736E-02     0   450   205     0     0     0
   452  0.53477632E-02     0   451   203     0     0     0
   452  0.79217600E-02     0   451   204     0     0     0
   452  0.10320137E-01     0   451   205     0     0     0
   452  0.47200210E-04     0   402     8     0     0     0
   452  0.47200210E-04     0   408     2     0     0     0
   452  0.71152353E-04     0   401     7     0     0     0
   452  0.71152353E-04     0   407     1     0     0     0
   452  0.71152346E-04     0   403     9     0     0     0
   452  0.71152346E-04     0   409     3     0     0     0
   452  0.47200108E-04     0   404    10     0     0     0
   452  0.47200108E-04     0   410     4     0     0     0
   452  0.10113682E-04     0   414     8     0     0     0
   452  0.10113682E-04     0   420     2     0     0     0
   452  0.10113659E-04     0   416    10     0     0     0
   452  0.10113659E-04     0   422     4     0     0     0
   452  0.89249219E-03     0   405    11     0     0     0
   452  0.89249219E-03     0   411     5     0     0     0
   452  0.15626862E-02     0   417    11     0     0     0
   452  0.15626862E-02     0   423     5     0     0     0
   452  0.15589900E+00     0   406    12     0     0     0
   452  0.15589900E+00     0   412     6     0     0     0
   452  0.22706355E+00     0   418    12     0     0     0
   452  0.22706355E+00     0   424     6     0     0     0
  36
   453  0.50077628E-01     0   454   199     0     0     0
   453  0.50077628E-01     0   456   198     0     0     0
   453  0.18949008E-01     0   454   207     0     0     0
   453  0.18949008E-01     0   456   206     0     0     0
   453  0.22489510E-02     0   450   200     0     0     0
   453  0.56033283E-02     0   451   200     0     0     0
   453  0.14481780E-01     0   450   203     0     0     0
   453  0.34292983E-02     0   450   204     0     0     0
   453  0.33505138E-02     0   450   205     0     0     0
   453  0.41880276E-01     0   451   203     0     0     0
   453  0.98317824E-02     0   451   204     0     0     0
   453  0.78704981E-02     0   451   205     0     0     0
   453  0.36807379E-03     0   402     8     0     0     0
   453  0.36807379E-03     0   408     2     0     0     0
   453  0.53750974E-03     0   401     7     0     0     0
   453  0.53750974E-03     0   407     1     0     0     0
   453  0.53750974E-03     0   403     9     0     0     0
   453  0.53750974E-03     0   409     3     0     0     0
   453  0.36807300E-03     0   404    10     0     0     0
   453  0.36807300E-03     0   410     4     0     0     0
   453  0.66191140E-04     0   414     8     0     0     0
   453  0.66191140E-04     0   420     2     0     0     0
   453  0.16516815E-04     0   413     7     0     0     0
   453  0.16516815E-04     0   419     1     0     0     0
   453  0.16516815E-04     0   415     9     0     0     0
   453  0.16516815E-04     0   421     3     0     0     0
   453  0.66190994E-04     0   416    10     0     0     0
   453  0.66190994E-04     0   422     4     0     0     0
   453  0.51921856E-03     0   405    11     0     0     0
   453  0.51921856E-03     0   411     5     0     0     0
   453  0.23572438E-02     0   417    11     0     0     0
   453  0.23572438E-02     0   423     5     0     0     0
   453  0.24187048E+00     0   406    12     0     0     0
   453  0.24187048E+00     0   412     6     0     0     0
   453  0.13990162E+00     0   418    12     0     0     0
   453  0.13990162E+00     0   424     6     0     0     0
   5
   454  0.36144677E+00     0   450     2     7     0     0
   454  0.36144719E+00     0   450     4     9     0     0
   454  0.92368640E-01     0   450   127   122     0     0
   454  0.92368640E-01     0   450   129   124     0     0
   454  0.92368774E-01     0   450   131   126     0     0
  16
   455  0.12730704E-01     0   450   198     0     0     0
   455  0.51595978E-02     0   450   206     0     0     0
   455  0.51862780E-01     0   451   198     0     0     0
   455  0.19849814E-01     0   451   206     0     0     0
   455  0.36804000E-03     0   402     7     0     0     0
   455  0.16476503E-02     0   407     2     0     0     0
   455  0.36803927E-03     0   404     9     0     0     0
   455  0.16579041E-02     0   409     4     0     0     0
   455  0.19073173E+00     0   406    11     0     0     0
   455  0.19584931E+00     0   418    11     0     0     0
   455  0.18639098E+00     0   411     6     0     0     0
   455  0.19613115E+00     0   423     6     0     0     0
   455  0.50288320E-01     0   454   200     0     0     0
   455  0.49105298E-01     0   454   203     0     0     0
   455  0.18734818E-01     0   454   204     0     0     0
   455  0.19123880E-01     0   454   205     0     0     0
   5
   456  0.36144677E+00     0   450     8     1     0     0
   456  0.36144719E+00     0   450    10     3     0     0
   456  0.92368640E-01     0   450   121   128     0     0
   456  0.92368640E-01     0   450   123   130     0     0
   456  0.92368774E-01     0   450   125   132     0     0
  16
   457  0.12730704E-01     0   450   199     0     0     0
   457  0.51595978E-02     0   450   207     0     0     0
   457  0.51862780E-01     0   451   199     0     0     0
   457  0.19849814E-01     0   451   207     0     0     0
   457  0.36804000E-03     0   408     1     0     0     0
   457  0.16476503E-02     0   401     8     0     0     0
   457  0.36803927E-03     0   410     3     0     0     0
   457  0.16579041E-02     0   403    10     0     0     0
   457  0.19073173E+00     0   412     5     0     0     0
   457  0.19584931E+00     0   424     5     0     0     0
   457  0.18639098E+00     0   405    12     0     0     0
   457  0.19613115E+00     0   417    12     0     0     0
   457  0.50288320E-01     0   456   200     0     0     0
   457  0.49105298E-01     0   456   203     0     0     0
   457  0.18734818E-01     0   456   204     0     0     0
   457  0.19123880E-01     0   456   205     0     0     0
  17
   203  0.21436530E-03     0   123   129     0     0     0
   203  0.61278000E-01     0   125   131     0     0     0
   203  0.25809130E-02     0     3     9     0     0     0
   203  0.86479747E+00     0     5    11     0     0     0
   203  0.37008245E-01     0     4    10     0     0     0
   203  0.12061700E-02     0    59    59     0     0     0
   203  0.30012863E-01     0    13    13     0     0     0
   203  0.16122154E-03     0   198   121   128     0     0
   203  0.16122154E-03     0   198   123   130     0     0
   203  0.16122154E-03     0   198   125   132     0     0
   203  0.48366460E-03     0   198     8     1     0     0
   203  0.48366460E-03     0   198    10     3     0     0
   203  0.16122154E-03     0   199   127   122     0     0
   203  0.16122154E-03     0   199   129   124     0     0
   203  0.16122154E-03     0   199   131   126     0     0
   203  0.48366460E-03     0   199     2     7     0     0
   203  0.48366460E-03     0   199     4     9     0     0
  10
   204  0.44649238E-04     0   123   129     0     0     0
   204  0.12787564E-01     0   125   131     0     0     0
   204  0.52575598E-03     0     3     9     0     0     0
   204  0.13791011E+00     0     5    11     0     0     0
   204  0.25948921E-04     0     4    10     0     0     0
   204  0.84354568E+00     0     6    12     0     0     0
   204  0.11481231E-02     0    13    13     0     0     0
   204  0.23536044E-02     0   198   199     0     0     0
   204  0.11721402E-02     0   200   200     0     0     0
   204  0.48641066E-03     0   203   203     0     0     0
   9
   205  0.34763008E-04     0   123   129     0     0     0
   205  0.99564856E-02     0   125   131     0     0     0
   205  0.40936997E-03     0     3     9     0     0     0
   205  0.10749061E+00     0     5    11     0     0     0
   205  0.18988618E-04     0     4    10     0     0     0
   205  0.87951297E+00     0     6    12     0     0     0
   205  0.83163677E-03     0    13    13     0     0     0
   205  0.13963420E-04     0   450   450     0     0     0
   205  0.17312136E-02     0   203   200     0     0     0
   5
   206  0.44559874E-04     0   124   129     0     0     0
   206  0.12762413E-01     0   126   131     0     0     0
   206  0.50239841E-03     0     4     9     0     0     0
   206  0.98439533E+00     0     6    11     0     0     0
   206  0.22952938E-02     0   203   198     0     0     0
   5
   207  0.44559874E-04     0   130   123     0     0     0
   207  0.12762413E-01     0   132   125     0     0     0
   207  0.50239841E-03     0    10     3     0     0     0
   207  0.98439533E+00     0    12     5     0     0     0
   207  0.22952938E-02     0   203   199     0     0     0
   0
   5
     6  0.33333334E+00   100     2     7     5     0     0
     6  0.33333334E+00   100     4     9     5     0     0
     6  0.11111111E+00   100   122   127     5     0     0
     6  0.11111111E+00   100   124   129     5     0     0
     6  0.11111111E+00   100   126   131     5     0     0
   5
    12  0.33333334E+00   100     8     1    11     0     0
    12  0.33333334E+00   100    10     3    11     0     0
    12  0.11111111E+00   100   128   121    11     0     0
    12  0.11111111E+00   100   130   123    11     0     0
    12  0.11111111E+00   100   132   125    11     0     0
      4.00000000     -0.25248992
      0.99856555     -0.03631082      0.03601015     -0.01586847
     -0.03893354     -0.99691910      0.06161261     -0.02899227
      0.01337133     -0.02360202     -0.70630759     -0.70738518
      0.03424033     -0.06539840     -0.70429879      0.70605528
     -0.99912083      0.04192296     -0.04192296     -0.99912083
     -0.99603355      0.08897840     -0.08897840     -0.99603355
     -0.77882409     -0.82376206     -0.79221922
      0.00000000      0.00000000      0.00000000
   1400.00000000
    T
