#  ISAJET SUSY parameters in Les Houches accord format
#  Created by ISALHA3. Last revision by C. Balazs on 2005 Jan. 10
Block SPINFO   # Program information
     1   ISASUGRA from ISAJET          # Spectrum Calculator
     2   7.79   16-DEC-2008 15:42:00   # Version number
Block MODSEL   # Model selection
     1     1   # Minimal supergravity (mSUGRA,CMSSM) model         
Block SMINPUTS   # Standard Model inputs
     1     1.27835434E+02   # alpha_em^(-1)
     2     1.16570000E-05   # G_Fermi
     3     1.17200002E-01   # alpha_s(M_Z)
     4     9.11699982E+01   # m_{Z}(pole)
     5     4.19999981E+00   # m_{b}(m_{b})
     6     1.72500000E+02   # m_{top}(pole)
     7     1.77699995E+00   # m_{tau}(pole)
Block MINPAR   # SUSY breaking input parameters
     1     8.00000000E+01   # m_0
     2     1.15000000E+02   # m_{1/2}
     3     3.00000000E+00   # tan(beta)
     4     1.00000000E+00   # sign(mu)
     5     0.00000000E+00   # A_0
#  
#  M_{GUT} =   0.28564275E+17
Block MASS   # Scalar and gaugino mass spectrum
#  PDG code   mass                 particle
        24     8.04229965E+01   #  W^+
        25     8.68091202E+01   #  h^0            
        35     2.26033752E+02   #  H^0            
        36     2.17103897E+02   #  A^0            
        37     2.32276276E+02   #  H^+            
   1000001     2.92283264E+02   #  dnl            
   1000002     2.82668549E+02   #  upl            
   1000003     2.92283325E+02   #  stl            
   1000004     2.82672058E+02   #  chl            
   1000005     2.66208618E+02   #  b1             
   1000006     1.83644165E+02   #  t1             
   1000011     1.19718658E+02   #  el-            
   1000012     9.55017548E+01   #  nuel           
   1000013     1.19718697E+02   #  mul-           
   1000014     9.55017548E+01   #  numl           
   1000015     9.73359604E+01   #  tau1           
   1000016     9.50492020E+01   #  nutl           
   1000021     3.02865326E+02   #  glss           
   1000022     2.91898479E+01   #  z1ss           
   1000023     6.36406631E+01   #  z2ss           
   1000024     5.39445801E+01   #  w1ss           
   1000025    -1.85473877E+02   #  z3ss           
   1000035     2.27370453E+02   #  z4ss           
   1000037     2.21900284E+02   #  w2ss           
   2000001     2.79565308E+02   #  dnr            
   2000002     2.77433563E+02   #  upr            
   2000003     2.79565369E+02   #  str            
   2000004     2.77437195E+02   #  chr            
   2000005     2.80461090E+02   #  b2             
   2000006     3.55699127E+02   #  t2             
   2000011     9.83239746E+01   #  er-            
   2000013     9.83240356E+01   #  mur-           
   2000015     1.20199554E+02   #  tau2           
#  Higgs mixing
Block ALPHA   # Effective Higgs mixing parameter
         -4.22093153E-01   # alpha
Block STOPMIX   # stop mixing matrix
  1  1     6.34361386E-01   # O_{11}
  1  2    -7.73036599E-01   # O_{12}
  2  1     7.73036599E-01   # O_{21}
  2  2     6.34361386E-01   # O_{22}
Block SBOTMIX   # sbottom mixing matrix
  1  1     9.48500037E-01   # O_{11}
  1  2    -3.16776991E-01   # O_{12}
  2  1     3.16776991E-01   # O_{21}
  2  2     9.48500037E-01   # O_{22}
Block STAUMIX   # stau mixing matrix
  1  1     2.22140104E-01   # O_{11}
  1  2    -9.75014746E-01   # O_{12}
  2  1     9.75014746E-01   # O_{21}
  2  2     2.22140104E-01   # O_{22}
Block NMIX   # neutralino mixing matrix
  1  1    -8.17590356E-01   #
  1  2     3.95415962E-01   #
  1  3    -3.77959788E-01   #
  1  4     1.79829478E-01   #
  2  1    -5.35848916E-01   #
  2  2    -7.87369072E-01   #
  2  3     2.58667946E-01   #
  2  4    -1.61266908E-01   #
  3  1    -8.84256288E-02   #
  3  2     1.34179994E-01   #
  3  3     6.74498737E-01   #
  3  4     7.20574558E-01   #
  4  1     1.91292822E-01   #
  4  2    -4.53532726E-01   #
  4  3    -5.79040945E-01   #
  4  4     6.49943292E-01   #
Block UMIX   # chargino U mixing matrix
  1  1    -8.12327623E-01   # U_{11}
  1  2     5.83201408E-01   # U_{12}
  2  1    -5.83201408E-01   # U_{21}
  2  2    -8.12327623E-01   # U_{22}
Block VMIX   # chargino V mixing matrix
  1  1    -9.32699263E-01   # V_{11}
  1  2     3.60655129E-01   # V_{12}
  2  1    -3.60655129E-01   # V_{21}
  2  2    -9.32699263E-01   # V_{22}
Block GAUGE Q=  2.29704437E+02   #
     1     3.57524306E-01   # g`
     2     6.52391791E-01   # g_2
     3     1.21935034E+00   # g_3
Block YU Q=  2.29704437E+02   #
  3  3     9.54757452E-01   # y_t
Block YD Q=  2.29704437E+02   #
  3  3     4.63661440E-02   # y_b
Block YE Q=  2.29704437E+02   #
  3  3     3.16582508E-02   # y_tau
Block HMIX Q=  2.29704437E+02   # Higgs mixing parameters
     1     1.80201721E+02   # mu(Q)
     2     3.00000000E+00   # tan(beta)(M_{GUT})
     3     2.49484222E+02   # Higgs vev at Q
     4     4.71341016E+04   # m_A^2(Q)
Block MSOFT Q=  2.29704437E+02   # DRbar SUSY breaking parameters
     1     4.52208366E+01   # M_1(Q)          
     2     8.68496323E+01   # M_2(Q)          
     3     2.83779449E+02   # M_3(Q)          
    31     1.12022896E+02   # MeL(Q)          
    32     1.12022896E+02   # MmuL(Q)         
    33     1.11639832E+02   # MtauL(Q)        
    34     9.05491409E+01   # MeR(Q)          
    35     9.05491409E+01   # MmuR(Q)         
    36     9.03936920E+01   # MtauR(Q)        
    41     2.72728333E+02   # MqL1(Q)         
    42     2.72728333E+02   # MqL2(Q)         
    43     2.49892395E+02   # MqL3(Q)         
    44     2.65369324E+02   # MuR(Q)          
    45     2.65369324E+02   # McR(Q)          
    46     2.11147400E+02   # MtR(Q)          
    47     2.64512573E+02   # MdR(Q)          
    48     2.64512573E+02   # MsR(Q)          
    49     2.66454407E+02   # MbR(Q)          
Block AU Q=  2.29704437E+02   #
  1  1    -2.19727463E+02   # A_u
  2  2    -2.19727463E+02   # A_c
  3  3    -2.19727463E+02   # A_t
Block AD Q=  2.29704437E+02   #
  1  1    -3.57284546E+02   # A_d
  2  2    -3.57284546E+02   # A_s
  3  3    -3.57284546E+02   # A_b
Block AE Q=  2.29704437E+02   #
  1  1    -7.50774307E+01   # A_e
  2  2    -7.50774307E+01   # A_mu
  3  3    -7.50774307E+01   # A_tau
#  ISAJET decay tables in SUSY Les Houches accord format
#  Created by ISALHD. Last revision: C. Balazs, 2005 May 25
Block DCINFO                           # Program information
     1   ISASUGRA from ISAJET          # Spectrum Calculator
     2   7.79   16-DEC-2008 15:42:00   # Version number
#         PDG         Width
DECAY         6  1.14680767E+00   # TP    decays
#          BR          NDA       ID1       ID2       ID3       ID4
      3.33333343E-01    3            2        -1         5             # TP     -->  UP     DB     BT          
      3.33333343E-01    3            4        -3         5             # TP     -->  CH     SB     BT          
      1.11111112E-01    3          -11        12         5             # TP     -->  E+     NUE    BT          
      1.11111112E-01    3          -13        14         5             # TP     -->  MU+    NUM    BT          
      1.11111112E-01    3          -15        16         5             # TP     -->  TAU+   NUT    BT          
#         PDG         Width
DECAY   1000021  1.65226471E+00   # GLSS  decays
#          BR          NDA       ID1       ID2       ID3       ID4
      1.86517755E-05    3      1000024         5        -6             # GLSS   -->  W1SS+  BT     TB          
      1.86517755E-05    3     -1000024         6        -5             # GLSS   -->  W1SS-  TP     BB          
      1.85059816E-05    2      1000022        21                       # GLSS   -->  Z1SS   GL                 
      1.59948286E-05    2      1000023        21                       # GLSS   -->  Z2SS   GL                 
      6.11280484E-05    2      1000025        21                       # GLSS   -->  Z3SS   GL                 
      2.57754127E-05    2      1000035        21                       # GLSS   -->  Z4SS   GL                 
      4.00376394E-02    2     -1000002         2                       # GLSS   -->  UBL    UP                 
      4.00376394E-02    2      1000002        -2                       # GLSS   -->  UPL    UB                 
      1.13551198E-02    2     -1000001         1                       # GLSS   -->  DBL    DN                 
      1.13551198E-02    2      1000001        -1                       # GLSS   -->  DNL    DB                 
      6.23529181E-02    2     -2000002         2                       # GLSS   -->  UBR    UP                 
      6.23529181E-02    2      2000002        -2                       # GLSS   -->  UPR    UB                 
      5.27231209E-02    2     -2000001         1                       # GLSS   -->  DBR    DN                 
      5.27231209E-02    2      2000001        -1                       # GLSS   -->  DNR    DB                 
      1.13530532E-02    2     -1000003         3                       # GLSS   -->  SBL    ST                 
      1.13530532E-02    2      1000003        -3                       # GLSS   -->  STL    SB                 
      5.27210943E-02    2     -2000003         3                       # GLSS   -->  SBR    ST                 
      5.27210943E-02    2      2000003        -3                       # GLSS   -->  STR    SB                 
      3.99407148E-02    2     -1000004         4                       # GLSS   -->  CBL    CH                 
      3.99407148E-02    2      1000004        -4                       # GLSS   -->  CHL    CB                 
      6.22554906E-02    2     -2000004         4                       # GLSS   -->  CBR    CH                 
      6.22554906E-02    2      2000004        -4                       # GLSS   -->  CHR    CB                 
      1.12790637E-01    2     -1000005         5                       # GLSS   -->  BB1    BT                 
      1.12790637E-01    2      1000005        -5                       # GLSS   -->  BT1    BB                 
      5.43908514E-02    2     -2000005         5                       # GLSS   -->  BB2    BT                 
      5.43908514E-02    2      2000005        -5                       # GLSS   -->  BT2    BB                 
#         PDG         Width
DECAY   1000002  2.91014981E+00   # UPL   decays
#          BR          NDA       ID1       ID2       ID3       ID4
      2.41444167E-02    2      1000022         2                       # UPL    -->  Z1SS   UP                 
      2.88940161E-01    2      1000023         2                       # UPL    -->  Z2SS   UP                 
      1.84552756E-03    2      1000025         2                       # UPL    -->  Z3SS   UP                 
      8.92184023E-03    2      1000035         2                       # UPL    -->  Z4SS   UP                 
      6.60485148E-01    2      1000024         1                       # UPL    -->  W1SS+  DN                 
      1.56629328E-02    2      1000037         1                       # UPL    -->  W2SS+  DN                 
#         PDG         Width
DECAY   1000001  2.60962462E+00   # DNL   decays
#          BR          NDA       ID1       ID2       ID3       ID4
      1.37356728E-01    2      1000022         1                       # DNL    -->  Z1SS   DN                 
      2.03207001E-01    2      1000023         1                       # DNL    -->  Z2SS   DN                 
      3.80396633E-03    2      1000025         1                       # DNL    -->  Z3SS   DN                 
      1.75460987E-02    2      1000035         1                       # DNL    -->  Z4SS   DN                 
      5.80534101E-01    2     -1000024         2                       # DNL    -->  W1SS-  UP                 
      5.75520732E-02    2     -1000037         2                       # DNL    -->  W2SS-  UP                 
#         PDG         Width
DECAY   1000003  2.60952067E+00   # STL   decays
#          BR          NDA       ID1       ID2       ID3       ID4
      1.37362242E-01    2      1000022         3                       # STL    -->  Z1SS   ST                 
      2.03215167E-01    2      1000023         3                       # STL    -->  Z2SS   ST                 
      3.80412117E-03    2      1000025         3                       # STL    -->  Z3SS   ST                 
      1.75468270E-02    2      1000035         3                       # STL    -->  Z4SS   ST                 
      5.80530882E-01    2     -1000024         4                       # STL    -->  W1SS-  CH                 
      5.75407632E-02    2     -1000037         4                       # STL    -->  W2SS-  CH                 
#         PDG         Width
DECAY   1000004  2.91014171E+00   # CHL   decays
#          BR          NDA       ID1       ID2       ID3       ID4
      2.41436698E-02    2      1000022         4                       # CHL    -->  Z1SS   CH                 
      2.88930684E-01    2      1000023         4                       # CHL    -->  Z2SS   CH                 
      1.84536504E-03    2      1000025         4                       # CHL    -->  Z3SS   CH                 
      8.91952217E-03    2      1000035         4                       # CHL    -->  Z4SS   CH                 
      6.60496354E-01    2      1000024         3                       # CHL    -->  W1SS+  ST                 
      1.56644192E-02    2      1000037         3                       # CHL    -->  W2SS+  ST                 
#         PDG         Width
DECAY   1000005  1.06542945E+00   # BT1   decays
#          BR          NDA       ID1       ID2       ID3       ID4
      3.04559588E-01    2      1000022         5                       # BT1    -->  Z1SS   BT                 
      4.11214083E-01    2      1000023         5                       # BT1    -->  Z2SS   BT                 
      4.70761256E-03    2      1000025         5                       # BT1    -->  Z3SS   BT                 
      1.54323103E-02    2      1000035         5                       # BT1    -->  Z4SS   BT                 
      2.57458866E-01    2     -1000024         6                       # BT1    -->  W1SS-  TP                 
      6.62759319E-03    2          -24   1000006                       # BT1    -->  W-     TP1                
#         PDG         Width
DECAY   1000006  1.28465402E+00   # TP1   decays
#          BR          NDA       ID1       ID2       ID3       ID4
      1.00000000E+00    2      1000024         5                       # TP1    -->  W1SS+  BT                 
#         PDG         Width
DECAY   2000002  5.75593412E-01   # UPR   decays
#          BR          NDA       ID1       ID2       ID3       ID4
      7.12298632E-01    2      1000022         2                       # UPR    -->  Z1SS   UP                 
      2.80797064E-01    2      1000023         2                       # UPR    -->  Z2SS   UP                 
      2.60593183E-03    2      1000025         2                       # UPR    -->  Z3SS   UP                 
      4.29835264E-03    2      1000035         2                       # UPR    -->  Z4SS   UP                 
#         PDG         Width
DECAY   2000001  1.45156592E-01   # DNR   decays
#          BR          NDA       ID1       ID2       ID3       ID4
      7.11792111E-01    2      1000022         1                       # DNR    -->  Z1SS   DN                 
      2.80975521E-01    2      1000023         1                       # DNR    -->  Z2SS   DN                 
      2.66750506E-03    2      1000025         1                       # DNR    -->  Z3SS   DN                 
      4.56486875E-03    2      1000035         1                       # DNR    -->  Z4SS   DN                 
#         PDG         Width
DECAY   2000003  1.45156637E-01   # STR   decays
#          BR          NDA       ID1       ID2       ID3       ID4
      7.11792052E-01    2      1000022         3                       # STR    -->  Z1SS   ST                 
      2.80975521E-01    2      1000023         3                       # STR    -->  Z2SS   ST                 
      2.66750669E-03    2      1000025         3                       # STR    -->  Z3SS   ST                 
      4.56487620E-03    2      1000035         3                       # STR    -->  Z4SS   ST                 
#         PDG         Width
DECAY   2000004  5.75572252E-01   # CHR   decays
#          BR          NDA       ID1       ID2       ID3       ID4
      7.12300062E-01    2      1000022         4                       # CHR    -->  Z1SS   CH                 
      2.80797094E-01    2      1000023         4                       # CHR    -->  Z2SS   CH                 
      2.60576862E-03    2      1000025         4                       # CHR    -->  Z3SS   CH                 
      4.29713866E-03    2      1000035         4                       # CHR    -->  Z4SS   CH                 
#         PDG         Width
DECAY   2000005  2.50996172E-01   # BT2   decays
#          BR          NDA       ID1       ID2       ID3       ID4
      4.26692784E-01    2      1000022         5                       # BT2    -->  Z1SS   BT                 
      3.15419614E-01    2      1000023         5                       # BT2    -->  Z2SS   BT                 
      2.22778730E-02    2      1000025         5                       # BT2    -->  Z3SS   BT                 
      3.00608911E-02    2      1000035         5                       # BT2    -->  Z4SS   BT                 
      1.34558022E-01    2     -1000024         6                       # BT2    -->  W1SS-  TP                 
      7.09908381E-02    2          -24   1000006                       # BT2    -->  W-     TP1                
#         PDG         Width
DECAY   2000006  3.18843102E+00   # TP2   decays
#          BR          NDA       ID1       ID2       ID3       ID4
      1.35089204E-01    2      1000024         5                       # TP2    -->  W1SS+  BT                 
      4.58636343E-01    2      1000037         5                       # TP2    -->  W2SS+  BT                 
      2.57850379E-01    2           23   1000006                       # TP2    -->  Z0     TP1                
      2.12743971E-02    2           25   1000006                       # TP2    -->  HL0    TP1                
      3.45832892E-02    2           24   1000005                       # TP2    -->  W+     BT1                
      2.64545809E-03    2      1000022         6                       # TP2    -->  Z1SS   TP                 
      8.99209529E-02    2      1000023         6                       # TP2    -->  Z2SS   TP                 
#         PDG         Width
DECAY   1000011  7.27300823E-01   # EL-   decays
#          BR          NDA       ID1       ID2       ID3       ID4
      1.78398192E-03    2      1000022        11                       # EL-    -->  Z1SS   E-                 
      4.17411119E-01    2      1000023        11                       # EL-    -->  Z2SS   E-                 
      5.80804884E-01    2     -1000024        12                       # EL-    -->  W1SS-  NUE                
      1.60293376E-10    3      1000015        11       -15             # EL-    -->  TAU1-  E-     TAU+        
      9.36034375E-11    3     -1000015        11        15             # EL-    -->  TAU1+  E-     TAU-        
#         PDG         Width
DECAY   1000013  7.27300406E-01   # MUL-  decays
#          BR          NDA       ID1       ID2       ID3       ID4
      1.78398029E-03    2      1000022        13                       # MUL-   -->  Z1SS   MU-                
      4.17410403E-01    2      1000023        13                       # MUL-   -->  Z2SS   MU-                
      5.80805659E-01    2     -1000024        14                       # MUL-   -->  W1SS-  NUM                
      1.60294791E-10    3      1000015        13       -15             # MUL-   -->  TAU1-  MU-    TAU+        
      9.36042424E-11    3     -1000015        13        15             # MUL-   -->  TAU1+  MU-    TAU-        
#         PDG         Width
DECAY   1000015  3.35038513E-01   # TAU1- decays
#          BR          NDA       ID1       ID2       ID3       ID4
      7.87376702E-01    2      1000022        15                       # TAU1-  -->  Z1SS   TAU-               
      1.61618456E-01    2      1000023        15                       # TAU1-  -->  Z2SS   TAU-               
      5.10047972E-02    2     -1000024        16                       # TAU1-  -->  W1SS-  NUT                
#         PDG         Width
DECAY   1000012  5.90273499E-01   # NUEL  decays
#          BR          NDA       ID1       ID2       ID3       ID4
      3.99457246E-01    2      1000022        12                       # NUEL   -->  Z1SS   NUE                
      5.11277504E-02    2      1000023        12                       # NUEL   -->  Z2SS   NUE                
      5.49414933E-01    2      1000024        11                       # NUEL   -->  W1SS+  E-                 
#         PDG         Width
DECAY   1000014  5.90271831E-01   # NUML  decays
#          BR          NDA       ID1       ID2       ID3       ID4
      3.99458379E-01    2      1000022        14                       # NUML   -->  Z1SS   NUM                
      5.11278957E-02    2      1000023        14                       # NUML   -->  Z2SS   NUM                
      5.49413741E-01    2      1000024        13                       # NUML   -->  W1SS+  MU-                
#         PDG         Width
DECAY   1000016  5.82878232E-01   # NUTL  decays
#          BR          NDA       ID1       ID2       ID3       ID4
      4.01816815E-01    2      1000022        16                       # NUTL   -->  Z1SS   NUT                
      5.07482924E-02    2      1000023        16                       # NUTL   -->  Z2SS   NUT                
      5.47434866E-01    2      1000024        15                       # NUTL   -->  W1SS+  TAU-               
#         PDG         Width
DECAY   2000011  3.26448590E-01   # ER-   decays
#          BR          NDA       ID1       ID2       ID3       ID4
      8.51484478E-01    2      1000022        11                       # ER-    -->  Z1SS   E-                 
      1.48515537E-01    2      1000023        11                       # ER-    -->  Z2SS   E-                 
      4.82978887E-26    3      1000015        12       -16             # ER-    -->  TAU1-  NUE    ANUT        
#         PDG         Width
DECAY   2000013  3.26447874E-01   # MUR-  decays
#          BR          NDA       ID1       ID2       ID3       ID4
      8.51484776E-01    2      1000022        13                       # MUR-   -->  Z1SS   MU-                
      1.48515224E-01    2      1000023        13                       # MUR-   -->  Z2SS   MU-                
      2.06458970E-21    3      1000015        14       -16             # MUR-   -->  TAU1-  NUM    ANUT        
#         PDG         Width
DECAY   2000015  7.06485510E-01   # TAU2- decays
#          BR          NDA       ID1       ID2       ID3       ID4
      2.12582443E-02    2      1000022        15                       # TAU2-  -->  Z1SS   TAU-               
      4.14907753E-01    2      1000023        15                       # TAU2-  -->  Z2SS   TAU-               
      5.63834071E-01    2     -1000024        16                       # TAU2-  -->  W1SS-  NUT                
#         PDG         Width
DECAY   1000023  3.96298765E-06   # Z2SS  decays
#          BR          NDA       ID1       ID2       ID3       ID4
      4.70353727E-04    2      1000022        22                       # Z2SS   -->  Z1SS   GM                 
      1.72344819E-02    3     -1000024         2        -1             # Z2SS   -->  W1SS-  UP     DB          
      5.74482745E-03    3     -1000024        12       -11             # Z2SS   -->  W1SS-  NUE    E+          
      5.74482745E-03    3     -1000024        14       -13             # Z2SS   -->  W1SS-  NUM    MU+         
      1.72344819E-02    3      1000024         1        -2             # Z2SS   -->  W1SS+  DN     UB          
      5.74482745E-03    3      1000024        11       -12             # Z2SS   -->  W1SS+  E-     ANUE        
      5.74482745E-03    3      1000024        13       -14             # Z2SS   -->  W1SS+  MU-    ANUM        
      1.72344819E-02    3     -1000024         4        -3             # Z2SS   -->  W1SS-  CH     SB          
      5.74482745E-03    3     -1000024        16       -15             # Z2SS   -->  W1SS-  NUT    TAU+        
      1.72344819E-02    3      1000024         3        -4             # Z2SS   -->  W1SS+  ST     CB          
      5.74482745E-03    3      1000024        15       -16             # Z2SS   -->  W1SS+  TAU-   ANUT        
      8.37203767E-03    3      1000022         2        -2             # Z2SS   -->  Z1SS   UP     UB          
      2.38295477E-02    3      1000022         1        -1             # Z2SS   -->  Z1SS   DN     DB          
      2.38295402E-02    3      1000022         3        -3             # Z2SS   -->  Z1SS   ST     SB          
      8.37199204E-03    3      1000022         4        -4             # Z2SS   -->  Z1SS   CH     CB          
      2.23297738E-02    3      1000022         5        -5             # Z2SS   -->  Z1SS   BT     BB          
      1.71444654E-01    3      1000022        11       -11             # Z2SS   -->  Z1SS   E-     E+          
      1.71444073E-01    3      1000022        13       -13             # Z2SS   -->  Z1SS   MU-    MU+         
      1.77624568E-01    3      1000022        15       -15             # Z2SS   -->  Z1SS   TAU-   TAU+        
      9.52688307E-02    3      1000022        12       -12             # Z2SS   -->  Z1SS   NUE    ANUE        
      9.52688307E-02    3      1000022        14       -14             # Z2SS   -->  Z1SS   NUM    ANUM        
      9.83389169E-02    3      1000022        16       -16             # Z2SS   -->  Z1SS   NUT    ANUT        
#         PDG         Width
DECAY   1000025  8.04665327E-01   # Z3SS  decays
#          BR          NDA       ID1       ID2       ID3       ID4
      5.88693183E-07    2      1000022        22                       # Z3SS   -->  Z1SS   GM                 
      2.25830341E-08    2      1000023        22                       # Z3SS   -->  Z2SS   GM                 
      3.03408146E-01    2      1000024       -24                       # Z3SS   -->  W1SS+  W-                 
      3.03408146E-01    2     -1000024        24                       # Z3SS   -->  W1SS-  W+                 
      2.36643597E-01    2      1000022        23                       # Z3SS   -->  Z1SS   Z0                 
      5.22427969E-02    2      1000023        23                       # Z3SS   -->  Z2SS   Z0                 
      1.51376270E-07    3      1000022         2        -2             # Z3SS   -->  Z1SS   UP     UB          
      3.48922981E-07    3      1000022         1        -1             # Z3SS   -->  Z1SS   DN     DB          
      3.48922583E-07    3      1000022         3        -3             # Z3SS   -->  Z1SS   ST     SB          
      1.51366109E-07    3      1000022         4        -4             # Z3SS   -->  Z1SS   CH     CB          
      1.23373991E-06    3      1000022         5        -5             # Z3SS   -->  Z1SS   BT     BB          
      5.87844688E-08    3      1000022        15       -15             # Z3SS   -->  Z1SS   TAU-   TAU+        
      3.19915785E-07    3      1000023         2        -2             # Z3SS   -->  Z2SS   UP     UB          
      2.48382833E-07    3      1000023         1        -1             # Z3SS   -->  Z2SS   DN     DB          
      2.48382548E-07    3      1000023         3        -3             # Z3SS   -->  Z2SS   ST     SB          
      3.19894241E-07    3      1000023         4        -4             # Z3SS   -->  Z2SS   CH     CB          
      6.10007930E-07    3      1000023         5        -5             # Z3SS   -->  Z2SS   BT     BB          
      5.28042854E-09    3      1000023        15       -15             # Z3SS   -->  Z2SS   TAU-   TAU+        
      2.55284924E-02    2      1000022        25                       # Z3SS   -->  Z1SS   HL0                
      3.27524310E-03    2      1000023        25                       # Z3SS   -->  Z2SS   HL0                
      1.20910886E-03    2      1000011       -11                       # Z3SS   -->  EL-    E+                 
      1.20910886E-03    2     -1000011        11                       # Z3SS   -->  EL+    E-                 
      1.20910676E-03    2      1000013       -13                       # Z3SS   -->  MUL-   MU+                
      1.20910676E-03    2     -1000013        13                       # Z3SS   -->  MUL+   MU-                
      2.36926461E-03    2      2000011       -11                       # Z3SS   -->  ER-    E+                 
      2.36926461E-03    2     -2000011        11                       # Z3SS   -->  ER+    E-                 
      2.36926158E-03    2      2000013       -13                       # Z3SS   -->  MUR-   MU+                
      2.36926158E-03    2     -2000013        13                       # Z3SS   -->  MUR+   MU-                
      2.02449667E-03    2      1000015       -15                       # Z3SS   -->  TAU1-  TAU+               
      2.02449667E-03    2     -1000015        15                       # Z3SS   -->  TAU1+  TAU-               
      2.24590162E-03    2      2000015       -15                       # Z3SS   -->  TAU2-  TAU+               
      2.24590162E-03    2     -2000015        15                       # Z3SS   -->  TAU2+  TAU-               
      8.75249691E-03    2      1000012       -12                       # Z3SS   -->  NUEL   ANUE               
      8.75249691E-03    2     -1000012        12                       # Z3SS   -->  ANUEL  NUE                
      8.75249691E-03    2      1000014       -14                       # Z3SS   -->  NUML   ANUM               
      8.75249691E-03    2     -1000014        14                       # Z3SS   -->  ANUML  NUM                
      8.81231017E-03    2      1000016       -16                       # Z3SS   -->  NUTL   ANUT               
      8.81231017E-03    2     -1000016        16                       # Z3SS   -->  ANUTL  NUT                
#         PDG         Width
DECAY   1000035  1.94595683E+00   # Z4SS  decays
#          BR          NDA       ID1       ID2       ID3       ID4
      1.01830636E-07    2      1000022        22                       # Z4SS   -->  Z1SS   GM                 
      4.96870484E-07    2      1000023        22                       # Z4SS   -->  Z2SS   GM                 
      4.45829791E-08    2      1000025        22                       # Z4SS   -->  Z3SS   GM                 
      2.21728981E-01    2      1000024       -24                       # Z4SS   -->  W1SS+  W-                 
      2.21728981E-01    2     -1000024        24                       # Z4SS   -->  W1SS-  W+                 
      1.48395940E-09    3     -1000037         2        -1             # Z4SS   -->  W2SS-  UP     DB          
      4.94653152E-10    3     -1000037        12       -11             # Z4SS   -->  W2SS-  NUE    E+          
      4.94653152E-10    3     -1000037        14       -13             # Z4SS   -->  W2SS-  NUM    MU+         
      1.48395940E-09    3      1000037         1        -2             # Z4SS   -->  W2SS+  DN     UB          
      4.94653152E-10    3      1000037        11       -12             # Z4SS   -->  W2SS+  E-     ANUE        
      4.94653152E-10    3      1000037        13       -14             # Z4SS   -->  W2SS+  MU-    ANUM        
      1.48395940E-09    3     -1000037         4        -3             # Z4SS   -->  W2SS-  CH     SB          
      4.94653152E-10    3     -1000037        16       -15             # Z4SS   -->  W2SS-  NUT    TAU+        
      1.48395940E-09    3      1000037         3        -4             # Z4SS   -->  W2SS+  ST     CB          
      4.94653152E-10    3      1000037        15       -16             # Z4SS   -->  W2SS+  TAU-   ANUT        
      2.03344952E-02    2      1000022        23                       # Z4SS   -->  Z1SS   Z0                 
      3.63327423E-03    2      1000023        23                       # Z4SS   -->  Z2SS   Z0                 
      2.72258717E-06    3      1000022         2        -2             # Z4SS   -->  Z1SS   UP     UB          
      8.66733171E-06    3      1000022         1        -1             # Z4SS   -->  Z1SS   DN     DB          
      8.66732080E-06    3      1000022         3        -3             # Z4SS   -->  Z1SS   ST     SB          
      2.72237730E-06    3      1000022         4        -4             # Z4SS   -->  Z1SS   CH     CB          
      1.49176458E-05    3      1000022         5        -5             # Z4SS   -->  Z1SS   BT     BB          
      4.13436538E-08    3      1000022        15       -15             # Z4SS   -->  Z1SS   TAU-   TAU+        
      1.60963918E-05    3      1000023         2        -2             # Z4SS   -->  Z2SS   UP     UB          
      1.06169891E-05    3      1000023         1        -1             # Z4SS   -->  Z2SS   DN     DB          
      1.06169746E-05    3      1000023         3        -3             # Z4SS   -->  Z2SS   ST     SB          
      1.60951531E-05    3      1000023         4        -4             # Z4SS   -->  Z2SS   CH     CB          
      1.83314605E-05    3      1000023         5        -5             # Z4SS   -->  Z2SS   BT     BB          
      2.19811769E-09    3      1000023        15       -15             # Z4SS   -->  Z2SS   TAU-   TAU+        
      5.18804154E-06    3      1000025         2        -2             # Z4SS   -->  Z3SS   UP     UB          
      7.05122920E-06    3      1000025         1        -1             # Z4SS   -->  Z3SS   DN     DB          
      7.05122920E-06    3      1000025         3        -3             # Z4SS   -->  Z3SS   ST     SB          
      5.18804882E-06    3      1000025         4        -4             # Z4SS   -->  Z3SS   CH     CB          
      6.11505538E-06    3      1000025         5        -5             # Z4SS   -->  Z3SS   BT     BB          
      1.55576356E-06    3      1000025        11       -11             # Z4SS   -->  Z3SS   E-     E+          
      1.55576356E-06    3      1000025        13       -13             # Z4SS   -->  Z3SS   MU-    MU+         
      1.51516372E-06    3      1000025        15       -15             # Z4SS   -->  Z3SS   TAU-   TAU+        
      3.09548022E-06    3      1000025        12       -12             # Z4SS   -->  Z3SS   NUE    ANUE        
      3.09548022E-06    3      1000025        14       -14             # Z4SS   -->  Z3SS   NUM    ANUM        
      3.09548022E-06    3      1000025        16       -16             # Z4SS   -->  Z3SS   NUT    ANUT        
      6.31252006E-02    2      1000022        25                       # Z4SS   -->  Z1SS   HL0                
      1.96219590E-02    2      1000023        25                       # Z4SS   -->  Z2SS   HL0                
      1.55924065E-02    2      1000011       -11                       # Z4SS   -->  EL-    E+                 
      1.55924065E-02    2     -1000011        11                       # Z4SS   -->  EL+    E-                 
      1.55923963E-02    2      1000013       -13                       # Z4SS   -->  MUL-   MU+                
      1.55923963E-02    2     -1000013        13                       # Z4SS   -->  MUL+   MU-                
      7.18693668E-03    2      2000011       -11                       # Z4SS   -->  ER-    E+                 
      7.18693668E-03    2     -2000011        11                       # Z4SS   -->  ER+    E-                 
      7.18693202E-03    2      2000013       -13                       # Z4SS   -->  MUR-   MU+                
      7.18693202E-03    2     -2000013        13                       # Z4SS   -->  MUR+   MU-                
      6.59133820E-03    2      1000015       -15                       # Z4SS   -->  TAU1-  TAU+               
      6.59133820E-03    2     -1000015        15                       # Z4SS   -->  TAU1+  TAU-               
      1.62950791E-02    2      2000015       -15                       # Z4SS   -->  TAU2-  TAU+               
      1.62950791E-02    2     -2000015        15                       # Z4SS   -->  TAU2+  TAU-               
      5.20600118E-02    2      1000012       -12                       # Z4SS   -->  NUEL   ANUE               
      5.20600118E-02    2     -1000012        12                       # Z4SS   -->  ANUEL  NUE                
      5.20600118E-02    2      1000014       -14                       # Z4SS   -->  NUML   ANUM               
      5.20600118E-02    2     -1000014        14                       # Z4SS   -->  ANUML  NUM                
      5.22711091E-02    2      1000016       -16                       # Z4SS   -->  NUTL   ANUT               
      5.22711091E-02    2     -1000016        16                       # Z4SS   -->  ANUTL  NUT                
#         PDG         Width
DECAY   1000024  6.92625235E-06   # W1SS+ decays
#          BR          NDA       ID1       ID2       ID3       ID4
      2.48896435E-01    3      1000022         2        -1             # W1SS+  -->  Z1SS   UP     DB          
      2.48896316E-01    3      1000022         4        -3             # W1SS+  -->  Z1SS   CH     SB          
      1.66569814E-01    3      1000022       -11        12             # W1SS+  -->  Z1SS   E+     NUE         
      1.66569814E-01    3      1000022       -13        14             # W1SS+  -->  Z1SS   MU+    NUM         
      1.69067636E-01    3      1000022       -15        16             # W1SS+  -->  Z1SS   TAU+   NUT         
#         PDG         Width
DECAY   1000037  1.93830681E+00   # W2SS+ decays
#          BR          NDA       ID1       ID2       ID3       ID4
      8.76779450E-06    3      1000022         2        -1             # W2SS+  -->  Z1SS   UP     DB          
      8.76775357E-06    3      1000022         4        -3             # W2SS+  -->  Z1SS   CH     SB          
      1.42150665E-08    3      1000022       -15        16             # W2SS+  -->  Z1SS   TAU+   NUT         
      2.29897420E-03    2      1000022        24                       # W2SS+  -->  Z1SS   W+                 
      1.19207725E-05    3      1000023         2        -1             # W2SS+  -->  Z2SS   UP     DB          
      1.19203687E-05    3      1000023         4        -3             # W2SS+  -->  Z2SS   CH     SB          
      6.55566481E-08    3      1000023       -15        16             # W2SS+  -->  Z2SS   TAU+   NUT         
      2.68981338E-01    2      1000023        24                       # W2SS+  -->  Z2SS   W+                 
      1.01832347E-05    3      1000025         2        -1             # W2SS+  -->  Z3SS   UP     DB          
      1.01832375E-05    3      1000025         4        -3             # W2SS+  -->  Z3SS   CH     SB          
      3.36334460E-06    3      1000025       -11        12             # W2SS+  -->  Z3SS   E+     NUE         
      3.36334460E-06    3      1000025       -13        14             # W2SS+  -->  Z3SS   MU+    NUM         
      3.36335688E-06    3      1000025       -15        16             # W2SS+  -->  Z3SS   TAU+   NUT         
      9.81272385E-02    2      1000006        -5                       # W2SS+  -->  TP1    BB                 
      4.16105613E-02    2      1000012       -11                       # W2SS+  -->  NUEL   E+                 
      4.16105613E-02    2      1000014       -13                       # W2SS+  -->  NUML   MU+                
      4.21196930E-02    2      1000016       -15                       # W2SS+  -->  NUTL   TAU+               
      8.23725685E-02    2     -1000011        12                       # W2SS+  -->  EL+    NUE                
      8.23725313E-02    2     -1000013        14                       # W2SS+  -->  MUL+   NUM                
      2.57886550E-03    2     -1000015        16                       # W2SS+  -->  TAU1+  NUT                
      8.02391469E-02    2     -2000015        16                       # W2SS+  -->  TAU2+  NUT                
      1.81237757E-01    2      1000024        23                       # W2SS+  -->  W1SS+  Z0                 
      1.88798458E-05    3      1000024         1        -1             # W2SS+  -->  W1SS+  DN     DB          
      1.88784252E-05    3      1000024         3        -3             # W2SS+  -->  W1SS+  ST     SB          
      3.06922375E-05    3      1000024         2        -2             # W2SS+  -->  W1SS+  UP     UB          
      3.06922011E-05    3      1000024         4        -4             # W2SS+  -->  W1SS+  CH     CB          
      7.62797296E-02    2      1000024        25                       # W2SS+  -->  W1SS+  HL0                
#         PDG         Width
DECAY        25  2.62909196E-02   # HL0   decays
#          BR          NDA       ID1       ID2       ID3       ID4
      9.41722256E-10    2           11       -11                       # HL0    -->  E-     E+                 
      3.97608637E-05    2           13       -13                       # HL0    -->  MU-    MU+                
      1.13596013E-02    2           15       -15                       # HL0    -->  TAU-   TAU+               
      1.18718231E-06    2            1        -1                       # HL0    -->  DN     DB                 
      4.79680573E-04    2            3        -3                       # HL0    -->  ST     SB                 
      1.63569987E-01    2            5        -5                       # HL0    -->  BT     BB                 
      2.09277530E-07    2            2        -2                       # HL0    -->  UP     UB                 
      4.11710609E-03    2            4        -4                       # HL0    -->  CH     CB                 
      1.36318849E-04    2           22        22                       # HL0    -->  GM     GM                 
      2.55617010E-03    2           21        21                       # HL0    -->  GL     GL                 
      8.17740023E-01    2      1000022   1000022                       # HL0    -->  Z1SS   Z1SS               
#         PDG         Width
DECAY        35  6.06817365E-01   # HH0   decays
#          BR          NDA       ID1       ID2       ID3       ID4
      5.26769295E-10    2           11       -11                       # HH0    -->  E-     E+                 
      2.22411200E-05    2           13       -13                       # HH0    -->  MU-    MU+                
      6.36784406E-03    2           15       -15                       # HH0    -->  TAU-   TAU+               
      6.55027122E-07    2            1        -1                       # HH0    -->  DN     DB                 
      2.64664035E-04    2            3        -3                       # HH0    -->  ST     SB                 
      4.73758839E-02    2            5        -5                       # HH0    -->  BT     BB                 
      4.69656758E-09    2            2        -2                       # HH0    -->  UP     UB                 
      8.00908165E-05    2            4        -4                       # HH0    -->  CH     CB                 
      1.50330993E-06    2           22        22                       # HH0    -->  GM     GM                 
      5.11810824E-04    2           21        21                       # HH0    -->  GL     GL                 
      2.99486443E-02    2           24       -24                       # HH0    -->  W+     W-                 
      1.25705469E-02    2           23        23                       # HH0    -->  Z0     Z0                 
      1.48314729E-01    2      1000022   1000022                       # HH0    -->  Z1SS   Z1SS               
      9.02216360E-02    2      1000022   1000023                       # HH0    -->  Z1SS   Z2SS               
      9.58823040E-02    2      1000022   1000025                       # HH0    -->  Z1SS   Z3SS               
      1.24086281E-02    2      1000023   1000023                       # HH0    -->  Z2SS   Z2SS               
      3.01120728E-01    2      1000024  -1000024                       # HH0    -->  W1SS+  W1SS-              
      1.05909728E-01    2           25        25                       # HH0    -->  HL0    HL0                
      8.18955060E-03    2      2000011  -2000011                       # HH0    -->  ER-    ER+                
      8.18913989E-03    2      2000013  -2000013                       # HH0    -->  MUR-   MUR+               
      8.37093778E-03    2      1000015  -1000015                       # HH0    -->  TAU1-  TAU1+              
      2.45692399E-06    2      1000015  -2000015                       # HH0    -->  TAU1-  TAU2+              
      2.45692399E-06    2      2000015  -1000015                       # HH0    -->  TAU2-  TAU1+              
      4.12531979E-02    2      1000012  -1000012                       # HH0    -->  NUEL   ANUEL              
      4.12531979E-02    2      1000014  -1000014                       # HH0    -->  NUML   ANUML              
      4.17373814E-02    2      1000016  -1000016                       # HH0    -->  NUTL   ANUTL              
#         PDG         Width
DECAY        36  1.04148936E+00   # HA0   decays
#          BR          NDA       ID1       ID2       ID3       ID4
      3.18822191E-10    2           11       -11                       # HA0    -->  E-     E+                 
      1.34612419E-05    2           13       -13                       # HA0    -->  MU-    MU+                
      3.85499094E-03    2           15       -15                       # HA0    -->  TAU-   TAU+               
      3.96651302E-07    2            1        -1                       # HA0    -->  DN     DB                 
      1.60267227E-04    2            3        -3                       # HA0    -->  ST     SB                 
      2.87187286E-02    2            5        -5                       # HA0    -->  BT     BB                 
      1.56685831E-09    2            2        -2                       # HA0    -->  UP     UB                 
      2.68722270E-05    2            4        -4                       # HA0    -->  CH     CB                 
      3.09184907E-06    2           22        22                       # HA0    -->  GM     GM                 
      9.21283790E-05    2           21        21                       # HA0    -->  GL     GL                 
      2.08181933E-01    2      1000022   1000022                       # HA0    -->  Z1SS   Z1SS               
      1.58140838E-01    2      1000022   1000023                       # HA0    -->  Z1SS   Z2SS               
      1.50739856E-04    2      1000022   1000025                       # HA0    -->  Z1SS   Z3SS               
      3.03368922E-02    2      1000023   1000023                       # HA0    -->  Z2SS   Z2SS               
      5.64218342E-01    2      1000024  -1000024                       # HA0    -->  W1SS+  W1SS-              
      6.10129256E-03    2           25        23                       # HA0    -->  HL0    Z0                 
#         PDG         Width
DECAY        37  5.97468972E-01   # H+    decays
#          BR          NDA       ID1       ID2       ID3       ID4
      5.94600480E-10    2           12       -11                       # H+     -->  NUE    E+                 
      2.51050951E-05    2           14       -13                       # H+     -->  NUM    MU+                
      7.18964497E-03    2           16       -15                       # H+     -->  NUT    TAU+               
      6.72182580E-07    2            2        -1                       # H+     -->  UP     DB                 
      3.15435667E-04    2            4        -3                       # H+     -->  CH     SB                 
      4.64816779E-01    2            6        -5                       # H+     -->  TP     BB                 
      2.91507691E-01    2      1000024   1000022                       # H+     -->  W1SS+  Z1SS               
      1.33401304E-01    2      1000024   1000023                       # H+     -->  W1SS+  Z2SS               
      2.28679460E-02    2           25        24                       # H+     -->  HL0    W+                 
      2.64185239E-02    2     -1000011   1000012                       # H+     -->  EL+    NUEL               
      2.64180470E-02    2     -1000013   1000014                       # H+     -->  MUL+   NUML               
      2.31180107E-03    2     -1000015   1000016                       # H+     -->  TAU1+  NUTL               
      2.47270837E-02    2     -2000015   1000016                       # H+     -->  TAU2+  NUTL               
