  65
  401    689.7818    0.10017E-24
  402    685.1726    0.97598E-25
  403    689.7818    0.10017E-24
  404    685.1740    0.97598E-25
  405    658.5103    0.11121E-24
  406    600.9218    0.57203E-25
  407    689.7818    0.10017E-24
  408    685.1726    0.97598E-25
  409    689.7818    0.10017E-24
  410    685.1740    0.97598E-25
  411    658.5103    0.11121E-24
  412    600.9218    0.57203E-25
  413    662.1076    0.18971E-23
  414    662.7538    0.47374E-24
  415    662.1077    0.18971E-23
  416    662.7552    0.47374E-24
  417    664.7142    0.11514E-24
  418    693.3389    0.54901E-25
  419    662.1076    0.18971E-23
  420    662.7538    0.47374E-24
  421    662.1077    0.18971E-23
  422    662.7552    0.47374E-24
  423    664.7142    0.11514E-24
  424    693.3389    0.54901E-25
  425    203.7310    0.81241E-23
  426    186.6888    0.52138E-23
  427    203.7311    0.81241E-23
  428    186.6888    0.52138E-23
  429    102352E7    0.16588E-12
  430    800.0000    0.89711E-24
  431    203.7310    0.81241E-23
  432    186.6888    0.52138E-23
  433    203.7311    0.81241E-23
  434    186.6888    0.52138E-23
  435    102352E7    0.16588E-12
  436    184.1648    0.54580E-23
  437    100.5083    0.18145E-12
  438      0.0000    0.10000E+31
  439    100.5084    0.18145E-12
  440      0.0000    0.10000E+31
  441    202468E7    0.83996E-23
  442      0.0000    0.10000E+31
  443    100.5083    0.18145E-12
  444      0.0000    0.10000E+31
  445    100.5084    0.18145E-12
  446      0.0000    0.10000E+31
  447    202468E7    0.83996E-23
  448      0.0000    0.10000E+31
  449    705.4940    0.40763E-24
  450    113.3690    0.99142E-23
  451    197.7258    0.57760E-23
  452   -281.4905    0.24453E-23
  453    331.2892    0.27820E-24
  454    195.0776    0.30228E-22
  455    328.5646    0.32699E-24
  456    195.0776    0.30228E-22
  457    328.5646    0.32699E-24
  203    102.9327    0.14385E-21
  204    345.7107    0.28144E-23
  205    341.3686    0.20456E-23
  206    352.7245    0.10430E-23
  207    352.7245    0.10430E-23
  458      0.0000    0.10000E+31
    6    172.5000    0.57395E-24
   12    172.5000    0.57395E-24
   6
   401  0.33653803E-01     0   450     1     0     0     0
   401  0.21228877E+00     0   451     1     0     0     0
   401  0.26345060E-02     0   452     1     0     0     0
   401  0.97868301E-01     0   453     1     0     0     0
   401  0.42656541E+00     0   456     2     0     0     0
   401  0.22698922E+00     0   457     2     0     0     0
   6
   402  0.18532651E-02     0   450     2     0     0     0
   402  0.25528586E+00     0   451     2     0     0     0
   402  0.14752261E-02     0   452     2     0     0     0
   402  0.78749441E-01     0   453     2     0     0     0
   402  0.52205443E+00     0   454     1     0     0     0
   402  0.14058183E+00     0   455     1     0     0     0
   6
   403  0.33654030E-01     0   450     3     0     0     0
   403  0.21229020E+00     0   451     3     0     0     0
   403  0.26345239E-02     0   452     3     0     0     0
   403  0.97868964E-01     0   453     3     0     0     0
   403  0.42656446E+00     0   456     4     0     0     0
   403  0.22698784E+00     0   457     4     0     0     0
   6
   404  0.18532546E-02     0   450     4     0     0     0
   404  0.25528428E+00     0   451     4     0     0     0
   404  0.14752155E-02     0   452     4     0     0     0
   404  0.78748770E-01     0   453     4     0     0     0
   404  0.52205598E+00     0   454     3     0     0     0
   404  0.14058250E+00     0   455     3     0     0     0
   6
   405  0.54808192E-01     0   450     5     0     0     0
   405  0.13372543E+00     0   451     5     0     0     0
   405  0.11624213E-02     0   452     5     0     0     0
   405  0.38356870E-01     0   453     5     0     0     0
   405  0.32592982E+00     0   456     6     0     0     0
   405  0.44601727E+00     0   457     6     0     0     0
   6
   406  0.93735419E-01     0   450     6     0     0     0
   406  0.12198941E+00     0   451     6     0     0     0
   406  0.25334510E+00     0   452     6     0     0     0
   406  0.33011638E-01     0   453     6     0     0     0
   406  0.35297337E+00     0   454     5     0     0     0
   406  0.14494506E+00     0   455     5     0     0     0
   6
   407  0.33653803E-01     0   450     7     0     0     0
   407  0.21228877E+00     0   451     7     0     0     0
   407  0.26345060E-02     0   452     7     0     0     0
   407  0.97868301E-01     0   453     7     0     0     0
   407  0.42656541E+00     0   454     8     0     0     0
   407  0.22698922E+00     0   455     8     0     0     0
   6
   408  0.18532651E-02     0   450     8     0     0     0
   408  0.25528586E+00     0   451     8     0     0     0
   408  0.14752261E-02     0   452     8     0     0     0
   408  0.78749441E-01     0   453     8     0     0     0
   408  0.52205443E+00     0   456     7     0     0     0
   408  0.14058183E+00     0   457     7     0     0     0
   6
   409  0.33654030E-01     0   450     9     0     0     0
   409  0.21229020E+00     0   451     9     0     0     0
   409  0.26345239E-02     0   452     9     0     0     0
   409  0.97868964E-01     0   453     9     0     0     0
   409  0.42656446E+00     0   454    10     0     0     0
   409  0.22698784E+00     0   455    10     0     0     0
   6
   410  0.18532546E-02     0   450    10     0     0     0
   410  0.25528428E+00     0   451    10     0     0     0
   410  0.14752155E-02     0   452    10     0     0     0
   410  0.78748770E-01     0   453    10     0     0     0
   410  0.52205598E+00     0   456     9     0     0     0
   410  0.14058250E+00     0   457     9     0     0     0
   6
   411  0.54808192E-01     0   450    11     0     0     0
   411  0.13372543E+00     0   451    11     0     0     0
   411  0.11624213E-02     0   452    11     0     0     0
   411  0.38356870E-01     0   453    11     0     0     0
   411  0.32592982E+00     0   454    12     0     0     0
   411  0.44601727E+00     0   455    12     0     0     0
   6
   412  0.93735419E-01     0   450    12     0     0     0
   412  0.12198941E+00     0   451    12     0     0     0
   412  0.25334510E+00     0   452    12     0     0     0
   412  0.33011638E-01     0   453    12     0     0     0
   412  0.35297337E+00     0   456    11     0     0     0
   412  0.14494506E+00     0   457    11     0     0     0
   4
   413  0.93417156E+00     0   450     1     0     0     0
   413  0.51164500E-01     0   451     1     0     0     0
   413  0.26057584E-02     0   452     1     0     0     0
   413  0.12058223E-01     0   453     1     0     0     0
   4
   414  0.93414378E+00     0   450     2     0     0     0
   414  0.51176481E-01     0   451     2     0     0     0
   414  0.26076157E-02     0   452     2     0     0     0
   414  0.12072143E-01     0   453     2     0     0     0
   4
   415  0.93417156E+00     0   450     3     0     0     0
   415  0.51164500E-01     0   451     3     0     0     0
   415  0.26057588E-02     0   452     3     0     0     0
   415  0.12058224E-01     0   453     3     0     0     0
   4
   416  0.93414384E+00     0   450     4     0     0     0
   416  0.51176455E-01     0   451     4     0     0     0
   416  0.26076105E-02     0   452     4     0     0     0
   416  0.12072103E-01     0   453     4     0     0     0
   6
   417  0.37773844E-01     0   450     5     0     0     0
   417  0.98051153E-01     0   451     5     0     0     0
   417  0.90661710E-02     0   452     5     0     0     0
   417  0.67504570E-01     0   453     5     0     0     0
   417  0.26661345E+00     0   456     6     0     0     0
   417  0.52099085E+00     0   457     6     0     0     0
   7
   418  0.93998738E-01     0   454     5     0     0     0
   418  0.27138934E+00     0   455     5     0     0     0
   418  0.89441659E-04     0   200   406     0     0     0
   418  0.60934639E-02     0   450     6     0     0     0
   418  0.10257033E+00     0   451     6     0     0     0
   418  0.19816655E+00     0   452     6     0     0     0
   418  0.32769218E+00     0   453     6     0     0     0
   4
   419  0.93417156E+00     0   450     7     0     0     0
   419  0.51164500E-01     0   451     7     0     0     0
   419  0.26057584E-02     0   452     7     0     0     0
   419  0.12058223E-01     0   453     7     0     0     0
   4
   420  0.93414378E+00     0   450     8     0     0     0
   420  0.51176481E-01     0   451     8     0     0     0
   420  0.26076157E-02     0   452     8     0     0     0
   420  0.12072143E-01     0   453     8     0     0     0
   4
   421  0.93417156E+00     0   450     9     0     0     0
   421  0.51164500E-01     0   451     9     0     0     0
   421  0.26057588E-02     0   452     9     0     0     0
   421  0.12058224E-01     0   453     9     0     0     0
   4
   422  0.93414384E+00     0   450    10     0     0     0
   422  0.51176455E-01     0   451    10     0     0     0
   422  0.26076105E-02     0   452    10     0     0     0
   422  0.12072103E-01     0   453    10     0     0     0
   6
   423  0.37773844E-01     0   450    11     0     0     0
   423  0.98051153E-01     0   451    11     0     0     0
   423  0.90661710E-02     0   452    11     0     0     0
   423  0.67504570E-01     0   453    11     0     0     0
   423  0.26661345E+00     0   454    12     0     0     0
   423  0.52099085E+00     0   455    12     0     0     0
   7
   424  0.93998738E-01     0   456    11     0     0     0
   424  0.27138934E+00     0   457    11     0     0     0
   424  0.89441659E-04     0   200   412     0     0     0
   424  0.60934639E-02     0   450    12     0     0     0
   424  0.10257033E+00     0   451    12     0     0     0
   424  0.19816655E+00     0   452    12     0     0     0
   424  0.32769218E+00     0   453    12     0     0     0
   3
   425  0.88562900E+00     0   450   121     0     0     0
   425  0.30914206E-01     0   451   121     0     0     0
   425  0.83456777E-01     0   456   122     0     0     0
   1
   426  0.99998999E+00     0   450   122     0     0     0
   3
   427  0.88563246E+00     0   450   123     0     0     0
   427  0.30909775E-01     0   451   123     0     0     0
   427  0.83457731E-01     0   456   124     0     0     0
   1
   428  0.99998999E+00     0   450   124     0     0     0
   1
   429  0.10000000E+01     0   125   458     0     0     0
   3
   430  0.22523418E+00     0   121   129     0     0     0
   430  0.22523418E+00     0   127   123     0     0     0
   430  0.54953164E+00     0   1     7       0     0     0
   3
   431  0.88562900E+00     0   450   127     0     0     0
   431  0.30914206E-01     0   451   127     0     0     0
   431  0.83456777E-01     0   454   128     0     0     0
   1
   432  0.99998999E+00     0   450   128     0     0     0
   3
   433  0.88563246E+00     0   450   129     0     0     0
   433  0.30909775E-01     0   451   129     0     0     0
   433  0.83457731E-01     0   454   130     0     0     0
   1
   434  0.99998999E+00     0   450   130     0     0     0
   1
   435  0.10000000E+01     0   131   458     0     0     0
   1
   436  0.99964821E+00     0   450   132     0     0     0
   1
   437  0.10000000E+01     0   121   458     0     0     0
   0
   1
   439  0.10000000E+01     0   123   458     0     0     0
   0
   3
   441  0.91467530E+00     0   450   125     0     0     0
   441  0.17536042E-01     0   451   125     0     0     0
   441  0.62707722E-01     0   456   126     0     0     0
   0
   1
   443  0.10000000E+01     0   127   458     0     0     0
   0
   1
   445  0.10000000E+01     0   129   458     0     0     0
   0
   3
   447  0.91467530E+00     0   450   131     0     0     0
   447  0.17536042E-01     0   451   131     0     0     0
   447  0.62707722E-01     0   454   132     0     0     0
   0
  31
   449  0.89344289E-03     0   454     5    12     0     0
   449  0.89344289E-03     0   456     6    11     0     0
   449  0.12408327E-02     0   455     5    12     0     0
   449  0.12408327E-02     0   457     6    11     0     0
   449  0.82596653E-03     0   450     6    12     0     0
   449  0.87446315E-04     0   451    13     0     0     0
   449  0.91883028E-03     0   451     6    12     0     0
   449  0.31903843E-03     0   452    13     0     0     0
   449  0.59569272E-03     0   452     6    12     0     0
   449  0.23182044E-03     0   453    13     0     0     0
   449  0.27914456E-03     0   453     6    12     0     0
   449  0.16819615E-01     0   408     2     0     0     0
   449  0.16819615E-01     0   402     8     0     0     0
   449  0.10121794E-01     0   407     1     0     0     0
   449  0.10121794E-01     0   401     7     0     0     0
   449  0.72022073E-01     0   420     2     0     0     0
   449  0.72022073E-01     0   414     8     0     0     0
   449  0.74146204E-01     0   419     1     0     0     0
   449  0.74146204E-01     0   413     7     0     0     0
   449  0.10121002E-01     0   409     3     0     0     0
   449  0.10121002E-01     0   403     9     0     0     0
   449  0.74145302E-01     0   421     3     0     0     0
   449  0.74145302E-01     0   415     9     0     0     0
   449  0.16781243E-01     0   410     4     0     0     0
   449  0.16781243E-01     0   404    10     0     0     0
   449  0.71983747E-01     0   422     4     0     0     0
   449  0.71983747E-01     0   416    10     0     0     0
   449  0.76572634E-01     0   411     5     0     0     0
   449  0.76572634E-01     0   405    11     0     0     0
   449  0.73523164E-01     0   423     5     0     0     0
   449  0.73523164E-01     0   417    11     0     0     0
   4
   450  0.18285388E+00     0   437   127     0     0     0
   450  0.18285388E+00     0   443   121     0     0     0
   450  0.18284690E+00     0   439   129     0     0     0
   450  0.18284690E+00     0   445   123     0     0     0
  19
   451  0.98762139E-04     0   450     2     8     0     0
   451  0.12987820E-03     0   450     1     7     0     0
   451  0.12987820E-03     0   450     3     9     0     0
   451  0.98762124E-04     0   450     4    10     0     0
   451  0.13044372E-03     0   450     5    11     0     0
   451  0.74933589E-04     0   450   121   127     0     0
   451  0.74933385E-04     0   450   123   129     0     0
   451  0.82119557E-04     0   450   125   131     0     0
   451  0.55797733E-04     0   450   122   128     0     0
   451  0.55797733E-04     0   450   124   130     0     0
   451  0.55797733E-04     0   450   126   132     0     0
   451  0.13878460E+00     0   437   127     0     0     0
   451  0.13878460E+00     0   443   121     0     0     0
   451  0.13878447E+00     0   439   129     0     0     0
   451  0.13878447E+00     0   445   123     0     0     0
   451  0.19166756E-01     0   426   128     0     0     0
   451  0.19166756E-01     0   432   122     0     0     0
   451  0.19166756E-01     0   428   130     0     0     0
   451  0.19166756E-01     0   434   124     0     0     0
  27
   452  0.88495784E-01     0   454   199     0     0     0
   452  0.88495784E-01     0   456   198     0     0     0
   452  0.64625853E+00     0   450   200     0     0     0
   452  0.83269889E-03     0   451     2     8     0     0
   452  0.10682270E-02     0   451     1     7     0     0
   452  0.10682270E-02     0   451     3     9     0     0
   452  0.83269889E-03     0   451     4    10     0     0
   452  0.10594458E-02     0   451     5    11     0     0
   452  0.24300291E-03     0   451   121   127     0     0
   452  0.24300291E-03     0   451   123   129     0     0
   452  0.24269072E-03     0   451   125   131     0     0
   452  0.48349932E-03     0   451   122   128     0     0
   452  0.48349932E-03     0   451   124   130     0     0
   452  0.48349932E-03     0   451   126   132     0     0
   452  0.40807519E-01     0   450   203     0     0     0
   452  0.11823925E-02     0   425   127     0     0     0
   452  0.11823925E-02     0   431   121     0     0     0
   452  0.11823910E-02     0   427   129     0     0     0
   452  0.11823910E-02     0   433   123     0     0     0
   452  0.72884951E-02     0   437   127     0     0     0
   452  0.72884951E-02     0   443   121     0     0     0
   452  0.72884923E-02     0   439   129     0     0     0
   452  0.72884923E-02     0   445   123     0     0     0
   452  0.90741776E-02     0   426   128     0     0     0
   452  0.90741776E-02     0   432   122     0     0     0
   452  0.90741776E-02     0   428   130     0     0     0
   452  0.90741776E-02     0   434   124     0     0     0
  21
   453  0.18114343E+00     0   454   199     0     0     0
   453  0.18114343E+00     0   456   198     0     0     0
   453  0.78019896E-02     0   450   200     0     0     0
   453  0.82100229E-03     0   451   200     0     0     0
   453  0.12848609E-04     0   452     1     7     0     0
   453  0.12848609E-04     0   452     3     9     0     0
   453  0.11555299E-04     0   452     5    11     0     0
   453  0.40680408E-01     0   450   203     0     0     0
   453  0.93519194E-02     0   451   203     0     0     0
   453  0.29449632E-01     0   425   127     0     0     0
   453  0.29449632E-01     0   431   121     0     0     0
   453  0.29449617E-01     0   427   129     0     0     0
   453  0.29449617E-01     0   433   123     0     0     0
   453  0.58408920E-02     0   437   127     0     0     0
   453  0.58408920E-02     0   443   121     0     0     0
   453  0.58408901E-02     0   439   129     0     0     0
   453  0.58408901E-02     0   445   123     0     0     0
   453  0.60409456E-01     0   426   128     0     0     0
   453  0.60409456E-01     0   432   122     0     0     0
   453  0.60409456E-01     0   428   130     0     0     0
   453  0.60409456E-01     0   434   124     0     0     0
   6
   454  0.23272629E-03     0   450   127   122     0     0
   454  0.23272581E-03     0   450   129   124     0     0
   454  0.25593067E-03     0   450   131   126     0     0
   454  0.54818161E-01     0   450   198     0     0     0
   454  0.19304593E+00     0   426   127     0     0     0
   454  0.19303147E+00     0   428   129     0     0     0
  12
   455  0.21184538E-01     0   450   198     0     0     0
   455  0.20753597E+00     0   451   198     0     0     0
   455  0.33008535E-04     0   452     2     7     0     0
   455  0.33008535E-04     0   452     4     9     0     0
   455  0.10995095E-04     0   452   127   122     0     0
   455  0.10995095E-04     0   452   129   124     0     0
   455  0.10995146E-04     0   452   131   126     0     0
   455  0.87328307E-01     0   426   127     0     0     0
   455  0.87328300E-01     0   428   129     0     0     0
   455  0.11186451E+00     0   433   124     0     0     0
   455  0.14378892E+00     0   454   200     0     0     0
   455  0.24093894E-01     0   454   203     0     0     0
   7
   456  0.23272629E-03     0   450   121   128     0     0
   456  0.23272581E-03     0   450   123   130     0     0
   456  0.25593067E-03     0   450   125   132     0     0
   456  0.54818161E-01     0   450   199     0     0     0
   456  0.19304593E+00     0   432   121     0     0     0
   456  0.19303147E+00     0   434   123     0     0     0
   456  0.32586136E+00     0   436   125     0     0     0
  14
   457  0.21184538E-01     0   450   199     0     0     0
   457  0.20753597E+00     0   451   199     0     0     0
   457  0.33008535E-04     0   452     8     1     0     0
   457  0.33008535E-04     0   452    10     3     0     0
   457  0.10995095E-04     0   452   121   128     0     0
   457  0.10995095E-04     0   452   123   130     0     0
   457  0.10995146E-04     0   452   125   132     0     0
   457  0.87328307E-01     0   432   121     0     0     0
   457  0.87328300E-01     0   434   123     0     0     0
   457  0.90377457E-01     0   436   125     0     0     0
   457  0.11186454E+00     0   425   128     0     0     0
   457  0.11186451E+00     0   427   130     0     0     0
   457  0.14378892E+00     0   456   200     0     0     0
   457  0.24093894E-01     0   456   203     0     0     0
  22
   203  0.21805394E-03     0   123   129     0     0     0
   203  0.62342737E-01     0   125   131     0     0     0
   203  0.26235033E-02     0     3     9     0     0     0
   203  0.87361062E+00     0     5    11     0     0     0
   203  0.29039292E-01     0     4    10     0     0     0
   203  0.10728488E-02     0    59    59     0     0     0
   203  0.24731928E-01     0    13    13     0     0     0
   203  0.34861255E-03     0   198   121   128     0     0
   203  0.34861255E-03     0   198   123   130     0     0
   203  0.34861255E-03     0   198   125   132     0     0
   203  0.10458376E-02     0   198     8     1     0     0
   203  0.10458376E-02     0   198    10     3     0     0
   203  0.34861255E-03     0   199   127   122     0     0
   203  0.34861255E-03     0   199   129   124     0     0
   203  0.34861255E-03     0   199   131   126     0     0
   203  0.10458376E-02     0   199     2     7     0     0
   203  0.10458376E-02     0   199     4     9     0     0
   203  0.14669758E-04     0   200     2     8     0     0
   203  0.14669758E-04     0   200     4    10     0     0
   203  0.18898263E-04     0   200     1     7     0     0
   203  0.18898263E-04     0   200     3     9     0     0
   203  0.18898263E-04     0   200     5    11     0     0
  15
   204  0.26143665E-03     0   123   129     0     0     0
   204  0.74867636E-01     0   125   131     0     0     0
   204  0.30952892E-02     0     3     9     0     0     0
   204  0.50745106E+00     0     5    11     0     0     0
   204  0.86489425E-04     0     4    10     0     0     0
   204  0.48415437E-02     0     6    12     0     0     0
   204  0.15573383E-04     0    59    59     0     0     0
   204  0.27369887E-02     0    13    13     0     0     0
   204  0.44166777E-01     0   198   199     0     0     0
   204  0.20727247E-01     0   200   200     0     0     0
   204  0.80415182E-01     0   450   450     0     0     0
   204  0.59264261E-01     0   450   451     0     0     0
   204  0.17686374E+00     0   203   203     0     0     0
   204  0.85890079E-02     0   437   443     0     0     0
   204  0.85878428E-02     0   439   445     0     0     0
   9
   205  0.19030570E-03     0   123   129     0     0     0
   205  0.54503527E-01     0   125   131     0     0     0
   205  0.22534498E-02     0     3     9     0     0     0
   205  0.36959782E+00     0     5    11     0     0     0
   205  0.46035704E-04     0     4    10     0     0     0
   205  0.10220268E-02     0    13    13     0     0     0
   205  0.16761810E+00     0   450   450     0     0     0
   205  0.38060030E+00     0   450   451     0     0     0
   205  0.24012227E-01     0   203   200     0     0     0
   6
   206  0.10026455E-03     0   124   129     0     0     0
   206  0.28715855E-01     0   126   131     0     0     0
   206  0.11023704E-02     0     4     9     0     0     0
   206  0.75225139E+00     0     6    11     0     0     0
   206  0.20296489E+00     0   454   450     0     0     0
   206  0.14865280E-01     0   203   198     0     0     0
   6
   207  0.10026455E-03     0   130   123     0     0     0
   207  0.28715855E-01     0   132   125     0     0     0
   207  0.11023704E-02     0    10     3     0     0     0
   207  0.75225139E+00     0    12     5     0     0     0
   207  0.20296489E+00     0   456   450     0     0     0
   207  0.14865280E-01     0   203   199     0     0     0
   0
   5
     6  0.33333334E+00   100     2     7     5     0     0
     6  0.33333334E+00   100     4     9     5     0     0
     6  0.11111111E+00   100   122   127     5     0     0
     6  0.11111111E+00   100   124   129     5     0     0
     6  0.11111111E+00   100   126   131     5     0     0
   5
    12  0.33333334E+00   100     8     1    11     0     0
    12  0.33333334E+00   100    10     3    11     0     0
    12  0.11111111E+00   100   128   121    11     0     0
    12  0.11111111E+00   100   130   123    11     0     0
    12  0.11111111E+00   100   132   125    11     0     0
      5.00000000     -0.22996145
      0.95881039     -0.10797773      0.22856945     -0.12953641
     -0.23913795     -0.79900086      0.42922693     -0.34666252
      0.05999919     -0.08165172     -0.69414681     -0.71266651
     -0.14105318      0.58589363      0.53073591     -0.59594619
     -0.85018235      0.52648830     -0.52648830     -0.85018235
     -0.75515616      0.65554494     -0.65554494     -0.75515616
     -1.13709021     -0.77117264     -1.49464917
   -233.23774719   -267.94061279    -27.15861511
    275.08944702
    F
      0.00000000      0.00000000      0.00000000      0.00000000      0.00000000      0.00000000      0.00000000      0.00000000      0.00000000      0.00000000      0.00000000      0.00000000      0.00000000      0.00000000      0.00000000      0.00000000      0.00000000      0.00000000      0.00000000      0.07000000      0.00000000      0.07000000      0.00000000      0.00000000      0.00000000      0.00000000      0.00000000
      0.00000000      0.00000000      0.00000000      0.00000000      0.00000000      0.00000000      0.00000000      0.00000000      0.00000000      0.00000000      0.00000000      0.00000000      0.00000000      0.00000000      0.00000000      0.00000000      0.00000000      0.00000000      0.11000000      0.00000000      0.00000000      0.00000000      0.00000000      0.00000000      0.00000000      0.00000000      0.00000000
      0.00000000      0.00000000      0.00000000      0.00000000      0.00000000      0.00000000      0.00000000      0.00000000      0.00000000      0.00000000      0.00000000      0.00000000      0.00000000      0.00000000      0.00000000      0.00000000      0.00000000      0.00000000      0.00000000      0.00000000      0.00000000      0.00000000      0.00000000      0.00000000      0.00000000      0.00000000      0.00000000
