  65
  401    404.1066    0.17335E-24
  402    397.1791    0.16419E-24
  403    404.1067    0.17336E-24
  404    397.1816    0.16419E-24
  405    370.7843    0.26679E-24
  406    263.1946    0.44602E-24
  407    404.1066    0.17335E-24
  408    397.1791    0.16419E-24
  409    404.1067    0.17336E-24
  410    397.1816    0.16419E-24
  411    370.7843    0.26679E-24
  412    263.1946    0.44602E-24
  413    387.9537    0.32442E-23
  414    387.2056    0.81283E-24
  415    387.9538    0.32442E-23
  416    387.2082    0.81285E-24
  417    388.3616    0.17259E-23
  418    449.6293    0.15638E-24
  419    387.9537    0.32442E-23
  420    387.2056    0.81283E-24
  421    387.9538    0.32442E-23
  422    387.2082    0.81285E-24
  423    388.3616    0.17259E-23
  424    449.6293    0.15638E-24
  425    144.6592    0.16494E-23
  426    124.6609    0.23989E-23
  427    144.6593    0.16494E-23
  428    124.6609    0.23989E-23
  429    104.4560    0.29978E-23
  430    123.7801    0.24994E-23
  431    144.6592    0.16494E-23
  432    124.6609    0.23989E-23
  433    144.6593    0.16494E-23
  434    124.6609    0.23989E-23
  435    104.4560    0.29978E-23
  436    123.7801    0.24994E-23
  437    104.9214    0.29065E-23
  438      0.0000    0.10000E+31
  439    104.9214    0.29065E-23
  440      0.0000    0.10000E+31
  441    144.6058    0.16668E-23
  442      0.0000    0.10000E+31
  443    104.9214    0.29065E-23
  444      0.0000    0.10000E+31
  445    104.9214    0.29065E-23
  446      0.0000    0.10000E+31
  447    144.6058    0.16668E-23
  448      0.0000    0.10000E+31
  449    429.4796    0.20052E-24
  450     58.3570    0.10000E+31
  451    107.4177    0.24389E-20
  452   -264.7313    0.44964E-24
  453    299.8010    0.25602E-24
  454    103.7987    0.11496E-19
  455    294.5278    0.25692E-24
  456    103.7987    0.11496E-19
  457    294.5278    0.25692E-24
  203     92.8581    0.16176E-21
  204    315.3041    0.14988E-23
  205    308.1646    0.68283E-24
  206    320.0314    0.53815E-24
  207    320.0314    0.53815E-24
  458      0.0000    0.10000E+31
    6    172.5000    0.57395E-24
   12    172.5000    0.57395E-24
   6
   401  0.60915679E-01     0   450     1     0     0     0
   401  0.27424890E+00     0   451     1     0     0     0
   401  0.14728636E-02     0   452     1     0     0     0
   401  0.15654307E-01     0   453     1     0     0     0
   401  0.60259813E+00     0   456     2     0     0     0
   401  0.45110118E-01     0   457     2     0     0     0
   6
   402  0.38342146E-03     0   450     2     0     0     0
   402  0.32153571E+00     0   451     2     0     0     0
   402  0.79588458E-03     0   452     2     0     0     0
   402  0.99528395E-02     0   453     2     0     0     0
   402  0.65007126E+00     0   454     1     0     0     0
   402  0.17260900E-01     0   455     1     0     0     0
   6
   403  0.60916893E-01     0   450     3     0     0     0
   403  0.27425435E+00     0   451     3     0     0     0
   403  0.14728935E-02     0   452     3     0     0     0
   403  0.15654631E-01     0   453     3     0     0     0
   403  0.60259479E+00     0   456     4     0     0     0
   403  0.45106463E-01     0   457     4     0     0     0
   6
   404  0.38341520E-03     0   450     4     0     0     0
   404  0.32153004E+00     0   451     4     0     0     0
   404  0.79584698E-03     0   452     4     0     0     0
   404  0.99520003E-02     0   453     4     0     0     0
   404  0.65007716E+00     0   454     3     0     0     0
   404  0.17261555E-01     0   455     3     0     0     0
   6
   405  0.89538023E-01     0   450     5     0     0     0
   405  0.35750678E+00     0   451     5     0     0     0
   405  0.14637751E-02     0   452     5     0     0     0
   405  0.11571904E-01     0   453     5     0     0     0
   405  0.38005668E+00     0   456     6     0     0     0
   405  0.15986285E+00     0   199   406     0     0     0
   2
   406  0.62271286E-01     0   450     6     0     0     0
   406  0.93772870E+00     0   454     5     0     0     0
   6
   407  0.60915679E-01     0   450     7     0     0     0
   407  0.27424890E+00     0   451     7     0     0     0
   407  0.14728636E-02     0   452     7     0     0     0
   407  0.15654307E-01     0   453     7     0     0     0
   407  0.60259813E+00     0   454     8     0     0     0
   407  0.45110118E-01     0   455     8     0     0     0
   6
   408  0.38342146E-03     0   450     8     0     0     0
   408  0.32153571E+00     0   451     8     0     0     0
   408  0.79588458E-03     0   452     8     0     0     0
   408  0.99528395E-02     0   453     8     0     0     0
   408  0.65007126E+00     0   456     7     0     0     0
   408  0.17260900E-01     0   457     7     0     0     0
   6
   409  0.60916893E-01     0   450     9     0     0     0
   409  0.27425435E+00     0   451     9     0     0     0
   409  0.14728935E-02     0   452     9     0     0     0
   409  0.15654631E-01     0   453     9     0     0     0
   409  0.60259479E+00     0   454    10     0     0     0
   409  0.45106463E-01     0   455    10     0     0     0
   6
   410  0.38341520E-03     0   450    10     0     0     0
   410  0.32153004E+00     0   451    10     0     0     0
   410  0.79584698E-03     0   452    10     0     0     0
   410  0.99520003E-02     0   453    10     0     0     0
   410  0.65007716E+00     0   456     9     0     0     0
   410  0.17261555E-01     0   457     9     0     0     0
   6
   411  0.89538023E-01     0   450    11     0     0     0
   411  0.35750678E+00     0   451    11     0     0     0
   411  0.14637751E-02     0   452    11     0     0     0
   411  0.11571904E-01     0   453    11     0     0     0
   411  0.38005668E+00     0   454    12     0     0     0
   411  0.15986285E+00     0   198   412     0     0     0
   2
   412  0.62271286E-01     0   450    12     0     0     0
   412  0.93772870E+00     0   456    11     0     0     0
   4
   413  0.91837943E+00     0   450     1     0     0     0
   413  0.76326646E-01     0   451     1     0     0     0
   413  0.10959238E-02     0   452     1     0     0     0
   413  0.41980203E-02     0   453     1     0     0     0
   4
   414  0.91846186E+00     0   450     2     0     0     0
   414  0.76298147E-01     0   451     2     0     0     0
   414  0.10888417E-02     0   452     2     0     0     0
   414  0.41511306E-02     0   453     2     0     0     0
   4
   415  0.91837943E+00     0   450     3     0     0     0
   415  0.76326646E-01     0   451     3     0     0     0
   415  0.10959244E-02     0   452     3     0     0     0
   415  0.41980240E-02     0   453     3     0     0     0
   4
   416  0.91846234E+00     0   450     4     0     0     0
   416  0.76298065E-01     0   451     4     0     0     0
   416  0.10888012E-02     0   452     4     0     0     0
   416  0.41507711E-02     0   453     4     0     0     0
   6
   417  0.46386668E+00     0   450     5     0     0     0
   417  0.17358463E+00     0   451     5     0     0     0
   417  0.12116591E-01     0   452     5     0     0     0
   417  0.23794230E-01     0   453     5     0     0     0
   417  0.15846537E+00     0   456     6     0     0     0
   417  0.16817251E+00     0   199   406     0     0     0
   7
   418  0.18566519E+00     0   454     5     0     0     0
   418  0.33868906E+00     0   455     5     0     0     0
   418  0.30332941E+00     0   200   406     0     0     0
   418  0.39955094E-01     0   203   406     0     0     0
   418  0.18047959E-01     0   450     6     0     0     0
   418  0.99004522E-01     0   451     6     0     0     0
   418  0.15308789E-01     0   452     6     0     0     0
   4
   419  0.91837943E+00     0   450     7     0     0     0
   419  0.76326646E-01     0   451     7     0     0     0
   419  0.10959238E-02     0   452     7     0     0     0
   419  0.41980203E-02     0   453     7     0     0     0
   4
   420  0.91846186E+00     0   450     8     0     0     0
   420  0.76298147E-01     0   451     8     0     0     0
   420  0.10888417E-02     0   452     8     0     0     0
   420  0.41511306E-02     0   453     8     0     0     0
   4
   421  0.91837943E+00     0   450     9     0     0     0
   421  0.76326646E-01     0   451     9     0     0     0
   421  0.10959244E-02     0   452     9     0     0     0
   421  0.41980240E-02     0   453     9     0     0     0
   4
   422  0.91846234E+00     0   450    10     0     0     0
   422  0.76298065E-01     0   451    10     0     0     0
   422  0.10888012E-02     0   452    10     0     0     0
   422  0.41507711E-02     0   453    10     0     0     0
   6
   423  0.46386668E+00     0   450    11     0     0     0
   423  0.17358463E+00     0   451    11     0     0     0
   423  0.12116591E-01     0   452    11     0     0     0
   423  0.23794230E-01     0   453    11     0     0     0
   423  0.15846537E+00     0   454    12     0     0     0
   423  0.16817251E+00     0   198   412     0     0     0
   7
   424  0.18566519E+00     0   456    11     0     0     0
   424  0.33868906E+00     0   457    11     0     0     0
   424  0.30332941E+00     0   200   412     0     0     0
   424  0.39955094E-01     0   203   412     0     0     0
   424  0.18047959E-01     0   450    12     0     0     0
   424  0.99004522E-01     0   451    12     0     0     0
   424  0.15308789E-01     0   452    12     0     0     0
   3
   425  0.10588052E+00     0   450   121     0     0     0
   425  0.34039336E+00     0   451   121     0     0     0
   425  0.55372614E+00     0   456   122     0     0     0
   3
   426  0.60820246E+00     0   450   122     0     0     0
   426  0.68774693E-01     0   451   122     0     0     0
   426  0.32302284E+00     0   454   121     0     0     0
   3
   427  0.10588049E+00     0   450   123     0     0     0
   427  0.34039223E+00     0   451   123     0     0     0
   427  0.55372727E+00     0   456   124     0     0     0
   3
   428  0.60820544E+00     0   450   124     0     0     0
   428  0.68775028E-01     0   451   124     0     0     0
   428  0.32301953E+00     0   454   123     0     0     0
   2
   429  0.99998355E+00     0   450   125     0     0     0
   429  0.16471338E-04     0   456   126     0     0     0
   3
   430  0.62417448E+00     0   450   126     0     0     0
   430  0.65410696E-01     0   451   126     0     0     0
   430  0.31041485E+00     0   454   125     0     0     0
   3
   431  0.10588052E+00     0   450   127     0     0     0
   431  0.34039336E+00     0   451   127     0     0     0
   431  0.55372614E+00     0   454   128     0     0     0
   3
   432  0.60820246E+00     0   450   128     0     0     0
   432  0.68774693E-01     0   451   128     0     0     0
   432  0.32302284E+00     0   456   127     0     0     0
   3
   433  0.10588049E+00     0   450   129     0     0     0
   433  0.34039223E+00     0   451   129     0     0     0
   433  0.55372727E+00     0   454   130     0     0     0
   3
   434  0.60820544E+00     0   450   130     0     0     0
   434  0.68775028E-01     0   451   130     0     0     0
   434  0.32301953E+00     0   456   129     0     0     0
   2
   435  0.99998355E+00     0   450   131     0     0     0
   435  0.16471338E-04     0   454   132     0     0     0
   3
   436  0.62417448E+00     0   450   132     0     0     0
   436  0.65410696E-01     0   451   132     0     0     0
   436  0.31041485E+00     0   456   131     0     0     0
   1
   437  0.10000000E+01     0   450   121     0     0     0
   0
   1
   439  0.10000000E+01     0   450   123     0     0     0
   0
   3
   441  0.12817441E+00     0   450   125     0     0     0
   441  0.33187413E+00     0   451   125     0     0     0
   441  0.53995144E+00     0   456   126     0     0     0
   0
   1
   443  0.10000000E+01     0   450   127     0     0     0
   0
   1
   445  0.10000000E+01     0   450   129     0     0     0
   0
   3
   447  0.12817441E+00     0   450   131     0     0     0
   447  0.33187413E+00     0   451   131     0     0     0
   447  0.53995144E+00     0   454   132     0     0     0
   0
  26
   449  0.48217189E-03     0   454     5    12     0     0
   449  0.48217189E-03     0   456     6    11     0     0
   449  0.32110791E-04     0   450     6    12     0     0
   449  0.22768971E-04     0   451    13     0     0     0
   449  0.54935063E-04     0   452    13     0     0     0
   449  0.50201321E-04     0   453    13     0     0     0
   449  0.34565825E-01     0   408     2     0     0     0
   449  0.34565825E-01     0   402     8     0     0     0
   449  0.21687999E-01     0   407     1     0     0     0
   449  0.21687999E-01     0   401     7     0     0     0
   449  0.57787247E-01     0   420     2     0     0     0
   449  0.57787247E-01     0   414     8     0     0     0
   449  0.55862267E-01     0   419     1     0     0     0
   449  0.55862267E-01     0   413     7     0     0     0
   449  0.21687277E-01     0   409     3     0     0     0
   449  0.21687277E-01     0   403     9     0     0     0
   449  0.55861540E-01     0   421     3     0     0     0
   449  0.55861540E-01     0   415     9     0     0     0
   449  0.34532793E-01     0   410     4     0     0     0
   449  0.34532793E-01     0   404    10     0     0     0
   449  0.57754107E-01     0   422     4     0     0     0
   449  0.57754107E-01     0   416    10     0     0     0
   449  0.10178037E+00     0   411     5     0     0     0
   449  0.10178037E+00     0   405    11     0     0     0
   449  0.57918400E-01     0   423     5     0     0     0
   449  0.57918400E-01     0   417    11     0     0     0
   0
  17
   451  0.49372384E-03     0   450     2     8     0     0
   451  0.95189689E-03     0   450     1     7     0     0
   451  0.95189671E-03     0   450     3     9     0     0
   451  0.49372303E-03     0   450     4    10     0     0
   451  0.97476383E-03     0   450     5    11     0     0
   451  0.16949630E-02     0   450   121   127     0     0
   451  0.16949603E-02     0   450   123   129     0     0
   451  0.18451277E-02     0   450   125   131     0     0
   451  0.13638238E-01     0   450   122   128     0     0
   451  0.13638238E-01     0   450   124   130     0     0
   451  0.14566392E-01     0   450   126   132     0     0
   451  0.17697380E+00     0   437   127     0     0     0
   451  0.17697380E+00     0   443   121     0     0     0
   451  0.17681171E+00     0   439   129     0     0     0
   451  0.17681171E+00     0   445   123     0     0     0
   451  0.12074251E+00     0   429   131     0     0     0
   451  0.12074251E+00     0   435   125     0     0     0
  24
   452  0.30490193E+00     0   454   199     0     0     0
   452  0.30490193E+00     0   456   198     0     0     0
   452  0.17718692E+00     0   450   200     0     0     0
   452  0.15767629E+00     0   451   200     0     0     0
   452  0.15552436E-01     0   450   203     0     0     0
   452  0.65215002E-02     0   451   203     0     0     0
   452  0.60350297E-03     0   425   127     0     0     0
   452  0.60350297E-03     0   431   121     0     0     0
   452  0.60350267E-03     0   427   129     0     0     0
   452  0.60350267E-03     0   433   123     0     0     0
   452  0.11605941E-02     0   437   127     0     0     0
   452  0.11605941E-02     0   443   121     0     0     0
   452  0.11605935E-02     0   439   129     0     0     0
   452  0.11605935E-02     0   445   123     0     0     0
   452  0.13127651E-02     0   429   131     0     0     0
   452  0.13127651E-02     0   435   125     0     0     0
   452  0.14195329E-02     0   441   131     0     0     0
   452  0.14195329E-02     0   447   125     0     0     0
   452  0.34471001E-02     0   426   128     0     0     0
   452  0.34470996E-02     0   432   122     0     0     0
   452  0.34471001E-02     0   428   130     0     0     0
   452  0.34470996E-02     0   434   124     0     0     0
   452  0.34748148E-02     0   430   132     0     0     0
   452  0.34748148E-02     0   436   126     0     0     0
  25
   453  0.24498551E+00     0   454   199     0     0     0
   453  0.24498551E+00     0   456   198     0     0     0
   453  0.13445767E-01     0   450   200     0     0     0
   453  0.72339792E-02     0   451   200     0     0     0
   453  0.11019256E-04     0   451     5    11     0     0
   453  0.74735820E-01     0   450   203     0     0     0
   453  0.76555632E-01     0   451   203     0     0     0
   453  0.13207579E-01     0   425   127     0     0     0
   453  0.13207579E-01     0   431   121     0     0     0
   453  0.13207574E-01     0   427   129     0     0     0
   453  0.13207574E-01     0   433   123     0     0     0
   453  0.54675536E-02     0   437   127     0     0     0
   453  0.54675536E-02     0   443   121     0     0     0
   453  0.54675522E-02     0   439   129     0     0     0
   453  0.54675522E-02     0   445   123     0     0     0
   453  0.49273600E-02     0   429   131     0     0     0
   453  0.49273600E-02     0   435   125     0     0     0
   453  0.14087520E-01     0   441   131     0     0     0
   453  0.14087520E-01     0   447   125     0     0     0
   453  0.37479091E-01     0   426   128     0     0     0
   453  0.37479091E-01     0   432   122     0     0     0
   453  0.37479091E-01     0   428   130     0     0     0
   453  0.37479091E-01     0   434   124     0     0     0
   453  0.37700061E-01     0   430   132     0     0     0
   453  0.37700061E-01     0   436   126     0     0     0
   5
   454  0.21417230E+00     0   450     2     7     0     0
   454  0.21417230E+00     0   450     4     9     0     0
   454  0.18137929E+00     0   450   127   122     0     0
   454  0.18137929E+00     0   450   129   124     0     0
   454  0.20889682E+00     0   450   131   126     0     0
  14
   455  0.13101026E-01     0   450   198     0     0     0
   455  0.29870585E+00     0   451   198     0     0     0
   455  0.46590962E-01     0   406    11     0     0     0
   455  0.33307962E-01     0   426   127     0     0     0
   455  0.33307958E-01     0   428   129     0     0     0
   455  0.33997066E-01     0   430   131     0     0     0
   455  0.63825846E-01     0   431   122     0     0     0
   455  0.63825823E-01     0   433   124     0     0     0
   455  0.39081785E-03     0   435   126     0     0     0
   455  0.64086460E-01     0   447   126     0     0     0
   455  0.21939889E+00     0   454   200     0     0     0
   455  0.12923996E-04     0   454     2     8     0     0
   455  0.12923984E-04     0   454     4    10     0     0
   455  0.12943549E+00     0   454   203     0     0     0
   5
   456  0.21417230E+00     0   450     8     1     0     0
   456  0.21417230E+00     0   450    10     3     0     0
   456  0.18137929E+00     0   450   121   128     0     0
   456  0.18137929E+00     0   450   123   130     0     0
   456  0.20889682E+00     0   450   125   132     0     0
  14
   457  0.13101026E-01     0   450   199     0     0     0
   457  0.29870585E+00     0   451   199     0     0     0
   457  0.46590962E-01     0   412     5     0     0     0
   457  0.33307962E-01     0   432   121     0     0     0
   457  0.33307958E-01     0   434   123     0     0     0
   457  0.33997066E-01     0   436   125     0     0     0
   457  0.63825846E-01     0   425   128     0     0     0
   457  0.63825823E-01     0   427   130     0     0     0
   457  0.39081785E-03     0   429   132     0     0     0
   457  0.64086460E-01     0   441   132     0     0     0
   457  0.21939889E+00     0   456   200     0     0     0
   457  0.12923996E-04     0   456     8     2     0     0
   457  0.12923984E-04     0   456    10     4     0     0
   457  0.12943549E+00     0   456   203     0     0     0
  17
   203  0.21711864E-03     0   123   129     0     0     0
   203  0.62049992E-01     0   125   131     0     0     0
   203  0.26164986E-02     0     3     9     0     0     0
   203  0.88393694E+00     0     5    11     0     0     0
   203  0.29310985E-01     0     4    10     0     0     0
   203  0.88191789E-03     0    59    59     0     0     0
   203  0.20560762E-01     0    13    13     0     0     0
   203  0.23654762E-04     0   198   121   128     0     0
   203  0.23654762E-04     0   198   123   130     0     0
   203  0.23654762E-04     0   198   125   132     0     0
   203  0.70964285E-04     0   198     8     1     0     0
   203  0.70964285E-04     0   198    10     3     0     0
   203  0.23654762E-04     0   199   127   122     0     0
   203  0.23654762E-04     0   199   129   124     0     0
   203  0.23654762E-04     0   199   131   126     0     0
   203  0.70964285E-04     0   199     2     7     0     0
   203  0.70964285E-04     0   199     4     9     0     0
  25
   204  0.44685239E-04     0   123   129     0     0     0
   204  0.12796108E-01     0   125   131     0     0     0
   204  0.52961009E-03     0     3     9     0     0     0
   204  0.90794042E-01     0     5    11     0     0     0
   204  0.11608256E-03     0     4    10     0     0     0
   204  0.15837815E-04     0    59    59     0     0     0
   204  0.23393915E-02     0    13    13     0     0     0
   204  0.40988643E-01     0   198   199     0     0     0
   204  0.18918380E-01     0   200   200     0     0     0
   204  0.75100794E-01     0   450   450     0     0     0
   204  0.13306876E+00     0   450   451     0     0     0
   204  0.49808357E-01     0   451   451     0     0     0
   204  0.26424429E+00     0   454   456     0     0     0
   204  0.12919252E+00     0   203   203     0     0     0
   204  0.77967453E-02     0   425   431     0     0     0
   204  0.10969788E-01     0   437   443     0     0     0
   204  0.77963877E-02     0   427   433     0     0     0
   204  0.10969213E-01     0   439   445     0     0     0
   204  0.11026790E-01     0   429   435     0     0     0
   204  0.76009901E-02     0   441   447     0     0     0
   204  0.12680511E-04     0   429   447     0     0     0
   204  0.12680511E-04     0   441   435     0     0     0
   204  0.41789725E-01     0   426   432     0     0     0
   204  0.41789725E-01     0   428   434     0     0     0
   204  0.42277783E-01     0   430   436     0     0     0
  11
   205  0.20644819E-04     0   123   129     0     0     0
   205  0.59126006E-02     0   125   131     0     0     0
   205  0.24474773E-03     0     3     9     0     0     0
   205  0.41980512E-01     0     5    11     0     0     0
   205  0.39110986E-04     0     4    10     0     0     0
   205  0.53017511E-03     0    13    13     0     0     0
   205  0.87147221E-01     0   450   450     0     0     0
   205  0.20097117E+00     0   450   451     0     0     0
   205  0.11398631E+00     0   451   451     0     0     0
   205  0.53576177E+00     0   454   456     0     0     0
   205  0.13405715E-01     0   203   200     0     0     0
  11
   206  0.16896613E-04     0   124   129     0     0     0
   206  0.48391516E-02     0   126   131     0     0     0
   206  0.21101392E-03     0     4     9     0     0     0
   206  0.77191687E+00     0     6    11     0     0     0
   206  0.15399414E+00     0   454   450     0     0     0
   206  0.14912243E-01     0   454   451     0     0     0
   206  0.13418629E-01     0   203   198     0     0     0
   206  0.13499400E-01     0   431   426     0     0     0
   206  0.13499166E-01     0   433   428     0     0     0
   206  0.61125134E-03     0   435   430     0     0     0
   206  0.13081232E-01     0   447   430     0     0     0
  11
   207  0.16896613E-04     0   130   123     0     0     0
   207  0.48391516E-02     0   132   125     0     0     0
   207  0.21101392E-03     0    10     3     0     0     0
   207  0.77191687E+00     0    12     5     0     0     0
   207  0.15399414E+00     0   456   450     0     0     0
   207  0.14912243E-01     0   456   451     0     0     0
   207  0.13418629E-01     0   203   199     0     0     0
   207  0.13499400E-01     0   425   432     0     0     0
   207  0.13499166E-01     0   427   434     0     0     0
   207  0.61125134E-03     0   429   436     0     0     0
   207  0.13081232E-01     0   441   436     0     0     0
   0
   5
     6  0.33333334E+00   100     2     7     5     0     0
     6  0.33333334E+00   100     4     9     5     0     0
     6  0.11111111E+00   100   122   127     5     0     0
     6  0.11111111E+00   100   124   129     5     0     0
     6  0.11111111E+00   100   126   131     5     0     0
   5
    12  0.33333334E+00   100     8     1    11     0     0
    12  0.33333334E+00   100    10     3    11     0     0
    12  0.11111111E+00   100   128   121    11     0     0
    12  0.11111111E+00   100   130   123    11     0     0
    12  0.11111111E+00   100   132   125    11     0     0
      3.00000000     -0.37271655
      0.94321758     -0.20379469      0.23254246     -0.12137613
     -0.28783229     -0.89462894      0.28505737     -0.18850441
      0.05959608     -0.08952652     -0.69251746     -0.71333975
      0.15472978     -0.38741672     -0.62055343      0.66398841
     -0.94755012      0.31960720     -0.31960720     -0.94755012
     -0.87801719      0.47862914     -0.47862914     -0.87801719
     -0.92261106     -0.26062983     -1.41266549
   -313.66622925   -503.86190796   -109.11058044
    261.65985107
    T
