#  ISAJET SUSY parameters in SUSY Les Houches Accord 2 format
#  Created by ISALHA 2.0 Last revision: C. Balazs 21 Apr 2009
Block SPINFO   # Program information
     1   ISASUGRA from ISAJET          # Spectrum Calculator
     2   7.80   29-OCT-2009 12:50:36   # Version number
Block MODSEL   # Model selection
     1    13   # Non-universal supergravity model                  
Block SMINPUTS   # Standard Model inputs
     1     1.27836243E+02   # alpha_em^(-1)
     2     1.16570000E-05   # G_Fermi
     3     1.17200002E-01   # alpha_s(M_Z)
     4     9.11699982E+01   # m_{Z}(pole)
     5     4.19999981E+00   # m_{b}(m_{b})
     6     1.72500000E+02   # m_{top}(pole)
     7     1.77699995E+00   # m_{tau}(pole)
Block MINPAR   # SUSY breaking input parameters
     1     5.00000000E+03   # m_0
     2     5.00000000E+03   # m_{1/2}
     3     1.04999995E+00   # tan(beta)
     4     1.00000000E+00   # sign(mu)
     5     0.00000000E+00   # A_0
Block EXTPAR   # Non-universal SUSY breaking parameters
     0     1.00000000E+04   # Input scale
    21    -1.21530960E+07   # Down type Higgs mass squared
    22    -1.21524730E+07   #  Up  type Higgs mass squared
     1     0.00000000E+00   #  U(1)_Y gaugino (Bino) mass
     2     5.00000000E+03   # SU(2)_L gaugino (Wino) mass
     3     5.00000000E+02   # SU(3)_C gaugino (gluino) mass
    34     5.00000000E+03   # Right scalar electron mass
    31     5.00000000E+03   # Left 1st gen. slepton mass
    47     5.00000000E+02   # Right scalar down mass
    44     5.00000000E+02   # Right scalar  up  mass
    41     5.00000000E+02   # Left 1st gen. squark mass
    36     5.00000000E+03   # Right scalar tau mass
    33     5.00000000E+03   # Left 3rd gen. slepton mass
    49     5.00000000E+03   # Right scalar bottom mass
    46     5.00000000E+03   # Right scalar top mass
    43     5.00000000E+03   # Left 3rd gen. squark mass
Block MASS   # Scalar and gaugino mass spectrum
#  PDG code   mass                 particle
        24     8.04229965E+01   #  W^+
        25     5.00000000e+03   #  h^0            
        35     5.00000000e+03   #  H^0            
        36     5.00000000e+03   #  A^0            
        37     5.00000000e+03   #  H^+            
   1000001     1.60000000e+03   #  dnl            
   1000002     1.60000000e+03   #  upl            
   1000003     1.60000000e+03   #  stl            
   1000004     1.60000000e+03   #  chl            
   1000005     5.00000000e+03   #  b1             
   1000006     5.00000000e+03   #  t1             
   1000011     5.00000000e+03   #  el-            
   1000012     5.00000000e+03   #  nuel           
   1000013     5.00000000e+03   #  mul-           
   1000014     5.00000000e+03   #  numl           
   1000015     5.00000000e+03   #  tau1           
   1000016     5.00000000e+03   #  nutl           
   1000021     6.00000000e+02   #  glss           
   1000022     0.00000000e+00   #  z1ss           
   1000023     5.00000000e+03   #  z2ss           
   1000024     5.00000000e+03   #  w1ss           
   1000025     5.00000000e+03   #  z3ss           
   1000035     5.00000000e+03   #  z4ss           
   1000037     5.00000000e+03   #  w2ss           
   2000001     1.60000000e+03   #  dnr            
   2000002     1.60000000e+03   #  upr            
   2000003     1.60000000e+03   #  str            
   2000004     1.60000000e+03   #  chr            
   2000005     5.00000000e+03   #  b2             
   2000006     5.00000000e+03   #  t2             
   2000011     5.00000000e+03   #  er-            
   2000013     5.00000000e+03   #  mur-           
   2000015     5.00000000e+03   #  tau2           
Block ALPHA   # Effective Higgs mixing parameter
         -7.61225343E-01   # alpha
Block STOPMIX   # stop mixing matrix
  1  1     4.11578804E-01   # O_{11}
  1  2     9.11374152E-01   # O_{12}
  2  1    -9.11374152E-01   # O_{21}
  2  2     4.11578804E-01   # O_{22}
Block SBOTMIX   # sbottom mixing matrix
  1  1     7.21292436E-01   # O_{11}
  1  2     6.92630649E-01   # O_{12}
  2  1    -6.92630649E-01   # O_{21}
  2  2     7.21292436E-01   # O_{22}
Block STAUMIX   # stau mixing matrix
  1  1     1.15967337E-02   # O_{11}
  1  2     9.99932766E-01   # O_{12}
  2  1    -9.99932766E-01   # O_{21}
  2  2     1.15967337E-02   # O_{22}
Block NMIX   # neutralino mixing matrix
  1  1     9.99965727E-01   #
  1  2     6.19883998E-04   #
  1  3     5.98469656E-03   #
  1  4    -5.69890067E-03   #
  2  1    -3.05461744E-03   #
  2  2    -8.99356544E-01   #
  2  3     3.09205741E-01   #
  2  4    -3.09095919E-01   #
  3  1    -2.02044539E-04   #
  3  2     8.11236241E-05   #
  3  3     7.07098126E-01   #
  3  4     7.07115471E-01   #
  4  1    -7.70109193E-03   #
  4  2     4.37215477E-01   #
  4  3     6.35899603E-01   #
  4  4    -6.35936439E-01   #
Block UMIX   # chargino U mixing matrix
  1  1    -8.51988018E-01   # U_{11}
  1  2     5.23561239E-01   # U_{12}
  2  1    -5.23561239E-01   # U_{21}
  2  2    -8.51988018E-01   # U_{22}
Block VMIX   # chargino V mixing matrix
  1  1    -8.51987004E-01   # V_{11}
  1  2     5.23562908E-01   # V_{12}
  2  1    -5.23562908E-01   # V_{21}
  2  2    -8.51987004E-01   # V_{22}
Block GAUGE Q=  4.95367969E+03   #
     1     3.57524991E-01   # g`
     2     6.52378619E-01   # g_2
     3     1.21928000E+00   # g_3
Block YU Q=  4.95367969E+03   #
  3  3     1.11666286E+00   # y_t
Block YD Q=  4.95367969E+03   #
  3  3     1.78913847E-02   # y_b
Block YE Q=  4.95367969E+03   #
  3  3     1.46171292E-02   # y_tau
Block HMIX Q=  4.95367969E+03   # Higgs mixing parameters
     1     5.00000000E+03   # mu(Q)
     2     1.04999995E+00   # tan(beta)(M_GUT)
     3     2.52928284E+02   # Higgs vev at Q
     4     2.50000000E+07   # m_A^2(Q)
Block MSOFT Q=  4.95367969E+03   # DRbar SUSY breaking parameters
     1    -2.49941841E-01   # M_1(Q)          
     2     4.97828369E+03   # M_2(Q)          
     3     5.71167542E+02   # M_3(Q)          
    31     5.02573047E+03   # MeL(Q)          
    32     5.02573047E+03   # MmuL(Q)         
    33     5.02622510E+03   # MtauL(Q)        
    34     4.99976221E+03   # MeR(Q)          
    35     4.99976221E+03   # MmuR(Q)         
    36     4.99974414E+03   # MtauR(Q)        
    41     1.03033508E+03   # MqL1(Q)         
    42     1.03033508E+03   # MqL2(Q)         
    43     4.98691504E+03   # MqL3(Q)         
    44     4.90182617E+02   # MuR(Q)          
    45     4.90182617E+02   # McR(Q)          
    46     4.92066553E+03   # MtR(Q)          
    47     4.83325043E+02   # MdR(Q)          
    48     4.83325043E+02   # MsR(Q)          
    49     4.99957080E+03   # MbR(Q)          
Block AU Q=  4.95367969E+03   #
  1  1    -7.30358887E+01   # A_u
  2  2    -7.30358887E+01   # A_c
  3  3    -7.30358887E+01   # A_t
Block AD Q=  4.95367969E+03   #
  1  1    -7.64760590E+01   # A_d
  2  2    -7.64760590E+01   # A_s
  3  3    -7.64760590E+01   # A_b
Block AE Q=  4.95367969E+03   #
  1  1    -5.29883537E+01   # A_e
  2  2    -5.29883537E+01   # A_mu
  3  3    -5.29883537E+01   # A_tau
#  ISAJET decay tables in SUSY Les Houches accord format
#  Created by ISALHD. Last revision: C. Balazs, 2005 May 25
Block DCINFO                           # Program information
     1   ISASUGRA from ISAJET          # Spectrum Calculator
     2   7.80   29-OCT-2009 12:50:36   # Version number
#         PDG         Width
DECAY         6  1.14680767E+00   # TP    decays
#          BR          NDA       ID1       ID2       ID3       ID4
      3.33333343E-01    3            2        -1         5             # TP     -->  UP     DB     BT          
      3.33333343E-01    3            4        -3         5             # TP     -->  CH     SB     BT          
      1.11111112E-01    3          -11        12         5             # TP     -->  E+     NUE    BT          
      1.11111112E-01    3          -13        14         5             # TP     -->  MU+    NUM    BT          
      1.11111112E-01    3          -15        16         5             # TP     -->  TAU+   NUT    BT          
#         PDG         Width
DECAY   1000021  5.35530198E-05   # GLSS  decays
#          BR          NDA       ID1       ID2       ID3       ID4
      2.56062344E-06    2      1000022        21                       # GLSS   -->  Z1SS   GL                 
      3.85654509E-01    3      1000022         2        -2             # GLSS   -->  Z1SS   UP     UB          
      1.13461442E-01    3      1000022         1        -1             # GLSS   -->  Z1SS   DN     DB          
      1.13461442E-01    3      1000022         3        -3             # GLSS   -->  Z1SS   ST     SB          
      3.85654002E-01    3      1000022         4        -4             # GLSS   -->  Z1SS   CH     CB          
      1.06798520E-03    3      1000022         5        -5             # GLSS   -->  Z1SS   BT     BB          
      6.98039599E-04    3      1000022         6        -6             # GLSS   -->  Z1SS   TP     TB          
#         PDG         Width
DECAY   1000002  6.94435959E+01   # UPL   decays
#          BR          NDA       ID1       ID2       ID3       ID4
      3.24985897E-03    2      1000022         2                       # UPL    -->  Z1SS   UP                 
      9.96750116E-01    2      1000021         2                       # UPL    -->  GLSS   UP                 
#         PDG         Width
DECAY   1000001  6.94508438E+01   # DNL   decays
#          BR          NDA       ID1       ID2       ID3       ID4
      3.25981062E-03    2      1000022         1                       # DNL    -->  Z1SS   DN                 
      9.96740222E-01    2      1000021         1                       # DNL    -->  GLSS   DN                 
#         PDG         Width
DECAY   1000003  6.94508514E+01   # STL   decays
#          BR          NDA       ID1       ID2       ID3       ID4
      3.25981062E-03    2      1000022         3                       # STL    -->  Z1SS   ST                 
      9.96740222E-01    2      1000021         3                       # STL    -->  GLSS   ST                 
#         PDG         Width
DECAY   1000004  6.94434967E+01   # CHL   decays
#          BR          NDA       ID1       ID2       ID3       ID4
      3.24985990E-03    2      1000022         4                       # CHL    -->  Z1SS   CH                 
      9.96750116E-01    2      1000021         4                       # CHL    -->  GLSS   CH                 
#         PDG         Width
DECAY   1000005  2.57750366E+02   # BT1   decays
#          BR          NDA       ID1       ID2       ID3       ID4
      6.88674999E-03    2      1000022         5                       # BT1    -->  Z1SS   BT                 
      2.10984726E-05    2      1000023         5                       # BT1    -->  Z2SS   BT                 
      9.93092120E-01    2      1000021         5                       # BT1    -->  GLSS   BT                 
#         PDG         Width
DECAY   1000006  2.60551758E+02   # TP1   decays
#          BR          NDA       ID1       ID2       ID3       ID4
      9.76664722E-01    2      1000021         6                       # TP1    -->  GLSS   TP                 
      2.33198088E-02    2      1000022         6                       # TP1    -->  Z1SS   TP                 
      1.55153411E-05    2      1000024         5                       # TP1    -->  W1SS+  BT                 
#         PDG         Width
DECAY   2000002  7.28361053E+01   # UPR   decays
#          BR          NDA       ID1       ID2       ID3       ID4
      4.96535413E-02    2      1000022         2                       # UPR    -->  Z1SS   UP                 
      9.50346470E-01    2      1000021         2                       # UPR    -->  GLSS   UP                 
#         PDG         Width
DECAY   2000001  7.01256714E+01   # DNR   decays
#          BR          NDA       ID1       ID2       ID3       ID4
      1.28934104E-02    2      1000022         1                       # DNR    -->  Z1SS   DN                 
      9.87106562E-01    2      1000021         1                       # DNR    -->  GLSS   DN                 
#         PDG         Width
DECAY   2000003  7.01256714E+01   # STR   decays
#          BR          NDA       ID1       ID2       ID3       ID4
      1.28934104E-02    2      1000022         3                       # STR    -->  Z1SS   ST                 
      9.87106562E-01    2      1000021         3                       # STR    -->  GLSS   ST                 
#         PDG         Width
DECAY   2000004  7.28360062E+01   # CHR   decays
#          BR          NDA       ID1       ID2       ID3       ID4
      4.96535487E-02    2      1000022         4                       # CHR    -->  Z1SS   CH                 
      9.50346410E-01    2      1000021         4                       # CHR    -->  GLSS   CH                 
#         PDG         Width
DECAY   2000005  2.57741211E+02   # BT2   decays
#          BR          NDA       ID1       ID2       ID3       ID4
      6.82034111E-03    2      1000022         5                       # BT2    -->  Z1SS   BT                 
      1.99940041E-05    2      1000023         5                       # BT2    -->  Z2SS   BT                 
      9.93159652E-01    2      1000021         5                       # BT2    -->  GLSS   BT                 
#         PDG         Width
DECAY   2000006  2.62724976E+02   # TP2   decays
#          BR          NDA       ID1       ID2       ID3       ID4
      9.75945473E-01    2      1000021         6                       # TP2    -->  GLSS   TP                 
      4.54312612E-05    2      1000024         5                       # TP2    -->  W1SS+  BT                 
      1.51506381E-03    2           23   1000006                       # TP2    -->  Z0     TP1                
      7.82403656E-12    2           25   1000006                       # TP2    -->  HL0    TP1                
      2.24940777E-02    2      1000022         6                       # TP2    -->  Z1SS   TP                 
#         PDG         Width
DECAY   1000011  6.38626623E+00   # EL-   decays
#          BR          NDA       ID1       ID2       ID3       ID4
      9.94956851E-01    2      1000022        11                       # EL-    -->  Z1SS   E-                 
      1.68973906E-03    2      1000023        11                       # EL-    -->  Z2SS   E-                 
      3.38365209E-19    2      1000025        11                       # EL-    -->  Z3SS   E-                 
      3.35341808E-03    2     -1000024        12                       # EL-    -->  W1SS-  NUE                
#         PDG         Width
DECAY   1000013  6.38626623E+00   # MUL-  decays
#          BR          NDA       ID1       ID2       ID3       ID4
      9.94956851E-01    2      1000022        13                       # MUL-   -->  Z1SS   MU-                
      1.68973766E-03    2      1000023        13                       # MUL-   -->  Z2SS   MU-                
      3.35341808E-03    2     -1000024        14                       # MUL-   -->  W1SS-  NUM                
#         PDG         Width
DECAY   1000015  1.59130335E+01   # TAU1- decays
#          BR          NDA       ID1       ID2       ID3       ID4
      9.98966992E-01    2      1000022        15                       # TAU1-  -->  Z1SS   TAU-               
      3.45881010E-04    2      1000023        15                       # TAU1-  -->  Z2SS   TAU-               
      6.87136839E-04    2     -1000024        16                       # TAU1-  -->  W1SS-  NUT                
#         PDG         Width
DECAY   1000012  6.39258051E+00   # NUEL  decays
#          BR          NDA       ID1       ID2       ID3       ID4
      9.94995892E-01    2      1000022        12                       # NUEL   -->  Z1SS   NUE                
      1.65389513E-03    2      1000023        12                       # NUEL   -->  Z2SS   NUE                
      3.35021457E-03    2      1000024        11                       # NUEL   -->  W1SS+  E-                 
      1.91097630E-19    3     -1000015        11        16             # NUEL   -->  TAU1+  E-     NUT         
#         PDG         Width
DECAY   1000014  6.39258051E+00   # NUML  decays
#          BR          NDA       ID1       ID2       ID3       ID4
      9.94995892E-01    2      1000022        14                       # NUML   -->  Z1SS   NUM                
      1.65389513E-03    2      1000023        14                       # NUML   -->  Z2SS   NUM                
      3.35021154E-03    2      1000024        13                       # NUML   -->  W1SS+  MU-                
      1.91097941E-19    3     -1000015        13        16             # NUML   -->  TAU1+  MU-    NUT         
#         PDG         Width
DECAY   1000016  6.39256477E+00   # NUTL  decays
#          BR          NDA       ID1       ID2       ID3       ID4
      9.94998336E-01    2      1000022        16                       # NUTL   -->  Z1SS   NUT                
      1.65389921E-03    2      1000023        16                       # NUTL   -->  Z2SS   NUT                
      3.34778032E-03    2      1000024        15                       # NUTL   -->  W1SS+  TAU-               
#         PDG         Width
DECAY   2000011  2.54293709E+01   # ER-   decays
#          BR          NDA       ID1       ID2       ID3       ID4
      9.99999940E-01    2      1000022        11                       # ER-    -->  Z1SS   E-                 
      4.07590441E-08    2      1000023        11                       # ER-    -->  Z2SS   E-                 
      5.74187060E-19    2      1000025        11                       # ER-    -->  Z3SS   E-                 
      2.46338005E-23    3      1000015        12       -16             # ER-    -->  TAU1-  NUE    ANUT        
#         PDG         Width
DECAY   2000013  2.54293709E+01   # MUR-  decays
#          BR          NDA       ID1       ID2       ID3       ID4
      9.99999940E-01    2      1000022        13                       # MUR-   -->  Z1SS   MU-                
      4.07590086E-08    2      1000023        13                       # MUR-   -->  Z2SS   MU-                
      5.20075884E-20    3      1000015        14       -16             # MUR-   -->  TAU1-  NUM    ANUT        
#         PDG         Width
DECAY   2000015  1.59025841E+01   # TAU2- decays
#          BR          NDA       ID1       ID2       ID3       ID4
      9.99009609E-01    2      1000022        15                       # TAU2-  -->  Z1SS   TAU-               
      3.31790972E-04    2      1000023        15                       # TAU2-  -->  Z2SS   TAU-               
      6.58595178E-04    2     -1000024        16                       # TAU2-  -->  W1SS-  NUT                
#         PDG         Width
DECAY   1000023  1.01223740E+02   # Z2SS  decays
#          BR          NDA       ID1       ID2       ID3       ID4
      5.91319077E-11    2      1000022        22                       # Z2SS   -->  Z1SS   GM                 
      9.13971144E-06    2      1000022        23                       # Z2SS   -->  Z1SS   Z0                 
      5.04854870E-06    3      1000022         5        -5             # Z2SS   -->  Z1SS   BT     BB          
      1.51175664E-05    3      1000022        11       -11             # Z2SS   -->  Z1SS   E-     E+          
      1.51175664E-05    3      1000022        13       -13             # Z2SS   -->  Z1SS   MU-    MU+         
      1.51768381E-05    3      1000022        15       -15             # Z2SS   -->  Z1SS   TAU-   TAU+        
      1.48336476E-05    3      1000022        12       -12             # Z2SS   -->  Z1SS   NUE    ANUE        
      1.48336476E-05    3      1000022        14       -14             # Z2SS   -->  Z1SS   NUM    ANUM        
      1.48336476E-05    3      1000022        16       -16             # Z2SS   -->  Z1SS   NUT    ANUT        
      1.58970058E-02    2      1000022        25                       # Z2SS   -->  Z1SS   HL0                
      1.23402104E-01    2      1000002        -2                       # Z2SS   -->  UPL    UB                 
      1.23402104E-01    2     -1000002         2                       # Z2SS   -->  UBL    UP                 
      1.22590989E-01    2      1000001        -1                       # Z2SS   -->  DNL    DB                 
      1.22590989E-01    2     -1000001         1                       # Z2SS   -->  DBL    DN                 
      1.22590989E-01    2      1000003        -3                       # Z2SS   -->  STL    SB                 
      1.22590989E-01    2     -1000003         3                       # Z2SS   -->  SBL    ST                 
      1.23402081E-01    2      1000004        -4                       # Z2SS   -->  CHL    CB                 
      1.23402081E-01    2     -1000004         4                       # Z2SS   -->  CBL    CH                 
      5.30259513E-06    2      2000002        -2                       # Z2SS   -->  UPR    UB                 
      5.30259513E-06    2     -2000002         2                       # Z2SS   -->  UBR    UP                 
      1.32563730E-06    2      2000001        -1                       # Z2SS   -->  DNR    DB                 
      1.32563730E-06    2     -2000001         1                       # Z2SS   -->  DBR    DN                 
      1.32563730E-06    2      2000003        -3                       # Z2SS   -->  STR    SB                 
      1.32563730E-06    2     -2000003         3                       # Z2SS   -->  SBR    ST                 
      5.30259422E-06    2      2000004        -4                       # Z2SS   -->  CHR    CB                 
      5.30259422E-06    2     -2000004         4                       # Z2SS   -->  CBR    CH                 
#         PDG         Width
DECAY   1000025  3.24259663E+00   # Z3SS  decays
#          BR          NDA       ID1       ID2       ID3       ID4
      8.06835305E-06    2      1000022        22                       # Z3SS   -->  Z1SS   GM                 
      1.40177922E-13    2      1000023        22                       # Z3SS   -->  Z2SS   GM                 
      8.90312076E-04    3     -1000024         2        -1             # Z3SS   -->  W1SS-  UP     DB          
      2.96770682E-04    3     -1000024        12       -11             # Z3SS   -->  W1SS-  NUE    E+          
      2.96770682E-04    3     -1000024        14       -13             # Z3SS   -->  W1SS-  NUM    MU+         
      8.90312076E-04    3      1000024         1        -2             # Z3SS   -->  W1SS+  DN     UB          
      2.96770682E-04    3      1000024        11       -12             # Z3SS   -->  W1SS+  E-     ANUE        
      2.96770682E-04    3      1000024        13       -14             # Z3SS   -->  W1SS+  MU-    ANUM        
      8.90312076E-04    3     -1000024         4        -3             # Z3SS   -->  W1SS-  CH     SB          
      2.96770682E-04    3     -1000024        16       -15             # Z3SS   -->  W1SS-  NUT    TAU+        
      8.90312076E-04    3      1000024         3        -4             # Z3SS   -->  W1SS+  ST     CB          
      2.96770682E-04    3      1000024        15       -16             # Z3SS   -->  W1SS+  TAU-   ANUT        
      9.92992043E-01    2      1000022        23                       # Z3SS   -->  Z1SS   Z0                 
      3.45996386E-06    3      1000022         5        -5             # Z3SS   -->  Z1SS   BT     BB          
      3.02937092E-10    3      1000022        11       -11             # Z3SS   -->  Z1SS   E-     E+          
      3.02937092E-10    3      1000022        13       -13             # Z3SS   -->  Z1SS   MU-    MU+         
      2.20664560E-06    3      1000022        15       -15             # Z3SS   -->  Z1SS   TAU-   TAU+        
      1.26986779E-04    3      1000023         2        -2             # Z3SS   -->  Z2SS   UP     UB          
      1.63750301E-04    3      1000023         1        -1             # Z3SS   -->  Z2SS   DN     DB          
      1.63750301E-04    3      1000023         3        -3             # Z3SS   -->  Z2SS   ST     SB          
      1.26986779E-04    3      1000023         4        -4             # Z3SS   -->  Z2SS   CH     CB          
      1.61194228E-04    3      1000023         5        -5             # Z3SS   -->  Z2SS   BT     BB          
      3.71465903E-05    3      1000023        11       -11             # Z3SS   -->  Z2SS   E-     E+          
      3.71465903E-05    3      1000023        13       -13             # Z3SS   -->  Z2SS   MU-    MU+         
      3.69877816E-05    3      1000023        15       -15             # Z3SS   -->  Z2SS   TAU-   TAU+        
      7.39101888E-05    3      1000023        12       -12             # Z3SS   -->  Z2SS   NUE    ANUE        
      7.39101888E-05    3      1000023        14       -14             # Z3SS   -->  Z2SS   NUM    ANUM        
      7.39101888E-05    3      1000023        16       -16             # Z3SS   -->  Z2SS   NUT    ANUT        
      5.73174329E-04    2      1000022        25                       # Z3SS   -->  Z1SS   HL0                
      1.35729136E-10    2      1000023        25                       # Z3SS   -->  Z2SS   HL0                
      1.92393287E-07    2      1000002        -2                       # Z3SS   -->  UPL    UB                 
      1.92393287E-07    2     -1000002         2                       # Z3SS   -->  UBL    UP                 
      4.35404758E-07    2      1000001        -1                       # Z3SS   -->  DNL    DB                 
      4.35404758E-07    2     -1000001         1                       # Z3SS   -->  DBL    DN                 
      4.35404758E-07    2      1000003        -3                       # Z3SS   -->  STL    SB                 
      4.35404758E-07    2     -1000003         3                       # Z3SS   -->  SBL    ST                 
      1.92393244E-07    2      1000004        -4                       # Z3SS   -->  CHL    CB                 
      1.92393244E-07    2     -1000004         4                       # Z3SS   -->  CBL    CH                 
      1.95777744E-07    2      2000002        -2                       # Z3SS   -->  UPR    UB                 
      1.95777744E-07    2     -2000002         2                       # Z3SS   -->  UBR    UP                 
      4.89440275E-08    2      2000001        -1                       # Z3SS   -->  DNR    DB                 
      4.89440275E-08    2     -2000001         1                       # Z3SS   -->  DBR    DN                 
      4.89440275E-08    2      2000003        -3                       # Z3SS   -->  STR    SB                 
      4.89440275E-08    2     -2000003         3                       # Z3SS   -->  SBR    ST                 
      1.95777716E-07    2      2000004        -4                       # Z3SS   -->  CHR    CB                 
      1.95777716E-07    2     -2000004         4                       # Z3SS   -->  CBR    CH                 
      2.16127868E-17    2      1000012       -12                       # Z3SS   -->  NUEL   ANUE               
      2.16127868E-17    2     -1000012        12                       # Z3SS   -->  ANUEL  NUE                
      2.16127868E-17    2      1000014       -14                       # Z3SS   -->  NUML   ANUM               
      2.16127868E-17    2     -1000014        14                       # Z3SS   -->  ANUML  NUM                
      2.16127868E-17    2      1000016       -16                       # Z3SS   -->  NUTL   ANUT               
      2.16127868E-17    2     -1000016        16                       # Z3SS   -->  ANUTL  NUT                
#         PDG         Width
DECAY   1000035  1.08884460E+02   # Z4SS  decays
#          BR          NDA       ID1       ID2       ID3       ID4
      2.68288943E-07    2      1000022        22                       # Z4SS   -->  Z1SS   GM                 
      1.97578820E-09    2      1000023        22                       # Z4SS   -->  Z2SS   GM                 
      3.51142559E-10    2      1000025        22                       # Z4SS   -->  Z3SS   GM                 
      1.53450118E-02    2      1000024       -24                       # Z4SS   -->  W1SS+  W-                 
      1.53450118E-02    2     -1000024        24                       # Z4SS   -->  W1SS-  W+                 
      9.10523431E-06    2      1000022        23                       # Z4SS   -->  Z1SS   Z0                 
      1.70865343E-13    2      1000023        23                       # Z4SS   -->  Z2SS   Z0                 
      1.90397711E-21    3      1000023         5        -5             # Z4SS   -->  Z2SS   BT     BB          
      3.00465860E-22    3      1000023        15       -15             # Z4SS   -->  Z2SS   TAU-   TAU+        
      3.94080962E-06    3      1000025         2        -2             # Z4SS   -->  Z3SS   UP     UB          
      5.08170024E-06    3      1000025         1        -1             # Z4SS   -->  Z3SS   DN     DB          
      5.08170024E-06    3      1000025         3        -3             # Z4SS   -->  Z3SS   ST     SB          
      3.94080962E-06    3      1000025         4        -4             # Z4SS   -->  Z3SS   CH     CB          
      5.01037812E-06    3      1000025         5        -5             # Z4SS   -->  Z3SS   BT     BB          
      1.15278112E-06    3      1000025        11       -11             # Z4SS   -->  Z3SS   E-     E+          
      1.15278112E-06    3      1000025        13       -13             # Z4SS   -->  Z3SS   MU-    MU+         
      1.14960062E-06    3      1000025        15       -15             # Z4SS   -->  Z3SS   TAU-   TAU+        
      2.29367174E-06    3      1000025        12       -12             # Z4SS   -->  Z3SS   NUE    ANUE        
      2.29367174E-06    3      1000025        14       -14             # Z4SS   -->  Z3SS   NUM    ANUM        
      2.29367174E-06    3      1000025        16       -16             # Z4SS   -->  Z3SS   NUT    ANUT        
      1.43817905E-02    2      1000022        25                       # Z4SS   -->  Z1SS   HL0                
      2.62996691E-09    2      1000022        35                       # Z4SS   -->  Z1SS   HH0                
      1.43235175E-05    2      1000022        36                       # Z4SS   -->  Z1SS   HA0                
      1.22341973E-07    2      1000023        25                       # Z4SS   -->  Z2SS   HL0                
      4.62892615E-12    2      1000025        25                       # Z4SS   -->  Z3SS   HL0                
      1.18867420E-01    2      1000002        -2                       # Z4SS   -->  UPL    UB                 
      1.18867420E-01    2     -1000002         2                       # Z4SS   -->  UBL    UP                 
      1.19626105E-01    2      1000001        -1                       # Z4SS   -->  DNL    DB                 
      1.19626105E-01    2     -1000001         1                       # Z4SS   -->  DBL    DN                 
      1.19626105E-01    2      1000003        -3                       # Z4SS   -->  STL    SB                 
      1.19626105E-01    2     -1000003         3                       # Z4SS   -->  SBL    ST                 
      1.18867405E-01    2      1000004        -4                       # Z4SS   -->  CHL    CB                 
      1.18867405E-01    2     -1000004         4                       # Z4SS   -->  CBL    CH                 
      4.86777117E-06    2      2000002        -2                       # Z4SS   -->  UPR    UB                 
      4.86777117E-06    2     -2000002         2                       # Z4SS   -->  UBR    UP                 
      1.21693290E-06    2      2000001        -1                       # Z4SS   -->  DNR    DB                 
      1.21693290E-06    2     -2000001         1                       # Z4SS   -->  DBR    DN                 
      1.21693290E-06    2      2000003        -3                       # Z4SS   -->  STR    SB                 
      1.21693290E-06    2     -2000003         3                       # Z4SS   -->  SBR    ST                 
      4.86777071E-06    2      2000004        -4                       # Z4SS   -->  CHR    CB                 
      4.86777071E-06    2     -2000004         4                       # Z4SS   -->  CBR    CH                 
      6.98683652E-05    2      1000005        -5                       # Z4SS   -->  BT1    BB                 
      6.98683652E-05    2     -1000005         5                       # Z4SS   -->  BB1    BT                 
      7.52639244E-05    2      2000005        -5                       # Z4SS   -->  BT2    BB                 
      7.52639244E-05    2     -2000005         5                       # Z4SS   -->  BB2    BT                 
      4.80452109E-05    2      1000011       -11                       # Z4SS   -->  EL-    E+                 
      4.80452109E-05    2     -1000011        11                       # Z4SS   -->  EL+    E-                 
      4.80451708E-05    2      1000013       -13                       # Z4SS   -->  MUL-   MU+                
      4.80451708E-05    2     -1000013        13                       # Z4SS   -->  MUL+   MU-                
      4.45556436E-09    2      2000011       -11                       # Z4SS   -->  ER-    E+                 
      4.45556436E-09    2     -2000011        11                       # Z4SS   -->  ER+    E-                 
      4.45556081E-09    2      2000013       -13                       # Z4SS   -->  MUR-   MU+                
      4.45556081E-09    2     -2000013        13                       # Z4SS   -->  MUR+   MU-                
      2.34497293E-05    2      1000015       -15                       # Z4SS   -->  TAU1-  TAU+               
      2.34497293E-05    2     -1000015        15                       # Z4SS   -->  TAU1+  TAU-               
      2.45452557E-05    2      2000015       -15                       # Z4SS   -->  TAU2-  TAU+               
      2.45452557E-05    2     -2000015        15                       # Z4SS   -->  TAU2+  TAU-               
      4.90121311E-05    2      1000012       -12                       # Z4SS   -->  NUEL   ANUE               
      4.90121311E-05    2     -1000012        12                       # Z4SS   -->  ANUEL  NUE                
      4.90121311E-05    2      1000014       -14                       # Z4SS   -->  NUML   ANUM               
      4.90121311E-05    2     -1000014        14                       # Z4SS   -->  ANUML  NUM                
      4.90121311E-05    2      1000016       -16                       # Z4SS   -->  NUTL   ANUT               
      4.90121311E-05    2     -1000016        16                       # Z4SS   -->  ANUTL  NUT                
#         PDG         Width
DECAY   1000024  1.00977417E+02   # W1SS+ decays
#          BR          NDA       ID1       ID2       ID3       ID4
      2.99265303E-05    3      1000022       -11        12             # W1SS+  -->  Z1SS   E+     NUE         
      2.99265303E-05    3      1000022       -13        14             # W1SS+  -->  Z1SS   MU+    NUM         
      2.99859275E-05    3      1000022       -15        16             # W1SS+  -->  Z1SS   TAU+   NUT         
      1.59769747E-02    2      1000022        24                       # W1SS+  -->  Z1SS   W+                 
      2.46081546E-01    2      1000002        -1                       # W1SS+  -->  UPL    DB                 
      2.45881528E-01    2     -1000001         2                       # W1SS+  -->  DBL    UP                 
      2.46081501E-01    2      1000004        -3                       # W1SS+  -->  CHL    SB                 
      2.45888576E-01    2     -1000003         4                       # W1SS+  -->  SBL    CH                 
#         PDG         Width
DECAY   1000037  1.08917976E+02   # W2SS+ decays
#          BR          NDA       ID1       ID2       ID3       ID4
      1.43446857E-02    2      1000022        24                       # W2SS+  -->  Z1SS   W+                 
      4.88656497E-06    2      1000022        37                       # W2SS+  -->  Z1SS   H+                 
      3.25229053E-18    3      1000023       -15        16             # W2SS+  -->  Z2SS   TAU+   NUT         
      1.54165439E-02    2      1000023        24                       # W2SS+  -->  Z2SS   W+                 
      3.04213190E-05    3      1000025         2        -1             # W2SS+  -->  Z3SS   UP     DB          
      3.04213190E-05    3      1000025         4        -3             # W2SS+  -->  Z3SS   CH     SB          
      1.01404403E-05    3      1000025       -11        12             # W2SS+  -->  Z3SS   E+     NUE         
      1.01404403E-05    3      1000025       -13        14             # W2SS+  -->  Z3SS   MU+    NUM         
      1.01404403E-05    3      1000025       -15        16             # W2SS+  -->  Z3SS   TAU+   NUT         
      2.38895640E-01    2      1000002        -1                       # W2SS+  -->  UPL    DB                 
      2.39076689E-01    2     -1000001         2                       # W2SS+  -->  DBL    UP                 
      2.38895580E-01    2      1000004        -3                       # W2SS+  -->  CHL    SB                 
      2.39083052E-01    2     -1000003         4                       # W2SS+  -->  SBL    CH                 
      1.58471506E-04    2      1000006        -5                       # W2SS+  -->  TP1    BB                 
      3.97253534E-05    2      2000006        -5                       # W2SS+  -->  TP2    BB                 
      9.68042150E-05    2      1000012       -11                       # W2SS+  -->  NUEL   E+                 
      9.68041277E-05    2      1000014       -13                       # W2SS+  -->  NUML   MU+                
      9.67329470E-05    2      1000016       -15                       # W2SS+  -->  NUTL   TAU+               
      9.68067034E-05    2     -1000011        12                       # W2SS+  -->  EL+    NUE                
      9.68067034E-05    2     -1000013        14                       # W2SS+  -->  MUL+   NUM                
      4.72976681E-05    2     -1000015        16                       # W2SS+  -->  TAU1+  NUT                
      4.94710221E-05    2     -2000015        16                       # W2SS+  -->  TAU2+  NUT                
      1.34127140E-02    2      1000024        23                       # W2SS+  -->  W1SS+  Z0                 
      2.40801645E-09    2      1000024        25                       # W2SS+  -->  W1SS+  HL0                
#         PDG         Width
DECAY        25  2.66789272E-03   # HL0   decays
#          BR          NDA       ID1       ID2       ID3       ID4
      4.93796115E-09    2           11       -11                       # HL0    -->  E-     E+                 
      2.08487312E-04    2           13       -13                       # HL0    -->  MU-    MU+                
      5.95262945E-02    2           15       -15                       # HL0    -->  TAU-   TAU+               
      6.23678034E-06    2            1        -1                       # HL0    -->  DN     DB                 
      2.51996727E-03    2            3        -3                       # HL0    -->  ST     SB                 
      8.72676551E-01    2            5        -5                       # HL0    -->  BT     BB                 
      1.99387068E-06    2            2        -2                       # HL0    -->  UP     UB                 
      3.99496779E-02    2            4        -4                       # HL0    -->  CH     CB                 
      7.08707783E-04    2           22        22                       # HL0    -->  GM     GM                 
      1.86397415E-02    2           21        21                       # HL0    -->  GL     GL                 
      5.76234888E-03    2      1000022   1000022                       # HL0    -->  Z1SS   Z1SS               
#         PDG         Width
DECAY        35  1.86488205E+02   # HH0   decays
#          BR          NDA       ID1       ID2       ID3       ID4
      5.05555797E-12    2           11       -11                       # HH0    -->  E-     E+                 
      2.13454769E-07    2           13       -13                       # HH0    -->  MU-    MU+                
      6.11366777E-05    2           15       -15                       # HH0    -->  TAU-   TAU+               
      6.12218853E-09    2            1        -1                       # HH0    -->  DN     DB                 
      2.47367529E-06    2            3        -3                       # HH0    -->  ST     SB                 
      5.11746388E-04    2            5        -5                       # HH0    -->  BT     BB                 
      1.61296465E-09    2            2        -2                       # HH0    -->  UP     UB                 
      1.90552946E-05    2            4        -4                       # HH0    -->  CH     CB                 
      9.99091446E-01    2            6        -6                       # HH0    -->  TP     TB                 
      9.51113634E-07    2           22        22                       # HH0    -->  GM     GM                 
      1.06279447E-04    2           21        21                       # HH0    -->  GL     GL                 
      1.00119087E-05    2           24       -24                       # HH0    -->  W+     W-                 
      5.13674559E-06    2           23        23                       # HH0    -->  Z0     Z0                 
      1.26520145E-08    2      1000022   1000022                       # HH0    -->  Z1SS   Z1SS               
      2.19131184E-08    2      1000022   1000023                       # HH0    -->  Z1SS   Z2SS               
      6.19450884E-06    2      1000022   1000025                       # HH0    -->  Z1SS   Z3SS               
      3.64025145E-05    2           25        25                       # HH0    -->  HL0    HL0                
      2.70947912E-05    2      1000002  -1000002                       # HH0    -->  UPL    UBL                
      5.43497799E-06    2      2000002  -2000002                       # HH0    -->  UPR    UBR                
      2.70624078E-05    2      1000004  -1000004                       # HH0    -->  CHL    CBL                
      5.42048019E-06    2      2000004  -2000004                       # HH0    -->  CHR    CBR                
      4.05869941E-05    2      1000001  -1000001                       # HH0    -->  DNL    DBL                
      1.35872699E-06    2      2000001  -2000001                       # HH0    -->  DNR    DBR                
      4.05879400E-05    2      1000003  -1000003                       # HH0    -->  STL    SBL                
      1.35855396E-06    2      2000003  -2000003                       # HH0    -->  STR    SBR                
#         PDG         Width
DECAY        36  1.85874176E+02   # HA0   decays
#          BR          NDA       ID1       ID2       ID3       ID4
      5.03991076E-12    2           11       -11                       # HA0    -->  E-     E+                 
      2.12794120E-07    2           13       -13                       # HA0    -->  MU-    MU+                
      6.09474810E-05    2           15       -15                       # HA0    -->  TAU-   TAU+               
      6.10350215E-09    2            1        -1                       # HA0    -->  DN     DB                 
      2.46612285E-06    2            3        -3                       # HA0    -->  ST     SB                 
      5.10536076E-04    2            5        -5                       # HA0    -->  BT     BB                 
      1.60667135E-09    2            2        -2                       # HA0    -->  UP     UB                 
      1.89940492E-05    2            4        -4                       # HA0    -->  CH     CB                 
      9.99189675E-01    2            6        -6                       # HA0    -->  TP     TB                 
      9.46605667E-07    2           22        22                       # HA0    -->  GM     GM                 
      1.08040069E-04    2           21        21                       # HA0    -->  GL     GL                 
      5.35032632E-06    2      1000022   1000022                       # HA0    -->  Z1SS   Z1SS               
      1.77465645E-05    2      1000022   1000023                       # HA0    -->  Z1SS   Z2SS               
      9.97012376E-06    2           25        23                       # HA0    -->  HL0    Z0                 
      6.32774444E-10    2      1000002  -2000002                       # HA0    -->  UPL    UBR                
      6.32774444E-10    2      2000002  -1000002                       # HA0    -->  UPR    UBL                
      3.67739558E-05    2      1000004  -2000004                       # HA0    -->  CHL    CBR                
      3.67739558E-05    2      2000004  -1000004                       # HA0    -->  CHR    CBL                
      1.97756789E-09    2      1000001  -2000001                       # HA0    -->  DNL    DBR                
      1.97756789E-09    2      2000001  -1000001                       # HA0    -->  DNR    DBL                
      7.99037423E-07    2      1000003  -2000003                       # HA0    -->  STL    SBR                
      7.99037423E-07    2      2000003  -1000003                       # HA0    -->  STR    SBL                
#         PDG         Width
DECAY        37  1.73670242E+02   # H+    decays
#          BR          NDA       ID1       ID2       ID3       ID4
      5.43020099E-12    2           12       -11                       # H+     -->  NUE    E+                 
      2.29272871E-07    2           14       -13                       # H+     -->  NUM    MU+                
      6.56672491E-05    2           16       -15                       # H+     -->  NUT    TAU+               
      7.72415465E-09    2            2        -1                       # H+     -->  UP     DB                 
      2.14862303E-05    2            4        -3                       # H+     -->  CH     SB                 
      9.99718308E-01    2            6        -5                       # H+     -->  TP     BB                 
      3.79344638E-05    2      1000024   1000022                       # H+     -->  W1SS+  Z1SS               
      1.07473652E-05    2           25        24                       # H+     -->  HL0    W+                 
      7.19493401E-05    2      1000002  -1000001                       # H+     -->  UPL    DBL                
      4.22428936E-09    2      2000002  -2000001                       # H+     -->  UPR    DBR                
      7.19097516E-05    2      1000004  -1000003                       # H+     -->  CHL    SBL                
      1.70682665E-06    2      2000004  -2000003                       # H+     -->  CHR    SBR                
