  65
  401    415.3224    0.16815E-24
  402    408.5887    0.15972E-24
  403    415.3225    0.16815E-24
  404    408.5911    0.15972E-24
  405    380.6623    0.25142E-24
  406    271.2859    0.43742E-24
  407    415.3224    0.16815E-24
  408    408.5887    0.15972E-24
  409    415.3225    0.16815E-24
  410    408.5911    0.15972E-24
  411    380.6623    0.25142E-24
  412    271.2859    0.43742E-24
  413    398.8750    0.31540E-23
  414    397.8421    0.79083E-24
  415    398.8751    0.31540E-23
  416    397.8446    0.79084E-24
  417    398.8065    0.17111E-23
  418    458.3802    0.15252E-24
  419    398.8750    0.31540E-23
  420    397.8421    0.79083E-24
  421    398.8751    0.31540E-23
  422    397.8446    0.79084E-24
  423    398.8065    0.17111E-23
  424    458.3802    0.15252E-24
  425    149.9573    0.16036E-23
  426    130.7121    0.22549E-23
  427    149.9573    0.16036E-23
  428    130.7121    0.22549E-23
  429    109.1884    0.28210E-23
  430    129.8198    0.23460E-23
  431    149.9573    0.16036E-23
  432    130.7121    0.22549E-23
  433    149.9573    0.16036E-23
  434    130.7121    0.22549E-23
  435    109.1884    0.28210E-23
  436    129.8198    0.23460E-23
  437    109.6246    0.27419E-23
  438      0.0000    0.10000E+31
  439    109.6246    0.27419E-23
  440      0.0000    0.10000E+31
  441    149.8716    0.16209E-23
  442      0.0000    0.10000E+31
  443    109.6246    0.27419E-23
  444      0.0000    0.10000E+31
  445    109.6246    0.27419E-23
  446      0.0000    0.10000E+31
  447    149.8716    0.16209E-23
  448      0.0000    0.10000E+31
  449    440.6172    0.20222E-24
  450     60.8313    0.10000E+31
  451    111.6526    0.44037E-20
  452   -271.9042    0.43129E-24
  453    306.4351    0.25224E-24
  454    108.3059    0.10526E-19
  455    301.2129    0.25359E-24
  456    108.3059    0.10526E-19
  457    301.2129    0.25359E-24
  203     93.1997    0.16359E-21
  204    324.9322    0.15315E-23
  205    317.8926    0.68409E-24
  206    329.5332    0.51052E-24
  207    329.5332    0.51052E-24
  458      0.0000    0.10000E+31
    6    172.5000    0.57395E-24
   12    172.5000    0.57395E-24
   6
   401  0.57379160E-01     0   450     1     0     0     0
   401  0.27738911E+00     0   451     1     0     0     0
   401  0.13863526E-02     0   452     1     0     0     0
   401  0.15597042E-01     0   453     1     0     0     0
   401  0.60372174E+00     0   456     2     0     0     0
   401  0.44526629E-01     0   457     2     0     0     0
   6
   402  0.14263035E-03     0   450     2     0     0     0
   402  0.32224157E+00     0   451     2     0     0     0
   402  0.75421442E-03     0   452     2     0     0     0
   402  0.10036438E-01     0   453     2     0     0     0
   402  0.64944679E+00     0   454     1     0     0     0
   402  0.17378382E-01     0   455     1     0     0     0
   6
   403  0.57380240E-01     0   450     3     0     0     0
   403  0.27739432E+00     0   451     3     0     0     0
   403  0.13863789E-02     0   452     3     0     0     0
   403  0.15597341E-01     0   453     3     0     0     0
   403  0.60371840E+00     0   456     4     0     0     0
   403  0.44523291E-01     0   457     4     0     0     0
   6
   404  0.14262815E-03     0   450     4     0     0     0
   404  0.32223618E+00     0   451     4     0     0     0
   404  0.75418066E-03     0   452     4     0     0     0
   404  0.10035667E-01     0   453     4     0     0     0
   404  0.64945233E+00     0   454     3     0     0     0
   404  0.17378990E-01     0   455     3     0     0     0
   6
   405  0.82023978E-01     0   450     5     0     0     0
   405  0.35195753E+00     0   451     5     0     0     0
   405  0.13796646E-02     0   452     5     0     0     0
   405  0.11348585E-01     0   453     5     0     0     0
   405  0.38533619E+00     0   456     6     0     0     0
   405  0.16795406E+00     0   199   406     0     0     0
   2
   406  0.73315509E-01     0   450     6     0     0     0
   406  0.92668450E+00     0   454     5     0     0     0
   6
   407  0.57379160E-01     0   450     7     0     0     0
   407  0.27738911E+00     0   451     7     0     0     0
   407  0.13863526E-02     0   452     7     0     0     0
   407  0.15597042E-01     0   453     7     0     0     0
   407  0.60372174E+00     0   454     8     0     0     0
   407  0.44526629E-01     0   455     8     0     0     0
   6
   408  0.14263035E-03     0   450     8     0     0     0
   408  0.32224157E+00     0   451     8     0     0     0
   408  0.75421442E-03     0   452     8     0     0     0
   408  0.10036438E-01     0   453     8     0     0     0
   408  0.64944679E+00     0   456     7     0     0     0
   408  0.17378382E-01     0   457     7     0     0     0
   6
   409  0.57380240E-01     0   450     9     0     0     0
   409  0.27739432E+00     0   451     9     0     0     0
   409  0.13863789E-02     0   452     9     0     0     0
   409  0.15597341E-01     0   453     9     0     0     0
   409  0.60371840E+00     0   454    10     0     0     0
   409  0.44523291E-01     0   455    10     0     0     0
   6
   410  0.14262815E-03     0   450    10     0     0     0
   410  0.32223618E+00     0   451    10     0     0     0
   410  0.75418066E-03     0   452    10     0     0     0
   410  0.10035667E-01     0   453    10     0     0     0
   410  0.64945233E+00     0   456     9     0     0     0
   410  0.17378990E-01     0   457     9     0     0     0
   6
   411  0.82023978E-01     0   450    11     0     0     0
   411  0.35195753E+00     0   451    11     0     0     0
   411  0.13796646E-02     0   452    11     0     0     0
   411  0.11348585E-01     0   453    11     0     0     0
   411  0.38533619E+00     0   454    12     0     0     0
   411  0.16795406E+00     0   198   412     0     0     0
   2
   412  0.73315509E-01     0   450    12     0     0     0
   412  0.92668450E+00     0   456    11     0     0     0
   4
   413  0.92627275E+00     0   450     1     0     0     0
   413  0.68493985E-01     0   451     1     0     0     0
   413  0.10369380E-02     0   452     1     0     0     0
   413  0.41963435E-02     0   453     1     0     0     0
   4
   414  0.92637855E+00     0   450     2     0     0     0
   414  0.68458229E-01     0   451     2     0     0     0
   414  0.10279708E-02     0   452     2     0     0     0
   414  0.41352273E-02     0   453     2     0     0     0
   4
   415  0.92627275E+00     0   450     3     0     0     0
   415  0.68493992E-01     0   451     3     0     0     0
   415  0.10369383E-02     0   452     3     0     0     0
   415  0.41963453E-02     0   453     3     0     0     0
   4
   416  0.92637902E+00     0   450     4     0     0     0
   416  0.68458162E-01     0   451     4     0     0     0
   416  0.10279348E-02     0   452     4     0     0     0
   416  0.41349027E-02     0   453     4     0     0     0
   6
   417  0.47661465E+00     0   450     5     0     0     0
   417  0.16403407E+00     0   451     5     0     0     0
   417  0.11880896E-01     0   452     5     0     0     0
   417  0.23499751E-01     0   453     5     0     0     0
   417  0.15474012E+00     0   456     6     0     0     0
   417  0.16923051E+00     0   199   406     0     0     0
   7
   418  0.19047120E+00     0   454     5     0     0     0
   418  0.32886472E+00     0   455     5     0     0     0
   418  0.30242869E+00     0   200   406     0     0     0
   418  0.42091463E-01     0   203   406     0     0     0
   418  0.19116741E-01     0   450     6     0     0     0
   418  0.99760331E-01     0   451     6     0     0     0
   418  0.17266860E-01     0   452     6     0     0     0
   4
   419  0.92627275E+00     0   450     7     0     0     0
   419  0.68493985E-01     0   451     7     0     0     0
   419  0.10369380E-02     0   452     7     0     0     0
   419  0.41963435E-02     0   453     7     0     0     0
   4
   420  0.92637855E+00     0   450     8     0     0     0
   420  0.68458229E-01     0   451     8     0     0     0
   420  0.10279708E-02     0   452     8     0     0     0
   420  0.41352273E-02     0   453     8     0     0     0
   4
   421  0.92627275E+00     0   450     9     0     0     0
   421  0.68493992E-01     0   451     9     0     0     0
   421  0.10369383E-02     0   452     9     0     0     0
   421  0.41963453E-02     0   453     9     0     0     0
   4
   422  0.92637902E+00     0   450    10     0     0     0
   422  0.68458162E-01     0   451    10     0     0     0
   422  0.10279348E-02     0   452    10     0     0     0
   422  0.41349027E-02     0   453    10     0     0     0
   6
   423  0.47661465E+00     0   450    11     0     0     0
   423  0.16403407E+00     0   451    11     0     0     0
   423  0.11880896E-01     0   452    11     0     0     0
   423  0.23499751E-01     0   453    11     0     0     0
   423  0.15474012E+00     0   454    12     0     0     0
   423  0.16923051E+00     0   198   412     0     0     0
   7
   424  0.19047120E+00     0   456    11     0     0     0
   424  0.32886472E+00     0   457    11     0     0     0
   424  0.30242869E+00     0   200   412     0     0     0
   424  0.42091463E-01     0   203   412     0     0     0
   424  0.19116741E-01     0   450    12     0     0     0
   424  0.99760331E-01     0   451    12     0     0     0
   424  0.17266860E-01     0   452    12     0     0     0
   3
   425  0.11581932E+00     0   450   121     0     0     0
   425  0.33651674E+00     0   451   121     0     0     0
   425  0.54766393E+00     0   456   122     0     0     0
   3
   426  0.58923930E+00     0   450   122     0     0     0
   426  0.77374145E-01     0   451   122     0     0     0
   426  0.33338657E+00     0   454   121     0     0     0
   3
   427  0.11581929E+00     0   450   123     0     0     0
   427  0.33651575E+00     0   451   123     0     0     0
   427  0.54766494E+00     0   456   124     0     0     0
   3
   428  0.58924186E+00     0   450   124     0     0     0
   428  0.77374488E-01     0   451   124     0     0     0
   428  0.33338365E+00     0   454   123     0     0     0
   2
   429  0.99997437E+00     0   450   125     0     0     0
   429  0.25605441E-04     0   456   126     0     0     0
   3
   430  0.60422069E+00     0   450   126     0     0     0
   430  0.74108064E-01     0   451   126     0     0     0
   430  0.32167128E+00     0   454   125     0     0     0
   3
   431  0.11581932E+00     0   450   127     0     0     0
   431  0.33651674E+00     0   451   127     0     0     0
   431  0.54766393E+00     0   454   128     0     0     0
   3
   432  0.58923930E+00     0   450   128     0     0     0
   432  0.77374145E-01     0   451   128     0     0     0
   432  0.33338657E+00     0   456   127     0     0     0
   3
   433  0.11581929E+00     0   450   129     0     0     0
   433  0.33651575E+00     0   451   129     0     0     0
   433  0.54766494E+00     0   454   130     0     0     0
   3
   434  0.58924186E+00     0   450   130     0     0     0
   434  0.77374488E-01     0   451   130     0     0     0
   434  0.33338365E+00     0   456   129     0     0     0
   2
   435  0.99997437E+00     0   450   131     0     0     0
   435  0.25605441E-04     0   454   132     0     0     0
   3
   436  0.60422069E+00     0   450   132     0     0     0
   436  0.74108064E-01     0   451   132     0     0     0
   436  0.32167128E+00     0   456   131     0     0     0
   1
   437  0.10000000E+01     0   450   121     0     0     0
   0
   1
   439  0.10000000E+01     0   450   123     0     0     0
   0
   3
   441  0.13725750E+00     0   450   125     0     0     0
   441  0.32826608E+00     0   451   125     0     0     0
   441  0.53447640E+00     0   456   126     0     0     0
   0
   1
   443  0.10000000E+01     0   450   127     0     0     0
   0
   1
   445  0.10000000E+01     0   450   129     0     0     0
   0
   3
   447  0.13725750E+00     0   450   131     0     0     0
   447  0.32826608E+00     0   451   131     0     0     0
   447  0.53447640E+00     0   454   132     0     0     0
   0
  26
   449  0.77858061E-03     0   454     5    12     0     0
   449  0.77858061E-03     0   456     6    11     0     0
   449  0.91407594E-04     0   450     6    12     0     0
   449  0.24720672E-04     0   451    13     0     0     0
   449  0.57719812E-04     0   452    13     0     0     0
   449  0.55113058E-04     0   453    13     0     0     0
   449  0.33398889E-01     0   408     2     0     0     0
   449  0.33398889E-01     0   402     8     0     0     0
   449  0.21163099E-01     0   407     1     0     0     0
   449  0.21163099E-01     0   401     7     0     0     0
   449  0.58073614E-01     0   420     2     0     0     0
   449  0.58073614E-01     0   414     8     0     0     0
   449  0.55439096E-01     0   419     1     0     0     0
   449  0.55439096E-01     0   413     7     0     0     0
   449  0.21162437E-01     0   409     3     0     0     0
   449  0.21162437E-01     0   403     9     0     0     0
   449  0.55438455E-01     0   421     3     0     0     0
   449  0.55438455E-01     0   415     9     0     0     0
   449  0.33366568E-01     0   410     4     0     0     0
   449  0.33366568E-01     0   404    10     0     0     0
   449  0.58041107E-01     0   422     4     0     0     0
   449  0.58041107E-01     0   416    10     0     0     0
   449  0.10443536E+00     0   411     5     0     0     0
   449  0.10443536E+00     0   405    11     0     0     0
   449  0.58588304E-01     0   423     5     0     0     0
   449  0.58588304E-01     0   417    11     0     0     0
   0
  17
   451  0.10098991E-02     0   450     2     8     0     0
   451  0.18949609E-02     0   450     1     7     0     0
   451  0.18949609E-02     0   450     3     9     0     0
   451  0.10098973E-02     0   450     4    10     0     0
   451  0.19545162E-02     0   450     5    11     0     0
   451  0.34717303E-02     0   450   121   127     0     0
   451  0.34717256E-02     0   450   123   129     0     0
   451  0.37276256E-02     0   450   125   131     0     0
   451  0.23391314E-01     0   450   122   128     0     0
   451  0.23391314E-01     0   450   124   130     0     0
   451  0.24909765E-01     0   450   126   132     0     0
   451  0.18377675E+00     0   437   127     0     0     0
   451  0.18377675E+00     0   443   121     0     0     0
   451  0.18352358E+00     0   439   129     0     0     0
   451  0.18352358E+00     0   445   123     0     0     0
   451  0.87635815E-01     0   429   131     0     0     0
   451  0.87635815E-01     0   435   125     0     0     0
  24
   452  0.30516535E+00     0   454   199     0     0     0
   452  0.30516535E+00     0   456   198     0     0     0
   452  0.17282896E+00     0   450   200     0     0     0
   452  0.16469955E+00     0   451   200     0     0     0
   452  0.15079644E-01     0   450   203     0     0     0
   452  0.66729840E-02     0   451   203     0     0     0
   452  0.55107760E-03     0   425   127     0     0     0
   452  0.55107760E-03     0   431   121     0     0     0
   452  0.55107725E-03     0   427   129     0     0     0
   452  0.55107725E-03     0   433   123     0     0     0
   452  0.10645374E-02     0   437   127     0     0     0
   452  0.10645374E-02     0   443   121     0     0     0
   452  0.10645369E-02     0   439   129     0     0     0
   452  0.10645369E-02     0   445   123     0     0     0
   452  0.12393078E-02     0   429   131     0     0     0
   452  0.12393078E-02     0   435   125     0     0     0
   452  0.13247455E-02     0   441   131     0     0     0
   452  0.13247455E-02     0   447   125     0     0     0
   452  0.31243984E-02     0   426   128     0     0     0
   452  0.31243984E-02     0   432   122     0     0     0
   452  0.31243984E-02     0   428   130     0     0     0
   452  0.31243984E-02     0   434   124     0     0     0
   452  0.31500068E-02     0   430   132     0     0     0
   452  0.31500068E-02     0   436   126     0     0     0
  25
   453  0.24842213E+00     0   454   199     0     0     0
   453  0.24842213E+00     0   456   198     0     0     0
   453  0.13141087E-01     0   450   200     0     0     0
   453  0.74336417E-02     0   451   200     0     0     0
   453  0.10468630E-04     0   451     5    11     0     0
   453  0.75590886E-01     0   450   203     0     0     0
   453  0.82365088E-01     0   451   203     0     0     0
   453  0.12755904E-01     0   425   127     0     0     0
   453  0.12755904E-01     0   431   121     0     0     0
   453  0.12755901E-01     0   427   129     0     0     0
   453  0.12755901E-01     0   433   123     0     0     0
   453  0.52540209E-02     0   437   127     0     0     0
   453  0.52540209E-02     0   443   121     0     0     0
   453  0.52540186E-02     0   439   129     0     0     0
   453  0.52540186E-02     0   445   123     0     0     0
   453  0.47380575E-02     0   429   131     0     0     0
   453  0.47380575E-02     0   435   125     0     0     0
   453  0.13620578E-01     0   441   131     0     0     0
   453  0.13620578E-01     0   447   125     0     0     0
   453  0.35903718E-01     0   426   128     0     0     0
   453  0.35903718E-01     0   432   122     0     0     0
   453  0.35903718E-01     0   428   130     0     0     0
   453  0.35903718E-01     0   434   124     0     0     0
   453  0.36121372E-01     0   430   132     0     0     0
   453  0.36121372E-01     0   436   126     0     0     0
   5
   454  0.22423857E+00     0   450     2     7     0     0
   454  0.22423856E+00     0   450     4     9     0     0
   454  0.17585561E+00     0   450   127   122     0     0
   454  0.17585561E+00     0   450   129   124     0     0
   454  0.19981164E+00     0   450   131   126     0     0
  14
   455  0.15313822E-01     0   450   198     0     0     0
   455  0.30204698E+00     0   451   198     0     0     0
   455  0.41871525E-01     0   406    11     0     0     0
   455  0.32150105E-01     0   426   127     0     0     0
   455  0.32150101E-01     0   428   129     0     0     0
   455  0.32839648E-01     0   430   131     0     0     0
   455  0.61315134E-01     0   431   122     0     0     0
   455  0.61315123E-01     0   433   124     0     0     0
   455  0.31332031E-03     0   435   126     0     0     0
   455  0.61652463E-01     0   447   126     0     0     0
   455  0.22406738E+00     0   454   200     0     0     0
   455  0.12013308E-04     0   454     2     8     0     0
   455  0.12013302E-04     0   454     4    10     0     0
   455  0.13494037E+00     0   454   203     0     0     0
   5
   456  0.22423857E+00     0   450     8     1     0     0
   456  0.22423856E+00     0   450    10     3     0     0
   456  0.17585561E+00     0   450   121   128     0     0
   456  0.17585561E+00     0   450   123   130     0     0
   456  0.19981164E+00     0   450   125   132     0     0
  14
   457  0.15313822E-01     0   450   199     0     0     0
   457  0.30204698E+00     0   451   199     0     0     0
   457  0.41871525E-01     0   412     5     0     0     0
   457  0.32150105E-01     0   432   121     0     0     0
   457  0.32150101E-01     0   434   123     0     0     0
   457  0.32839648E-01     0   436   125     0     0     0
   457  0.61315134E-01     0   425   128     0     0     0
   457  0.61315123E-01     0   427   130     0     0     0
   457  0.31332031E-03     0   429   132     0     0     0
   457  0.61652463E-01     0   441   132     0     0     0
   457  0.22406738E+00     0   456   200     0     0     0
   457  0.12013308E-04     0   456     8     2     0     0
   457  0.12013302E-04     0   456    10     4     0     0
   457  0.13494037E+00     0   456   203     0     0     0
  17
   203  0.21699232E-03     0   123   129     0     0     0
   203  0.62014893E-01     0   125   131     0     0     0
   203  0.26148227E-02     0     3     9     0     0     0
   203  0.88291937E+00     0     5    11     0     0     0
   203  0.29803013E-01     0     4    10     0     0     0
   203  0.90023433E-03     0    59    59     0     0     0
   203  0.21040602E-01     0    13    13     0     0     0
   203  0.27226424E-04     0   198   121   128     0     0
   203  0.27226424E-04     0   198   123   130     0     0
   203  0.27226424E-04     0   198   125   132     0     0
   203  0.81679274E-04     0   198     8     1     0     0
   203  0.81679274E-04     0   198    10     3     0     0
   203  0.27226424E-04     0   199   127   122     0     0
   203  0.27226424E-04     0   199   129   124     0     0
   203  0.27226424E-04     0   199   131   126     0     0
   203  0.81679274E-04     0   199     2     7     0     0
   203  0.81679274E-04     0   199     4     9     0     0
  25
   204  0.47164140E-04     0   123   129     0     0     0
   204  0.13506117E-01     0   125   131     0     0     0
   204  0.55879587E-03     0     3     9     0     0     0
   204  0.95602676E-01     0     5    11     0     0     0
   204  0.11982742E-03     0     4    10     0     0     0
   204  0.19511270E-04     0    59    59     0     0     0
   204  0.28292984E-02     0    13    13     0     0     0
   204  0.41473292E-01     0   198   199     0     0     0
   204  0.19251568E-01     0   200   200     0     0     0
   204  0.71671724E-01     0   450   450     0     0     0
   204  0.13442241E+00     0   450   451     0     0     0
   204  0.52934583E-01     0   451   451     0     0     0
   204  0.26311958E+00     0   454   456     0     0     0
   204  0.13000615E+00     0   203   203     0     0     0
   204  0.74283602E-02     0   425   431     0     0     0
   204  0.10677347E-01     0   437   443     0     0     0
   204  0.74280147E-02     0   427   433     0     0     0
   204  0.10676784E-01     0   439   445     0     0     0
   204  0.10738252E-01     0   429   435     0     0     0
   204  0.72459658E-02     0   441   447     0     0     0
   204  0.13365128E-04     0   429   447     0     0     0
   204  0.13365128E-04     0   441   435     0     0     0
   204  0.39906878E-01     0   426   432     0     0     0
   204  0.39906878E-01     0   428   434     0     0     0
   204  0.40402099E-01     0   430   436     0     0     0
  11
   205  0.21335683E-04     0   123   129     0     0     0
   205  0.61104861E-02     0   125   131     0     0     0
   205  0.25284680E-03     0     3     9     0     0     0
   205  0.43280099E-01     0     5    11     0     0     0
   205  0.40237090E-04     0     4    10     0     0     0
   205  0.69173129E-03     0    13    13     0     0     0
   205  0.81663840E-01     0   450   450     0     0     0
   205  0.20006770E+00     0   450   451     0     0     0
   205  0.12029428E+00     0   451   451     0     0     0
   205  0.53390825E+00     0   454   456     0     0     0
   205  0.13669190E-01     0   203   200     0     0     0
  11
   206  0.16505017E-04     0   124   129     0     0     0
   206  0.47270157E-02     0   126   131     0     0     0
   206  0.20601363E-03     0     4     9     0     0     0
   206  0.78736138E+00     0     6    11     0     0     0
   206  0.14599389E+00     0   454   450     0     0     0
   206  0.12599730E-01     0   454   451     0     0     0
   206  0.12709306E-01     0   203   198     0     0     0
   206  0.12067291E-01     0   431   426     0     0     0
   206  0.12067082E-01     0   433   428     0     0     0
   206  0.53365814E-03     0   435   430     0     0     0
   206  0.11718146E-01     0   447   430     0     0     0
  11
   207  0.16505017E-04     0   130   123     0     0     0
   207  0.47270157E-02     0   132   125     0     0     0
   207  0.20601363E-03     0    10     3     0     0     0
   207  0.78736138E+00     0    12     5     0     0     0
   207  0.14599389E+00     0   456   450     0     0     0
   207  0.12599730E-01     0   456   451     0     0     0
   207  0.12709306E-01     0   203   199     0     0     0
   207  0.12067291E-01     0   425   432     0     0     0
   207  0.12067082E-01     0   427   434     0     0     0
   207  0.53365814E-03     0   429   436     0     0     0
   207  0.11718146E-01     0   441   436     0     0     0
   0
   5
     6  0.33333334E+00   100     2     7     5     0     0
     6  0.33333334E+00   100     4     9     5     0     0
     6  0.11111111E+00   100   122   127     5     0     0
     6  0.11111111E+00   100   124   129     5     0     0
     6  0.11111111E+00   100   126   131     5     0     0
   5
    12  0.33333334E+00   100     8     1    11     0     0
    12  0.33333334E+00   100    10     3    11     0     0
    12  0.11111111E+00   100   128   121    11     0     0
    12  0.11111111E+00   100   130   123    11     0     0
    12  0.11111111E+00   100   132   125    11     0     0
      3.00000000     -0.36969641
      0.94808459     -0.19260137      0.22412488     -0.11750986
     -0.27322450     -0.89955395      0.28387523     -0.18858887
      0.05787939     -0.08690438     -0.69334877     -0.71299750
      0.15209918     -0.38230205     -0.62325817      0.66502666
     -0.94873935      0.31605959     -0.31605959     -0.94873935
     -0.88211960      0.47102547     -0.47102547     -0.88211960
     -0.92724454     -0.25113630     -1.41677403
   -321.68093872   -516.22192383   -112.08170319
    268.94677734
    T
