  65
  401    305.1227    0.55270E-24
  402    295.7487    0.60907E-24
  403    305.1228    0.55274E-24
  404    295.7518    0.60907E-24
  405   2000.1373    0.73380E-26
  406   2004.0999    0.47624E-26
  407    305.1227    0.55270E-24
  408    295.7487    0.60907E-24
  409    305.1228    0.55274E-24
  410    295.7518    0.60907E-24
  411   2000.1373    0.73380E-26
  412   2004.0999    0.47624E-26
  413    300.9438    0.49686E-23
  414    298.1035    0.12601E-23
  415    300.9439    0.49686E-23
  416    298.1065    0.12601E-23
  417   2000.7828    0.48190E-26
  418   2004.4734    0.48646E-26
  419    300.9438    0.49686E-23
  420    298.1035    0.12601E-23
  421    300.9439    0.49686E-23
  422    298.1065    0.12601E-23
  423   2000.7828    0.48190E-26
  424   2004.4734    0.48646E-26
  425    156.4146    0.11888E-22
  426    137.2332    0.14413E-22
  427    156.4147    0.11888E-22
  428    137.2332    0.14413E-22
  429    155.3390    0.24752E-23
  430   1999.0830    0.24158E-25
  431    156.4146    0.11888E-22
  432    137.2332    0.14413E-22
  433    156.4147    0.11888E-22
  434    137.2332    0.14413E-22
  435    155.3390    0.24752E-23
  436   1999.0830    0.24158E-25
  437    155.5683    0.24585E-23
  438      0.0000    0.10000E+31
  439    155.5684    0.24585E-23
  440      0.0000    0.10000E+31
  441   2000.5107    0.24194E-25
  442      0.0000    0.10000E+31
  443    155.5683    0.24585E-23
  444      0.0000    0.10000E+31
  445    155.5684    0.24585E-23
  446      0.0000    0.10000E+31
  447   2000.5107    0.24194E-25
  448      0.0000    0.10000E+31
  449    700.0000    0.73791E-26
  450     99.9443    0.10000E+31
  451    199.7936    0.10072E-23
  452   -453.5259    0.19242E-24
  453    472.5786    0.14521E-24
  454    199.1624    0.98349E-24
  455    471.3311    0.14583E-24
  456    199.1624    0.98349E-24
  457    471.3311    0.14583E-24
  203    105.4010    0.17896E-21
  204   1007.6902    0.55631E-25
  205   1000.0000    0.56473E-25
  206   1007.8586    0.58522E-25
  207   1007.8586    0.58522E-25
  458      0.0000    0.10000E+31
    6    172.5000    0.57395E-24
   12    172.5000    0.57395E-24
   3
   401  0.47784295E-01     0   450     1     0     0     0
   401  0.31525001E+00     0   451     1     0     0     0
   401  0.63696569E+00     0   456     2     0     0     0
   3
   402  0.14611516E-01     0   450     2     0     0     0
   402  0.32547694E+00     0   451     2     0     0     0
   402  0.65991151E+00     0   454     1     0     0     0
   3
   403  0.47787890E-01     0   450     3     0     0     0
   403  0.31527391E+00     0   451     3     0     0     0
   403  0.63693821E+00     0   456     4     0     0     0
   3
   404  0.14611001E-01     0   450     4     0     0     0
   404  0.32544646E+00     0   451     4     0     0     0
   404  0.65994251E+00     0   454     3     0     0     0
   7
   405  0.12324771E-01     0   450     5     0     0     0
   405  0.17369547E-03     0   451     5     0     0     0
   405  0.79843367E-03     0   452     5     0     0     0
   405  0.81652764E-03     0   453     5     0     0     0
   405  0.98432189E+00     0   449     5     0     0     0
   405  0.17644370E-03     0   456     6     0     0     0
   405  0.13882336E-02     0   457     6     0     0     0
   7
   406  0.62842506E+00     0   449     6     0     0     0
   406  0.31952869E-01     0   450     6     0     0     0
   406  0.37208430E-02     0   451     6     0     0     0
   406  0.85173182E-01     0   452     6     0     0     0
   406  0.80040053E-01     0   453     6     0     0     0
   406  0.76505113E-02     0   454     5     0     0     0
   406  0.16303746E+00     0   455     5     0     0     0
   3
   407  0.47784295E-01     0   450     7     0     0     0
   407  0.31525001E+00     0   451     7     0     0     0
   407  0.63696569E+00     0   454     8     0     0     0
   3
   408  0.14611516E-01     0   450     8     0     0     0
   408  0.32547694E+00     0   451     8     0     0     0
   408  0.65991151E+00     0   456     7     0     0     0
   3
   409  0.47787890E-01     0   450     9     0     0     0
   409  0.31527391E+00     0   451     9     0     0     0
   409  0.63693821E+00     0   454    10     0     0     0
   3
   410  0.14611001E-01     0   450    10     0     0     0
   410  0.32544646E+00     0   451    10     0     0     0
   410  0.65994251E+00     0   456     9     0     0     0
   7
   411  0.12324771E-01     0   450    11     0     0     0
   411  0.17369547E-03     0   451    11     0     0     0
   411  0.79843367E-03     0   452    11     0     0     0
   411  0.81652764E-03     0   453    11     0     0     0
   411  0.98432189E+00     0   449    11     0     0     0
   411  0.17644370E-03     0   454    12     0     0     0
   411  0.13882336E-02     0   455    12     0     0     0
   7
   412  0.62842506E+00     0   449    12     0     0     0
   412  0.31952869E-01     0   450    12     0     0     0
   412  0.37208430E-02     0   451    12     0     0     0
   412  0.85173182E-01     0   452    12     0     0     0
   412  0.80040053E-01     0   453    12     0     0     0
   412  0.76505113E-02     0   456    11     0     0     0
   412  0.16303746E+00     0   457    11     0     0     0
   2
   413  0.99706781E+00     0   450     1     0     0     0
   413  0.29322000E-02     0   451     1     0     0     0
   2
   414  0.99714184E+00     0   450     2     0     0     0
   414  0.28581382E-02     0   451     2     0     0     0
   2
   415  0.99706781E+00     0   450     3     0     0     0
   415  0.29322023E-02     0   451     3     0     0     0
   2
   416  0.99714202E+00     0   450     4     0     0     0
   416  0.28579815E-02     0   451     4     0     0     0
   7
   417  0.34262738E-02     0   450     5     0     0     0
   417  0.54191511E-01     0   451     5     0     0     0
   417  0.78230334E-03     0   452     5     0     0     0
   417  0.47148447E-02     0   453     5     0     0     0
   417  0.64673471E+00     0   449     5     0     0     0
   417  0.11335418E+00     0   456     6     0     0     0
   417  0.17679617E+00     0   457     6     0     0     0
   7
   418  0.64209533E+00     0   449     6     0     0     0
   418  0.11737238E+00     0   454     5     0     0     0
   418  0.55025788E-02     0   455     5     0     0     0
   418  0.15077010E-02     0   450     6     0     0     0
   418  0.60596760E-01     0   451     6     0     0     0
   418  0.87279126E-01     0   452     6     0     0     0
   418  0.85646123E-01     0   453     6     0     0     0
   2
   419  0.99706781E+00     0   450     7     0     0     0
   419  0.29322000E-02     0   451     7     0     0     0
   2
   420  0.99714184E+00     0   450     8     0     0     0
   420  0.28581382E-02     0   451     8     0     0     0
   2
   421  0.99706781E+00     0   450     9     0     0     0
   421  0.29322023E-02     0   451     9     0     0     0
   2
   422  0.99714202E+00     0   450    10     0     0     0
   422  0.28579815E-02     0   451    10     0     0     0
   7
   423  0.34262738E-02     0   450    11     0     0     0
   423  0.54191511E-01     0   451    11     0     0     0
   423  0.78230334E-03     0   452    11     0     0     0
   423  0.47148447E-02     0   453    11     0     0     0
   423  0.64673471E+00     0   449    11     0     0     0
   423  0.11335418E+00     0   454    12     0     0     0
   423  0.17679617E+00     0   455    12     0     0     0
   7
   424  0.64209533E+00     0   449    12     0     0     0
   424  0.11737238E+00     0   456    11     0     0     0
   424  0.55025788E-02     0   457    11     0     0     0
   424  0.15077010E-02     0   450    12     0     0     0
   424  0.60596760E-01     0   451    12     0     0     0
   424  0.87279126E-01     0   452    12     0     0     0
   424  0.85646123E-01     0   453    12     0     0     0
   1
   425  0.10000000E+01     0   450   121     0     0     0
   1
   426  0.10000000E+01     0   450   122     0     0     0
   1
   427  0.10000000E+01     0   450   123     0     0     0
   1
   428  0.10000000E+01     0   450   124     0     0     0
   1
   429  0.10000000E+01     0   450   125     0     0     0
   7
   430  0.11015902E+00     0   450   126     0     0     0
   430  0.25351489E+00     0   451   126     0     0     0
   430  0.20064528E-02     0   452   126     0     0     0
   430  0.27220033E-01     0   453   126     0     0     0
   430  0.58091396E+00     0   454   125     0     0     0
   430  0.24561368E-01     0   455   125     0     0     0
   430  0.16242961E-02     0   206   429     0     0     0
   1
   431  0.10000000E+01     0   450   127     0     0     0
   1
   432  0.10000000E+01     0   450   128     0     0     0
   1
   433  0.10000000E+01     0   450   129     0     0     0
   1
   434  0.10000000E+01     0   450   130     0     0     0
   1
   435  0.10000000E+01     0   450   131     0     0     0
   7
   436  0.11015902E+00     0   450   132     0     0     0
   436  0.25351489E+00     0   451   132     0     0     0
   436  0.20064528E-02     0   452   132     0     0     0
   436  0.27220033E-01     0   453   132     0     0     0
   436  0.58091396E+00     0   456   131     0     0     0
   436  0.24561368E-01     0   457   131     0     0     0
   436  0.16242961E-02     0   207   435     0     0     0
   1
   437  0.10000000E+01     0   450   121     0     0     0
   0
   1
   439  0.10000000E+01     0   450   123     0     0     0
   0
   8
   441  0.74004158E-01     0   450   125     0     0     0
   441  0.30903840E+00     0   451   125     0     0     0
   441  0.15346921E-02     0   452   125     0     0     0
   441  0.12600903E-01     0   453   125     0     0     0
   441  0.54402053E+00     0   456   126     0     0     0
   441  0.57170290E-01     0   457   126     0     0     0
   441  0.81767055E-03     0   205   429     0     0     0
   441  0.81329764E-03     0   204   429     0     0     0
   0
   1
   443  0.10000000E+01     0   450   127     0     0     0
   0
   1
   445  0.10000000E+01     0   450   129     0     0     0
   0
   8
   447  0.74004158E-01     0   450   131     0     0     0
   447  0.30903840E+00     0   451   131     0     0     0
   447  0.15346921E-02     0   452   131     0     0     0
   447  0.12600903E-01     0   453   131     0     0     0
   447  0.54402053E+00     0   454   132     0     0     0
   447  0.57170290E-01     0   455   132     0     0     0
   447  0.81767055E-03     0   205   435     0     0     0
   447  0.81329764E-03     0   204   435     0     0     0
   0
  16
   449  0.63292414E-01     0   408     2     0     0     0
   449  0.63292414E-01     0   402     8     0     0     0
   449  0.61533526E-01     0   407     1     0     0     0
   449  0.61533526E-01     0   401     7     0     0     0
   449  0.62853426E-01     0   420     2     0     0     0
   449  0.62853426E-01     0   414     8     0     0     0
   449  0.62321343E-01     0   419     1     0     0     0
   449  0.62321343E-01     0   413     7     0     0     0
   449  0.61533511E-01     0   409     3     0     0     0
   449  0.61533511E-01     0   403     9     0     0     0
   449  0.62321328E-01     0   421     3     0     0     0
   449  0.62321328E-01     0   415     9     0     0     0
   449  0.63291714E-01     0   410     4     0     0     0
   449  0.63291714E-01     0   404    10     0     0     0
   449  0.62852725E-01     0   422     4     0     0     0
   449  0.62852725E-01     0   416    10     0     0     0
   0
  15
   451  0.53033209E-03     0   450   200     0     0     0
   451  0.98179586E-01     0   425   127     0     0     0
   451  0.98179586E-01     0   431   121     0     0     0
   451  0.98179244E-01     0   427   129     0     0     0
   451  0.98179244E-01     0   433   123     0     0     0
   451  0.88010088E-03     0   437   127     0     0     0
   451  0.88010088E-03     0   443   121     0     0     0
   451  0.88009785E-03     0   439   129     0     0     0
   451  0.88009785E-03     0   445   123     0     0     0
   451  0.90972509E-03     0   429   131     0     0     0
   451  0.90972509E-03     0   435   125     0     0     0
   451  0.15035304E+00     0   426   128     0     0     0
   451  0.15035304E+00     0   432   122     0     0     0
   451  0.15035304E+00     0   428   130     0     0     0
   451  0.15035304E+00     0   434   124     0     0     0
  36
   452  0.30194569E+00     0   454   199     0     0     0
   452  0.30194569E+00     0   456   198     0     0     0
   452  0.99977233E-01     0   450   200     0     0     0
   452  0.24821311E+00     0   451   200     0     0     0
   452  0.13655655E-01     0   450   203     0     0     0
   452  0.12396844E-01     0   451   203     0     0     0
   452  0.83084602E-03     0   402     8     0     0     0
   452  0.83084602E-03     0   408     2     0     0     0
   452  0.12252745E-02     0   401     7     0     0     0
   452  0.12252745E-02     0   407     1     0     0     0
   452  0.12252729E-02     0   403     9     0     0     0
   452  0.12252729E-02     0   409     3     0     0     0
   452  0.83080144E-03     0   404    10     0     0     0
   452  0.83080144E-03     0   410     4     0     0     0
   452  0.24567000E-03     0   414     8     0     0     0
   452  0.24567000E-03     0   420     2     0     0     0
   452  0.59641439E-04     0   413     7     0     0     0
   452  0.59641439E-04     0   419     1     0     0     0
   452  0.59641348E-04     0   415     9     0     0     0
   452  0.59641348E-04     0   421     3     0     0     0
   452  0.24565653E-03     0   416    10     0     0     0
   452  0.24565653E-03     0   422     4     0     0     0
   452  0.34194032E-03     0   425   127     0     0     0
   452  0.34194032E-03     0   431   121     0     0     0
   452  0.34194026E-03     0   427   129     0     0     0
   452  0.34194026E-03     0   433   123     0     0     0
   452  0.44468901E-03     0   437   127     0     0     0
   452  0.44468901E-03     0   443   121     0     0     0
   452  0.44468895E-03     0   439   129     0     0     0
   452  0.44468895E-03     0   445   123     0     0     0
   452  0.13111623E-02     0   429   131     0     0     0
   452  0.13111623E-02     0   435   125     0     0     0
   452  0.16628313E-02     0   426   128     0     0     0
   452  0.16628313E-02     0   432   122     0     0     0
   452  0.16628313E-02     0   428   130     0     0     0
   452  0.16628313E-02     0   434   124     0     0     0
  36
   453  0.25164235E+00     0   454   199     0     0     0
   453  0.25164235E+00     0   456   198     0     0     0
   453  0.12098595E-01     0   450   200     0     0     0
   453  0.13098359E-01     0   451   200     0     0     0
   453  0.62979296E-01     0   450   203     0     0     0
   453  0.16041136E+00     0   451   203     0     0     0
   453  0.14213725E-01     0   402     8     0     0     0
   453  0.14213725E-01     0   408     2     0     0     0
   453  0.17298590E-01     0   401     7     0     0     0
   453  0.17298590E-01     0   407     1     0     0     0
   453  0.17298574E-01     0   403     9     0     0     0
   453  0.17298574E-01     0   409     3     0     0     0
   453  0.14213097E-01     0   404    10     0     0     0
   453  0.14213097E-01     0   410     4     0     0     0
   453  0.12682335E-02     0   414     8     0     0     0
   453  0.12682335E-02     0   420     2     0     0     0
   453  0.30908515E-03     0   413     7     0     0     0
   453  0.30908515E-03     0   419     1     0     0     0
   453  0.30908477E-03     0   415     9     0     0     0
   453  0.30908477E-03     0   421     3     0     0     0
   453  0.12681764E-02     0   416    10     0     0     0
   453  0.12681764E-02     0   422     4     0     0     0
   453  0.73182988E-02     0   425   127     0     0     0
   453  0.73182988E-02     0   431   121     0     0     0
   453  0.73182979E-02     0   427   129     0     0     0
   453  0.73182979E-02     0   433   123     0     0     0
   453  0.20859891E-02     0   437   127     0     0     0
   453  0.20859891E-02     0   443   121     0     0     0
   453  0.20859889E-02     0   439   129     0     0     0
   453  0.20859889E-02     0   445   123     0     0     0
   453  0.26947078E-02     0   429   131     0     0     0
   453  0.26947078E-02     0   435   125     0     0     0
   453  0.18191006E-01     0   426   128     0     0     0
   453  0.18191006E-01     0   432   122     0     0     0
   453  0.18191006E-01     0   428   130     0     0     0
   453  0.18191006E-01     0   434   124     0     0     0
   6
   454  0.73752948E-02     0   450   198     0     0     0
   454  0.33137047E+00     0   426   127     0     0     0
   454  0.33137015E+00     0   428   129     0     0     0
   454  0.16490228E+00     0   431   122     0     0     0
   454  0.16490208E+00     0   433   124     0     0     0
   454  0.79722915E-04     0   435   126     0     0     0
  13
   455  0.53189304E-01     0   450   198     0     0     0
   455  0.27329391E+00     0   451   198     0     0     0
   455  0.19863252E-01     0   402     7     0     0     0
   455  0.46070952E-01     0   407     2     0     0     0
   455  0.19862708E-01     0   404     9     0     0     0
   455  0.50178055E-01     0   409     4     0     0     0
   455  0.15088513E-01     0   426   127     0     0     0
   455  0.15088514E-01     0   428   129     0     0     0
   455  0.36035221E-01     0   431   122     0     0     0
   455  0.36035217E-01     0   433   124     0     0     0
   455  0.12548370E-02     0   435   126     0     0     0
   455  0.24381112E+00     0   454   200     0     0     0
   455  0.19022839E+00     0   454   203     0     0     0
   6
   456  0.73752948E-02     0   450   199     0     0     0
   456  0.33137047E+00     0   432   121     0     0     0
   456  0.33137015E+00     0   434   123     0     0     0
   456  0.16490228E+00     0   425   128     0     0     0
   456  0.16490208E+00     0   427   130     0     0     0
   456  0.79722915E-04     0   429   132     0     0     0
  13
   457  0.53189304E-01     0   450   199     0     0     0
   457  0.27329391E+00     0   451   199     0     0     0
   457  0.19863252E-01     0   408     1     0     0     0
   457  0.46070952E-01     0   401     8     0     0     0
   457  0.19862708E-01     0   410     3     0     0     0
   457  0.50178055E-01     0   403    10     0     0     0
   457  0.15088513E-01     0   432   121     0     0     0
   457  0.15088514E-01     0   434   123     0     0     0
   457  0.36035221E-01     0   425   128     0     0     0
   457  0.36035217E-01     0   427   130     0     0     0
   457  0.12548370E-02     0   429   132     0     0     0
   457  0.24381112E+00     0   456   200     0     0     0
   457  0.19022839E+00     0   456   203     0     0     0
  28
   203  0.21324474E-03     0   123   129     0     0     0
   203  0.60972791E-01     0   125   131     0     0     0
   203  0.25646992E-02     0     3     9     0     0     0
   203  0.85118282E+00     0     5    11     0     0     0
   203  0.37280496E-01     0     4    10     0     0     0
   203  0.14829405E-02     0    59    59     0     0     0
   203  0.33165220E-01     0    13    13     0     0     0
   203  0.70849742E-03     0   198   121   128     0     0
   203  0.70849742E-03     0   198   123   130     0     0
   203  0.70849742E-03     0   198   125   132     0     0
   203  0.21254923E-02     0   198     8     1     0     0
   203  0.21254923E-02     0   198    10     3     0     0
   203  0.70849742E-03     0   199   127   122     0     0
   203  0.70849742E-03     0   199   129   124     0     0
   203  0.70849742E-03     0   199   131   126     0     0
   203  0.21254923E-02     0   199     2     7     0     0
   203  0.21254923E-02     0   199     4     9     0     0
   203  0.26321562E-04     0   200   122   128     0     0
   203  0.26321562E-04     0   200   124   130     0     0
   203  0.26321562E-04     0   200   126   132     0     0
   203  0.13247379E-04     0   200   121   127     0     0
   203  0.13247379E-04     0   200   123   129     0     0
   203  0.13247379E-04     0   200   125   131     0     0
   203  0.45384397E-04     0   200     2     8     0     0
   203  0.45384397E-04     0   200     4    10     0     0
   203  0.58466281E-04     0   200     1     7     0     0
   203  0.58466281E-04     0   200     3     9     0     0
   203  0.58466281E-04     0   200     5    11     0     0
  37
   204  0.27939614E-02     0   125   131     0     0     0
   204  0.11435767E-03     0     3     9     0     0     0
   204  0.28197238E-01     0     5    11     0     0     0
   204  0.23627739E+00     0     6    12     0     0     0
   204  0.13895391E-03     0    13    13     0     0     0
   204  0.57130668E-03     0   198   199     0     0     0
   204  0.29006801E-03     0   200   200     0     0     0
   204  0.23698045E-02     0   450   450     0     0     0
   204  0.12130074E-01     0   450   451     0     0     0
   204  0.62234655E-01     0   450   452     0     0     0
   204  0.12090374E-01     0   450   453     0     0     0
   204  0.14867296E-01     0   451   451     0     0     0
   204  0.14533886E+00     0   451   452     0     0     0
   204  0.20745357E-01     0   451   453     0     0     0
   204  0.31223689E-03     0   452   452     0     0     0
   204  0.13504262E-01     0   452   453     0     0     0
   204  0.67620882E-03     0   453   453     0     0     0
   204  0.36987696E-01     0   454   456     0     0     0
   204  0.36852248E-03     0   455   457     0     0     0
   204  0.20174544E+00     0   454   457     0     0     0
   204  0.20174544E+00     0   456   455     0     0     0
   204  0.24075778E-02     0   203   203     0     0     0
   204  0.11909664E-03     0   425   431     0     0     0
   204  0.89300847E-04     0   437   443     0     0     0
   204  0.11908683E-03     0   427   433     0     0     0
   204  0.89292364E-04     0   439   445     0     0     0
   204  0.86901186E-04     0   429   435     0     0     0
   204  0.50524692E-03     0   402   408     0     0     0
   204  0.10092239E-03     0   414   420     0     0     0
   204  0.50490460E-03     0   404   410     0     0     0
   204  0.10077040E-03     0   416   422     0     0     0
   204  0.74395206E-03     0   401   407     0     0     0
   204  0.25100102E-04     0   413   419     0     0     0
   204  0.74409100E-03     0   403   409     0     0     0
   204  0.25074471E-04     0   415   421     0     0     0
   204  0.41960183E-03     0   426   432     0     0     0
   204  0.41960183E-03     0   428   434     0     0     0
  22
   205  0.28211698E-02     0   125   131     0     0     0
   205  0.11547721E-03     0     3     9     0     0     0
   205  0.28500319E-01     0     5    11     0     0     0
   205  0.25509819E+00     0     6    12     0     0     0
   205  0.14898115E-03     0    13    13     0     0     0
   205  0.39211344E-02     0   450   450     0     0     0
   205  0.23160502E-01     0   450   451     0     0     0
   205  0.16787924E-01     0   450   452     0     0     0
   205  0.47843162E-01     0   450   453     0     0     0
   205  0.33633631E-01     0   451   451     0     0     0
   205  0.29817048E-01     0   451   452     0     0     0
   205  0.10673770E+00     0   451   453     0     0     0
   205  0.56554598E-03     0   452   452     0     0     0
   205  0.10163158E-02     0   452   453     0     0     0
   205  0.15544373E-01     0   453   453     0     0     0
   205  0.82171023E-01     0   454   456     0     0     0
   205  0.16594520E-01     0   455   457     0     0     0
   205  0.16745552E+00     0   454   457     0     0     0
   205  0.16745552E+00     0   456   455     0     0     0
   205  0.56221156E-03     0   203   200     0     0     0
   205  0.24870438E-04     0   404   422     0     0     0
   205  0.24870438E-04     0   416   410     0     0     0
  17
   206  0.10287389E-04     0   124   129     0     0     0
   206  0.29464478E-02     0   126   131     0     0     0
   206  0.11568277E-03     0     4     9     0     0     0
   206  0.23913279E+00     0     6    11     0     0     0
   206  0.32174263E-01     0   454   450     0     0     0
   206  0.29227301E-03     0   454   451     0     0     0
   206  0.21283974E+00     0   454   452     0     0     0
   206  0.20901778E+00     0   454   453     0     0     0
   206  0.40781457E-01     0   455   450     0     0     0
   206  0.24890597E+00     0   455   451     0     0     0
   206  0.87726768E-02     0   455   452     0     0     0
   206  0.83920266E-03     0   455   453     0     0     0
   206  0.59257785E-03     0   203   198     0     0     0
   206  0.12809881E-02     0   402   407     0     0     0
   206  0.12804680E-02     0   404   409     0     0     0
   206  0.50870789E-03     0   431   426     0     0     0
   206  0.50869311E-03     0   433   428     0     0     0
  17
   207  0.10287389E-04     0   130   123     0     0     0
   207  0.29464478E-02     0   132   125     0     0     0
   207  0.11568277E-03     0    10     3     0     0     0
   207  0.23913279E+00     0    12     5     0     0     0
   207  0.32174263E-01     0   456   450     0     0     0
   207  0.29227301E-03     0   456   451     0     0     0
   207  0.21283974E+00     0   456   452     0     0     0
   207  0.20901778E+00     0   456   453     0     0     0
   207  0.40781457E-01     0   457   450     0     0     0
   207  0.24890597E+00     0   457   451     0     0     0
   207  0.87726768E-02     0   457   452     0     0     0
   207  0.83920266E-03     0   457   453     0     0     0
   207  0.59257785E-03     0   203   199     0     0     0
   207  0.12809881E-02     0   408   401     0     0     0
   207  0.12804680E-02     0   410   403     0     0     0
   207  0.50870789E-03     0   425   432     0     0     0
   207  0.50869311E-03     0   427   434     0     0     0
   0
   5
     6  0.33333334E+00   100     2     7     5     0     0
     6  0.33333334E+00   100     4     9     5     0     0
     6  0.11111111E+00   100   122   127     5     0     0
     6  0.11111111E+00   100   124   129     5     0     0
     6  0.11111111E+00   100   126   131     5     0     0
   5
    12  0.33333334E+00   100     8     1    11     0     0
    12  0.33333334E+00   100    10     3    11     0     0
    12  0.11111111E+00   100   128   121    11     0     0
    12  0.11111111E+00   100   130   123    11     0     0
    12  0.11111111E+00   100   132   125    11     0     0
      4.00000000     -0.24957119
      0.99050838     -0.05432412      0.11525796     -0.05155071
     -0.08545429     -0.96212196      0.21956424     -0.13715115
     -0.04115922      0.06235391      0.70052940      0.70970160
     -0.09948091      0.25977334      0.66915303     -0.68909764
     -0.97929609      0.20243324     -0.20243324     -0.97929609
     -0.94682348      0.32175347     -0.32175347     -0.94682348
      1.57075787     -1.57079613     -1.57079637
    112.50000000   1800.00000000   1800.00000000
    450.00000000
    T
