  65
  401    469.9505    0.14702E-24
  402    464.0144    0.14127E-24
  403    469.9506    0.14702E-24
  404    464.0165    0.14127E-24
  405    430.9063    0.19314E-24
  406    312.8360    0.37710E-24
  407    469.9505    0.14702E-24
  408    464.0144    0.14127E-24
  409    469.9506    0.14702E-24
  410    464.0165    0.14127E-24
  411    430.9063    0.19314E-24
  412    312.8360    0.37710E-24
  413    451.8298    0.27796E-23
  414    451.6644    0.69520E-24
  415    451.8299    0.27796E-23
  416    451.6666    0.69521E-24
  417    451.8273    0.16232E-23
  418    503.7570    0.13402E-24
  419    451.8298    0.27796E-23
  420    451.6644    0.69520E-24
  421    451.8299    0.27796E-23
  422    451.6666    0.69521E-24
  423    451.8273    0.16232E-23
  424    503.7570    0.13402E-24
  425    174.3751    0.14905E-23
  426    157.8676    0.19015E-23
  427    174.3752    0.14905E-23
  428    157.8676    0.19015E-23
  429    129.6733    0.22972E-23
  430    156.9347    0.19698E-23
  431    174.3751    0.14905E-23
  432    157.8676    0.19015E-23
  433    174.3752    0.14905E-23
  434    157.8676    0.19015E-23
  435    129.6733    0.22972E-23
  436    156.9347    0.19698E-23
  437    129.9150    0.22557E-23
  438      0.0000    0.10000E+31
  439    129.9150    0.22558E-23
  440      0.0000    0.10000E+31
  441    174.1626    0.15068E-23
  442      0.0000    0.10000E+31
  443    129.9150    0.22557E-23
  444      0.0000    0.10000E+31
  445    129.9150    0.22558E-23
  446      0.0000    0.10000E+31
  447    174.1626    0.15068E-23
  448      0.0000    0.10000E+31
  449    497.9904    0.18217E-24
  450     72.5711    0.10000E+31
  451    132.9219    0.36950E-20
  452   -308.6850    0.35324E-24
  453    340.5909    0.23142E-24
  454    130.6494    0.63018E-20
  455    335.6411    0.23425E-24
  456    130.6494    0.63018E-20
  457    335.6411    0.23425E-24
  203     94.8985    0.17026E-21
  204    372.7428    0.10642E-23
  205    366.0556    0.31763E-24
  206    376.7913    0.40919E-24
  207    376.7913    0.40919E-24
  458      0.0000    0.10000E+31
    6    172.5000    0.57395E-24
   12    172.5000    0.57395E-24
   6
   401  0.43989137E-01     0   450     1     0     0     0
   401  0.29009286E+00     0   451     1     0     0     0
   401  0.10335314E-02     0   452     1     0     0     0
   401  0.14554396E-01     0   453     1     0     0     0
   401  0.61027306E+00     0   456     2     0     0     0
   401  0.40056977E-01     0   457     2     0     0     0
   6
   402  0.37582134E-03     0   450     2     0     0     0
   402  0.32444939E+00     0   451     2     0     0     0
   402  0.57650474E-03     0   452     2     0     0     0
   402  0.97784074E-02     0   453     2     0     0     0
   402  0.64799869E+00     0   454     1     0     0     0
   402  0.16821217E-01     0   455     1     0     0     0
   6
   403  0.43989774E-01     0   450     3     0     0     0
   403  0.29009709E+00     0   451     3     0     0     0
   403  0.10335468E-02     0   452     3     0     0     0
   403  0.14554617E-01     0   453     3     0     0     0
   403  0.61027014E+00     0   456     4     0     0     0
   403  0.40054824E-01     0   457     4     0     0     0
   6
   404  0.37581677E-03     0   450     4     0     0     0
   404  0.32444507E+00     0   451     4     0     0     0
   404  0.57648472E-03     0   452     4     0     0     0
   404  0.97778905E-02     0   453     4     0     0     0
   404  0.64800310E+00     0   454     3     0     0     0
   404  0.16821645E-01     0   455     3     0     0     0
   6
   405  0.55644535E-01     0   450     5     0     0     0
   405  0.32696781E+00     0   451     5     0     0     0
   405  0.10600020E-02     0   452     5     0     0     0
   405  0.10029772E-01     0   453     5     0     0     0
   405  0.40450931E+00     0   456     6     0     0     0
   405  0.20178859E+00     0   199   406     0     0     0
   3
   406  0.11996915E+00     0   450     6     0     0     0
   406  0.50685033E-01     0   451     6     0     0     0
   406  0.82934582E+00     0   454     5     0     0     0
   6
   407  0.43989137E-01     0   450     7     0     0     0
   407  0.29009286E+00     0   451     7     0     0     0
   407  0.10335314E-02     0   452     7     0     0     0
   407  0.14554396E-01     0   453     7     0     0     0
   407  0.61027306E+00     0   454     8     0     0     0
   407  0.40056977E-01     0   455     8     0     0     0
   6
   408  0.37582134E-03     0   450     8     0     0     0
   408  0.32444939E+00     0   451     8     0     0     0
   408  0.57650474E-03     0   452     8     0     0     0
   408  0.97784074E-02     0   453     8     0     0     0
   408  0.64799869E+00     0   456     7     0     0     0
   408  0.16821217E-01     0   457     7     0     0     0
   6
   409  0.43989774E-01     0   450     9     0     0     0
   409  0.29009709E+00     0   451     9     0     0     0
   409  0.10335468E-02     0   452     9     0     0     0
   409  0.14554617E-01     0   453     9     0     0     0
   409  0.61027014E+00     0   454    10     0     0     0
   409  0.40054824E-01     0   455    10     0     0     0
   6
   410  0.37581677E-03     0   450    10     0     0     0
   410  0.32444507E+00     0   451    10     0     0     0
   410  0.57648472E-03     0   452    10     0     0     0
   410  0.97778905E-02     0   453    10     0     0     0
   410  0.64800310E+00     0   456     9     0     0     0
   410  0.16821645E-01     0   457     9     0     0     0
   6
   411  0.55644535E-01     0   450    11     0     0     0
   411  0.32696781E+00     0   451    11     0     0     0
   411  0.10600020E-02     0   452    11     0     0     0
   411  0.10029772E-01     0   453    11     0     0     0
   411  0.40450931E+00     0   454    12     0     0     0
   411  0.20178859E+00     0   198   412     0     0     0
   3
   412  0.11996915E+00     0   450    12     0     0     0
   412  0.50685033E-01     0   451    12     0     0     0
   412  0.82934582E+00     0   456    11     0     0     0
   4
   413  0.95486850E+00     0   450     1     0     0     0
   413  0.40428147E-01     0   451     1     0     0     0
   413  0.78506261E-03     0   452     1     0     0     0
   413  0.39182683E-02     0   453     1     0     0     0
   4
   414  0.95488036E+00     0   450     2     0     0     0
   414  0.40424604E-01     0   451     2     0     0     0
   414  0.78409619E-03     0   452     2     0     0     0
   414  0.39109164E-02     0   453     2     0     0     0
   4
   415  0.95486850E+00     0   450     3     0     0     0
   415  0.40428147E-01     0   451     3     0     0     0
   415  0.78506290E-03     0   452     3     0     0     0
   415  0.39182706E-02     0   453     3     0     0     0
   4
   416  0.95488065E+00     0   450     4     0     0     0
   416  0.40424559E-01     0   451     4     0     0     0
   416  0.78407471E-03     0   452     4     0     0     0
   416  0.39107134E-02     0   453     4     0     0     0
   6
   417  0.53204370E+00     0   450     5     0     0     0
   417  0.12636900E+00     0   451     5     0     0     0
   417  0.10943813E-01     0   452     5     0     0     0
   417  0.21897681E-01     0   453     5     0     0     0
   417  0.13804348E+00     0   456     6     0     0     0
   417  0.17070235E+00     0   199   406     0     0     0
   7
   418  0.21210118E+00     0   454     5     0     0     0
   418  0.28439096E+00     0   455     5     0     0     0
   418  0.29684782E+00     0   200   406     0     0     0
   418  0.52165180E-01     0   203   406     0     0     0
   418  0.23573523E-01     0   450     6     0     0     0
   418  0.10369984E+00     0   451     6     0     0     0
   418  0.27221505E-01     0   452     6     0     0     0
   4
   419  0.95486850E+00     0   450     7     0     0     0
   419  0.40428147E-01     0   451     7     0     0     0
   419  0.78506261E-03     0   452     7     0     0     0
   419  0.39182683E-02     0   453     7     0     0     0
   4
   420  0.95488036E+00     0   450     8     0     0     0
   420  0.40424604E-01     0   451     8     0     0     0
   420  0.78409619E-03     0   452     8     0     0     0
   420  0.39109164E-02     0   453     8     0     0     0
   4
   421  0.95486850E+00     0   450     9     0     0     0
   421  0.40428147E-01     0   451     9     0     0     0
   421  0.78506290E-03     0   452     9     0     0     0
   421  0.39182706E-02     0   453     9     0     0     0
   4
   422  0.95488065E+00     0   450    10     0     0     0
   422  0.40424559E-01     0   451    10     0     0     0
   422  0.78407471E-03     0   452    10     0     0     0
   422  0.39107134E-02     0   453    10     0     0     0
   6
   423  0.53204370E+00     0   450    11     0     0     0
   423  0.12636900E+00     0   451    11     0     0     0
   423  0.10943813E-01     0   452    11     0     0     0
   423  0.21897681E-01     0   453    11     0     0     0
   423  0.13804348E+00     0   454    12     0     0     0
   423  0.17070235E+00     0   198   412     0     0     0
   7
   424  0.21210118E+00     0   456    11     0     0     0
   424  0.28439096E+00     0   457    11     0     0     0
   424  0.29684782E+00     0   200   412     0     0     0
   424  0.52165180E-01     0   203   412     0     0     0
   424  0.23573523E-01     0   450    12     0     0     0
   424  0.10369984E+00     0   451    12     0     0     0
   424  0.27221505E-01     0   452    12     0     0     0
   3
   425  0.16808163E+00     0   450   121     0     0     0
   425  0.31313697E+00     0   451   121     0     0     0
   425  0.51878142E+00     0   456   122     0     0     0
   3
   426  0.54755652E+00     0   450   122     0     0     0
   426  0.10488665E+00     0   451   122     0     0     0
   426  0.34755683E+00     0   454   121     0     0     0
   3
   427  0.16808164E+00     0   450   123     0     0     0
   427  0.31313613E+00     0   451   123     0     0     0
   427  0.51878226E+00     0   456   124     0     0     0
   3
   428  0.54755825E+00     0   450   124     0     0     0
   428  0.10488698E+00     0   451   124     0     0     0
   428  0.34755480E+00     0   454   123     0     0     0
   1
   429  0.10000000E+01     0   450   125     0     0     0
   3
   430  0.56026798E+00     0   450   126     0     0     0
   430  0.10182759E+00     0   451   126     0     0     0
   430  0.33790442E+00     0   454   125     0     0     0
   3
   431  0.16808163E+00     0   450   127     0     0     0
   431  0.31313697E+00     0   451   127     0     0     0
   431  0.51878142E+00     0   454   128     0     0     0
   3
   432  0.54755652E+00     0   450   128     0     0     0
   432  0.10488665E+00     0   451   128     0     0     0
   432  0.34755683E+00     0   456   127     0     0     0
   3
   433  0.16808164E+00     0   450   129     0     0     0
   433  0.31313613E+00     0   451   129     0     0     0
   433  0.51878226E+00     0   454   130     0     0     0
   3
   434  0.54755825E+00     0   450   130     0     0     0
   434  0.10488698E+00     0   451   130     0     0     0
   434  0.34755480E+00     0   456   129     0     0     0
   1
   435  0.10000000E+01     0   450   131     0     0     0
   3
   436  0.56026798E+00     0   450   132     0     0     0
   436  0.10182759E+00     0   451   132     0     0     0
   436  0.33790442E+00     0   456   131     0     0     0
   1
   437  0.10000000E+01     0   450   121     0     0     0
   0
   1
   439  0.10000000E+01     0   450   123     0     0     0
   0
   3
   441  0.18642585E+00     0   450   125     0     0     0
   441  0.30594778E+00     0   451   125     0     0     0
   441  0.50762635E+00     0   456   126     0     0     0
   0
   1
   443  0.10000000E+01     0   450   127     0     0     0
   0
   1
   445  0.10000000E+01     0   450   129     0     0     0
   0
   3
   447  0.18642585E+00     0   450   131     0     0     0
   447  0.30594778E+00     0   451   131     0     0     0
   447  0.50762635E+00     0   454   132     0     0     0
   0
  26
   449  0.65442262E-04     0   454     5    12     0     0
   449  0.65442262E-04     0   456     6    11     0     0
   449  0.21487525E-04     0   452    13     0     0     0
   449  0.10467657E-04     0   453    13     0     0     0
   449  0.29689008E-01     0   408     2     0     0     0
   449  0.29689008E-01     0   402     8     0     0     0
   449  0.20471346E-01     0   407     1     0     0     0
   449  0.20471346E-01     0   401     7     0     0     0
   449  0.53787135E-01     0   420     2     0     0     0
   449  0.53787135E-01     0   414     8     0     0     0
   449  0.53422268E-01     0   419     1     0     0     0
   449  0.53422268E-01     0   413     7     0     0     0
   449  0.20470772E-01     0   409     3     0     0     0
   449  0.20470772E-01     0   403     9     0     0     0
   449  0.53421680E-01     0   421     3     0     0     0
   449  0.53421680E-01     0   415     9     0     0     0
   449  0.29663587E-01     0   410     4     0     0     0
   449  0.29663587E-01     0   404    10     0     0     0
   449  0.53761598E-01     0   422     4     0     0     0
   449  0.53761598E-01     0   416    10     0     0     0
   449  0.10408213E+00     0   411     5     0     0     0
   449  0.10408213E+00     0   405    11     0     0     0
   449  0.55648528E-01     0   423     5     0     0     0
   449  0.55648528E-01     0   417    11     0     0     0
   449  0.25500538E-01     0   412     6     0     0     0
   449  0.25500538E-01     0   406    12     0     0     0
   0
  17
   451  0.15796396E-02     0   450     2     8     0     0
   451  0.26514104E-02     0   450     1     7     0     0
   451  0.26514099E-02     0   450     3     9     0     0
   451  0.15796373E-02     0   450     4    10     0     0
   451  0.27986288E-02     0   450     5    11     0     0
   451  0.53658830E-02     0   450   121   127     0     0
   451  0.53658802E-02     0   450   123   129     0     0
   451  0.55535836E-02     0   450   125   131     0     0
   451  0.19733969E-01     0   450   122   128     0     0
   451  0.19733969E-01     0   450   124   130     0     0
   451  0.20845676E-01     0   450   126   132     0     0
   451  0.17060694E+00     0   437   127     0     0     0
   451  0.17060694E+00     0   443   121     0     0     0
   451  0.17050019E+00     0   439   129     0     0     0
   451  0.17050019E+00     0   445   123     0     0     0
   451  0.11496302E+00     0   429   131     0     0     0
   451  0.11496302E+00     0   435   125     0     0     0
  24
   452  0.30570990E+00     0   454   199     0     0     0
   452  0.30570990E+00     0   456   198     0     0     0
   452  0.15308174E+00     0   450   200     0     0     0
   452  0.19451274E+00     0   451   200     0     0     0
   452  0.13111508E-01     0   450   203     0     0     0
   452  0.72230999E-02     0   451   203     0     0     0
   452  0.37220219E-03     0   425   127     0     0     0
   452  0.37220219E-03     0   431   121     0     0     0
   452  0.37220208E-03     0   427   129     0     0     0
   452  0.37220208E-03     0   433   123     0     0     0
   452  0.73034747E-03     0   437   127     0     0     0
   452  0.73034747E-03     0   443   121     0     0     0
   452  0.73034724E-03     0   439   129     0     0     0
   452  0.73034724E-03     0   445   123     0     0     0
   452  0.98293298E-03     0   429   131     0     0     0
   452  0.98293298E-03     0   435   125     0     0     0
   452  0.99791994E-03     0   441   131     0     0     0
   452  0.99791994E-03     0   447   125     0     0     0
   452  0.20408479E-02     0   426   128     0     0     0
   452  0.20408479E-02     0   432   122     0     0     0
   452  0.20408479E-02     0   428   130     0     0     0
   452  0.20408479E-02     0   434   124     0     0     0
   452  0.20579195E-02     0   430   132     0     0     0
   452  0.20579195E-02     0   436   126     0     0     0
  24
   453  0.26202512E+00     0   454   199     0     0     0
   453  0.26202512E+00     0   456   198     0     0     0
   453  0.11854858E-01     0   450   200     0     0     0
   453  0.81871888E-02     0   451   200     0     0     0
   453  0.78344718E-01     0   450   203     0     0     0
   453  0.11071115E+00     0   451   203     0     0     0
   453  0.10757232E-01     0   425   127     0     0     0
   453  0.10757232E-01     0   431   121     0     0     0
   453  0.10757230E-01     0   427   129     0     0     0
   453  0.10757230E-01     0   433   123     0     0     0
   453  0.43340693E-02     0   437   127     0     0     0
   453  0.43340693E-02     0   443   121     0     0     0
   453  0.43340679E-02     0   439   129     0     0     0
   453  0.43340679E-02     0   445   123     0     0     0
   453  0.39305524E-02     0   429   131     0     0     0
   453  0.39305524E-02     0   435   125     0     0     0
   453  0.11551178E-01     0   441   131     0     0     0
   453  0.11551178E-01     0   447   125     0     0     0
   453  0.29191008E-01     0   426   128     0     0     0
   453  0.29191012E-01     0   432   122     0     0     0
   453  0.29191008E-01     0   428   130     0     0     0
   453  0.29191012E-01     0   434   124     0     0     0
   453  0.29379562E-01     0   430   132     0     0     0
   453  0.29379562E-01     0   436   126     0     0     0
   6
   454  0.25310776E+00     0   450     2     7     0     0
   454  0.25310776E+00     0   450     4     9     0     0
   454  0.15535767E+00     0   450   127   122     0     0
   454  0.15535767E+00     0   450   129   124     0     0
   454  0.15902017E+00     0   450   131   126     0     0
   454  0.24048980E-01     0   435   126     0     0     0
  12
   455  0.26736110E-01     0   450   198     0     0     0
   455  0.31291905E+00     0   451   198     0     0     0
   455  0.22282753E-01     0   406    11     0     0     0
   455  0.26916452E-01     0   426   127     0     0     0
   455  0.26916450E-01     0   428   129     0     0     0
   455  0.27596978E-01     0   430   131     0     0     0
   455  0.50618999E-01     0   431   122     0     0     0
   455  0.50618995E-01     0   433   124     0     0     0
   455  0.79631289E-04     0   435   126     0     0     0
   455  0.51185716E-01     0   447   126     0     0     0
   455  0.24347599E+00     0   454   200     0     0     0
   455  0.16065288E+00     0   454   203     0     0     0
   6
   456  0.25310776E+00     0   450     8     1     0     0
   456  0.25310776E+00     0   450    10     3     0     0
   456  0.15535767E+00     0   450   121   128     0     0
   456  0.15535767E+00     0   450   123   130     0     0
   456  0.15902017E+00     0   450   125   132     0     0
   456  0.24048980E-01     0   429   132     0     0     0
  12
   457  0.26736110E-01     0   450   199     0     0     0
   457  0.31291905E+00     0   451   199     0     0     0
   457  0.22282753E-01     0   412     5     0     0     0
   457  0.26916452E-01     0   432   121     0     0     0
   457  0.26916450E-01     0   434   123     0     0     0
   457  0.27596978E-01     0   436   125     0     0     0
   457  0.50618999E-01     0   425   128     0     0     0
   457  0.50618995E-01     0   427   130     0     0     0
   457  0.79631289E-04     0   429   132     0     0     0
   457  0.51185716E-01     0   441   132     0     0     0
   457  0.24347599E+00     0   456   200     0     0     0
   457  0.16065288E+00     0   456   203     0     0     0
  17
   203  0.21650466E-03     0   123   129     0     0     0
   203  0.61880298E-01     0   125   131     0     0     0
   203  0.26081945E-02     0     3     9     0     0     0
   203  0.87846595E+00     0     5    11     0     0     0
   203  0.31761568E-01     0     4    10     0     0     0
   203  0.98474475E-03     0    59    59     0     0     0
   203  0.23158703E-01     0    13    13     0     0     0
   203  0.51333900E-04     0   198   121   128     0     0
   203  0.51333900E-04     0   198   123   130     0     0
   203  0.51333900E-04     0   198   125   132     0     0
   203  0.15400170E-03     0   198     8     1     0     0
   203  0.15400170E-03     0   198    10     3     0     0
   203  0.51333900E-04     0   199   127   122     0     0
   203  0.51333900E-04     0   199   129   124     0     0
   203  0.51333900E-04     0   199   131   126     0     0
   203  0.15400170E-03     0   199     2     7     0     0
   203  0.15400170E-03     0   199     4     9     0     0
  26
   204  0.37925027E-04     0   123   129     0     0     0
   204  0.10860832E-01     0   125   131     0     0     0
   204  0.44866794E-03     0     3     9     0     0     0
   204  0.71268819E-01     0     5    11     0     0     0
   204  0.88175249E-04     0     4    10     0     0     0
   204  0.37241992E+00     0     6    12     0     0     0
   204  0.22797612E-04     0    59    59     0     0     0
   204  0.30555513E-02     0    13    13     0     0     0
   204  0.27431652E-01     0   198   199     0     0     0
   204  0.13027304E-01     0   200   200     0     0     0
   204  0.36337685E-01     0   450   450     0     0     0
   204  0.86058483E-01     0   450   451     0     0     0
   204  0.41382995E-01     0   451   451     0     0     0
   204  0.15992691E+00     0   454   456     0     0     0
   204  0.83873183E-01     0   203   203     0     0     0
   204  0.40133870E-02     0   425   431     0     0     0
   204  0.61092856E-02     0   437   443     0     0     0
   204  0.40132008E-02     0   427   433     0     0     0
   204  0.61089583E-02     0   439   445     0     0     0
   204  0.61518247E-02     0   429   435     0     0     0
   204  0.39236760E-02     0   441   447     0     0     0
   204  0.10911876E-04     0   429   447     0     0     0
   204  0.10911876E-04     0   441   435     0     0     0
   204  0.21034829E-01     0   426   432     0     0     0
   204  0.21034829E-01     0   428   434     0     0     0
   204  0.21347303E-01     0   430   436     0     0     0
  12
   205  0.11407132E-04     0   123   129     0     0     0
   205  0.32670239E-02     0   125   131     0     0     0
   205  0.13497574E-03     0     3     9     0     0     0
   205  0.21448171E-01     0     5    11     0     0     0
   205  0.21080785E-04     0     4    10     0     0     0
   205  0.54753113E+00     0     6    12     0     0     0
   205  0.63075393E-03     0    13    13     0     0     0
   205  0.27749034E-01     0   450   450     0     0     0
   205  0.87428875E-01     0   450   451     0     0     0
   205  0.66916443E-01     0   451   451     0     0     0
   205  0.23823822E+00     0   454   456     0     0     0
   205  0.66228858E-02     0   203   200     0     0     0
  11
   206  0.15126302E-04     0   124   129     0     0     0
   206  0.43322127E-02     0   126   131     0     0     0
   206  0.18835269E-03     0     4     9     0     0     0
   206  0.84264505E+00     0     6    11     0     0     0
   206  0.11417802E+00     0   454   450     0     0     0
   206  0.56872615E-02     0   454   451     0     0     0
   206  0.99517470E-02     0   203   198     0     0     0
   206  0.76201931E-02     0   431   426     0     0     0
   206  0.76200627E-02     0   433   428     0     0     0
   206  0.30209005E-03     0   435   430     0     0     0
   206  0.74598989E-02     0   447   430     0     0     0
  11
   207  0.15126302E-04     0   130   123     0     0     0
   207  0.43322127E-02     0   132   125     0     0     0
   207  0.18835269E-03     0    10     3     0     0     0
   207  0.84264505E+00     0    12     5     0     0     0
   207  0.11417802E+00     0   456   450     0     0     0
   207  0.56872615E-02     0   456   451     0     0     0
   207  0.99517470E-02     0   203   199     0     0     0
   207  0.76201931E-02     0   425   432     0     0     0
   207  0.76200627E-02     0   427   434     0     0     0
   207  0.30209005E-03     0   429   436     0     0     0
   207  0.74598989E-02     0   441   436     0     0     0
   0
   5
     6  0.33333334E+00   100     2     7     5     0     0
     6  0.33333334E+00   100     4     9     5     0     0
     6  0.11111111E+00   100   122   127     5     0     0
     6  0.11111111E+00   100   124   129     5     0     0
     6  0.11111111E+00   100   126   131     5     0     0
   5
    12  0.33333334E+00   100     8     1    11     0     0
    12  0.33333334E+00   100    10     3    11     0     0
    12  0.11111111E+00   100   128   121    11     0     0
    12  0.11111111E+00   100   130   123    11     0     0
    12  0.11111111E+00   100   132   125    11     0     0
      3.00000000     -0.35821405
      0.96592832     -0.14627202      0.18850122     -0.10026941
     -0.21197137     -0.91957295      0.27402335     -0.18537731
     -0.05059888      0.07579606      0.69662905      0.71161962
     -0.13960685      0.35671386      0.63567781     -0.67020786
     -0.95484900      0.29709154     -0.29709154     -0.95484900
     -0.90063155      0.43458354     -0.43458354     -0.90063155
     -0.94920844     -0.21415576     -1.43464732
   -363.25772095   -580.89599609   -127.39035034
    306.20223999
    T
