  65
  401    503.0903    0.38622E-25
  402    497.4608    0.39551E-25
  403    503.0904    0.38622E-25
  404    497.4627    0.39552E-25
  405   2000.1373    0.59326E-26
  406   2004.0999    0.41302E-26
  407    503.0903    0.38622E-25
  408    497.4608    0.39551E-25
  409    503.0904    0.38622E-25
  410    497.4627    0.39552E-25
  411   2000.1373    0.59326E-26
  412   2004.0999    0.41302E-26
  413    500.5668    0.47761E-25
  414    498.8644    0.46306E-25
  415    500.5669    0.47761E-25
  416    498.8662    0.46307E-25
  417   2000.7828    0.41785E-26
  418   2004.4734    0.42137E-26
  419    500.5668    0.47761E-25
  420    498.8644    0.46306E-25
  421    500.5669    0.47761E-25
  422    498.8662    0.46307E-25
  423   2000.7828    0.41785E-26
  424   2004.4734    0.42137E-26
  425   2000.4913    0.24614E-25
  426   1999.0830    0.24576E-25
  427   2000.4913    0.24614E-25
  428   1999.0830    0.24576E-25
  429   2000.4075    0.65355E-25
  430   1999.0830    0.24520E-25
  431   2000.4913    0.24614E-25
  432   1999.0830    0.24576E-25
  433   2000.4913    0.24614E-25
  434   1999.0830    0.24576E-25
  435   2000.4075    0.65355E-25
  436   1999.0830    0.24520E-25
  437   2000.4253    0.66153E-25
  438      0.0000    0.10000E+31
  439   2000.4253    0.66153E-25
  440      0.0000    0.10000E+31
  441   2000.5106    0.24558E-25
  442      0.0000    0.10000E+31
  443   2000.4253    0.66153E-25
  444      0.0000    0.10000E+31
  445   2000.4253    0.66153E-25
  446      0.0000    0.10000E+31
  447   2000.5106    0.24558E-25
  448      0.0000    0.10000E+31
  449    300.0000    0.34080E-19
  450    199.8806    0.10000E+31
  451    249.7887    0.10205E-17
  452   -453.1879    0.22680E-24
  453    478.2475    0.21527E-24
  454    247.5060    0.14949E-19
  455    475.5892    0.21290E-24
  456    247.5060    0.14949E-19
  457    475.5892    0.21290E-24
  203    105.4010    0.17895E-21
  204   1007.6904    0.58294E-25
  205   1000.0000    0.59457E-25
  206   1007.8588    0.61482E-25
  207   1007.8588    0.61482E-25
  458      0.0000    0.10000E+31
    6    172.5000    0.57395E-24
   12    172.5000    0.57395E-24
   7
   401  0.10424853E-01     0   450     1     0     0     0
   401  0.56281414E-01     0   451     1     0     0     0
   401  0.18172363E-04     0   452     1     0     0     0
   401  0.13067154E-03     0   453     1     0     0     0
   401  0.80982506E+00     0   449     1     0     0     0
   401  0.12292919E+00     0   456     2     0     0     0
   401  0.39062151E-03     0   457     2     0     0     0
   5
   402  0.66703118E-01     0   451     2     0     0     0
   402  0.59930986E-04     0   453     2     0     0     0
   402  0.80056888E+00     0   449     2     0     0     0
   402  0.13253812E+00     0   454     1     0     0     0
   402  0.12989566E-03     0   455     1     0     0     0
   7
   403  0.10424890E-01     0   450     3     0     0     0
   403  0.56281619E-01     0   451     3     0     0     0
   403  0.18172444E-04     0   452     3     0     0     0
   403  0.13067230E-03     0   453     3     0     0     0
   403  0.80982798E+00     0   449     3     0     0     0
   403  0.12292656E+00     0   456     4     0     0     0
   403  0.39012599E-03     0   457     4     0     0     0
   5
   404  0.66703260E-01     0   451     4     0     0     0
   404  0.59789156E-04     0   453     4     0     0     0
   404  0.80056506E+00     0   449     4     0     0     0
   404  0.13254189E+00     0   454     3     0     0     0
   404  0.12991906E-03     0   455     3     0     0     0
   7
   405  0.93563041E-02     0   450     5     0     0     0
   405  0.54951652E-03     0   451     5     0     0     0
   405  0.64263865E-03     0   452     5     0     0     0
   405  0.70068811E-03     0   453     5     0     0     0
   405  0.98748583E+00     0   449     5     0     0     0
   405  0.18941276E-03     0   456     6     0     0     0
   405  0.10756052E-02     0   457     6     0     0     0
   7
   406  0.67820048E+00     0   449     6     0     0     0
   406  0.27121933E-01     0   450     6     0     0     0
   406  0.56477110E-02     0   451     6     0     0     0
   406  0.73828943E-01     0   452     6     0     0     0
   406  0.67168623E-01     0   453     6     0     0     0
   406  0.11178084E-01     0   454     5     0     0     0
   406  0.13685422E+00     0   455     5     0     0     0
   7
   407  0.10424853E-01     0   450     7     0     0     0
   407  0.56281414E-01     0   451     7     0     0     0
   407  0.18172363E-04     0   452     7     0     0     0
   407  0.13067154E-03     0   453     7     0     0     0
   407  0.80982506E+00     0   449     7     0     0     0
   407  0.12292919E+00     0   454     8     0     0     0
   407  0.39062151E-03     0   455     8     0     0     0
   5
   408  0.66703118E-01     0   451     8     0     0     0
   408  0.59930986E-04     0   453     8     0     0     0
   408  0.80056888E+00     0   449     8     0     0     0
   408  0.13253812E+00     0   456     7     0     0     0
   408  0.12989566E-03     0   457     7     0     0     0
   7
   409  0.10424890E-01     0   450     9     0     0     0
   409  0.56281619E-01     0   451     9     0     0     0
   409  0.18172444E-04     0   452     9     0     0     0
   409  0.13067230E-03     0   453     9     0     0     0
   409  0.80982798E+00     0   449     9     0     0     0
   409  0.12292656E+00     0   454    10     0     0     0
   409  0.39012599E-03     0   455    10     0     0     0
   5
   410  0.66703260E-01     0   451    10     0     0     0
   410  0.59789156E-04     0   453    10     0     0     0
   410  0.80056506E+00     0   449    10     0     0     0
   410  0.13254189E+00     0   456     9     0     0     0
   410  0.12991906E-03     0   457     9     0     0     0
   7
   411  0.93563041E-02     0   450    11     0     0     0
   411  0.54951652E-03     0   451    11     0     0     0
   411  0.64263865E-03     0   452    11     0     0     0
   411  0.70068811E-03     0   453    11     0     0     0
   411  0.98748583E+00     0   449    11     0     0     0
   411  0.18941276E-03     0   454    12     0     0     0
   411  0.10756052E-02     0   455    12     0     0     0
   7
   412  0.67820048E+00     0   449    12     0     0     0
   412  0.27121933E-01     0   450    12     0     0     0
   412  0.56477110E-02     0   451    12     0     0     0
   412  0.73828943E-01     0   452    12     0     0     0
   412  0.67168623E-01     0   453    12     0     0     0
   412  0.11178084E-01     0   456    11     0     0     0
   412  0.13685422E+00     0   457    11     0     0     0
   3
   413  0.13533141E-01     0   450     1     0     0     0
   413  0.55683847E-03     0   451     1     0     0     0
   413  0.98591006E+00     0   449     1     0     0     0
   3
   414  0.52169140E-01     0   450     2     0     0     0
   414  0.21423984E-02     0   451     2     0     0     0
   414  0.94568843E+00     0   449     2     0     0     0
   3
   415  0.13533138E-01     0   450     3     0     0     0
   415  0.55683841E-03     0   451     3     0     0     0
   415  0.98591006E+00     0   449     3     0     0     0
   3
   416  0.52169640E-01     0   450     4     0     0     0
   416  0.21424119E-02     0   451     4     0     0     0
   416  0.94568795E+00     0   449     4     0     0     0
   7
   417  0.62262267E-02     0   450     5     0     0     0
   417  0.41385625E-01     0   451     5     0     0     0
   417  0.64240862E-03     0   452     5     0     0     0
   417  0.57718977E-02     0   453     5     0     0     0
   417  0.69574684E+00     0   449     5     0     0     0
   417  0.97661622E-01     0   456     6     0     0     0
   417  0.15256542E+00     0   457     6     0     0     0
   7
   418  0.69205046E+00     0   449     6     0     0     0
   418  0.97582482E-01     0   454     5     0     0     0
   418  0.74967486E-02     0   455     5     0     0     0
   418  0.17912518E-02     0   450     6     0     0     0
   418  0.52552529E-01     0   451     6     0     0     0
   418  0.75564727E-01     0   452     6     0     0     0
   418  0.72961785E-01     0   453     6     0     0     0
   3
   419  0.13533141E-01     0   450     7     0     0     0
   419  0.55683847E-03     0   451     7     0     0     0
   419  0.98591006E+00     0   449     7     0     0     0
   3
   420  0.52169140E-01     0   450     8     0     0     0
   420  0.21423984E-02     0   451     8     0     0     0
   420  0.94568843E+00     0   449     8     0     0     0
   3
   421  0.13533138E-01     0   450     9     0     0     0
   421  0.55683841E-03     0   451     9     0     0     0
   421  0.98591006E+00     0   449     9     0     0     0
   3
   422  0.52169640E-01     0   450    10     0     0     0
   422  0.21424119E-02     0   451    10     0     0     0
   422  0.94568795E+00     0   449    10     0     0     0
   7
   423  0.62262267E-02     0   450    11     0     0     0
   423  0.41385625E-01     0   451    11     0     0     0
   423  0.64240862E-03     0   452    11     0     0     0
   423  0.57718977E-02     0   453    11     0     0     0
   423  0.69574684E+00     0   449    11     0     0     0
   423  0.97661622E-01     0   454    12     0     0     0
   423  0.15256542E+00     0   455    12     0     0     0
   7
   424  0.69205046E+00     0   449    12     0     0     0
   424  0.97582482E-01     0   456    11     0     0     0
   424  0.74967486E-02     0   457    11     0     0     0
   424  0.17912518E-02     0   450    12     0     0     0
   424  0.52552529E-01     0   451    12     0     0     0
   424  0.75564727E-01     0   452    12     0     0     0
   424  0.72961785E-01     0   453    12     0     0     0
   6
   425  0.40883131E-01     0   450   121     0     0     0
   425  0.33894271E+00     0   451   121     0     0     0
   425  0.42407689E-03     0   452   121     0     0     0
   425  0.16059561E-01     0   453   121     0     0     0
   425  0.52576852E+00     0   456   122     0     0     0
   425  0.77922016E-01     0   457   122     0     0     0
   6
   426  0.14997829E+00     0   450   122     0     0     0
   426  0.20115203E+00     0   451   122     0     0     0
   426  0.16705211E-02     0   452   122     0     0     0
   426  0.41442987E-01     0   453   122     0     0     0
   426  0.56672585E+00     0   454   121     0     0     0
   426  0.39030284E-01     0   455   121     0     0     0
   6
   427  0.40883131E-01     0   450   123     0     0     0
   427  0.33894271E+00     0   451   123     0     0     0
   427  0.42407689E-03     0   452   123     0     0     0
   427  0.16059557E-01     0   453   123     0     0     0
   427  0.52576852E+00     0   456   124     0     0     0
   427  0.77922016E-01     0   457   124     0     0     0
   6
   428  0.14997829E+00     0   450   124     0     0     0
   428  0.20115203E+00     0   451   124     0     0     0
   428  0.16705211E-02     0   452   124     0     0     0
   428  0.41442987E-01     0   453   124     0     0     0
   428  0.56672585E+00     0   454   123     0     0     0
   428  0.39030284E-01     0   455   123     0     0     0
   6
   429  0.92413282E+00     0   450   125     0     0     0
   429  0.47439341E-01     0   451   125     0     0     0
   429  0.40621911E-02     0   452   125     0     0     0
   429  0.18326329E-01     0   453   125     0     0     0
   429  0.90325845E-03     0   456   126     0     0     0
   429  0.51360377E-02     0   457   126     0     0     0
   6
   430  0.14963865E+00     0   450   126     0     0     0
   430  0.20069650E+00     0   451   126     0     0     0
   430  0.16667380E-02     0   452   126     0     0     0
   430  0.41349135E-01     0   453   126     0     0     0
   430  0.56577396E+00     0   454   125     0     0     0
   430  0.40874980E-01     0   455   125     0     0     0
   6
   431  0.40883131E-01     0   450   127     0     0     0
   431  0.33894271E+00     0   451   127     0     0     0
   431  0.42407689E-03     0   452   127     0     0     0
   431  0.16059561E-01     0   453   127     0     0     0
   431  0.52576852E+00     0   454   128     0     0     0
   431  0.77922016E-01     0   455   128     0     0     0
   6
   432  0.14997829E+00     0   450   128     0     0     0
   432  0.20115203E+00     0   451   128     0     0     0
   432  0.16705211E-02     0   452   128     0     0     0
   432  0.41442987E-01     0   453   128     0     0     0
   432  0.56672585E+00     0   456   127     0     0     0
   432  0.39030284E-01     0   457   127     0     0     0
   6
   433  0.40883131E-01     0   450   129     0     0     0
   433  0.33894271E+00     0   451   129     0     0     0
   433  0.42407689E-03     0   452   129     0     0     0
   433  0.16059557E-01     0   453   129     0     0     0
   433  0.52576852E+00     0   454   130     0     0     0
   433  0.77922016E-01     0   455   130     0     0     0
   6
   434  0.14997829E+00     0   450   130     0     0     0
   434  0.20115203E+00     0   451   130     0     0     0
   434  0.16705211E-02     0   452   130     0     0     0
   434  0.41442987E-01     0   453   130     0     0     0
   434  0.56672585E+00     0   456   129     0     0     0
   434  0.39030284E-01     0   457   129     0     0     0
   6
   435  0.92413282E+00     0   450   131     0     0     0
   435  0.47439341E-01     0   451   131     0     0     0
   435  0.40621911E-02     0   452   131     0     0     0
   435  0.18326329E-01     0   453   131     0     0     0
   435  0.90325845E-03     0   454   132     0     0     0
   435  0.51360377E-02     0   455   132     0     0     0
   6
   436  0.14963865E+00     0   450   132     0     0     0
   436  0.20069650E+00     0   451   132     0     0     0
   436  0.16667380E-02     0   452   132     0     0     0
   436  0.41349135E-01     0   453   132     0     0     0
   436  0.56577396E+00     0   456   131     0     0     0
   436  0.40874980E-01     0   457   131     0     0     0
   4
   437  0.93525130E+00     0   450   121     0     0     0
   437  0.47663864E-01     0   451   121     0     0     0
   437  0.11105781E-02     0   452   121     0     0     0
   437  0.15974257E-01     0   453   121     0     0     0
   0
   4
   439  0.93525130E+00     0   450   123     0     0     0
   439  0.47663864E-01     0   451   123     0     0     0
   439  0.11105781E-02     0   452   123     0     0     0
   439  0.15974257E-01     0   453   123     0     0     0
   0
   6
   441  0.40860098E-01     0   450   125     0     0     0
   441  0.33830118E+00     0   451   125     0     0     0
   441  0.15373158E-02     0   452   125     0     0     0
   441  0.16980909E-01     0   453   125     0     0     0
   441  0.52457517E+00     0   456   126     0     0     0
   441  0.77745333E-01     0   457   126     0     0     0
   0
   4
   443  0.93525130E+00     0   450   127     0     0     0
   443  0.47663864E-01     0   451   127     0     0     0
   443  0.11105781E-02     0   452   127     0     0     0
   443  0.15974257E-01     0   453   127     0     0     0
   0
   4
   445  0.93525130E+00     0   450   129     0     0     0
   445  0.47663864E-01     0   451   129     0     0     0
   445  0.11105781E-02     0   452   129     0     0     0
   445  0.15974257E-01     0   453   129     0     0     0
   0
   6
   447  0.40860098E-01     0   450   131     0     0     0
   447  0.33830118E+00     0   451   131     0     0     0
   447  0.15373158E-02     0   452   131     0     0     0
   447  0.16980909E-01     0   453   131     0     0     0
   447  0.52457517E+00     0   454   132     0     0     0
   447  0.77745333E-01     0   455   132     0     0     0
   0
  16
   449  0.51476069E-01     0   454     1     8     0     0
   449  0.51476069E-01     0   456     2     7     0     0
   449  0.51475491E-01     0   454     3    10     0     0
   449  0.51475491E-01     0   456     4     9     0     0
   449  0.26265657E-03     0   450    13     0     0     0
   449  0.24126202E+00     0   450     2     8     0     0
   449  0.11362334E+00     0   450     1     7     0     0
   449  0.11362330E+00     0   450     3     9     0     0
   449  0.24125722E+00     0   450     4    10     0     0
   449  0.24878464E-03     0   450     5    11     0     0
   449  0.10919767E-03     0   451    13     0     0     0
   449  0.23573898E-01     0   451     2     8     0     0
   449  0.18265326E-01     0   451     1     7     0     0
   449  0.18265320E-01     0   451     3     9     0     0
   449  0.23573395E-01     0   451     4    10     0     0
   449  0.32451742E-04     0   451     5    11     0     0
   0
  18
   451  0.96986843E-02     0   450    59     0     0     0
   451  0.14158210E-03     0   456     2     7     0     0
   451  0.47194033E-04     0   456   122   127     0     0
   451  0.47194033E-04     0   456   124   129     0     0
   451  0.14158209E-03     0   454     1     8     0     0
   451  0.47194033E-04     0   454   121   128     0     0
   451  0.47194033E-04     0   454   123   130     0     0
   451  0.10557519E+00     0   450     2     8     0     0
   451  0.22815108E+00     0   450     1     7     0     0
   451  0.22815108E+00     0   450     3     9     0     0
   451  0.10557499E+00     0   450     4    10     0     0
   451  0.11141080E+00     0   450     5    11     0     0
   451  0.23305882E-01     0   450   121   127     0     0
   451  0.23305882E-01     0   450   123   129     0     0
   451  0.23831353E-01     0   450   125   131     0     0
   451  0.46841033E-01     0   450   122   128     0     0
   451  0.46841033E-01     0   450   124   130     0     0
   451  0.46841033E-01     0   450   126   132     0     0
   6
   452  0.30654842E+00     0   454   199     0     0     0
   452  0.30654842E+00     0   456   198     0     0     0
   452  0.16969274E+00     0   450   200     0     0     0
   452  0.20342083E+00     0   451   200     0     0     0
   452  0.84008798E-02     0   450   203     0     0     0
   452  0.53887749E-02     0   451   203     0     0     0
  10
   453  0.34482509E+00     0   454   199     0     0     0
   453  0.34482509E+00     0   456   198     0     0     0
   453  0.10966691E-01     0   450   200     0     0     0
   453  0.87384898E-02     0   451   200     0     0     0
   453  0.19361365E-04     0   451     2     8     0     0
   453  0.19297318E-04     0   451     1     7     0     0
   453  0.19297304E-04     0   451     3     9     0     0
   453  0.19360436E-04     0   451     4    10     0     0
   453  0.12951651E+00     0   450   203     0     0     0
   453  0.16105075E+00     0   451   203     0     0     0
   5
   454  0.33622998E+00     0   450     2     7     0     0
   454  0.33622998E+00     0   450     4     9     0     0
   454  0.10917997E+00     0   450   127   122     0     0
   454  0.10917997E+00     0   450   129   124     0     0
   454  0.10918015E+00     0   450   131   126     0     0
  10
   455  0.34552831E-01     0   450   198     0     0     0
   455  0.18591689E-04     0   451     2     7     0     0
   455  0.18591281E-04     0   451     4     9     0     0
   455  0.40865991E+00     0   451   198     0     0     0
   455  0.32722008E+00     0   454   200     0     0     0
   455  0.22429424E-04     0   454     1     7     0     0
   455  0.22428319E-04     0   454     3     9     0     0
   455  0.35828805E-04     0   454     2     8     0     0
   455  0.35828776E-04     0   454     4    10     0     0
   455  0.22941349E+00     0   454   203     0     0     0
   5
   456  0.33622998E+00     0   450     8     1     0     0
   456  0.33622998E+00     0   450    10     3     0     0
   456  0.10917997E+00     0   450   121   128     0     0
   456  0.10917997E+00     0   450   123   130     0     0
   456  0.10918015E+00     0   450   125   132     0     0
  10
   457  0.34552831E-01     0   450   199     0     0     0
   457  0.18591689E-04     0   451     8     1     0     0
   457  0.18591281E-04     0   451    10     3     0     0
   457  0.40865991E+00     0   451   199     0     0     0
   457  0.32722008E+00     0   456   200     0     0     0
   457  0.22429424E-04     0   456     7     1     0     0
   457  0.22428319E-04     0   456     9     3     0     0
   457  0.35828805E-04     0   456     8     2     0     0
   457  0.35828776E-04     0   456    10     4     0     0
   457  0.22941349E+00     0   456   203     0     0     0
  28
   203  0.21322611E-03     0   123   129     0     0     0
   203  0.60967464E-01     0   125   131     0     0     0
   203  0.25644752E-02     0     3     9     0     0     0
   203  0.85110855E+00     0     5    11     0     0     0
   203  0.37277244E-01     0     4    10     0     0     0
   203  0.15041195E-02     0    59    59     0     0     0
   203  0.33228375E-01     0    13    13     0     0     0
   203  0.70842775E-03     0   198   121   128     0     0
   203  0.70842775E-03     0   198   123   130     0     0
   203  0.70842775E-03     0   198   125   132     0     0
   203  0.21252835E-02     0   198     8     1     0     0
   203  0.21252835E-02     0   198    10     3     0     0
   203  0.70842775E-03     0   199   127   122     0     0
   203  0.70842775E-03     0   199   129   124     0     0
   203  0.70842775E-03     0   199   131   126     0     0
   203  0.21252835E-02     0   199     2     7     0     0
   203  0.21252835E-02     0   199     4     9     0     0
   203  0.26318743E-04     0   200   122   128     0     0
   203  0.26318743E-04     0   200   124   130     0     0
   203  0.26318743E-04     0   200   126   132     0     0
   203  0.13245959E-04     0   200   121   127     0     0
   203  0.13245959E-04     0   200   123   129     0     0
   203  0.13245959E-04     0   200   125   131     0     0
   203  0.45379536E-04     0   200     2     8     0     0
   203  0.45379536E-04     0   200     4    10     0     0
   203  0.58460017E-04     0   200     1     7     0     0
   203  0.58460017E-04     0   200     3     9     0     0
   203  0.58460017E-04     0   200     5    11     0     0
  29
   204  0.10222042E-04     0   123   129     0     0     0
   204  0.29276947E-02     0   125   131     0     0     0
   204  0.11983141E-03     0     3     9     0     0     0
   204  0.29546905E-01     0     5    11     0     0     0
   204  0.24758667E+00     0     6    12     0     0     0
   204  0.13921829E-03     0    13    13     0     0     0
   204  0.59865130E-03     0   198   199     0     0     0
   204  0.30395165E-03     0   200   200     0     0     0
   204  0.52697468E-02     0   450   450     0     0     0
   204  0.15426556E-01     0   450   451     0     0     0
   204  0.89119516E-01     0   450   452     0     0     0
   204  0.10829818E-01     0   450   453     0     0     0
   204  0.11040960E-01     0   451   451     0     0     0
   204  0.11717764E+00     0   451   452     0     0     0
   204  0.11420811E-01     0   451   453     0     0     0
   204  0.27077354E-03     0   452   452     0     0     0
   204  0.19092306E-01     0   452   453     0     0     0
   204  0.75268373E-03     0   453   453     0     0     0
   204  0.41152176E-01     0   454   456     0     0     0
   204  0.59820706E-03     0   455   457     0     0     0
   204  0.19687080E+00     0   454   457     0     0     0
   204  0.19687080E+00     0   456   455     0     0     0
   204  0.25226185E-02     0   203   203     0     0     0
   204  0.10377265E-03     0   402   408     0     0     0
   204  0.18399047E-04     0   414   420     0     0     0
   204  0.10368821E-03     0   404   410     0     0     0
   204  0.18368073E-04     0   416   422     0     0     0
   204  0.53603668E-04     0   401   407     0     0     0
   204  0.53612581E-04     0   403   409     0     0     0
  21
   205  0.10370343E-04     0   123   129     0     0     0
   205  0.29702063E-02     0   125   131     0     0     0
   205  0.12157765E-03     0     3     9     0     0     0
   205  0.30005934E-01     0     5    11     0     0     0
   205  0.26857433E+00     0     6    12     0     0     0
   205  0.15685143E-03     0    13    13     0     0     0
   205  0.11981729E-01     0   450   450     0     0     0
   205  0.38543135E-01     0   450   451     0     0     0
   205  0.18498868E-01     0   450   452     0     0     0
   205  0.58074981E-01     0   450   453     0     0     0
   205  0.30522265E-01     0   451   451     0     0     0
   205  0.20664258E-01     0   451   452     0     0     0
   205  0.71795270E-01     0   451   453     0     0     0
   205  0.49044890E-03     0   452   452     0     0     0
   205  0.12110901E-02     0   452   453     0     0     0
   205  0.20949423E-01     0   453   453     0     0     0
   205  0.11015295E+00     0   454   456     0     0     0
   205  0.24795379E-01     0   455   457     0     0     0
   205  0.14494452E+00     0   454   457     0     0     0
   205  0.14494452E+00     0   456   455     0     0     0
   205  0.59191085E-03     0   203   200     0     0     0
  15
   206  0.10807590E-04     0   124   129     0     0     0
   206  0.30954401E-02     0   126   131     0     0     0
   206  0.12153249E-03     0     4     9     0     0     0
   206  0.25122485E+00     0     6    11     0     0     0
   206  0.40431470E-01     0   454   450     0     0     0
   206  0.23822575E-02     0   454   451     0     0     0
   206  0.20615250E+00     0   454   452     0     0     0
   206  0.19947262E+00     0   454   453     0     0     0
   206  0.15356133E-01     0   455   450     0     0     0
   206  0.26680171E+00     0   455   451     0     0     0
   206  0.12861072E-01     0   455   452     0     0     0
   206  0.10641627E-02     0   455   453     0     0     0
   206  0.62254164E-03     0   203   198     0     0     0
   206  0.20149480E-03     0   402   407     0     0     0
   206  0.20138813E-03     0   404   409     0     0     0
  15
   207  0.10807590E-04     0   130   123     0     0     0
   207  0.30954401E-02     0   132   125     0     0     0
   207  0.12153249E-03     0    10     3     0     0     0
   207  0.25122485E+00     0    12     5     0     0     0
   207  0.40431470E-01     0   456   450     0     0     0
   207  0.23822575E-02     0   456   451     0     0     0
   207  0.20615250E+00     0   456   452     0     0     0
   207  0.19947262E+00     0   456   453     0     0     0
   207  0.15356133E-01     0   457   450     0     0     0
   207  0.26680171E+00     0   457   451     0     0     0
   207  0.12861072E-01     0   457   452     0     0     0
   207  0.10641627E-02     0   457   453     0     0     0
   207  0.62254164E-03     0   203   199     0     0     0
   207  0.20149480E-03     0   408   401     0     0     0
   207  0.20138813E-03     0   410   403     0     0     0
   0
   5
     6  0.33333334E+00   100     2     7     5     0     0
     6  0.33333334E+00   100     4     9     5     0     0
     6  0.11111111E+00   100   122   127     5     0     0
     6  0.11111111E+00   100   124   129     5     0     0
     6  0.11111111E+00   100   126   131     5     0     0
   5
    12  0.33333334E+00   100     8     1    11     0     0
    12  0.33333334E+00   100    10     3    11     0     0
    12  0.11111111E+00   100   128   121    11     0     0
    12  0.11111111E+00   100   130   123    11     0     0
    12  0.11111111E+00   100   132   125    11     0     0
      4.00000000     -0.24957114
      0.96598238     -0.16696705      0.16748144     -0.10464207
     -0.21931422     -0.93338197      0.23196130     -0.16399141
     -0.03473790      0.05777595      0.70133579      0.70963615
     -0.13256161      0.31238097      0.65289539     -0.67718059
     -0.96447355      0.26417950     -0.26417950     -0.96447355
     -0.92790252      0.37282285     -0.37282285     -0.92790252
      1.57075787     -1.57079613     -1.57079518
    112.50000000   1800.00000000   1800.00000000
    450.00000000
    T
