#  ISAJET SUSY parameters in Les Houches accord format
#  Created by ISALHA3. Last revision by C. Balazs on 2005 Jan. 10
Block SPINFO   # Program information
     1   ISASUGRA from ISAJET          # Spectrum Calculator
     2   7.79   16-DEC-2008 15:42:00   # Version number
Block MODSEL   # Model selection
     1     1   # Minimal supergravity (mSUGRA,CMSSM) model         
Block SMINPUTS   # Standard Model inputs
     1     1.27842560E+02   # alpha_em^(-1)
     2     1.16570000E-05   # G_Fermi
     3     1.17200002E-01   # alpha_s(M_Z)
     4     9.11699982E+01   # m_{Z}(pole)
     5     4.19999981E+00   # m_{b}(m_{b})
     6     1.72500000E+02   # m_{top}(pole)
     7     1.77699995E+00   # m_{tau}(pole)
Block MINPAR   # SUSY breaking input parameters
     1     2.00000000E+02   # m_0
     2     1.45000000E+02   # m_{1/2}
     3     3.00000000E+00   # tan(beta)
     4     1.00000000E+00   # sign(mu)
     5     0.00000000E+00   # A_0
#  
#  M_{GUT} =   0.27296119E+17
Block MASS   # Scalar and gaugino mass spectrum
#  PDG code   mass                 particle
        24     8.04229965E+01   #  W^+
        25     9.13830643E+01   #  h^0            
        35     3.50436768E+02   #  H^0            
        36     3.43671692E+02   #  A^0            
        37     3.54787750E+02   #  H^+            
   1000001     3.96726654E+02   #  dnl            
   1000002     3.89872162E+02   #  upl            
   1000003     3.96726715E+02   #  stl            
   1000004     3.89874634E+02   #  chl            
   1000005     3.54301483E+02   #  b1             
   1000006     2.51482574E+02   #  t1             
   1000011     2.26280777E+02   #  el-            
   1000012     2.14274384E+02   #  nuel           
   1000013     2.26280792E+02   #  mul-           
   1000014     2.14274384E+02   #  numl           
   1000015     2.09564651E+02   #  tau1           
   1000016     2.14058533E+02   #  nutl           
   1000021     3.79302765E+02   #  glss           
   1000022     4.76775131E+01   #  z1ss           
   1000023     8.94690781E+01   #  z2ss           
   1000024     8.50187302E+01   #  w1ss           
   1000025    -2.46692413E+02   #  z3ss           
   1000035     2.81592560E+02   #  z4ss           
   1000037     2.76456116E+02   #  w2ss           
   2000001     3.84804993E+02   #  dnr            
   2000002     3.83358612E+02   #  upr            
   2000003     3.84805054E+02   #  str            
   2000004     3.83361145E+02   #  chr            
   2000005     3.83846161E+02   #  b2             
   2000006     4.26137238E+02   #  t2             
   2000011     2.10340408E+02   #  er-            
   2000013     2.10340439E+02   #  mur-           
   2000015     2.26686142E+02   #  tau2           
#  Higgs mixing
Block ALPHA   # Effective Higgs mixing parameter
         -3.61387163E-01   # alpha
Block STOPMIX   # stop mixing matrix
  1  1     5.77203512E-01   # O_{11}
  1  2    -8.16600323E-01   # O_{12}
  2  1     8.16600323E-01   # O_{21}
  2  2     5.77203512E-01   # O_{22}
Block SBOTMIX   # sbottom mixing matrix
  1  1     9.90585685E-01   # O_{11}
  1  2    -1.36894301E-01   # O_{12}
  2  1     1.36894301E-01   # O_{21}
  2  2     9.90585685E-01   # O_{22}
Block STAUMIX   # stau mixing matrix
  1  1     1.97816148E-01   # O_{11}
  1  2    -9.80239153E-01   # O_{12}
  2  1     9.80239153E-01   # O_{21}
  2  2     1.97816148E-01   # O_{22}
Block NMIX   # neutralino mixing matrix
  1  1     9.23950732E-01   #
  1  2    -2.50350416E-01   #
  1  3     2.58475095E-01   #
  1  4    -1.29732579E-01   #
  2  1    -3.40692371E-01   #
  2  2    -8.81483018E-01   #
  2  3     2.76338667E-01   #
  2  4    -1.74794942E-01   #
  3  1     6.54745549E-02   #
  3  2    -9.96819511E-02   #
  3  3    -6.89273238E-01   #
  3  4    -7.14618027E-01   #
  4  1     1.61111891E-01   #
  4  2    -3.87783140E-01   #
  4  3    -6.17843032E-01   #
  4  4     6.64783478E-01   #
Block UMIX   # chargino U mixing matrix
  1  1    -8.73282194E-01   # U_{11}
  1  2     4.87214714E-01   # U_{12}
  2  1    -4.87214714E-01   # U_{21}
  2  2    -8.73282194E-01   # U_{22}
Block VMIX   # chargino V mixing matrix
  1  1    -9.50269222E-01   # V_{11}
  1  2     3.11429560E-01   # V_{12}
  2  1    -3.11429560E-01   # V_{21}
  2  2    -9.50269222E-01   # V_{22}
Block GAUGE Q=  3.01811676E+02   #
     1     3.57491881E-01   # g`
     2     6.52510166E-01   # g_2
     3     1.22100294E+00   # g_3
Block YU Q=  3.01811676E+02   #
  3  3     9.42031980E-01   # y_t
Block YD Q=  3.01811676E+02   #
  3  3     4.55540307E-02   # y_b
Block YE Q=  3.01811676E+02   #
  3  3     3.17064337E-02   # y_tau
Block HMIX Q=  3.01811676E+02   # Higgs mixing parameters
     1     2.42927536E+02   # mu(Q)
     2     3.00000000E+00   # tan(beta)(M_{GUT})
     3     2.49816544E+02   # Higgs vev at Q
     4     1.18110234E+05   # m_A^2(Q)
Block MSOFT Q=  3.01811676E+02   # DRbar SUSY breaking parameters
     1     5.78230515E+01   # M_1(Q)          
     2     1.10288727E+02   # M_2(Q)          
     3     3.51215973E+02   # M_3(Q)          
    31     2.21927475E+02   # MeL(Q)          
    32     2.21927475E+02   # MmuL(Q)         
    33     2.21721024E+02   # MtauL(Q)        
    34     2.06650314E+02   # MeR(Q)          
    35     2.06650314E+02   # MmuR(Q)         
    36     2.06439316E+02   # MtauR(Q)        
    41     3.74452118E+02   # MqL1(Q)         
    42     3.74452118E+02   # MqL2(Q)         
    43     3.34562927E+02   # MqL3(Q)         
    44     3.66339508E+02   # MuR(Q)          
    45     3.66339508E+02   # McR(Q)          
    46     2.72266541E+02   # MtR(Q)          
    47     3.65658142E+02   # MdR(Q)          
    48     3.65658142E+02   # MsR(Q)          
    49     3.67880341E+02   # MbR(Q)          
Block AU Q=  3.01811676E+02   #
  1  1    -2.68947083E+02   # A_u
  2  2    -2.68947083E+02   # A_c
  3  3    -2.68947083E+02   # A_t
Block AD Q=  3.01811676E+02   #
  1  1    -4.34110718E+02   # A_d
  2  2    -4.34110718E+02   # A_s
  3  3    -4.34110718E+02   # A_b
Block AE Q=  3.01811676E+02   #
  1  1    -9.34139328E+01   # A_e
  2  2    -9.34139328E+01   # A_mu
  3  3    -9.34139328E+01   # A_tau
#  ISAJET decay tables in SUSY Les Houches accord format
#  Created by ISALHD. Last revision: C. Balazs, 2005 May 25
Block DCINFO                           # Program information
     1   ISASUGRA from ISAJET          # Spectrum Calculator
     2   7.79   16-DEC-2008 15:42:00   # Version number
#         PDG         Width
DECAY         6  1.14680767E+00   # TP    decays
#          BR          NDA       ID1       ID2       ID3       ID4
      3.33333343E-01    3            2        -1         5             # TP     -->  UP     DB     BT          
      3.33333343E-01    3            4        -3         5             # TP     -->  CH     SB     BT          
      1.11111112E-01    3          -11        12         5             # TP     -->  E+     NUE    BT          
      1.11111112E-01    3          -13        14         5             # TP     -->  MU+    NUM    BT          
      1.11111112E-01    3          -15        16         5             # TP     -->  TAU+   NUT    BT          
#         PDG         Width
DECAY   1000021  1.89221948E-01   # GLSS  decays
#          BR          NDA       ID1       ID2       ID3       ID4
      3.03998757E-02    3      1000024         1        -2             # GLSS   -->  W1SS+  DN     UB          
      3.03998757E-02    3     -1000024         2        -1             # GLSS   -->  W1SS-  UP     DB          
      3.03984918E-02    3      1000024         3        -4             # GLSS   -->  W1SS+  ST     CB          
      3.03984918E-02    3     -1000024         4        -3             # GLSS   -->  W1SS-  CH     SB          
      8.22783040E-04    3      1000024         5        -6             # GLSS   -->  W1SS+  BT     TB          
      8.22783040E-04    3     -1000024         6        -5             # GLSS   -->  W1SS-  TP     BB          
      3.92552873E-04    3      1000037         1        -2             # GLSS   -->  W2SS+  DN     UB          
      3.92552873E-04    3     -1000037         2        -1             # GLSS   -->  W2SS-  UP     DB          
      3.92532878E-04    3      1000037         3        -4             # GLSS   -->  W2SS+  ST     CB          
      3.92532878E-04    3     -1000037         4        -3             # GLSS   -->  W2SS-  CH     SB          
      1.18585987E-04    2      1000022        21                       # GLSS   -->  Z1SS   GL                 
      1.28071578E-02    3      1000022         2        -2             # GLSS   -->  Z1SS   UP     UB          
      6.18664594E-03    3      1000022         1        -1             # GLSS   -->  Z1SS   DN     DB          
      6.18663337E-03    3      1000022         3        -3             # GLSS   -->  Z1SS   ST     SB          
      1.28058009E-02    3      1000022         4        -4             # GLSS   -->  Z1SS   CH     CB          
      3.05464165E-03    3      1000022         5        -5             # GLSS   -->  Z1SS   BT     BB          
      1.42184974E-04    2      1000023        21                       # GLSS   -->  Z2SS   GL                 
      1.89173166E-02    3      1000023         2        -2             # GLSS   -->  Z2SS   UP     UB          
      1.11431321E-02    3      1000023         1        -1             # GLSS   -->  Z2SS   DN     DB          
      1.11431153E-02    3      1000023         3        -3             # GLSS   -->  Z2SS   ST     SB          
      1.89158134E-02    3      1000023         4        -4             # GLSS   -->  Z2SS   CH     CB          
      5.09147998E-04    3      1000023         5        -5             # GLSS   -->  Z2SS   BT     BB          
      5.43400529E-04    2      1000025        21                       # GLSS   -->  Z3SS   GL                 
      1.80426396E-05    3      1000025         2        -2             # GLSS   -->  Z3SS   UP     UB          
      1.55371054E-05    3      1000025         1        -1             # GLSS   -->  Z3SS   DN     DB          
      1.55370617E-05    3      1000025         3        -3             # GLSS   -->  Z3SS   ST     SB          
      1.80397328E-05    3      1000025         4        -4             # GLSS   -->  Z3SS   CH     CB          
      2.61138575E-05    3      1000025         5        -5             # GLSS   -->  Z3SS   BT     BB          
      3.66413587E-04    2      1000035        21                       # GLSS   -->  Z4SS   GL                 
      1.86458929E-04    3      1000035         2        -2             # GLSS   -->  Z4SS   UP     UB          
      1.63850418E-04    3      1000035         1        -1             # GLSS   -->  Z4SS   DN     DB          
      1.63849996E-04    3      1000035         3        -3             # GLSS   -->  Z4SS   ST     SB          
      1.86433186E-04    3      1000035         4        -4             # GLSS   -->  Z4SS   CH     CB          
      3.07031005E-05    3      1000035         5        -5             # GLSS   -->  Z4SS   BT     BB          
      3.85761499E-01    2     -1000005         5                       # GLSS   -->  BB1    BT                 
      3.85761499E-01    2      1000005        -5                       # GLSS   -->  BT1    BB                 
#         PDG         Width
DECAY   1000002  4.21856546E+00   # UPL   decays
#          BR          NDA       ID1       ID2       ID3       ID4
      2.48123612E-03    2      1000022         2                       # UPL    -->  Z1SS   UP                 
      3.11050683E-01    2      1000023         2                       # UPL    -->  Z2SS   UP                 
      1.07546116E-03    2      1000025         2                       # UPL    -->  Z3SS   UP                 
      1.14243701E-02    2      1000035         2                       # UPL    -->  Z4SS   UP                 
      1.79711245E-02    2      1000021         2                       # UPL    -->  GLSS   UP                 
      6.37343824E-01    2      1000024         1                       # UPL    -->  W1SS+  DN                 
      1.86533015E-02    2      1000037         1                       # UPL    -->  W2SS+  DN                 
#         PDG         Width
DECAY   1000001  4.10125494E+00   # DNL   decays
#          BR          NDA       ID1       ID2       ID3       ID4
      6.96422160E-02    2      1000022         1                       # DNL    -->  Z1SS   DN                 
      2.46085614E-01    2      1000023         1                       # DNL    -->  Z2SS   DN                 
      1.91038102E-03    2      1000025         1                       # DNL    -->  Z3SS   DN                 
      1.74579788E-02    2      1000035         1                       # DNL    -->  Z4SS   DN                 
      4.84342724E-02    2      1000021         1                       # DNL    -->  GLSS   DN                 
      5.65315902E-01    2     -1000024         2                       # DNL    -->  W1SS-  UP                 
      5.11536263E-02    2     -1000037         2                       # DNL    -->  W2SS-  UP                 
#         PDG         Width
DECAY   1000003  4.10118008E+00   # STL   decays
#          BR          NDA       ID1       ID2       ID3       ID4
      6.96435124E-02    2      1000022         3                       # STL    -->  Z1SS   ST                 
      2.46090189E-01    2      1000023         3                       # STL    -->  Z2SS   ST                 
      1.91041711E-03    2      1000025         3                       # STL    -->  Z3SS   ST                 
      1.74583141E-02    2      1000035         3                       # STL    -->  Z4SS   ST                 
      4.84354831E-02    2      1000021         3                       # STL    -->  GLSS   ST                 
      5.65311968E-01    2     -1000024         4                       # STL    -->  W1SS-  CH                 
      5.11501282E-02    2     -1000037         4                       # STL    -->  W2SS-  CH                 
#         PDG         Width
DECAY   1000004  4.21795702E+00   # CHL   decays
#          BR          NDA       ID1       ID2       ID3       ID4
      2.48154998E-03    2      1000022         4                       # CHL    -->  Z1SS   CH                 
      3.11089724E-01    2      1000023         4                       # CHL    -->  Z2SS   CH                 
      1.07556977E-03    2      1000025         4                       # CHL    -->  Z3SS   CH                 
      1.14252111E-02    2      1000035         4                       # CHL    -->  Z4SS   CH                 
      1.78306419E-02    2      1000021         4                       # CHL    -->  GLSS   CH                 
      6.37440741E-01    2      1000024         3                       # CHL    -->  W1SS+  ST                 
      1.86565947E-02    2      1000037         3                       # CHL    -->  W2SS+  ST                 
#         PDG         Width
DECAY   1000005  2.41654754E+00   # BT1   decays
#          BR          NDA       ID1       ID2       ID3       ID4
      1.07474014E-01    2      1000022         5                       # BT1    -->  Z1SS   BT                 
      3.59269768E-01    2      1000023         5                       # BT1    -->  Z2SS   BT                 
      2.28698994E-03    2      1000025         5                       # BT1    -->  Z3SS   BT                 
      1.41415000E-02    2      1000035         5                       # BT1    -->  Z4SS   BT                 
      4.04175609E-01    2     -1000024         6                       # BT1    -->  W1SS-  TP                 
      1.12652093E-01    2          -24   1000006                       # BT1    -->  W-     TP1                
#         PDG         Width
DECAY   1000006  1.46624863E+00   # TP1   decays
#          BR          NDA       ID1       ID2       ID3       ID4
      5.54526560E-02    2      1000022         6                       # TP1    -->  Z1SS   TP                 
      9.44547296E-01    2      1000024         5                       # TP1    -->  W1SS+  BT                 
#         PDG         Width
DECAY   2000002  8.24639142E-01   # UPR   decays
#          BR          NDA       ID1       ID2       ID3       ID4
      8.69591653E-01    2      1000022         2                       # UPR    -->  Z1SS   UP                 
      1.09052457E-01    2      1000023         2                       # UPR    -->  Z2SS   UP                 
      1.54651958E-03    2      1000025         2                       # UPR    -->  Z3SS   UP                 
      5.78331947E-03    2      1000035         2                       # UPR    -->  Z4SS   UP                 
      1.40260421E-02    2      1000021         2                       # UPR    -->  GLSS   UP                 
#         PDG         Width
DECAY   2000001  2.25240245E-01   # DNR   decays
#          BR          NDA       ID1       ID2       ID3       ID4
      7.99118578E-01    2      1000022         1                       # DNR    -->  Z1SS   DN                 
      1.00277685E-01    2      1000023         1                       # DNR    -->  Z2SS   DN                 
      1.43596192E-03    2      1000025         1                       # DNR    -->  Z3SS   DN                 
      5.40722208E-03    2      1000035         1                       # DNR    -->  Z4SS   DN                 
      9.37605724E-02    2      1000021         1                       # DNR    -->  GLSS   DN                 
#         PDG         Width
DECAY   2000003  2.25240752E-01   # STR   decays
#          BR          NDA       ID1       ID2       ID3       ID4
      7.99116969E-01    2      1000022         3                       # STR    -->  Z1SS   ST                 
      1.00277491E-01    2      1000023         3                       # STR    -->  Z2SS   ST                 
      1.43595960E-03    2      1000025         3                       # STR    -->  Z3SS   ST                 
      5.40721463E-03    2      1000035         3                       # STR    -->  Z4SS   ST                 
      9.37624127E-02    2      1000021         3                       # STR    -->  GLSS   ST                 
#         PDG         Width
DECAY   2000004  8.23971987E-01   # CHR   decays
#          BR          NDA       ID1       ID2       ID3       ID4
      8.70279610E-01    2      1000022         4                       # CHR    -->  Z1SS   CH                 
      1.09138630E-01    2      1000023         4                       # CHR    -->  Z2SS   CH                 
      1.54769921E-03    2      1000025         4                       # CHR    -->  Z3SS   CH                 
      5.78754302E-03    2      1000035         4                       # CHR    -->  Z4SS   CH                 
      1.32465111E-02    2      1000021         4                       # CHR    -->  GLSS   CH                 
#         PDG         Width
DECAY   2000005  2.54032344E-01   # BT2   decays
#          BR          NDA       ID1       ID2       ID3       ID4
      6.85232282E-01    2      1000022         5                       # BT2    -->  Z1SS   BT                 
      1.32333204E-01    2      1000023         5                       # BT2    -->  Z2SS   BT                 
      1.74358878E-02    2      1000025         5                       # BT2    -->  Z3SS   BT                 
      2.59883776E-02    2      1000035         5                       # BT2    -->  Z4SS   BT                 
      5.67540303E-02    2     -1000024         6                       # BT2    -->  W1SS-  TP                 
      8.22562352E-02    2          -24   1000006                       # BT2    -->  W-     TP1                
#         PDG         Width
DECAY   2000006  3.87280726E+00   # TP2   decays
#          BR          NDA       ID1       ID2       ID3       ID4
      2.29515001E-01    2      1000024         5                       # TP2    -->  W1SS+  BT                 
      3.38699222E-01    2      1000037         5                       # TP2    -->  W2SS+  BT                 
      2.44613379E-01    2           23   1000006                       # TP2    -->  Z0     TP1                
      5.08553758E-02    2           25   1000006                       # TP2    -->  HL0    TP1                
      1.09034320E-02    2      1000022         6                       # TP2    -->  Z1SS   TP                 
      1.14419229E-01    2      1000023         6                       # TP2    -->  Z2SS   TP                 
      1.09943310E-02    2      1000025         6                       # TP2    -->  Z3SS   TP                 
#         PDG         Width
DECAY   1000011  1.90357769E+00   # EL-   decays
#          BR          NDA       ID1       ID2       ID3       ID4
      3.02905645E-02    2      1000022        11                       # EL-    -->  Z1SS   E-                 
      4.06790823E-01    2      1000023        11                       # EL-    -->  Z2SS   E-                 
      5.62918603E-01    2     -1000024        12                       # EL-    -->  W1SS-  NUE                
      4.92162084E-12    3      1000015        11       -15             # EL-    -->  TAU1-  E-     TAU+        
      6.92466744E-12    3     -1000015        11        15             # EL-    -->  TAU1+  E-     TAU-        
#         PDG         Width
DECAY   1000013  1.90357733E+00   # MUL-  decays
#          BR          NDA       ID1       ID2       ID3       ID4
      3.02905589E-02    2      1000022        13                       # MUL-   -->  Z1SS   MU-                
      4.06790674E-01    2      1000023        13                       # MUL-   -->  Z2SS   MU-                
      5.62918782E-01    2     -1000024        14                       # MUL-   -->  W1SS-  NUM                
      4.92164035E-12    3      1000015        13       -15             # MUL-   -->  TAU1-  MU-    TAU+        
      6.92469910E-12    3     -1000015        13        15             # MUL-   -->  TAU1+  MU-    TAU-        
#         PDG         Width
DECAY   1000015  9.50232148E-01   # TAU1- decays
#          BR          NDA       ID1       ID2       ID3       ID4
      8.34301889E-01    2      1000022        15                       # TAU1-  -->  Z1SS   TAU-               
      1.15752041E-01    2      1000023        15                       # TAU1-  -->  Z2SS   TAU-               
      4.99460585E-02    2     -1000024        16                       # TAU1-  -->  W1SS-  NUT                
#         PDG         Width
DECAY   1000012  1.92116177E+00   # NUEL  decays
#          BR          NDA       ID1       ID2       ID3       ID4
      2.43809700E-01    2      1000022        12                       # NUEL   -->  Z1SS   NUE                
      1.54250219E-01    2      1000023        12                       # NUEL   -->  Z2SS   NUE                
      6.01940095E-01    2      1000024        11                       # NUEL   -->  W1SS+  E-                 
      1.02791658E-14    3      1000015        12       -15             # NUEL   -->  TAU1-  NUE    TAU+        
      1.93004199E-14    3     -1000015        12        15             # NUEL   -->  TAU1+  NUE    TAU-        
      1.67253703E-14    3     -1000015        11        16             # NUEL   -->  TAU1+  E-     NUT         
#         PDG         Width
DECAY   1000014  1.92116082E+00   # NUML  decays
#          BR          NDA       ID1       ID2       ID3       ID4
      2.43809819E-01    2      1000022        14                       # NUML   -->  Z1SS   NUM                
      1.54250294E-01    2      1000023        14                       # NUML   -->  Z2SS   NUM                
      6.01939917E-01    2      1000024        13                       # NUML   -->  W1SS+  MU-                
      1.02791709E-14    3      1000015        14       -15             # NUML   -->  TAU1-  NUM    TAU+        
      1.93004301E-14    3     -1000015        14        15             # NUML   -->  TAU1+  NUM    TAU-        
      1.67256379E-14    3     -1000015        13        16             # NUML   -->  TAU1+  MU-    NUT         
#         PDG         Width
DECAY   1000016  1.91806257E+00   # NUTL  decays
#          BR          NDA       ID1       ID2       ID3       ID4
      2.43906364E-01    2      1000022        16                       # NUTL   -->  Z1SS   NUT                
      1.54212341E-01    2      1000023        16                       # NUTL   -->  Z2SS   NUT                
      6.01881325E-01    2      1000024        15                       # NUTL   -->  W1SS+  TAU-               
      7.66477827E-15    3     -1000015        16        15             # NUTL   -->  TAU1+  NUT    TAU-        
      1.04436616E-11    3      1000015        16       -15             # NUTL   -->  TAU1-  NUT    TAU+        
      1.04293137E-11    3      1000015        12       -11             # NUTL   -->  TAU1-  NUE    E+          
      1.04293137E-11    3      1000015        14       -13             # NUTL   -->  TAU1-  NUM    MU+         
      3.12879410E-11    3      1000015         2        -1             # NUTL   -->  TAU1-  UP     DB          
      3.12879410E-11    3      1000015         4        -3             # NUTL   -->  TAU1-  CH     SB          
#         PDG         Width
DECAY   2000011  9.05182660E-01   # ER-   decays
#          BR          NDA       ID1       ID2       ID3       ID4
      9.07964230E-01    2      1000022        11                       # ER-    -->  Z1SS   E-                 
      9.20357481E-02    2      1000023        11                       # ER-    -->  Z2SS   E-                 
      1.19170786E-27    3      1000015        12       -16             # ER-    -->  TAU1-  NUE    ANUT        
#         PDG         Width
DECAY   2000013  9.05182362E-01   # MUR-  decays
#          BR          NDA       ID1       ID2       ID3       ID4
      9.07964289E-01    2      1000022        13                       # MUR-   -->  Z1SS   MU-                
      9.20357406E-02    2      1000023        13                       # MUR-   -->  Z2SS   MU-                
      5.09698713E-23    3      1000015        14       -16             # MUR-   -->  TAU1-  NUM    ANUT        
#         PDG         Width
DECAY   2000015  1.85303926E+00   # TAU2- decays
#          BR          NDA       ID1       ID2       ID3       ID4
      4.64484319E-02    2      1000022        15                       # TAU2-  -->  Z1SS   TAU-               
      4.02437806E-01    2      1000023        15                       # TAU2-  -->  Z2SS   TAU-               
      5.51113784E-01    2     -1000024        16                       # TAU2-  -->  W1SS-  NUT                
#         PDG         Width
DECAY   1000023  6.13229361E-07   # Z2SS  decays
#          BR          NDA       ID1       ID2       ID3       ID4
      1.13074435E-03    2      1000022        22                       # Z2SS   -->  Z1SS   GM                 
      3.45746661E-03    3     -1000024         2        -1             # Z2SS   -->  W1SS-  UP     DB          
      1.15248875E-03    3     -1000024        12       -11             # Z2SS   -->  W1SS-  NUE    E+          
      1.15248875E-03    3     -1000024        14       -13             # Z2SS   -->  W1SS-  NUM    MU+         
      3.45746614E-03    3      1000024         1        -2             # Z2SS   -->  W1SS+  DN     UB          
      1.15248875E-03    3      1000024        11       -12             # Z2SS   -->  W1SS+  E-     ANUE        
      1.15248875E-03    3      1000024        13       -14             # Z2SS   -->  W1SS+  MU-    ANUM        
      3.45746614E-03    3     -1000024         4        -3             # Z2SS   -->  W1SS-  CH     SB          
      1.15248875E-03    3     -1000024        16       -15             # Z2SS   -->  W1SS-  NUT    TAU+        
      3.45746614E-03    3      1000024         3        -4             # Z2SS   -->  W1SS+  ST     CB          
      1.15248875E-03    3      1000024        15       -16             # Z2SS   -->  W1SS+  TAU-   ANUT        
      1.02576427E-01    3      1000022         2        -2             # Z2SS   -->  Z1SS   UP     UB          
      2.13705212E-01    3      1000022         1        -1             # Z2SS   -->  Z1SS   DN     DB          
      2.13705167E-01    3      1000022         3        -3             # Z2SS   -->  Z1SS   ST     SB          
      1.02576301E-01    3      1000022         4        -4             # Z2SS   -->  Z1SS   CH     CB          
      2.14975089E-01    3      1000022         5        -5             # Z2SS   -->  Z1SS   BT     BB          
      2.74074338E-02    3      1000022        11       -11             # Z2SS   -->  Z1SS   E-     E+          
      2.74074022E-02    3      1000022        13       -13             # Z2SS   -->  Z1SS   MU-    MU+         
      3.06052230E-02    3      1000022        15       -15             # Z2SS   -->  Z1SS   TAU-   TAU+        
      1.49891851E-02    3      1000022        12       -12             # Z2SS   -->  Z1SS   NUE    ANUE        
      1.49891851E-02    3      1000022        14       -14             # Z2SS   -->  Z1SS   NUM    ANUM        
      1.51877729E-02    3      1000022        16       -16             # Z2SS   -->  Z1SS   NUT    ANUT        
#         PDG         Width
DECAY   1000025  1.34121311E+00   # Z3SS  decays
#          BR          NDA       ID1       ID2       ID3       ID4
      4.61499496E-07    2      1000022        22                       # Z3SS   -->  Z1SS   GM                 
      1.26757925E-07    2      1000023        22                       # Z3SS   -->  Z2SS   GM                 
      3.16357583E-01    2      1000024       -24                       # Z3SS   -->  W1SS+  W-                 
      3.16357583E-01    2     -1000024        24                       # Z3SS   -->  W1SS-  W+                 
      1.92258358E-01    2      1000022        23                       # Z3SS   -->  Z1SS   Z0                 
      1.43563077E-01    2      1000023        23                       # Z3SS   -->  Z2SS   Z0                 
      4.24073470E-08    3      1000022         2        -2             # Z3SS   -->  Z1SS   UP     UB          
      7.34875840E-08    3      1000022         1        -1             # Z3SS   -->  Z1SS   DN     DB          
      7.34875272E-08    3      1000022         3        -3             # Z3SS   -->  Z1SS   ST     SB          
      4.24059081E-08    3      1000022         4        -4             # Z3SS   -->  Z1SS   CH     CB          
      3.73226726E-07    3      1000022         5        -5             # Z3SS   -->  Z1SS   BT     BB          
      1.59899560E-08    3      1000022        15       -15             # Z3SS   -->  Z1SS   TAU-   TAU+        
      1.14075654E-07    3      1000023         2        -2             # Z3SS   -->  Z2SS   UP     UB          
      1.24468230E-07    3      1000023         1        -1             # Z3SS   -->  Z2SS   DN     DB          
      1.24468130E-07    3      1000023         3        -3             # Z3SS   -->  Z2SS   ST     SB          
      1.14071838E-07    3      1000023         4        -4             # Z3SS   -->  Z2SS   CH     CB          
      4.42863922E-07    3      1000023         5        -5             # Z3SS   -->  Z2SS   BT     BB          
      4.39542447E-09    3      1000023        15       -15             # Z3SS   -->  Z2SS   TAU-   TAU+        
      1.99006330E-02    2      1000022        25                       # Z3SS   -->  Z1SS   HL0                
      7.72595918E-03    2      1000023        25                       # Z3SS   -->  Z2SS   HL0                
      3.95245333E-05    2      1000011       -11                       # Z3SS   -->  EL-    E+                 
      3.95245333E-05    2     -1000011        11                       # Z3SS   -->  EL+    E-                 
      3.95239913E-05    2      1000013       -13                       # Z3SS   -->  MUL-   MU+                
      3.95239913E-05    2     -1000013        13                       # Z3SS   -->  MUL+   MU-                
      1.49451502E-04    2      2000011       -11                       # Z3SS   -->  ER-    E+                 
      1.49451502E-04    2     -2000011        11                       # Z3SS   -->  ER+    E-                 
      1.49450701E-04    2      2000013       -13                       # Z3SS   -->  MUR-   MU+                
      1.49450701E-04    2     -2000013        13                       # Z3SS   -->  MUR+   MU-                
      1.53975066E-04    2      1000015       -15                       # Z3SS   -->  TAU1-  TAU+               
      1.53975066E-04    2     -1000015        15                       # Z3SS   -->  TAU1+  TAU-               
      9.12356045E-05    2      2000015       -15                       # Z3SS   -->  TAU2-  TAU+               
      9.12356045E-05    2     -2000015        15                       # Z3SS   -->  TAU2+  TAU-               
      4.29620646E-04    2      1000012       -12                       # Z3SS   -->  NUEL   ANUE               
      4.29620646E-04    2     -1000012        12                       # Z3SS   -->  ANUEL  NUE                
      4.29620646E-04    2      1000014       -14                       # Z3SS   -->  NUML   ANUM               
      4.29620646E-04    2     -1000014        14                       # Z3SS   -->  ANUML  NUM                
      4.34953254E-04    2      1000016       -16                       # Z3SS   -->  NUTL   ANUT               
      4.34953254E-04    2     -1000016        16                       # Z3SS   -->  ANUTL  NUT                
#         PDG         Width
DECAY   1000035  1.79016745E+00   # Z4SS  decays
#          BR          NDA       ID1       ID2       ID3       ID4
      4.46882837E-07    2      1000022        22                       # Z4SS   -->  Z1SS   GM                 
      6.88702528E-07    2      1000023        22                       # Z4SS   -->  Z2SS   GM                 
      2.61733106E-08    2      1000025        22                       # Z4SS   -->  Z3SS   GM                 
      3.31621975E-01    2      1000024       -24                       # Z4SS   -->  W1SS+  W-                 
      3.31621975E-01    2     -1000024        24                       # Z4SS   -->  W1SS-  W+                 
      1.08807996E-09    3     -1000037         2        -1             # Z4SS   -->  W2SS-  UP     DB          
      3.62693320E-10    3     -1000037        12       -11             # Z4SS   -->  W2SS-  NUE    E+          
      3.62693320E-10    3     -1000037        14       -13             # Z4SS   -->  W2SS-  NUM    MU+         
      1.08807996E-09    3      1000037         1        -2             # Z4SS   -->  W2SS+  DN     UB          
      3.62693320E-10    3      1000037        11       -12             # Z4SS   -->  W2SS+  E-     ANUE        
      3.62693320E-10    3      1000037        13       -14             # Z4SS   -->  W2SS+  MU-    ANUM        
      1.08807996E-09    3     -1000037         4        -3             # Z4SS   -->  W2SS-  CH     SB          
      3.62693320E-10    3     -1000037        16       -15             # Z4SS   -->  W2SS-  NUT    TAU+        
      1.08807996E-09    3      1000037         3        -4             # Z4SS   -->  W2SS+  ST     CB          
      3.62693320E-10    3      1000037        15       -16             # Z4SS   -->  W2SS+  TAU-   ANUT        
      2.16614325E-02    2      1000022        23                       # Z4SS   -->  Z1SS   Z0                 
      1.03341509E-02    2      1000023        23                       # Z4SS   -->  Z2SS   Z0                 
      8.15983071E-07    3      1000022         2        -2             # Z4SS   -->  Z1SS   UP     UB          
      2.95239920E-06    3      1000022         1        -1             # Z4SS   -->  Z1SS   DN     DB          
      2.95239647E-06    3      1000022         3        -3             # Z4SS   -->  Z1SS   ST     SB          
      8.15953854E-07    3      1000022         4        -4             # Z4SS   -->  Z1SS   CH     CB          
      5.55226461E-06    3      1000022         5        -5             # Z4SS   -->  Z1SS   BT     BB          
      1.40188128E-08    3      1000022        15       -15             # Z4SS   -->  Z1SS   TAU-   TAU+        
      8.43852467E-06    3      1000023         2        -2             # Z4SS   -->  Z2SS   UP     UB          
      7.77317200E-06    3      1000023         1        -1             # Z4SS   -->  Z2SS   DN     DB          
      7.77316473E-06    3      1000023         3        -3             # Z4SS   -->  Z2SS   ST     SB          
      8.43822818E-06    3      1000023         4        -4             # Z4SS   -->  Z2SS   CH     CB          
      1.48372210E-05    3      1000023         5        -5             # Z4SS   -->  Z2SS   BT     BB          
      3.56910923E-09    3      1000023        15       -15             # Z4SS   -->  Z2SS   TAU-   TAU+        
      2.67040559E-06    3      1000025         2        -2             # Z4SS   -->  Z3SS   UP     UB          
      3.49612014E-06    3      1000025         1        -1             # Z4SS   -->  Z3SS   DN     DB          
      3.49611992E-06    3      1000025         3        -3             # Z4SS   -->  Z3SS   ST     SB          
      2.67040605E-06    3      1000025         4        -4             # Z4SS   -->  Z3SS   CH     CB          
      2.79259871E-06    3      1000025         5        -5             # Z4SS   -->  Z3SS   BT     BB          
      7.86513226E-07    3      1000025        11       -11             # Z4SS   -->  Z3SS   E-     E+          
      7.86513226E-07    3      1000025        13       -13             # Z4SS   -->  Z3SS   MU-    MU+         
      7.56937482E-07    3      1000025        15       -15             # Z4SS   -->  Z3SS   TAU-   TAU+        
      1.56491410E-06    3      1000025        12       -12             # Z4SS   -->  Z3SS   NUE    ANUE        
      1.56491410E-06    3      1000025        14       -14             # Z4SS   -->  Z3SS   NUM    ANUM        
      1.56491410E-06    3      1000025        16       -16             # Z4SS   -->  Z3SS   NUT    ANUT        
      1.03013344E-01    2      1000022        25                       # Z4SS   -->  Z1SS   HL0                
      8.71749222E-02    2      1000023        25                       # Z4SS   -->  Z2SS   HL0                
      3.72039550E-03    2      1000011       -11                       # Z4SS   -->  EL-    E+                 
      3.72039550E-03    2     -1000011        11                       # Z4SS   -->  EL+    E-                 
      3.72038805E-03    2      1000013       -13                       # Z4SS   -->  MUL-   MU+                
      3.72038805E-03    2     -1000013        13                       # Z4SS   -->  MUL+   MU-                
      2.02896539E-03    2      2000011       -11                       # Z4SS   -->  ER-    E+                 
      2.02896539E-03    2     -2000011        11                       # Z4SS   -->  ER+    E-                 
      2.02896213E-03    2      2000013       -13                       # Z4SS   -->  MUR-   MU+                
      2.02896213E-03    2     -2000013        13                       # Z4SS   -->  MUR+   MU-                
      1.82435964E-03    2      1000015       -15                       # Z4SS   -->  TAU1-  TAU+               
      1.82435964E-03    2     -1000015        15                       # Z4SS   -->  TAU1+  TAU-               
      3.91141186E-03    2      2000015       -15                       # Z4SS   -->  TAU2-  TAU+               
      3.91141186E-03    2     -2000015        15                       # Z4SS   -->  TAU2+  TAU-               
      1.33119756E-02    2      1000012       -12                       # Z4SS   -->  NUEL   ANUE               
      1.33119756E-02    2     -1000012        12                       # Z4SS   -->  ANUEL  NUE                
      1.33119756E-02    2      1000014       -14                       # Z4SS   -->  NUML   ANUM               
      1.33119756E-02    2     -1000014        14                       # Z4SS   -->  ANUML  NUM                
      1.33858183E-02    2      1000016       -16                       # Z4SS   -->  NUTL   ANUT               
      1.33858183E-02    2     -1000016        16                       # Z4SS   -->  ANUTL  NUT                
#         PDG         Width
DECAY   1000024  1.88622325E-05   # W1SS+ decays
#          BR          NDA       ID1       ID2       ID3       ID4
      3.23878974E-01    3      1000022         2        -1             # W1SS+  -->  Z1SS   UP     DB          
      3.23878944E-01    3      1000022         4        -3             # W1SS+  -->  Z1SS   CH     SB          
      1.17383078E-01    3      1000022       -11        12             # W1SS+  -->  Z1SS   E+     NUE         
      1.17383078E-01    3      1000022       -13        14             # W1SS+  -->  Z1SS   MU+    NUM         
      1.17475919E-01    3      1000022       -15        16             # W1SS+  -->  Z1SS   TAU+   NUT         
#         PDG         Width
DECAY   1000037  1.80834210E+00   # W2SS+ decays
#          BR          NDA       ID1       ID2       ID3       ID4
      2.71897420E-06    3      1000022         2        -1             # W2SS+  -->  Z1SS   UP     DB          
      2.71897306E-06    3      1000022         4        -3             # W2SS+  -->  Z1SS   CH     SB          
      1.93984079E-10    3      1000022       -15        16             # W2SS+  -->  Z1SS   TAU+   NUT         
      9.78110172E-03    2      1000022        24                       # W2SS+  -->  Z1SS   W+                 
      7.27194583E-06    3      1000023         2        -1             # W2SS+  -->  Z2SS   UP     DB          
      7.27185670E-06    3      1000023         4        -3             # W2SS+  -->  Z2SS   CH     SB          
      2.60299302E-08    3      1000023       -15        16             # W2SS+  -->  Z2SS   TAU+   NUT         
      4.03889447E-01    2      1000023        24                       # W2SS+  -->  Z2SS   W+                 
      4.39851419E-06    3      1000025         2        -1             # W2SS+  -->  Z3SS   UP     DB          
      4.39851465E-06    3      1000025         4        -3             # W2SS+  -->  Z3SS   CH     SB          
      1.46255707E-06    3      1000025       -11        12             # W2SS+  -->  Z3SS   E+     NUE         
      1.46255707E-06    3      1000025       -13        14             # W2SS+  -->  Z3SS   MU+    NUM         
      1.46255786E-06    3      1000025       -15        16             # W2SS+  -->  Z3SS   TAU+   NUT         
      5.01206517E-02    2      1000006        -5                       # W2SS+  -->  TP1    BB                 
      9.94911138E-03    2      1000012       -11                       # W2SS+  -->  NUEL   E+                 
      9.94909927E-03    2      1000014       -13                       # W2SS+  -->  NUML   MU+                
      1.01092560E-02    2      1000016       -15                       # W2SS+  -->  NUTL   TAU+               
      1.66400950E-02    2     -1000011        12                       # W2SS+  -->  EL+    NUE                
      1.66400857E-02    2     -1000013        14                       # W2SS+  -->  MUL+   NUM                
      3.40993138E-04    2     -1000015        16                       # W2SS+  -->  TAU1+  NUT                
      1.63248386E-02    2     -2000015        16                       # W2SS+  -->  TAU2+  NUT                
      2.89796591E-01    2      1000024        23                       # W2SS+  -->  W1SS+  Z0                 
      8.76230024E-06    3      1000024         1        -1             # W2SS+  -->  W1SS+  DN     DB          
      8.76199283E-06    3      1000024         3        -3             # W2SS+  -->  W1SS+  ST     SB          
      1.64596422E-05    3      1000024         2        -2             # W2SS+  -->  W1SS+  UP     UB          
      1.64596295E-05    3      1000024         4        -4             # W2SS+  -->  W1SS+  CH     CB          
      1.66375056E-01    2      1000024        25                       # W2SS+  -->  W1SS+  HL0                
#         PDG         Width
DECAY        25  3.79415904E-03   # HL0   decays
#          BR          NDA       ID1       ID2       ID3       ID4
      5.11681097E-09    2           11       -11                       # HL0    -->  E-     E+                 
      2.16039261E-04    2           13       -13                       # HL0    -->  MU-    MU+                
      6.17371164E-02    2           15       -15                       # HL0    -->  TAU-   TAU+               
      6.44514694E-06    2            1        -1                       # HL0    -->  DN     DB                 
      2.60415999E-03    2            3        -3                       # HL0    -->  ST     SB                 
      8.81729364E-01    2            5        -5                       # HL0    -->  BT     BB                 
      1.60376783E-06    2            2        -2                       # HL0    -->  UP     UB                 
      3.12939398E-02    2            4        -4                       # HL0    -->  CH     CB                 
      9.53170122E-04    2           22        22                       # HL0    -->  GM     GM                 
      2.12079510E-02    2           21        21                       # HL0    -->  GL     GL                 
      1.38988335E-05    3           24        11       -12             # HL0    -->  W+     E-     ANUE        
      1.38988335E-05    3           24        13       -14             # HL0    -->  W+     MU-    ANUM        
      1.38988335E-05    3           24        15       -16             # HL0    -->  W+     TAU-   ANUT        
      4.16964976E-05    3           24        -2         1             # HL0    -->  W+     UB     DN          
      4.16964976E-05    3           24        -4         3             # HL0    -->  W+     CB     ST          
      1.38988335E-05    3          -24       -11        12             # HL0    -->  W-     E+     NUE         
      1.38988335E-05    3          -24       -13        14             # HL0    -->  W-     MU+    NUM         
      1.38988335E-05    3          -24       -15        16             # HL0    -->  W-     TAU+   NUT         
      4.16964976E-05    3          -24         2        -1             # HL0    -->  W-     UP     DB          
      4.16964976E-05    3          -24         4        -3             # HL0    -->  W-     CH     SB          
#         PDG         Width
DECAY        35  8.63112807E-01   # HH0   decays
#          BR          NDA       ID1       ID2       ID3       ID4
      6.03721795E-10    2           11       -11                       # HH0    -->  E-     E+                 
      2.54902097E-05    2           13       -13                       # HH0    -->  MU-    MU+                
      7.29966396E-03    2           15       -15                       # HH0    -->  TAU-   TAU+               
      7.46812304E-07    2            1        -1                       # HH0    -->  DN     DB                 
      3.01749940E-04    2            3        -3                       # HH0    -->  ST     SB                 
      4.84711565E-02    2            5        -5                       # HH0    -->  BT     BB                 
      3.79340559E-09    2            2        -2                       # HH0    -->  UP     UB                 
      6.09491071E-05    2            4        -4                       # HH0    -->  CH     CB                 
      3.62531058E-02    2            6        -6                       # HH0    -->  TP     TB                 
      1.39133963E-05    2           22        22                       # HH0    -->  GM     GM                 
      1.84560614E-03    2           21        21                       # HH0    -->  GL     GL                 
      1.86197888E-02    2           24       -24                       # HH0    -->  W+     W-                 
      8.75787903E-03    2           23        23                       # HH0    -->  Z0     Z0                 
      6.71925172E-02    2      1000022   1000022                       # HH0    -->  Z1SS   Z1SS               
      1.07504703E-01    2      1000022   1000023                       # HH0    -->  Z1SS   Z2SS               
      2.21043900E-01    2      1000022   1000025                       # HH0    -->  Z1SS   Z3SS               
      1.41716818E-03    2      1000022   1000035                       # HH0    -->  Z1SS   Z4SS               
      4.05087620E-02    2      1000023   1000023                       # HH0    -->  Z2SS   Z2SS               
      1.22561052E-01    2      1000023   1000025                       # HH0    -->  Z2SS   Z3SS               
      2.59394139E-01    2      1000024  -1000024                       # HH0    -->  W1SS+  W1SS-              
      5.87276816E-02    2           25        25                       # HH0    -->  HL0    HL0                
#         PDG         Width
DECAY        36  1.30718839E+00   # HA0   decays
#          BR          NDA       ID1       ID2       ID3       ID4
      4.02106709E-10    2           11       -11                       # HA0    -->  E-     E+                 
      1.69776667E-05    2           13       -13                       # HA0    -->  MU-    MU+                
      4.86240536E-03    2           15       -15                       # HA0    -->  TAU-   TAU+               
      4.97513781E-07    2            1        -1                       # HA0    -->  DN     DB                 
      2.01020783E-04    2            3        -3                       # HA0    -->  ST     SB                 
      3.23042385E-02    2            5        -5                       # HA0    -->  BT     BB                 
      1.96528727E-09    2            2        -2                       # HA0    -->  UP     UB                 
      3.16588921E-05    2            4        -4                       # HA0    -->  CH     CB                 
      4.83238591E-06    2           22        22                       # HA0    -->  GM     GM                 
      7.76736299E-04    2           21        21                       # HA0    -->  GL     GL                 
      1.00146972E-01    2      1000022   1000022                       # HA0    -->  Z1SS   Z1SS               
      1.91572219E-01    2      1000022   1000023                       # HA0    -->  Z1SS   Z2SS               
      1.01154046E-02    2      1000022   1000025                       # HA0    -->  Z1SS   Z3SS               
      2.72365417E-02    2      1000022   1000035                       # HA0    -->  Z1SS   Z4SS               
      9.17689875E-02    2      1000023   1000023                       # HA0    -->  Z2SS   Z2SS               
      5.70659759E-04    2      1000023   1000025                       # HA0    -->  Z2SS   Z3SS               
      5.30613601E-01    2      1000024  -1000024                       # HA0    -->  W1SS+  W1SS-              
      9.77729354E-03    2           25        23                       # HA0    -->  HL0    Z0                 
#         PDG         Width
DECAY        37  1.74834144E+00   # H+    decays
#          BR          NDA       ID1       ID2       ID3       ID4
      3.10368842E-10    2           12       -11                       # H+     -->  NUE    E+                 
      1.31043298E-05    2           14       -13                       # H+     -->  NUM    MU+                
      3.75309330E-03    2           16       -15                       # H+     -->  NUT    TAU+               
      3.50865065E-07    2            2        -1                       # H+     -->  UP     DB                 
      1.63349367E-04    2            4        -3                       # H+     -->  CH     SB                 
      6.85745776E-01    2            6        -5                       # H+     -->  TP     BB                 
      1.37772322E-01    2      1000024   1000022                       # H+     -->  W1SS+  Z1SS               
      2.05140635E-02    2      1000024   1000023                       # H+     -->  W1SS+  Z2SS               
      1.42470956E-01    2      1000024   1000025                       # H+     -->  W1SS+  Z3SS               
      8.38028151E-04    2      1000037   1000022                       # H+     -->  W2SS+  Z1SS               
      8.72897077E-03    2           25        24                       # H+     -->  HL0    W+                 
