  65
  401   2168.6101    0.56066E-26
  402   2167.1306    0.56077E-26
  403   2168.6101    0.56066E-26
  404   2167.1311    0.56077E-26
  405   1795.6797    0.58791E-26
  406   1320.4016    0.10184E-25
  407   2168.6101    0.56066E-26
  408   2167.1306    0.56077E-26
  409   2168.6101    0.56066E-26
  410   2167.1311    0.56077E-26
  411   1795.6797    0.58791E-26
  412   1320.4016    0.10184E-25
  413   2170.6628    0.71638E-26
  414   2169.7249    0.68945E-26
  415   2170.6628    0.71638E-26
  416   2169.7253    0.68945E-26
  417   2150.5300    0.71566E-26
  418   1806.0507    0.59332E-26
  419   2170.6628    0.71638E-26
  420   2169.7249    0.68945E-26
  421   2170.6628    0.71638E-26
  422   2169.7253    0.68945E-26
  423   2150.5300    0.71566E-26
  424   1806.0507    0.59332E-26
  425   2105.0386    0.23164E-25
  426   2104.0942    0.23129E-25
  427   2105.0386    0.23164E-25
  428   2104.0942    0.23129E-25
  429   2083.4490    0.57158E-25
  430   2095.5374    0.22902E-25
  431   2105.0386    0.23164E-25
  432   2104.0942    0.23129E-25
  433   2105.0386    0.23164E-25
  434   2104.0942    0.23129E-25
  435   2083.4490    0.57158E-25
  436   2095.5374    0.22902E-25
  437   2100.8953    0.62097E-25
  438      0.0000    0.10000E+31
  439   2100.8953    0.62097E-25
  440      0.0000    0.10000E+31
  441   2096.1501    0.23104E-25
  442      0.0000    0.10000E+31
  443   2100.8953    0.62097E-25
  444      0.0000    0.10000E+31
  445   2100.8953    0.62097E-25
  446      0.0000    0.10000E+31
  447   2096.1501    0.23104E-25
  448      0.0000    0.10000E+31
  449    821.1211    0.24980E-21
  450    106.0002    0.10000E+31
  451    161.8467    0.62432E-19
  452   -182.8186    0.71950E-21
  453    290.8603    0.70426E-24
  454    149.4619    0.81888E-20
  455    284.6334    0.92479E-24
  456    149.4619    0.81888E-20
  457    284.6334    0.92479E-24
  203    114.2301    0.16330E-21
  204   2096.6260    0.20843E-25
  205   2082.8342    0.20982E-25
  206   2098.0713    0.21038E-25
  207   2098.0713    0.21038E-25
  458      0.0000    0.10000E+31
    6    172.5000    0.57395E-24
   12    172.5000    0.57395E-24
   7
   401  0.97539602E-02     0   450     1     0     0     0
   401  0.94012609E-02     0   451     1     0     0     0
   401  0.12448404E-02     0   452     1     0     0     0
   401  0.57662513E-01     0   453     1     0     0     0
   401  0.77111071E+00     0   449     1     0     0     0
   401  0.25232168E-01     0   456     2     0     0     0
   401  0.12559460E+00     0   457     2     0     0     0
   7
   402  0.34518683E-03     0   450     2     0     0     0
   402  0.24915896E-01     0   451     2     0     0     0
   402  0.68380183E-03     0   452     2     0     0     0
   402  0.52158255E-01     0   453     2     0     0     0
   402  0.77043682E+00     0   449     2     0     0     0
   402  0.53767066E-01     0   454     1     0     0     0
   402  0.97692937E-01     0   455     1     0     0     0
   7
   403  0.97539602E-02     0   450     3     0     0     0
   403  0.94012609E-02     0   451     3     0     0     0
   403  0.12448406E-02     0   452     3     0     0     0
   403  0.57662517E-01     0   453     3     0     0     0
   403  0.77111071E+00     0   449     3     0     0     0
   403  0.25232147E-01     0   456     4     0     0     0
   403  0.12559451E+00     0   457     4     0     0     0
   7
   404  0.34518683E-03     0   450     4     0     0     0
   404  0.24915896E-01     0   451     4     0     0     0
   404  0.68380183E-03     0   452     4     0     0     0
   404  0.52158259E-01     0   453     4     0     0     0
   404  0.77043676E+00     0   449     4     0     0     0
   404  0.53767111E-01     0   454     3     0     0     0
   404  0.97693019E-01     0   455     3     0     0     0
   8
   405  0.97596180E-02     0   450     5     0     0     0
   405  0.93213702E-02     0   451     5     0     0     0
   405  0.34828710E-02     0   452     5     0     0     0
   405  0.49589857E-01     0   453     5     0     0     0
   405  0.58115840E+00     0   449     5     0     0     0
   405  0.15874507E+00     0   456     6     0     0     0
   405  0.18242031E+00     0   457     6     0     0     0
   405  0.55224979E-02     0   199   406     0     0     0
   7
   406  0.42671445E+00     0   449     6     0     0     0
   406  0.56711152E-01     0   450     6     0     0     0
   406  0.71949735E-01     0   451     6     0     0     0
   406  0.13764076E+00     0   452     6     0     0     0
   406  0.39049298E-01     0   453     6     0     0     0
   406  0.18666603E+00     0   454     5     0     0     0
   406  0.81268601E-01     0   455     5     0     0     0
   7
   407  0.97539602E-02     0   450     7     0     0     0
   407  0.94012609E-02     0   451     7     0     0     0
   407  0.12448404E-02     0   452     7     0     0     0
   407  0.57662513E-01     0   453     7     0     0     0
   407  0.77111071E+00     0   449     7     0     0     0
   407  0.25232168E-01     0   454     8     0     0     0
   407  0.12559460E+00     0   455     8     0     0     0
   7
   408  0.34518683E-03     0   450     8     0     0     0
   408  0.24915896E-01     0   451     8     0     0     0
   408  0.68380183E-03     0   452     8     0     0     0
   408  0.52158255E-01     0   453     8     0     0     0
   408  0.77043682E+00     0   449     8     0     0     0
   408  0.53767066E-01     0   456     7     0     0     0
   408  0.97692937E-01     0   457     7     0     0     0
   7
   409  0.97539602E-02     0   450     9     0     0     0
   409  0.94012609E-02     0   451     9     0     0     0
   409  0.12448406E-02     0   452     9     0     0     0
   409  0.57662517E-01     0   453     9     0     0     0
   409  0.77111071E+00     0   449     9     0     0     0
   409  0.25232147E-01     0   454    10     0     0     0
   409  0.12559451E+00     0   455    10     0     0     0
   7
   410  0.34518683E-03     0   450    10     0     0     0
   410  0.24915896E-01     0   451    10     0     0     0
   410  0.68380183E-03     0   452    10     0     0     0
   410  0.52158259E-01     0   453    10     0     0     0
   410  0.77043676E+00     0   449    10     0     0     0
   410  0.53767111E-01     0   456     9     0     0     0
   410  0.97693019E-01     0   457     9     0     0     0
   8
   411  0.97596180E-02     0   450    11     0     0     0
   411  0.93213702E-02     0   451    11     0     0     0
   411  0.34828710E-02     0   452    11     0     0     0
   411  0.49589857E-01     0   453    11     0     0     0
   411  0.58115840E+00     0   449    11     0     0     0
   411  0.15874507E+00     0   454    12     0     0     0
   411  0.18242031E+00     0   455    12     0     0     0
   411  0.55224979E-02     0   198   412     0     0     0
   7
   412  0.42671445E+00     0   449    12     0     0     0
   412  0.56711152E-01     0   450    12     0     0     0
   412  0.71949735E-01     0   451    12     0     0     0
   412  0.13764076E+00     0   452    12     0     0     0
   412  0.39049298E-01     0   453    12     0     0     0
   412  0.18666603E+00     0   456    11     0     0     0
   412  0.81268601E-01     0   457    11     0     0     0
   5
   413  0.82219141E-02     0   450     1     0     0     0
   413  0.47476739E-02     0   451     1     0     0     0
   413  0.10652210E-03     0   452     1     0     0     0
   413  0.17471729E-03     0   453     1     0     0     0
   413  0.98674917E+00     0   449     1     0     0     0
   5
   414  0.31637598E-01     0   450     2     0     0     0
   414  0.18268757E-01     0   451     2     0     0     0
   414  0.40988944E-03     0   452     2     0     0     0
   414  0.67228667E-03     0   453     2     0     0     0
   414  0.94901150E+00     0   449     2     0     0     0
   5
   415  0.82219141E-02     0   450     3     0     0     0
   415  0.47476739E-02     0   451     3     0     0     0
   415  0.10652210E-03     0   452     3     0     0     0
   415  0.17471729E-03     0   453     3     0     0     0
   415  0.98674917E+00     0   449     3     0     0     0
   5
   416  0.31637602E-01     0   450     4     0     0     0
   416  0.18268760E-01     0   451     4     0     0     0
   416  0.40988950E-03     0   452     4     0     0     0
   416  0.67228673E-03     0   453     4     0     0     0
   416  0.94901145E+00     0   449     4     0     0     0
  10
   417  0.98358206E-02     0   450     5     0     0     0
   417  0.64213318E-02     0   451     5     0     0     0
   417  0.37173284E-02     0   452     5     0     0     0
   417  0.87868114E-03     0   453     5     0     0     0
   417  0.97131497E+00     0   449     5     0     0     0
   417  0.62470916E-02     0   456     6     0     0     0
   417  0.14117954E-02     0   457     6     0     0     0
   417  0.65369721E-04     0   199   418     0     0     0
   417  0.35315574E-04     0   200   405     0     0     0
   417  0.72253046E-04     0   203   405     0     0     0
   9
   418  0.57064235E+00     0   449     6     0     0     0
   418  0.44936769E-01     0   454     5     0     0     0
   418  0.92340536E-01     0   455     5     0     0     0
   418  0.29540136E-02     0   200   406     0     0     0
   418  0.61769257E-02     0   203   406     0     0     0
   418  0.21134857E-01     0   450     6     0     0     0
   418  0.64084575E-01     0   451     6     0     0     0
   418  0.11095932E+00     0   452     6     0     0     0
   418  0.86770646E-01     0   453     6     0     0     0
   5
   419  0.82219141E-02     0   450     7     0     0     0
   419  0.47476739E-02     0   451     7     0     0     0
   419  0.10652210E-03     0   452     7     0     0     0
   419  0.17471729E-03     0   453     7     0     0     0
   419  0.98674917E+00     0   449     7     0     0     0
   5
   420  0.31637598E-01     0   450     8     0     0     0
   420  0.18268757E-01     0   451     8     0     0     0
   420  0.40988944E-03     0   452     8     0     0     0
   420  0.67228667E-03     0   453     8     0     0     0
   420  0.94901150E+00     0   449     8     0     0     0
   5
   421  0.82219141E-02     0   450     9     0     0     0
   421  0.47476739E-02     0   451     9     0     0     0
   421  0.10652210E-03     0   452     9     0     0     0
   421  0.17471729E-03     0   453     9     0     0     0
   421  0.98674917E+00     0   449     9     0     0     0
   5
   422  0.31637602E-01     0   450    10     0     0     0
   422  0.18268760E-01     0   451    10     0     0     0
   422  0.40988950E-03     0   452    10     0     0     0
   422  0.67228673E-03     0   453    10     0     0     0
   422  0.94901145E+00     0   449    10     0     0     0
  10
   423  0.98358206E-02     0   450    11     0     0     0
   423  0.64213318E-02     0   451    11     0     0     0
   423  0.37173284E-02     0   452    11     0     0     0
   423  0.87868114E-03     0   453    11     0     0     0
   423  0.97131497E+00     0   449    11     0     0     0
   423  0.62470916E-02     0   454    12     0     0     0
   423  0.14117954E-02     0   455    12     0     0     0
   423  0.65369721E-04     0   198   424     0     0     0
   423  0.35315574E-04     0   200   411     0     0     0
   423  0.72253046E-04     0   203   411     0     0     0
   9
   424  0.57064235E+00     0   449    12     0     0     0
   424  0.44936769E-01     0   456    11     0     0     0
   424  0.92340536E-01     0   457    11     0     0     0
   424  0.29540136E-02     0   200   412     0     0     0
   424  0.61769257E-02     0   203   412     0     0     0
   424  0.21134857E-01     0   450    12     0     0     0
   424  0.64084575E-01     0   451    12     0     0     0
   424  0.11095932E+00     0   452    12     0     0     0
   424  0.86770646E-01     0   453    12     0     0     0
   6
   425  0.15210785E-01     0   450   121     0     0     0
   425  0.19188637E+00     0   451   121     0     0     0
   425  0.11620976E-02     0   452   121     0     0     0
   425  0.18799883E+00     0   453   121     0     0     0
   425  0.10113313E+00     0   456   122     0     0     0
   425  0.50260884E+00     0   457   122     0     0     0
   6
   426  0.12812325E+00     0   450   122     0     0     0
   426  0.51933071E-02     0   451   122     0     0     0
   426  0.78864899E-02     0   452   122     0     0     0
   426  0.25323379E+00     0   453   122     0     0     0
   426  0.21518561E+00     0   454   121     0     0     0
   426  0.39037758E+00     0   455   121     0     0     0
   6
   427  0.15210784E-01     0   450   123     0     0     0
   427  0.19188637E+00     0   451   123     0     0     0
   427  0.11620976E-02     0   452   123     0     0     0
   427  0.18799883E+00     0   453   123     0     0     0
   427  0.10113313E+00     0   456   124     0     0     0
   427  0.50260884E+00     0   457   124     0     0     0
   6
   428  0.12812325E+00     0   450   124     0     0     0
   428  0.51933071E-02     0   451   124     0     0     0
   428  0.78864899E-02     0   452   124     0     0     0
   428  0.25323379E+00     0   453   124     0     0     0
   428  0.21518560E+00     0   454   123     0     0     0
   428  0.39037758E+00     0   455   123     0     0     0
   6
   429  0.57930833E+00     0   450   125     0     0     0
   429  0.33848122E+00     0   451   125     0     0     0
   429  0.19676032E-01     0   452   125     0     0     0
   429  0.11064930E-01     0   453   125     0     0     0
   429  0.49623121E-01     0   456   126     0     0     0
   429  0.18463633E-02     0   457   126     0     0     0
   6
   430  0.12634598E+00     0   450   126     0     0     0
   430  0.51209815E-02     0   451   126     0     0     0
   430  0.77764471E-02     0   452   126     0     0     0
   430  0.24965179E+00     0   453   126     0     0     0
   430  0.22398055E+00     0   454   125     0     0     0
   430  0.38712430E+00     0   455   125     0     0     0
   6
   431  0.15210785E-01     0   450   127     0     0     0
   431  0.19188637E+00     0   451   127     0     0     0
   431  0.11620976E-02     0   452   127     0     0     0
   431  0.18799883E+00     0   453   127     0     0     0
   431  0.10113313E+00     0   454   128     0     0     0
   431  0.50260884E+00     0   455   128     0     0     0
   6
   432  0.12812325E+00     0   450   128     0     0     0
   432  0.51933071E-02     0   451   128     0     0     0
   432  0.78864899E-02     0   452   128     0     0     0
   432  0.25323379E+00     0   453   128     0     0     0
   432  0.21518561E+00     0   456   127     0     0     0
   432  0.39037758E+00     0   457   127     0     0     0
   6
   433  0.15210784E-01     0   450   129     0     0     0
   433  0.19188637E+00     0   451   129     0     0     0
   433  0.11620976E-02     0   452   129     0     0     0
   433  0.18799883E+00     0   453   129     0     0     0
   433  0.10113313E+00     0   454   130     0     0     0
   433  0.50260884E+00     0   455   130     0     0     0
   6
   434  0.12812325E+00     0   450   130     0     0     0
   434  0.51933071E-02     0   451   130     0     0     0
   434  0.78864899E-02     0   452   130     0     0     0
   434  0.25323379E+00     0   453   130     0     0     0
   434  0.21518560E+00     0   456   129     0     0     0
   434  0.39037758E+00     0   457   129     0     0     0
   6
   435  0.57930833E+00     0   450   131     0     0     0
   435  0.33848122E+00     0   451   131     0     0     0
   435  0.19676032E-01     0   452   131     0     0     0
   435  0.11064930E-01     0   453   131     0     0     0
   435  0.49623121E-01     0   454   132     0     0     0
   435  0.18463633E-02     0   455   132     0     0     0
   6
   436  0.12634598E+00     0   450   132     0     0     0
   436  0.51209815E-02     0   451   132     0     0     0
   436  0.77764471E-02     0   452   132     0     0     0
   436  0.24965179E+00     0   453   132     0     0     0
   436  0.22398055E+00     0   456   131     0     0     0
   436  0.38712430E+00     0   457   131     0     0     0
   4
   437  0.62059993E+00     0   450   121     0     0     0
   437  0.35820526E+00     0   451   121     0     0     0
   437  0.80352556E-02     0   452   121     0     0     0
   437  0.13159579E-01     0   453   121     0     0     0
   0
   4
   439  0.62059993E+00     0   450   123     0     0     0
   439  0.35820526E+00     0   451   123     0     0     0
   439  0.80352556E-02     0   452   123     0     0     0
   439  0.13159579E-01     0   453   123     0     0     0
   0
   6
   441  0.16506508E-01     0   450   125     0     0     0
   441  0.19224465E+00     0   451   125     0     0     0
   441  0.92352387E-02     0   452   125     0     0     0
   441  0.18929791E+00     0   453   125     0     0     0
   441  0.92162527E-01     0   456   126     0     0     0
   441  0.50055319E+00     0   457   126     0     0     0
   0
   4
   443  0.62059993E+00     0   450   127     0     0     0
   443  0.35820526E+00     0   451   127     0     0     0
   443  0.80352556E-02     0   452   127     0     0     0
   443  0.13159579E-01     0   453   127     0     0     0
   0
   4
   445  0.62059993E+00     0   450   129     0     0     0
   445  0.35820526E+00     0   451   129     0     0     0
   445  0.80352556E-02     0   452   129     0     0     0
   445  0.13159579E-01     0   453   129     0     0     0
   0
   6
   447  0.16506508E-01     0   450   131     0     0     0
   447  0.19224465E+00     0   451   131     0     0     0
   447  0.92352387E-02     0   452   131     0     0     0
   447  0.18929791E+00     0   453   131     0     0     0
   447  0.92162527E-01     0   454   132     0     0     0
   447  0.50055319E+00     0   455   132     0     0     0
   0
  40
   449  0.95861275E-02     0   454     1     8     0     0
   449  0.95861275E-02     0   456     2     7     0     0
   449  0.95861210E-02     0   454     3    10     0     0
   449  0.95861210E-02     0   456     4     9     0     0
   449  0.13209879E+00     0   454     5    12     0     0
   449  0.13209879E+00     0   456     6    11     0     0
   449  0.16900428E-01     0   455     1     8     0     0
   449  0.16900428E-01     0   457     2     7     0     0
   449  0.16900418E-01     0   455     3    10     0     0
   449  0.16900418E-01     0   457     4     9     0     0
   449  0.96185006E-01     0   455     5    12     0     0
   449  0.96185006E-01     0   457     6    11     0     0
   449  0.43443320E-02     0   450    13     0     0     0
   449  0.68076453E-02     0   450     2     8     0     0
   449  0.42296182E-02     0   450     1     7     0     0
   449  0.42296182E-02     0   450     3     9     0     0
   449  0.68076393E-02     0   450     4    10     0     0
   449  0.88098524E-02     0   450     5    11     0     0
   449  0.29473338E-01     0   450     6    12     0     0
   449  0.10786182E-01     0   451    13     0     0     0
   449  0.95227640E-02     0   451     2     8     0     0
   449  0.31326744E-02     0   451     1     7     0     0
   449  0.31326744E-02     0   451     3     9     0     0
   449  0.95227547E-02     0   451     4    10     0     0
   449  0.71839173E-02     0   451     5    11     0     0
   449  0.94262965E-01     0   451     6    12     0     0
   449  0.23131762E-01     0   452    13     0     0     0
   449  0.12343351E-03     0   452     2     8     0     0
   449  0.16090555E-03     0   452     1     7     0     0
   449  0.16090555E-03     0   452     3     9     0     0
   449  0.12343340E-03     0   452     4    10     0     0
   449  0.27607593E-02     0   452     5    11     0     0
   449  0.10307767E+00     0   452     6    12     0     0
   449  0.61079827E-02     0   453    13     0     0     0
   449  0.77548511E-02     0   453     2     8     0     0
   449  0.84753698E-02     0   453     1     7     0     0
   449  0.84753698E-02     0   453     3     9     0     0
   449  0.77548437E-02     0   453     4    10     0     0
   449  0.19722655E-01     0   453     5    11     0     0
   449  0.47410294E-01     0   453     6    12     0     0
   0
  22
   451  0.55029411E-02     0   450    59     0     0     0
   451  0.11276159E-01     0   456     2     7     0     0
   451  0.37587199E-02     0   456   122   127     0     0
   451  0.37587199E-02     0   456   124   129     0     0
   451  0.11276160E-01     0   454     1     8     0     0
   451  0.37587199E-02     0   454   121   128     0     0
   451  0.37587199E-02     0   454   123   130     0     0
   451  0.11276160E-01     0   456     4     9     0     0
   451  0.37587199E-02     0   456   126   131     0     0
   451  0.11276160E-01     0   454     3    10     0     0
   451  0.37587199E-02     0   454   125   132     0     0
   451  0.11057809E+00     0   450     2     8     0     0
   451  0.14273386E+00     0   450     1     7     0     0
   451  0.14273386E+00     0   450     3     9     0     0
   451  0.11057809E+00     0   450     4    10     0     0
   451  0.13343404E+00     0   450     5    11     0     0
   451  0.31618036E-01     0   450   121   127     0     0
   451  0.31618036E-01     0   450   123   129     0     0
   451  0.31396139E-01     0   450   125   131     0     0
   451  0.64050384E-01     0   450   122   128     0     0
   451  0.64050384E-01     0   450   124   130     0     0
   451  0.64049132E-01     0   450   126   132     0     0
  33
   452  0.80320038E-04     0   450    59     0     0     0
   452  0.12697817E-01     0   456     2     7     0     0
   452  0.42326055E-02     0   456   122   127     0     0
   452  0.42326055E-02     0   456   124   129     0     0
   452  0.12697817E-01     0   454     1     8     0     0
   452  0.42326055E-02     0   454   121   128     0     0
   452  0.42326055E-02     0   454   123   130     0     0
   452  0.12697817E-01     0   456     4     9     0     0
   452  0.42326055E-02     0   456   126   131     0     0
   452  0.12697817E-01     0   454     3    10     0     0
   452  0.42326055E-02     0   454   125   132     0     0
   452  0.10903711E+00     0   450     2     8     0     0
   452  0.14056398E+00     0   450     1     7     0     0
   452  0.14056398E+00     0   450     3     9     0     0
   452  0.10903711E+00     0   450     4    10     0     0
   452  0.13697326E+00     0   450     5    11     0     0
   452  0.31885210E-01     0   450   121   127     0     0
   452  0.31885210E-01     0   450   123   129     0     0
   452  0.31742472E-01     0   450   125   131     0     0
   452  0.63480951E-01     0   450   122   128     0     0
   452  0.63480951E-01     0   450   124   130     0     0
   452  0.63481145E-01     0   450   126   132     0     0
   452  0.20396773E-03     0   451     2     8     0     0
   452  0.26290974E-03     0   451     1     7     0     0
   452  0.26290974E-03     0   451     3     9     0     0
   452  0.20396773E-03     0   451     4    10     0     0
   452  0.13820500E-03     0   451     5    11     0     0
   452  0.59655493E-04     0   451   121   127     0     0
   452  0.59655493E-04     0   451   123   129     0     0
   452  0.54022625E-04     0   451   125   131     0     0
   452  0.11870205E-03     0   451   122   128     0     0
   452  0.11870205E-03     0   451   124   130     0     0
   452  0.11870214E-03     0   451   126   132     0     0
   7
   453  0.41854370E+00     0   454   199     0     0     0
   453  0.41854370E+00     0   456   198     0     0     0
   453  0.36072368E-04     0   450   200     0     0     0
   453  0.10699186E-01     0   451   200     0     0     0
   453  0.76080628E-01     0   452   200     0     0     0
   453  0.23083426E-02     0   450   203     0     0     0
   453  0.73788404E-01     0   451   203     0     0     0
   5
   454  0.33335143E+00     0   450     2     7     0     0
   454  0.33335143E+00     0   450     4     9     0     0
   454  0.11109762E+00     0   450   127   122     0     0
   454  0.11109762E+00     0   450   129   124     0     0
   454  0.11110187E+00     0   450   131   126     0     0
   5
   455  0.44371471E-01     0   450   198     0     0     0
   455  0.36713088E+00     0   451   198     0     0     0
   455  0.15262298E+00     0   452   198     0     0     0
   455  0.32672063E+00     0   454   200     0     0     0
   455  0.10915406E+00     0   454   203     0     0     0
   5
   456  0.33335143E+00     0   450     8     1     0     0
   456  0.33335143E+00     0   450    10     3     0     0
   456  0.11109762E+00     0   450   121   128     0     0
   456  0.11109762E+00     0   450   123   130     0     0
   456  0.11110187E+00     0   450   125   132     0     0
   5
   457  0.44371471E-01     0   450   199     0     0     0
   457  0.36713088E+00     0   451   199     0     0     0
   457  0.15262298E+00     0   452   199     0     0     0
   457  0.32672063E+00     0   456   200     0     0     0
   457  0.10915406E+00     0   456   203     0     0     0
  28
   203  0.20530229E-03     0   123   129     0     0     0
   203  0.58716666E-01     0   125   131     0     0     0
   203  0.24661445E-02     0     3     9     0     0     0
   203  0.80922186E+00     0     5    11     0     0     0
   203  0.36448538E-01     0     4    10     0     0     0
   203  0.18541646E-02     0    59    59     0     0     0
   203  0.38836800E-01     0    13    13     0     0     0
   203  0.27112239E-02     0   198   121   128     0     0
   203  0.27112239E-02     0   198   123   130     0     0
   203  0.27112239E-02     0   198   125   132     0     0
   203  0.81336712E-02     0   198     8     1     0     0
   203  0.81336712E-02     0   198    10     3     0     0
   203  0.27112239E-02     0   199   127   122     0     0
   203  0.27112239E-02     0   199   129   124     0     0
   203  0.27112239E-02     0   199   131   126     0     0
   203  0.81336712E-02     0   199     2     7     0     0
   203  0.81336712E-02     0   199     4     9     0     0
   203  0.23584600E-03     0   200   122   128     0     0
   203  0.23584600E-03     0   200   124   130     0     0
   203  0.23584600E-03     0   200   126   132     0     0
   203  0.11869893E-03     0   200   121   127     0     0
   203  0.11869893E-03     0   200   123   129     0     0
   203  0.11869893E-03     0   200   125   131     0     0
   203  0.40665246E-03     0   200     2     8     0     0
   203  0.40665246E-03     0   200     4    10     0     0
   203  0.52386854E-03     0   200     1     7     0     0
   203  0.52386854E-03     0   200     3     9     0     0
   203  0.52386854E-03     0   200     5    11     0     0
  22
   204  0.47632373E-04     0   123   129     0     0     0
   204  0.13642583E-01     0   125   131     0     0     0
   204  0.55523479E-03     0     3     9     0     0     0
   204  0.68275996E-01     0     5    11     0     0     0
   204  0.29425215E-01     0     6    12     0     0     0
   204  0.21585009E-04     0   198   199     0     0     0
   204  0.11051465E-04     0   200   200     0     0     0
   204  0.45401182E-01     0   450   450     0     0     0
   204  0.30097788E-01     0   450   451     0     0     0
   204  0.46403889E-01     0   450   452     0     0     0
   204  0.17127311E-01     0   450   453     0     0     0
   204  0.16550648E-02     0   451   451     0     0     0
   204  0.22972340E-03     0   451   452     0     0     0
   204  0.33778530E-01     0   451   453     0     0     0
   204  0.76915221E-02     0   452   452     0     0     0
   204  0.14337119E+00     0   452   453     0     0     0
   204  0.24551917E-01     0   453   453     0     0     0
   204  0.13823840E+00     0   454   456     0     0     0
   204  0.36548924E-01     0   455   457     0     0     0
   204  0.18142207E+00     0   454   457     0     0     0
   204  0.18142207E+00     0   456   455     0     0     0
   204  0.81147315E-04     0   203   203     0     0     0
  20
   205  0.47640755E-04     0   123   129     0     0     0
   205  0.13645023E-01     0   125   131     0     0     0
   205  0.55535894E-03     0     3     9     0     0     0
   205  0.68291903E-01     0     5    11     0     0     0
   205  0.29795166E-01     0     6    12     0     0     0
   205  0.13645847E-04     0    13    13     0     0     0
   205  0.60125358E-01     0   450   450     0     0     0
   205  0.44026271E-01     0   450   451     0     0     0
   205  0.25604274E-01     0   450   452     0     0     0
   205  0.18471530E-01     0   450   453     0     0     0
   205  0.24889281E-02     0   451   451     0     0     0
   205  0.50826937E-01     0   451   453     0     0     0
   205  0.51831924E-02     0   452   452     0     0     0
   205  0.95453642E-01     0   452   453     0     0     0
   205  0.47955457E-01     0   453   453     0     0     0
   205  0.17985429E+00     0   454   456     0     0     0
   205  0.77091210E-01     0   455   457     0     0     0
   205  0.14027436E+00     0   454   457     0     0     0
   205  0.14027436E+00     0   456   455     0     0     0
   205  0.21455451E-04     0   203   200     0     0     0
  13
   206  0.48115038E-04     0   124   129     0     0     0
   206  0.13780865E-01     0   126   131     0     0     0
   206  0.51900861E-03     0     4     9     0     0     0
   206  0.90446353E-01     0     6    11     0     0     0
   206  0.63517660E-01     0   454   450     0     0     0
   206  0.55671938E-01     0   454   451     0     0     0
   206  0.55054247E-01     0   454   452     0     0     0
   206  0.21281245E+00     0   454   453     0     0     0
   206  0.76295450E-01     0   455   450     0     0     0
   206  0.23481303E+00     0   455   451     0     0     0
   206  0.19641607E+00     0   455   452     0     0     0
   206  0.60309691E-03     0   455   453     0     0     0
   206  0.21733060E-04     0   203   198     0     0     0
  13
   207  0.48115038E-04     0   130   123     0     0     0
   207  0.13780865E-01     0   132   125     0     0     0
   207  0.51900861E-03     0    10     3     0     0     0
   207  0.90446353E-01     0    12     5     0     0     0
   207  0.63517660E-01     0   456   450     0     0     0
   207  0.55671938E-01     0   456   451     0     0     0
   207  0.55054247E-01     0   456   452     0     0     0
   207  0.21281245E+00     0   456   453     0     0     0
   207  0.76295450E-01     0   457   450     0     0     0
   207  0.23481303E+00     0   457   451     0     0     0
   207  0.19641607E+00     0   457   452     0     0     0
   207  0.60309691E-03     0   457   453     0     0     0
   207  0.21733060E-04     0   203   199     0     0     0
   0
   5
     6  0.33333334E+00   100     2     7     5     0     0
     6  0.33333334E+00   100     4     9     5     0     0
     6  0.11111111E+00   100   122   127     5     0     0
     6  0.11111111E+00   100   124   129     5     0     0
     6  0.11111111E+00   100   126   131     5     0     0
   5
    12  0.33333334E+00   100     8     1    11     0     0
    12  0.33333334E+00   100    10     3    11     0     0
    12  0.11111111E+00   100   128   121    11     0     0
    12  0.11111111E+00   100   130   123    11     0     0
    12  0.11111111E+00   100   132   125    11     0     0
     10.00000000     -0.10014755
      0.78661120     -0.21091755      0.48132017     -0.32417175
     -0.59965068     -0.45952731      0.47400096     -0.45230159
      0.08995976     -0.11095422     -0.68000025     -0.71916318
      0.11648589     -0.85559195     -0.28504986      0.41610113
     -0.59095514      0.80670440     -0.80670440     -0.59095514
     -0.40473068      0.91443592     -0.91443592     -0.40473068
     -1.52870476     -0.00629016     -1.46472311
   -515.61926270   -752.48962402   -178.52053833
    171.30085754
    T
