#  ISAJET SUSY parameters in SUSY Les Houches Accord 2 format
#  Created by ISALHA 2.0 Last revision: C. Balazs 21 Apr 2009
Block SPINFO   # Program information
     1   ISASUGRA from ISAJET          # Spectrum Calculator
     2   7.80   29-OCT-2009 12:50:36   # Version number
Block MODSEL   # Model selection
     1     1   # Minimal supergravity (mSUGRA) model               
Block SMINPUTS   # Standard Model inputs
     1     1.27836296E+02   # alpha_em^(-1)
     2     1.16570000E-05   # G_Fermi
     3     1.17200002E-01   # alpha_s(M_Z)
     4     9.11699982E+01   # m_{Z}(pole)
     5     4.19999981E+00   # m_{b}(m_{b})
     6     1.72500000E+02   # m_{top}(pole)
     7     1.77699995E+00   # m_{tau}(pole)
Block MINPAR   # SUSY breaking input parameters
     1     2.40000000E+02   # m_0
     2     1.60000000E+02   # m_{1/2}
     3     4.00000000E+01   # tan(beta)
     4     1.00000000E+00   # sign(mu)
     5     0.00000000E+00   # A_0
Block EXTPAR   # Non-universal SUSY breaking parameters
     0     2.72494673E+16   # Input scale
Block MASS   # Scalar and gaugino mass spectrum
#  PDG code   mass                 particle
        24     8.04229965E+01   #  W^+
        25     1.06380424E+02   #  h^0            
        35     2.41067139E+02   #  H^0            
        36     2.39532944E+02   #  A^0            
        37     2.55374924E+02   #  H^+            
   1000001     4.44858398E+02   #  dnl            
   1000002     4.37307037E+02   #  upl            
   1000003     4.44858459E+02   #  stl            
   1000004     4.37309235E+02   #  chl            
   1000005     3.59691315E+02   #  b1             
   1000006     3.04955414E+02   #  t1             
   1000011     2.66882904E+02   #  el-            
   1000012     2.54298691E+02   #  nuel           
   1000013     2.66882904E+02   #  mul-           
   1000014     2.54298691E+02   #  numl           
   1000015     1.83775040E+02   #  tau1           
   1000016     2.34162323E+02   #  nutl           
   1000021     4.15962860E+02   #  glss           
   1000022     5.98301392E+01   #  z1ss           
   1000023     1.06303085E+02   #  z2ss           
   1000024     1.05798843E+02   #  w1ss           
   1000025    -2.24620880E+02   #  z3ss           
   1000035     2.48462616E+02   #  z4ss           
   1000037     2.49345322E+02   #  w2ss           
   2000001     4.31938049E+02   #  dnr            
   2000002     4.30601624E+02   #  upr            
   2000003     4.31938080E+02   #  str            
   2000004     4.30603851E+02   #  chr            
   2000005     4.14678314E+02   #  b2             
   2000006     4.42802612E+02   #  t2             
   2000011     2.50711273E+02   #  er-            
   2000013     2.50711288E+02   #  mur-           
   2000015     2.65079681E+02   #  tau2           
Block ALPHA   # Effective Higgs mixing parameter
         -2.89777592E-02   # alpha
Block STOPMIX   # stop mixing matrix
  1  1     5.82013905E-01   # O_{11}
  1  2     8.13178837E-01   # O_{12}
  2  1    -8.13178837E-01   # O_{21}
  2  2     5.82013905E-01   # O_{22}
Block SBOTMIX   # sbottom mixing matrix
  1  1     7.93361247E-01   # O_{11}
  1  2     6.08751178E-01   # O_{12}
  2  1    -6.08751178E-01   # O_{21}
  2  2     7.93361247E-01   # O_{22}
Block STAUMIX   # stau mixing matrix
  1  1     4.96223122E-01   # O_{11}
  1  2     8.68195057E-01   # O_{12}
  2  1    -8.68195057E-01   # O_{21}
  2  2     4.96223122E-01   # O_{22}
Block NMIX   # neutralino mixing matrix
  1  1     9.58423436E-01   #
  1  2    -1.03236459E-01   #
  1  3     2.54638612E-01   #
  1  4    -7.69817531E-02   #
  2  1    -2.10763261E-01   #
  2  2    -8.80154610E-01   #
  2  3     3.76798749E-01   #
  2  4    -1.97305799E-01   #
  3  1    -1.05559111E-01   #
  3  2     1.54642850E-01   #
  3  3     6.75590754E-01   #
  3  4     7.13106394E-01   #
  4  1    -1.60813183E-01   #
  4  2     4.36756074E-01   #
  4  3     5.80310345E-01   #
  4  4    -6.68299139E-01   #
Block UMIX   # chargino U mixing matrix
  1  1    -8.22118342E-01   # U_{11}
  1  2     5.69316685E-01   # U_{12}
  2  1    -5.69316685E-01   # U_{21}
  2  2    -8.22118342E-01   # U_{22}
Block VMIX   # chargino V mixing matrix
  1  1    -9.54909980E-01   # V_{11}
  1  2     2.96895504E-01   # V_{12}
  2  1    -2.96895504E-01   # V_{21}
  2  2    -9.54909980E-01   # V_{22}
Block GAUGE Q=  3.35680695E+02   #
     1     3.57523978E-01   # g`
     2     6.52384162E-01   # g_2
     3     1.21917629E+00   # g_3
Block YU Q=  3.35680695E+02   #
  3  3     8.92061412E-01   # y_t
Block YD Q=  3.35680695E+02   #
  3  3     5.11642873E-01   # y_b
Block YE Q=  3.35680695E+02   #
  3  3     4.19883072E-01   # y_tau
Block HMIX Q=  3.35680695E+02   # Higgs mixing parameters
     1     2.13196228E+02   # mu(Q)
     2     4.00000000E+01   # tan(beta)(M_GUT)
     3     2.49930893E+02   # Higgs vev at Q
     4     5.73760312E+04   # m_A^2(Q)
Block MSOFT Q=  3.35680695E+02   # DRbar SUSY breaking parameters
     1     6.40803070E+01   # M_1(Q)          
     2     1.22130653E+02   # M_2(Q)          
     3     3.84626373E+02   # M_3(Q)          
    31     2.62186462E+02   # MeL(Q)          
    32     2.62186462E+02   # MmuL(Q)         
    33     2.42884155E+02   # MtauL(Q)        
    34     2.46694412E+02   # MeR(Q)          
    35     2.46694412E+02   # MmuR(Q)         
    36     2.03159958E+02   # MtauR(Q)        
    41     4.20395508E+02   # MqL1(Q)         
    42     4.20395508E+02   # MqL2(Q)         
    43     3.60014587E+02   # MqL3(Q)         
    44     4.11852661E+02   # MuR(Q)          
    45     4.11852661E+02   # McR(Q)          
    46     3.12991577E+02   # MtR(Q)          
    47     4.10838531E+02   # MdR(Q)          
    48     4.10838531E+02   # MsR(Q)          
    49     3.79571838E+02   # MbR(Q)          
Block AU Q=  3.35680695E+02   #
  1  1    -3.03581421E+02   # A_u
  2  2    -3.03581421E+02   # A_c
  3  3    -3.03581421E+02   # A_t
Block AD Q=  3.35680695E+02   #
  1  1    -4.07105164E+02   # A_d
  2  2    -4.07105164E+02   # A_s
  3  3    -4.07105164E+02   # A_b
Block AE Q=  3.35680695E+02   #
  1  1    -5.69103241E+01   # A_e
  2  2    -5.69103241E+01   # A_mu
  3  3    -5.69103241E+01   # A_tau
#  ISAJET decay tables in SUSY Les Houches accord format
#  Created by ISALHD. Last revision: C. Balazs, 2005 May 25
Block DCINFO                           # Program information
     1   ISASUGRA from ISAJET          # Spectrum Calculator
     2   7.80   29-OCT-2009 12:50:36   # Version number
#         PDG         Width
DECAY         6  1.14680779E+00   # TP    decays
#          BR          NDA       ID1       ID2       ID3       ID4
      3.33333343E-01    3            2        -1         5             # TP     -->  UP     DB     BT          
      3.33333343E-01    3            4        -3         5             # TP     -->  CH     SB     BT          
      1.11111112E-01    3          -11        12         5             # TP     -->  E+     NUE    BT          
      1.11111112E-01    3          -13        14         5             # TP     -->  MU+    NUM    BT          
      1.11111112E-01    3          -15        16         5             # TP     -->  TAU+   NUT    BT          
#         PDG         Width
DECAY   1000021  6.45546973E-01   # GLSS  decays
#          BR          NDA       ID1       ID2       ID3       ID4
      6.94682542E-03    3      1000024         1        -2             # GLSS   -->  W1SS+  DN     UB          
      6.94682542E-03    3     -1000024         2        -1             # GLSS   -->  W1SS-  UP     DB          
      6.94661262E-03    3      1000024         3        -4             # GLSS   -->  W1SS+  ST     CB          
      6.94661262E-03    3     -1000024         4        -3             # GLSS   -->  W1SS-  CH     SB          
      4.58651513E-04    3      1000024         5        -6             # GLSS   -->  W1SS+  BT     TB          
      4.58651513E-04    3     -1000024         6        -5             # GLSS   -->  W1SS-  TP     BB          
      3.64641746E-04    3      1000037         1        -2             # GLSS   -->  W2SS+  DN     UB          
      3.64641746E-04    3     -1000037         2        -1             # GLSS   -->  W2SS-  UP     DB          
      3.64634121E-04    3      1000037         3        -4             # GLSS   -->  W2SS+  ST     CB          
      3.64634121E-04    3     -1000037         4        -3             # GLSS   -->  W2SS-  CH     SB          
      1.70279818E-05    2      1000022        21                       # GLSS   -->  Z1SS   GL                 
      3.17278760E-03    3      1000022         2        -2             # GLSS   -->  Z1SS   UP     UB          
      1.12066430E-03    3      1000022         1        -1             # GLSS   -->  Z1SS   DN     DB          
      1.12066325E-03    3      1000022         3        -3             # GLSS   -->  Z1SS   ST     SB          
      3.17260670E-03    3      1000022         4        -4             # GLSS   -->  Z1SS   CH     CB          
      1.51407832E-04    3      1000022         5        -5             # GLSS   -->  Z1SS   BT     BB          
      2.62263438E-06    3      1000022         6        -6             # GLSS   -->  Z1SS   TP     TB          
      4.19066455E-05    2      1000023        21                       # GLSS   -->  Z2SS   GL                 
      4.08188347E-03    3      1000023         2        -2             # GLSS   -->  Z2SS   UP     UB          
      2.84874230E-03    3      1000023         1        -1             # GLSS   -->  Z2SS   DN     DB          
      2.84873904E-03    3      1000023         3        -3             # GLSS   -->  Z2SS   ST     SB          
      4.08167718E-03    3      1000023         4        -4             # GLSS   -->  Z2SS   CH     CB          
      1.21157011E-03    3      1000023         5        -5             # GLSS   -->  Z2SS   BT     BB          
      2.80612410E-04    2      1000025        21                       # GLSS   -->  Z3SS   GL                 
      2.10315848E-05    3      1000025         2        -2             # GLSS   -->  Z3SS   UP     UB          
      2.08523470E-05    3      1000025         1        -1             # GLSS   -->  Z3SS   DN     DB          
      2.08523106E-05    3      1000025         3        -3             # GLSS   -->  Z3SS   ST     SB          
      2.10299386E-05    3      1000025         4        -4             # GLSS   -->  Z3SS   CH     CB          
      2.78390246E-03    3      1000025         5        -5             # GLSS   -->  Z3SS   BT     BB          
      2.45569594E-04    2      1000035        21                       # GLSS   -->  Z4SS   GL                 
      2.00646100E-04    3      1000035         2        -2             # GLSS   -->  Z4SS   UP     UB          
      1.97781410E-04    3      1000035         1        -1             # GLSS   -->  Z4SS   DN     DB          
      1.97781104E-04    3      1000035         3        -3             # GLSS   -->  Z4SS   ST     SB          
      2.00632814E-04    3      1000035         4        -4             # GLSS   -->  Z4SS   CH     CB          
      2.85162986E-03    3      1000035         5        -5             # GLSS   -->  Z4SS   BT     BB          
      4.69461322E-01    2     -1000005         5                       # GLSS   -->  BB1    BT                 
      4.69461322E-01    2      1000005        -5                       # GLSS   -->  BT1    BB                 
#         PDG         Width
DECAY   1000002  4.93269825E+00   # UPL   decays
#          BR          NDA       ID1       ID2       ID3       ID4
      1.88113353E-03    2      1000022         2                       # UPL    -->  Z1SS   UP                 
      2.78882474E-01    2      1000023         2                       # UPL    -->  Z2SS   UP                 
      3.70243285E-03    2      1000025         2                       # UPL    -->  Z3SS   UP                 
      2.83889323E-02    2      1000035         2                       # UPL    -->  Z4SS   UP                 
      5.39530814E-02    2      1000021         2                       # UPL    -->  GLSS   UP                 
      6.03226662E-01    2      1000024         1                       # UPL    -->  W1SS+  DN                 
      2.99652647E-02    2      1000037         1                       # UPL    -->  W2SS+  DN                 
#         PDG         Width
DECAY   1000001  4.83814812E+00   # DNL   decays
#          BR          NDA       ID1       ID2       ID3       ID4
      2.90113054E-02    2      1000022         1                       # DNL    -->  Z1SS   DN                 
      2.43688703E-01    2      1000023         1                       # DNL    -->  Z2SS   DN                 
      6.50329143E-03    2      1000025         1                       # DNL    -->  Z3SS   DN                 
      3.98271345E-02    2      1000035         1                       # DNL    -->  Z4SS   DN                 
      9.72834527E-02    2      1000021         1                       # DNL    -->  GLSS   DN                 
      4.65672821E-01    2     -1000024         2                       # DNL    -->  W1SS-  UP                 
      1.18013278E-01    2     -1000037         2                       # DNL    -->  W2SS-  UP                 
#         PDG         Width
DECAY   1000003  4.83808184E+00   # STL   decays
#          BR          NDA       ID1       ID2       ID3       ID4
      2.90117096E-02    2      1000022         3                       # STL    -->  Z1SS   ST                 
      2.43692115E-01    2      1000023         3                       # STL    -->  Z2SS   ST                 
      6.50338223E-03    2      1000025         3                       # STL    -->  Z3SS   ST                 
      3.98276895E-02    2      1000035         3                       # STL    -->  Z4SS   ST                 
      9.72850695E-02    2      1000021         3                       # STL    -->  GLSS   ST                 
      4.65669692E-01    2     -1000024         4                       # STL    -->  W1SS-  CH                 
      1.18010297E-01    2     -1000037         4                       # STL    -->  W2SS-  CH                 
#         PDG         Width
DECAY   1000004  4.93218613E+00   # CHL   decays
#          BR          NDA       ID1       ID2       ID3       ID4
      1.88130187E-03    2      1000022         4                       # CHL    -->  Z1SS   CH                 
      2.78907210E-01    2      1000023         4                       # CHL    -->  Z2SS   CH                 
      3.70273227E-03    2      1000025         4                       # CHL    -->  Z3SS   CH                 
      2.83911116E-02    2      1000035         4                       # CHL    -->  Z4SS   CH                 
      5.38557023E-02    2      1000021         4                       # CHL    -->  GLSS   CH                 
      6.03293121E-01    2      1000024         3                       # CHL    -->  W1SS+  ST                 
      2.99688112E-02    2      1000037         3                       # CHL    -->  W2SS+  ST                 
#         PDG         Width
DECAY   1000005  2.93311930E+00   # BT1   decays
#          BR          NDA       ID1       ID2       ID3       ID4
      1.69072017E-01    2      1000022         5                       # BT1    -->  Z1SS   BT                 
      3.99797767E-01    2      1000023         5                       # BT1    -->  Z2SS   BT                 
      8.50853026E-02    2      1000025         5                       # BT1    -->  Z3SS   BT                 
      3.21297459E-02    2      1000035         5                       # BT1    -->  Z4SS   BT                 
      3.13915133E-01    2     -1000024         6                       # BT1    -->  W1SS-  TP                 
#         PDG         Width
DECAY   1000006  2.29295444E+00   # TP1   decays
#          BR          NDA       ID1       ID2       ID3       ID4
      8.70502517E-02    2      1000022         6                       # TP1    -->  Z1SS   TP                 
      7.50794411E-02    2      1000023         6                       # TP1    -->  Z2SS   TP                 
      7.31283486E-01    2      1000024         5                       # TP1    -->  W1SS+  BT                 
      1.06586866E-01    2      1000037         5                       # TP1    -->  W2SS+  BT                 
#         PDG         Width
DECAY   2000002  1.04432464E+00   # UPR   decays
#          BR          NDA       ID1       ID2       ID3       ID4
      8.23452353E-01    2      1000022         2                       # UPR    -->  Z1SS   UP                 
      3.65113579E-02    2      1000023         2                       # UPR    -->  Z2SS   UP                 
      5.50270313E-03    2      1000025         2                       # UPR    -->  Z3SS   UP                 
      1.07256779E-02    2      1000035         2                       # UPR    -->  Z4SS   UP                 
      1.23807989E-01    2      1000021         2                       # UPR    -->  GLSS   UP                 
#         PDG         Width
DECAY   2000001  3.82536292E-01   # DNR   decays
#          BR          NDA       ID1       ID2       ID3       ID4
      5.63887954E-01    2      1000022         1                       # DNR    -->  Z1SS   DN                 
      2.50164028E-02    2      1000023         1                       # DNR    -->  Z2SS   DN                 
      3.78467608E-03    2      1000025         1                       # DNR    -->  Z3SS   DN                 
      7.38835707E-03    2      1000035         1                       # DNR    -->  Z4SS   DN                 
      3.99922669E-01    2      1000021         1                       # DNR    -->  GLSS   DN                 
#         PDG         Width
DECAY   2000003  3.82536858E-01   # STR   decays
#          BR          NDA       ID1       ID2       ID3       ID4
      5.63887119E-01    2      1000022         3                       # STR    -->  Z1SS   ST                 
      2.50163693E-02    2      1000023         3                       # STR    -->  Z2SS   ST                 
      3.78467096E-03    2      1000025         3                       # STR    -->  Z3SS   ST                 
      7.38834590E-03    2      1000035         3                       # STR    -->  Z4SS   ST                 
      3.99923444E-01    2      1000021         3                       # STR    -->  GLSS   ST                 
#         PDG         Width
DECAY   2000004  1.04377842E+00   # CHR   decays
#          BR          NDA       ID1       ID2       ID3       ID4
      8.23870897E-01    2      1000022         4                       # CHR    -->  Z1SS   CH                 
      3.65298875E-02    2      1000023         4                       # CHR    -->  Z2SS   CH                 
      5.50544960E-03    2      1000025         4                       # CHR    -->  Z3SS   CH                 
      1.07309828E-02    2      1000035         4                       # CHR    -->  Z4SS   CH                 
      1.23362780E-01    2      1000021         4                       # CHR    -->  GLSS   CH                 
#         PDG         Width
DECAY   2000005  1.75423598E+00   # BT2   decays
#          BR          NDA       ID1       ID2       ID3       ID4
      1.35636581E-02    2      1000022         5                       # BT2    -->  Z1SS   BT                 
      1.14446528E-01    2      1000023         5                       # BT2    -->  Z2SS   BT                 
      3.58659148E-01    2      1000025         5                       # BT2    -->  Z3SS   BT                 
      3.45704198E-01    2      1000035         5                       # BT2    -->  Z4SS   BT                 
      6.83027357E-02    2     -1000024         6                       # BT2    -->  W1SS-  TP                 
      9.93237495E-02    2          -24   1000006                       # BT2    -->  W-     TP1                
#         PDG         Width
DECAY   2000006  6.27758503E+00   # TP2   decays
#          BR          NDA       ID1       ID2       ID3       ID4
      2.23825514E-01    2      1000024         5                       # TP2    -->  W1SS+  BT                 
      3.58192652E-01    2      1000037         5                       # TP2    -->  W2SS+  BT                 
      6.12235703E-02    2           23   1000006                       # TP2    -->  Z0     TP1                
      1.36180064E-02    2           25   1000006                       # TP2    -->  HL0    TP1                
      2.33196444E-03    2           24   1000005                       # TP2    -->  W+     BT1                
      1.89756807E-02    2      1000022         6                       # TP2    -->  Z1SS   TP                 
      6.06748834E-02    2      1000023         6                       # TP2    -->  Z2SS   TP                 
      4.89704385E-02    2      1000025         6                       # TP2    -->  Z3SS   TP                 
      2.12187305E-01    2      1000035         6                       # TP2    -->  Z4SS   TP                 
#         PDG         Width
DECAY   1000011  2.06447434E+00   # EL-   decays
#          BR          NDA       ID1       ID2       ID3       ID4
      8.80461335E-02    2      1000022        11                       # EL-    -->  Z1SS   E-                 
      3.82108688E-01    2      1000023        11                       # EL-    -->  Z2SS   E-                 
      4.32092493E-04    2      1000025        11                       # EL-    -->  Z3SS   E-                 
      1.17303536E-03    2      1000035        11                       # EL-    -->  Z4SS   E-                 
      5.22541106E-01    2     -1000024        12                       # EL-    -->  W1SS-  NUE                
      5.69903152E-03    2     -1000037        12                       # EL-    -->  W2SS-  NUE                
#         PDG         Width
DECAY   1000013  2.06447411E+00   # MUL-  decays
#          BR          NDA       ID1       ID2       ID3       ID4
      8.80461261E-02    2      1000022        13                       # MUL-   -->  Z1SS   MU-                
      3.82108569E-01    2      1000023        13                       # MUL-   -->  Z2SS   MU-                
      4.32090979E-04    2      1000025        13                       # MUL-   -->  Z3SS   MU-                
      1.17301510E-03    2      1000035        13                       # MUL-   -->  Z4SS   MU-                
      5.22541165E-01    2     -1000024        14                       # MUL-   -->  W1SS-  NUM                
      5.69903199E-03    2     -1000037        14                       # MUL-   -->  W2SS-  NUM                
#         PDG         Width
DECAY   1000015  1.23911619E+00   # TAU1- decays
#          BR          NDA       ID1       ID2       ID3       ID4
      5.29695690E-01    2      1000022        15                       # TAU1-  -->  Z1SS   TAU-               
      1.74550474E-01    2      1000023        15                       # TAU1-  -->  Z2SS   TAU-               
      2.95753896E-01    2     -1000024        16                       # TAU1-  -->  W1SS-  NUT                
#         PDG         Width
DECAY   1000012  2.14305663E+00   # NUEL  decays
#          BR          NDA       ID1       ID2       ID3       ID4
      1.76909029E-01    2      1000022        12                       # NUEL   -->  Z1SS   NUE                
      1.98721066E-01    2      1000023        12                       # NUEL   -->  Z2SS   NUE                
      1.09120947E-03    2      1000025        12                       # NUEL   -->  Z3SS   NUE                
      2.83573288E-04    2      1000035        12                       # NUEL   -->  Z4SS   NUE                
      6.22864068E-01    2      1000024        11                       # NUEL   -->  W1SS+  E-                 
      1.31048466E-04    2      1000037        11                       # NUEL   -->  W2SS+  E-                 
#         PDG         Width
DECAY   1000014  2.14305592E+00   # NUML  decays
#          BR          NDA       ID1       ID2       ID3       ID4
      1.76909089E-01    2      1000022        14                       # NUML   -->  Z1SS   NUM                
      1.98721141E-01    2      1000023        14                       # NUML   -->  Z2SS   NUM                
      1.09120982E-03    2      1000025        14                       # NUML   -->  Z3SS   NUM                
      2.83573376E-04    2      1000035        14                       # NUML   -->  Z4SS   NUM                
      6.22863889E-01    2      1000024        13                       # NUML   -->  W1SS+  MU-                
      1.31018474E-04    2      1000037        13                       # NUML   -->  W2SS+  MU-                
#         PDG         Width
DECAY   1000016  2.00559378E+00   # NUTL  decays
#          BR          NDA       ID1       ID2       ID3       ID4
      1.70425728E-01    2      1000022        16                       # NUTL   -->  Z1SS   NUT                
      1.80955902E-01    2      1000023        16                       # NUTL   -->  Z2SS   NUT                
      1.41655750E-04    2      1000025        16                       # NUTL   -->  Z3SS   NUT                
      6.48381412E-01    2      1000024        15                       # NUTL   -->  W1SS+  TAU-               
      8.21824315E-08    3     -1000015        16        15             # NUTL   -->  TAU1+  NUT    TAU-        
      1.06246753E-05    3      1000015        16       -15             # NUTL   -->  TAU1-  NUT    TAU+        
      1.05782419E-05    3      1000015        12       -11             # NUTL   -->  TAU1-  NUE    E+          
      1.05782419E-05    3      1000015        14       -13             # NUTL   -->  TAU1-  NUM    MU+         
      3.17347221E-05    3      1000015         2        -1             # NUTL   -->  TAU1-  UP     DB          
      3.17347221E-05    3      1000015         4        -3             # NUTL   -->  TAU1-  CH     SB          
#         PDG         Width
DECAY   2000011  1.08040679E+00   # ER-   decays
#          BR          NDA       ID1       ID2       ID3       ID4
      9.64205980E-01    2      1000022        11                       # ER-    -->  Z1SS   E-                 
      3.52723822E-02    2      1000023        11                       # ER-    -->  Z2SS   E-                 
      5.11961058E-04    2      1000025        11                       # ER-    -->  Z3SS   E-                 
      9.73378428E-06    2      1000035        11                       # ER-    -->  Z4SS   E-                 
#         PDG         Width
DECAY   2000013  1.08040631E+00   # MUR-  decays
#          BR          NDA       ID1       ID2       ID3       ID4
      9.64205980E-01    2      1000022        13                       # MUR-   -->  Z1SS   MU-                
      3.52723785E-02    2      1000023        13                       # MUR-   -->  Z2SS   MU-                
      5.11957274E-04    2      1000025        13                       # MUR-   -->  Z3SS   MU-                
      9.72320959E-06    2      1000035        13                       # MUR-   -->  Z4SS   MU-                
#         PDG         Width
DECAY   2000015  1.36289942E+00   # TAU2- decays
#          BR          NDA       ID1       ID2       ID3       ID4
      2.47250617E-01    2      1000022        15                       # TAU2-  -->  Z1SS   TAU-               
      3.74184251E-01    2      1000023        15                       # TAU2-  -->  Z2SS   TAU-               
      3.17009427E-02    2      1000025        15                       # TAU2-  -->  Z3SS   TAU-               
      8.23568646E-03    2      1000035        15                       # TAU2-  -->  Z4SS   TAU-               
      3.26132119E-01    2     -1000024        16                       # TAU2-  -->  W1SS-  NUT                
      1.24963867E-02    2     -1000037        16                       # TAU2-  -->  W2SS-  NUT                
#         PDG         Width
DECAY   1000023  3.23082713E-06   # Z2SS  decays
#          BR          NDA       ID1       ID2       ID3       ID4
      4.16572252E-03    2      1000022        22                       # Z2SS   -->  Z1SS   GM                 
      1.09760858E-01    3      1000022         2        -2             # Z2SS   -->  Z1SS   UP     UB          
      1.52987853E-01    3      1000022         1        -1             # Z2SS   -->  Z1SS   DN     DB          
      1.52987853E-01    3      1000022         3        -3             # Z2SS   -->  Z1SS   ST     SB          
      1.09760739E-01    3      1000022         4        -4             # Z2SS   -->  Z1SS   CH     CB          
      2.37672538E-01    3      1000022         5        -5             # Z2SS   -->  Z1SS   BT     BB          
      2.06368184E-03    3      1000022        11       -11             # Z2SS   -->  Z1SS   E-     E+          
      2.06368510E-03    3      1000022        13       -13             # Z2SS   -->  Z1SS   MU-    MU+         
      2.01716438E-01    3      1000022        15       -15             # Z2SS   -->  Z1SS   TAU-   TAU+        
      1.05858715E-02    3      1000022        12       -12             # Z2SS   -->  Z1SS   NUE    ANUE        
      1.05858715E-02    3      1000022        14       -14             # Z2SS   -->  Z1SS   NUM    ANUM        
      5.64890355E-03    3      1000022        16       -16             # Z2SS   -->  Z1SS   NUT    ANUT        
#         PDG         Width
DECAY   1000025  6.29343629E-01   # Z3SS  decays
#          BR          NDA       ID1       ID2       ID3       ID4
      4.88771207E-07    2      1000022        22                       # Z3SS   -->  Z1SS   GM                 
      9.53300798E-08    2      1000023        22                       # Z3SS   -->  Z2SS   GM                 
      3.16347361E-01    2      1000024       -24                       # Z3SS   -->  W1SS+  W-                 
      3.16347361E-01    2     -1000024        24                       # Z3SS   -->  W1SS-  W+                 
      1.61826566E-01    2      1000022        23                       # Z3SS   -->  Z1SS   Z0                 
      1.24282539E-01    2      1000023        23                       # Z3SS   -->  Z2SS   Z0                 
      6.00368111E-08    3      1000022         2        -2             # Z3SS   -->  Z1SS   UP     UB          
      4.34968115E-08    3      1000022         1        -1             # Z3SS   -->  Z1SS   DN     DB          
      4.34967831E-08    3      1000022         3        -3             # Z3SS   -->  Z1SS   ST     SB          
      6.00353474E-08    3      1000022         4        -4             # Z3SS   -->  Z1SS   CH     CB          
      1.04210558E-04    3      1000022         5        -5             # Z3SS   -->  Z1SS   BT     BB          
      2.41999601E-06    3      1000022        11       -11             # Z3SS   -->  Z1SS   E-     E+          
      2.41999487E-06    3      1000022        13       -13             # Z3SS   -->  Z1SS   MU-    MU+         
      3.33268181E-05    3      1000022        15       -15             # Z3SS   -->  Z1SS   TAU-   TAU+        
      2.41318253E-06    3      1000022        12       -12             # Z3SS   -->  Z1SS   NUE    ANUE        
      2.41318253E-06    3      1000022        14       -14             # Z3SS   -->  Z1SS   NUM    ANUM        
      5.44445584E-06    3      1000022        16       -16             # Z3SS   -->  Z1SS   NUT    ANUT        
      8.53198046E-08    3      1000023         2        -2             # Z3SS   -->  Z2SS   UP     UB          
      1.08018064E-07    3      1000023         1        -1             # Z3SS   -->  Z2SS   DN     DB          
      1.08018007E-07    3      1000023         3        -3             # Z3SS   -->  Z2SS   ST     SB          
      8.53177369E-08    3      1000023         4        -4             # Z3SS   -->  Z2SS   CH     CB          
      4.64664045E-05    3      1000023         5        -5             # Z3SS   -->  Z2SS   BT     BB          
      3.42370299E-07    3      1000023        11       -11             # Z3SS   -->  Z2SS   E-     E+          
      3.42370242E-07    3      1000023        13       -13             # Z3SS   -->  Z2SS   MU-    MU+         
      2.79908145E-05    3      1000023        15       -15             # Z3SS   -->  Z2SS   TAU-   TAU+        
      1.30551746E-06    3      1000023        12       -12             # Z3SS   -->  Z2SS   NUE    ANUE        
      1.30551746E-06    3      1000023        14       -14             # Z3SS   -->  Z2SS   NUM    ANUM        
      3.35312779E-06    3      1000023        16       -16             # Z3SS   -->  Z2SS   NUT    ANUT        
      3.20799947E-02    2      1000022        25                       # Z3SS   -->  Z1SS   HL0                
      4.23389114E-03    2      1000023        25                       # Z3SS   -->  Z2SS   HL0                
      2.23236289E-02    2      1000015       -15                       # Z3SS   -->  TAU1-  TAU+               
      2.23236289E-02    2     -1000015        15                       # Z3SS   -->  TAU1+  TAU-               
#         PDG         Width
DECAY   1000035  9.51661110E-01   # Z4SS  decays
#          BR          NDA       ID1       ID2       ID3       ID4
      4.42186007E-07    2      1000022        22                       # Z4SS   -->  Z1SS   GM                 
      7.94401913E-08    2      1000023        22                       # Z4SS   -->  Z2SS   GM                 
      8.00422395E-09    2      1000025        22                       # Z4SS   -->  Z3SS   GM                 
      3.64042848E-01    2      1000024       -24                       # Z4SS   -->  W1SS+  W-                 
      3.64042848E-01    2     -1000024        24                       # Z4SS   -->  W1SS-  W+                 
      4.61473055E-02    2      1000022        23                       # Z4SS   -->  Z1SS   Z0                 
      2.75538005E-02    2      1000023        23                       # Z4SS   -->  Z2SS   Z0                 
      3.75003225E-07    3      1000022         2        -2             # Z4SS   -->  Z1SS   UP     UB          
      7.30336126E-07    3      1000022         1        -1             # Z4SS   -->  Z1SS   DN     DB          
      7.30335785E-07    3      1000022         3        -3             # Z4SS   -->  Z1SS   ST     SB          
      3.74993988E-07    3      1000022         4        -4             # Z4SS   -->  Z1SS   CH     CB          
      6.19553757E-05    3      1000022         5        -5             # Z4SS   -->  Z1SS   BT     BB          
      2.44680705E-05    3      1000022        11       -11             # Z4SS   -->  Z1SS   E-     E+          
      2.44680487E-05    3      1000022        13       -13             # Z4SS   -->  Z1SS   MU-    MU+         
      6.89473891E-05    3      1000022        15       -15             # Z4SS   -->  Z1SS   TAU-   TAU+        
      4.78900874E-05    3      1000022        12       -12             # Z4SS   -->  Z1SS   NUE    ANUE        
      4.78900874E-05    3      1000022        14       -14             # Z4SS   -->  Z1SS   NUM    ANUM        
      3.01654359E-06    3      1000023         2        -2             # Z4SS   -->  Z2SS   UP     UB          
      3.04402010E-06    3      1000023         1        -1             # Z4SS   -->  Z2SS   DN     DB          
      3.04401783E-06    3      1000023         3        -3             # Z4SS   -->  Z2SS   ST     SB          
      3.01646969E-06    3      1000023         4        -4             # Z4SS   -->  Z2SS   CH     CB          
      3.73068287E-05    3      1000023         5        -5             # Z4SS   -->  Z2SS   BT     BB          
      1.87501064E-05    3      1000023        11       -11             # Z4SS   -->  Z2SS   E-     E+          
      1.87501064E-05    3      1000023        13       -13             # Z4SS   -->  Z2SS   MU-    MU+         
      7.22542609E-05    3      1000023        15       -15             # Z4SS   -->  Z2SS   TAU-   TAU+        
      4.23875936E-05    3      1000023        12       -12             # Z4SS   -->  Z2SS   NUE    ANUE        
      4.23875936E-05    3      1000023        14       -14             # Z4SS   -->  Z2SS   NUM    ANUM        
      6.90645436E-07    3      1000025         2        -2             # Z4SS   -->  Z3SS   UP     UB          
      9.05974673E-07    3      1000025         1        -1             # Z4SS   -->  Z3SS   DN     DB          
      9.05974673E-07    3      1000025         3        -3             # Z4SS   -->  Z3SS   ST     SB          
      6.90645493E-07    3      1000025         4        -4             # Z4SS   -->  Z3SS   CH     CB          
      6.16403213E-07    3      1000025         5        -5             # Z4SS   -->  Z3SS   BT     BB          
      2.20480132E-07    3      1000025        11       -11             # Z4SS   -->  Z3SS   E-     E+          
      2.20480104E-07    3      1000025        13       -13             # Z4SS   -->  Z3SS   MU-    MU+         
      3.45855995E-07    3      1000025        15       -15             # Z4SS   -->  Z3SS   TAU-   TAU+        
      3.28525374E-07    3      1000025        12       -12             # Z4SS   -->  Z3SS   NUE    ANUE        
      3.28525374E-07    3      1000025        14       -14             # Z4SS   -->  Z3SS   NUM    ANUM        
      4.05065180E-07    3      1000025        16       -16             # Z4SS   -->  Z3SS   NUT    ANUT        
      8.15652609E-02    2      1000022        25                       # Z4SS   -->  Z1SS   HL0                
      9.03935060E-02    2      1000023        25                       # Z4SS   -->  Z2SS   HL0                
      1.09691424E-02    2      1000015       -15                       # Z4SS   -->  TAU1-  TAU+               
      1.09691424E-02    2     -1000015        15                       # Z4SS   -->  TAU1+  TAU-               
      1.89400150E-03    2      1000016       -16                       # Z4SS   -->  NUTL   ANUT               
      1.89400150E-03    2     -1000016        16                       # Z4SS   -->  ANUTL  NUT                
#         PDG         Width
DECAY   1000024  1.84489218E-05   # W1SS+ decays
#          BR          NDA       ID1       ID2       ID3       ID4
      3.29842389E-01    3      1000022         2        -1             # W1SS+  -->  Z1SS   UP     DB          
      3.29842389E-01    3      1000022         4        -3             # W1SS+  -->  Z1SS   CH     SB          
      1.01826742E-01    3      1000022       -11        12             # W1SS+  -->  Z1SS   E+     NUE         
      1.01826742E-01    3      1000022       -13        14             # W1SS+  -->  Z1SS   MU+    NUM         
      1.36661723E-01    3      1000022       -15        16             # W1SS+  -->  Z1SS   TAU+   NUT         
#         PDG         Width
DECAY   1000037  7.90651143E-01   # W2SS+ decays
#          BR          NDA       ID1       ID2       ID3       ID4
      1.10417795E-06    3      1000022         2        -1             # W2SS+  -->  Z1SS   UP     DB          
      1.10417579E-06    3      1000022         4        -3             # W2SS+  -->  Z1SS   CH     SB          
      3.86549873E-05    3      1000022       -11        12             # W2SS+  -->  Z1SS   E+     NUE         
      3.86549873E-05    3      1000022       -13        14             # W2SS+  -->  Z1SS   MU+    NUM         
      6.26101901E-05    3      1000022       -15        16             # W2SS+  -->  Z1SS   TAU+   NUT         
      8.04710612E-02    2      1000022        24                       # W2SS+  -->  Z1SS   W+                 
      3.45335093E-06    3      1000023         2        -1             # W2SS+  -->  Z2SS   UP     DB          
      3.45333774E-06    3      1000023         4        -3             # W2SS+  -->  Z2SS   CH     SB          
      4.68726939E-05    3      1000023       -11        12             # W2SS+  -->  Z2SS   E+     NUE         
      4.68726939E-05    3      1000023       -13        14             # W2SS+  -->  Z2SS   MU+    NUM         
      1.05483603E-04    3      1000023       -15        16             # W2SS+  -->  Z2SS   TAU+   NUT         
      4.60395932E-01    2      1000023        24                       # W2SS+  -->  Z2SS   W+                 
      3.89242041E-06    3      1000025         2        -1             # W2SS+  -->  Z3SS   UP     DB          
      3.89242041E-06    3      1000025         4        -3             # W2SS+  -->  Z3SS   CH     SB          
      1.27621399E-06    3      1000025       -11        12             # W2SS+  -->  Z3SS   E+     NUE         
      1.27621399E-06    3      1000025       -13        14             # W2SS+  -->  Z3SS   MU+    NUM         
      1.61984451E-06    3      1000025       -15        16             # W2SS+  -->  Z3SS   TAU+   NUT         
      2.04211322E-13    3      1000035       -11        12             # W2SS+  -->  Z4SS   E+     NUE         
      2.04211322E-13    3      1000035       -13        14             # W2SS+  -->  Z4SS   MU+    NUM         
      6.12893282E-03    2      1000016       -15                       # W2SS+  -->  NUTL   TAU+               
      8.93414207E-03    2     -1000015        16                       # W2SS+  -->  TAU1+  NUT                
      2.91908920E-01    2      1000024        23                       # W2SS+  -->  W1SS+  Z0                 
      3.07346795E-06    3      1000024         1        -1             # W2SS+  -->  W1SS+  DN     DB          
      3.07339224E-06    3      1000024         3        -3             # W2SS+  -->  W1SS+  ST     SB          
      7.70277256E-06    3      1000024         2        -2             # W2SS+  -->  W1SS+  UP     UB          
      7.70276802E-06    3      1000024         4        -4             # W2SS+  -->  W1SS+  CH     CB          
      6.45488835E-05    3      1000024        12       -12             # W2SS+  -->  W1SS+  NUE    ANUE        
      6.45488835E-05    3      1000024        14       -14             # W2SS+  -->  W1SS+  NUM    ANUM        
      4.38040443E-05    3      1000024        11       -11             # W2SS+  -->  W1SS+  E-     E+          
      4.38040443E-05    3      1000024        13       -13             # W2SS+  -->  W1SS+  MU-    MU+         
      1.51562542E-01    2      1000024        25                       # W2SS+  -->  W1SS+  HL0                
#         PDG         Width
DECAY        25  4.73018549E-03   # HL0   decays
#          BR          NDA       ID1       ID2       ID3       ID4
      5.13660092E-09    2           11       -11                       # HL0    -->  E-     E+                 
      2.16875284E-04    2           13       -13                       # HL0    -->  MU-    MU+                
      6.20128028E-02    2           15       -15                       # HL0    -->  TAU-   TAU+               
      6.45462751E-06    2            1        -1                       # HL0    -->  DN     DB                 
      2.60799192E-03    2            3        -3                       # HL0    -->  ST     SB                 
      8.64422560E-01    2            5        -5                       # HL0    -->  BT     BB                 
      1.53632982E-06    2            2        -2                       # HL0    -->  UP     UB                 
      2.92714480E-02    2            4        -4                       # HL0    -->  CH     CB                 
      1.15432369E-03    2           22        22                       # HL0    -->  GM     GM                 
      2.80099139E-02    2           21        21                       # HL0    -->  GL     GL                 
      6.60306949E-04    3           24        11       -12             # HL0    -->  W+     E-     ANUE        
      6.60306949E-04    3           24        13       -14             # HL0    -->  W+     MU-    ANUM        
      6.60306949E-04    3           24        15       -16             # HL0    -->  W+     TAU-   ANUT        
      1.98092079E-03    3           24        -2         1             # HL0    -->  W+     UB     DN          
      1.98092079E-03    3           24        -4         3             # HL0    -->  W+     CB     ST          
      6.60306949E-04    3          -24       -11        12             # HL0    -->  W-     E+     NUE         
      6.60306949E-04    3          -24       -13        14             # HL0    -->  W-     MU+    NUM         
      6.60306949E-04    3          -24       -15        16             # HL0    -->  W-     TAU+   NUT         
      1.98092079E-03    3          -24         2        -1             # HL0    -->  W-     UP     DB          
      1.98092079E-03    3          -24         4        -3             # HL0    -->  W-     CH     SB          
      2.80914901E-05    3           23        12       -12             # HL0    -->  Z0     NUE    ANUE        
      2.80914901E-05    3           23        14       -14             # HL0    -->  Z0     NUM    ANUM        
      2.80914901E-05    3           23        16       -16             # HL0    -->  Z0     NUT    ANUT        
      1.41381661E-05    3           23        11       -11             # HL0    -->  Z0     E-     E+          
      1.41381661E-05    3           23        13       -13             # HL0    -->  Z0     MU-    MU+         
      1.41381661E-05    3           23        15       -15             # HL0    -->  Z0     TAU-   TAU+        
      4.84361553E-05    3           23         2        -2             # HL0    -->  Z0     UP     UB          
      4.84361553E-05    3           23         4        -4             # HL0    -->  Z0     CH     CB          
      6.23977030E-05    3           23         1        -1             # HL0    -->  Z0     DN     DB          
      6.23977030E-05    3           23         3        -3             # HL0    -->  Z0     ST     SB          
      6.23977030E-05    3           23         5        -5             # HL0    -->  Z0     BT     BB          
#         PDG         Width
DECAY        35  6.82990980E+00   # HH0   decays
#          BR          NDA       ID1       ID2       ID3       ID4
      9.59494617E-09    2           11       -11                       # HH0    -->  E-     E+                 
      4.05115454E-04    2           13       -13                       # HH0    -->  MU-    MU+                
      1.15993582E-01    2           15       -15                       # HH0    -->  TAU-   TAU+               
      1.19215347E-05    2            1        -1                       # HH0    -->  DN     DB                 
      4.81690280E-03    2            3        -3                       # HH0    -->  ST     SB                 
      8.51767659E-01    2            5        -5                       # HH0    -->  BT     BB                 
      2.00304682E-12    2            2        -2                       # HH0    -->  UP     UB                 
      3.38540538E-08    2            4        -4                       # HH0    -->  CH     CB                 
      2.10652274E-07    2           22        22                       # HH0    -->  GM     GM                 
      4.85961646E-05    2           21        21                       # HH0    -->  GL     GL                 
      5.54802045E-06    2           24       -24                       # HH0    -->  W+     W-                 
      2.39389033E-06    2           23        23                       # HH0    -->  Z0     Z0                 
      4.91148792E-03    2      1000022   1000022                       # HH0    -->  Z1SS   Z1SS               
      1.00904303E-02    2      1000022   1000023                       # HH0    -->  Z1SS   Z2SS               
      2.50123441E-03    2      1000023   1000023                       # HH0    -->  Z2SS   Z2SS               
      9.40078869E-03    2      1000024  -1000024                       # HH0    -->  W1SS+  W1SS-              
      4.41496923E-05    2           25        25                       # HH0    -->  HL0    HL0                
#         PDG         Width
DECAY        36  7.15195274E+00   # HA0   decays
#          BR          NDA       ID1       ID2       ID3       ID4
      9.10654219E-09    2           11       -11                       # HA0    -->  E-     E+                 
      3.84494488E-04    2           13       -13                       # HA0    -->  MU-    MU+                
      1.10113040E-01    2           15       -15                       # HA0    -->  TAU-   TAU+               
      1.13155993E-05    2            1        -1                       # HA0    -->  DN     DB                 
      4.57207486E-03    2            3        -3                       # HA0    -->  ST     SB                 
      8.09234560E-01    2            5        -5                       # HA0    -->  BT     BB                 
      1.41430834E-12    2            2        -2                       # HA0    -->  UP     UB                 
      2.39259119E-08    2            4        -4                       # HA0    -->  CH     CB                 
      1.63417752E-07    2           22        22                       # HA0    -->  GM     GM                 
      8.00559719E-05    2           21        21                       # HA0    -->  GL     GL                 
      6.37746975E-03    2      1000022   1000022                       # HA0    -->  Z1SS   Z1SS               
      1.82640329E-02    2      1000022   1000023                       # HA0    -->  Z1SS   Z2SS               
      1.10492911E-02    2      1000023   1000023                       # HA0    -->  Z2SS   Z2SS               
      3.99117991E-02    2      1000024  -1000024                       # HA0    -->  W1SS+  W1SS-              
      1.80683037E-06    2           25        23                       # HA0    -->  HL0    Z0                 
#         PDG         Width
DECAY        37  2.70077229E+00   # H+    decays
#          BR          NDA       ID1       ID2       ID3       ID4
      2.57100634E-08    2           12       -11                       # H+     -->  NUE    E+                 
      1.08552491E-03    2           14       -13                       # H+     -->  NUM    MU+                
      3.10880989E-01    2           16       -15                       # H+     -->  NUT    TAU+               
      2.89503005E-05    2            2        -1                       # H+     -->  UP     DB                 
      1.16967773E-02    2            4        -3                       # H+     -->  CH     SB                 
      6.07033908E-01    2            6        -5                       # H+     -->  TP     BB                 
      6.68361858E-02    2      1000024   1000022                       # H+     -->  W1SS+  Z1SS               
      2.42767483E-03    2      1000024   1000023                       # H+     -->  W1SS+  Z2SS               
      9.93545837E-06    2           25        24                       # H+     -->  HL0    W+                 
