#  ISAJET SUSY parameters in Les Houches accord format
#  Created by ISALHA3. Last revision by C. Balazs on 2005 Jan. 10
Block SPINFO   # Program information
     1   ISASUGRA from ISAJET          # Spectrum Calculator
     2   7.79   16-DEC-2008 15:42:00   # Version number
Block MODSEL   # Model selection
     1     1   # Minimal supergravity (mSUGRA,CMSSM) model         
Block SMINPUTS   # Standard Model inputs
     1     1.27834572E+02   # alpha_em^(-1)
     2     1.16570000E-05   # G_Fermi
     3     1.17200002E-01   # alpha_s(M_Z)
     4     9.11699982E+01   # m_{Z}(pole)
     5     4.19999981E+00   # m_{b}(m_{b})
     6     1.72500000E+02   # m_{top}(pole)
     7     1.77699995E+00   # m_{tau}(pole)
Block MINPAR   # SUSY breaking input parameters
     1     4.00000000E+02   # m_0
     2     2.20000000E+02   # m_{1/2}
     3     3.00000000E+00   # tan(beta)
     4     1.00000000E+00   # sign(mu)
     5     0.00000000E+00   # A_0
#  
#  M_{GUT} =   0.24366612E+17
Block MASS   # Scalar and gaugino mass spectrum
#  PDG code   mass                 particle
        24     8.04229965E+01   #  W^+
        25     9.64415131E+01   #  h^0            
        35     6.09521179E+02   #  H^0            
        36     6.02973694E+02   #  A^0            
        37     6.12046448E+02   #  H^+            
   1000001     6.35667358E+02   #  dnl            
   1000002     6.31514038E+02   #  upl            
   1000003     6.35667358E+02   #  stl            
   1000004     6.31515503E+02   #  chl            
   1000005     5.58422852E+02   #  b1             
   1000006     4.13125946E+02   #  t1             
   1000011     4.27593506E+02   #  el-            
   1000012     4.21173401E+02   #  nuel           
   1000013     4.27593536E+02   #  mul-           
   1000014     4.21173401E+02   #  numl           
   1000015     4.08692719E+02   #  tau1           
   1000016     4.20939484E+02   #  nutl           
   1000021     5.60772278E+02   #  glss           
   1000022     8.40259399E+01   #  z1ss           
   1000023     1.56181015E+02   #  z2ss           
   1000024     1.55127365E+02   #  w1ss           
   1000025    -3.85514954E+02   #  z3ss           
   1000035     4.10662415E+02   #  z4ss           
   1000037     4.06707031E+02   #  w2ss           
   2000001     6.21713684E+02   #  dnr            
   2000002     6.21711182E+02   #  upr            
   2000003     6.21713745E+02   #  str            
   2000004     6.21712708E+02   #  chr            
   2000005     6.19550049E+02   #  b2             
   2000006     6.06806152E+02   #  t2             
   2000011     4.09426727E+02   #  er-            
   2000013     4.09426727E+02   #  mur-           
   2000015     4.27752899E+02   #  tau2           
#  Higgs mixing
Block ALPHA   # Effective Higgs mixing parameter
         -3.35126102E-01   # alpha
Block STOPMIX   # stop mixing matrix
  1  1     4.58525568E-01   # O_{11}
  1  2    -8.88681233E-01   # O_{12}
  2  1     8.88681233E-01   # O_{21}
  2  2     4.58525568E-01   # O_{22}
Block SBOTMIX   # sbottom mixing matrix
  1  1     9.98187602E-01   # O_{11}
  1  2    -6.01792037E-02   # O_{12}
  2  1     6.01792037E-02   # O_{21}
  2  2     9.98187602E-01   # O_{22}
Block STAUMIX   # stau mixing matrix
  1  1     1.45312488E-01   # O_{11}
  1  2    -9.89385784E-01   # O_{12}
  2  1     9.89385784E-01   # O_{21}
  2  2     1.45312488E-01   # O_{22}
Block NMIX   # neutralino mixing matrix
  1  1     9.82611895E-01   #
  1  2    -9.75139588E-02   #
  1  3     1.40303209E-01   #
  1  4    -7.26636648E-02   #
  2  1    -1.38696522E-01   #
  2  2    -9.50722158E-01   #
  2  3     2.31657863E-01   #
  2  4    -1.52398497E-01   #
  3  1     4.12149169E-02   #
  3  2    -6.27567768E-02   #
  3  3    -7.00048327E-01   #
  3  4    -7.10137188E-01   #
  4  1     1.16355315E-01   #
  4  2    -2.87541270E-01   #
  4  3    -6.60743356E-01   #
  4  4     6.83519840E-01   #
Block UMIX   # chargino U mixing matrix
  1  1    -9.36737061E-01   # U_{11}
  1  2     3.50033909E-01   # U_{12}
  2  1    -3.50033909E-01   # U_{21}
  2  2    -9.36737061E-01   # U_{22}
Block VMIX   # chargino V mixing matrix
  1  1    -9.72426414E-01   # V_{11}
  1  2     2.33209953E-01   # V_{12}
  2  1    -2.33209953E-01   # V_{21}
  2  2    -9.72426414E-01   # V_{22}
Block GAUGE Q=  4.72344910E+02   #
     1     3.57524276E-01   # g`
     2     6.52401447E-01   # g_2
     3     1.21927488E+00   # g_3
Block YU Q=  4.72344910E+02   #
  3  3     9.24602151E-01   # y_t
Block YD Q=  4.72344910E+02   #
  3  3     4.43159938E-02   # y_b
Block YE Q=  4.72344910E+02   #
  3  3     3.17539573E-02   # y_tau
Block HMIX Q=  4.72344910E+02   # Higgs mixing parameters
     1     3.83037811E+02   # mu(Q)
     2     3.00000000E+00   # tan(beta)(M_{GUT})
     3     2.50287720E+02   # Higgs vev at Q
     4     3.63577281E+05   # m_A^2(Q)
Block MSOFT Q=  4.72344910E+02   # DRbar SUSY breaking parameters
     1     8.96071548E+01   # M_1(Q)          
     2     1.69170334E+02   # M_2(Q)          
     3     5.15366760E+02   # M_3(Q)          
    31     4.24380188E+02   # MeL(Q)          
    32     4.24380188E+02   # MmuL(Q)         
    33     4.24151215E+02   # MtauL(Q)        
    34     4.07292877E+02   # MeR(Q)          
    35     4.07292877E+02   # MmuR(Q)         
    36     4.06913971E+02   # MtauR(Q)        
    41     6.06355713E+02   # MqL1(Q)         
    42     6.06355713E+02   # MqL2(Q)         
    43     5.31713867E+02   # MqL3(Q)         
    44     5.95397034E+02   # MuR(Q)          
    45     5.95397034E+02   # McR(Q)          
    46     4.19604828E+02   # MtR(Q)          
    47     5.94102661E+02   # MdR(Q)          
    48     5.94102661E+02   # MsR(Q)          
    49     5.97719360E+02   # MbR(Q)          
Block AU Q=  4.72344910E+02   #
  1  1    -3.89618347E+02   # A_u
  2  2    -3.89618347E+02   # A_c
  3  3    -3.89618347E+02   # A_t
Block AD Q=  4.72344910E+02   #
  1  1    -6.21994629E+02   # A_d
  2  2    -6.21994629E+02   # A_s
  3  3    -6.21994629E+02   # A_b
Block AE Q=  4.72344910E+02   #
  1  1    -1.38729065E+02   # A_e
  2  2    -1.38729065E+02   # A_mu
  3  3    -1.38729065E+02   # A_tau
#  ISAJET decay tables in SUSY Les Houches accord format
#  Created by ISALHD. Last revision: C. Balazs, 2005 May 25
Block DCINFO                           # Program information
     1   ISASUGRA from ISAJET          # Spectrum Calculator
     2   7.79   16-DEC-2008 15:42:00   # Version number
#         PDG         Width
DECAY         6  1.14680767E+00   # TP    decays
#          BR          NDA       ID1       ID2       ID3       ID4
      3.33333343E-01    3            2        -1         5             # TP     -->  UP     DB     BT          
      3.33333343E-01    3            4        -3         5             # TP     -->  CH     SB     BT          
      1.11111112E-01    3          -11        12         5             # TP     -->  E+     NUE    BT          
      1.11111112E-01    3          -13        14         5             # TP     -->  MU+    NUM    BT          
      1.11111112E-01    3          -15        16         5             # TP     -->  TAU+   NUT    BT          
#         PDG         Width
DECAY   1000021  4.75977361E-02   # GLSS  decays
#          BR          NDA       ID1       ID2       ID3       ID4
      7.83146098E-02    3      1000024         1        -2             # GLSS   -->  W1SS+  DN     UB          
      7.83146098E-02    3     -1000024         2        -1             # GLSS   -->  W1SS-  UP     DB          
      7.83138871E-02    3      1000024         3        -4             # GLSS   -->  W1SS+  ST     CB          
      7.83138871E-02    3     -1000024         4        -3             # GLSS   -->  W1SS-  CH     SB          
      1.14066564E-01    3      1000024         5        -6             # GLSS   -->  W1SS+  BT     TB          
      1.14066564E-01    3     -1000024         6        -5             # GLSS   -->  W1SS-  TP     BB          
      4.04717954E-04    3      1000037         1        -2             # GLSS   -->  W2SS+  DN     UB          
      4.04717954E-04    3     -1000037         2        -1             # GLSS   -->  W2SS-  UP     DB          
      4.04714228E-04    3      1000037         3        -4             # GLSS   -->  W2SS+  ST     CB          
      4.04714228E-04    3     -1000037         4        -3             # GLSS   -->  W2SS-  CH     SB          
      2.82637804E-04    2      1000022        21                       # GLSS   -->  Z1SS   GL                 
      3.19332480E-02    3      1000022         2        -2             # GLSS   -->  Z1SS   UP     UB          
      1.18710585E-02    3      1000022         1        -1             # GLSS   -->  Z1SS   DN     DB          
      1.18710538E-02    3      1000022         3        -3             # GLSS   -->  Z1SS   ST     SB          
      3.19326483E-02    3      1000022         4        -4             # GLSS   -->  Z1SS   CH     CB          
      2.37326603E-02    3      1000022         5        -5             # GLSS   -->  Z1SS   BT     BB          
      2.57482417E-02    3      1000022         6        -6             # GLSS   -->  Z1SS   TP     TB          
      2.88140099E-03    2      1000023        21                       # GLSS   -->  Z2SS   GL                 
      4.22245637E-02    3      1000023         2        -2             # GLSS   -->  Z2SS   UP     UB          
      3.58222313E-02    3      1000023         1        -1             # GLSS   -->  Z2SS   DN     DB          
      3.58222313E-02    3      1000023         3        -3             # GLSS   -->  Z2SS   ST     SB          
      4.22238261E-02    3      1000023         4        -4             # GLSS   -->  Z2SS   CH     CB          
      1.47089392E-01    3      1000023         5        -5             # GLSS   -->  Z2SS   BT     BB          
      5.19095175E-03    3      1000023         6        -6             # GLSS   -->  Z2SS   TP     TB          
      2.86296103E-03    2      1000025        21                       # GLSS   -->  Z3SS   GL                 
      6.48705600E-06    3      1000025         2        -2             # GLSS   -->  Z3SS   UP     UB          
      7.62717673E-06    3      1000025         1        -1             # GLSS   -->  Z3SS   DN     DB          
      7.62717627E-06    3      1000025         3        -3             # GLSS   -->  Z3SS   ST     SB          
      6.48688047E-06    3      1000025         4        -4             # GLSS   -->  Z3SS   CH     CB          
      2.35699801E-04    3      1000025         5        -5             # GLSS   -->  Z3SS   BT     BB          
      2.52800481E-03    2      1000035        21                       # GLSS   -->  Z4SS   GL                 
      1.76802263E-04    3      1000035         2        -2             # GLSS   -->  Z4SS   UP     UB          
      2.02671203E-04    3      1000035         1        -1             # GLSS   -->  Z4SS   DN     DB          
      2.02671203E-04    3      1000035         3        -3             # GLSS   -->  Z4SS   ST     SB          
      1.76797781E-04    3      1000035         4        -4             # GLSS   -->  Z4SS   CH     CB          
      1.95100612E-03    3      1000035         5        -5             # GLSS   -->  Z4SS   BT     BB          
#         PDG         Width
DECAY   1000002  8.67423439E+00   # UPL   decays
#          BR          NDA       ID1       ID2       ID3       ID4
      2.01296038E-03    2      1000022         2                       # UPL    -->  Z1SS   UP                 
      2.57372141E-01    2      1000023         2                       # UPL    -->  Z2SS   UP                 
      3.67567205E-04    2      1000025         2                       # UPL    -->  Z3SS   UP                 
      7.23453378E-03    2      1000035         2                       # UPL    -->  Z4SS   UP                 
      2.09857106E-01    2      1000021         2                       # UPL    -->  GLSS   UP                 
      5.11738658E-01    2      1000024         1                       # UPL    -->  W1SS+  DN                 
      1.14170900E-02    2      1000037         1                       # UPL    -->  W2SS+  DN                 
#         PDG         Width
DECAY   1000001  8.70865250E+00   # DNL   decays
#          BR          NDA       ID1       ID2       ID3       ID4
      2.28463355E-02    2      1000022         1                       # DNL    -->  Z1SS   DN                 
      2.32265264E-01    2      1000023         1                       # DNL    -->  Z2SS   DN                 
      6.07005088E-04    2      1000025         1                       # DNL    -->  Z3SS   DN                 
      9.94973257E-03    2      1000035         1                       # DNL    -->  Z4SS   DN                 
      2.31170267E-01    2      1000021         1                       # DNL    -->  GLSS   DN                 
      4.76895660E-01    2     -1000024         2                       # DNL    -->  W1SS-  UP                 
      2.62657329E-02    2     -1000037         2                       # DNL    -->  W2SS-  UP                 
#         PDG         Width
DECAY   1000003  8.70860481E+00   # STL   decays
#          BR          NDA       ID1       ID2       ID3       ID4
      2.28464641E-02    2      1000022         3                       # STL    -->  Z1SS   ST                 
      2.32266560E-01    2      1000023         3                       # STL    -->  Z2SS   ST                 
      6.07008464E-04    2      1000025         3                       # STL    -->  Z3SS   ST                 
      9.94978752E-03    2      1000035         3                       # STL    -->  Z4SS   ST                 
      2.31171548E-01    2      1000021         3                       # STL    -->  GLSS   ST                 
      4.76893455E-01    2     -1000024         4                       # STL    -->  W1SS-  CH                 
      2.62652021E-02    2     -1000037         4                       # STL    -->  W2SS-  CH                 
#         PDG         Width
DECAY   1000004  8.67392540E+00   # CHL   decays
#          BR          NDA       ID1       ID2       ID3       ID4
      2.01301789E-03    2      1000022         4                       # CHL    -->  Z1SS   CH                 
      2.57379383E-01    2      1000023         4                       # CHL    -->  Z2SS   CH                 
      3.67574685E-04    2      1000025         4                       # CHL    -->  Z3SS   CH                 
      7.23465858E-03    2      1000035         4                       # CHL    -->  Z4SS   CH                 
      2.09829360E-01    2      1000021         4                       # CHL    -->  GLSS   CH                 
      5.11758387E-01    2      1000024         3                       # CHL    -->  W1SS+  ST                 
      1.14175985E-02    2      1000037         3                       # CHL    -->  W2SS+  ST                 
#         PDG         Width
DECAY   1000005  5.89576817E+00   # BT1   decays
#          BR          NDA       ID1       ID2       ID3       ID4
      2.98538096E-02    2      1000022         5                       # BT1    -->  Z1SS   BT                 
      2.89856285E-01    2      1000023         5                       # BT1    -->  Z2SS   BT                 
      9.50328831E-04    2      1000025         5                       # BT1    -->  Z3SS   BT                 
      8.19761492E-03    2      1000035         5                       # BT1    -->  Z4SS   BT                 
      4.57568198E-01    2     -1000024         6                       # BT1    -->  W1SS-  TP                 
      2.13573724E-01    2          -24   1000006                       # BT1    -->  W-     TP1                
#         PDG         Width
DECAY   1000006  2.24264431E+00   # TP1   decays
#          BR          NDA       ID1       ID2       ID3       ID4
      2.23068893E-01    2      1000022         6                       # TP1    -->  Z1SS   TP                 
      1.54962480E-01    2      1000023         6                       # TP1    -->  Z2SS   TP                 
      6.20889127E-01    2      1000024         5                       # TP1    -->  W1SS+  BT                 
      1.07945700E-03    2      1000037         5                       # TP1    -->  W2SS+  BT                 
#         PDG         Width
DECAY   2000002  2.73340654E+00   # UPR   decays
#          BR          NDA       ID1       ID2       ID3       ID4
      4.78467226E-01    2      1000022         2                       # UPR    -->  Z1SS   UP                 
      8.68183933E-03    2      1000023         2                       # UPR    -->  Z2SS   UP                 
      3.30868061E-04    2      1000025         2                       # UPR    -->  Z3SS   UP                 
      2.21186155E-03    2      1000035         2                       # UPR    -->  Z4SS   UP                 
      5.10308206E-01    2      1000021         2                       # UPR    -->  GLSS   UP                 
#         PDG         Width
DECAY   2000001  1.72961593E+00   # DNR   decays
#          BR          NDA       ID1       ID2       ID3       ID4
      1.89037800E-01    2      1000022         1                       # DNR    -->  Z1SS   DN                 
      3.43011320E-03    2      1000023         1                       # DNR    -->  Z2SS   DN                 
      1.30724031E-04    2      1000025         1                       # DNR    -->  Z3SS   DN                 
      8.73895769E-04    2      1000035         1                       # DNR    -->  Z4SS   DN                 
      8.06527495E-01    2      1000021         1                       # DNR    -->  GLSS   DN                 
#         PDG         Width
DECAY   2000003  1.72961843E+00   # STR   decays
#          BR          NDA       ID1       ID2       ID3       ID4
      1.89037532E-01    2      1000022         3                       # STR    -->  Z1SS   ST                 
      3.43010831E-03    2      1000023         3                       # STR    -->  Z2SS   ST                 
      1.30723885E-04    2      1000025         3                       # STR    -->  Z3SS   ST                 
      8.73894780E-04    2      1000035         3                       # STR    -->  Z4SS   ST                 
      8.06527734E-01    2      1000021         3                       # STR    -->  GLSS   ST                 
#         PDG         Width
DECAY   2000004  2.73308134E+00   # CHR   decays
#          BR          NDA       ID1       ID2       ID3       ID4
      4.78520721E-01    2      1000022         4                       # CHR    -->  Z1SS   CH                 
      8.68280511E-03    2      1000023         4                       # CHR    -->  Z2SS   CH                 
      3.30901996E-04    2      1000025         4                       # CHR    -->  Z3SS   CH                 
      2.21208110E-03    2      1000035         4                       # CHR    -->  Z4SS   CH                 
      5.10253489E-01    2      1000021         4                       # CHR    -->  GLSS   CH                 
#         PDG         Width
DECAY   2000005  1.67489469E+00   # BT2   decays
#          BR          NDA       ID1       ID2       ID3       ID4
      1.92884117E-01    2      1000022         5                       # BT2    -->  Z1SS   BT                 
      5.17595466E-03    2      1000023         5                       # BT2    -->  Z2SS   BT                 
      3.27103701E-03    2      1000025         5                       # BT2    -->  Z3SS   BT                 
      4.50859033E-03    2      1000035         5                       # BT2    -->  Z4SS   BT                 
      7.69698024E-01    2      1000021         5                       # BT2    -->  GLSS   BT                 
      2.76846089E-03    2     -1000024         6                       # BT2    -->  W1SS-  TP                 
      1.23651400E-02    2     -1000037         6                       # BT2    -->  W2SS-  TP                 
      9.32870246E-03    2          -24   1000006                       # BT2    -->  W-     TP1                
#         PDG         Width
DECAY   2000006  8.09847260E+00   # TP2   decays
#          BR          NDA       ID1       ID2       ID3       ID4
      2.81120569E-01    2      1000024         5                       # TP2    -->  W1SS+  BT                 
      1.33751288E-01    2      1000037         5                       # TP2    -->  W2SS+  BT                 
      1.58250943E-01    2           23   1000006                       # TP2    -->  Z0     TP1                
      8.64157826E-02    2           25   1000006                       # TP2    -->  HL0    TP1                
      1.40797812E-02    2      1000022         6                       # TP2    -->  Z1SS   TP                 
      1.24717437E-01    2      1000023         6                       # TP2    -->  Z2SS   TP                 
      5.11238202E-02    2      1000025         6                       # TP2    -->  Z3SS   TP                 
      1.50540426E-01    2      1000035         6                       # TP2    -->  Z4SS   TP                 
#         PDG         Width
DECAY   1000011  4.13790417E+00   # EL-   decays
#          BR          NDA       ID1       ID2       ID3       ID4
      7.87375644E-02    2      1000022        11                       # EL-    -->  Z1SS   E-                 
      3.44500005E-01    2      1000023        11                       # EL-    -->  Z2SS   E-                 
      2.44983275E-05    2      1000025        11                       # EL-    -->  Z3SS   E-                 
      1.31028515E-04    2      1000035        11                       # EL-    -->  Z4SS   E-                 
      5.75638771E-01    2     -1000024        12                       # EL-    -->  W1SS-  NUE                
      9.68197535E-04    2     -1000037        12                       # EL-    -->  W2SS-  NUE                
#         PDG         Width
DECAY   1000013  4.13790417E+00   # MUL-  decays
#          BR          NDA       ID1       ID2       ID3       ID4
      7.87375495E-02    2      1000022        13                       # MUL-   -->  Z1SS   MU-                
      3.44499946E-01    2      1000023        13                       # MUL-   -->  Z2SS   MU-                
      2.44982730E-05    2      1000025        13                       # MUL-   -->  Z3SS   MU-                
      1.31026376E-04    2      1000035        13                       # MUL-   -->  Z4SS   MU-                
      5.75638771E-01    2     -1000024        14                       # MUL-   -->  W1SS-  NUM                
      9.68200096E-04    2     -1000037        14                       # MUL-   -->  W2SS-  NUM                
#         PDG         Width
DECAY   1000015  1.93335605E+00   # TAU1- decays
#          BR          NDA       ID1       ID2       ID3       ID4
      9.37171817E-01    2      1000022        15                       # TAU1-  -->  Z1SS   TAU-               
      3.21593098E-02    2      1000023        15                       # TAU1-  -->  Z2SS   TAU-               
      3.24029679E-05    2      1000025        15                       # TAU1-  -->  Z3SS   TAU-               
      3.06364913E-02    2     -1000024        16                       # TAU1-  -->  W1SS-  NUT                
      4.02964506E-09    2     -1000037        16                       # TAU1-  -->  W2SS-  NUT                
#         PDG         Width
DECAY   1000012  4.17960548E+00   # NUEL  decays
#          BR          NDA       ID1       ID2       ID3       ID4
      1.58974007E-01    2      1000022        12                       # NUEL   -->  Z1SS   NUE                
      2.41299897E-01    2      1000023        12                       # NUEL   -->  Z2SS   NUE                
      8.13656952E-05    2      1000025        12                       # NUEL   -->  Z3SS   NUE                
      1.27317631E-04    2      1000035        12                       # NUEL   -->  Z4SS   NUE                
      5.99307120E-01    2      1000024        11                       # NUEL   -->  W1SS+  E-                 
      2.10316037E-04    2      1000037        11                       # NUEL   -->  W2SS+  E-                 
#         PDG         Width
DECAY   1000014  4.17960453E+00   # NUML  decays
#          BR          NDA       ID1       ID2       ID3       ID4
      1.58974022E-01    2      1000022        14                       # NUML   -->  Z1SS   NUM                
      2.41299927E-01    2      1000023        14                       # NUML   -->  Z2SS   NUM                
      8.13657025E-05    2      1000025        14                       # NUML   -->  Z3SS   NUM                
      1.27317646E-04    2      1000035        14                       # NUML   -->  Z4SS   NUM                
      5.99307001E-01    2      1000024        13                       # NUML   -->  W1SS+  MU-                
      2.10310303E-04    2      1000037        13                       # NUML   -->  W2SS+  MU-                
#         PDG         Width
DECAY   1000016  4.17636299E+00   # NUTL  decays
#          BR          NDA       ID1       ID2       ID3       ID4
      1.58994421E-01    2      1000022        16                       # NUTL   -->  Z1SS   NUT                
      2.41267562E-01    2      1000023        16                       # NUTL   -->  Z2SS   NUT                
      8.04514129E-05    2      1000025        16                       # NUTL   -->  Z3SS   NUT                
      1.21942969E-04    2      1000035        16                       # NUTL   -->  Z4SS   NUT                
      5.99315345E-01    2      1000024        15                       # NUTL   -->  W1SS+  TAU-               
      2.20217553E-04    2      1000037        15                       # NUTL   -->  W2SS+  TAU-               
      3.88547555E-10    3      1000015        16       -15             # NUTL   -->  TAU1-  NUT    TAU+        
      3.88547527E-10    3      1000015        12       -11             # NUTL   -->  TAU1-  NUE    E+          
      3.88547527E-10    3      1000015        14       -13             # NUTL   -->  TAU1-  NUM    MU+         
      1.16564269E-09    3      1000015         2        -1             # NUTL   -->  TAU1-  UP     DB          
      1.16564269E-09    3      1000015         4        -3             # NUTL   -->  TAU1-  CH     SB          
#         PDG         Width
DECAY   2000011  1.87415075E+00   # ER-   decays
#          BR          NDA       ID1       ID2       ID3       ID4
      9.84368980E-01    2      1000022        11                       # ER-    -->  Z1SS   E-                 
      1.56067237E-02    2      1000023        11                       # ER-    -->  Z2SS   E-                 
      2.42699425E-05    2      1000025        11                       # ER-    -->  Z3SS   E-                 
#         PDG         Width
DECAY   2000013  1.87415051E+00   # MUR-  decays
#          BR          NDA       ID1       ID2       ID3       ID4
      9.84368980E-01    2      1000022        13                       # MUR-   -->  Z1SS   MU-                
      1.56067219E-02    2      1000023        13                       # MUR-   -->  Z2SS   MU-                
      2.42696988E-05    2      1000025        13                       # MUR-   -->  Z3SS   MU-                
#         PDG         Width
DECAY   2000015  4.07361984E+00   # TAU2- decays
#          BR          NDA       ID1       ID2       ID3       ID4
      8.75994787E-02    2      1000022        15                       # TAU2-  -->  Z1SS   TAU-               
      3.41542155E-01    2      1000023        15                       # TAU2-  -->  Z2SS   TAU-               
      7.82396091E-05    2      1000025        15                       # TAU2-  -->  Z3SS   TAU-               
      1.59310090E-04    2      1000035        15                       # TAU2-  -->  Z4SS   TAU-               
      5.69605589E-01    2     -1000024        16                       # TAU2-  -->  W1SS-  NUT                
      1.01518293E-03    2     -1000037        16                       # TAU2-  -->  W2SS-  NUT                
#         PDG         Width
DECAY   1000023  2.75513617E-06   # Z2SS  decays
#          BR          NDA       ID1       ID2       ID3       ID4
      1.12600566E-04    2      1000022        22                       # Z2SS   -->  Z1SS   GM                 
      7.19956006E-07    3     -1000024         2        -1             # Z2SS   -->  W1SS-  UP     DB          
      2.39985326E-07    3     -1000024        12       -11             # Z2SS   -->  W1SS-  NUE    E+          
      2.39985326E-07    3     -1000024        14       -13             # Z2SS   -->  W1SS-  NUM    MU+         
      7.19955949E-07    3      1000024         1        -2             # Z2SS   -->  W1SS+  DN     UB          
      2.39985326E-07    3      1000024        11       -12             # Z2SS   -->  W1SS+  E-     ANUE        
      2.39985326E-07    3      1000024        13       -14             # Z2SS   -->  W1SS+  MU-    ANUM        
      1.44180566E-01    3      1000022         2        -2             # Z2SS   -->  Z1SS   UP     UB          
      2.12091431E-01    3      1000022         1        -1             # Z2SS   -->  Z1SS   DN     DB          
      2.12091431E-01    3      1000022         3        -3             # Z2SS   -->  Z1SS   ST     SB          
      1.44180477E-01    3      1000022         4        -4             # Z2SS   -->  Z1SS   CH     CB          
      2.30511248E-01    3      1000022         5        -5             # Z2SS   -->  Z1SS   BT     BB          
      6.63147448E-03    3      1000022        11       -11             # Z2SS   -->  Z1SS   E-     E+          
      6.63147448E-03    3      1000022        13       -13             # Z2SS   -->  Z1SS   MU-    MU+         
      8.76150373E-03    3      1000022        15       -15             # Z2SS   -->  Z1SS   TAU-   TAU+        
      1.16138393E-02    3      1000022        12       -12             # Z2SS   -->  Z1SS   NUE    ANUE        
      1.16138393E-02    3      1000022        14       -14             # Z2SS   -->  Z1SS   NUM    ANUM        
      1.15777105E-02    3      1000022        16       -16             # Z2SS   -->  Z1SS   NUT    ANUT        
#         PDG         Width
DECAY   1000025  2.74311757E+00   # Z3SS  decays
#          BR          NDA       ID1       ID2       ID3       ID4
      3.51850503E-07    2      1000022        22                       # Z3SS   -->  Z1SS   GM                 
      1.84340109E-07    2      1000023        22                       # Z3SS   -->  Z2SS   GM                 
      3.09371352E-01    2      1000024       -24                       # Z3SS   -->  W1SS+  W-                 
      3.09371352E-01    2     -1000024        24                       # Z3SS   -->  W1SS-  W+                 
      1.22032955E-01    2      1000022        23                       # Z3SS   -->  Z1SS   Z0                 
      2.36618862E-01    2      1000023        23                       # Z3SS   -->  Z2SS   Z0                 
      1.08994112E-08    3      1000022         2        -2             # Z3SS   -->  Z1SS   UP     UB          
      8.19718693E-09    3      1000022         1        -1             # Z3SS   -->  Z1SS   DN     DB          
      8.19718693E-09    3      1000022         3        -3             # Z3SS   -->  Z1SS   ST     SB          
      1.08992779E-08    3      1000022         4        -4             # Z3SS   -->  Z1SS   CH     CB          
      1.05217381E-07    3      1000022         5        -5             # Z3SS   -->  Z1SS   BT     BB          
      2.91254054E-07    3      1000022        11       -11             # Z3SS   -->  Z1SS   E-     E+          
      2.91254025E-07    3      1000022        13       -13             # Z3SS   -->  Z1SS   MU-    MU+         
      8.27273084E-07    3      1000022        15       -15             # Z3SS   -->  Z1SS   TAU-   TAU+        
      2.51614324E-07    3      1000022        12       -12             # Z3SS   -->  Z1SS   NUE    ANUE        
      2.51614324E-07    3      1000022        14       -14             # Z3SS   -->  Z1SS   NUM    ANUM        
      2.52894324E-07    3      1000022        16       -16             # Z3SS   -->  Z1SS   NUT    ANUT        
      2.34718076E-08    3      1000023         2        -2             # Z3SS   -->  Z2SS   UP     UB          
      3.29546808E-08    3      1000023         1        -1             # Z3SS   -->  Z2SS   DN     DB          
      3.29546808E-08    3      1000023         3        -3             # Z3SS   -->  Z2SS   ST     SB          
      2.34715252E-08    3      1000023         4        -4             # Z3SS   -->  Z2SS   CH     CB          
      2.23826902E-07    3      1000023         5        -5             # Z3SS   -->  Z2SS   BT     BB          
      6.15104057E-08    3      1000023        11       -11             # Z3SS   -->  Z2SS   E-     E+          
      6.15103701E-08    3      1000023        13       -13             # Z3SS   -->  Z2SS   MU-    MU+         
      2.13656264E-07    3      1000023        15       -15             # Z3SS   -->  Z2SS   TAU-   TAU+        
      2.25089664E-07    3      1000023        12       -12             # Z3SS   -->  Z2SS   NUE    ANUE        
      2.25089664E-07    3      1000023        14       -14             # Z3SS   -->  Z2SS   NUM    ANUM        
      2.26382070E-07    3      1000023        16       -16             # Z3SS   -->  Z2SS   NUT    ANUT        
      1.21108359E-02    2      1000022        25                       # Z3SS   -->  Z1SS   HL0                
      1.04904482E-02    2      1000023        25                       # Z3SS   -->  Z2SS   HL0                
#         PDG         Width
DECAY   1000035  2.90850520E+00   # Z4SS  decays
#          BR          NDA       ID1       ID2       ID3       ID4
      1.04212268E-06    2      1000022        22                       # Z4SS   -->  Z1SS   GM                 
      5.72745705E-07    2      1000023        22                       # Z4SS   -->  Z2SS   GM                 
      4.16078416E-09    2      1000025        22                       # Z4SS   -->  Z3SS   GM                 
      3.39856178E-01    2      1000024       -24                       # Z4SS   -->  W1SS+  W-                 
      3.39856178E-01    2     -1000024        24                       # Z4SS   -->  W1SS-  W+                 
      1.63707908E-10    3     -1000037         2        -1             # Z4SS   -->  W2SS-  UP     DB          
      5.45693039E-11    3     -1000037        12       -11             # Z4SS   -->  W2SS-  NUE    E+          
      5.45693039E-11    3     -1000037        14       -13             # Z4SS   -->  W2SS-  NUM    MU+         
      1.63707908E-10    3      1000037         1        -2             # Z4SS   -->  W2SS+  DN     UB          
      5.45693039E-11    3      1000037        11       -12             # Z4SS   -->  W2SS+  E-     ANUE        
      5.45693039E-11    3      1000037        13       -14             # Z4SS   -->  W2SS+  MU-    ANUM        
      1.63707908E-10    3     -1000037         4        -3             # Z4SS   -->  W2SS-  CH     SB          
      5.45693039E-11    3     -1000037        16       -15             # Z4SS   -->  W2SS-  NUT    TAU+        
      1.63707908E-10    3      1000037         3        -4             # Z4SS   -->  W2SS+  ST     CB          
      5.45693039E-11    3      1000037        15       -16             # Z4SS   -->  W2SS+  TAU-   ANUT        
      1.34783434E-02    2      1000022        23                       # Z4SS   -->  Z1SS   Z0                 
      1.32518960E-02    2      1000023        23                       # Z4SS   -->  Z2SS   Z0                 
      2.34101620E-07    3      1000022         2        -2             # Z4SS   -->  Z1SS   UP     UB          
      3.78080387E-07    3      1000022         1        -1             # Z4SS   -->  Z1SS   DN     DB          
      3.78080387E-07    3      1000022         3        -3             # Z4SS   -->  Z1SS   ST     SB          
      2.34098707E-07    3      1000022         4        -4             # Z4SS   -->  Z1SS   CH     CB          
      7.99991767E-07    3      1000022         5        -5             # Z4SS   -->  Z1SS   BT     BB          
      2.00712407E-06    3      1000022        11       -11             # Z4SS   -->  Z1SS   E-     E+          
      2.00712270E-06    3      1000022        13       -13             # Z4SS   -->  Z1SS   MU-    MU+         
      2.53665144E-06    3      1000022        15       -15             # Z4SS   -->  Z1SS   TAU-   TAU+        
      1.22298434E-05    3      1000022        12       -12             # Z4SS   -->  Z1SS   NUE    ANUE        
      1.22298434E-05    3      1000022        14       -14             # Z4SS   -->  Z1SS   NUM    ANUM        
      1.23144573E-05    3      1000022        16       -16             # Z4SS   -->  Z1SS   NUT    ANUT        
      1.97044437E-06    3      1000023         2        -2             # Z4SS   -->  Z2SS   UP     UB          
      2.30087949E-06    3      1000023         1        -1             # Z4SS   -->  Z2SS   DN     DB          
      2.30087949E-06    3      1000023         3        -3             # Z4SS   -->  Z2SS   ST     SB          
      1.97042050E-06    3      1000023         4        -4             # Z4SS   -->  Z2SS   CH     CB          
      4.78458333E-06    3      1000023         5        -5             # Z4SS   -->  Z2SS   BT     BB          
      7.15317356E-06    3      1000023        11       -11             # Z4SS   -->  Z2SS   E-     E+          
      7.15316764E-06    3      1000023        13       -13             # Z4SS   -->  Z2SS   MU-    MU+         
      7.74793261E-06    3      1000023        15       -15             # Z4SS   -->  Z2SS   TAU-   TAU+        
      1.54560184E-05    3      1000023        12       -12             # Z4SS   -->  Z2SS   NUE    ANUE        
      1.54560184E-05    3      1000023        14       -14             # Z4SS   -->  Z2SS   NUM    ANUM        
      1.55724283E-05    3      1000023        16       -16             # Z4SS   -->  Z2SS   NUT    ANUT        
      3.74868847E-07    3      1000025         2        -2             # Z4SS   -->  Z3SS   UP     UB          
      4.84555414E-07    3      1000025         1        -1             # Z4SS   -->  Z3SS   DN     DB          
      4.84555414E-07    3      1000025         3        -3             # Z4SS   -->  Z3SS   ST     SB          
      3.74868847E-07    3      1000025         4        -4             # Z4SS   -->  Z3SS   CH     CB          
      3.11263221E-07    3      1000025         5        -5             # Z4SS   -->  Z3SS   BT     BB          
      1.10361512E-07    3      1000025        11       -11             # Z4SS   -->  Z3SS   E-     E+          
      1.10361512E-07    3      1000025        13       -13             # Z4SS   -->  Z3SS   MU-    MU+         
      1.03081149E-07    3      1000025        15       -15             # Z4SS   -->  Z3SS   TAU-   TAU+        
      2.13630884E-07    3      1000025        12       -12             # Z4SS   -->  Z3SS   NUE    ANUE        
      2.13630884E-07    3      1000025        14       -14             # Z4SS   -->  Z3SS   NUM    ANUM        
      2.13575589E-07    3      1000025        16       -16             # Z4SS   -->  Z3SS   NUT    ANUT        
      9.67857763E-02    2      1000022        25                       # Z4SS   -->  Z1SS   HL0                
      1.96638823E-01    2      1000023        25                       # Z4SS   -->  Z2SS   HL0                
      1.75532037E-07    2      2000011       -11                       # Z4SS   -->  ER-    E+                 
      1.75532037E-07    2     -2000011        11                       # Z4SS   -->  ER+    E-                 
      1.74899085E-07    2      2000013       -13                       # Z4SS   -->  MUR-   MU+                
      1.74899085E-07    2     -2000013        13                       # Z4SS   -->  MUR+   MU-                
      1.36987808E-07    2      1000015       -15                       # Z4SS   -->  TAU1-  TAU+               
      1.36987808E-07    2     -1000015        15                       # Z4SS   -->  TAU1+  TAU-               
#         PDG         Width
DECAY   1000024  1.30956032E-04   # W1SS+ decays
#          BR          NDA       ID1       ID2       ID3       ID4
      3.34617794E-01    3      1000022         2        -1             # W1SS+  -->  Z1SS   UP     DB          
      3.34617794E-01    3      1000022         4        -3             # W1SS+  -->  Z1SS   CH     SB          
      1.10252462E-01    3      1000022       -11        12             # W1SS+  -->  Z1SS   E+     NUE         
      1.10252462E-01    3      1000022       -13        14             # W1SS+  -->  Z1SS   MU+    NUM         
      1.10259548E-01    3      1000022       -15        16             # W1SS+  -->  Z1SS   TAU+   NUT         
#         PDG         Width
DECAY   1000037  2.91804171E+00   # W2SS+ decays
#          BR          NDA       ID1       ID2       ID3       ID4
      3.98050844E-07    3      1000022         2        -1             # W2SS+  -->  Z1SS   UP     DB          
      3.98050503E-07    3      1000022         4        -3             # W2SS+  -->  Z1SS   CH     SB          
      9.12064934E-06    3      1000022       -11        12             # W2SS+  -->  Z1SS   E+     NUE         
      9.12064752E-06    3      1000022       -13        14             # W2SS+  -->  Z1SS   MU+    NUM         
      9.82533311E-06    3      1000022       -15        16             # W2SS+  -->  Z1SS   TAU+   NUT         
      5.28428890E-02    2      1000022        24                       # W2SS+  -->  Z1SS   W+                 
      1.90103958E-06    3      1000023         2        -1             # W2SS+  -->  Z2SS   UP     DB          
      1.90103367E-06    3      1000023         4        -3             # W2SS+  -->  Z2SS   CH     SB          
      1.28473612E-05    3      1000023       -11        12             # W2SS+  -->  Z2SS   E+     NUE         
      1.28473521E-05    3      1000023       -13        14             # W2SS+  -->  Z2SS   MU+    NUM         
      1.30136195E-05    3      1000023       -15        16             # W2SS+  -->  Z2SS   TAU+   NUT         
      3.77105772E-01    2      1000023        24                       # W2SS+  -->  Z2SS   W+                 
      5.60299043E-07    3      1000025         2        -1             # W2SS+  -->  Z3SS   UP     DB          
      5.60299043E-07    3      1000025         4        -3             # W2SS+  -->  Z3SS   CH     SB          
      1.86234146E-07    3      1000025       -11        12             # W2SS+  -->  Z3SS   E+     NUE         
      1.86234146E-07    3      1000025       -13        14             # W2SS+  -->  Z3SS   MU+    NUM         
      1.86319880E-07    3      1000025       -15        16             # W2SS+  -->  Z3SS   TAU+   NUT         
      3.20480645E-01    2      1000024        23                       # W2SS+  -->  W1SS+  Z0                 
      2.02715410E-06    3      1000024         1        -1             # W2SS+  -->  W1SS+  DN     DB          
      2.02712931E-06    3      1000024         3        -3             # W2SS+  -->  W1SS+  ST     SB          
      4.09531503E-06    3      1000024         2        -2             # W2SS+  -->  W1SS+  UP     UB          
      4.09531503E-06    3      1000024         4        -4             # W2SS+  -->  W1SS+  CH     CB          
      2.03261661E-05    3      1000024        12       -12             # W2SS+  -->  W1SS+  NUE    ANUE        
      2.03261498E-05    3      1000024        14       -14             # W2SS+  -->  W1SS+  NUM    ANUM        
      4.04593193E-05    3      1000024        16       -16             # W2SS+  -->  W1SS+  NUT    ANUT        
      1.16882802E-05    3      1000024        11       -11             # W2SS+  -->  W1SS+  E-     E+          
      1.16882802E-05    3      1000024        13       -13             # W2SS+  -->  W1SS+  MU-    MU+         
      1.17734844E-05    3      1000024        15       -15             # W2SS+  -->  W1SS+  TAU-   TAU+        
      2.49369130E-01    2      1000024        25                       # W2SS+  -->  W1SS+  HL0                
#         PDG         Width
DECAY        25  3.48339276E-03   # HL0   decays
#          BR          NDA       ID1       ID2       ID3       ID4
      5.08922415E-09    2           11       -11                       # HL0    -->  E-     E+                 
      2.14874686E-04    2           13       -13                       # HL0    -->  MU-    MU+                
      6.14185221E-02    2           15       -15                       # HL0    -->  TAU-   TAU+               
      6.40489225E-06    2            1        -1                       # HL0    -->  DN     DB                 
      2.58789584E-03    2            3        -3                       # HL0    -->  ST     SB                 
      8.69667113E-01    2            5        -5                       # HL0    -->  BT     BB                 
      1.87742080E-06    2            2        -2                       # HL0    -->  UP     UB                 
      3.63230482E-02    2            4        -4                       # HL0    -->  CH     CB                 
      1.16599130E-03    2           22        22                       # HL0    -->  GM     GM                 
      2.69554798E-02    2           21        21                       # HL0    -->  GL     GL                 
      9.21545870E-05    3           24        11       -12             # HL0    -->  W+     E-     ANUE        
      9.21545870E-05    3           24        13       -14             # HL0    -->  W+     MU-    ANUM        
      9.21545870E-05    3           24        15       -16             # HL0    -->  W+     TAU-   ANUT        
      2.76463776E-04    3           24        -2         1             # HL0    -->  W+     UB     DN          
      2.76463776E-04    3           24        -4         3             # HL0    -->  W+     CB     ST          
      9.21545870E-05    3          -24       -11        12             # HL0    -->  W-     E+     NUE         
      9.21545870E-05    3          -24       -13        14             # HL0    -->  W-     MU+    NUM         
      9.21545870E-05    3          -24       -15        16             # HL0    -->  W-     TAU+   NUT         
      2.76463776E-04    3          -24         2        -1             # HL0    -->  W-     UP     DB          
      2.76463776E-04    3          -24         4        -3             # HL0    -->  W-     CH     SB          
#         PDG         Width
DECAY        35  5.07974672E+00   # HH0   decays
#          BR          NDA       ID1       ID2       ID3       ID4
      1.81854198E-10    2           11       -11                       # HH0    -->  E-     E+                 
      7.67821075E-06    2           13       -13                       # HH0    -->  MU-    MU+                
      2.19904538E-03    2           15       -15                       # HH0    -->  TAU-   TAU+               
      2.23748486E-07    2            1        -1                       # HH0    -->  DN     DB                 
      9.04057160E-05    2            3        -3                       # HH0    -->  ST     SB                 
      1.36228129E-02    2            5        -5                       # HH0    -->  BT     BB                 
      9.64798907E-10    2            2        -2                       # HH0    -->  UP     UB                 
      1.44387704E-05    2            4        -4                       # HH0    -->  CH     CB                 
      4.74371552E-01    2            6        -6                       # HH0    -->  TP     TB                 
      6.93323818E-06    2           22        22                       # HH0    -->  GM     GM                 
      6.17094105E-04    2           21        21                       # HH0    -->  GL     GL                 
      2.33783154E-03    2           24       -24                       # HH0    -->  W+     W-                 
      1.16488268E-03    2           23        23                       # HH0    -->  Z0     Z0                 
      4.30139713E-03    2      1000022   1000022                       # HH0    -->  Z1SS   Z1SS               
      1.59652326E-02    2      1000022   1000023                       # HH0    -->  Z1SS   Z2SS               
      6.65704831E-02    2      1000022   1000025                       # HH0    -->  Z1SS   Z3SS               
      3.97949759E-03    2      1000022   1000035                       # HH0    -->  Z1SS   Z4SS               
      1.39121963E-02    2      1000023   1000023                       # HH0    -->  Z2SS   Z2SS               
      1.08615309E-01    2      1000023   1000025                       # HH0    -->  Z2SS   Z3SS               
      1.91480375E-03    2      1000023   1000035                       # HH0    -->  Z2SS   Z4SS               
      4.01344001E-02    2      1000024  -1000024                       # HH0    -->  W1SS+  W1SS-              
      1.21673457E-01    2      1000024  -1000037                       # HH0    -->  W1SS+  W2SS-              
      1.21673457E-01    2     -1000024   1000037                       # HH0    -->  W1SS-  W2SS+              
      6.82690227E-03    2           25        25                       # HH0    -->  HL0    HL0                
#         PDG         Width
DECAY        36  5.71850920E+00   # HA0   decays
#          BR          NDA       ID1       ID2       ID3       ID4
      1.61269123E-10    2           11       -11                       # HA0    -->  E-     E+                 
      6.80907351E-06    2           13       -13                       # HA0    -->  MU-    MU+                
      1.95018924E-03    2           15       -15                       # HA0    -->  TAU-   TAU+               
      1.98440858E-07    2            1        -1                       # HA0    -->  DN     DB                 
      8.01801507E-05    2            3        -3                       # HA0    -->  ST     SB                 
      1.20835379E-02    2            5        -5                       # HA0    -->  BT     BB                 
      7.83884291E-10    2            2        -2                       # HA0    -->  UP     UB                 
      1.17471418E-05    2            4        -4                       # HA0    -->  CH     CB                 
      5.44978321E-01    2            6        -6                       # HA0    -->  TP     TB                 
      9.99509894E-07    2           22        22                       # HA0    -->  GM     GM                 
      5.06257580E-04    2           21        21                       # HA0    -->  GL     GL                 
      8.44246708E-03    2      1000022   1000022                       # HA0    -->  Z1SS   Z1SS               
      3.76307592E-02    2      1000022   1000023                       # HA0    -->  Z1SS   Z2SS               
      6.76286686E-03    2      1000022   1000025                       # HA0    -->  Z1SS   Z3SS               
      3.51035036E-02    2      1000022   1000035                       # HA0    -->  Z1SS   Z4SS               
      4.16932330E-02    2      1000023   1000023                       # HA0    -->  Z2SS   Z2SS               
      4.54572774E-03    2      1000023   1000025                       # HA0    -->  Z2SS   Z3SS               
      4.66177873E-02    2      1000023   1000035                       # HA0    -->  Z2SS   Z4SS               
      1.16960607E-01    2      1000024  -1000024                       # HA0    -->  W1SS+  W1SS-              
      7.03420863E-02    2      1000024  -1000037                       # HA0    -->  W1SS+  W2SS-              
      7.03420863E-02    2     -1000024   1000037                       # HA0    -->  W1SS-  W2SS+              
      1.94062770E-03    2           25        23                       # HA0    -->  HL0    Z0                 
#         PDG         Width
DECAY        37  5.24249506E+00   # H+    decays
#          BR          NDA       ID1       ID2       ID3       ID4
      1.78559140E-10    2           12       -11                       # H+     -->  NUE    E+                 
      7.53908853E-06    2           14       -13                       # H+     -->  NUM    MU+                
      2.15927418E-03    2           16       -15                       # H+     -->  NUT    TAU+               
      2.01857134E-07    2            2        -1                       # H+     -->  UP     DB                 
      9.31187533E-05    2            4        -3                       # H+     -->  CH     SB                 
      5.38903773E-01    2            6        -5                       # H+     -->  TP     BB                 
      4.60546166E-02    2      1000024   1000022                       # H+     -->  W1SS+  Z1SS               
      1.00122101E-03    2      1000024   1000023                       # H+     -->  W1SS+  Z2SS               
      1.39744222E-01    2      1000024   1000025                       # H+     -->  W1SS+  Z3SS               
      1.08691983E-01    2      1000024   1000035                       # H+     -->  W1SS+  Z4SS               
      2.04877350E-02    2      1000037   1000022                       # H+     -->  W2SS+  Z1SS               
      1.40624940E-01    2      1000037   1000023                       # H+     -->  W2SS+  Z2SS               
      2.23141280E-03    2           25        24                       # H+     -->  HL0    W+                 
