  65
  401  11916.6104    0.89665E-27
  402  11916.3350    0.89664E-27
  403  11916.6104    0.89665E-27
  404  11916.3350    0.89664E-27
  405   1904.1830    0.65288E-26
  406   2341.7751    0.50722E-26
  407  11916.6104    0.89665E-27
  408  11916.3350    0.89664E-27
  409  11916.6104    0.89665E-27
  410  11916.3350    0.89664E-27
  411   1904.1830    0.65288E-26
  412   2341.7751    0.50722E-26
  413  11359.7871    0.11686E-26
  414  11927.3652    0.10801E-26
  415  11359.7871    0.11686E-26
  416  11927.3652    0.10801E-26
  417   3450.2712    0.16743E-26
  418   3441.1865    0.17194E-26
  419  11359.7871    0.11686E-26
  420  11927.3652    0.10801E-26
  421  11359.7871    0.11686E-26
  422  11927.3652    0.10801E-26
  423   3450.2712    0.16743E-26
  424   3441.1865    0.17194E-26
  425  11337.8984    0.41785E-26
  426  11340.8359    0.41771E-26
  427  11337.8984    0.41785E-26
  428  11340.8359    0.41771E-26
  429   5176.0630    0.10941E-25
  430   6114.4927    0.60013E-26
  431  11337.8984    0.41785E-26
  432  11340.8359    0.41771E-26
  433  11337.8984    0.41785E-26
  434  11340.8359    0.41771E-26
  435   5176.0630    0.10941E-25
  436   6114.4927    0.60013E-26
  437  11969.0322    0.10813E-25
  438      0.0000    0.10000E+31
  439  11969.0322    0.10813E-25
  440      0.0000    0.10000E+31
  441   6131.6782    0.60057E-26
  442      0.0000    0.10000E+31
  443  11969.0322    0.10813E-25
  444      0.0000    0.10000E+31
  445  11969.0322    0.10813E-25
  446      0.0000    0.10000E+31
  447   6131.6782    0.60057E-26
  448      0.0000    0.10000E+31
  449    415.7608    0.10294E-17
  450     60.7361    0.10000E+31
  451    143.4918    0.91166E-16
  452  -2263.2563    0.35835E-25
  453   2263.8625    0.30629E-25
  454    143.9670    0.19576E-17
  455   2245.2249    0.32813E-25
  456    143.9670    0.19576E-17
  457   2245.2249    0.32813E-25
  203    128.4470    0.11874E-21
  204   1818.0116    0.10466E-25
  205   1806.2614    0.10533E-25
  206   1820.9725    0.11354E-25
  207   1820.9725    0.11354E-25
  458      0.0000    0.10000E+31
    6    172.5000    0.57395E-24
   12    172.5000    0.57395E-24
   7
   401  0.23375198E-02     0   450     1     0     0     0
   401  0.68170801E-01     0   451     1     0     0     0
   401  0.47293634E-04     0   452     1     0     0     0
   401  0.42551688E-04     0   453     1     0     0     0
   401  0.79280245E+00     0   449     1     0     0     0
   401  0.13628450E+00     0   456     2     0     0     0
   401  0.31487990E-03     0   457     2     0     0     0
   6
   402  0.22480241E-02     0   450     2     0     0     0
   402  0.68290822E-01     0   451     2     0     0     0
   402  0.32143907E-04     0   452     2     0     0     0
   402  0.27740261E-04     0   453     2     0     0     0
   402  0.79278487E+00     0   449     2     0     0     0
   402  0.13661641E+00     0   454     1     0     0     0
   7
   403  0.23375198E-02     0   450     3     0     0     0
   403  0.68170801E-01     0   451     3     0     0     0
   403  0.47293634E-04     0   452     3     0     0     0
   403  0.42551688E-04     0   453     3     0     0     0
   403  0.79280245E+00     0   449     3     0     0     0
   403  0.13628450E+00     0   456     4     0     0     0
   403  0.31487990E-03     0   457     4     0     0     0
   6
   404  0.22480241E-02     0   450     4     0     0     0
   404  0.68290822E-01     0   451     4     0     0     0
   404  0.32143907E-04     0   452     4     0     0     0
   404  0.27740263E-04     0   453     4     0     0     0
   404  0.79278481E+00     0   449     4     0     0     0
   404  0.13661641E+00     0   454     3     0     0     0
   4
   405  0.10831620E-01     0   450     5     0     0     0
   405  0.80048369E-03     0   451     5     0     0     0
   405  0.98673820E+00     0   449     5     0     0     0
   405  0.16297123E-02     0   456     6     0     0     0
   6
   406  0.95296234E+00     0   449     6     0     0     0
   406  0.39320465E-01     0   450     6     0     0     0
   406  0.19493874E-02     0   451     6     0     0     0
   406  0.41564051E-02     0   454     5     0     0     0
   406  0.14895586E-02     0   455     5     0     0     0
   406  0.12184808E-03     0   198   405     0     0     0
   7
   407  0.23375198E-02     0   450     7     0     0     0
   407  0.68170801E-01     0   451     7     0     0     0
   407  0.47293634E-04     0   452     7     0     0     0
   407  0.42551688E-04     0   453     7     0     0     0
   407  0.79280245E+00     0   449     7     0     0     0
   407  0.13628450E+00     0   454     8     0     0     0
   407  0.31487990E-03     0   455     8     0     0     0
   6
   408  0.22480241E-02     0   450     8     0     0     0
   408  0.68290822E-01     0   451     8     0     0     0
   408  0.32143907E-04     0   452     8     0     0     0
   408  0.27740261E-04     0   453     8     0     0     0
   408  0.79278487E+00     0   449     8     0     0     0
   408  0.13661641E+00     0   456     7     0     0     0
   7
   409  0.23375198E-02     0   450     9     0     0     0
   409  0.68170801E-01     0   451     9     0     0     0
   409  0.47293634E-04     0   452     9     0     0     0
   409  0.42551688E-04     0   453     9     0     0     0
   409  0.79280245E+00     0   449     9     0     0     0
   409  0.13628450E+00     0   454    10     0     0     0
   409  0.31487990E-03     0   455    10     0     0     0
   6
   410  0.22480241E-02     0   450    10     0     0     0
   410  0.68290822E-01     0   451    10     0     0     0
   410  0.32143907E-04     0   452    10     0     0     0
   410  0.27740263E-04     0   453    10     0     0     0
   410  0.79278481E+00     0   449    10     0     0     0
   410  0.13661641E+00     0   456     9     0     0     0
   4
   411  0.10831620E-01     0   450    11     0     0     0
   411  0.80048369E-03     0   451    11     0     0     0
   411  0.98673820E+00     0   449    11     0     0     0
   411  0.16297123E-02     0   454    12     0     0     0
   6
   412  0.95296234E+00     0   449    12     0     0     0
   412  0.39320465E-01     0   450    12     0     0     0
   412  0.19493874E-02     0   451    12     0     0     0
   412  0.41564051E-02     0   456    11     0     0     0
   412  0.14895586E-02     0   457    11     0     0     0
   412  0.12184808E-03     0   199   411     0     0     0
   2
   413  0.11393150E-01     0   450     1     0     0     0
   413  0.98860687E+00     0   449     1     0     0     0
   2
   414  0.44224780E-01     0   450     2     0     0     0
   414  0.95577526E+00     0   449     2     0     0     0
   2
   415  0.11393150E-01     0   450     3     0     0     0
   415  0.98860687E+00     0   449     3     0     0     0
   2
   416  0.44224784E-01     0   450     4     0     0     0
   416  0.95577526E+00     0   449     4     0     0     0
  10
   417  0.12495707E-02     0   450     5     0     0     0
   417  0.36596790E-01     0   451     5     0     0     0
   417  0.16305318E-01     0   452     5     0     0     0
   417  0.16306352E-01     0   453     5     0     0     0
   417  0.46435758E+00     0   449     5     0     0     0
   417  0.72552003E-01     0   456     6     0     0     0
   417  0.37999421E-01     0   457     6     0     0     0
   417  0.26980203E+00     0   199   406     0     0     0
   417  0.23055533E-01     0   200   405     0     0     0
   417  0.61775401E-01     0   203   405     0     0     0
  10
   418  0.47136825E+00     0   449     6     0     0     0
   418  0.73586479E-01     0   454     5     0     0     0
   418  0.34025352E-01     0   455     5     0     0     0
   418  0.13380103E+00     0   200   406     0     0     0
   418  0.16728248E+00     0   203   406     0     0     0
   418  0.45014560E-01     0   198   405     0     0     0
   418  0.17238517E-02     0   450     6     0     0     0
   418  0.36525600E-01     0   451     6     0     0     0
   418  0.17810969E-01     0   452     6     0     0     0
   418  0.18861415E-01     0   453     6     0     0     0
   2
   419  0.11393150E-01     0   450     7     0     0     0
   419  0.98860687E+00     0   449     7     0     0     0
   2
   420  0.44224780E-01     0   450     8     0     0     0
   420  0.95577526E+00     0   449     8     0     0     0
   2
   421  0.11393150E-01     0   450     9     0     0     0
   421  0.98860687E+00     0   449     9     0     0     0
   2
   422  0.44224784E-01     0   450    10     0     0     0
   422  0.95577526E+00     0   449    10     0     0     0
  10
   423  0.12495707E-02     0   450    11     0     0     0
   423  0.36596790E-01     0   451    11     0     0     0
   423  0.16305318E-01     0   452    11     0     0     0
   423  0.16306352E-01     0   453    11     0     0     0
   423  0.46435758E+00     0   449    11     0     0     0
   423  0.72552003E-01     0   454    12     0     0     0
   423  0.37999421E-01     0   455    12     0     0     0
   423  0.26980203E+00     0   198   412     0     0     0
   423  0.23055533E-01     0   200   411     0     0     0
   423  0.61775401E-01     0   203   411     0     0     0
  10
   424  0.47136825E+00     0   449    12     0     0     0
   424  0.73586479E-01     0   456    11     0     0     0
   424  0.34025352E-01     0   457    11     0     0     0
   424  0.13380103E+00     0   200   412     0     0     0
   424  0.16728248E+00     0   203   412     0     0     0
   424  0.45014560E-01     0   199   411     0     0     0
   424  0.17238517E-02     0   450    12     0     0     0
   424  0.36525600E-01     0   451    12     0     0     0
   424  0.17810969E-01     0   452    12     0     0     0
   424  0.18861415E-01     0   453    12     0     0     0
   6
   425  0.90889372E-01     0   450   121     0     0     0
   425  0.30332622E+00     0   451   121     0     0     0
   425  0.87593646E-04     0   452   121     0     0     0
   425  0.70765869E-04     0   453   121     0     0     0
   425  0.60424066E+00     0   456   122     0     0     0
   425  0.13853783E-02     0   457   122     0     0     0
   6
   426  0.92071623E-01     0   450   122     0     0     0
   426  0.30168369E+00     0   451   122     0     0     0
   426  0.28750821E-03     0   452   122     0     0     0
   426  0.26621725E-03     0   453   122     0     0     0
   426  0.60567778E+00     0   454   121     0     0     0
   426  0.13146619E-04     0   455   121     0     0     0
   6
   427  0.90889372E-01     0   450   123     0     0     0
   427  0.30332622E+00     0   451   123     0     0     0
   427  0.87593646E-04     0   452   123     0     0     0
   427  0.70765869E-04     0   453   123     0     0     0
   427  0.60424066E+00     0   456   124     0     0     0
   427  0.13853783E-02     0   457   124     0     0     0
   6
   428  0.92071623E-01     0   450   124     0     0     0
   428  0.30168369E+00     0   451   124     0     0     0
   428  0.28750821E-03     0   452   124     0     0     0
   428  0.26621725E-03     0   453   124     0     0     0
   428  0.60567778E+00     0   454   123     0     0     0
   428  0.13146619E-04     0   455   123     0     0     0
   6
   429  0.43749508E+00     0   450   125     0     0     0
   429  0.13814912E-02     0   451   125     0     0     0
   429  0.13925365E+00     0   452   125     0     0     0
   429  0.13924906E+00     0   453   125     0     0     0
   429  0.28622712E-02     0   456   126     0     0     0
   429  0.27975848E+00     0   457   126     0     0     0
   7
   430  0.71311124E-01     0   450   126     0     0     0
   430  0.23350954E+00     0   451   126     0     0     0
   430  0.17991060E-03     0   452   126     0     0     0
   430  0.16656671E-03     0   453   126     0     0     0
   430  0.46948904E+00     0   454   125     0     0     0
   430  0.20666315E+00     0   455   125     0     0     0
   430  0.18680679E-01     0   198   429     0     0     0
   6
   431  0.90889372E-01     0   450   127     0     0     0
   431  0.30332622E+00     0   451   127     0     0     0
   431  0.87593646E-04     0   452   127     0     0     0
   431  0.70765869E-04     0   453   127     0     0     0
   431  0.60424066E+00     0   454   128     0     0     0
   431  0.13853783E-02     0   455   128     0     0     0
   6
   432  0.92071623E-01     0   450   128     0     0     0
   432  0.30168369E+00     0   451   128     0     0     0
   432  0.28750821E-03     0   452   128     0     0     0
   432  0.26621725E-03     0   453   128     0     0     0
   432  0.60567778E+00     0   456   127     0     0     0
   432  0.13146619E-04     0   457   127     0     0     0
   6
   433  0.90889372E-01     0   450   129     0     0     0
   433  0.30332622E+00     0   451   129     0     0     0
   433  0.87593646E-04     0   452   129     0     0     0
   433  0.70765869E-04     0   453   129     0     0     0
   433  0.60424066E+00     0   454   130     0     0     0
   433  0.13853783E-02     0   455   130     0     0     0
   6
   434  0.92071623E-01     0   450   130     0     0     0
   434  0.30168369E+00     0   451   130     0     0     0
   434  0.28750821E-03     0   452   130     0     0     0
   434  0.26621725E-03     0   453   130     0     0     0
   434  0.60567778E+00     0   456   129     0     0     0
   434  0.13146619E-04     0   457   129     0     0     0
   6
   435  0.43749508E+00     0   450   131     0     0     0
   435  0.13814912E-02     0   451   131     0     0     0
   435  0.13925365E+00     0   452   131     0     0     0
   435  0.13924906E+00     0   453   131     0     0     0
   435  0.28622712E-02     0   454   132     0     0     0
   435  0.27975848E+00     0   455   132     0     0     0
   7
   436  0.71311124E-01     0   450   132     0     0     0
   436  0.23350954E+00     0   451   132     0     0     0
   436  0.17991060E-03     0   452   132     0     0     0
   436  0.16656671E-03     0   453   132     0     0     0
   436  0.46948904E+00     0   456   131     0     0     0
   436  0.20666315E+00     0   457   131     0     0     0
   436  0.18680679E-01     0   199   435     0     0     0
   3
   437  0.99966890E+00     0   450   121     0     0     0
   437  0.15902201E-03     0   452   121     0     0     0
   437  0.17213413E-03     0   453   121     0     0     0
   0
   3
   439  0.99966890E+00     0   450   123     0     0     0
   439  0.15902201E-03     0   452   123     0     0     0
   439  0.17213413E-03     0   453   123     0     0     0
   0
   8
   441  0.70737012E-01     0   450   125     0     0     0
   441  0.23534162E+00     0   451   125     0     0     0
   441  0.10371447E+00     0   452   125     0     0     0
   441  0.10369567E+00     0   453   125     0     0     0
   441  0.46813622E+00     0   456   126     0     0     0
   441  0.16679408E-02     0   457   126     0     0     0
   441  0.99291271E-02     0   200   429     0     0     0
   441  0.67779222E-02     0   203   429     0     0     0
   0
   3
   443  0.99966890E+00     0   450   127     0     0     0
   443  0.15902201E-03     0   452   127     0     0     0
   443  0.17213413E-03     0   453   127     0     0     0
   0
   3
   445  0.99966890E+00     0   450   129     0     0     0
   445  0.15902201E-03     0   452   129     0     0     0
   445  0.17213413E-03     0   453   129     0     0     0
   0
   8
   447  0.70737012E-01     0   450   131     0     0     0
   447  0.23534162E+00     0   451   131     0     0     0
   447  0.10371447E+00     0   452   131     0     0     0
   447  0.10369567E+00     0   453   131     0     0     0
   447  0.46813622E+00     0   454   132     0     0     0
   447  0.16679408E-02     0   455   132     0     0     0
   447  0.99291271E-02     0   200   435     0     0     0
   447  0.67779222E-02     0   203   435     0     0     0
   0
  19
   449  0.31896101E-02     0   454     1     8     0     0
   449  0.31896101E-02     0   456     2     7     0     0
   449  0.31896101E-02     0   454     3    10     0     0
   449  0.31896101E-02     0   456     4     9     0     0
   449  0.45687083E-01     0   454     5    12     0     0
   449  0.45687083E-01     0   456     6    11     0     0
   449  0.21191334E-03     0   450    13     0     0     0
   449  0.16252721E-02     0   450     2     8     0     0
   449  0.56316587E-03     0   450     1     7     0     0
   449  0.56316587E-03     0   450     3     9     0     0
   449  0.16252721E-02     0   450     4    10     0     0
   449  0.62819749E+00     0   450     5    11     0     0
   449  0.80078514E-03     0   450     6    12     0     0
   449  0.11767980E-01     0   451    13     0     0     0
   449  0.16047865E-02     0   451     2     8     0     0
   449  0.16017758E-02     0   451     1     7     0     0
   449  0.16017758E-02     0   451     3     9     0     0
   449  0.16047865E-02     0   451     4    10     0     0
   449  0.24409920E+00     0   451     5    11     0     0
   0
  12
   451  0.47021019E-03     0   450    59     0     0     0
   451  0.11791764E+00     0   450     2     8     0     0
   451  0.15198000E+00     0   450     1     7     0     0
   451  0.15198000E+00     0   450     3     9     0     0
   451  0.11791764E+00     0   450     4    10     0     0
   451  0.17461322E+00     0   450     5    11     0     0
   451  0.32707661E-01     0   450   121   127     0     0
   451  0.32707661E-01     0   450   123   129     0     0
   451  0.29897822E-01     0   450   125   131     0     0
   451  0.65220274E-01     0   450   122   128     0     0
   451  0.65220274E-01     0   450   124   130     0     0
   451  0.59367638E-01     0   450   126   132     0     0
  15
   452  0.20493339E+00     0   454   199     0     0     0
   452  0.20493339E+00     0   456   198     0     0     0
   452  0.31193983E-01     0   454   207     0     0     0
   452  0.31193983E-01     0   456   206     0     0     0
   452  0.38648855E-01     0   450   200     0     0     0
   452  0.11200352E+00     0   451   200     0     0     0
   452  0.64135464E-04     0   451     5    11     0     0
   452  0.38541820E-01     0   450   203     0     0     0
   452  0.39920616E-02     0   450   204     0     0     0
   452  0.61280779E-02     0   450   205     0     0     0
   452  0.11656618E+00     0   451   203     0     0     0
   452  0.96051674E-02     0   451   204     0     0     0
   452  0.22750685E-01     0   451   205     0     0     0
   452  0.89722343E-01     0   405    11     0     0     0
   452  0.89722343E-01     0   411     5     0     0     0
  15
   453  0.23221080E+00     0   454   199     0     0     0
   453  0.23221080E+00     0   456   198     0     0     0
   453  0.26723702E-01     0   454   207     0     0     0
   453  0.26723702E-01     0   456   206     0     0     0
   453  0.30584654E-01     0   450   200     0     0     0
   453  0.10868737E+00     0   451   200     0     0     0
   453  0.54987515E-04     0   451     5    11     0     0
   453  0.33858579E-01     0   450   203     0     0     0
   453  0.50265780E-02     0   450   204     0     0     0
   453  0.36005438E-02     0   450   205     0     0     0
   453  0.11865895E+00     0   451   203     0     0     0
   453  0.18673589E-01     0   451   204     0     0     0
   453  0.87590329E-02     0   451   205     0     0     0
   453  0.77113353E-01     0   405    11     0     0     0
   453  0.77113353E-01     0   411     5     0     0     0
   2
   454  0.19080737E-04     0   450   131   126     0     0
   454  0.99998099E+00     0   450   198     0     0     0
   9
   455  0.64716056E-01     0   450   198     0     0     0
   455  0.80961846E-02     0   450   206     0     0     0
   455  0.24468520E+00     0   451   198     0     0     0
   455  0.25966955E-01     0   451   206     0     0     0
   455  0.13913159E+00     0   411     6     0     0     0
   455  0.22911181E+00     0   454   200     0     0     0
   455  0.23462307E+00     0   454   203     0     0     0
   455  0.26132459E-01     0   454   204     0     0     0
   455  0.27536720E-01     0   454   205     0     0     0
   2
   456  0.19080737E-04     0   450   125   132     0     0
   456  0.99998099E+00     0   450   199     0     0     0
   9
   457  0.64716056E-01     0   450   199     0     0     0
   457  0.80961846E-02     0   450   207     0     0     0
   457  0.24468520E+00     0   451   199     0     0     0
   457  0.25966955E-01     0   451   207     0     0     0
   457  0.13913159E+00     0   405    12     0     0     0
   457  0.22911181E+00     0   456   200     0     0     0
   457  0.23462307E+00     0   456   203     0     0     0
   457  0.26132459E-01     0   456   204     0     0     0
   457  0.27536720E-01     0   456   205     0     0     0
  28
   203  0.16874979E-03     0   123   129     0     0     0
   203  0.48277229E-01     0   125   131     0     0     0
   203  0.20235369E-02     0     3     9     0     0     0
   203  0.65303874E+00     0     5    11     0     0     0
   203  0.29222516E-01     0     4    10     0     0     0
   203  0.21141579E-02     0    59    59     0     0     0
   203  0.40018115E-01     0    13    13     0     0     0
   203  0.11162612E-01     0   198   121   128     0     0
   203  0.11162612E-01     0   198   123   130     0     0
   203  0.11162612E-01     0   198   125   132     0     0
   203  0.33487838E-01     0   198     8     1     0     0
   203  0.33487838E-01     0   198    10     3     0     0
   203  0.11162612E-01     0   199   127   122     0     0
   203  0.11162612E-01     0   199   129   124     0     0
   203  0.11162612E-01     0   199   131   126     0     0
   203  0.33487838E-01     0   199     2     7     0     0
   203  0.33487838E-01     0   199     4     9     0     0
   203  0.16557239E-02     0   200   122   128     0     0
   203  0.16557239E-02     0   200   124   130     0     0
   203  0.16557239E-02     0   200   126   132     0     0
   203  0.83330926E-03     0   200   121   127     0     0
   203  0.83330926E-03     0   200   123   129     0     0
   203  0.83330926E-03     0   200   125   131     0     0
   203  0.28548469E-02     0   200     2     8     0     0
   203  0.28548469E-02     0   200     4    10     0     0
   203  0.36777460E-02     0   200     1     7     0     0
   203  0.36777460E-02     0   200     3     9     0     0
   203  0.36777460E-02     0   200     5    11     0     0
  10
   204  0.51854760E-03     0   123   129     0     0     0
   204  0.14851913E+00     0   125   131     0     0     0
   204  0.14975437E-04     0     1     7     0     0     0
   204  0.60508344E-02     0     3     9     0     0     0
   204  0.84333342E+00     0     5    11     0     0     0
   204  0.51854888E-03     0     6    12     0     0     0
   204  0.26367770E-04     0   450   450     0     0     0
   204  0.16947274E-03     0   450   451     0     0     0
   204  0.27111353E-03     0   451   451     0     0     0
   204  0.57771185E-03     0   454   456     0     0     0
  10
   205  0.51850150E-03     0   123   129     0     0     0
   205  0.14850649E+00     0   125   131     0     0     0
   205  0.14974826E-04     0     1     7     0     0     0
   205  0.60505881E-02     0     3     9     0     0     0
   205  0.84330982E+00     0     5    11     0     0     0
   205  0.52614347E-03     0     6    12     0     0     0
   205  0.26441228E-04     0   450   450     0     0     0
   205  0.17132510E-03     0   450   451     0     0     0
   205  0.27866708E-03     0   451   451     0     0     0
   205  0.59707050E-03     0   454   456     0     0     0
   6
   206  0.56345540E-03     0   124   129     0     0     0
   206  0.16138196E+00     0   126   131     0     0     0
   206  0.15027013E-04     0     2     7     0     0     0
   206  0.60716770E-02     0     4     9     0     0     0
   206  0.83158803E+00     0     6    11     0     0     0
   206  0.37990991E-03     0   454   450     0     0     0
   6
   207  0.56345540E-03     0   130   123     0     0     0
   207  0.16138196E+00     0   132   125     0     0     0
   207  0.15027013E-04     0     8     1     0     0     0
   207  0.60716770E-02     0    10     3     0     0     0
   207  0.83158803E+00     0    12     5     0     0     0
   207  0.37990991E-03     0   456   450     0     0     0
   0
   5
     6  0.33333334E+00   100     2     7     5     0     0
     6  0.33333334E+00   100     4     9     5     0     0
     6  0.11111111E+00   100   122   127     5     0     0
     6  0.11111111E+00   100   124   129     5     0     0
     6  0.11111111E+00   100   126   131     5     0     0
   5
    12  0.33333334E+00   100     8     1    11     0     0
    12  0.33333334E+00   100    10     3    11     0     0
    12  0.11111111E+00   100   128   121    11     0     0
    12  0.11111111E+00   100   130   123    11     0     0
    12  0.11111111E+00   100   132   125    11     0     0
     50.00000000     -0.02014696
      0.99981904     -0.00178657      0.01894023      0.00037133
      0.00243158      0.99941456     -0.03410830      0.00106257
     -0.01307747      0.02489680      0.70654684     -0.70710713
      0.01360621     -0.02339605     -0.70658976     -0.70710558
     -0.99998826      0.00484815     -0.00484815     -0.99998826
     -0.99876082      0.04976736     -0.04976736     -0.99876082
     -1.41025829     -1.52599812     -1.54605877
  -6836.21435547  -7043.80224609  -9476.07226562
   2307.54956055
    T
