#  ISAJET SUSY parameters in SUSY Les Houches Accord 2 format
#  Created by ISALHA 2.0 Last revision: C. Balazs 21 Apr 2009
Block SPINFO   # Program information
     1   ISASUGRA from ISAJET          # Spectrum Calculator
     2   7.80   29-OCT-2009 12:50:36   # Version number
Block MODSEL   # Model selection
     1     1   # Minimal supergravity (mSUGRA) model               
Block SMINPUTS   # Standard Model inputs
     1     1.27837318E+02   # alpha_em^(-1)
     2     1.16570000E-05   # G_Fermi
     3     1.17200002E-01   # alpha_s(M_Z)
     4     9.11699982E+01   # m_{Z}(pole)
     5     4.19999981E+00   # m_{b}(m_{b})
     6     1.72500000E+02   # m_{top}(pole)
     7     1.77699995E+00   # m_{tau}(pole)
Block MINPAR   # SUSY breaking input parameters
     1     9.20000000E+02   # m_0
     2     3.40000000E+02   # m_{1/2}
     3     4.00000000E+01   # tan(beta)
     4     1.00000000E+00   # sign(mu)
     5     0.00000000E+00   # A_0
Block EXTPAR   # Non-universal SUSY breaking parameters
     0     2.17129731E+16   # Input scale
Block MASS   # Scalar and gaugino mass spectrum
#  PDG code   mass                 particle
        24     8.04229965E+01   #  W^+
        25     1.13164154E+02   #  h^0            
        35     7.38616943E+02   #  H^0            
        36     7.33774292E+02   #  A^0            
        37     7.43766113E+02   #  H^+            
   1000001     1.16734485E+03   #  dnl            
   1000002     1.16455383E+03   #  upl            
   1000003     1.16734485E+03   #  stl            
   1000004     1.16455457E+03   #  chl            
   1000005     9.41462219E+02   #  b1             
   1000006     7.85787781E+02   #  t1             
   1000011     9.46603394E+02   #  el-            
   1000012     9.43031738E+02   #  nuel           
   1000013     9.46603394E+02   #  mul-           
   1000014     9.43031738E+02   #  numl           
   1000015     7.69010010E+02   #  tau1           
   1000016     8.70750671E+02   #  nutl           
   1000021     8.55934570E+02   #  glss           
   1000022     1.39442581E+02   #  z1ss           
   1000023     2.60112213E+02   #  z2ss           
   1000024     2.60866089E+02   #  w1ss           
   1000025    -4.18068756E+02   #  z3ss           
   1000035     4.37062469E+02   #  z4ss           
   1000037     4.37080536E+02   #  w2ss           
   2000001     1.15248535E+03   #  dnr            
   2000002     1.15302966E+03   #  upr            
   2000003     1.15248535E+03   #  str            
   2000004     1.15303040E+03   #  chr            
   2000005     1.03655029E+03   #  b2             
   2000006     9.71780151E+02   #  t2             
   2000011     9.28452454E+02   #  er-            
   2000013     9.28452454E+02   #  mur-           
   2000015     8.77060181E+02   #  tau2           
Block ALPHA   # Effective Higgs mixing parameter
         -2.56454516E-02   # alpha
Block STOPMIX   # stop mixing matrix
  1  1     2.82255769E-01   # O_{11}
  1  2     9.59339201E-01   # O_{12}
  2  1    -9.59339201E-01   # O_{21}
  2  2     2.82255769E-01   # O_{22}
Block SBOTMIX   # sbottom mixing matrix
  1  1     9.75567400E-01   # O_{11}
  1  2     2.19700471E-01   # O_{12}
  2  1    -2.19700471E-01   # O_{21}
  2  2     9.75567400E-01   # O_{22}
Block STAUMIX   # stau mixing matrix
  1  1     1.81119531E-01   # O_{11}
  1  2     9.83461082E-01   # O_{12}
  2  1    -9.83461082E-01   # O_{21}
  2  2     1.81119531E-01   # O_{22}
Block NMIX   # neutralino mixing matrix
  1  1     9.90809858E-01   #
  1  2    -2.84026619E-02   #
  1  3     1.24577060E-01   #
  1  4    -4.43797857E-02   #
  2  1     7.12271407E-02   #
  2  2     9.37055469E-01   #
  2  3    -2.86337495E-01   #
  2  4     1.86720833E-01   #
  3  1     5.39357439E-02   #
  3  2    -7.64062554E-02   #
  3  3    -6.98971093E-01   #
  3  4    -7.09007978E-01   #
  4  1     1.01554669E-01   #
  4  2    -3.39532733E-01   #
  4  3    -6.43374205E-01   #
  4  4     6.78581893E-01   #
Block UMIX   # chargino U mixing matrix
  1  1    -9.14149106E-01   # U_{11}
  1  2     4.05378103E-01   # U_{12}
  2  1    -4.05378103E-01   # U_{21}
  2  2    -9.14149106E-01   # U_{22}
Block VMIX   # chargino V mixing matrix
  1  1    -9.64577794E-01   # V_{11}
  1  2     2.63798445E-01   # V_{12}
  2  1    -2.63798445E-01   # V_{21}
  2  2    -9.64577794E-01   # V_{22}
Block GAUGE Q=  8.33309937E+02   #
     1     3.57524693E-01   # g`
     2     6.52368724E-01   # g_2
     3     1.21927261E+00   # g_3
Block YU Q=  8.33309937E+02   #
  3  3     8.61545265E-01   # y_t
Block YD Q=  8.33309937E+02   #
  3  3     5.09283066E-01   # y_b
Block YE Q=  8.33309937E+02   #
  3  3     4.15712774E-01   # y_tau
Block HMIX Q=  8.33309937E+02   # Higgs mixing parameters
     1     4.09708588E+02   # mu(Q)
     2     4.00000000E+01   # tan(beta)(M_GUT)
     3     2.50876633E+02   # Higgs vev at Q
     4     5.38424688E+05   # m_A^2(Q)
Block MSOFT Q=  8.33309937E+02   # DRbar SUSY breaking parameters
     1     1.42003235E+02   # M_1(Q)          
     2     2.64949158E+02   # M_2(Q)          
     3     7.73868958E+02   # M_3(Q)          
    31     9.42565857E+02   # MeL(Q)          
    32     9.42565857E+02   # MmuL(Q)         
    33     8.71521790E+02   # MtauL(Q)        
    34     9.26556274E+02   # MeR(Q)          
    35     9.26556274E+02   # MmuR(Q)         
    36     7.73656006E+02   # MtauR(Q)        
    41     1.12750391E+03   # MqL1(Q)         
    42     1.12750391E+03   # MqL2(Q)         
    43     9.10491821E+02   # MqL3(Q)         
    44     1.11513245E+03   # MuR(Q)          
    45     1.11513245E+03   # McR(Q)          
    46     7.62670776E+02   # MtR(Q)          
    47     1.11371692E+03   # MdR(Q)          
    48     1.11371692E+03   # MsR(Q)          
    49     1.00311523E+03   # MbR(Q)          
Block AU Q=  8.33309937E+02   #
  1  1    -5.85638733E+02   # A_u
  2  2    -5.85638733E+02   # A_c
  3  3    -5.85638733E+02   # A_t
Block AD Q=  8.33309937E+02   #
  1  1    -7.69147400E+02   # A_d
  2  2    -7.69147400E+02   # A_s
  3  3    -7.69147400E+02   # A_b
Block AE Q=  8.33309937E+02   #
  1  1    -1.19981972E+02   # A_e
  2  2    -1.19981972E+02   # A_mu
  3  3    -1.19981972E+02   # A_tau
#  ISAJET decay tables in SUSY Les Houches accord format
#  Created by ISALHD. Last revision: C. Balazs, 2005 May 25
Block DCINFO                           # Program information
     1   ISASUGRA from ISAJET          # Spectrum Calculator
     2   7.80   29-OCT-2009 12:50:36   # Version number
#         PDG         Width
DECAY         6  1.14680779E+00   # TP    decays
#          BR          NDA       ID1       ID2       ID3       ID4
      3.33333343E-01    3            2        -1         5             # TP     -->  UP     DB     BT          
      3.33333343E-01    3            4        -3         5             # TP     -->  CH     SB     BT          
      1.11111112E-01    3          -11        12         5             # TP     -->  E+     NUE    BT          
      1.11111112E-01    3          -13        14         5             # TP     -->  MU+    NUM    BT          
      1.11111112E-01    3          -15        16         5             # TP     -->  TAU+   NUT    BT          
#         PDG         Width
DECAY   1000021  3.82836163E-02   # GLSS  decays
#          BR          NDA       ID1       ID2       ID3       ID4
      3.89102213E-02    3      1000024         1        -2             # GLSS   -->  W1SS+  DN     UB          
      3.89102213E-02    3     -1000024         2        -1             # GLSS   -->  W1SS-  UP     DB          
      3.89101505E-02    3      1000024         3        -4             # GLSS   -->  W1SS+  ST     CB          
      3.89101505E-02    3     -1000024         4        -3             # GLSS   -->  W1SS-  CH     SB          
      8.53110030E-02    3      1000024         5        -6             # GLSS   -->  W1SS+  BT     TB          
      8.53110030E-02    3     -1000024         6        -5             # GLSS   -->  W1SS-  TP     BB          
      1.83246180E-03    3      1000037         1        -2             # GLSS   -->  W2SS+  DN     UB          
      1.83246180E-03    3     -1000037         2        -1             # GLSS   -->  W2SS-  UP     DB          
      1.83245912E-03    3      1000037         3        -4             # GLSS   -->  W2SS+  ST     CB          
      1.83245912E-03    3     -1000037         4        -3             # GLSS   -->  W2SS-  CH     SB          
      1.14194915E-01    3      1000037         5        -6             # GLSS   -->  W2SS+  BT     TB          
      1.14194915E-01    3     -1000037         6        -5             # GLSS   -->  W2SS-  TP     BB          
      1.26109617E-05    2      1000022        21                       # GLSS   -->  Z1SS   GL                 
      1.76057946E-02    3      1000022         2        -2             # GLSS   -->  Z1SS   UP     UB          
      5.55476220E-03    3      1000022         1        -1             # GLSS   -->  Z1SS   DN     DB          
      5.55476220E-03    3      1000022         3        -3             # GLSS   -->  Z1SS   ST     SB          
      1.76057331E-02    3      1000022         4        -4             # GLSS   -->  Z1SS   CH     CB          
      1.86836831E-02    3      1000022         5        -5             # GLSS   -->  Z1SS   BT     BB          
      5.75920381E-02    3      1000022         6        -6             # GLSS   -->  Z1SS   TP     TB          
      1.63096795E-03    2      1000023        21                       # GLSS   -->  Z2SS   GL                 
      2.01441236E-02    3      1000023         2        -2             # GLSS   -->  Z2SS   UP     UB          
      1.87553577E-02    3      1000023         1        -1             # GLSS   -->  Z2SS   DN     DB          
      1.87553577E-02    3      1000023         3        -3             # GLSS   -->  Z2SS   ST     SB          
      2.01440528E-02    3      1000023         4        -4             # GLSS   -->  Z2SS   CH     CB          
      9.30804238E-02    3      1000023         5        -5             # GLSS   -->  Z2SS   BT     BB          
      1.42115755E-02    3      1000023         6        -6             # GLSS   -->  Z2SS   TP     TB          
      7.47284386E-03    2      1000025        21                       # GLSS   -->  Z3SS   GL                 
      2.38639823E-05    3      1000025         2        -2             # GLSS   -->  Z3SS   UP     UB          
      3.03726047E-05    3      1000025         1        -1             # GLSS   -->  Z3SS   DN     DB          
      3.03726047E-05    3      1000025         3        -3             # GLSS   -->  Z3SS   ST     SB          
      2.38638877E-05    3      1000025         4        -4             # GLSS   -->  Z3SS   CH     CB          
      3.89513969E-02    3      1000025         5        -5             # GLSS   -->  Z3SS   BT     BB          
      1.50780501E-02    3      1000025         6        -6             # GLSS   -->  Z3SS   TP     TB          
      6.60207542E-03    2      1000035        21                       # GLSS   -->  Z4SS   GL                 
      8.83424305E-04    3      1000035         2        -2             # GLSS   -->  Z4SS   UP     UB          
      1.03771768E-03    3      1000035         1        -1             # GLSS   -->  Z4SS   DN     DB          
      1.03771768E-03    3      1000035         3        -3             # GLSS   -->  Z4SS   ST     SB          
      8.83420988E-04    3      1000035         4        -4             # GLSS   -->  Z4SS   CH     CB          
      3.22218649E-02    3      1000035         5        -5             # GLSS   -->  Z4SS   BT     BB          
      2.44095512E-02    3      1000035         6        -6             # GLSS   -->  Z4SS   TP     TB          
#         PDG         Width
DECAY   1000002  2.81132278E+01   # UPL   decays
#          BR          NDA       ID1       ID2       ID3       ID4
      3.97177786E-03    2      1000022         2                       # UPL    -->  Z1SS   UP                 
      1.42086521E-01    2      1000023         2                       # UPL    -->  Z2SS   UP                 
      5.85581525E-04    2      1000025         2                       # UPL    -->  Z3SS   UP                 
      1.32558737E-02    2      1000035         2                       # UPL    -->  Z4SS   UP                 
      5.29469550E-01    2      1000021         2                       # UPL    -->  GLSS   UP                 
      2.92718142E-01    2      1000024         1                       # UPL    -->  W1SS+  DN                 
      1.79125760E-02    2      1000037         1                       # UPL    -->  W2SS+  DN                 
#         PDG         Width
DECAY   1000001  2.81848488E+01   # DNL   decays
#          BR          NDA       ID1       ID2       ID3       ID4
      7.46525638E-03    2      1000022         1                       # DNL    -->  Z1SS   DN                 
      1.34434894E-01    2      1000023         1                       # DNL    -->  Z2SS   DN                 
      9.86427534E-04    2      1000025         1                       # DNL    -->  Z3SS   DN                 
      1.65314618E-02    2      1000035         1                       # DNL    -->  Z4SS   DN                 
      5.35218358E-01    2      1000021         1                       # DNL    -->  GLSS   DN                 
      2.63004333E-01    2     -1000024         2                       # DNL    -->  W1SS-  UP                 
      4.23592925E-02    2     -1000037         2                       # DNL    -->  W2SS-  UP                 
#         PDG         Width
DECAY   1000003  2.81848240E+01   # STL   decays
#          BR          NDA       ID1       ID2       ID3       ID4
      7.46526290E-03    2      1000022         3                       # STL    -->  Z1SS   ST                 
      1.34435013E-01    2      1000023         3                       # STL    -->  Z2SS   ST                 
      9.86428349E-04    2      1000025         3                       # STL    -->  Z3SS   ST                 
      1.65314768E-02    2      1000035         3                       # STL    -->  Z4SS   ST                 
      5.35218835E-01    2      1000021         3                       # STL    -->  GLSS   ST                 
      2.63003796E-01    2     -1000024         4                       # STL    -->  W1SS-  CH                 
      4.23591733E-02    2     -1000037         4                       # STL    -->  W2SS-  CH                 
#         PDG         Width
DECAY   1000004  2.81130886E+01   # CHL   decays
#          BR          NDA       ID1       ID2       ID3       ID4
      3.97178810E-03    2      1000022         4                       # CHL    -->  Z1SS   CH                 
      1.42086908E-01    2      1000023         4                       # CHL    -->  Z2SS   CH                 
      5.85582922E-04    2      1000025         4                       # CHL    -->  Z3SS   CH                 
      1.32559044E-02    2      1000035         4                       # CHL    -->  Z4SS   CH                 
      5.29467344E-01    2      1000021         4                       # CHL    -->  GLSS   CH                 
      2.92719841E-01    2      1000024         3                       # CHL    -->  W1SS+  ST                 
      1.79126840E-02    2      1000037         3                       # CHL    -->  W2SS+  ST                 
#         PDG         Width
DECAY   1000005  2.25090046E+01   # BT1   decays
#          BR          NDA       ID1       ID2       ID3       ID4
      1.70453507E-02    2      1000022         5                       # BT1    -->  Z1SS   BT                 
      1.55307695E-01    2      1000023         5                       # BT1    -->  Z2SS   BT                 
      6.51657805E-02    2      1000025         5                       # BT1    -->  Z3SS   BT                 
      5.55373020E-02    2      1000035         5                       # BT1    -->  Z4SS   BT                 
      7.94457272E-02    2      1000021         5                       # BT1    -->  GLSS   BT                 
      2.66922653E-01    2     -1000024         6                       # BT1    -->  W1SS-  TP                 
      3.28619838E-01    2     -1000037         6                       # BT1    -->  W2SS-  TP                 
      3.19556482E-02    2          -24   1000006                       # BT1    -->  W-     TP1                
#         PDG         Width
DECAY   1000006  1.27097273E+01   # TP1   decays
#          BR          NDA       ID1       ID2       ID3       ID4
      1.13091685E-01    2      1000022         6                       # TP1    -->  Z1SS   TP                 
      6.38763234E-02    2      1000023         6                       # TP1    -->  Z2SS   TP                 
      2.34994978E-01    2      1000025         6                       # TP1    -->  Z3SS   TP                 
      1.07008293E-01    2      1000035         6                       # TP1    -->  Z4SS   TP                 
      1.52817801E-01    2      1000024         5                       # TP1    -->  W1SS+  BT                 
      3.28210950E-01    2      1000037         5                       # TP1    -->  W2SS+  BT                 
#         PDG         Width
DECAY   2000002  1.65862808E+01   # UPR   decays
#          BR          NDA       ID1       ID2       ID3       ID4
      1.49792850E-01    2      1000022         2                       # UPR    -->  Z1SS   UP                 
      7.18176307E-04    2      1000023         2                       # UPR    -->  Z2SS   UP                 
      3.44853266E-04    2      1000025         2                       # UPR    -->  Z3SS   UP                 
      1.18843780E-03    2      1000035         2                       # UPR    -->  Z4SS   UP                 
      8.47955644E-01    2      1000021         2                       # UPR    -->  GLSS   UP                 
#         PDG         Width
DECAY   2000001  1.46560192E+01   # DNR   decays
#          BR          NDA       ID1       ID2       ID3       ID4
      4.23591062E-02    2      1000022         1                       # DNR    -->  Z1SS   DN                 
      2.03074262E-04    2      1000023         1                       # DNR    -->  Z2SS   DN                 
      9.74940485E-05    2      1000025         1                       # DNR    -->  Z3SS   DN                 
      3.35974793E-04    2      1000035         1                       # DNR    -->  Z4SS   DN                 
      9.57004368E-01    2      1000021         1                       # DNR    -->  GLSS   DN                 
#         PDG         Width
DECAY   2000003  1.46560192E+01   # STR   decays
#          BR          NDA       ID1       ID2       ID3       ID4
      4.23591062E-02    2      1000022         3                       # STR    -->  Z1SS   ST                 
      2.03074262E-04    2      1000023         3                       # STR    -->  Z2SS   ST                 
      9.74940485E-05    2      1000025         3                       # STR    -->  Z3SS   ST                 
      3.35974793E-04    2      1000035         3                       # STR    -->  Z4SS   ST                 
      9.57004368E-01    2      1000021         3                       # STR    -->  GLSS   ST                 
#         PDG         Width
DECAY   2000004  1.65861359E+01   # CHR   decays
#          BR          NDA       ID1       ID2       ID3       ID4
      1.49793833E-01    2      1000022         4                       # CHR    -->  Z1SS   CH                 
      7.18180847E-04    2      1000023         4                       # CHR    -->  Z2SS   CH                 
      3.44855420E-04    2      1000025         4                       # CHR    -->  Z3SS   CH                 
      1.18844490E-03    2      1000035         4                       # CHR    -->  Z4SS   CH                 
      8.47954690E-01    2      1000021         4                       # CHR    -->  GLSS   CH                 
#         PDG         Width
DECAY   2000005  1.52627163E+01   # BT2   decays
#          BR          NDA       ID1       ID2       ID3       ID4
      3.10466997E-02    2      1000022         5                       # BT2    -->  Z1SS   BT                 
      5.16575808E-03    2      1000023         5                       # BT2    -->  Z2SS   BT                 
      1.27539396E-01    2      1000025         5                       # BT2    -->  Z3SS   BT                 
      1.23642214E-01    2      1000035         5                       # BT2    -->  Z4SS   BT                 
      4.15812016E-01    2      1000021         5                       # BT2    -->  GLSS   BT                 
      9.05440096E-03    2     -1000024         6                       # BT2    -->  W1SS-  TP                 
      2.75699973E-01    2     -1000037         6                       # BT2    -->  W2SS-  TP                 
      1.19040050E-02    2          -24   1000006                       # BT2    -->  W-     TP1                
      1.35509370E-04    2           23   1000005                       # BT2    -->  Z0     BT1                
#         PDG         Width
DECAY   2000006  2.27399597E+01   # TP2   decays
#          BR          NDA       ID1       ID2       ID3       ID4
      2.40813762E-01    2      1000024         5                       # TP2    -->  W1SS+  BT                 
      1.94331869E-01    2      1000037         5                       # TP2    -->  W2SS+  BT                 
      2.66871545E-02    2           23   1000006                       # TP2    -->  Z0     TP1                
      3.07776891E-02    2           25   1000006                       # TP2    -->  HL0    TP1                
      6.86829025E-03    2      1000022         6                       # TP2    -->  Z1SS   TP                 
      1.03963420E-01    2      1000023         6                       # TP2    -->  Z2SS   TP                 
      1.61918491E-01    2      1000025         6                       # TP2    -->  Z3SS   TP                 
      2.34639406E-01    2      1000035         6                       # TP2    -->  Z4SS   TP                 
#         PDG         Width
DECAY   1000011  1.09627666E+01   # EL-   decays
#          BR          NDA       ID1       ID2       ID3       ID4
      9.26798359E-02    2      1000022        11                       # EL-    -->  Z1SS   E-                 
      2.96038479E-01    2      1000023        11                       # EL-    -->  Z2SS   E-                 
      5.14965504E-04    2      1000025        11                       # EL-    -->  Z3SS   E-                 
      1.81124210E-02    2      1000035        11                       # EL-    -->  Z4SS   E-                 
      5.18704116E-01    2     -1000024        12                       # EL-    -->  W1SS-  NUE                
      7.39502236E-02    2     -1000037        12                       # EL-    -->  W2SS-  NUE                
#         PDG         Width
DECAY   1000013  1.09627666E+01   # MUL-  decays
#          BR          NDA       ID1       ID2       ID3       ID4
      9.26798359E-02    2      1000022        13                       # MUL-   -->  Z1SS   MU-                
      2.96038479E-01    2      1000023        13                       # MUL-   -->  Z2SS   MU-                
      5.14965504E-04    2      1000025        13                       # MUL-   -->  Z3SS   MU-                
      1.81124210E-02    2      1000035        13                       # MUL-   -->  Z4SS   MU-                
      5.18704116E-01    2     -1000024        14                       # MUL-   -->  W1SS-  NUM                
      7.39502236E-02    2     -1000037        14                       # MUL-   -->  W2SS-  NUM                
#         PDG         Width
DECAY   1000015  6.74726391E+00   # TAU1- decays
#          BR          NDA       ID1       ID2       ID3       ID4
      5.34776986E-01    2      1000022        15                       # TAU1-  -->  Z1SS   TAU-               
      7.05455318E-02    2      1000023        15                       # TAU1-  -->  Z2SS   TAU-               
      9.06426981E-02    2      1000025        15                       # TAU1-  -->  Z3SS   TAU-               
      5.98744340E-02    2      1000035        15                       # TAU1-  -->  Z4SS   TAU-               
      1.33143410E-01    2     -1000024        16                       # TAU1-  -->  W1SS-  NUT                
      1.11016929E-01    2     -1000037        16                       # TAU1-  -->  W2SS-  NUT                
#         PDG         Width
DECAY   1000012  1.10300751E+01   # NUEL  decays
#          BR          NDA       ID1       ID2       ID3       ID4
      1.13038346E-01    2      1000022        12                       # NUEL   -->  Z1SS   NUE                
      2.47680739E-01    2      1000023        12                       # NUEL   -->  Z2SS   NUE                
      2.61286949E-03    2      1000025        12                       # NUEL   -->  Z3SS   NUE                
      3.46802659E-02    2      1000035        12                       # NUEL   -->  Z4SS   NUE                
      5.71107864E-01    2      1000024        11                       # NUEL   -->  W1SS+  E-                 
      3.08798589E-02    2      1000037        11                       # NUEL   -->  W2SS+  E-                 
#         PDG         Width
DECAY   1000014  1.10300751E+01   # NUML  decays
#          BR          NDA       ID1       ID2       ID3       ID4
      1.13038346E-01    2      1000022        14                       # NUML   -->  Z1SS   NUM                
      2.47680739E-01    2      1000023        14                       # NUML   -->  Z2SS   NUM                
      2.61286949E-03    2      1000025        14                       # NUML   -->  Z3SS   NUM                
      3.46802659E-02    2      1000035        14                       # NUML   -->  Z4SS   NUM                
      5.71107864E-01    2      1000024        13                       # NUML   -->  W1SS+  MU-                
      3.08798589E-02    2      1000037        13                       # NUML   -->  W2SS+  MU-                
#         PDG         Width
DECAY   1000016  1.17248402E+01   # NUTL  decays
#          BR          NDA       ID1       ID2       ID3       ID4
      9.74318907E-02    2      1000022        16                       # NUTL   -->  Z1SS   NUT                
      2.09062025E-01    2      1000023        16                       # NUTL   -->  Z2SS   NUT                
      2.08170619E-03    2      1000025        16                       # NUTL   -->  Z3SS   NUT                
      2.73421220E-02    2      1000035        16                       # NUTL   -->  Z4SS   NUT                
      5.16548872E-01    2      1000024        15                       # NUTL   -->  W1SS+  TAU-               
      1.44601271E-01    2      1000037        15                       # NUTL   -->  W2SS+  TAU-               
      2.93203443E-03    2           24   1000015                       # NUTL   -->  W+     TAU1-              
#         PDG         Width
DECAY   2000011  4.48775625E+00   # ER-   decays
#          BR          NDA       ID1       ID2       ID3       ID4
      9.86945450E-01    2      1000022        11                       # ER-    -->  Z1SS   E-                 
      4.53338306E-03    2      1000023        11                       # ER-    -->  Z2SS   E-                 
      1.94564601E-03    2      1000025        11                       # ER-    -->  Z3SS   E-                 
      6.57560630E-03    2      1000035        11                       # ER-    -->  Z4SS   E-                 
#         PDG         Width
DECAY   2000013  4.48775625E+00   # MUR-  decays
#          BR          NDA       ID1       ID2       ID3       ID4
      9.86945450E-01    2      1000022        13                       # MUR-   -->  Z1SS   MU-                
      4.53338306E-03    2      1000023        13                       # MUR-   -->  Z2SS   MU-                
      1.94564601E-03    2      1000025        13                       # MUR-   -->  Z3SS   MU-                
      6.57560630E-03    2      1000035        13                       # MUR-   -->  Z4SS   MU-                
#         PDG         Width
DECAY   2000015  1.13006430E+01   # TAU2- decays
#          BR          NDA       ID1       ID2       ID3       ID4
      8.88443813E-02    2      1000022        15                       # TAU2-  -->  Z1SS   TAU-               
      2.46088147E-01    2      1000023        15                       # TAU2-  -->  Z2SS   TAU-               
      8.32254365E-02    2      1000025        15                       # TAU2-  -->  Z3SS   TAU-               
      9.25254151E-02    2      1000035        15                       # TAU2-  -->  Z4SS   TAU-               
      3.94086450E-01    2     -1000024        16                       # TAU2-  -->  W1SS-  NUT                
      9.40422341E-02    2     -1000037        16                       # TAU2-  -->  W2SS-  NUT                
      1.18790008E-03    2           23   1000015                       # TAU2-  -->  Z0     TAU1-              
#         PDG         Width
DECAY   1000023  8.71305447E-03   # Z2SS  decays
#          BR          NDA       ID1       ID2       ID3       ID4
      3.43987335E-06    2      1000022        22                       # Z2SS   -->  Z1SS   GM                 
      2.34006569E-01    2      1000022        23                       # Z2SS   -->  Z1SS   Z0                 
      4.41500248E-07    3      1000022         2        -2             # Z2SS   -->  Z1SS   UP     UB          
      7.27668237E-07    3      1000022         1        -1             # Z2SS   -->  Z1SS   DN     DB          
      7.27668237E-07    3      1000022         3        -3             # Z2SS   -->  Z1SS   ST     SB          
      4.41499139E-07    3      1000022         4        -4             # Z2SS   -->  Z1SS   CH     CB          
      1.58178282E-05    3      1000022         5        -5             # Z2SS   -->  Z1SS   BT     BB          
      4.02230899E-06    3      1000022        11       -11             # Z2SS   -->  Z1SS   E-     E+          
      4.02230899E-06    3      1000022        13       -13             # Z2SS   -->  Z1SS   MU-    MU+         
      1.41124628E-05    3      1000022        15       -15             # Z2SS   -->  Z1SS   TAU-   TAU+        
      4.13183443E-06    3      1000022        12       -12             # Z2SS   -->  Z1SS   NUE    ANUE        
      4.13183443E-06    3      1000022        14       -14             # Z2SS   -->  Z1SS   NUM    ANUM        
      5.78075242E-06    3      1000022        16       -16             # Z2SS   -->  Z1SS   NUT    ANUT        
      7.65935600E-01    2      1000022        25                       # Z2SS   -->  Z1SS   HL0                
#         PDG         Width
DECAY   1000025  1.47646475E+00   # Z3SS  decays
#          BR          NDA       ID1       ID2       ID3       ID4
      7.00952718E-09    2      1000022        22                       # Z3SS   -->  Z1SS   GM                 
      4.73037090E-07    2      1000023        22                       # Z3SS   -->  Z2SS   GM                 
      2.95577705E-01    2      1000024       -24                       # Z3SS   -->  W1SS+  W-                 
      2.95577705E-01    2     -1000024        24                       # Z3SS   -->  W1SS-  W+                 
      1.41152024E-01    2      1000022        23                       # Z3SS   -->  Z1SS   Z0                 
      2.32256547E-01    2      1000023        23                       # Z3SS   -->  Z2SS   Z0                 
      2.02401695E-09    3      1000022         2        -2             # Z3SS   -->  Z1SS   UP     UB          
      7.95325306E-10    3      1000022         1        -1             # Z3SS   -->  Z1SS   DN     DB          
      7.95325306E-10    3      1000022         3        -3             # Z3SS   -->  Z1SS   ST     SB          
      2.02401118E-09    3      1000022         4        -4             # Z3SS   -->  Z1SS   CH     CB          
      6.55122722E-06    3      1000022         5        -5             # Z3SS   -->  Z1SS   BT     BB          
      8.92714169E-09    3      1000022        11       -11             # Z3SS   -->  Z1SS   E-     E+          
      8.92714169E-09    3      1000022        13       -13             # Z3SS   -->  Z1SS   MU-    MU+         
      6.95588051E-06    3      1000022        15       -15             # Z3SS   -->  Z1SS   TAU-   TAU+        
      6.53253762E-09    3      1000022        12       -12             # Z3SS   -->  Z1SS   NUE    ANUE        
      6.53253762E-09    3      1000022        14       -14             # Z3SS   -->  Z1SS   NUM    ANUM        
      9.38703781E-09    3      1000022        16       -16             # Z3SS   -->  Z1SS   NUT    ANUT        
      8.60828242E-10    3      1000023         2        -2             # Z3SS   -->  Z2SS   UP     UB          
      1.35400013E-09    3      1000023         1        -1             # Z3SS   -->  Z2SS   DN     DB          
      1.35400013E-09    3      1000023         3        -3             # Z3SS   -->  Z2SS   ST     SB          
      8.60825911E-10    3      1000023         4        -4             # Z3SS   -->  Z2SS   CH     CB          
      2.22353719E-06    3      1000023         5        -5             # Z3SS   -->  Z2SS   BT     BB          
      3.84743487E-10    3      1000023        11       -11             # Z3SS   -->  Z2SS   E-     E+          
      3.84743487E-10    3      1000023        13       -13             # Z3SS   -->  Z2SS   MU-    MU+         
      6.12559063E-07    3      1000023        15       -15             # Z3SS   -->  Z2SS   TAU-   TAU+        
      1.68471437E-09    3      1000023        12       -12             # Z3SS   -->  Z2SS   NUE    ANUE        
      1.68471437E-09    3      1000023        14       -14             # Z3SS   -->  Z2SS   NUM    ANUM        
      2.45280130E-09    3      1000023        16       -16             # Z3SS   -->  Z2SS   NUT    ANUT        
      2.82485280E-02    2      1000022        25                       # Z3SS   -->  Z1SS   HL0                
      7.17055751E-03    2      1000023        25                       # Z3SS   -->  Z2SS   HL0                
#         PDG         Width
DECAY   1000035  1.81366670E+00   # Z4SS  decays
#          BR          NDA       ID1       ID2       ID3       ID4
      3.63360941E-09    2      1000022        22                       # Z4SS   -->  Z1SS   GM                 
      1.42313539E-07    2      1000023        22                       # Z4SS   -->  Z2SS   GM                 
      4.30518421E-09    2      1000025        22                       # Z4SS   -->  Z3SS   GM                 
      3.34473401E-01    2      1000024       -24                       # Z4SS   -->  W1SS+  W-                 
      3.34473401E-01    2     -1000024        24                       # Z4SS   -->  W1SS-  W+                 
      2.99683213E-02    2      1000022        23                       # Z4SS   -->  Z1SS   Z0                 
      1.72910169E-02    2      1000023        23                       # Z4SS   -->  Z2SS   Z0                 
      2.79023702E-08    3      1000022         2        -2             # Z4SS   -->  Z1SS   UP     UB          
      2.95535880E-08    3      1000022         1        -1             # Z4SS   -->  Z1SS   DN     DB          
      2.95535880E-08    3      1000022         3        -3             # Z4SS   -->  Z1SS   ST     SB          
      2.79022920E-08    3      1000022         4        -4             # Z4SS   -->  Z1SS   CH     CB          
      4.83803342E-06    3      1000022         5        -5             # Z4SS   -->  Z1SS   BT     BB          
      1.58242045E-07    3      1000022        11       -11             # Z4SS   -->  Z1SS   E-     E+          
      1.58242045E-07    3      1000022        13       -13             # Z4SS   -->  Z1SS   MU-    MU+         
      6.13413113E-06    3      1000022        15       -15             # Z4SS   -->  Z1SS   TAU-   TAU+        
      2.19825083E-07    3      1000022        12       -12             # Z4SS   -->  Z1SS   NUE    ANUE        
      2.19825083E-07    3      1000022        14       -14             # Z4SS   -->  Z1SS   NUM    ANUM        
      3.15153500E-07    3      1000022        16       -16             # Z4SS   -->  Z1SS   NUT    ANUT        
      7.68013777E-08    3      1000023         2        -2             # Z4SS   -->  Z2SS   UP     UB          
      8.94986556E-08    3      1000023         1        -1             # Z4SS   -->  Z2SS   DN     DB          
      8.94986556E-08    3      1000023         3        -3             # Z4SS   -->  Z2SS   ST     SB          
      7.68011645E-08    3      1000023         4        -4             # Z4SS   -->  Z2SS   CH     CB          
      2.21695177E-06    3      1000023         5        -5             # Z4SS   -->  Z2SS   BT     BB          
      5.38975904E-08    3      1000023        11       -11             # Z4SS   -->  Z2SS   E-     E+          
      5.38975904E-08    3      1000023        13       -13             # Z4SS   -->  Z2SS   MU-    MU+         
      5.95519964E-07    3      1000023        15       -15             # Z4SS   -->  Z2SS   TAU-   TAU+        
      9.00142325E-08    3      1000023        12       -12             # Z4SS   -->  Z2SS   NUE    ANUE        
      9.00142325E-08    3      1000023        14       -14             # Z4SS   -->  Z2SS   NUM    ANUM        
      1.31177117E-07    3      1000023        16       -16             # Z4SS   -->  Z2SS   NUT    ANUT        
      1.43680268E-07    3      1000025         2        -2             # Z4SS   -->  Z3SS   UP     UB          
      1.85410926E-07    3      1000025         1        -1             # Z4SS   -->  Z3SS   DN     DB          
      1.85410926E-07    3      1000025         3        -3             # Z4SS   -->  Z3SS   ST     SB          
      1.43680268E-07    3      1000025         4        -4             # Z4SS   -->  Z3SS   CH     CB          
      8.51218545E-08    3      1000025         5        -5             # Z4SS   -->  Z3SS   BT     BB          
      4.20596464E-08    3      1000025        11       -11             # Z4SS   -->  Z3SS   E-     E+          
      4.20596464E-08    3      1000025        13       -13             # Z4SS   -->  Z3SS   MU-    MU+         
      3.81546883E-08    3      1000025        15       -15             # Z4SS   -->  Z3SS   TAU-   TAU+        
      8.35854763E-08    3      1000025        12       -12             # Z4SS   -->  Z3SS   NUE    ANUE        
      8.35854763E-08    3      1000025        14       -14             # Z4SS   -->  Z3SS   NUM    ANUM        
      8.35701428E-08    3      1000025        16       -16             # Z4SS   -->  Z3SS   NUT    ANUT        
      9.94479731E-02    2      1000022        25                       # Z4SS   -->  Z1SS   HL0                
      1.84329182E-01    2      1000023        25                       # Z4SS   -->  Z2SS   HL0                
#         PDG         Width
DECAY   1000024  1.07634859E-02   # W1SS+ decays
#          BR          NDA       ID1       ID2       ID3       ID4
      9.35486412E-07    3      1000022         2        -1             # W1SS+  -->  Z1SS   UP     DB          
      9.35485446E-07    3      1000022         4        -3             # W1SS+  -->  Z1SS   CH     SB          
      6.78758579E-06    3      1000022       -11        12             # W1SS+  -->  Z1SS   E+     NUE         
      6.78758579E-06    3      1000022       -13        14             # W1SS+  -->  Z1SS   MU+    NUM         
      1.62379274E-05    3      1000022       -15        16             # W1SS+  -->  Z1SS   TAU+   NUT         
      9.99968350E-01    2      1000022        24                       # W1SS+  -->  Z1SS   W+                 
      1.07494664E-11    3      1000023       -11        12             # W1SS+  -->  Z2SS   E+     NUE         
      1.07494664E-11    3      1000023       -13        14             # W1SS+  -->  Z2SS   MU+    NUM         
#         PDG         Width
DECAY   1000037  1.63380861E+00   # W2SS+ decays
#          BR          NDA       ID1       ID2       ID3       ID4
      4.69016221E-08    3      1000022         2        -1             # W2SS+  -->  Z1SS   UP     DB          
      4.69015937E-08    3      1000022         4        -3             # W2SS+  -->  Z1SS   CH     SB          
      3.09409501E-07    3      1000022       -11        12             # W2SS+  -->  Z1SS   E+     NUE         
      3.09409501E-07    3      1000022       -13        14             # W2SS+  -->  Z1SS   MU+    NUM         
      6.78597598E-06    3      1000022       -15        16             # W2SS+  -->  Z1SS   TAU+   NUT         
      1.20834574E-01    2      1000022        24                       # W2SS+  -->  Z1SS   W+                 
      7.13408213E-08    3      1000023         2        -1             # W2SS+  -->  Z2SS   UP     DB          
      7.13407857E-08    3      1000023         4        -3             # W2SS+  -->  Z2SS   CH     SB          
      6.68175844E-08    3      1000023       -11        12             # W2SS+  -->  Z2SS   E+     NUE         
      6.68175844E-08    3      1000023       -13        14             # W2SS+  -->  Z2SS   MU+    NUM         
      1.10899407E-06    3      1000023       -15        16             # W2SS+  -->  Z2SS   TAU+   NUT         
      3.50651234E-01    2      1000023        24                       # W2SS+  -->  Z2SS   W+                 
      5.68951293E-07    3      1000025         2        -1             # W2SS+  -->  Z3SS   UP     DB          
      5.68951293E-07    3      1000025         4        -3             # W2SS+  -->  Z3SS   CH     SB          
      1.89616856E-07    3      1000025       -11        12             # W2SS+  -->  Z3SS   E+     NUE         
      1.89616856E-07    3      1000025       -13        14             # W2SS+  -->  Z3SS   MU+    NUM         
      1.90791411E-07    3      1000025       -15        16             # W2SS+  -->  Z3SS   TAU+   NUT         
      3.01536351E-01    2      1000024        23                       # W2SS+  -->  W1SS+  Z0                 
      7.95022572E-08    3      1000024         1        -1             # W2SS+  -->  W1SS+  DN     DB          
      7.95020227E-08    3      1000024         3        -3             # W2SS+  -->  W1SS+  ST     SB          
      1.66851493E-07    3      1000024         2        -2             # W2SS+  -->  W1SS+  UP     UB          
      1.66851493E-07    3      1000024         4        -4             # W2SS+  -->  W1SS+  CH     CB          
      1.43574454E-07    3      1000024        12       -12             # W2SS+  -->  W1SS+  NUE    ANUE        
      1.43574454E-07    3      1000024        14       -14             # W2SS+  -->  W1SS+  NUM    ANUM        
      3.94481305E-07    3      1000024        16       -16             # W2SS+  -->  W1SS+  NUT    ANUT        
      6.88971156E-08    3      1000024        11       -11             # W2SS+  -->  W1SS+  E-     E+          
      6.88971156E-08    3      1000024        13       -13             # W2SS+  -->  W1SS+  MU-    MU+         
      1.00520602E-07    3      1000024        15       -15             # W2SS+  -->  W1SS+  TAU-   TAU+        
      2.26965874E-01    2      1000024        25                       # W2SS+  -->  W1SS+  HL0                
#         PDG         Width
DECAY        25  4.11484856E-03   # HL0   decays
#          BR          NDA       ID1       ID2       ID3       ID4
      4.91999597E-09    2           11       -11                       # HL0    -->  E-     E+                 
      2.07730045E-04    2           13       -13                       # HL0    -->  MU-    MU+                
      5.94093725E-02    2           15       -15                       # HL0    -->  TAU-   TAU+               
      6.17661226E-06    2            1        -1                       # HL0    -->  DN     DB                 
      2.49566068E-03    2            3        -3                       # HL0    -->  ST     SB                 
      8.19994688E-01    2            5        -5                       # HL0    -->  BT     BB                 
      1.87726368E-06    2            2        -2                       # HL0    -->  UP     UB                 
      3.54269557E-02    2            4        -4                       # HL0    -->  CH     CB                 
      1.69963238E-03    2           22        22                       # HL0    -->  GM     GM                 
      3.70364524E-02    2           21        21                       # HL0    -->  GL     GL                 
      2.27881316E-03    3           24        11       -12             # HL0    -->  W+     E-     ANUE        
      2.27881316E-03    3           24        13       -14             # HL0    -->  W+     MU-    ANUM        
      2.27881316E-03    3           24        15       -16             # HL0    -->  W+     TAU-   ANUT        
      6.83643995E-03    3           24        -2         1             # HL0    -->  W+     UB     DN          
      6.83643995E-03    3           24        -4         3             # HL0    -->  W+     CB     ST          
      2.27881316E-03    3          -24       -11        12             # HL0    -->  W-     E+     NUE         
      2.27881316E-03    3          -24       -13        14             # HL0    -->  W-     MU+    NUM         
      2.27881316E-03    3          -24       -15        16             # HL0    -->  W-     TAU+   NUT         
      6.83643995E-03    3          -24         2        -1             # HL0    -->  W-     UP     DB          
      6.83643995E-03    3          -24         4        -3             # HL0    -->  W-     CH     SB          
      1.84849618E-04    3           23        12       -12             # HL0    -->  Z0     NUE    ANUE        
      1.84849618E-04    3           23        14       -14             # HL0    -->  Z0     NUM    ANUM        
      1.84849618E-04    3           23        16       -16             # HL0    -->  Z0     NUT    ANUT        
      9.30329552E-05    3           23        11       -11             # HL0    -->  Z0     E-     E+          
      9.30329552E-05    3           23        13       -13             # HL0    -->  Z0     MU-    MU+         
      9.30329552E-05    3           23        15       -15             # HL0    -->  Z0     TAU-   TAU+        
      3.18723003E-04    3           23         2        -2             # HL0    -->  Z0     UP     UB          
      3.18723003E-04    3           23         4        -4             # HL0    -->  Z0     CH     CB          
      4.10593755E-04    3           23         1        -1             # HL0    -->  Z0     DN     DB          
      4.10593755E-04    3           23         3        -3             # HL0    -->  Z0     ST     SB          
      4.10593755E-04    3           23         5        -5             # HL0    -->  Z0     BT     BB          
#         PDG         Width
DECAY        35  2.04483128E+01   # HH0   decays
#          BR          NDA       ID1       ID2       ID3       ID4
      9.82110482E-09    2           11       -11                       # HH0    -->  E-     E+                 
      4.14664712E-04    2           13       -13                       # HH0    -->  MU-    MU+                
      1.18762225E-01    2           15       -15                       # HH0    -->  TAU-   TAU+               
      1.20627728E-05    2            1        -1                       # HH0    -->  DN     DB                 
      4.87397099E-03    2            3        -3                       # HH0    -->  ST     SB                 
      7.56482840E-01    2            5        -5                       # HH0    -->  BT     BB                 
      1.58724672E-12    2            2        -2                       # HH0    -->  UP     UB                 
      2.31987105E-08    2            4        -4                       # HH0    -->  CH     CB                 
      9.10871720E-04    2            6        -6                       # HH0    -->  TP     TB                 
      9.36635445E-08    2           22        22                       # HH0    -->  GM     GM                 
      7.34083778E-06    2           21        21                       # HH0    -->  GL     GL                 
      2.52830364E-06    2           24       -24                       # HH0    -->  W+     W-                 
      1.27173075E-06    2           23        23                       # HH0    -->  Z0     Z0                 
      1.20695308E-03    2      1000022   1000022                       # HH0    -->  Z1SS   Z1SS               
      6.60574157E-03    2      1000022   1000023                       # HH0    -->  Z1SS   Z2SS               
      1.25296107E-02    2      1000022   1000025                       # HH0    -->  Z1SS   Z3SS               
      3.26184905E-03    2      1000022   1000035                       # HH0    -->  Z1SS   Z4SS               
      6.94770506E-03    2      1000023   1000023                       # HH0    -->  Z2SS   Z2SS               
      2.11606696E-02    2      1000023   1000025                       # HH0    -->  Z2SS   Z3SS               
      1.07962312E-03    2      1000023   1000035                       # HH0    -->  Z2SS   Z4SS               
      1.59619041E-02    2      1000024  -1000024                       # HH0    -->  W1SS+  W1SS-              
      2.48889718E-02    2      1000024  -1000037                       # HH0    -->  W1SS+  W2SS-              
      2.48889718E-02    2     -1000024   1000037                       # HH0    -->  W1SS-  W2SS+              
      1.00443687E-09    2           25        25                       # HH0    -->  HL0    HL0                
#         PDG         Width
DECAY        36  2.02764511E+01   # HA0   decays
#          BR          NDA       ID1       ID2       ID3       ID4
      9.83973525E-09    2           11       -11                       # HA0    -->  E-     E+                 
      4.15451388E-04    2           13       -13                       # HA0    -->  MU-    MU+                
      1.18990250E-01    2           15       -15                       # HA0    -->  TAU-   TAU+               
      1.20863569E-05    2            1        -1                       # HA0    -->  DN     DB                 
      4.88350028E-03    2            3        -3                       # HA0    -->  ST     SB                 
      7.58027434E-01    2            5        -5                       # HA0    -->  BT     BB                 
      1.51064361E-12    2            2        -2                       # HA0    -->  UP     UB                 
      2.20969145E-08    2            4        -4                       # HA0    -->  CH     CB                 
      1.07591285E-03    2            6        -6                       # HA0    -->  TP     TB                 
      3.81954344E-08    2           22        22                       # HA0    -->  GM     GM                 
      1.93700726E-05    2           21        21                       # HA0    -->  GL     GL                 
      1.46052393E-03    2      1000022   1000022                       # HA0    -->  Z1SS   Z1SS               
      9.57933627E-03    2      1000022   1000023                       # HA0    -->  Z1SS   Z2SS               
      5.50155807E-03    2      1000022   1000025                       # HA0    -->  Z1SS   Z3SS               
      7.76912272E-03    2      1000022   1000035                       # HA0    -->  Z1SS   Z4SS               
      1.46602923E-02    2      1000023   1000023                       # HA0    -->  Z2SS   Z2SS               
      2.79184268E-03    2      1000023   1000025                       # HA0    -->  Z2SS   Z3SS               
      9.91052110E-03    2      1000023   1000035                       # HA0    -->  Z2SS   Z4SS               
      3.37508135E-02    2      1000024  -1000024                       # HA0    -->  W1SS+  W1SS-              
      1.55747663E-02    2      1000024  -1000037                       # HA0    -->  W1SS+  W2SS-              
      1.55747663E-02    2     -1000024   1000037                       # HA0    -->  W1SS-  W2SS+              
      2.40620534E-06    2           25        23                       # HA0    -->  HL0    Z0                 
#         PDG         Width
DECAY        37  1.76236725E+01   # H+    decays
#          BR          NDA       ID1       ID2       ID3       ID4
      1.14750041E-08    2           12       -11                       # H+     -->  NUE    E+                 
      4.84495395E-04    2           14       -13                       # H+     -->  NUM    MU+                
      1.38765320E-01    2           16       -15                       # H+     -->  NUT    TAU+               
      1.29211985E-05    2            2        -1                       # H+     -->  UP     DB                 
      5.22080576E-03    2            4        -3                       # H+     -->  CH     SB                 
      7.26185560E-01    2            6        -5                       # H+     -->  TP     BB                 
      1.71136316E-02    2      1000024   1000022                       # H+     -->  W1SS+  Z1SS               
      6.25520697E-05    2      1000024   1000023                       # H+     -->  W1SS+  Z2SS               
      3.50885838E-02    2      1000024   1000025                       # H+     -->  W1SS+  Z3SS               
      2.95941960E-02    2      1000024   1000035                       # H+     -->  W1SS+  Z4SS               
      1.04384646E-02    2      1000037   1000022                       # H+     -->  W2SS+  Z1SS               
      3.70305814E-02    2      1000037   1000023                       # H+     -->  W2SS+  Z2SS               
      2.88642855E-06    2           25        24                       # H+     -->  HL0    W+                 
