  65
  401   9972.1055    0.10588E-26
  402   9971.7773    0.10588E-26
  403   9972.1055    0.10588E-26
  404   9971.7773    0.10588E-26
  405   3307.1199    0.26525E-26
  406   2786.8276    0.41409E-26
  407   9972.1055    0.10588E-26
  408   9971.7773    0.10588E-26
  409   9972.1055    0.10588E-26
  410   9971.7773    0.10588E-26
  411   3307.1199    0.26525E-26
  412   2786.8276    0.41409E-26
  413  10027.8428    0.13097E-26
  414   9914.9092    0.12801E-26
  415  10027.8428    0.13097E-26
  416   9914.9092    0.12801E-26
  417   3515.5308    0.29086E-26
  418   3377.4524    0.23965E-26
  419  10027.8428    0.13097E-26
  420   9914.9092    0.12801E-26
  421  10027.8428    0.13097E-26
  422   9914.9092    0.12801E-26
  423   3515.5308    0.29086E-26
  424   3377.4524    0.23965E-26
  425   9940.9453    0.47655E-26
  426   9942.3428    0.47643E-26
  427   9940.9453    0.47655E-26
  428   9942.3428    0.47643E-26
  429   4339.5547    0.19410E-25
  430   7549.2998    0.39463E-26
  431   9940.9453    0.47655E-26
  432   9942.3428    0.47643E-26
  433   9940.9453    0.47655E-26
  434   9942.3428    0.47643E-26
  435   4339.5547    0.19410E-25
  436   7549.2998    0.39463E-26
  437  10094.4219    0.12821E-25
  438      0.0000    0.10000E+31
  439  10094.4219    0.12821E-25
  440      0.0000    0.10000E+31
  441   7551.4404    0.39651E-26
  442      0.0000    0.10000E+31
  443  10094.4219    0.12821E-25
  444      0.0000    0.10000E+31
  445  10094.4219    0.12821E-25
  446      0.0000    0.10000E+31
  447   7551.4404    0.39651E-26
  448      0.0000    0.10000E+31
  449    325.4795    0.82784E-17
  450     45.4454    0.10000E+31
  451    108.5678    0.25295E-14
  452  -3020.6797    0.19681E-25
  453   3021.5896    0.17380E-25
  454    108.9404    0.40071E-16
  455   3001.0701    0.18020E-25
  456    108.9404    0.40071E-16
  457   3001.0701    0.18020E-25
  203    127.8217    0.12060E-21
  204   1161.2600    0.15451E-25
  205   1153.7584    0.15549E-25
  206   1199.4210    0.16636E-25
  207   1199.4210    0.16636E-25
  458      0.0000    0.10000E+31
    6    172.5000    0.57395E-24
   12    172.5000    0.57395E-24
   7
   401  0.23153354E-02     0   450     1     0     0     0
   401  0.67404829E-01     0   451     1     0     0     0
   401  0.20722524E-04     0   452     1     0     0     0
   401  0.23248354E-04     0   453     1     0     0     0
   401  0.79525357E+00     0   449     1     0     0     0
   401  0.13483004E+00     0   456     2     0     0     0
   401  0.15223768E-03     0   457     2     0     0     0
   6
   402  0.22167899E-02     0   450     2     0     0     0
   402  0.67518763E-01     0   451     2     0     0     0
   402  0.13928627E-04     0   452     2     0     0     0
   402  0.15234735E-04     0   453     2     0     0     0
   402  0.79522675E+00     0   449     2     0     0     0
   402  0.13500851E+00     0   454     1     0     0     0
   7
   403  0.23153354E-02     0   450     3     0     0     0
   403  0.67404829E-01     0   451     3     0     0     0
   403  0.20722524E-04     0   452     3     0     0     0
   403  0.23248354E-04     0   453     3     0     0     0
   403  0.79525357E+00     0   449     3     0     0     0
   403  0.13483004E+00     0   456     4     0     0     0
   403  0.15223767E-03     0   457     4     0     0     0
   6
   404  0.22167901E-02     0   450     4     0     0     0
   404  0.67518763E-01     0   451     4     0     0     0
   404  0.13928627E-04     0   452     4     0     0     0
   404  0.15234735E-04     0   453     4     0     0     0
   404  0.79522675E+00     0   449     4     0     0     0
   404  0.13500851E+00     0   454     3     0     0     0
   8
   405  0.35169928E-02     0   450     5     0     0     0
   405  0.47969829E-01     0   451     5     0     0     0
   405  0.22161850E-02     0   452     5     0     0     0
   405  0.21463523E-02     0   453     5     0     0     0
   405  0.71500087E+00     0   449     5     0     0     0
   405  0.95358275E-01     0   456     6     0     0     0
   405  0.25666377E-02     0   457     6     0     0     0
   405  0.13122486E+00     0   199   406     0     0     0
   4
   406  0.94742441E+00     0   449     6     0     0     0
   406  0.36643062E-01     0   450     6     0     0     0
   406  0.51803370E-02     0   451     6     0     0     0
   406  0.10752207E-01     0   454     5     0     0     0
   7
   407  0.23153354E-02     0   450     7     0     0     0
   407  0.67404829E-01     0   451     7     0     0     0
   407  0.20722524E-04     0   452     7     0     0     0
   407  0.23248354E-04     0   453     7     0     0     0
   407  0.79525357E+00     0   449     7     0     0     0
   407  0.13483004E+00     0   454     8     0     0     0
   407  0.15223768E-03     0   455     8     0     0     0
   6
   408  0.22167899E-02     0   450     8     0     0     0
   408  0.67518763E-01     0   451     8     0     0     0
   408  0.13928627E-04     0   452     8     0     0     0
   408  0.15234735E-04     0   453     8     0     0     0
   408  0.79522675E+00     0   449     8     0     0     0
   408  0.13500851E+00     0   456     7     0     0     0
   7
   409  0.23153354E-02     0   450     9     0     0     0
   409  0.67404829E-01     0   451     9     0     0     0
   409  0.20722524E-04     0   452     9     0     0     0
   409  0.23248354E-04     0   453     9     0     0     0
   409  0.79525357E+00     0   449     9     0     0     0
   409  0.13483004E+00     0   454    10     0     0     0
   409  0.15223767E-03     0   455    10     0     0     0
   6
   410  0.22167901E-02     0   450    10     0     0     0
   410  0.67518763E-01     0   451    10     0     0     0
   410  0.13928627E-04     0   452    10     0     0     0
   410  0.15234735E-04     0   453    10     0     0     0
   410  0.79522675E+00     0   449    10     0     0     0
   410  0.13500851E+00     0   456     9     0     0     0
   8
   411  0.35169928E-02     0   450    11     0     0     0
   411  0.47969829E-01     0   451    11     0     0     0
   411  0.22161850E-02     0   452    11     0     0     0
   411  0.21463523E-02     0   453    11     0     0     0
   411  0.71500087E+00     0   449    11     0     0     0
   411  0.95358275E-01     0   454    12     0     0     0
   411  0.25666377E-02     0   455    12     0     0     0
   411  0.13122486E+00     0   198   412     0     0     0
   4
   412  0.94742441E+00     0   449    12     0     0     0
   412  0.36643062E-01     0   450    12     0     0     0
   412  0.51803370E-02     0   451    12     0     0     0
   412  0.10752207E-01     0   456    11     0     0     0
   2
   413  0.11273270E-01     0   450     1     0     0     0
   413  0.98872679E+00     0   449     1     0     0     0
   2
   414  0.43580707E-01     0   450     2     0     0     0
   414  0.95641935E+00     0   449     2     0     0     0
   2
   415  0.11273270E-01     0   450     3     0     0     0
   415  0.98872679E+00     0   449     3     0     0     0
   2
   416  0.43580700E-01     0   450     4     0     0     0
   416  0.95641929E+00     0   449     4     0     0     0
  11
   417  0.69931657E-02     0   450     5     0     0     0
   417  0.94802780E-02     0   451     5     0     0     0
   417  0.65030619E-02     0   452     5     0     0     0
   417  0.65799556E-02     0   453     5     0     0     0
   417  0.83034307E+00     0   449     5     0     0     0
   417  0.18725811E-01     0   456     6     0     0     0
   417  0.16592173E-01     0   457     6     0     0     0
   417  0.79472579E-01     0   199   406     0     0     0
   417  0.50241132E-02     0   199   418     0     0     0
   417  0.10189191E-01     0   200   405     0     0     0
   417  0.10096601E-01     0   203   405     0     0     0
   9
   418  0.65200269E+00     0   449     6     0     0     0
   418  0.95963322E-01     0   454     5     0     0     0
   418  0.66842777E-02     0   455     5     0     0     0
   418  0.96271805E-01     0   200   406     0     0     0
   418  0.92383996E-01     0   203   406     0     0     0
   418  0.35616837E-02     0   450     6     0     0     0
   418  0.47751643E-01     0   451     6     0     0     0
   418  0.20752419E-02     0   452     6     0     0     0
   418  0.33053041E-02     0   453     6     0     0     0
   2
   419  0.11273270E-01     0   450     7     0     0     0
   419  0.98872679E+00     0   449     7     0     0     0
   2
   420  0.43580707E-01     0   450     8     0     0     0
   420  0.95641935E+00     0   449     8     0     0     0
   2
   421  0.11273270E-01     0   450     9     0     0     0
   421  0.98872679E+00     0   449     9     0     0     0
   2
   422  0.43580700E-01     0   450    10     0     0     0
   422  0.95641929E+00     0   449    10     0     0     0
  11
   423  0.69931657E-02     0   450    11     0     0     0
   423  0.94802780E-02     0   451    11     0     0     0
   423  0.65030619E-02     0   452    11     0     0     0
   423  0.65799556E-02     0   453    11     0     0     0
   423  0.83034307E+00     0   449    11     0     0     0
   423  0.18725811E-01     0   454    12     0     0     0
   423  0.16592173E-01     0   455    12     0     0     0
   423  0.79472579E-01     0   198   412     0     0     0
   423  0.50241132E-02     0   198   424     0     0     0
   423  0.10189191E-01     0   200   411     0     0     0
   423  0.10096601E-01     0   203   411     0     0     0
   9
   424  0.65200269E+00     0   449    12     0     0     0
   424  0.95963322E-01     0   456    11     0     0     0
   424  0.66842777E-02     0   457    11     0     0     0
   424  0.96271805E-01     0   200   412     0     0     0
   424  0.92383996E-01     0   203   412     0     0     0
   424  0.35616837E-02     0   450    12     0     0     0
   424  0.47751643E-01     0   451    12     0     0     0
   424  0.20752419E-02     0   452    12     0     0     0
   424  0.33053041E-02     0   453    12     0     0     0
   6
   425  0.90833232E-01     0   450   121     0     0     0
   425  0.30346841E+00     0   451   121     0     0     0
   425  0.38002858E-04     0   452   121     0     0     0
   425  0.39923340E-04     0   453   121     0     0     0
   425  0.60493821E+00     0   456   122     0     0     0
   425  0.68218773E-03     0   457   122     0     0     0
   5
   426  0.92149511E-01     0   450   122     0     0     0
   426  0.30187207E+00     0   451   122     0     0     0
   426  0.12931845E-03     0   452   122     0     0     0
   426  0.14763392E-03     0   453   122     0     0     0
   426  0.60570151E+00     0   454   121     0     0     0
   6
   427  0.90833232E-01     0   450   123     0     0     0
   427  0.30346841E+00     0   451   123     0     0     0
   427  0.38002858E-04     0   452   123     0     0     0
   427  0.39923340E-04     0   453   123     0     0     0
   427  0.60493821E+00     0   456   124     0     0     0
   427  0.68218773E-03     0   457   124     0     0     0
   5
   428  0.92149511E-01     0   450   124     0     0     0
   428  0.30187207E+00     0   451   124     0     0     0
   428  0.12931845E-03     0   452   124     0     0     0
   428  0.14763392E-03     0   453   124     0     0     0
   428  0.60570151E+00     0   454   123     0     0     0
   6
   429  0.65079737E+00     0   450   125     0     0     0
   429  0.72953576E-03     0   451   125     0     0     0
   429  0.85765809E-01     0   452   125     0     0     0
   429  0.85665144E-01     0   453   125     0     0     0
   429  0.15092773E-02     0   456   126     0     0     0
   429  0.17553285E+00     0   457   126     0     0     0
   8
   430  0.57954133E-01     0   450   126     0     0     0
   430  0.18982422E+00     0   451   126     0     0     0
   430  0.69637004E-04     0   452   126     0     0     0
   430  0.79491205E-04     0   453   126     0     0     0
   430  0.38118997E+00     0   454   125     0     0     0
   430  0.16182931E+00     0   455   125     0     0     0
   430  0.39559614E-01     0   198   429     0     0     0
   430  0.16949362E+00     0   206   429     0     0     0
   6
   431  0.90833232E-01     0   450   127     0     0     0
   431  0.30346841E+00     0   451   127     0     0     0
   431  0.38002858E-04     0   452   127     0     0     0
   431  0.39923340E-04     0   453   127     0     0     0
   431  0.60493821E+00     0   454   128     0     0     0
   431  0.68218773E-03     0   455   128     0     0     0
   5
   432  0.92149511E-01     0   450   128     0     0     0
   432  0.30187207E+00     0   451   128     0     0     0
   432  0.12931845E-03     0   452   128     0     0     0
   432  0.14763392E-03     0   453   128     0     0     0
   432  0.60570151E+00     0   456   127     0     0     0
   6
   433  0.90833232E-01     0   450   129     0     0     0
   433  0.30346841E+00     0   451   129     0     0     0
   433  0.38002858E-04     0   452   129     0     0     0
   433  0.39923340E-04     0   453   129     0     0     0
   433  0.60493821E+00     0   454   130     0     0     0
   433  0.68218773E-03     0   455   130     0     0     0
   5
   434  0.92149511E-01     0   450   130     0     0     0
   434  0.30187207E+00     0   451   130     0     0     0
   434  0.12931845E-03     0   452   130     0     0     0
   434  0.14763392E-03     0   453   130     0     0     0
   434  0.60570151E+00     0   456   129     0     0     0
   6
   435  0.65079737E+00     0   450   131     0     0     0
   435  0.72953576E-03     0   451   131     0     0     0
   435  0.85765809E-01     0   452   131     0     0     0
   435  0.85665144E-01     0   453   131     0     0     0
   435  0.15092773E-02     0   454   132     0     0     0
   435  0.17553285E+00     0   455   132     0     0     0
   8
   436  0.57954133E-01     0   450   132     0     0     0
   436  0.18982422E+00     0   451   132     0     0     0
   436  0.69637004E-04     0   452   132     0     0     0
   436  0.79491205E-04     0   453   132     0     0     0
   436  0.38118997E+00     0   456   131     0     0     0
   436  0.16182931E+00     0   457   131     0     0     0
   436  0.39559614E-01     0   199   435     0     0     0
   436  0.16949362E+00     0   207   435     0     0     0
   3
   437  0.99983203E+00     0   450   121     0     0     0
   437  0.74537922E-04     0   452   121     0     0     0
   437  0.93498216E-04     0   453   121     0     0     0
   0
   3
   439  0.99983203E+00     0   450   123     0     0     0
   439  0.74537922E-04     0   452   123     0     0     0
   439  0.93498216E-04     0   453   123     0     0     0
   0
  10
   441  0.57441305E-01     0   450   125     0     0     0
   441  0.19181524E+00     0   451   125     0     0     0
   441  0.81048101E-01     0   452   125     0     0     0
   441  0.81029102E-01     0   453   125     0     0     0
   441  0.38206491E+00     0   456   126     0     0     0
   441  0.52044721E-03     0   457   126     0     0     0
   441  0.20163434E-01     0   200   429     0     0     0
   441  0.14616976E-01     0   203   429     0     0     0
   441  0.85714370E-01     0   205   429     0     0     0
   441  0.85586183E-01     0   204   429     0     0     0
   0
   3
   443  0.99983203E+00     0   450   127     0     0     0
   443  0.74537922E-04     0   452   127     0     0     0
   443  0.93498216E-04     0   453   127     0     0     0
   0
   3
   445  0.99983203E+00     0   450   129     0     0     0
   445  0.74537922E-04     0   452   129     0     0     0
   445  0.93498216E-04     0   453   129     0     0     0
   0
  10
   447  0.57441305E-01     0   450   131     0     0     0
   447  0.19181524E+00     0   451   131     0     0     0
   447  0.81048101E-01     0   452   131     0     0     0
   447  0.81029102E-01     0   453   131     0     0     0
   447  0.38206491E+00     0   454   132     0     0     0
   447  0.52044721E-03     0   455   132     0     0     0
   447  0.20163434E-01     0   200   435     0     0     0
   447  0.14616976E-01     0   203   435     0     0     0
   447  0.85714370E-01     0   205   435     0     0     0
   447  0.85586183E-01     0   204   435     0     0     0
   0
  18
   449  0.16676595E-01     0   454     1     8     0     0
   449  0.16676595E-01     0   456     2     7     0     0
   449  0.16676595E-01     0   454     3    10     0     0
   449  0.16676595E-01     0   456     4     9     0     0
   449  0.19639511E-01     0   454     5    12     0     0
   449  0.19639511E-01     0   456     6    11     0     0
   449  0.34609105E-03     0   450    13     0     0     0
   449  0.83303815E-02     0   450     2     8     0     0
   449  0.23686641E-02     0   450     1     7     0     0
   449  0.23686641E-02     0   450     3     9     0     0
   449  0.83303815E-02     0   450     4    10     0     0
   449  0.17034902E+00     0   450     5    11     0     0
   449  0.42814072E-02     0   451    13     0     0     0
   449  0.83881877E-02     0   451     2     8     0     0
   449  0.83726058E-02     0   451     1     7     0     0
   449  0.83726058E-02     0   451     3     9     0     0
   449  0.83881877E-02     0   451     4    10     0     0
   449  0.66411841E+00     0   451     5    11     0     0
   0
  12
   451  0.83850051E-03     0   450    59     0     0     0
   451  0.11448410E+00     0   450     2     8     0     0
   451  0.14732563E+00     0   450     1     7     0     0
   451  0.14732563E+00     0   450     3     9     0     0
   451  0.11448410E+00     0   450     4    10     0     0
   451  0.23682390E+00     0   450     5    11     0     0
   451  0.27086778E-01     0   450   121   127     0     0
   451  0.27086778E-01     0   450   123   129     0     0
   451  0.28056588E-01     0   450   125   131     0     0
   451  0.54169711E-01     0   450   122   128     0     0
   451  0.54169711E-01     0   450   124   130     0     0
   451  0.48148457E-01     0   450   126   132     0     0
  17
   452  0.14498214E+00     0   454   199     0     0     0
   452  0.14498214E+00     0   456   198     0     0     0
   452  0.13508278E+00     0   454   207     0     0     0
   452  0.13508278E+00     0   456   206     0     0     0
   452  0.30833665E-01     0   450   200     0     0     0
   452  0.92165053E-01     0   451   200     0     0     0
   452  0.30307494E-04     0   450     5    11     0     0
   452  0.13437925E-04     0   450   125   131     0     0
   452  0.34910438E-03     0   451     5    11     0     0
   452  0.29063242E-01     0   450   203     0     0     0
   452  0.19395303E-01     0   450   204     0     0     0
   452  0.22644784E-01     0   450   205     0     0     0
   452  0.91119364E-01     0   451   203     0     0     0
   452  0.60301844E-01     0   451   204     0     0     0
   452  0.77663563E-01     0   451   205     0     0     0
   452  0.81452299E-02     0   406    12     0     0     0
   452  0.81452299E-02     0   412     6     0     0     0
  17
   453  0.18118614E+00     0   454   199     0     0     0
   453  0.18118614E+00     0   456   198     0     0     0
   453  0.11934736E+00     0   454   207     0     0     0
   453  0.11934736E+00     0   456   206     0     0     0
   453  0.21733804E-01     0   450   200     0     0     0
   453  0.73466450E-01     0   451   200     0     0     0
   453  0.26852571E-04     0   450     5    11     0     0
   453  0.11888405E-04     0   450   125   131     0     0
   453  0.30925719E-03     0   451     5    11     0     0
   453  0.25164921E-01     0   450   203     0     0     0
   453  0.19923521E-01     0   450   204     0     0     0
   453  0.17218646E-01     0   450   205     0     0     0
   453  0.85801512E-01     0   451   203     0     0     0
   453  0.68335786E-01     0   451   204     0     0     0
   453  0.53542610E-01     0   451   205     0     0     0
   453  0.16698828E-01     0   406    12     0     0     0
   453  0.16698828E-01     0   412     6     0     0     0
   5
   454  0.33381960E+00     0   450     2     7     0     0
   454  0.33381960E+00     0   450     4     9     0     0
   454  0.11083979E+00     0   450   127   122     0     0
   454  0.11083979E+00     0   450   129   124     0     0
   454  0.11068127E+00     0   450   131   126     0     0
  10
   455  0.11823893E-04     0   450   131   126     0     0
   455  0.48383679E-01     0   450   198     0     0     0
   455  0.36402814E-01     0   450   206     0     0     0
   455  0.17518252E+00     0   451   198     0     0     0
   455  0.12199739E+00     0   451   206     0     0     0
   455  0.30214783E-01     0   406    11     0     0     0
   455  0.16597418E+00     0   454   200     0     0     0
   455  0.17255832E+00     0   454   203     0     0     0
   455  0.12435081E+00     0   454   204     0     0     0
   455  0.12492363E+00     0   454   205     0     0     0
   5
   456  0.33381960E+00     0   450     8     1     0     0
   456  0.33381960E+00     0   450    10     3     0     0
   456  0.11083979E+00     0   450   121   128     0     0
   456  0.11083979E+00     0   450   123   130     0     0
   456  0.11068127E+00     0   450   125   132     0     0
  10
   457  0.11823893E-04     0   450   125   132     0     0
   457  0.48383679E-01     0   450   199     0     0     0
   457  0.36402814E-01     0   450   207     0     0     0
   457  0.17518252E+00     0   451   199     0     0     0
   457  0.12199739E+00     0   451   207     0     0     0
   457  0.30214783E-01     0   412     5     0     0     0
   457  0.16597418E+00     0   456   200     0     0     0
   457  0.17255832E+00     0   456   203     0     0     0
   457  0.12435081E+00     0   456   204     0     0     0
   457  0.12492363E+00     0   456   205     0     0     0
  28
   203  0.17136763E-03     0   123   129     0     0     0
   203  0.49025614E-01     0   125   131     0     0     0
   203  0.20550750E-02     0     3     9     0     0     0
   203  0.66367590E+00     0     5    11     0     0     0
   203  0.29561160E-01     0     4    10     0     0     0
   203  0.21006067E-02     0    59    59     0     0     0
   203  0.40034752E-01     0    13    13     0     0     0
   203  0.10593915E-01     0   198   121   128     0     0
   203  0.10593915E-01     0   198   123   130     0     0
   203  0.10593915E-01     0   198   125   132     0     0
   203  0.31781748E-01     0   198     8     1     0     0
   203  0.31781748E-01     0   198    10     3     0     0
   203  0.10593915E-01     0   199   127   122     0     0
   203  0.10593915E-01     0   199   129   124     0     0
   203  0.10593915E-01     0   199   131   126     0     0
   203  0.31781748E-01     0   199     2     7     0     0
   203  0.31781748E-01     0   199     4     9     0     0
   203  0.15514252E-02     0   200   122   128     0     0
   203  0.15514252E-02     0   200   124   130     0     0
   203  0.15514252E-02     0   200   126   132     0     0
   203  0.78081671E-03     0   200   121   127     0     0
   203  0.78081671E-03     0   200   123   129     0     0
   203  0.78081671E-03     0   200   125   131     0     0
   203  0.26750118E-02     0   200     2     8     0     0
   203  0.26750118E-02     0   200     4    10     0     0
   203  0.34460744E-02     0   200     1     7     0     0
   203  0.34460744E-02     0   200     3     9     0     0
   203  0.34460744E-02     0   200     5    11     0     0
  10
   204  0.49683457E-03     0   123   129     0     0     0
   204  0.14229906E+00     0   125   131     0     0     0
   204  0.14398121E-04     0     1     7     0     0     0
   204  0.58175698E-02     0     3     9     0     0     0
   204  0.85035408E+00     0     5    11     0     0     0
   204  0.47837687E-03     0     6    12     0     0     0
   204  0.14112670E-04     0   450   450     0     0     0
   204  0.89366506E-04     0   450   451     0     0     0
   204  0.14055560E-03     0   451   451     0     0     0
   204  0.29559905E-03     0   454   456     0     0     0
  11
   205  0.49676577E-03     0   123   129     0     0     0
   205  0.14228067E+00     0   125   131     0     0     0
   205  0.14396879E-04     0     1     7     0     0     0
   205  0.58170678E-02     0     3     9     0     0     0
   205  0.85030878E+00     0     5    11     0     0     0
   205  0.50664885E-03     0     6    12     0     0     0
   205  0.18111779E-04     0    13    13     0     0     0
   205  0.14133269E-04     0   450   450     0     0     0
   205  0.90371068E-04     0   450   451     0     0     0
   205  0.14529281E-03     0   451   451     0     0     0
   205  0.30773086E-03     0   454   456     0     0     0
   6
   206  0.55251364E-03     0   124   129     0     0     0
   206  0.15824768E+00     0   126   131     0     0     0
   206  0.14735202E-04     0     2     7     0     0     0
   206  0.59537617E-02     0     4     9     0     0     0
   206  0.83502740E+00     0     6    11     0     0     0
   206  0.20400049E-03     0   454   450     0     0     0
   6
   207  0.55251364E-03     0   130   123     0     0     0
   207  0.15824768E+00     0   132   125     0     0     0
   207  0.14735202E-04     0     8     1     0     0     0
   207  0.59537617E-02     0    10     3     0     0     0
   207  0.83502740E+00     0    12     5     0     0     0
   207  0.20400049E-03     0   456   450     0     0     0
   0
   5
     6  0.33333334E+00   100     2     7     5     0     0
     6  0.33333334E+00   100     4     9     5     0     0
     6  0.11111111E+00   100   122   127     5     0     0
     6  0.11111111E+00   100   124   129     5     0     0
     6  0.11111111E+00   100   126   131     5     0     0
   5
    12  0.33333334E+00   100     8     1    11     0     0
    12  0.33333334E+00   100    10     3    11     0     0
    12  0.11111111E+00   100   128   121    11     0     0
    12  0.11111111E+00   100   130   123    11     0     0
    12  0.11111111E+00   100   132   125    11     0     0
     50.40000153     -0.02003393
      0.99989587     -0.00199017      0.01427023      0.00080652
      0.00235349      0.99967313     -0.02545069     -0.00065908
     -0.00948229      0.01755102      0.70681930     -0.70711309
      0.01062067     -0.01848542     -0.70679253     -0.70709974
     -0.99999756      0.00220529     -0.00220529     -0.99999756
     -0.99931824      0.03691899     -0.03691899     -0.99931824
     -1.30006754     -0.43366548     -1.56193173
  -6152.55615234  -5427.36767578  -8195.57714844
   3075.23925781
    T
