#  ISAJET SUSY parameters in Les Houches accord format
#  Created by ISALHA3. Last revision by C. Balazs on 2005 Jan. 10
Block SPINFO   # Program information
     1   ISASUGRA from ISAJET          # Spectrum Calculator
     2   7.79   16-DEC-2008 15:42:00   # Version number
Block MODSEL   # Model selection
     1     1   # Minimal supergravity (mSUGRA,CMSSM) model         
Block SMINPUTS   # Standard Model inputs
     1     1.27837143E+02   # alpha_em^(-1)
     2     1.16570000E-05   # G_Fermi
     3     1.17200002E-01   # alpha_s(M_Z)
     4     9.11699982E+01   # m_{Z}(pole)
     5     4.19999981E+00   # m_{b}(m_{b})
     6     1.72500000E+02   # m_{top}(pole)
     7     1.77699995E+00   # m_{tau}(pole)
Block MINPAR   # SUSY breaking input parameters
     1     2.80000000E+02   # m_0
     2     3.40000000E+02   # m_{1/2}
     3     3.00000000E+00   # tan(beta)
     4     1.00000000E+00   # sign(mu)
     5     0.00000000E+00   # A_0
#  
#  M_{GUT} =   0.20319170E+17
Block MASS   # Scalar and gaugino mass spectrum
#  PDG code   mass                 particle
        24     8.04229965E+01   #  W^+
        25     1.00026718E+02   #  h^0            
        35     6.66563965E+02   #  H^0            
        36     6.59823242E+02   #  A^0            
        37     6.68836731E+02   #  H^+            
   1000001     7.92016663E+02   #  dnl            
   1000002     7.88537231E+02   #  upl            
   1000003     7.92016724E+02   #  stl            
   1000004     7.88538452E+02   #  chl            
   1000005     7.20111877E+02   #  b1             
   1000006     5.56480103E+02   #  t1             
   1000011     3.64231842E+02   #  el-            
   1000012     3.55950928E+02   #  nuel           
   1000013     3.64231842E+02   #  mul-           
   1000014     3.55950928E+02   #  numl           
   1000015     3.08753265E+02   #  tau1           
   1000016     3.55030273E+02   #  nutl           
   1000021     8.15109192E+02   #  glss           
   1000022     1.35391174E+02   #  z1ss           
   1000023     2.53346054E+02   #  z2ss           
   1000024     2.52978348E+02   #  w1ss           
   1000025    -5.11439636E+02   #  z3ss           
   1000035     5.33596069E+02   #  z4ss           
   1000037     5.30221436E+02   #  w2ss           
   2000001     7.64690063E+02   #  dnr            
   2000002     7.66472717E+02   #  upr            
   2000003     7.64690063E+02   #  str            
   2000004     7.66473999E+02   #  chr            
   2000005     7.63157532E+02   #  b2             
   2000006     7.71145203E+02   #  t2             
   2000011     3.08778687E+02   #  er-            
   2000013     3.08778717E+02   #  mur-           
   2000015     3.63805908E+02   #  tau2           
#  Higgs mixing
Block ALPHA   # Effective Higgs mixing parameter
         -3.33439410E-01   # alpha
Block STOPMIX   # stop mixing matrix
  1  1     4.71851617E-01   # O_{11}
  1  2    -8.81677985E-01   # O_{12}
  2  1     8.81677985E-01   # O_{21}
  2  2     4.71851617E-01   # O_{22}
Block SBOTMIX   # sbottom mixing matrix
  1  1     9.95386541E-01   # O_{11}
  1  2    -9.59459022E-02   # O_{12}
  2  1     9.59459022E-02   # O_{21}
  2  2     9.95386541E-01   # O_{22}
Block STAUMIX   # stau mixing matrix
  1  1     8.21541622E-02   # O_{11}
  1  2    -9.96619642E-01   # O_{12}
  2  1     9.96619642E-01   # O_{21}
  2  2     8.21541622E-02   # O_{22}
Block NMIX   # neutralino mixing matrix
  1  1     9.92073178E-01   #
  1  2    -4.83395420E-02   #
  1  3     1.01584703E-01   #
  1  4    -5.59874102E-02   #
  2  1    -7.64874890E-02   #
  2  2    -9.64138389E-01   #
  2  3     2.06675485E-01   #
  2  4    -1.47892520E-01   #
  3  1    -2.98693739E-02   #
  3  2     4.44524027E-02   #
  3  3     7.03458011E-01   #
  3  4     7.08715916E-01   #
  4  1    -9.51221958E-02   #
  4  2     2.57146955E-01   #
  4  3     6.72393084E-01   #
  4  4    -6.87542379E-01   #
Block UMIX   # chargino U mixing matrix
  1  1    -9.53047156E-01   # U_{11}
  1  2     3.02821994E-01   # U_{12}
  2  1    -3.02821994E-01   # U_{21}
  2  2    -9.53047156E-01   # U_{22}
Block VMIX   # chargino V mixing matrix
  1  1    -9.75779176E-01   # V_{11}
  1  2     2.18757823E-01   # V_{12}
  2  1    -2.18757823E-01   # V_{21}
  2  2    -9.75779176E-01   # V_{22}
Block GAUGE Q=  6.26754883E+02   #
     1     3.57525289E-01   # g`
     2     6.52366996E-01   # g_2
     3     1.21920288E+00   # g_3
Block YU Q=  6.26754883E+02   #
  3  3     9.12494183E-01   # y_t
Block YD Q=  6.26754883E+02   #
  3  3     4.33504060E-02   # y_b
Block YE Q=  6.26754883E+02   #
  3  3     3.18282880E-02   # y_tau
Block HMIX Q=  6.26754883E+02   # Higgs mixing parameters
     1     5.09858063E+02   # mu(Q)
     2     3.00000000E+00   # tan(beta)(M_{GUT})
     3     2.50478912E+02   # Higgs vev at Q
     4     4.35366719E+05   # m_A^2(Q)
Block MSOFT Q=  6.26754883E+02   # DRbar SUSY breaking parameters
     1     1.40583084E+02   # M_1(Q)          
     2     2.63123566E+02   # M_2(Q)          
     3     7.69918457E+02   # M_3(Q)          
    31     3.60021973E+02   # MeL(Q)          
    32     3.60021973E+02   # MmuL(Q)         
    33     3.59123962E+02   # MtauL(Q)        
    34     3.06285706E+02   # MeR(Q)          
    35     3.06285706E+02   # MmuR(Q)         
    36     3.05843536E+02   # MtauR(Q)        
    41     7.51131897E+02   # MqL1(Q)         
    42     7.51131897E+02   # MqL2(Q)         
    43     6.85729126E+02   # MqL3(Q)         
    44     7.28832703E+02   # MuR(Q)          
    45     7.28832703E+02   # McR(Q)          
    46     5.72852539E+02   # MtR(Q)          
    47     7.26043518E+02   # MdR(Q)          
    48     7.26043518E+02   # MsR(Q)          
    49     7.30603699E+02   # MbR(Q)          
Block AU Q=  6.26754883E+02   #
  1  1    -5.85887817E+02   # A_u
  2  2    -5.85887817E+02   # A_c
  3  3    -5.85887817E+02   # A_t
Block AD Q=  6.26754883E+02   #
  1  1    -9.23989746E+02   # A_d
  2  2    -9.23989746E+02   # A_s
  3  3    -9.23989746E+02   # A_b
Block AE Q=  6.26754883E+02   #
  1  1    -2.11020889E+02   # A_e
  2  2    -2.11020889E+02   # A_mu
  3  3    -2.11020889E+02   # A_tau
#  ISAJET decay tables in SUSY Les Houches accord format
#  Created by ISALHD. Last revision: C. Balazs, 2005 May 25
Block DCINFO                           # Program information
     1   ISASUGRA from ISAJET          # Spectrum Calculator
     2   7.79   16-DEC-2008 15:42:00   # Version number
#         PDG         Width
DECAY         6  1.14680767E+00   # TP    decays
#          BR          NDA       ID1       ID2       ID3       ID4
      3.33333343E-01    3            2        -1         5             # TP     -->  UP     DB     BT          
      3.33333343E-01    3            4        -3         5             # TP     -->  CH     SB     BT          
      1.11111112E-01    3          -11        12         5             # TP     -->  E+     NUE    BT          
      1.11111112E-01    3          -13        14         5             # TP     -->  MU+    NUM    BT          
      1.11111112E-01    3          -15        16         5             # TP     -->  TAU+   NUT    BT          
#         PDG         Width
DECAY   1000021  4.27231264E+00   # GLSS  decays
#          BR          NDA       ID1       ID2       ID3       ID4
      5.76774066E-04    3      1000024         5        -6             # GLSS   -->  W1SS+  BT     TB          
      5.76774066E-04    3     -1000024         6        -5             # GLSS   -->  W1SS-  TP     BB          
      2.80695022E-05    3      1000037         5        -6             # GLSS   -->  W2SS+  BT     TB          
      2.80695022E-05    3     -1000037         6        -5             # GLSS   -->  W2SS-  TP     BB          
      4.19669050E-07    2      1000022        21                       # GLSS   -->  Z1SS   GL                 
      7.04813938E-05    3      1000022         6        -6             # GLSS   -->  Z1SS   TP     TB          
      1.95284383E-06    2      1000023        21                       # GLSS   -->  Z2SS   GL                 
      3.16615100E-04    3      1000023         6        -6             # GLSS   -->  Z2SS   TP     TB          
      4.20390570E-05    2      1000025        21                       # GLSS   -->  Z3SS   GL                 
      2.43823979E-05    2      1000035        21                       # GLSS   -->  Z4SS   GL                 
      9.22934618E-03    2     -1000002         2                       # GLSS   -->  UBL    UP                 
      9.22934618E-03    2      1000002        -2                       # GLSS   -->  UPL    UB                 
      7.00082583E-03    2     -1000001         1                       # GLSS   -->  DBL    DN                 
      7.00082583E-03    2      1000001        -1                       # GLSS   -->  DNL    DB                 
      3.00755911E-02    2     -2000002         2                       # GLSS   -->  UBR    UP                 
      3.00755911E-02    2      2000002        -2                       # GLSS   -->  UPR    UB                 
      3.22478749E-02    2     -2000001         1                       # GLSS   -->  DBR    DN                 
      3.22478749E-02    2      2000001        -1                       # GLSS   -->  DNR    DB                 
      7.00054178E-03    2     -1000003         3                       # GLSS   -->  SBL    ST                 
      7.00054178E-03    2      1000003        -3                       # GLSS   -->  STL    SB                 
      3.22476402E-02    2     -2000003         3                       # GLSS   -->  SBR    ST                 
      3.22476402E-02    2      2000003        -3                       # GLSS   -->  STR    SB                 
      9.21699032E-03    2     -1000004         4                       # GLSS   -->  CBL    CH                 
      9.21699032E-03    2      1000004        -4                       # GLSS   -->  CHL    CB                 
      3.00631765E-02    2     -2000004         4                       # GLSS   -->  CBR    CH                 
      3.00631765E-02    2      2000004        -4                       # GLSS   -->  CHR    CB                 
      1.06826887E-01    2     -1000005         5                       # GLSS   -->  BB1    BT                 
      1.06826887E-01    2      1000005        -5                       # GLSS   -->  BT1    BB                 
      3.46690901E-02    2     -2000005         5                       # GLSS   -->  BB2    BT                 
      3.46690901E-02    2      2000005        -5                       # GLSS   -->  BT2    BB                 
      2.00589254E-01    2     -1000006         6                       # GLSS   -->  TB1    TP                 
      2.00589254E-01    2      1000006        -6                       # GLSS   -->  TP1    TB                 
#         PDG         Width
DECAY   1000002  7.84926796E+00   # UPL   decays
#          BR          NDA       ID1       ID2       ID3       ID4
      7.08964281E-03    2      1000022         2                       # UPL    -->  Z1SS   UP                 
      3.25375289E-01    2      1000023         2                       # UPL    -->  Z2SS   UP                 
      2.15645065E-04    2      1000025         2                       # UPL    -->  Z3SS   UP                 
      7.14093260E-03    2      1000035         2                       # UPL    -->  Z4SS   UP                 
      6.48030460E-01    2      1000024         1                       # UPL    -->  W1SS+  DN                 
      1.21480366E-02    2      1000037         1                       # UPL    -->  W2SS+  DN                 
#         PDG         Width
DECAY   1000001  7.73908472E+00   # DNL   decays
#          BR          NDA       ID1       ID2       ID3       ID4
      2.14935560E-02    2      1000022         1                       # DNL    -->  Z1SS   DN                 
      3.13373297E-01    2      1000023         1                       # DNL    -->  Z2SS   DN                 
      3.64961714E-04    2      1000025         1                       # DNL    -->  Z3SS   DN                 
      9.68558714E-03    2      1000035         1                       # DNL    -->  Z4SS   DN                 
      6.31024182E-01    2     -1000024         2                       # DNL    -->  W1SS-  UP                 
      2.40584221E-02    2     -1000037         2                       # DNL    -->  W2SS-  UP                 
#         PDG         Width
DECAY   1000003  7.73904705E+00   # STL   decays
#          BR          NDA       ID1       ID2       ID3       ID4
      2.14936621E-02    2      1000022         3                       # STL    -->  Z1SS   ST                 
      3.13374847E-01    2      1000023         3                       # STL    -->  Z2SS   ST                 
      3.64963606E-04    2      1000025         3                       # STL    -->  Z3SS   ST                 
      9.68563743E-03    2      1000035         3                       # STL    -->  Z4SS   ST                 
      6.31022811E-01    2     -1000024         4                       # STL    -->  W1SS-  CH                 
      2.40580905E-02    2     -1000037         4                       # STL    -->  W2SS-  CH                 
#         PDG         Width
DECAY   1000004  7.84926558E+00   # CHL   decays
#          BR          NDA       ID1       ID2       ID3       ID4
      7.08961301E-03    2      1000022         4                       # CHL    -->  Z1SS   CH                 
      3.25373739E-01    2      1000023         4                       # CHL    -->  Z2SS   CH                 
      2.15642649E-04    2      1000025         4                       # CHL    -->  Z3SS   CH                 
      7.14084040E-03    2      1000035         4                       # CHL    -->  Z4SS   CH                 
      6.48032069E-01    2      1000024         3                       # CHL    -->  W1SS+  ST                 
      1.21481214E-02    2      1000037         3                       # CHL    -->  W2SS+  ST                 
#         PDG         Width
DECAY   1000005  9.27658272E+00   # BT1   decays
#          BR          NDA       ID1       ID2       ID3       ID4
      1.66657921E-02    2      1000022         5                       # BT1    -->  Z1SS   BT                 
      2.25291505E-01    2      1000023         5                       # BT1    -->  Z2SS   BT                 
      4.90990176E-04    2      1000025         5                       # BT1    -->  Z3SS   BT                 
      5.03362715E-03    2      1000035         5                       # BT1    -->  Z4SS   BT                 
      3.76267403E-01    2     -1000024         6                       # BT1    -->  W1SS-  TP                 
      1.28218129E-01    2     -1000037         6                       # BT1    -->  W2SS-  TP                 
      2.48032555E-01    2          -24   1000006                       # BT1    -->  W-     TP1                
#         PDG         Width
DECAY   1000006  2.86811280E+00   # TP1   decays
#          BR          NDA       ID1       ID2       ID3       ID4
      2.70943493E-01    2      1000022         6                       # TP1    -->  Z1SS   TP                 
      1.70348004E-01    2      1000023         6                       # TP1    -->  Z2SS   TP                 
      5.42850077E-01    2      1000024         5                       # TP1    -->  W1SS+  BT                 
      1.58584025E-02    2      1000037         5                       # TP1    -->  W2SS+  BT                 
#         PDG         Width
DECAY   2000002  1.61322212E+00   # UPR   decays
#          BR          NDA       ID1       ID2       ID3       ID4
      9.92138684E-01    2      1000022         2                       # UPR    -->  Z1SS   UP                 
      4.98549175E-03    2      1000023         2                       # UPR    -->  Z2SS   UP                 
      2.94903177E-04    2      1000025         2                       # UPR    -->  Z3SS   UP                 
      2.58095399E-03    2      1000035         2                       # UPR    -->  Z4SS   UP                 
#         PDG         Width
DECAY   2000001  4.02235240E-01   # DNR   decays
#          BR          NDA       ID1       ID2       ID3       ID4
      9.92166579E-01    2      1000022         1                       # DNR    -->  Z1SS   DN                 
      4.98142187E-03    2      1000023         1                       # DNR    -->  Z2SS   DN                 
      2.92793935E-04    2      1000025         1                       # DNR    -->  Z3SS   DN                 
      2.55918526E-03    2      1000035         1                       # DNR    -->  Z4SS   DN                 
#         PDG         Width
DECAY   2000003  4.02235240E-01   # STR   decays
#          BR          NDA       ID1       ID2       ID3       ID4
      9.92166579E-01    2      1000022         3                       # STR    -->  Z1SS   ST                 
      4.98142187E-03    2      1000023         3                       # STR    -->  Z2SS   ST                 
      2.92793935E-04    2      1000025         3                       # STR    -->  Z3SS   ST                 
      2.55918526E-03    2      1000035         3                       # STR    -->  Z4SS   ST                 
#         PDG         Width
DECAY   2000004  1.61321449E+00   # CHR   decays
#          BR          NDA       ID1       ID2       ID3       ID4
      9.92138684E-01    2      1000022         4                       # CHR    -->  Z1SS   CH                 
      4.98548895E-03    2      1000023         4                       # CHR    -->  Z2SS   CH                 
      2.94900703E-04    2      1000025         4                       # CHR    -->  Z3SS   CH                 
      2.58092699E-03    2      1000035         4                       # CHR    -->  Z4SS   CH                 
#         PDG         Width
DECAY   2000005  5.35100222E-01   # BT2   decays
#          BR          NDA       ID1       ID2       ID3       ID4
      7.34388292E-01    2      1000022         5                       # BT2    -->  Z1SS   BT                 
      2.83758659E-02    2      1000023         5                       # BT2    -->  Z2SS   BT                 
      9.89595149E-03    2      1000025         5                       # BT2    -->  Z3SS   BT                 
      1.56701803E-02    2      1000035         5                       # BT2    -->  Z4SS   BT                 
      4.28058356E-02    2     -1000024         6                       # BT2    -->  W1SS-  TP                 
      8.04136992E-02    2     -1000037         6                       # BT2    -->  W2SS-  TP                 
      8.84501562E-02    2          -24   1000006                       # BT2    -->  W-     TP1                
#         PDG         Width
DECAY   2000006  1.10384836E+01   # TP2   decays
#          BR          NDA       ID1       ID2       ID3       ID4
      2.41357565E-01    2      1000024         5                       # TP2    -->  W1SS+  BT                 
      1.13044769E-01    2      1000037         5                       # TP2    -->  W2SS+  BT                 
      1.92257330E-01    2           23   1000006                       # TP2    -->  Z0     TP1                
      8.78721699E-02    2           25   1000006                       # TP2    -->  HL0    TP1                
      2.03786138E-02    2      1000022         6                       # TP2    -->  Z1SS   TP                 
      1.09834410E-01    2      1000023         6                       # TP2    -->  Z2SS   TP                 
      6.07528575E-02    2      1000025         6                       # TP2    -->  Z3SS   TP                 
      1.74502313E-01    2      1000035         6                       # TP2    -->  Z4SS   TP                 
#         PDG         Width
DECAY   1000011  1.44093800E+00   # EL-   decays
#          BR          NDA       ID1       ID2       ID3       ID4
      1.95148662E-01    2      1000022        11                       # EL-    -->  Z1SS   E-                 
      2.87023574E-01    2      1000023        11                       # EL-    -->  Z2SS   E-                 
      5.17827749E-01    2     -1000024        12                       # EL-    -->  W1SS-  NUE                
      2.91665442E-11    3      1000015        11       -15             # EL-    -->  TAU1-  E-     TAU+        
      1.45165165E-11    3     -1000015        11        15             # EL-    -->  TAU1+  E-     TAU-        
#         PDG         Width
DECAY   1000013  1.44093776E+00   # MUL-  decays
#          BR          NDA       ID1       ID2       ID3       ID4
      1.95148692E-01    2      1000022        13                       # MUL-   -->  Z1SS   MU-                
      2.87023425E-01    2      1000023        13                       # MUL-   -->  Z2SS   MU-                
      5.17827868E-01    2     -1000024        14                       # MUL-   -->  W1SS-  NUM                
      2.91665511E-11    3      1000015        13       -15             # MUL-   -->  TAU1-  MU-    TAU+        
      1.45165199E-11    3     -1000015        13        15             # MUL-   -->  TAU1+  MU-    TAU-        
#         PDG         Width
DECAY   1000015  1.00863326E+00   # TAU1- decays
#          BR          NDA       ID1       ID2       ID3       ID4
      9.95277047E-01    2      1000022        15                       # TAU1-  -->  Z1SS   TAU-               
      2.29900214E-03    2      1000023        15                       # TAU1-  -->  Z2SS   TAU-               
      2.42398679E-03    2     -1000024        16                       # TAU1-  -->  W1SS-  NUT                
#         PDG         Width
DECAY   1000012  1.39520037E+00   # NUEL  decays
#          BR          NDA       ID1       ID2       ID3       ID4
      2.76833743E-01    2      1000022        12                       # NUEL   -->  Z1SS   NUE                
      2.22307712E-01    2      1000023        12                       # NUEL   -->  Z2SS   NUE                
      5.00858545E-01    2      1000024        11                       # NUEL   -->  W1SS+  E-                 
      3.01153165E-11    3      1000015        12       -15             # NUEL   -->  TAU1-  NUE    TAU+        
      1.52814116E-11    3     -1000015        12        15             # NUEL   -->  TAU1+  NUE    TAU-        
      6.61392729E-12    3     -1000015        11        16             # NUEL   -->  TAU1+  E-     NUT         
#         PDG         Width
DECAY   1000014  1.39519989E+00   # NUML  decays
#          BR          NDA       ID1       ID2       ID3       ID4
      2.76833832E-01    2      1000022        14                       # NUML   -->  Z1SS   NUM                
      2.22307786E-01    2      1000023        14                       # NUML   -->  Z2SS   NUM                
      5.00858426E-01    2      1000024        13                       # NUML   -->  W1SS+  MU-                
      3.01153269E-11    3      1000015        14       -15             # NUML   -->  TAU1-  NUM    TAU+        
      1.52814168E-11    3     -1000015        14        15             # NUML   -->  TAU1+  NUM    TAU-        
      6.61414023E-12    3     -1000015        13        16             # NUML   -->  TAU1+  MU-    NUT         
#         PDG         Width
DECAY   1000016  1.37997365E+00   # NUTL  decays
#          BR          NDA       ID1       ID2       ID3       ID4
      2.78674245E-01    2      1000022        16                       # NUTL   -->  Z1SS   NUT                
      2.21795291E-01    2      1000023        16                       # NUTL   -->  Z2SS   NUT                
      4.99527693E-01    2      1000024        15                       # NUTL   -->  W1SS+  TAU-               
      2.76908878E-11    3     -1000015        16        15             # NUTL   -->  TAU1+  NUT    TAU-        
      3.02848065E-07    3      1000015        16       -15             # NUTL   -->  TAU1-  NUT    TAU+        
      3.02834081E-07    3      1000015        12       -11             # NUTL   -->  TAU1-  NUE    E+          
      3.02834081E-07    3      1000015        14       -13             # NUTL   -->  TAU1-  NUM    MU+         
      9.08502216E-07    3      1000015         2        -1             # NUTL   -->  TAU1-  UP     DB          
      9.08502216E-07    3      1000015         4        -3             # NUTL   -->  TAU1-  CH     SB          
#         PDG         Width
DECAY   2000011  1.00948620E+00   # ER-   decays
#          BR          NDA       ID1       ID2       ID3       ID4
      9.99027908E-01    2      1000022        11                       # ER-    -->  Z1SS   E-                 
      9.72150650E-04    2      1000023        11                       # ER-    -->  Z2SS   E-                 
      7.76552077E-38    3      1000015        12       -16             # ER-    -->  TAU1-  NUE    ANUT        
#         PDG         Width
DECAY   2000013  1.00948620E+00   # MUR-  decays
#          BR          NDA       ID1       ID2       ID3       ID4
      9.99027908E-01    2      1000022        13                       # MUR-   -->  Z1SS   MU-                
      9.72149486E-04    2      1000023        13                       # MUR-   -->  Z2SS   MU-                
      3.31043968E-33    3      1000015        14       -16             # MUR-   -->  TAU1-  NUM    ANUT        
#         PDG         Width
DECAY   2000015  1.42926979E+00   # TAU2- decays
#          BR          NDA       ID1       ID2       ID3       ID4
      2.00622335E-01    2      1000022        15                       # TAU2-  -->  Z1SS   TAU-               
      2.85055339E-01    2      1000023        15                       # TAU2-  -->  Z2SS   TAU-               
      5.14322340E-01    2     -1000024        16                       # TAU2-  -->  W1SS-  NUT                
#         PDG         Width
DECAY   1000023  1.80194341E-02   # Z2SS  decays
#          BR          NDA       ID1       ID2       ID3       ID4
      6.68457119E-07    2      1000022        22                       # Z2SS   -->  Z1SS   GM                 
      2.24364661E-02    2      1000022        23                       # Z2SS   -->  Z1SS   Z0                 
      8.05946968E-07    3      1000022         2        -2             # Z2SS   -->  Z1SS   UP     UB          
      2.00463114E-06    3      1000022         1        -1             # Z2SS   -->  Z1SS   DN     DB          
      2.00463069E-06    3      1000022         3        -3             # Z2SS   -->  Z1SS   ST     SB          
      8.05941568E-07    3      1000022         4        -4             # Z2SS   -->  Z1SS   CH     CB          
      3.00180750E-06    3      1000022         5        -5             # Z2SS   -->  Z1SS   BT     BB          
      1.53235989E-04    3      1000022        11       -11             # Z2SS   -->  Z1SS   E-     E+          
      1.53235975E-04    3      1000022        13       -13             # Z2SS   -->  Z1SS   MU-    MU+         
      1.58841969E-04    3      1000022        15       -15             # Z2SS   -->  Z1SS   TAU-   TAU+        
      1.91553350E-04    3      1000022        12       -12             # Z2SS   -->  Z1SS   NUE    ANUE        
      1.91553350E-04    3      1000022        14       -14             # Z2SS   -->  Z1SS   NUM    ANUM        
      1.94512279E-04    3      1000022        16       -16             # Z2SS   -->  Z1SS   NUT    ANUT        
      9.76511300E-01    2      1000022        25                       # Z2SS   -->  Z1SS   HL0                
#         PDG         Width
DECAY   1000025  3.79770374E+00   # Z3SS  decays
#          BR          NDA       ID1       ID2       ID3       ID4
      1.71832383E-07    2      1000022        22                       # Z3SS   -->  Z1SS   GM                 
      2.47990897E-07    2      1000023        22                       # Z3SS   -->  Z2SS   GM                 
      3.05216283E-01    2      1000024       -24                       # Z3SS   -->  W1SS+  W-                 
      3.05216283E-01    2     -1000024        24                       # Z3SS   -->  W1SS-  W+                 
      1.08432017E-01    2      1000022        23                       # Z3SS   -->  Z1SS   Z0                 
      2.61204720E-01    2      1000023        23                       # Z3SS   -->  Z2SS   Z0                 
      7.07174452E-09    3      1000022         2        -2             # Z3SS   -->  Z1SS   UP     UB          
      3.24659721E-09    3      1000022         1        -1             # Z3SS   -->  Z1SS   DN     DB          
      3.24659633E-09    3      1000022         3        -3             # Z3SS   -->  Z1SS   ST     SB          
      7.07168146E-09    3      1000022         4        -4             # Z3SS   -->  Z1SS   CH     CB          
      1.22845819E-07    3      1000022         5        -5             # Z3SS   -->  Z1SS   BT     BB          
      8.53189874E-09    3      1000022        15       -15             # Z3SS   -->  Z1SS   TAU-   TAU+        
      8.41589110E-09    3      1000023         2        -2             # Z3SS   -->  Z2SS   UP     UB          
      1.26965283E-08    3      1000023         1        -1             # Z3SS   -->  Z2SS   DN     DB          
      1.26965221E-08    3      1000023         3        -3             # Z3SS   -->  Z2SS   ST     SB          
      8.41581738E-09    3      1000023         4        -4             # Z3SS   -->  Z2SS   CH     CB          
      1.45641181E-07    3      1000023         5        -5             # Z3SS   -->  Z2SS   BT     BB          
      3.62930463E-09    3      1000023        15       -15             # Z3SS   -->  Z2SS   TAU-   TAU+        
      8.92951339E-03    2      1000022        25                       # Z3SS   -->  Z1SS   HL0                
      7.38555333E-03    2      1000023        25                       # Z3SS   -->  Z2SS   HL0                
      5.41054033E-05    2      1000011       -11                       # Z3SS   -->  EL-    E+                 
      5.41054033E-05    2     -1000011        11                       # Z3SS   -->  EL+    E-                 
      5.41053887E-05    2      1000013       -13                       # Z3SS   -->  MUL-   MU+                
      5.41053887E-05    2     -1000013        13                       # Z3SS   -->  MUL+   MU-                
      1.23400212E-04    2      2000011       -11                       # Z3SS   -->  ER-    E+                 
      1.23400212E-04    2     -2000011        11                       # Z3SS   -->  ER+    E-                 
      1.23400183E-04    2      2000013       -13                       # Z3SS   -->  MUR-   MU+                
      1.23400183E-04    2     -2000013        13                       # Z3SS   -->  MUR+   MU-                
      3.50721966E-04    2      1000015       -15                       # Z3SS   -->  TAU1-  TAU+               
      3.50721966E-04    2     -1000015        15                       # Z3SS   -->  TAU1+  TAU-               
      2.61427602E-04    2      2000015       -15                       # Z3SS   -->  TAU2-  TAU+               
      2.61427602E-04    2     -2000015        15                       # Z3SS   -->  TAU2+  TAU-               
      2.79190572E-04    2      1000012       -12                       # Z3SS   -->  NUEL   ANUE               
      2.79190572E-04    2     -1000012        12                       # Z3SS   -->  ANUEL  NUE                
      2.79190572E-04    2      1000014       -14                       # Z3SS   -->  NUML   ANUM               
      2.79190572E-04    2     -1000014        14                       # Z3SS   -->  ANUML  NUM                
      2.81907152E-04    2      1000016       -16                       # Z3SS   -->  NUTL   ANUT               
      2.81907152E-04    2     -1000016        16                       # Z3SS   -->  ANUTL  NUT                
#         PDG         Width
DECAY   1000035  4.27744198E+00   # Z4SS  decays
#          BR          NDA       ID1       ID2       ID3       ID4
      6.95104973E-07    2      1000022        22                       # Z4SS   -->  Z1SS   GM                 
      2.11670780E-07    2      1000023        22                       # Z4SS   -->  Z2SS   GM                 
      1.81217807E-09    2      1000025        22                       # Z4SS   -->  Z3SS   GM                 
      3.01381528E-01    2      1000024       -24                       # Z4SS   -->  W1SS+  W-                 
      3.01381528E-01    2     -1000024        24                       # Z4SS   -->  W1SS-  W+                 
      5.02528505E-11    3     -1000037         2        -1             # Z4SS   -->  W2SS-  UP     DB          
      1.67509513E-11    3     -1000037        12       -11             # Z4SS   -->  W2SS-  NUE    E+          
      1.67509513E-11    3     -1000037        14       -13             # Z4SS   -->  W2SS-  NUM    MU+         
      5.02528505E-11    3      1000037         1        -2             # Z4SS   -->  W2SS+  DN     UB          
      1.67509513E-11    3      1000037        11       -12             # Z4SS   -->  W2SS+  E-     ANUE        
      1.67509513E-11    3      1000037        13       -14             # Z4SS   -->  W2SS+  MU-    ANUM        
      5.02528505E-11    3     -1000037         4        -3             # Z4SS   -->  W2SS-  CH     SB          
      1.67509513E-11    3     -1000037        16       -15             # Z4SS   -->  W2SS-  NUT    TAU+        
      5.02528505E-11    3      1000037         3        -4             # Z4SS   -->  W2SS+  ST     CB          
      1.67509513E-11    3      1000037        15       -16             # Z4SS   -->  W2SS+  TAU-   ANUT        
      8.91291443E-03    2      1000022        23                       # Z4SS   -->  Z1SS   Z0                 
      8.49399902E-03    2      1000023        23                       # Z4SS   -->  Z2SS   Z0                 
      1.98949976E-07    3      1000022         2        -2             # Z4SS   -->  Z1SS   UP     UB          
      2.03333570E-07    3      1000022         1        -1             # Z4SS   -->  Z1SS   DN     DB          
      2.03333485E-07    3      1000022         3        -3             # Z4SS   -->  Z1SS   ST     SB          
      1.98948257E-07    3      1000022         4        -4             # Z4SS   -->  Z1SS   CH     CB          
      4.28132239E-07    3      1000022         5        -5             # Z4SS   -->  Z1SS   BT     BB          
      7.90106647E-09    3      1000022        15       -15             # Z4SS   -->  Z1SS   TAU-   TAU+        
      1.05399147E-06    3      1000023         2        -2             # Z4SS   -->  Z2SS   UP     UB          
      1.27305987E-06    3      1000023         1        -1             # Z4SS   -->  Z2SS   DN     DB          
      1.27305930E-06    3      1000023         3        -3             # Z4SS   -->  Z2SS   ST     SB          
      1.05398249E-06    3      1000023         4        -4             # Z4SS   -->  Z2SS   CH     CB          
      2.29672150E-06    3      1000023         5        -5             # Z4SS   -->  Z2SS   BT     BB          
      3.41200712E-09    3      1000023        15       -15             # Z4SS   -->  Z2SS   TAU-   TAU+        
      1.41730183E-07    3      1000025         2        -2             # Z4SS   -->  Z3SS   UP     UB          
      1.82952192E-07    3      1000025         1        -1             # Z4SS   -->  Z3SS   DN     DB          
      1.82952192E-07    3      1000025         3        -3             # Z4SS   -->  Z3SS   ST     SB          
      1.41730197E-07    3      1000025         4        -4             # Z4SS   -->  Z3SS   CH     CB          
      1.03195568E-07    3      1000025         5        -5             # Z4SS   -->  Z3SS   BT     BB          
      4.14784296E-08    3      1000025        11       -11             # Z4SS   -->  Z3SS   E-     E+          
      4.14784296E-08    3      1000025        13       -13             # Z4SS   -->  Z3SS   MU-    MU+         
      3.79194169E-08    3      1000025        15       -15             # Z4SS   -->  Z3SS   TAU-   TAU+        
      8.25290272E-08    3      1000025        12       -12             # Z4SS   -->  Z3SS   NUE    ANUE        
      8.25290272E-08    3      1000025        14       -14             # Z4SS   -->  Z3SS   NUM    ANUM        
      8.25290272E-08    3      1000025        16       -16             # Z4SS   -->  Z3SS   NUT    ANUT        
      8.66098776E-02    2      1000022        25                       # Z4SS   -->  Z1SS   HL0                
      2.19498843E-01    2      1000023        25                       # Z4SS   -->  Z2SS   HL0                
      3.14288610E-03    2      1000011       -11                       # Z4SS   -->  EL-    E+                 
      3.14288610E-03    2     -1000011        11                       # Z4SS   -->  EL+    E-                 
      3.14288586E-03    2      1000013       -13                       # Z4SS   -->  MUL-   MU+                
      3.14288586E-03    2     -1000013        13                       # Z4SS   -->  MUL+   MU-                
      1.26993377E-03    2      2000011       -11                       # Z4SS   -->  ER-    E+                 
      1.26993377E-03    2     -2000011        11                       # Z4SS   -->  ER+    E-                 
      1.26993353E-03    2      2000013       -13                       # Z4SS   -->  MUR-   MU+                
      1.26993353E-03    2     -2000013        13                       # Z4SS   -->  MUR+   MU-                
      1.26899162E-03    2      1000015       -15                       # Z4SS   -->  TAU1-  TAU+               
      1.26899162E-03    2     -1000015        15                       # Z4SS   -->  TAU1+  TAU-               
      3.46683594E-03    2      2000015       -15                       # Z4SS   -->  TAU2-  TAU+               
      3.46683594E-03    2     -2000015        15                       # Z4SS   -->  TAU2+  TAU-               
      7.74326641E-03    2      1000012       -12                       # Z4SS   -->  NUEL   ANUE               
      7.74326641E-03    2     -1000012        12                       # Z4SS   -->  ANUEL  NUE                
      7.74326641E-03    2      1000014       -14                       # Z4SS   -->  NUML   ANUM               
      7.74326641E-03    2     -1000014        14                       # Z4SS   -->  ANUML  NUM                
      7.80754816E-03    2      1000016       -16                       # Z4SS   -->  NUTL   ANUT               
      7.80754816E-03    2     -1000016        16                       # Z4SS   -->  ANUTL  NUT                
#         PDG         Width
DECAY   1000024  1.24530504E-02   # W1SS+ decays
#          BR          NDA       ID1       ID2       ID3       ID4
      3.75686432E-06    3      1000022         2        -1             # W1SS+  -->  Z1SS   UP     DB          
      3.75685499E-06    3      1000022         4        -3             # W1SS+  -->  Z1SS   CH     SB          
      4.79070732E-04    3      1000022       -11        12             # W1SS+  -->  Z1SS   E+     NUE         
      4.79070732E-04    3      1000022       -13        14             # W1SS+  -->  Z1SS   MU+    NUM         
      4.92171792E-04    3      1000022       -15        16             # W1SS+  -->  Z1SS   TAU+   NUT         
      9.98542190E-01    2      1000022        24                       # W1SS+  -->  Z1SS   W+                 
#         PDG         Width
DECAY   1000037  4.28842497E+00   # W2SS+ decays
#          BR          NDA       ID1       ID2       ID3       ID4
      2.48424925E-07    3      1000022         2        -1             # W2SS+  -->  Z1SS   UP     DB          
      2.48424413E-07    3      1000022         4        -3             # W2SS+  -->  Z1SS   CH     SB          
      5.05893683E-09    3      1000022       -15        16             # W2SS+  -->  Z1SS   TAU+   NUT         
      6.57438412E-02    2      1000022        24                       # W2SS+  -->  Z1SS   W+                 
      9.62522108E-07    3      1000023         2        -1             # W2SS+  -->  Z2SS   UP     DB          
      9.62519493E-07    3      1000023         4        -3             # W2SS+  -->  Z2SS   CH     SB          
      6.14646867E-09    3      1000023       -15        16             # W2SS+  -->  Z2SS   TAU+   NUT         
      3.27419102E-01    2      1000023        24                       # W2SS+  -->  Z2SS   W+                 
      2.15129461E-07    3      1000025         2        -1             # W2SS+  -->  Z3SS   UP     DB          
      2.15129461E-07    3      1000025         4        -3             # W2SS+  -->  Z3SS   CH     SB          
      7.17004340E-08    3      1000025       -11        12             # W2SS+  -->  Z3SS   E+     NUE         
      7.17004340E-08    3      1000025       -13        14             # W2SS+  -->  Z3SS   MU+    NUM         
      7.17004340E-08    3      1000025       -15        16             # W2SS+  -->  Z3SS   TAU+   NUT         
      7.51543045E-03    2      1000012       -11                       # W2SS+  -->  NUEL   E+                 
      7.51542952E-03    2      1000014       -13                       # W2SS+  -->  NUML   MU+                
      7.89539982E-03    2      1000016       -15                       # W2SS+  -->  NUTL   TAU+               
      1.33104986E-02    2     -1000011        12                       # W2SS+  -->  EL+    NUE                
      1.33104986E-02    2     -1000013        14                       # W2SS+  -->  MUL+   NUM                
      1.14000119E-04    2     -1000015        16                       # W2SS+  -->  TAU1+  NUT                
      1.36209885E-02    2     -2000015        16                       # W2SS+  -->  TAU2+  NUT                
      2.94279039E-01    2      1000024        23                       # W2SS+  -->  W1SS+  Z0                 
      1.16255455E-06    3      1000024         1        -1             # W2SS+  -->  W1SS+  DN     DB          
      1.16254478E-06    3      1000024         3        -3             # W2SS+  -->  W1SS+  ST     SB          
      2.07392623E-06    3      1000024         2        -2             # W2SS+  -->  W1SS+  UP     UB          
      2.07392532E-06    3      1000024         4        -4             # W2SS+  -->  W1SS+  CH     CB          
      2.49266267E-01    2      1000024        25                       # W2SS+  -->  W1SS+  HL0                
#         PDG         Width
DECAY        25  3.57870408E-03   # HL0   decays
#          BR          NDA       ID1       ID2       ID3       ID4
      5.08817477E-09    2           11       -11                       # HL0    -->  E-     E+                 
      2.14830507E-04    2           13       -13                       # HL0    -->  MU-    MU+                
      6.14146776E-02    2           15       -15                       # HL0    -->  TAU-   TAU+               
      6.39989275E-06    2            1        -1                       # HL0    -->  DN     DB                 
      2.58587603E-03    2            3        -3                       # HL0    -->  ST     SB                 
      8.64554703E-01    2            5        -5                       # HL0    -->  BT     BB                 
      1.89648529E-06    2            2        -2                       # HL0    -->  UP     UB                 
      3.64821702E-02    2            4        -4                       # HL0    -->  CH     CB                 
      1.26069214E-03    2           22        22                       # HL0    -->  GM     GM                 
      2.92897690E-02    2           21        21                       # HL0    -->  GL     GL                 
      2.32721184E-04    3           24        11       -12             # HL0    -->  W+     E-     ANUE        
      2.32721184E-04    3           24        13       -14             # HL0    -->  W+     MU-    ANUM        
      2.32721184E-04    3           24        15       -16             # HL0    -->  W+     TAU-   ANUT        
      6.98163582E-04    3           24        -2         1             # HL0    -->  W+     UB     DN          
      6.98163582E-04    3           24        -4         3             # HL0    -->  W+     CB     ST          
      2.32721184E-04    3          -24       -11        12             # HL0    -->  W-     E+     NUE         
      2.32721184E-04    3          -24       -13        14             # HL0    -->  W-     MU+    NUM         
      2.32721184E-04    3          -24       -15        16             # HL0    -->  W-     TAU+   NUT         
      6.98163582E-04    3          -24         2        -1             # HL0    -->  W-     UP     DB          
      6.98163582E-04    3          -24         4        -3             # HL0    -->  W-     CH     SB          
#         PDG         Width
DECAY        35  3.23177671E+00   # HH0   decays
#          BR          NDA       ID1       ID2       ID3       ID4
      3.12957799E-10    2           11       -11                       # HH0    -->  E-     E+                 
      1.32136420E-05    2           13       -13                       # HH0    -->  MU-    MU+                
      3.78442882E-03    2           15       -15                       # HH0    -->  TAU-   TAU+               
      3.84742037E-07    2            1        -1                       # HH0    -->  DN     DB                 
      1.55455258E-04    2            3        -3                       # HH0    -->  ST     SB                 
      2.29264554E-02    2            5        -5                       # HH0    -->  BT     BB                 
      1.64104086E-09    2            2        -2                       # HH0    -->  UP     UB                 
      2.42885635E-05    2            4        -4                       # HH0    -->  CH     CB                 
      8.77610207E-01    2            6        -6                       # HH0    -->  TP     TB                 
      8.72846249E-06    2           22        22                       # HH0    -->  GM     GM                 
      9.83312260E-04    2           21        21                       # HH0    -->  GL     GL                 
      3.73349851E-03    2           24       -24                       # HH0    -->  W+     W-                 
      1.86933111E-03    2           23        23                       # HH0    -->  Z0     Z0                 
      2.81577208E-03    2      1000022   1000022                       # HH0    -->  Z1SS   Z1SS               
      1.15518114E-02    2      1000022   1000023                       # HH0    -->  Z1SS   Z2SS               
      3.28466706E-02    2      1000022   1000025                       # HH0    -->  Z1SS   Z3SS               
      8.73757619E-03    2      1000023   1000023                       # HH0    -->  Z2SS   Z2SS               
      2.13261154E-02    2      1000024  -1000024                       # HH0    -->  W1SS+  W1SS-              
      1.06420368E-02    2           25        25                       # HH0    -->  HL0    HL0                
      3.22283362E-04    2      2000011  -2000011                       # HH0    -->  ER-    ER+                
      3.22265289E-04    2      2000013  -2000013                       # HH0    -->  MUR-   MUR+               
      3.26124777E-04    2      1000015  -1000015                       # HH0    -->  TAU1-  TAU1+              
#         PDG         Width
DECAY        36  4.32100058E+00   # HA0   decays
#          BR          NDA       ID1       ID2       ID3       ID4
      2.33549541E-10    2           11       -11                       # HA0    -->  E-     E+                 
      9.86088253E-06    2           13       -13                       # HA0    -->  MU-    MU+                
      2.82426714E-03    2           15       -15                       # HA0    -->  TAU-   TAU+               
      2.87145923E-07    2            1        -1                       # HA0    -->  DN     DB                 
      1.16021489E-04    2            3        -3                       # HA0    -->  ST     SB                 
      1.71126202E-02    2            5        -5                       # HA0    -->  BT     BB                 
      1.13428844E-09    2            2        -2                       # HA0    -->  UP     UB                 
      1.68094157E-05    2            4        -4                       # HA0    -->  CH     CB                 
      7.99986541E-01    2            6        -6                       # HA0    -->  TP     TB                 
      2.14444867E-06    2           22        22                       # HA0    -->  GM     GM                 
      6.93204871E-04    2           21        21                       # HA0    -->  GL     GL                 
      5.37556224E-03    2      1000022   1000022                       # HA0    -->  Z1SS   Z1SS               
      3.07538826E-02    2      1000022   1000023                       # HA0    -->  Z1SS   Z2SS               
      2.66875140E-04    2      1000022   1000025                       # HA0    -->  Z1SS   Z3SS               
      4.12877165E-02    2      1000023   1000023                       # HA0    -->  Z2SS   Z2SS               
      9.89294648E-02    2      1000024  -1000024                       # HA0    -->  W1SS+  W1SS-              
      2.62473943E-03    2           25        23                       # HA0    -->  HL0    Z0                 
#         PDG         Width
DECAY        37  3.34360456E+00   # H+    decays
#          BR          NDA       ID1       ID2       ID3       ID4
      3.05943298E-10    2           12       -11                       # H+     -->  NUE    E+                 
      1.29174769E-05    2           14       -13                       # H+     -->  NUM    MU+                
      3.69971152E-03    2           16       -15                       # H+     -->  NUT    TAU+               
      3.45862105E-07    2            2        -1                       # H+     -->  UP     DB                 
      1.59327654E-04    2            4        -3                       # H+     -->  CH     SB                 
      9.39397037E-01    2            6        -5                       # H+     -->  TP     BB                 
      4.61513847E-02    2      1000024   1000022                       # H+     -->  W1SS+  Z1SS               
      2.90939817E-04    2      1000024   1000023                       # H+     -->  W1SS+  Z2SS               
      6.73086615E-03    2      1000037   1000022                       # H+     -->  W2SS+  Z1SS               
      3.54727823E-03    2           25        24                       # H+     -->  HL0    W+                 
      1.02423064E-05    2     -1000015   1000016                       # H+     -->  TAU1+  NUTL               
