#  ISAJET SUSY parameters in SUSY Les Houches Accord 2 format
#  Created by ISALHA 2.0 Last revision: C. Balazs 21 Apr 2009
Block SPINFO   # Program information
     1   ISASUGRA from ISAJET          # Spectrum Calculator
     2   7.80   29-OCT-2009 12:50:36   # Version number
Block MODSEL   # Model selection
     1     1   # Minimal supergravity (mSUGRA) model               
Block SMINPUTS   # Standard Model inputs
     1     1.27844315E+02   # alpha_em^(-1)
     2     1.16570000E-05   # G_Fermi
     3     1.17200002E-01   # alpha_s(M_Z)
     4     9.11699982E+01   # m_{Z}(pole)
     5     4.19999981E+00   # m_{b}(m_{b})
     6     1.72500000E+02   # m_{top}(pole)
     7     1.77699995E+00   # m_{tau}(pole)
Block MINPAR   # SUSY breaking input parameters
     1     8.40000000E+02   # m_0
     2     3.10000000E+02   # m_{1/2}
     3     4.00000000E+01   # tan(beta)
     4     1.00000000E+00   # sign(mu)
     5     0.00000000E+00   # A_0
Block EXTPAR   # Non-universal SUSY breaking parameters
     0     2.21278347E+16   # Input scale
Block MASS   # Scalar and gaugino mass spectrum
#  PDG code   mass                 particle
        24     8.04229965E+01   #  W^+
        25     1.12532776E+02   #  h^0            
        35     6.74967468E+02   #  H^0            
        36     6.70540527E+02   #  A^0            
        37     6.80551270E+02   #  H^+            
   1000001     1.06862622E+03   #  dnl            
   1000002     1.06557654E+03   #  upl            
   1000003     1.06862622E+03   #  stl            
   1000004     1.06557739E+03   #  chl            
   1000005     8.60711975E+02   #  b1             
   1000006     7.18525085E+02   #  t1             
   1000011     8.64429443E+02   #  el-            
   1000012     8.60518127E+02   #  nuel           
   1000013     8.64429443E+02   #  mul-           
   1000014     8.60518127E+02   #  numl           
   1000015     7.01290955E+02   #  tau1           
   1000016     7.94380981E+02   #  nutl           
   1000021     7.85643738E+02   #  glss           
   1000022     1.26334717E+02   #  z1ss           
   1000023     2.34773880E+02   #  z2ss           
   1000024     2.35459625E+02   #  w1ss           
   1000025    -3.88308105E+02   #  z3ss           
   1000035     4.07773834E+02   #  z4ss           
   1000037     4.07834473E+02   #  w2ss           
   2000001     1.05463794E+03   #  dnr            
   2000002     1.05496997E+03   #  upr            
   2000003     1.05463794E+03   #  str            
   2000004     1.05497083E+03   #  chr            
   2000005     9.49288757E+02   #  b2             
   2000006     8.93254944E+02   #  t2             
   2000011     8.47874878E+02   #  er-            
   2000013     8.47874878E+02   #  mur-           
   2000015     8.01475464E+02   #  tau2           
Block ALPHA   # Effective Higgs mixing parameter
         -2.57575605E-02   # alpha
Block STOPMIX   # stop mixing matrix
  1  1     3.05254489E-01   # O_{11}
  1  2     9.52270806E-01   # O_{12}
  2  1    -9.52270806E-01   # O_{21}
  2  2     3.05254489E-01   # O_{22}
Block SBOTMIX   # sbottom mixing matrix
  1  1     9.70902979E-01   # O_{11}
  1  2     2.39473164E-01   # O_{12}
  2  1    -2.39473164E-01   # O_{21}
  2  2     9.70902979E-01   # O_{22}
Block STAUMIX   # stau mixing matrix
  1  1     1.97817668E-01   # O_{11}
  1  2     9.80238855E-01   # O_{12}
  2  1    -9.80238855E-01   # O_{21}
  2  2     1.97817668E-01   # O_{22}
Block NMIX   # neutralino mixing matrix
  1  1    -9.89228070E-01   #
  1  2     3.30207460E-02   #
  1  3    -1.34632468E-01   #
  1  4     4.70273122E-02   #
  2  1     8.04062709E-02   #
  2  2     9.32893217E-01   #
  2  3    -2.96121508E-01   #
  2  4     1.88565567E-01   #
  3  1    -5.84424101E-02   #
  3  2     8.30848366E-02   #
  3  3     6.97550118E-01   #
  3  4     7.09298909E-01   #
  4  1     1.07457682E-01   #
  4  2    -3.48879188E-01   #
  4  3    -6.38443291E-01   #
  4  4     6.77588701E-01   #
Block UMIX   # chargino U mixing matrix
  1  1    -9.07203794E-01   # U_{11}
  1  2     4.20691460E-01   # U_{12}
  2  1    -4.20691460E-01   # U_{21}
  2  2    -9.07203794E-01   # U_{22}
Block VMIX   # chargino V mixing matrix
  1  1    -9.63613808E-01   # V_{11}
  1  2     2.67298281E-01   # V_{12}
  2  1    -2.67298281E-01   # V_{21}
  2  2    -9.63613808E-01   # V_{22}
Block GAUGE Q=  7.62275696E+02   #
     1     3.57493877E-01   # g`
     2     6.52478635E-01   # g_2
     3     1.22067559E+00   # g_3
Block YU Q=  7.62275696E+02   #
  3  3     8.64613175E-01   # y_t
Block YD Q=  7.62275696E+02   #
  3  3     5.11504233E-01   # y_b
Block YE Q=  7.62275696E+02   #
  3  3     4.15580571E-01   # y_tau
Block HMIX Q=  7.62275696E+02   # Higgs mixing parameters
     1     3.79809387E+02   # mu(Q)
     2     4.00000000E+01   # tan(beta)(M_GUT)
     3     2.50794312E+02   # Higgs vev at Q
     4     4.49624594E+05   # m_A^2(Q)
Block MSOFT Q=  7.62275696E+02   # DRbar SUSY breaking parameters
     1     1.28985764E+02   # M_1(Q)          
     2     2.41135086E+02   # M_2(Q)          
     3     7.09844727E+02   # M_3(Q)          
    31     8.60594360E+02   # MeL(Q)          
    32     8.60594360E+02   # MmuL(Q)         
    33     7.95594421E+02   # MtauL(Q)        
    34     8.45965149E+02   # MeR(Q)          
    35     8.45965149E+02   # MmuR(Q)         
    36     7.06053223E+02   # MtauR(Q)        
    41     1.03174854E+03   # MqL1(Q)         
    42     1.03174854E+03   # MqL2(Q)         
    43     8.32870605E+02   # MqL3(Q)         
    44     1.02024078E+03   # MuR(Q)          
    45     1.02024078E+03   # McR(Q)          
    46     6.97664429E+02   # MtR(Q)          
    47     1.01895990E+03   # MdR(Q)          
    48     1.01895990E+03   # MsR(Q)          
    49     9.17740051E+02   # MbR(Q)          
Block AU Q=  7.62275696E+02   #
  1  1    -5.38727112E+02   # A_u
  2  2    -5.38727112E+02   # A_c
  3  3    -5.38727112E+02   # A_t
Block AD Q=  7.62275696E+02   #
  1  1    -7.08520996E+02   # A_d
  2  2    -7.08520996E+02   # A_s
  3  3    -7.08520996E+02   # A_b
Block AE Q=  7.62275696E+02   #
  1  1    -1.09076828E+02   # A_e
  2  2    -1.09076828E+02   # A_mu
  3  3    -1.09076828E+02   # A_tau
#  ISAJET decay tables in SUSY Les Houches accord format
#  Created by ISALHD. Last revision: C. Balazs, 2005 May 25
Block DCINFO                           # Program information
     1   ISASUGRA from ISAJET          # Spectrum Calculator
     2   7.80   29-OCT-2009 12:50:36   # Version number
#         PDG         Width
DECAY         6  1.14680779E+00   # TP    decays
#          BR          NDA       ID1       ID2       ID3       ID4
      3.33333343E-01    3            2        -1         5             # TP     -->  UP     DB     BT          
      3.33333343E-01    3            4        -3         5             # TP     -->  CH     SB     BT          
      1.11111112E-01    3          -11        12         5             # TP     -->  E+     NUE    BT          
      1.11111112E-01    3          -13        14         5             # TP     -->  MU+    NUM    BT          
      1.11111112E-01    3          -15        16         5             # TP     -->  TAU+   NUT    BT          
#         PDG         Width
DECAY   1000021  3.21932957E-02   # GLSS  decays
#          BR          NDA       ID1       ID2       ID3       ID4
      4.39039543E-02    3      1000024         1        -2             # GLSS   -->  W1SS+  DN     UB          
      4.39039543E-02    3     -1000024         2        -1             # GLSS   -->  W1SS-  UP     DB          
      4.39038575E-02    3      1000024         3        -4             # GLSS   -->  W1SS+  ST     CB          
      4.39038575E-02    3     -1000024         4        -3             # GLSS   -->  W1SS-  CH     SB          
      8.89085457E-02    3      1000024         5        -6             # GLSS   -->  W1SS+  BT     TB          
      8.89085457E-02    3     -1000024         6        -5             # GLSS   -->  W1SS-  TP     BB          
      2.05080304E-03    3      1000037         1        -2             # GLSS   -->  W2SS+  DN     UB          
      2.05080304E-03    3     -1000037         2        -1             # GLSS   -->  W2SS-  UP     DB          
      2.05079955E-03    3      1000037         3        -4             # GLSS   -->  W2SS+  ST     CB          
      2.05079955E-03    3     -1000037         4        -3             # GLSS   -->  W2SS-  CH     SB          
      9.83641669E-02    3      1000037         5        -6             # GLSS   -->  W2SS+  BT     TB          
      9.83641669E-02    3     -1000037         6        -5             # GLSS   -->  W2SS-  TP     BB          
      3.32549098E-05    2      1000022        21                       # GLSS   -->  Z1SS   GL                 
      1.96698494E-02    3      1000022         2        -2             # GLSS   -->  Z1SS   UP     UB          
      6.27900334E-03    3      1000022         1        -1             # GLSS   -->  Z1SS   DN     DB          
      6.27900334E-03    3      1000022         3        -3             # GLSS   -->  Z1SS   ST     SB          
      1.96697656E-02    3      1000022         4        -4             # GLSS   -->  Z1SS   CH     CB          
      2.25283522E-02    3      1000022         5        -5             # GLSS   -->  Z1SS   BT     BB          
      4.95069958E-02    3      1000022         6        -6             # GLSS   -->  Z1SS   TP     TB          
      1.95812946E-03    2      1000023        21                       # GLSS   -->  Z2SS   GL                 
      2.28460133E-02    3      1000023         2        -2             # GLSS   -->  Z2SS   UP     UB          
      2.10440848E-02    3      1000023         1        -1             # GLSS   -->  Z2SS   DN     DB          
      2.10440848E-02    3      1000023         3        -3             # GLSS   -->  Z2SS   ST     SB          
      2.28459127E-02    3      1000023         4        -4             # GLSS   -->  Z2SS   CH     CB          
      1.07706532E-01    3      1000023         5        -5             # GLSS   -->  Z2SS   BT     BB          
      1.15298014E-02    3      1000023         6        -6             # GLSS   -->  Z2SS   TP     TB          
      8.31703562E-03    2      1000025        21                       # GLSS   -->  Z3SS   GL                 
      3.03662473E-05    3      1000025         2        -2             # GLSS   -->  Z3SS   UP     UB          
      3.85291460E-05    3      1000025         1        -1             # GLSS   -->  Z3SS   DN     DB          
      3.85291460E-05    3      1000025         3        -3             # GLSS   -->  Z3SS   ST     SB          
      3.03660963E-05    3      1000025         4        -4             # GLSS   -->  Z3SS   CH     CB          
      4.27476838E-02    3      1000025         5        -5             # GLSS   -->  Z3SS   BT     BB          
      4.75579686E-03    3      1000025         6        -6             # GLSS   -->  Z3SS   TP     TB          
      7.18080858E-03    2      1000035        21                       # GLSS   -->  Z4SS   GL                 
      9.88151645E-04    3      1000035         2        -2             # GLSS   -->  Z4SS   UP     UB          
      1.16166717E-03    3      1000035         1        -1             # GLSS   -->  Z4SS   DN     DB          
      1.16166717E-03    3      1000035         3        -3             # GLSS   -->  Z4SS   ST     SB          
      9.88146756E-04    3      1000035         4        -4             # GLSS   -->  Z4SS   CH     CB          
      3.44633237E-02    3      1000035         5        -5             # GLSS   -->  Z4SS   BT     BB          
      6.79294113E-03    3      1000035         6        -6             # GLSS   -->  Z4SS   TP     TB          
#         PDG         Width
DECAY   1000002  2.56581154E+01   # UPL   decays
#          BR          NDA       ID1       ID2       ID3       ID4
      3.73290852E-03    2      1000022         2                       # UPL    -->  Z1SS   UP                 
      1.42109215E-01    2      1000023         2                       # UPL    -->  Z2SS   UP                 
      6.88692555E-04    2      1000025         2                       # UPL    -->  Z3SS   UP                 
      1.38018010E-02    2      1000035         2                       # UPL    -->  Z4SS   UP                 
      5.27754366E-01    2      1000021         2                       # UPL    -->  GLSS   UP                 
      2.93715358E-01    2      1000024         1                       # UPL    -->  W1SS+  DN                 
      1.81976277E-02    2      1000037         1                       # UPL    -->  W2SS+  DN                 
#         PDG         Width
DECAY   1000001  2.57372570E+01   # DNL   decays
#          BR          NDA       ID1       ID2       ID3       ID4
      7.80026289E-03    2      1000022         1                       # DNL    -->  Z1SS   DN                 
      1.33458108E-01    2      1000023         1                       # DNL    -->  Z2SS   DN                 
      1.15826249E-03    2      1000025         1                       # DNL    -->  Z3SS   DN                 
      1.73308719E-02    2      1000035         1                       # DNL    -->  Z4SS   DN                 
      5.34669578E-01    2      1000021         1                       # DNL    -->  GLSS   DN                 
      2.60428280E-01    2     -1000024         2                       # DNL    -->  W1SS-  UP                 
      4.51546758E-02    2     -1000037         2                       # DNL    -->  W2SS-  UP                 
#         PDG         Width
DECAY   1000003  2.57372303E+01   # STL   decays
#          BR          NDA       ID1       ID2       ID3       ID4
      7.80027080E-03    2      1000022         3                       # STL    -->  Z1SS   ST                 
      1.33458242E-01    2      1000023         3                       # STL    -->  Z2SS   ST                 
      1.15826365E-03    2      1000025         3                       # STL    -->  Z3SS   ST                 
      1.73308887E-02    2      1000035         3                       # STL    -->  Z4SS   ST                 
      5.34670115E-01    2      1000021         3                       # STL    -->  GLSS   ST                 
      2.60427624E-01    2     -1000024         4                       # STL    -->  W1SS-  CH                 
      4.51545306E-02    2     -1000037         4                       # STL    -->  W2SS-  CH                 
#         PDG         Width
DECAY   1000004  2.56579628E+01   # CHL   decays
#          BR          NDA       ID1       ID2       ID3       ID4
      3.73292086E-03    2      1000022         4                       # CHL    -->  Z1SS   CH                 
      1.42109707E-01    2      1000023         4                       # CHL    -->  Z2SS   CH                 
      6.88694534E-04    2      1000025         4                       # CHL    -->  Z3SS   CH                 
      1.38018439E-02    2      1000035         4                       # CHL    -->  Z4SS   CH                 
      5.27751684E-01    2      1000021         4                       # CHL    -->  GLSS   CH                 
      2.93717384E-01    2      1000024         3                       # CHL    -->  W1SS+  ST                 
      1.81977618E-02    2      1000037         3                       # CHL    -->  W2SS+  ST                 
#         PDG         Width
DECAY   1000005  1.99943714E+01   # BT1   decays
#          BR          NDA       ID1       ID2       ID3       ID4
      1.96679998E-02    2      1000022         5                       # BT1    -->  Z1SS   BT                 
      1.61131769E-01    2      1000023         5                       # BT1    -->  Z2SS   BT                 
      6.57714605E-02    2      1000025         5                       # BT1    -->  Z3SS   BT                 
      5.46479821E-02    2      1000035         5                       # BT1    -->  Z4SS   BT                 
      7.67401457E-02    2      1000021         5                       # BT1    -->  GLSS   BT                 
      2.69512355E-01    2     -1000024         6                       # BT1    -->  W1SS-  TP                 
      3.24167758E-01    2     -1000037         6                       # BT1    -->  W2SS-  TP                 
      2.83605736E-02    2          -24   1000006                       # BT1    -->  W-     TP1                
#         PDG         Width
DECAY   1000006  1.13319092E+01   # TP1   decays
#          BR          NDA       ID1       ID2       ID3       ID4
      1.12691335E-01    2      1000022         6                       # TP1    -->  Z1SS   TP                 
      6.91987574E-02    2      1000023         6                       # TP1    -->  Z2SS   TP                 
      2.35090449E-01    2      1000025         6                       # TP1    -->  Z3SS   TP                 
      9.22555178E-02    2      1000035         6                       # TP1    -->  Z4SS   TP                 
      1.71802282E-01    2      1000024         5                       # TP1    -->  W1SS+  BT                 
      3.18961620E-01    2      1000037         5                       # TP1    -->  W2SS+  BT                 
#         PDG         Width
DECAY   2000002  1.50890169E+01   # UPR   decays
#          BR          NDA       ID1       ID2       ID3       ID4
      1.50259569E-01    2      1000022         2                       # UPR    -->  Z1SS   UP                 
      9.23118030E-04    2      1000023         2                       # UPR    -->  Z2SS   UP                 
      4.03461949E-04    2      1000025         2                       # UPR    -->  Z3SS   UP                 
      1.32043904E-03    2      1000035         2                       # UPR    -->  Z4SS   UP                 
      8.47093403E-01    2      1000021         2                       # UPR    -->  GLSS   UP                 
#         PDG         Width
DECAY   2000001  1.33347702E+01   # DNR   decays
#          BR          NDA       ID1       ID2       ID3       ID4
      4.24925536E-02    2      1000022         1                       # DNR    -->  Z1SS   DN                 
      2.61040230E-04    2      1000023         1                       # DNR    -->  Z2SS   DN                 
      1.14076334E-04    2      1000025         1                       # DNR    -->  Z3SS   DN                 
      3.73336981E-04    2      1000035         1                       # DNR    -->  Z4SS   DN                 
      9.56759036E-01    2      1000021         1                       # DNR    -->  GLSS   DN                 
#         PDG         Width
DECAY   2000003  1.33347702E+01   # STR   decays
#          BR          NDA       ID1       ID2       ID3       ID4
      4.24925536E-02    2      1000022         3                       # STR    -->  Z1SS   ST                 
      2.61040230E-04    2      1000023         3                       # STR    -->  Z2SS   ST                 
      1.14076334E-04    2      1000025         3                       # STR    -->  Z3SS   ST                 
      3.73336981E-04    2      1000035         3                       # STR    -->  Z4SS   ST                 
      9.56759036E-01    2      1000021         3                       # STR    -->  GLSS   ST                 
#         PDG         Width
DECAY   2000004  1.50888605E+01   # CHR   decays
#          BR          NDA       ID1       ID2       ID3       ID4
      1.50260746E-01    2      1000022         4                       # CHR    -->  Z1SS   CH                 
      9.23125306E-04    2      1000023         4                       # CHR    -->  Z2SS   CH                 
      4.03464946E-04    2      1000025         4                       # CHR    -->  Z3SS   CH                 
      1.32044870E-03    2      1000035         4                       # CHR    -->  Z4SS   CH                 
      8.47092211E-01    2      1000021         4                       # CHR    -->  GLSS   CH                 
#         PDG         Width
DECAY   2000005  1.40058079E+01   # BT2   decays
#          BR          NDA       ID1       ID2       ID3       ID4
      2.99135558E-02    2      1000022         5                       # BT2    -->  Z1SS   BT                 
      5.47517370E-03    2      1000023         5                       # BT2    -->  Z2SS   BT                 
      1.27693877E-01    2      1000025         5                       # BT2    -->  Z3SS   BT                 
      1.23803012E-01    2      1000035         5                       # BT2    -->  Z4SS   BT                 
      4.09763455E-01    2      1000021         5                       # BT2    -->  GLSS   BT                 
      9.19952802E-03    2     -1000024         6                       # BT2    -->  W1SS-  TP                 
      2.80572653E-01    2     -1000037         6                       # BT2    -->  W2SS-  TP                 
      1.35787083E-02    2          -24   1000006                       # BT2    -->  W-     TP1                
#         PDG         Width
DECAY   2000006  2.05771599E+01   # TP2   decays
#          BR          NDA       ID1       ID2       ID3       ID4
      2.38941580E-01    2      1000024         5                       # TP2    -->  W1SS+  BT                 
      2.01337516E-01    2      1000037         5                       # TP2    -->  W2SS+  BT                 
      2.62152087E-02    2           23   1000006                       # TP2    -->  Z0     TP1                
      2.89489552E-02    2           25   1000006                       # TP2    -->  HL0    TP1                
      7.22437119E-03    2      1000022         6                       # TP2    -->  Z1SS   TP                 
      1.00440264E-01    2      1000023         6                       # TP2    -->  Z2SS   TP                 
      1.56849533E-01    2      1000025         6                       # TP2    -->  Z3SS   TP                 
      2.40042642E-01    2      1000035         6                       # TP2    -->  Z4SS   TP                 
#         PDG         Width
DECAY   1000011  9.99181271E+00   # EL-   decays
#          BR          NDA       ID1       ID2       ID3       ID4
      9.09581110E-02    2      1000022        11                       # EL-    -->  Z1SS   E-                 
      2.98268288E-01    2      1000023        11                       # EL-    -->  Z2SS   E-                 
      6.02636952E-04    2      1000025        11                       # EL-    -->  Z3SS   E-                 
      1.84893254E-02    2      1000035        11                       # EL-    -->  Z4SS   E-                 
      5.13778925E-01    2     -1000024        12                       # EL-    -->  W1SS-  NUE                
      7.79028162E-02    2     -1000037        12                       # EL-    -->  W2SS-  NUE                
#         PDG         Width
DECAY   1000013  9.99181271E+00   # MUL-  decays
#          BR          NDA       ID1       ID2       ID3       ID4
      9.09581110E-02    2      1000022        13                       # MUL-   -->  Z1SS   MU-                
      2.98268288E-01    2      1000023        13                       # MUL-   -->  Z2SS   MU-                
      6.02636952E-04    2      1000025        13                       # MUL-   -->  Z3SS   MU-                
      1.84893254E-02    2      1000035        13                       # MUL-   -->  Z4SS   MU-                
      5.13778925E-01    2     -1000024        14                       # MUL-   -->  W1SS-  NUM                
      7.79028162E-02    2     -1000037        14                       # MUL-   -->  W2SS-  NUM                
#         PDG         Width
DECAY   1000015  6.16563463E+00   # TAU1- decays
#          BR          NDA       ID1       ID2       ID3       ID4
      5.32675147E-01    2      1000022        15                       # TAU1-  -->  Z1SS   TAU-               
      7.89994076E-02    2      1000023        15                       # TAU1-  -->  Z2SS   TAU-               
      8.63885283E-02    2      1000025        15                       # TAU1-  -->  Z3SS   TAU-               
      5.44468910E-02    2      1000035        15                       # TAU1-  -->  Z4SS   TAU-               
      1.48311809E-01    2     -1000024        16                       # TAU1-  -->  W1SS-  NUT                
      9.91782621E-02    2     -1000037        16                       # TAU1-  -->  W2SS-  NUT                
#         PDG         Width
DECAY   1000012  1.00654955E+01   # NUEL  decays
#          BR          NDA       ID1       ID2       ID3       ID4
      1.14588976E-01    2      1000022        12                       # NUEL   -->  Z1SS   NUE                
      2.43478686E-01    2      1000023        12                       # NUEL   -->  Z2SS   NUE                
      3.02915578E-03    2      1000025        12                       # NUEL   -->  Z3SS   NUE                
      3.60109285E-02    2      1000035        12                       # NUEL   -->  Z4SS   NUE                
      5.71975827E-01    2      1000024        11                       # NUEL   -->  W1SS+  E-                 
      3.09163928E-02    2      1000037        11                       # NUEL   -->  W2SS+  E-                 
#         PDG         Width
DECAY   1000014  1.00654955E+01   # NUML  decays
#          BR          NDA       ID1       ID2       ID3       ID4
      1.14588976E-01    2      1000022        14                       # NUML   -->  Z1SS   NUM                
      2.43478686E-01    2      1000023        14                       # NUML   -->  Z2SS   NUM                
      3.02915578E-03    2      1000025        14                       # NUML   -->  Z3SS   NUM                
      3.60109285E-02    2      1000035        14                       # NUML   -->  Z4SS   NUM                
      5.71975827E-01    2      1000024        13                       # NUML   -->  W1SS+  MU-                
      3.09163928E-02    2      1000037        13                       # NUML   -->  W2SS+  MU-                
#         PDG         Width
DECAY   1000016  1.06543760E+01   # NUTL  decays
#          BR          NDA       ID1       ID2       ID3       ID4
      9.91730690E-02    2      1000022        16                       # NUTL   -->  Z1SS   NUT                
      2.06460044E-01    2      1000023        16                       # NUTL   -->  Z2SS   NUT                
      2.41266447E-03    2      1000025        16                       # NUTL   -->  Z3SS   NUT                
      2.83302944E-02    2      1000035        16                       # NUTL   -->  Z4SS   NUT                
      5.22432983E-01    2      1000024        15                       # NUTL   -->  W1SS+  TAU-               
      1.39554217E-01    2      1000037        15                       # NUTL   -->  W2SS+  TAU-               
      1.63681537E-03    2           24   1000015                       # NUTL   -->  W+     TAU1-              
#         PDG         Width
DECAY   2000011  4.09719563E+00   # ER-   decays
#          BR          NDA       ID1       ID2       ID3       ID4
      9.84771609E-01    2      1000022        11                       # ER-    -->  Z1SS   E-                 
      5.80144161E-03    2      1000023        11                       # ER-    -->  Z2SS   E-                 
      2.24510068E-03    2      1000025        11                       # ER-    -->  Z3SS   E-                 
      7.18179252E-03    2      1000035        11                       # ER-    -->  Z4SS   E-                 
#         PDG         Width
DECAY   2000013  4.09719563E+00   # MUR-  decays
#          BR          NDA       ID1       ID2       ID3       ID4
      9.84771609E-01    2      1000022        13                       # MUR-   -->  Z1SS   MU-                
      5.80144161E-03    2      1000023        13                       # MUR-   -->  Z2SS   MU-                
      2.24510068E-03    2      1000025        13                       # MUR-   -->  Z3SS   MU-                
      7.18179252E-03    2      1000035        13                       # MUR-   -->  Z4SS   MU-                
#         PDG         Width
DECAY   2000015  1.02032652E+01   # TAU2- decays
#          BR          NDA       ID1       ID2       ID3       ID4
      8.94147977E-02    2      1000022        15                       # TAU2-  -->  Z1SS   TAU-               
      2.47710869E-01    2      1000023        15                       # TAU2-  -->  Z2SS   TAU-               
      8.31457749E-02    2      1000025        15                       # TAU2-  -->  Z3SS   TAU-               
      9.23573151E-02    2      1000035        15                       # TAU2-  -->  Z4SS   TAU-               
      3.85819733E-01    2     -1000024        16                       # TAU2-  -->  W1SS-  NUT                
      1.00980870E-01    2     -1000037        16                       # TAU2-  -->  W2SS-  NUT                
      5.70618373E-04    2           23   1000015                       # TAU2-  -->  Z0     TAU1-              
#         PDG         Width
DECAY   1000023  1.74143130E-03   # Z2SS  decays
#          BR          NDA       ID1       ID2       ID3       ID4
      1.57624672E-05    2      1000022        22                       # Z2SS   -->  Z1SS   GM                 
      9.99472260E-01    2      1000022        23                       # Z2SS   -->  Z1SS   Z0                 
      1.76825165E-06    3      1000022         2        -2             # Z2SS   -->  Z1SS   UP     UB          
      3.13664736E-06    3      1000022         1        -1             # Z2SS   -->  Z1SS   DN     DB          
      3.13664736E-06    3      1000022         3        -3             # Z2SS   -->  Z1SS   ST     SB          
      1.76824585E-06    3      1000022         4        -4             # Z2SS   -->  Z1SS   CH     CB          
      2.91902426E-04    3      1000022         5        -5             # Z2SS   -->  Z1SS   BT     BB          
      1.68252718E-05    3      1000022        11       -11             # Z2SS   -->  Z1SS   E-     E+          
      1.68252718E-05    3      1000022        13       -13             # Z2SS   -->  Z1SS   MU-    MU+         
      1.17472562E-04    3      1000022        15       -15             # Z2SS   -->  Z1SS   TAU-   TAU+        
      1.73924582E-05    3      1000022        12       -12             # Z2SS   -->  Z1SS   NUE    ANUE        
      1.73924582E-05    3      1000022        14       -14             # Z2SS   -->  Z1SS   NUM    ANUM        
      2.43483391E-05    3      1000022        16       -16             # Z2SS   -->  Z1SS   NUT    ANUT        
#         PDG         Width
DECAY   1000025  1.35990143E+00   # Z3SS  decays
#          BR          NDA       ID1       ID2       ID3       ID4
      1.58974114E-08    2      1000022        22                       # Z3SS   -->  Z1SS   GM                 
      4.76003493E-07    2      1000023        22                       # Z3SS   -->  Z2SS   GM                 
      2.98250943E-01    2      1000024       -24                       # Z3SS   -->  W1SS+  W-                 
      2.98250943E-01    2     -1000024        24                       # Z3SS   -->  W1SS-  W+                 
      1.41654462E-01    2      1000022        23                       # Z3SS   -->  Z1SS   Z0                 
      2.25599274E-01    2      1000023        23                       # Z3SS   -->  Z2SS   Z0                 
      2.64992828E-09    3      1000022         2        -2             # Z3SS   -->  Z1SS   UP     UB          
      1.09123233E-09    3      1000022         1        -1             # Z3SS   -->  Z1SS   DN     DB          
      1.09123233E-09    3      1000022         3        -3             # Z3SS   -->  Z1SS   ST     SB          
      2.64991962E-09    3      1000022         4        -4             # Z3SS   -->  Z1SS   CH     CB          
      7.45444140E-06    3      1000022         5        -5             # Z3SS   -->  Z1SS   BT     BB          
      1.18761525E-08    3      1000022        11       -11             # Z3SS   -->  Z1SS   E-     E+          
      1.18761525E-08    3      1000022        13       -13             # Z3SS   -->  Z1SS   MU-    MU+         
      7.81792460E-06    3      1000022        15       -15             # Z3SS   -->  Z1SS   TAU-   TAU+        
      8.91388741E-09    3      1000022        12       -12             # Z3SS   -->  Z1SS   NUE    ANUE        
      8.91388741E-09    3      1000022        14       -14             # Z3SS   -->  Z1SS   NUM    ANUM        
      1.28424702E-08    3      1000022        16       -16             # Z3SS   -->  Z1SS   NUT    ANUT        
      1.32607936E-09    3      1000023         2        -2             # Z3SS   -->  Z2SS   UP     UB          
      2.06159045E-09    3      1000023         1        -1             # Z3SS   -->  Z2SS   DN     DB          
      2.06159045E-09    3      1000023         3        -3             # Z3SS   -->  Z2SS   ST     SB          
      1.32607469E-09    3      1000023         4        -4             # Z3SS   -->  Z2SS   CH     CB          
      2.85461715E-06    3      1000023         5        -5             # Z3SS   -->  Z2SS   BT     BB          
      6.07188244E-10    3      1000023        11       -11             # Z3SS   -->  Z2SS   E-     E+          
      6.07188244E-10    3      1000023        13       -13             # Z3SS   -->  Z2SS   MU-    MU+         
      7.89951173E-07    3      1000023        15       -15             # Z3SS   -->  Z2SS   TAU-   TAU+        
      2.58483945E-09    3      1000023        12       -12             # Z3SS   -->  Z2SS   NUE    ANUE        
      2.58483945E-09    3      1000023        14       -14             # Z3SS   -->  Z2SS   NUM    ANUM        
      3.77302278E-09    3      1000023        16       -16             # Z3SS   -->  Z2SS   NUT    ANUT        
      2.87407096E-02    2      1000022        25                       # Z3SS   -->  Z1SS   HL0                
      7.48421857E-03    2      1000023        25                       # Z3SS   -->  Z2SS   HL0                
#         PDG         Width
DECAY   1000035  1.69058633E+00   # Z4SS  decays
#          BR          NDA       ID1       ID2       ID3       ID4
      7.63363150E-09    2      1000022        22                       # Z4SS   -->  Z1SS   GM                 
      1.42028156E-07    2      1000023        22                       # Z4SS   -->  Z2SS   GM                 
      5.09062836E-09    2      1000025        22                       # Z4SS   -->  Z3SS   GM                 
      3.38343948E-01    2      1000024       -24                       # Z4SS   -->  W1SS+  W-                 
      3.38343948E-01    2     -1000024        24                       # Z4SS   -->  W1SS-  W+                 
      3.12969722E-02    2      1000022        23                       # Z4SS   -->  Z1SS   Z0                 
      1.90269370E-02    2      1000023        23                       # Z4SS   -->  Z2SS   Z0                 
      3.33206813E-08    3      1000022         2        -2             # Z4SS   -->  Z1SS   UP     UB          
      3.67184221E-08    3      1000022         1        -1             # Z4SS   -->  Z1SS   DN     DB          
      3.67184221E-08    3      1000022         3        -3             # Z4SS   -->  Z1SS   ST     SB          
      3.33205641E-08    3      1000022         4        -4             # Z4SS   -->  Z1SS   CH     CB          
      5.40912288E-06    3      1000022         5        -5             # Z4SS   -->  Z1SS   BT     BB          
      1.91799685E-07    3      1000022        11       -11             # Z4SS   -->  Z1SS   E-     E+          
      1.91799685E-07    3      1000022        13       -13             # Z4SS   -->  Z1SS   MU-    MU+         
      6.87163629E-06    3      1000022        15       -15             # Z4SS   -->  Z1SS   TAU-   TAU+        
      2.71527483E-07    3      1000022        12       -12             # Z4SS   -->  Z1SS   NUE    ANUE        
      2.71527483E-07    3      1000022        14       -14             # Z4SS   -->  Z1SS   NUM    ANUM        
      3.90389772E-07    3      1000022        16       -16             # Z4SS   -->  Z1SS   NUT    ANUT        
      1.05685473E-07    3      1000023         2        -2             # Z4SS   -->  Z2SS   UP     UB          
      1.22784499E-07    3      1000023         1        -1             # Z4SS   -->  Z2SS   DN     DB          
      1.22784499E-07    3      1000023         3        -3             # Z4SS   -->  Z2SS   ST     SB          
      1.05685103E-07    3      1000023         4        -4             # Z4SS   -->  Z2SS   CH     CB          
      2.83254099E-06    3      1000023         5        -5             # Z4SS   -->  Z2SS   BT     BB          
      7.49575833E-08    3      1000023        11       -11             # Z4SS   -->  Z2SS   E-     E+          
      7.49575833E-08    3      1000023        13       -13             # Z4SS   -->  Z2SS   MU-    MU+         
      7.63843218E-07    3      1000023        15       -15             # Z4SS   -->  Z2SS   TAU-   TAU+        
      1.25301298E-07    3      1000023        12       -12             # Z4SS   -->  Z2SS   NUE    ANUE        
      1.25301298E-07    3      1000023        14       -14             # Z4SS   -->  Z2SS   NUM    ANUM        
      1.83111226E-07    3      1000023        16       -16             # Z4SS   -->  Z2SS   NUT    ANUT        
      1.71527191E-07    3      1000025         2        -2             # Z4SS   -->  Z3SS   UP     UB          
      2.21401578E-07    3      1000025         1        -1             # Z4SS   -->  Z3SS   DN     DB          
      2.21401578E-07    3      1000025         3        -3             # Z4SS   -->  Z3SS   ST     SB          
      1.71527191E-07    3      1000025         4        -4             # Z4SS   -->  Z3SS   CH     CB          
      1.06116502E-07    3      1000025         5        -5             # Z4SS   -->  Z3SS   BT     BB          
      5.02240418E-08    3      1000025        11       -11             # Z4SS   -->  Z3SS   E-     E+          
      5.02240418E-08    3      1000025        13       -13             # Z4SS   -->  Z3SS   MU-    MU+         
      4.59988314E-08    3      1000025        15       -15             # Z4SS   -->  Z3SS   TAU-   TAU+        
      9.97668650E-08    3      1000025        12       -12             # Z4SS   -->  Z3SS   NUE    ANUE        
      9.97668650E-08    3      1000025        14       -14             # Z4SS   -->  Z3SS   NUM    ANUM        
      9.97414276E-08    3      1000025        16       -16             # Z4SS   -->  Z3SS   NUT    ANUT        
      9.71108079E-02    2      1000022        25                       # Z4SS   -->  Z1SS   HL0                
      1.75857455E-01    2      1000023        25                       # Z4SS   -->  Z2SS   HL0                
#         PDG         Width
DECAY   1000024  7.94183742E-03   # W1SS+ decays
#          BR          NDA       ID1       ID2       ID3       ID4
      1.04983087E-06    3      1000022         2        -1             # W1SS+  -->  Z1SS   UP     DB          
      1.04982962E-06    3      1000022         4        -3             # W1SS+  -->  Z1SS   CH     SB          
      7.71333634E-06    3      1000022       -11        12             # W1SS+  -->  Z1SS   E+     NUE         
      7.71333634E-06    3      1000022       -13        14             # W1SS+  -->  Z1SS   MU+    NUM         
      1.92696389E-05    3      1000022       -15        16             # W1SS+  -->  Z1SS   TAU+   NUT         
      9.99963164E-01    2      1000022        24                       # W1SS+  -->  Z1SS   W+                 
      9.47492865E-12    3      1000023       -11        12             # W1SS+  -->  Z2SS   E+     NUE         
      9.47492865E-12    3      1000023       -13        14             # W1SS+  -->  Z2SS   MU+    NUM         
#         PDG         Width
DECAY   1000037  1.51607335E+00   # W2SS+ decays
#          BR          NDA       ID1       ID2       ID3       ID4
      5.74091139E-08    3      1000022         2        -1             # W2SS+  -->  Z1SS   UP     DB          
      5.74090677E-08    3      1000022         4        -3             # W2SS+  -->  Z1SS   CH     SB          
      3.72799491E-07    3      1000022       -11        12             # W2SS+  -->  Z1SS   E+     NUE         
      3.72799491E-07    3      1000022       -13        14             # W2SS+  -->  Z1SS   MU+    NUM         
      7.60624653E-06    3      1000022       -15        16             # W2SS+  -->  Z1SS   TAU+   NUT         
      1.17704585E-01    2      1000022        24                       # W2SS+  -->  Z1SS   W+                 
      1.00411789E-07    3      1000023         2        -1             # W2SS+  -->  Z2SS   UP     DB          
      1.00411732E-07    3      1000023         4        -3             # W2SS+  -->  Z2SS   CH     SB          
      9.67346381E-08    3      1000023       -11        12             # W2SS+  -->  Z2SS   E+     NUE         
      9.67346381E-08    3      1000023       -13        14             # W2SS+  -->  Z2SS   MU+    NUM         
      1.48873539E-06    3      1000023       -15        16             # W2SS+  -->  Z2SS   TAU+   NUT         
      3.59185129E-01    2      1000023        24                       # W2SS+  -->  Z2SS   W+                 
      6.93435766E-07    3      1000025         2        -1             # W2SS+  -->  Z3SS   UP     DB          
      6.93435766E-07    3      1000025         4        -3             # W2SS+  -->  Z3SS   CH     SB          
      2.31091178E-07    3      1000025       -11        12             # W2SS+  -->  Z3SS   E+     NUE         
      2.31091178E-07    3      1000025       -13        14             # W2SS+  -->  Z3SS   MU+    NUM         
      2.32829478E-07    3      1000025       -15        16             # W2SS+  -->  Z3SS   TAU+   NUT         
      2.23724992E-22    3      1000035       -11        12             # W2SS+  -->  Z4SS   E+     NUE         
      3.02644372E-01    2      1000024        23                       # W2SS+  -->  W1SS+  Z0                 
      1.08159696E-07    3      1000024         1        -1             # W2SS+  -->  W1SS+  DN     DB          
      1.08159313E-07    3      1000024         3        -3             # W2SS+  -->  W1SS+  ST     SB          
      2.34487217E-07    3      1000024         2        -2             # W2SS+  -->  W1SS+  UP     UB          
      2.34487217E-07    3      1000024         4        -4             # W2SS+  -->  W1SS+  CH     CB          
      2.04596148E-07    3      1000024        12       -12             # W2SS+  -->  W1SS+  NUE    ANUE        
      2.04596148E-07    3      1000024        14       -14             # W2SS+  -->  W1SS+  NUM    ANUM        
      5.69356871E-07    3      1000024        16       -16             # W2SS+  -->  W1SS+  NUT    ANUT        
      9.51890655E-08    3      1000024        11       -11             # W2SS+  -->  W1SS+  E-     E+          
      9.51890655E-08    3      1000024        13       -13             # W2SS+  -->  W1SS+  MU-    MU+         
      1.39293988E-07    3      1000024        15       -15             # W2SS+  -->  W1SS+  TAU-   TAU+        
      2.20451489E-01    2      1000024        25                       # W2SS+  -->  W1SS+  HL0                
#         PDG         Width
DECAY        25  4.10947669E-03   # HL0   decays
#          BR          NDA       ID1       ID2       ID3       ID4
      4.94185715E-09    2           11       -11                       # HL0    -->  E-     E+                 
      2.08653015E-04    2           13       -13                       # HL0    -->  MU-    MU+                
      5.96723482E-02    2           15       -15                       # HL0    -->  TAU-   TAU+               
      6.20458241E-06    2            1        -1                       # HL0    -->  DN     DB                 
      2.50696181E-03    2            3        -3                       # HL0    -->  ST     SB                 
      8.24360311E-01    2            5        -5                       # HL0    -->  BT     BB                 
      1.86937768E-06    2            2        -2                       # HL0    -->  UP     UB                 
      3.53085510E-02    2            4        -4                       # HL0    -->  CH     CB                 
      1.66498614E-03    2           22        22                       # HL0    -->  GM     GM                 
      3.64785120E-02    2           21        21                       # HL0    -->  GL     GL                 
      2.07957858E-03    3           24        11       -12             # HL0    -->  W+     E-     ANUE        
      2.07957858E-03    3           24        13       -14             # HL0    -->  W+     MU-    ANUM        
      2.07957858E-03    3           24        15       -16             # HL0    -->  W+     TAU-   ANUT        
      6.23873575E-03    3           24        -2         1             # HL0    -->  W+     UB     DN          
      6.23873575E-03    3           24        -4         3             # HL0    -->  W+     CB     ST          
      2.07957858E-03    3          -24       -11        12             # HL0    -->  W-     E+     NUE         
      2.07957858E-03    3          -24       -13        14             # HL0    -->  W-     MU+    NUM         
      2.07957858E-03    3          -24       -15        16             # HL0    -->  W-     TAU+   NUT         
      6.23873575E-03    3          -24         2        -1             # HL0    -->  W-     UP     DB          
      6.23873575E-03    3          -24         4        -3             # HL0    -->  W-     CH     SB          
      1.61350006E-04    3           23        12       -12             # HL0    -->  Z0     NUE    ANUE        
      1.61350006E-04    3           23        14       -14             # HL0    -->  Z0     NUM    ANUM        
      1.61350006E-04    3           23        16       -16             # HL0    -->  Z0     NUT    ANUT        
      8.12058352E-05    3           23        11       -11             # HL0    -->  Z0     E-     E+          
      8.12058352E-05    3           23        13       -13             # HL0    -->  Z0     MU-    MU+         
      8.12058352E-05    3           23        15       -15             # HL0    -->  Z0     TAU-   TAU+        
      2.78204330E-04    3           23         2        -2             # HL0    -->  Z0     UP     UB          
      2.78204330E-04    3           23         4        -4             # HL0    -->  Z0     CH     CB          
      3.58395715E-04    3           23         1        -1             # HL0    -->  Z0     DN     DB          
      3.58395715E-04    3           23         3        -3             # HL0    -->  Z0     ST     SB          
      3.58395715E-04    3           23         5        -5             # HL0    -->  Z0     BT     BB          
#         PDG         Width
DECAY        35  1.87782650E+01   # HH0   decays
#          BR          NDA       ID1       ID2       ID3       ID4
      9.77289982E-09    2           11       -11                       # HH0    -->  E-     E+                 
      4.12629422E-04    2           13       -13                       # HH0    -->  MU-    MU+                
      1.18178494E-01    2           15       -15                       # HH0    -->  TAU-   TAU+               
      1.20131917E-05    2            1        -1                       # HH0    -->  DN     DB                 
      4.85393731E-03    2            3        -3                       # HH0    -->  ST     SB                 
      7.61745095E-01    2            5        -5                       # HH0    -->  BT     BB                 
      1.59457918E-12    2            2        -2                       # HH0    -->  UP     UB                 
      2.35645121E-08    2            4        -4                       # HH0    -->  CH     CB                 
      8.61259992E-04    2            6        -6                       # HH0    -->  TP     TB                 
      9.98564857E-08    2           22        22                       # HH0    -->  GM     GM                 
      8.98242251E-06    2           21        21                       # HH0    -->  GL     GL                 
      2.84714747E-06    2           24       -24                       # HH0    -->  W+     W-                 
      1.42641545E-06    2           23        23                       # HH0    -->  Z0     Z0                 
      1.42760517E-03    2      1000022   1000022                       # HH0    -->  Z1SS   Z1SS               
      7.38943601E-03    2      1000022   1000023                       # HH0    -->  Z1SS   Z2SS               
      1.20974379E-02    2      1000022   1000025                       # HH0    -->  Z1SS   Z3SS               
      2.89734127E-03    2      1000022   1000035                       # HH0    -->  Z1SS   Z4SS               
      7.51122599E-03    2      1000023   1000023                       # HH0    -->  Z2SS   Z2SS               
      1.94931254E-02    2      1000023   1000025                       # HH0    -->  Z2SS   Z3SS               
      7.86822580E-04    2      1000023   1000035                       # HH0    -->  Z2SS   Z4SS               
      1.77128222E-02    2      1000024  -1000024                       # HH0    -->  W1SS+  W1SS-              
      2.23037321E-02    2      1000024  -1000037                       # HH0    -->  W1SS+  W2SS-              
      2.23037321E-02    2     -1000024   1000037                       # HH0    -->  W1SS-  W2SS+              
      2.43543958E-08    2           25        25                       # HH0    -->  HL0    HL0                
#         PDG         Width
DECAY        36  1.86571560E+01   # HA0   decays
#          BR          NDA       ID1       ID2       ID3       ID4
      9.77220260E-09    2           11       -11                       # HA0    -->  E-     E+                 
      4.12600028E-04    2           13       -13                       # HA0    -->  MU-    MU+                
      1.18173316E-01    2           15       -15                       # HA0    -->  TAU-   TAU+               
      1.20130453E-05    2            1        -1                       # HA0    -->  DN     DB                 
      4.85387817E-03    2            3        -3                       # HA0    -->  ST     SB                 
      7.61815608E-01    2            5        -5                       # HA0    -->  BT     BB                 
      1.50148036E-12    2            2        -2                       # HA0    -->  UP     UB                 
      2.22068106E-08    2            4        -4                       # HA0    -->  CH     CB                 
      1.06099318E-03    2            6        -6                       # HA0    -->  TP     TB                 
      3.87448722E-08    2           22        22                       # HA0    -->  GM     GM                 
      2.15134260E-05    2           21        21                       # HA0    -->  GL     GL                 
      1.71822647E-03    2      1000022   1000022                       # HA0    -->  Z1SS   Z1SS               
      1.05959252E-02    2      1000022   1000023                       # HA0    -->  Z1SS   Z2SS               
      5.19471243E-03    2      1000022   1000025                       # HA0    -->  Z1SS   Z3SS               
      7.11208489E-03    2      1000022   1000035                       # HA0    -->  Z1SS   Z4SS               
      1.54295731E-02    2      1000023   1000023                       # HA0    -->  Z2SS   Z2SS               
      2.40832847E-03    2      1000023   1000025                       # HA0    -->  Z2SS   Z3SS               
      8.23894236E-03    2      1000023   1000035                       # HA0    -->  Z2SS   Z4SS               
      3.64406109E-02    2      1000024  -1000024                       # HA0    -->  W1SS+  W1SS-              
      1.32546499E-02    2      1000024  -1000037                       # HA0    -->  W1SS+  W2SS-              
      1.32546499E-02    2     -1000024   1000037                       # HA0    -->  W1SS-  W2SS+              
      2.67655605E-06    2           25        23                       # HA0    -->  HL0    Z0                 
#         PDG         Width
DECAY        37  1.58954153E+01   # H+    decays
#          BR          NDA       ID1       ID2       ID3       ID4
      1.16413101E-08    2           12       -11                       # H+     -->  NUE    E+                 
      4.91517072E-04    2           14       -13                       # H+     -->  NUM    MU+                
      1.40776113E-01    2           16       -15                       # H+     -->  NUT    TAU+               
      1.31084635E-05    2            2        -1                       # H+     -->  UP     DB                 
      5.29646315E-03    2            4        -3                       # H+     -->  CH     SB                 
      7.28441656E-01    2            6        -5                       # H+     -->  TP     BB                 
      1.92091689E-02    2      1000024   1000022                       # H+     -->  W1SS+  Z1SS               
      9.62812555E-05    2      1000024   1000023                       # H+     -->  W1SS+  Z2SS               
      3.39263380E-02    2      1000024   1000025                       # H+     -->  W1SS+  Z3SS               
      2.73976363E-02    2      1000024   1000035                       # H+     -->  W1SS+  Z4SS               
      9.26109590E-03    2      1000037   1000022                       # H+     -->  W2SS+  Z1SS               
      3.50873582E-02    2      1000037   1000023                       # H+     -->  W2SS+  Z2SS               
      3.29955969E-06    2           25        24                       # H+     -->  HL0    W+                 
