#  ISAJET SUSY parameters in Les Houches accord format
#  Created by ISALHA3. Last revision by C. Balazs on 2005 Jan. 10
Block SPINFO   # Program information
     1   ISASUGRA from ISAJET          # Spectrum Calculator
     2   7.79   16-DEC-2008 15:42:00   # Version number
Block MODSEL   # Model selection
     1     1   # Minimal supergravity (mSUGRA,CMSSM) model         
Block SMINPUTS   # Standard Model inputs
     1     1.27842041E+02   # alpha_em^(-1)
     2     1.16570000E-05   # G_Fermi
     3     1.17200002E-01   # alpha_s(M_Z)
     4     9.11699982E+01   # m_{Z}(pole)
     5     4.19999981E+00   # m_{b}(m_{b})
     6     1.72500000E+02   # m_{top}(pole)
     7     1.77699995E+00   # m_{tau}(pole)
Block MINPAR   # SUSY breaking input parameters
     1     1.60000000E+02   # m_0
     2     1.90000000E+02   # m_{1/2}
     3     3.00000000E+00   # tan(beta)
     4     1.00000000E+00   # sign(mu)
     5     0.00000000E+00   # A_0
#  
#  M_{GUT} =   0.24926214E+17
Block MASS   # Scalar and gaugino mass spectrum
#  PDG code   mass                 particle
        24     8.04229965E+01   #  W^+
        25     9.44299316E+01   #  h^0            
        35     3.85921112E+02   #  H^0            
        36     3.79316895E+02   #  A^0            
        37     3.89856445E+02   #  H^+            
   1000001     4.66577118E+02   #  dnl            
   1000002     4.60643524E+02   #  upl            
   1000003     4.66577179E+02   #  stl            
   1000004     4.60645660E+02   #  chl            
   1000005     4.23822418E+02   #  b1             
   1000006     3.06704803E+02   #  t1             
   1000011     2.09716507E+02   #  el-            
   1000012     1.96361923E+02   #  nuel           
   1000013     2.09716537E+02   #  mul-           
   1000014     1.96361923E+02   #  numl           
   1000015     1.78169312E+02   #  tau1           
   1000016     1.95835602E+02   #  nutl           
   1000021     4.78973602E+02   #  glss           
   1000022     6.84452896E+01   #  z1ss           
   1000023     1.25545273E+02   #  z2ss           
   1000024     1.23098335E+02   #  w1ss           
   1000025    -3.01063599E+02   #  z3ss           
   1000035     3.32970764E+02   #  z4ss           
   1000037     3.28048340E+02   #  w2ss           
   2000001     4.49800659E+02   #  dnr            
   2000002     4.49446106E+02   #  upr            
   2000003     4.49800690E+02   #  str            
   2000004     4.49448303E+02   #  chr            
   2000005     4.49400360E+02   #  b2             
   2000006     4.94265259E+02   #  t2             
   2000011     1.78677216E+02   #  er-            
   2000013     1.78677246E+02   #  mur-           
   2000015     2.09807983E+02   #  tau2           
#  Higgs mixing
Block ALPHA   # Effective Higgs mixing parameter
         -3.55373263E-01   # alpha
Block STOPMIX   # stop mixing matrix
  1  1     5.73349476E-01   # O_{11}
  1  2    -8.19310904E-01   # O_{12}
  2  1     8.19310904E-01   # O_{21}
  2  2     5.73349476E-01   # O_{22}
Block SBOTMIX   # sbottom mixing matrix
  1  1     9.85859871E-01   # O_{11}
  1  2    -1.67571828E-01   # O_{12}
  2  1     1.67571828E-01   # O_{21}
  2  2     9.85859871E-01   # O_{22}
Block STAUMIX   # stau mixing matrix
  1  1     1.46384984E-01   # O_{11}
  1  2    -9.89227712E-01   # O_{12}
  2  1     9.89227712E-01   # O_{21}
  2  2     1.46384984E-01   # O_{22}
Block NMIX   # neutralino mixing matrix
  1  1     9.62693810E-01   #
  1  2    -1.56992167E-01   #
  1  3     1.95027024E-01   #
  1  4    -1.02653913E-01   #
  2  1    -2.24475026E-01   #
  2  2    -9.17303860E-01   #
  2  3     2.73530394E-01   #
  2  4    -1.82607710E-01   #
  3  1     5.22497334E-02   #
  3  2    -7.85704255E-02   #
  3  3    -6.95888996E-01   #
  3  4    -7.11923361E-01   #
  4  1     1.41777530E-01   #
  4  2    -3.57398421E-01   #
  4  3    -6.34731174E-01   #
  4  4     6.70284748E-01   #
Block UMIX   # chargino U mixing matrix
  1  1    -8.99126291E-01   # U_{11}
  1  2     4.37689334E-01   # U_{12}
  2  1    -4.37689334E-01   # U_{21}
  2  2    -8.99126291E-01   # U_{22}
Block VMIX   # chargino V mixing matrix
  1  1    -9.55344796E-01   # V_{11}
  1  2     2.95493454E-01   # V_{12}
  2  1    -2.95493454E-01   # V_{21}
  2  2    -9.55344796E-01   # V_{22}
Block GAUGE Q=  3.67428497E+02   #
     1     3.57490182E-01   # g`
     2     6.52526140E-01   # g_2
     3     1.22099030E+00   # g_3
Block YU Q=  3.67428497E+02   #
  3  3     9.33269262E-01   # y_t
Block YD Q=  3.67428497E+02   #
  3  3     4.48945686E-02   # y_b
Block YE Q=  3.67428497E+02   #
  3  3     3.17652971E-02   # y_tau
Block HMIX Q=  3.67428497E+02   # Higgs mixing parameters
     1     2.98384125E+02   # mu(Q)
     2     3.00000000E+00   # tan(beta)(M_{GUT})
     3     2.49958145E+02   # Higgs vev at Q
     4     1.43881312E+05   # m_A^2(Q)
Block MSOFT Q=  3.67428497E+02   # DRbar SUSY breaking parameters
     1     7.64670563E+01   # M_1(Q)          
     2     1.45167694E+02   # M_2(Q)          
     3     4.50238922E+02   # M_3(Q)          
    31     2.04812134E+02   # MeL(Q)          
    32     2.04812134E+02   # MmuL(Q)         
    33     2.04312469E+02   # MtauL(Q)        
    34     1.74477676E+02   # MeR(Q)          
    35     1.74477676E+02   # MmuR(Q)         
    36     1.74228241E+02   # MtauR(Q)        
    41     4.40444977E+02   # MqL1(Q)         
    42     4.40444977E+02   # MqL2(Q)         
    43     4.01549805E+02   # MqL3(Q)         
    44     4.28144470E+02   # MuR(Q)          
    45     4.28144470E+02   # McR(Q)          
    46     3.36206665E+02   # MtR(Q)          
    47     4.26683411E+02   # MdR(Q)          
    48     4.26683411E+02   # MsR(Q)          
    49     4.29505066E+02   # MbR(Q)          
Block AU Q=  3.67428497E+02   #
  1  1    -3.45808472E+02   # A_u
  2  2    -3.45808472E+02   # A_c
  3  3    -3.45808472E+02   # A_t
Block AD Q=  3.67428497E+02   #
  1  1    -5.53950806E+02   # A_d
  2  2    -5.53950806E+02   # A_s
  3  3    -5.53950806E+02   # A_b
Block AE Q=  3.67428497E+02   #
  1  1    -1.21225143E+02   # A_e
  2  2    -1.21225143E+02   # A_mu
  3  3    -1.21225143E+02   # A_tau
#  ISAJET decay tables in SUSY Les Houches accord format
#  Created by ISALHD. Last revision: C. Balazs, 2005 May 25
Block DCINFO                           # Program information
     1   ISASUGRA from ISAJET          # Spectrum Calculator
     2   7.79   16-DEC-2008 15:42:00   # Version number
#         PDG         Width
DECAY         6  1.14680767E+00   # TP    decays
#          BR          NDA       ID1       ID2       ID3       ID4
      3.33333343E-01    3            2        -1         5             # TP     -->  UP     DB     BT          
      3.33333343E-01    3            4        -3         5             # TP     -->  CH     SB     BT          
      1.11111112E-01    3          -11        12         5             # TP     -->  E+     NUE    BT          
      1.11111112E-01    3          -13        14         5             # TP     -->  MU+    NUM    BT          
      1.11111112E-01    3          -15        16         5             # TP     -->  TAU+   NUT    BT          
#         PDG         Width
DECAY   1000021  1.62116861E+00   # GLSS  decays
#          BR          NDA       ID1       ID2       ID3       ID4
      7.81449303E-03    3      1000024         5        -6             # GLSS   -->  W1SS+  BT     TB          
      7.81449303E-03    3     -1000024         6        -5             # GLSS   -->  W1SS-  TP     BB          
      3.86550892E-06    2      1000022        21                       # GLSS   -->  Z1SS   GL                 
      2.26497022E-03    3      1000022         6        -6             # GLSS   -->  Z1SS   TP     TB          
      5.50067525E-05    2      1000023        21                       # GLSS   -->  Z2SS   GL                 
      8.25168390E-04    3      1000023         6        -6             # GLSS   -->  Z2SS   TP     TB          
      1.21639714E-04    2      1000025        21                       # GLSS   -->  Z3SS   GL                 
      1.27238032E-04    2      1000035        21                       # GLSS   -->  Z4SS   GL                 
      2.07389835E-02    2     -1000002         2                       # GLSS   -->  UBL    UP                 
      2.07389835E-02    2      1000002        -2                       # GLSS   -->  UPL    UB                 
      9.60558187E-03    2     -1000001         1                       # GLSS   -->  DBL    DN                 
      9.60558187E-03    2      1000001        -1                       # GLSS   -->  DNL    DB                 
      5.25410846E-02    2     -2000002         2                       # GLSS   -->  UBR    UP                 
      5.25410846E-02    2      2000002        -2                       # GLSS   -->  UPR    UB                 
      5.13260402E-02    2     -2000001         1                       # GLSS   -->  DBR    DN                 
      5.13260402E-02    2      2000001        -1                       # GLSS   -->  DNR    DB                 
      9.60428827E-03    2     -1000003         3                       # GLSS   -->  SBL    ST                 
      9.60428827E-03    2      1000003        -3                       # GLSS   -->  STL    SB                 
      5.13248183E-02    2     -2000003         3                       # GLSS   -->  SBR    ST                 
      5.13248183E-02    2      2000003        -3                       # GLSS   -->  STR    SB                 
      2.06800885E-02    2     -1000004         4                       # GLSS   -->  CBL    CH                 
      2.06800885E-02    2      1000004        -4                       # GLSS   -->  CHL    CB                 
      5.24819903E-02    2     -2000004         4                       # GLSS   -->  CBR    CH                 
      5.24819903E-02    2      2000004        -4                       # GLSS   -->  CHR    CB                 
      1.67203128E-01    2     -1000005         5                       # GLSS   -->  BB1    BT                 
      1.67203128E-01    2      1000005        -5                       # GLSS   -->  BT1    BB                 
      5.49805686E-02    2     -2000005         5                       # GLSS   -->  BB2    BT                 
      5.49805686E-02    2      2000005        -5                       # GLSS   -->  BT2    BB                 
#         PDG         Width
DECAY   1000002  4.71281147E+00   # UPL   decays
#          BR          NDA       ID1       ID2       ID3       ID4
      1.47780534E-04    2      1000022         2                       # UPL    -->  Z1SS   UP                 
      3.23874384E-01    2      1000023         2                       # UPL    -->  Z2SS   UP                 
      6.42749248E-04    2      1000025         2                       # UPL    -->  Z3SS   UP                 
      1.03043336E-02    2      1000035         2                       # UPL    -->  Z4SS   UP                 
      6.47579253E-01    2      1000024         1                       # UPL    -->  W1SS+  DN                 
      1.74515117E-02    2      1000037         1                       # UPL    -->  W2SS+  DN                 
#         PDG         Width
DECAY   1000001  4.52214575E+00   # DNL   decays
#          BR          NDA       ID1       ID2       ID3       ID4
      4.62097302E-02    2      1000022         1                       # DNL    -->  Z1SS   DN                 
      2.86876649E-01    2      1000023         1                       # DNL    -->  Z2SS   DN                 
      1.14935800E-03    2      1000025         1                       # DNL    -->  Z3SS   DN                 
      1.53703438E-02    2      1000035         1                       # DNL    -->  Z4SS   DN                 
      6.07847393E-01    2     -1000024         2                       # DNL    -->  W1SS-  UP                 
      4.25465293E-02    2     -1000037         2                       # DNL    -->  W2SS-  UP                 
#         PDG         Width
DECAY   1000003  4.52208090E+00   # STL   decays
#          BR          NDA       ID1       ID2       ID3       ID4
      4.62104008E-02    2      1000022         3                       # STL    -->  Z1SS   ST                 
      2.86880821E-01    2      1000023         3                       # STL    -->  Z2SS   ST                 
      1.14937499E-03    2      1000025         3                       # STL    -->  Z3SS   ST                 
      1.53705757E-02    2      1000035         3                       # STL    -->  Z4SS   ST                 
      6.07844472E-01    2     -1000024         4                       # STL    -->  W1SS-  CH                 
      4.25443724E-02    2     -1000037         4                       # STL    -->  W2SS-  CH                 
#         PDG         Width
DECAY   1000004  4.71280813E+00   # CHL   decays
#          BR          NDA       ID1       ID2       ID3       ID4
      1.47778730E-04    2      1000022         4                       # CHL    -->  Z1SS   CH                 
      3.23870122E-01    2      1000023         4                       # CHL    -->  Z2SS   CH                 
      6.42727886E-04    2      1000025         4                       # CHL    -->  Z3SS   CH                 
      1.03038214E-02    2      1000035         4                       # CHL    -->  Z4SS   CH                 
      6.47583604E-01    2      1000024         3                       # CHL    -->  W1SS+  ST                 
      1.74519382E-02    2      1000037         3                       # CHL    -->  W2SS+  ST                 
#         PDG         Width
DECAY   1000005  3.39807320E+00   # BT1   decays
#          BR          NDA       ID1       ID2       ID3       ID4
      5.77732325E-02    2      1000022         5                       # BT1    -->  Z1SS   BT                 
      3.29314023E-01    2      1000023         5                       # BT1    -->  Z2SS   BT                 
      1.22685824E-03    2      1000025         5                       # BT1    -->  Z3SS   BT                 
      1.07277492E-02    2      1000035         5                       # BT1    -->  Z4SS   BT                 
      4.11073357E-01    2     -1000024         6                       # BT1    -->  W1SS-  TP                 
      1.89884752E-01    2          -24   1000006                       # BT1    -->  W-     TP1                
#         PDG         Width
DECAY   1000006  1.73928332E+00   # TP1   decays
#          BR          NDA       ID1       ID2       ID3       ID4
      1.15723193E-01    2      1000022         6                       # TP1    -->  Z1SS   TP                 
      5.48129864E-02    2      1000023         6                       # TP1    -->  Z2SS   TP                 
      8.29463840E-01    2      1000024         5                       # TP1    -->  W1SS+  BT                 
#         PDG         Width
DECAY   2000002  9.46957111E-01   # UPR   decays
#          BR          NDA       ID1       ID2       ID3       ID4
      9.48764920E-01    2      1000022         2                       # UPR    -->  Z1SS   UP                 
      4.59553301E-02    2      1000023         2                       # UPR    -->  Z2SS   UP                 
      8.90223950E-04    2      1000025         2                       # UPR    -->  Z3SS   UP                 
      4.38947277E-03    2      1000035         2                       # UPR    -->  Z4SS   UP                 
#         PDG         Width
DECAY   2000001  2.36950308E-01   # DNR   decays
#          BR          NDA       ID1       ID2       ID3       ID4
      9.48738813E-01    2      1000022         1                       # DNR    -->  Z1SS   DN                 
      4.59628887E-02    2      1000023         1                       # DNR    -->  Z2SS   DN                 
      8.92417680E-04    2      1000025         1                       # DNR    -->  Z3SS   DN                 
      4.40586777E-03    2      1000035         1                       # DNR    -->  Z4SS   DN                 
#         PDG         Width
DECAY   2000003  2.36950338E-01   # STR   decays
#          BR          NDA       ID1       ID2       ID3       ID4
      9.48738813E-01    2      1000022         3                       # STR    -->  Z1SS   ST                 
      4.59628887E-02    2      1000023         3                       # STR    -->  Z2SS   ST                 
      8.92417796E-04    2      1000025         3                       # STR    -->  Z3SS   ST                 
      4.40586871E-03    2      1000035         3                       # STR    -->  Z4SS   ST                 
#         PDG         Width
DECAY   2000004  9.46944118E-01   # CHR   decays
#          BR          NDA       ID1       ID2       ID3       ID4
      9.48765218E-01    2      1000022         4                       # CHR    -->  Z1SS   CH                 
      4.59552966E-02    2      1000023         4                       # CHR    -->  Z2SS   CH                 
      8.90201889E-04    2      1000025         4                       # CHR    -->  Z3SS   CH                 
      4.38926974E-03    2      1000035         4                       # CHR    -->  Z4SS   CH                 
#         PDG         Width
DECAY   2000005  3.42560828E-01   # BT2   decays
#          BR          NDA       ID1       ID2       ID3       ID4
      6.32848561E-01    2      1000022         5                       # BT2    -->  Z1SS   BT                 
      1.01477541E-01    2      1000023         5                       # BT2    -->  Z2SS   BT                 
      1.27775455E-02    2      1000025         5                       # BT2    -->  Z3SS   BT                 
      2.27766130E-02    2      1000035         5                       # BT2    -->  Z4SS   BT                 
      9.56459567E-02    2     -1000024         6                       # BT2    -->  W1SS-  TP                 
      1.34473816E-01    2          -24   1000006                       # BT2    -->  W-     TP1                
#         PDG         Width
DECAY   2000006  4.79275370E+00   # TP2   decays
#          BR          NDA       ID1       ID2       ID3       ID4
      2.24867791E-01    2      1000024         5                       # TP2    -->  W1SS+  BT                 
      2.83823460E-01    2      1000037         5                       # TP2    -->  W2SS+  BT                 
      2.78977513E-01    2           23   1000006                       # TP2    -->  Z0     TP1                
      5.61531596E-02    2           25   1000006                       # TP2    -->  HL0    TP1                
      2.11288519E-02    2      1000022         6                       # TP2    -->  Z1SS   TP                 
      1.08708292E-01    2      1000023         6                       # TP2    -->  Z2SS   TP                 
      2.63409857E-02    2      1000025         6                       # TP2    -->  Z3SS   TP                 
#         PDG         Width
DECAY   1000011  1.10438716E+00   # EL-   decays
#          BR          NDA       ID1       ID2       ID3       ID4
      8.83633196E-02    2      1000022        11                       # EL-    -->  Z1SS   E-                 
      3.56387824E-01    2      1000023        11                       # EL-    -->  Z2SS   E-                 
      5.55248857E-01    2     -1000024        12                       # EL-    -->  W1SS-  NUE                
      5.24506549E-11    3      1000015        11       -15             # EL-    -->  TAU1-  E-     TAU+        
      2.53451149E-11    3     -1000015        11        15             # EL-    -->  TAU1+  E-     TAU-        
#         PDG         Width
DECAY   1000013  1.10438716E+00   # MUL-  decays
#          BR          NDA       ID1       ID2       ID3       ID4
      8.83632824E-02    2      1000022        13                       # MUL-   -->  Z1SS   MU-                
      3.56387556E-01    2      1000023        13                       # MUL-   -->  Z2SS   MU-                
      5.55249155E-01    2     -1000024        14                       # MUL-   -->  W1SS-  NUM                
      5.24508874E-11    3      1000015        13       -15             # MUL-   -->  TAU1-  MU-    TAU+        
      2.53452294E-11    3     -1000015        13        15             # MUL-   -->  TAU1+  MU-    TAU-        
#         PDG         Width
DECAY   1000015  6.27310336E-01   # TAU1- decays
#          BR          NDA       ID1       ID2       ID3       ID4
      9.57485080E-01    2      1000022        15                       # TAU1-  -->  Z1SS   TAU-               
      2.72141993E-02    2      1000023        15                       # TAU1-  -->  Z2SS   TAU-               
      1.53006893E-02    2     -1000024        16                       # TAU1-  -->  W1SS-  NUT                
#         PDG         Width
DECAY   1000012  1.03830457E+00   # NUEL  decays
#          BR          NDA       ID1       ID2       ID3       ID4
      2.89211333E-01    2      1000022        12                       # NUEL   -->  Z1SS   NUE                
      1.75391898E-01    2      1000023        12                       # NUEL   -->  Z2SS   NUE                
      5.35396755E-01    2      1000024        11                       # NUEL   -->  W1SS+  E-                 
      8.52976197E-12    3      1000015        12       -15             # NUEL   -->  TAU1-  NUE    TAU+        
      4.51942823E-12    3     -1000015        12        15             # NUEL   -->  TAU1+  NUE    TAU-        
      8.97904852E-13    3     -1000015        11        16             # NUEL   -->  TAU1+  E-     NUT         
#         PDG         Width
DECAY   1000014  1.03830385E+00   # NUML  decays
#          BR          NDA       ID1       ID2       ID3       ID4
      2.89211541E-01    2      1000022        14                       # NUML   -->  Z1SS   NUM                
      1.75392017E-01    2      1000023        14                       # NUML   -->  Z2SS   NUM                
      5.35396397E-01    2      1000024        13                       # NUML   -->  W1SS+  MU-                
      8.52976804E-12    3      1000015        14       -15             # NUML   -->  TAU1-  NUM    TAU+        
      4.51943127E-12    3     -1000015        14        15             # NUML   -->  TAU1+  NUM    TAU-        
      8.97915531E-13    3     -1000015        13        16             # NUML   -->  TAU1+  MU-    NUT         
#         PDG         Width
DECAY   1000016  1.02943385E+00   # NUTL  decays
#          BR          NDA       ID1       ID2       ID3       ID4
      2.90488660E-01    2      1000022        16                       # NUTL   -->  Z1SS   NUT                
      1.75118417E-01    2      1000023        16                       # NUTL   -->  Z2SS   NUT                
      5.34392893E-01    2      1000024        15                       # NUTL   -->  W1SS+  TAU-               
      7.43553916E-12    3     -1000015        16        15             # NUTL   -->  TAU1+  NUT    TAU-        
      9.22031251E-09    3      1000015        16       -15             # NUTL   -->  TAU1-  NUT    TAU+        
      9.21637788E-09    3      1000015        12       -11             # NUTL   -->  TAU1-  NUE    E+          
      9.21637788E-09    3      1000015        14       -13             # NUTL   -->  TAU1-  NUM    MU+         
      2.76491345E-08    3      1000015         2        -1             # NUTL   -->  TAU1-  UP     DB          
      2.76491345E-08    3      1000015         4        -3             # NUTL   -->  TAU1-  CH     SB          
#         PDG         Width
DECAY   2000011  6.24945581E-01   # ER-   decays
#          BR          NDA       ID1       ID2       ID3       ID4
      9.81216431E-01    2      1000022        11                       # ER-    -->  Z1SS   E-                 
      1.87836140E-02    2      1000023        11                       # ER-    -->  Z2SS   E-                 
      5.68921445E-31    3      1000015        12       -16             # ER-    -->  TAU1-  NUE    ANUT        
#         PDG         Width
DECAY   2000013  6.24945164E-01   # MUR-  decays
#          BR          NDA       ID1       ID2       ID3       ID4
      9.81216431E-01    2      1000022        13                       # MUR-   -->  Z1SS   MU-                
      1.87835917E-02    2      1000023        13                       # MUR-   -->  Z2SS   MU-                
      2.44611022E-26    3      1000015        14       -16             # MUR-   -->  TAU1-  NUM    ANUT        
#         PDG         Width
DECAY   2000015  1.09074605E+00   # TAU2- decays
#          BR          NDA       ID1       ID2       ID3       ID4
      1.01051398E-01    2      1000022        15                       # TAU2-  -->  Z1SS   TAU-               
      3.51980686E-01    2      1000023        15                       # TAU2-  -->  Z2SS   TAU-               
      5.46967924E-01    2     -1000024        16                       # TAU2-  -->  W1SS-  NUT                
#         PDG         Width
DECAY   1000023  3.63924869E-06   # Z2SS  decays
#          BR          NDA       ID1       ID2       ID3       ID4
      1.08442998E-06    2      1000022        22                       # Z2SS   -->  Z1SS   GM                 
      3.36019075E-05    3     -1000024         2        -1             # Z2SS   -->  W1SS-  UP     DB          
      1.12006355E-05    3     -1000024        12       -11             # Z2SS   -->  W1SS-  NUE    E+          
      1.12006355E-05    3     -1000024        14       -13             # Z2SS   -->  W1SS-  NUM    MU+         
      3.36019075E-05    3      1000024         1        -2             # Z2SS   -->  W1SS+  DN     UB          
      1.12006355E-05    3      1000024        11       -12             # Z2SS   -->  W1SS+  E-     ANUE        
      1.12006355E-05    3      1000024        13       -14             # Z2SS   -->  W1SS+  MU-    ANUM        
      5.90741113E-02    3      1000022         2        -2             # Z2SS   -->  Z1SS   UP     UB          
      1.01316363E-01    3      1000022         1        -1             # Z2SS   -->  Z1SS   DN     DB          
      1.01316355E-01    3      1000022         3        -3             # Z2SS   -->  Z1SS   ST     SB          
      5.90740293E-02    3      1000022         4        -4             # Z2SS   -->  Z1SS   CH     CB          
      1.06741086E-01    3      1000022         5        -5             # Z2SS   -->  Z1SS   BT     BB          
      8.87970701E-02    3      1000022        11       -11             # Z2SS   -->  Z1SS   E-     E+          
      8.87969360E-02    3      1000022        13       -13             # Z2SS   -->  Z1SS   MU-    MU+         
      9.82309580E-02    3      1000022        15       -15             # Z2SS   -->  Z1SS   TAU-   TAU+        
      9.81072262E-02    3      1000022        12       -12             # Z2SS   -->  Z1SS   NUE    ANUE        
      9.81072262E-02    3      1000022        14       -14             # Z2SS   -->  Z1SS   NUM    ANUM        
      1.00325540E-01    3      1000022        16       -16             # Z2SS   -->  Z1SS   NUT    ANUT        
#         PDG         Width
DECAY   1000025  1.81012499E+00   # Z3SS  decays
#          BR          NDA       ID1       ID2       ID3       ID4
      3.48111740E-07    2      1000022        22                       # Z3SS   -->  Z1SS   GM                 
      1.86380518E-07    2      1000023        22                       # Z3SS   -->  Z2SS   GM                 
      3.08627427E-01    2      1000024       -24                       # Z3SS   -->  W1SS+  W-                 
      3.08627427E-01    2     -1000024        24                       # Z3SS   -->  W1SS-  W+                 
      1.56427115E-01    2      1000022        23                       # Z3SS   -->  Z1SS   Z0                 
      1.91294417E-01    2      1000023        23                       # Z3SS   -->  Z2SS   Z0                 
      2.75485519E-08    3      1000022         2        -2             # Z3SS   -->  Z1SS   UP     UB          
      2.84279853E-08    3      1000022         1        -1             # Z3SS   -->  Z1SS   DN     DB          
      2.84279711E-08    3      1000022         3        -3             # Z3SS   -->  Z1SS   ST     SB          
      2.75478307E-08    3      1000022         4        -4             # Z3SS   -->  Z1SS   CH     CB          
      2.81490998E-07    3      1000022         5        -5             # Z3SS   -->  Z1SS   BT     BB          
      1.75254407E-08    3      1000022        15       -15             # Z3SS   -->  Z1SS   TAU-   TAU+        
      5.63119755E-08    3      1000023         2        -2             # Z3SS   -->  Z2SS   UP     UB          
      7.09257293E-08    3      1000023         1        -1             # Z3SS   -->  Z2SS   DN     DB          
      7.09256796E-08    3      1000023         3        -3             # Z3SS   -->  Z2SS   ST     SB          
      5.63105509E-08    3      1000023         4        -4             # Z3SS   -->  Z2SS   CH     CB          
      3.33800614E-07    3      1000023         5        -5             # Z3SS   -->  Z2SS   BT     BB          
      6.10732620E-09    3      1000023        15       -15             # Z3SS   -->  Z2SS   TAU-   TAU+        
      1.40013192E-02    2      1000022        25                       # Z3SS   -->  Z1SS   HL0                
      7.70057505E-03    2      1000023        25                       # Z3SS   -->  Z2SS   HL0                
      2.30534890E-04    2      1000011       -11                       # Z3SS   -->  EL-    E+                 
      2.30534890E-04    2     -1000011        11                       # Z3SS   -->  EL+    E-                 
      2.30534672E-04    2      1000013       -13                       # Z3SS   -->  MUL-   MU+                
      2.30534672E-04    2     -1000013        13                       # Z3SS   -->  MUL+   MU-                
      4.84544056E-04    2      2000011       -11                       # Z3SS   -->  ER-    E+                 
      4.84544056E-04    2     -2000011        11                       # Z3SS   -->  ER+    E-                 
      4.84543765E-04    2      2000013       -13                       # Z3SS   -->  MUR-   MU+                
      4.84543765E-04    2     -2000013        13                       # Z3SS   -->  MUR+   MU-                
      6.22971507E-04    2      1000015       -15                       # Z3SS   -->  TAU1-  TAU+               
      6.22971507E-04    2     -1000015        15                       # Z3SS   -->  TAU1+  TAU-               
      6.05352980E-04    2      2000015       -15                       # Z3SS   -->  TAU2-  TAU+               
      6.05352980E-04    2     -2000015        15                       # Z3SS   -->  TAU2+  TAU-               
      1.33034540E-03    2      1000012       -12                       # Z3SS   -->  NUEL   ANUE               
      1.33034540E-03    2     -1000012        12                       # Z3SS   -->  ANUEL  NUE                
      1.33034540E-03    2      1000014       -14                       # Z3SS   -->  NUML   ANUM               
      1.33034540E-03    2     -1000014        14                       # Z3SS   -->  ANUML  NUM                
      1.34091184E-03    2      1000016       -16                       # Z3SS   -->  NUTL   ANUT               
      1.34091184E-03    2     -1000016        16                       # Z3SS   -->  ANUTL  NUT                
#         PDG         Width
DECAY   1000035  2.54477406E+00   # Z4SS  decays
#          BR          NDA       ID1       ID2       ID3       ID4
      5.54449684E-07    2      1000022        22                       # Z4SS   -->  Z1SS   GM                 
      4.71025572E-07    2      1000023        22                       # Z4SS   -->  Z2SS   GM                 
      1.31455211E-08    2      1000025        22                       # Z4SS   -->  Z3SS   GM                 
      2.86689907E-01    2      1000024       -24                       # Z4SS   -->  W1SS+  W-                 
      2.86689907E-01    2     -1000024        24                       # Z4SS   -->  W1SS-  W+                 
      5.99901573E-10    3     -1000037         2        -1             # Z4SS   -->  W2SS-  UP     DB          
      1.99967182E-10    3     -1000037        12       -11             # Z4SS   -->  W2SS-  NUE    E+          
      1.99967182E-10    3     -1000037        14       -13             # Z4SS   -->  W2SS-  NUM    MU+         
      5.99901573E-10    3      1000037         1        -2             # Z4SS   -->  W2SS+  DN     UB          
      1.99967182E-10    3      1000037        11       -12             # Z4SS   -->  W2SS+  E-     ANUE        
      1.99967182E-10    3      1000037        13       -14             # Z4SS   -->  W2SS+  MU-    ANUM        
      5.99901573E-10    3     -1000037         4        -3             # Z4SS   -->  W2SS-  CH     SB          
      1.99967182E-10    3     -1000037        16       -15             # Z4SS   -->  W2SS-  NUT    TAU+        
      5.99901573E-10    3      1000037         3        -4             # Z4SS   -->  W2SS+  ST     CB          
      1.99967182E-10    3      1000037        15       -16             # Z4SS   -->  W2SS+  TAU-   ANUT        
      1.36299124E-02    2      1000022        23                       # Z4SS   -->  Z1SS   Z0                 
      9.28435754E-03    2      1000023        23                       # Z4SS   -->  Z2SS   Z0                 
      5.08121047E-07    3      1000022         2        -2             # Z4SS   -->  Z1SS   UP     UB          
      1.28419697E-06    3      1000022         1        -1             # Z4SS   -->  Z1SS   DN     DB          
      1.28419595E-06    3      1000022         3        -3             # Z4SS   -->  Z1SS   ST     SB          
      5.08107405E-07    3      1000022         4        -4             # Z4SS   -->  Z1SS   CH     CB          
      2.28099680E-06    3      1000022         5        -5             # Z4SS   -->  Z1SS   BT     BB          
      1.41446579E-08    3      1000022        15       -15             # Z4SS   -->  Z1SS   TAU-   TAU+        
      4.91261790E-06    3      1000023         2        -2             # Z4SS   -->  Z2SS   UP     UB          
      5.09703568E-06    3      1000023         1        -1             # Z4SS   -->  Z2SS   DN     DB          
      5.09703113E-06    3      1000023         3        -3             # Z4SS   -->  Z2SS   ST     SB          
      4.91248920E-06    3      1000023         4        -4             # Z4SS   -->  Z2SS   CH     CB          
      8.95490120E-06    3      1000023         5        -5             # Z4SS   -->  Z2SS   BT     BB          
      4.68732653E-09    3      1000023        15       -15             # Z4SS   -->  Z2SS   TAU-   TAU+        
      1.28843874E-06    3      1000025         2        -2             # Z4SS   -->  Z3SS   UP     UB          
      1.67490555E-06    3      1000025         1        -1             # Z4SS   -->  Z3SS   DN     DB          
      1.67490555E-06    3      1000025         3        -3             # Z4SS   -->  Z3SS   ST     SB          
      1.28843874E-06    3      1000025         4        -4             # Z4SS   -->  Z3SS   CH     CB          
      1.27454189E-06    3      1000025         5        -5             # Z4SS   -->  Z3SS   BT     BB          
      3.78261149E-07    3      1000025        11       -11             # Z4SS   -->  Z3SS   E-     E+          
      3.78261149E-07    3      1000025        13       -13             # Z4SS   -->  Z3SS   MU-    MU+         
      3.61378142E-07    3      1000025        15       -15             # Z4SS   -->  Z3SS   TAU-   TAU+        
      7.52620622E-07    3      1000025        12       -12             # Z4SS   -->  Z3SS   NUE    ANUE        
      7.52620622E-07    3      1000025        14       -14             # Z4SS   -->  Z3SS   NUM    ANUM        
      7.52620622E-07    3      1000025        16       -16             # Z4SS   -->  Z3SS   NUT    ANUT        
      8.59281868E-02    2      1000022        25                       # Z4SS   -->  Z1SS   HL0                
      1.16490573E-01    2      1000023        25                       # Z4SS   -->  Z2SS   HL0                
      7.82892201E-03    2      1000011       -11                       # Z4SS   -->  EL-    E+                 
      7.82892201E-03    2     -1000011        11                       # Z4SS   -->  EL+    E-                 
      7.82891642E-03    2      1000013       -13                       # Z4SS   -->  MUL-   MU+                
      7.82891642E-03    2     -1000013        13                       # Z4SS   -->  MUL+   MU-                
      3.39120394E-03    2      2000011       -11                       # Z4SS   -->  ER-    E+                 
      3.39120394E-03    2     -2000011        11                       # Z4SS   -->  ER+    E-                 
      3.39120254E-03    2      2000013       -13                       # Z4SS   -->  MUR-   MU+                
      3.39120254E-03    2     -2000013        13                       # Z4SS   -->  MUR+   MU-                
      3.05767544E-03    2      1000015       -15                       # Z4SS   -->  TAU1-  TAU+               
      3.05767544E-03    2     -1000015        15                       # Z4SS   -->  TAU1+  TAU-               
      8.39574076E-03    2      2000015       -15                       # Z4SS   -->  TAU2-  TAU+               
      8.39574076E-03    2     -2000015        15                       # Z4SS   -->  TAU2+  TAU-               
      2.21999157E-02    2      1000012       -12                       # Z4SS   -->  NUEL   ANUE               
      2.21999157E-02    2     -1000012        12                       # Z4SS   -->  ANUEL  NUE                
      2.21999157E-02    2      1000014       -14                       # Z4SS   -->  NUML   ANUM               
      2.21999157E-02    2     -1000014        14                       # Z4SS   -->  ANUML  NUM                
      2.23268420E-02    2      1000016       -16                       # Z4SS   -->  NUTL   ANUT               
      2.23268420E-02    2     -1000016        16                       # Z4SS   -->  ANUTL  NUT                
#         PDG         Width
DECAY   1000024  6.68344946E-05   # W1SS+ decays
#          BR          NDA       ID1       ID2       ID3       ID4
      3.12014222E-01    3      1000022         2        -1             # W1SS+  -->  Z1SS   UP     DB          
      3.12014222E-01    3      1000022         4        -3             # W1SS+  -->  Z1SS   CH     SB          
      1.25125840E-01    3      1000022       -11        12             # W1SS+  -->  Z1SS   E+     NUE         
      1.25125855E-01    3      1000022       -13        14             # W1SS+  -->  Z1SS   MU+    NUM         
      1.25719875E-01    3      1000022       -15        16             # W1SS+  -->  Z1SS   TAU+   NUT         
#         PDG         Width
DECAY   1000037  2.52445102E+00   # W2SS+ decays
#          BR          NDA       ID1       ID2       ID3       ID4
      1.20971504E-06    3      1000022         2        -1             # W2SS+  -->  Z1SS   UP     DB          
      1.20971379E-06    3      1000022         4        -3             # W2SS+  -->  Z1SS   CH     SB          
      2.18308793E-09    3      1000022       -15        16             # W2SS+  -->  Z1SS   TAU+   NUT         
      2.66286228E-02    2      1000022        24                       # W2SS+  -->  Z1SS   W+                 
      4.38759116E-06    3      1000023         2        -1             # W2SS+  -->  Z2SS   UP     DB          
      4.38755205E-06    3      1000023         4        -3             # W2SS+  -->  Z2SS   CH     SB          
      2.03683825E-08    3      1000023       -15        16             # W2SS+  -->  Z2SS   TAU+   NUT         
      3.43035698E-01    2      1000023        24                       # W2SS+  -->  Z2SS   W+                 
      2.02048591E-06    3      1000025         2        -1             # W2SS+  -->  Z3SS   UP     DB          
      2.02048614E-06    3      1000025         4        -3             # W2SS+  -->  Z3SS   CH     SB          
      6.72694796E-07    3      1000025       -11        12             # W2SS+  -->  Z3SS   E+     NUE         
      6.72694796E-07    3      1000025       -13        14             # W2SS+  -->  Z3SS   MU+    NUM         
      6.72694966E-07    3      1000025       -15        16             # W2SS+  -->  Z3SS   TAU+   NUT         
      2.29161270E-02    2      1000006        -5                       # W2SS+  -->  TP1    BB                 
      1.96676124E-02    2      1000012       -11                       # W2SS+  -->  NUEL   E+                 
      1.96676087E-02    2      1000014       -13                       # W2SS+  -->  NUML   MU+                
      2.01330669E-02    2      1000016       -15                       # W2SS+  -->  NUTL   TAU+               
      3.66396680E-02    2     -1000011        12                       # W2SS+  -->  EL+    NUE                
      3.66396531E-02    2     -1000013        14                       # W2SS+  -->  MUL+   NUM                
      1.09120629E-04    2     -1000015        16                       # W2SS+  -->  TAU1+  NUT                
      3.68973911E-02    2     -2000015        16                       # W2SS+  -->  TAU2+  NUT                
      2.64753759E-01    2      1000024        23                       # W2SS+  -->  W1SS+  Z0                 
      5.20866752E-06    3      1000024         1        -1             # W2SS+  -->  W1SS+  DN     DB          
      5.20853064E-06    3      1000024         3        -3             # W2SS+  -->  W1SS+  ST     SB          
      9.41920644E-06    3      1000024         2        -2             # W2SS+  -->  W1SS+  UP     UB          
      9.41919916E-06    3      1000024         4        -4             # W2SS+  -->  W1SS+  CH     CB          
      1.72865167E-01    2      1000024        25                       # W2SS+  -->  W1SS+  HL0                
#         PDG         Width
DECAY        25  3.79370782E-03   # HL0   decays
#          BR          NDA       ID1       ID2       ID3       ID4
      5.12092679E-09    2           11       -11                       # HL0    -->  E-     E+                 
      2.16213157E-04    2           13       -13                       # HL0    -->  MU-    MU+                
      6.17956929E-02    2           15       -15                       # HL0    -->  TAU-   TAU+               
      6.44694774E-06    2            1        -1                       # HL0    -->  DN     DB                 
      2.60488829E-03    2            3        -3                       # HL0    -->  ST     SB                 
      8.77958655E-01    2            5        -5                       # HL0    -->  BT     BB                 
      1.66404811E-06    2            2        -2                       # HL0    -->  UP     UB                 
      3.23020518E-02    2            4        -4                       # HL0    -->  CH     CB                 
      1.00327714E-03    2           22        22                       # HL0    -->  GM     GM                 
      2.33054869E-02    2           21        21                       # HL0    -->  GL     GL                 
      4.47560451E-05    3           24        11       -12             # HL0    -->  W+     E-     ANUE        
      4.47560451E-05    3           24        13       -14             # HL0    -->  W+     MU-    ANUM        
      4.47560451E-05    3           24        15       -16             # HL0    -->  W+     TAU-   ANUT        
      1.34268150E-04    3           24        -2         1             # HL0    -->  W+     UB     DN          
      1.34268150E-04    3           24        -4         3             # HL0    -->  W+     CB     ST          
      4.47560451E-05    3          -24       -11        12             # HL0    -->  W-     E+     NUE         
      4.47560451E-05    3          -24       -13        14             # HL0    -->  W-     MU+    NUM         
      4.47560451E-05    3          -24       -15        16             # HL0    -->  W-     TAU+   NUT         
      1.34268150E-04    3          -24         2        -1             # HL0    -->  W-     UP     DB          
      1.34268150E-04    3          -24         4        -3             # HL0    -->  W-     CH     SB          
#         PDG         Width
DECAY        35  8.42272580E-01   # HH0   decays
#          BR          NDA       ID1       ID2       ID3       ID4
      6.84379775E-10    2           11       -11                       # HH0    -->  E-     E+                 
      2.88957344E-05    2           13       -13                       # HH0    -->  MU-    MU+                
      8.27513263E-03    2           15       -15                       # HH0    -->  TAU-   TAU+               
      8.45754187E-07    2            1        -1                       # HH0    -->  DN     DB                 
      3.41727457E-04    2            3        -3                       # HH0    -->  ST     SB                 
      5.39061837E-02    2            5        -5                       # HH0    -->  BT     BB                 
      4.14151202E-09    2            2        -2                       # HH0    -->  UP     UB                 
      6.57026394E-05    2            4        -4                       # HH0    -->  CH     CB                 
      4.32749689E-01    2            6        -6                       # HH0    -->  TP     TB                 
      2.01269759E-05    2           22        22                       # HH0    -->  GM     GM                 
      2.40312633E-03    2           21        21                       # HH0    -->  GL     GL                 
      1.93641875E-02    2           24       -24                       # HH0    -->  W+     W-                 
      9.24205687E-03    2           23        23                       # HH0    -->  Z0     Z0                 
      3.21247950E-02    2      1000022   1000022                       # HH0    -->  Z1SS   Z1SS               
      7.65004307E-02    2      1000022   1000023                       # HH0    -->  Z1SS   Z2SS               
      1.02379650E-01    2      1000022   1000025                       # HH0    -->  Z1SS   Z3SS               
      3.96218300E-02    2      1000023   1000023                       # HH0    -->  Z2SS   Z2SS               
      1.58091009E-01    2      1000024  -1000024                       # HH0    -->  W1SS+  W1SS-              
      5.80387004E-02    2           25        25                       # HH0    -->  HL0    HL0                
      2.26583495E-03    2      2000011  -2000011                       # HH0    -->  ER-    ER+                
      2.26571155E-03    2      2000013  -2000013                       # HH0    -->  MUR-   MUR+               
      2.31439970E-03    2      1000015  -1000015                       # HH0    -->  TAU1-  TAU1+              
#         PDG         Width
DECAY        36  2.38642073E+00   # HA0   decays
#          BR          NDA       ID1       ID2       ID3       ID4
      2.43103315E-10    2           11       -11                       # HA0    -->  E-     E+                 
      1.02642589E-05    2           13       -13                       # HA0    -->  MU-    MU+                
      2.93971249E-03    2           15       -15                       # HA0    -->  TAU-   TAU+               
      3.00478746E-07    2            1        -1                       # HA0    -->  DN     DB                 
      1.21408630E-04    2            3        -3                       # HA0    -->  ST     SB                 
      1.91582944E-02    2            5        -5                       # HA0    -->  BT     BB                 
      1.18695598E-09    2            2        -2                       # HA0    -->  UP     UB                 
      1.88733411E-05    2            4        -4                       # HA0    -->  CH     CB                 
      5.59753418E-01    2            6        -6                       # HA0    -->  TP     TB                 
      1.20756124E-06    2           22        22                       # HA0    -->  GM     GM                 
      6.09093404E-04    2           21        21                       # HA0    -->  GL     GL                 
      2.77859624E-02    2      1000022   1000022                       # HA0    -->  Z1SS   Z1SS               
      8.46346170E-02    2      1000022   1000023                       # HA0    -->  Z1SS   Z2SS               
      4.61454591E-04    2      1000022   1000025                       # HA0    -->  Z1SS   Z3SS               
      6.36253655E-02    2      1000023   1000023                       # HA0    -->  Z2SS   Z2SS               
      2.35228717E-01    2      1000024  -1000024                       # HA0    -->  W1SS+  W1SS-              
      5.65133011E-03    2           25        23                       # HA0    -->  HL0    Z0                 
#         PDG         Width
DECAY        37  1.68580461E+00   # H+    decays
#          BR          NDA       ID1       ID2       ID3       ID4
      3.53698543E-10    2           12       -11                       # H+     -->  NUE    E+                 
      1.49337875E-05    2           14       -13                       # H+     -->  NUM    MU+                
      4.27708868E-03    2           16       -15                       # H+     -->  NUT    TAU+               
      3.99848318E-07    2            2        -1                       # H+     -->  UP     DB                 
      1.85844299E-04    2            4        -3                       # H+     -->  CH     SB                 
      8.58018279E-01    2            6        -5                       # H+     -->  TP     BB                 
      1.21110454E-01    2      1000024   1000022                       # H+     -->  W1SS+  Z1SS               
      7.05288304E-03    2      1000024   1000023                       # H+     -->  W1SS+  Z2SS               
      9.21041891E-03    2           25        24                       # H+     -->  HL0    W+                 
      1.29663575E-04    2     -1000015   1000016                       # H+     -->  TAU1+  NUTL               
