  65
  401   3000.5166    0.33422E-26
  402   2999.5779    0.33422E-26
  403   3000.5166    0.33422E-26
  404   2999.5781    0.33422E-26
  405   2997.8540    0.34977E-26
  406   2994.8535    0.30214E-26
  407   3000.5166    0.33422E-26
  408   2999.5779    0.33422E-26
  409   3000.5166    0.33422E-26
  410   2999.5781    0.33422E-26
  411   2997.8540    0.34977E-26
  412   2994.8535    0.30214E-26
  413   3000.0945    0.40778E-26
  414   2999.8110    0.39539E-26
  415   3000.0945    0.40778E-26
  416   2999.8113    0.39539E-26
  417   3002.7573    0.34038E-26
  418   3010.5735    0.30961E-26
  419   3000.0945    0.40778E-26
  420   2999.8110    0.39539E-26
  421   3000.0945    0.40778E-26
  422   2999.8113    0.39539E-26
  423   3002.7573    0.34038E-26
  424   3010.5735    0.30961E-26
  425    303.2582    0.21949E-23
  426    293.8247    0.22114E-23
  427    303.2582    0.21949E-23
  428    293.8247    0.22114E-23
  429    286.4526    0.92897E-24
  430    293.8247    0.22114E-23
  431    303.2582    0.21949E-23
  432    293.8247    0.22114E-23
  433    303.2582    0.21949E-23
  434    293.8247    0.22114E-23
  435    286.4526    0.92897E-24
  436    293.8247    0.22114E-23
  437    302.8226    0.53894E-24
  438      0.0000    0.10000E+31
  439    302.8226    0.53894E-24
  440      0.0000    0.10000E+31
  441    318.7758    0.81413E-24
  442      0.0000    0.10000E+31
  443    302.8226    0.53894E-24
  444      0.0000    0.10000E+31
  445    302.8226    0.53894E-24
  446      0.0000    0.10000E+31
  447    318.7758    0.81413E-24
  448      0.0000    0.10000E+31
  449    400.0000    0.12962E-17
  450     99.9884    0.10000E+31
  451    349.9475    0.98778E-24
  452  -1401.3221    0.38444E-25
  453   1405.6250    0.38175E-25
  454    349.9340    0.98643E-24
  455   1405.5007    0.38002E-25
  456    349.9340    0.98643E-24
  457   1405.5007    0.38002E-25
  203    106.5847    0.15959E-21
  204    505.5095    0.55707E-24
  205    500.0000    0.41451E-24
  206    509.5998    0.52399E-24
  207    509.5998    0.52399E-24
  458      0.0000    0.10000E+31
    6    172.5000    0.57395E-24
   12    172.5000    0.57395E-24
   7
   401  0.22764252E-02     0   450     1     0     0     0
   401  0.61918855E-01     0   451     1     0     0     0
   401  0.27279122E-04     0   452     1     0     0     0
   401  0.19550092E-03     0   453     1     0     0     0
   401  0.81115121E+00     0   449     1     0     0     0
   401  0.12381192E+00     0   456     2     0     0     0
   401  0.61879418E-03     0   457     2     0     0     0
   7
   402  0.20176005E-02     0   450     2     0     0     0
   402  0.62252656E-01     0   451     2     0     0     0
   402  0.16991533E-04     0   452     2     0     0     0
   402  0.14109122E-03     0   453     2     0     0     0
   402  0.81089586E+00     0   449     2     0     0     0
   402  0.12453853E+00     0   454     1     0     0     0
   402  0.13729538E-03     0   455     1     0     0     0
   7
   403  0.22764255E-02     0   450     3     0     0     0
   403  0.61918858E-01     0   451     3     0     0     0
   403  0.27279124E-04     0   452     3     0     0     0
   403  0.19550094E-03     0   453     3     0     0     0
   403  0.81115127E+00     0   449     3     0     0     0
   403  0.12381189E+00     0   456     4     0     0     0
   403  0.61879383E-03     0   457     4     0     0     0
   7
   404  0.20176002E-02     0   450     4     0     0     0
   404  0.62252652E-01     0   451     4     0     0     0
   404  0.16991529E-04     0   452     4     0     0     0
   404  0.14109119E-03     0   453     4     0     0     0
   404  0.81089580E+00     0   449     4     0     0     0
   404  0.12453858E+00     0   454     3     0     0     0
   404  0.13729544E-03     0   455     3     0     0     0
   7
   405  0.61181523E-02     0   450     5     0     0     0
   405  0.30127080E-01     0   451     5     0     0     0
   405  0.25850593E-03     0   452     5     0     0     0
   405  0.14752084E-03     0   453     5     0     0     0
   405  0.84851640E+00     0   449     5     0     0     0
   405  0.59906643E-01     0   456     6     0     0     0
   405  0.54925717E-01     0   457     6     0     0     0
   7
   406  0.73833227E+00     0   449     6     0     0     0
   406  0.16666904E-01     0   450     6     0     0     0
   406  0.31256247E-01     0   451     6     0     0     0
   406  0.57279717E-01     0   452     6     0     0     0
   406  0.45077082E-01     0   453     6     0     0     0
   406  0.62943064E-01     0   454     5     0     0     0
   406  0.48444729E-01     0   455     5     0     0     0
   7
   407  0.22764252E-02     0   450     7     0     0     0
   407  0.61918855E-01     0   451     7     0     0     0
   407  0.27279122E-04     0   452     7     0     0     0
   407  0.19550092E-03     0   453     7     0     0     0
   407  0.81115121E+00     0   449     7     0     0     0
   407  0.12381192E+00     0   454     8     0     0     0
   407  0.61879418E-03     0   455     8     0     0     0
   7
   408  0.20176005E-02     0   450     8     0     0     0
   408  0.62252656E-01     0   451     8     0     0     0
   408  0.16991533E-04     0   452     8     0     0     0
   408  0.14109122E-03     0   453     8     0     0     0
   408  0.81089586E+00     0   449     8     0     0     0
   408  0.12453853E+00     0   456     7     0     0     0
   408  0.13729538E-03     0   457     7     0     0     0
   7
   409  0.22764255E-02     0   450     9     0     0     0
   409  0.61918858E-01     0   451     9     0     0     0
   409  0.27279124E-04     0   452     9     0     0     0
   409  0.19550094E-03     0   453     9     0     0     0
   409  0.81115127E+00     0   449     9     0     0     0
   409  0.12381189E+00     0   454    10     0     0     0
   409  0.61879383E-03     0   455    10     0     0     0
   7
   410  0.20176002E-02     0   450    10     0     0     0
   410  0.62252652E-01     0   451    10     0     0     0
   410  0.16991529E-04     0   452    10     0     0     0
   410  0.14109119E-03     0   453    10     0     0     0
   410  0.81089580E+00     0   449    10     0     0     0
   410  0.12453858E+00     0   456     9     0     0     0
   410  0.13729544E-03     0   457     9     0     0     0
   7
   411  0.61181523E-02     0   450    11     0     0     0
   411  0.30127080E-01     0   451    11     0     0     0
   411  0.25850593E-03     0   452    11     0     0     0
   411  0.14752084E-03     0   453    11     0     0     0
   411  0.84851640E+00     0   449    11     0     0     0
   411  0.59906643E-01     0   454    12     0     0     0
   411  0.54925717E-01     0   455    12     0     0     0
   7
   412  0.73833227E+00     0   449    12     0     0     0
   412  0.16666904E-01     0   450    12     0     0     0
   412  0.31256247E-01     0   451    12     0     0     0
   412  0.57279717E-01     0   452    12     0     0     0
   412  0.45077082E-01     0   453    12     0     0     0
   412  0.62943064E-01     0   456    11     0     0     0
   412  0.48444729E-01     0   457    11     0     0     0
   2
   413  0.10468724E-01     0   450     1     0     0     0
   413  0.98953122E+00     0   449     1     0     0     0
   3
   414  0.40598873E-01     0   450     2     0     0     0
   414  0.20857584E-04     0   453     2     0     0     0
   414  0.95938033E+00     0   449     2     0     0     0
   2
   415  0.10468724E-01     0   450     3     0     0     0
   415  0.98953122E+00     0   449     3     0     0     0
   3
   416  0.40598873E-01     0   450     4     0     0     0
   416  0.20857580E-04     0   453     4     0     0     0
   416  0.95938027E+00     0   449     4     0     0     0
   7
   417  0.51049036E-02     0   450     5     0     0     0
   417  0.33749186E-01     0   451     5     0     0     0
   417  0.49437245E-03     0   452     5     0     0     0
   417  0.77315437E-03     0   453     5     0     0     0
   417  0.82633054E+00     0   449     5     0     0     0
   417  0.67102239E-01     0   456     6     0     0     0
   417  0.66445589E-01     0   457     6     0     0     0
   7
   418  0.73711526E+00     0   449     6     0     0     0
   418  0.51269334E-01     0   454     5     0     0     0
   418  0.59291303E-01     0   455     5     0     0     0
   418  0.16420459E-01     0   450     6     0     0     0
   418  0.25515320E-01     0   451     6     0     0     0
   418  0.49083922E-01     0   452     6     0     0     0
   418  0.61304446E-01     0   453     6     0     0     0
   2
   419  0.10468724E-01     0   450     7     0     0     0
   419  0.98953122E+00     0   449     7     0     0     0
   3
   420  0.40598873E-01     0   450     8     0     0     0
   420  0.20857584E-04     0   453     8     0     0     0
   420  0.95938033E+00     0   449     8     0     0     0
   2
   421  0.10468724E-01     0   450     9     0     0     0
   421  0.98953122E+00     0   449     9     0     0     0
   3
   422  0.40598873E-01     0   450    10     0     0     0
   422  0.20857580E-04     0   453    10     0     0     0
   422  0.95938027E+00     0   449    10     0     0     0
   7
   423  0.51049036E-02     0   450    11     0     0     0
   423  0.33749186E-01     0   451    11     0     0     0
   423  0.49437245E-03     0   452    11     0     0     0
   423  0.77315437E-03     0   453    11     0     0     0
   423  0.82633054E+00     0   449    11     0     0     0
   423  0.67102239E-01     0   454    12     0     0     0
   423  0.66445589E-01     0   455    12     0     0     0
   7
   424  0.73711526E+00     0   449    12     0     0     0
   424  0.51269334E-01     0   456    11     0     0     0
   424  0.59291303E-01     0   457    11     0     0     0
   424  0.16420459E-01     0   450    12     0     0     0
   424  0.25515320E-01     0   451    12     0     0     0
   424  0.49083922E-01     0   452    12     0     0     0
   424  0.61304446E-01     0   453    12     0     0     0
   1
   425  0.10000000E+01     0   450   121     0     0     0
   1
   426  0.10000000E+01     0   450   122     0     0     0
   1
   427  0.10000000E+01     0   450   123     0     0     0
   1
   428  0.10000000E+01     0   450   124     0     0     0
   1
   429  0.10000000E+01     0   450   125     0     0     0
   1
   430  0.10000000E+01     0   450   126     0     0     0
   1
   431  0.10000000E+01     0   450   127     0     0     0
   1
   432  0.10000000E+01     0   450   128     0     0     0
   1
   433  0.10000000E+01     0   450   129     0     0     0
   1
   434  0.10000000E+01     0   450   130     0     0     0
   1
   435  0.10000000E+01     0   450   131     0     0     0
   1
   436  0.10000000E+01     0   450   132     0     0     0
   1
   437  0.10000000E+01     0   450   121     0     0     0
   0
   1
   439  0.10000000E+01     0   450   123     0     0     0
   0
   1
   441  0.10000000E+01     0   450   125     0     0     0
   0
   1
   443  0.10000000E+01     0   450   127     0     0     0
   0
   1
   445  0.10000000E+01     0   450   129     0     0     0
   0
   1
   447  0.10000000E+01     0   450   131     0     0     0
   0
  16
   449  0.70283777E-03     0   454     1     8     0     0
   449  0.70283777E-03     0   456     2     7     0     0
   449  0.70283766E-03     0   454     3    10     0     0
   449  0.70283766E-03     0   456     4     9     0     0
   449  0.35156461E-03     0   450    13     0     0     0
   449  0.34378505E+00     0   450     2     8     0     0
   449  0.10265326E+00     0   450     1     7     0     0
   449  0.10265326E+00     0   450     3     9     0     0
   449  0.34378493E+00     0   450     4    10     0     0
   449  0.10219995E+00     0   450     5    11     0     0
   449  0.43059372E-04     0   451    13     0     0     0
   449  0.35219407E-03     0   451     2     8     0     0
   449  0.34973363E-03     0   451     1     7     0     0
   449  0.34973363E-03     0   451     3     9     0     0
   449  0.35219392E-03     0   451     4    10     0     0
   449  0.31371269E-03     0   451     5    11     0     0
   0
  16
   451  0.51903604E-04     0   450   200     0     0     0
   451  0.25351301E-02     0   450   203     0     0     0
   451  0.68802536E-01     0   425   127     0     0     0
   451  0.68802536E-01     0   431   121     0     0     0
   451  0.68802394E-01     0   427   129     0     0     0
   451  0.68802394E-01     0   433   123     0     0     0
   451  0.60217965E-01     0   429   131     0     0     0
   451  0.60217965E-01     0   435   125     0     0     0
   451  0.16117161E-01     0   441   131     0     0     0
   451  0.16117161E-01     0   447   125     0     0     0
   451  0.94922148E-01     0   426   128     0     0     0
   451  0.94922148E-01     0   432   122     0     0     0
   451  0.94922148E-01     0   428   130     0     0     0
   451  0.94922148E-01     0   434   124     0     0     0
   451  0.94922148E-01     0   430   132     0     0     0
   451  0.94922148E-01     0   436   126     0     0     0
  30
   452  0.20802106E+00     0   454   199     0     0     0
   452  0.20802106E+00     0   456   198     0     0     0
   452  0.93196787E-01     0   454   207     0     0     0
   452  0.93196787E-01     0   456   206     0     0     0
   452  0.45046903E-01     0   450   200     0     0     0
   452  0.18429138E+00     0   451   200     0     0     0
   452  0.11209193E-01     0   450   203     0     0     0
   452  0.25070321E-01     0   450   204     0     0     0
   452  0.12272170E-01     0   450   205     0     0     0
   452  0.22033028E-01     0   451   203     0     0     0
   452  0.43295510E-01     0   451   204     0     0     0
   452  0.50409537E-01     0   451   205     0     0     0
   452  0.36502090E-04     0   425   127     0     0     0
   452  0.36502090E-04     0   431   121     0     0     0
   452  0.36502090E-04     0   427   129     0     0     0
   452  0.36502090E-04     0   433   123     0     0     0
   452  0.43441090E-04     0   437   127     0     0     0
   452  0.43441090E-04     0   443   121     0     0     0
   452  0.43441090E-04     0   439   129     0     0     0
   452  0.43441090E-04     0   445   123     0     0     0
   452  0.35258479E-03     0   429   131     0     0     0
   452  0.35258479E-03     0   435   125     0     0     0
   452  0.97411522E-03     0   441   131     0     0     0
   452  0.97411522E-03     0   447   125     0     0     0
   452  0.16052295E-03     0   426   128     0     0     0
   452  0.16052295E-03     0   432   122     0     0     0
   452  0.16052295E-03     0   428   130     0     0     0
   452  0.16052295E-03     0   434   124     0     0     0
   452  0.16052295E-03     0   430   132     0     0     0
   452  0.16052295E-03     0   436   126     0     0     0
  30
   453  0.20748298E+00     0   454   199     0     0     0
   453  0.20748298E+00     0   456   198     0     0     0
   453  0.93236946E-01     0   454   207     0     0     0
   453  0.93236946E-01     0   456   206     0     0     0
   453  0.12153581E-01     0   450   200     0     0     0
   453  0.24060823E-01     0   451   200     0     0     0
   453  0.44410378E-01     0   450   203     0     0     0
   453  0.11226869E-01     0   450   204     0     0     0
   453  0.24346825E-01     0   450   205     0     0     0
   453  0.18205112E+00     0   451   203     0     0     0
   453  0.46106178E-01     0   451   204     0     0     0
   453  0.42288996E-01     0   451   205     0     0     0
   453  0.38200273E-03     0   425   127     0     0     0
   453  0.38200273E-03     0   431   121     0     0     0
   453  0.38200273E-03     0   427   129     0     0     0
   453  0.38200273E-03     0   433   123     0     0     0
   453  0.15848561E-03     0   437   127     0     0     0
   453  0.15848561E-03     0   443   121     0     0     0
   453  0.15848561E-03     0   439   129     0     0     0
   453  0.15848561E-03     0   445   123     0     0     0
   453  0.89956884E-04     0   429   131     0     0     0
   453  0.89956884E-04     0   435   125     0     0     0
   453  0.16707522E-02     0   441   131     0     0     0
   453  0.16707522E-02     0   447   125     0     0     0
   453  0.10386638E-02     0   426   128     0     0     0
   453  0.10386638E-02     0   432   122     0     0     0
   453  0.10386638E-02     0   428   130     0     0     0
   453  0.10386638E-02     0   434   124     0     0     0
   453  0.10386638E-02     0   430   132     0     0     0
   453  0.10386638E-02     0   436   126     0     0     0
   8
   454  0.25845082E-02     0   450   198     0     0     0
   454  0.19173737E+00     0   426   127     0     0     0
   454  0.19173710E+00     0   428   129     0     0     0
   454  0.19173773E+00     0   430   131     0     0     0
   454  0.13575885E+00     0   431   122     0     0     0
   454  0.13575885E+00     0   433   124     0     0     0
   454  0.11890873E+00     0   435   126     0     0     0
   454  0.31776894E-01     0   447   126     0     0     0
  15
   455  0.53524856E-01     0   450   198     0     0     0
   455  0.34340955E-01     0   450   206     0     0     0
   455  0.20807528E+00     0   451   198     0     0     0
   455  0.94595410E-01     0   451   206     0     0     0
   455  0.54911722E-03     0   426   127     0     0     0
   455  0.54911722E-03     0   428   129     0     0     0
   455  0.17867137E-02     0   430   131     0     0     0
   455  0.24584956E-02     0   431   122     0     0     0
   455  0.24584956E-02     0   433   124     0     0     0
   455  0.97191660E-04     0   435   126     0     0     0
   455  0.35601151E-02     0   447   126     0     0     0
   455  0.20841804E+00     0   454   200     0     0     0
   455  0.20473474E+00     0   454   203     0     0     0
   455  0.90889312E-01     0   454   204     0     0     0
   455  0.93962133E-01     0   454   205     0     0     0
   8
   456  0.25845082E-02     0   450   199     0     0     0
   456  0.19173737E+00     0   432   121     0     0     0
   456  0.19173710E+00     0   434   123     0     0     0
   456  0.19173773E+00     0   436   125     0     0     0
   456  0.13575885E+00     0   425   128     0     0     0
   456  0.13575885E+00     0   427   130     0     0     0
   456  0.11890873E+00     0   429   132     0     0     0
   456  0.31776894E-01     0   441   132     0     0     0
  15
   457  0.53524856E-01     0   450   199     0     0     0
   457  0.34340955E-01     0   450   207     0     0     0
   457  0.20807528E+00     0   451   199     0     0     0
   457  0.94595410E-01     0   451   207     0     0     0
   457  0.54911722E-03     0   432   121     0     0     0
   457  0.54911722E-03     0   434   123     0     0     0
   457  0.17867137E-02     0   436   125     0     0     0
   457  0.24584956E-02     0   425   128     0     0     0
   457  0.24584956E-02     0   427   130     0     0     0
   457  0.97191660E-04     0   429   132     0     0     0
   457  0.35601151E-02     0   441   132     0     0     0
   457  0.20841804E+00     0   456   200     0     0     0
   457  0.20473474E+00     0   456   203     0     0     0
   457  0.90889312E-01     0   456   204     0     0     0
   457  0.93962133E-01     0   456   205     0     0     0
  28
   203  0.21482678E-03     0   123   129     0     0     0
   203  0.61427459E-01     0   125   131     0     0     0
   203  0.25832821E-02     0     3     9     0     0     0
   203  0.85600066E+00     0     5    11     0     0     0
   203  0.33298235E-01     0     4    10     0     0     0
   203  0.13523978E-02     0    59    59     0     0     0
   203  0.30482057E-01     0    13    13     0     0     0
   203  0.78551896E-03     0   198   121   128     0     0
   203  0.78551896E-03     0   198   123   130     0     0
   203  0.78551896E-03     0   198   125   132     0     0
   203  0.23565567E-02     0   198     8     1     0     0
   203  0.23565567E-02     0   198    10     3     0     0
   203  0.78551896E-03     0   199   127   122     0     0
   203  0.78551896E-03     0   199   129   124     0     0
   203  0.78551896E-03     0   199   131   126     0     0
   203  0.23565567E-02     0   199     2     7     0     0
   203  0.23565567E-02     0   199     4     9     0     0
   203  0.34314464E-04     0   200   122   128     0     0
   203  0.34314464E-04     0   200   124   130     0     0
   203  0.34314464E-04     0   200   126   132     0     0
   203  0.17270126E-04     0   200   121   127     0     0
   203  0.17270126E-04     0   200   123   129     0     0
   203  0.17270126E-04     0   200   125   131     0     0
   203  0.59165985E-04     0   200     2     8     0     0
   203  0.59165985E-04     0   200     4    10     0     0
   203  0.76220371E-04     0   200     1     7     0     0
   203  0.76220371E-04     0   200     3     9     0     0
   203  0.76220371E-04     0   200     5    11     0     0
  12
   204  0.48629758E-04     0   123   129     0     0     0
   204  0.13927277E-01     0   125   131     0     0     0
   204  0.57358487E-03     0     3     9     0     0     0
   204  0.15385994E+00     0     5    11     0     0     0
   204  0.31811702E-04     0     4    10     0     0     0
   204  0.76450217E+00     0     6    12     0     0     0
   204  0.10906728E-02     0    13    13     0     0     0
   204  0.11198555E-01     0   198   199     0     0     0
   204  0.55061793E-02     0   200   200     0     0     0
   204  0.66996872E-03     0   450   450     0     0     0
   204  0.48280199E-03     0   450   451     0     0     0
   204  0.48108377E-01     0   203   203     0     0     0
  10
   205  0.36148911E-04     0   123   129     0     0     0
   205  0.10353342E-01     0   125   131     0     0     0
   205  0.42641867E-03     0     3     9     0     0     0
   205  0.11456528E+00     0     5    11     0     0     0
   205  0.20238724E-04     0     4    10     0     0     0
   205  0.86384702E+00     0     6    12     0     0     0
   205  0.70277910E-03     0    13    13     0     0     0
   205  0.81997528E-03     0   450   450     0     0     0
   205  0.18733782E-02     0   450   451     0     0     0
   205  0.73554143E-02     0   203   200     0     0     0
   6
   206  0.46573216E-04     0   124   129     0     0     0
   206  0.13338960E-01     0   126   131     0     0     0
   206  0.52561652E-03     0     4     9     0     0     0
   206  0.97290498E+00     0     6    11     0     0     0
   206  0.31154065E-02     0   454   450     0     0     0
   206  0.10068462E-01     0   203   198     0     0     0
   6
   207  0.46573216E-04     0   130   123     0     0     0
   207  0.13338960E-01     0   132   125     0     0     0
   207  0.52561652E-03     0    10     3     0     0     0
   207  0.97290498E+00     0    12     5     0     0     0
   207  0.31154065E-02     0   456   450     0     0     0
   207  0.10068462E-01     0   203   199     0     0     0
   0
   5
     6  0.33333334E+00   100     2     7     5     0     0
     6  0.33333334E+00   100     4     9     5     0     0
     6  0.11111111E+00   100   122   127     5     0     0
     6  0.11111111E+00   100   124   129     5     0     0
     6  0.11111111E+00   100   126   131     5     0     0
   5
    12  0.33333334E+00   100     8     1    11     0     0
    12  0.33333334E+00   100    10     3    11     0     0
    12  0.11111111E+00   100   128   121    11     0     0
    12  0.11111111E+00   100   130   123    11     0     0
    12  0.11111111E+00   100   132   125    11     0     0
      4.00000000     -0.26411885
     -0.99943447      0.00550861     -0.03163341      0.00998924
     -0.00777898     -0.99756324      0.06273470     -0.02952019
      0.01515418     -0.02360105     -0.70627260     -0.70738423
      0.02899389     -0.06542354     -0.70444500      0.70614189
     -0.99912065      0.04192761     -0.04192761     -0.99912065
     -0.99603331      0.08898137     -0.08898137     -0.99603331
     -0.77800179     -0.82854742     -0.79221231
      0.00000000      0.00000000      0.00000000
   1400.00000000
    T
