  65
  401    471.0599    0.14649E-24
  402    465.1407    0.14078E-24
  403    471.0600    0.14649E-24
  404    465.1428    0.14078E-24
  405    431.6871    0.19203E-24
  406    313.4692    0.37565E-24
  407    471.0599    0.14649E-24
  408    465.1407    0.14078E-24
  409    471.0600    0.14649E-24
  410    465.1428    0.14078E-24
  411    431.6871    0.19203E-24
  412    313.4692    0.37565E-24
  413    453.0050    0.27715E-23
  414    452.8386    0.69317E-24
  415    453.0051    0.27715E-23
  416    452.8409    0.69318E-24
  417    452.9455    0.16410E-23
  418    504.2925    0.13380E-24
  419    453.0050    0.27715E-23
  420    452.8386    0.69317E-24
  421    453.0051    0.27715E-23
  422    452.8409    0.69318E-24
  423    452.9455    0.16410E-23
  424    504.2925    0.13380E-24
  425    177.2430    0.13676E-23
  426    161.0376    0.17089E-23
  427    177.2430    0.13676E-23
  428    161.0376    0.17089E-23
  429    133.5345    0.21204E-23
  430    160.1413    0.17641E-23
  431    177.2430    0.13676E-23
  432    161.0376    0.17089E-23
  433    177.2430    0.13676E-23
  434    161.0376    0.17089E-23
  435    133.5345    0.21204E-23
  436    160.1413    0.17641E-23
  437    133.7993    0.20821E-23
  438      0.0000    0.10000E+31
  439    133.7993    0.20821E-23
  440      0.0000    0.10000E+31
  441    177.0559    0.13823E-23
  442      0.0000    0.10000E+31
  443    133.7993    0.20821E-23
  444      0.0000    0.10000E+31
  445    133.7993    0.20821E-23
  446      0.0000    0.10000E+31
  447    177.0559    0.13823E-23
  448      0.0000    0.10000E+31
  449    498.2130    0.18908E-24
  450     72.6086    0.10000E+31
  451    132.9944    0.20395E-19
  452   -309.1020    0.35228E-24
  453    340.9506    0.23246E-24
  454    130.7327    0.65837E-20
  455    336.0089    0.23526E-24
  456    130.7327    0.65837E-20
  457    336.0089    0.23526E-24
  203     94.9136    0.17057E-21
  204    374.6624    0.10320E-23
  205    367.9864    0.31178E-24
  206    378.6922    0.40602E-24
  207    378.6922    0.40602E-24
  458      0.0000    0.10000E+31
    6    172.5000    0.57395E-24
   12    172.5000    0.57395E-24
   6
   401  0.43874741E-01     0   450     1     0     0     0
   401  0.29014078E+00     0   451     1     0     0     0
   401  0.10335669E-02     0   452     1     0     0     0
   401  0.14578706E-01     0   453     1     0     0     0
   401  0.61026388E+00     0   456     2     0     0     0
   401  0.40108319E-01     0   457     2     0     0     0
   6
   402  0.38281703E-03     0   450     2     0     0     0
   402  0.32444751E+00     0   451     2     0     0     0
   402  0.57689613E-03     0   452     2     0     0     0
   402  0.98015638E-02     0   453     2     0     0     0
   402  0.64794594E+00     0   454     1     0     0     0
   402  0.16845269E-01     0   455     1     0     0     0
   6
   403  0.43875374E-01     0   450     3     0     0     0
   403  0.29014501E+00     0   451     3     0     0     0
   403  0.10335823E-02     0   452     3     0     0     0
   403  0.14578925E-01     0   453     3     0     0     0
   403  0.61026096E+00     0   456     4     0     0     0
   403  0.40106189E-01     0   457     4     0     0     0
   6
   404  0.38281240E-03     0   450     4     0     0     0
   404  0.32444328E+00     0   451     4     0     0     0
   404  0.57687634E-03     0   452     4     0     0     0
   404  0.98010525E-02     0   453     4     0     0     0
   404  0.64795029E+00     0   454     3     0     0     0
   404  0.16845694E-01     0   455     3     0     0     0
   6
   405  0.55290066E-01     0   450     5     0     0     0
   405  0.32656738E+00     0   451     5     0     0     0
   405  0.10644767E-02     0   452     5     0     0     0
   405  0.10044115E-01     0   453     5     0     0     0
   405  0.40521747E+00     0   456     6     0     0     0
   405  0.20181648E+00     0   199   406     0     0     0
   3
   406  0.12059554E+00     0   450     6     0     0     0
   406  0.52585952E-01     0   451     6     0     0     0
   406  0.82681853E+00     0   454     5     0     0     0
   6
   407  0.43874741E-01     0   450     7     0     0     0
   407  0.29014078E+00     0   451     7     0     0     0
   407  0.10335669E-02     0   452     7     0     0     0
   407  0.14578706E-01     0   453     7     0     0     0
   407  0.61026388E+00     0   454     8     0     0     0
   407  0.40108319E-01     0   455     8     0     0     0
   6
   408  0.38281703E-03     0   450     8     0     0     0
   408  0.32444751E+00     0   451     8     0     0     0
   408  0.57689613E-03     0   452     8     0     0     0
   408  0.98015638E-02     0   453     8     0     0     0
   408  0.64794594E+00     0   456     7     0     0     0
   408  0.16845269E-01     0   457     7     0     0     0
   6
   409  0.43875374E-01     0   450     9     0     0     0
   409  0.29014501E+00     0   451     9     0     0     0
   409  0.10335823E-02     0   452     9     0     0     0
   409  0.14578925E-01     0   453     9     0     0     0
   409  0.61026096E+00     0   454    10     0     0     0
   409  0.40106189E-01     0   455    10     0     0     0
   6
   410  0.38281240E-03     0   450    10     0     0     0
   410  0.32444328E+00     0   451    10     0     0     0
   410  0.57687634E-03     0   452    10     0     0     0
   410  0.98010525E-02     0   453    10     0     0     0
   410  0.64795029E+00     0   456     9     0     0     0
   410  0.16845694E-01     0   457     9     0     0     0
   6
   411  0.55290066E-01     0   450    11     0     0     0
   411  0.32656738E+00     0   451    11     0     0     0
   411  0.10644767E-02     0   452    11     0     0     0
   411  0.10044115E-01     0   453    11     0     0     0
   411  0.40521747E+00     0   454    12     0     0     0
   411  0.20181648E+00     0   198   412     0     0     0
   3
   412  0.12059554E+00     0   450    12     0     0     0
   412  0.52585952E-01     0   451    12     0     0     0
   412  0.82681853E+00     0   456    11     0     0     0
   4
   413  0.95500404E+00     0   450     1     0     0     0
   413  0.40268369E-01     0   451     1     0     0     0
   413  0.78656734E-03     0   452     1     0     0     0
   413  0.39410442E-02     0   453     1     0     0     0
   4
   414  0.95501590E+00     0   450     2     0     0     0
   414  0.40264845E-01     0   451     2     0     0     0
   414  0.78560057E-03     0   452     2     0     0     0
   414  0.39336798E-02     0   453     2     0     0     0
   4
   415  0.95500404E+00     0   450     3     0     0     0
   415  0.40268369E-01     0   451     3     0     0     0
   415  0.78656775E-03     0   452     3     0     0     0
   415  0.39410470E-02     0   453     3     0     0     0
   4
   416  0.95501614E+00     0   450     4     0     0     0
   416  0.40264808E-01     0   451     4     0     0     0
   416  0.78557973E-03     0   452     4     0     0     0
   416  0.39334814E-02     0   453     4     0     0     0
   6
   417  0.54001874E+00     0   450     5     0     0     0
   417  0.12384373E+00     0   451     5     0     0     0
   417  0.11048995E-01     0   452     5     0     0     0
   417  0.21932673E-01     0   453     5     0     0     0
   417  0.13478315E+00     0   456     6     0     0     0
   417  0.16837269E+00     0   199   406     0     0     0
   7
   418  0.21322995E+00     0   454     5     0     0     0
   418  0.28347906E+00     0   455     5     0     0     0
   418  0.29566154E+00     0   200   406     0     0     0
   418  0.52617345E-01     0   203   406     0     0     0
   418  0.23510568E-01     0   450     6     0     0     0
   418  0.10407866E+00     0   451     6     0     0     0
   418  0.27422870E-01     0   452     6     0     0     0
   4
   419  0.95500404E+00     0   450     7     0     0     0
   419  0.40268369E-01     0   451     7     0     0     0
   419  0.78656734E-03     0   452     7     0     0     0
   419  0.39410442E-02     0   453     7     0     0     0
   4
   420  0.95501590E+00     0   450     8     0     0     0
   420  0.40264845E-01     0   451     8     0     0     0
   420  0.78560057E-03     0   452     8     0     0     0
   420  0.39336798E-02     0   453     8     0     0     0
   4
   421  0.95500404E+00     0   450     9     0     0     0
   421  0.40268369E-01     0   451     9     0     0     0
   421  0.78656775E-03     0   452     9     0     0     0
   421  0.39410470E-02     0   453     9     0     0     0
   4
   422  0.95501614E+00     0   450    10     0     0     0
   422  0.40264808E-01     0   451    10     0     0     0
   422  0.78557973E-03     0   452    10     0     0     0
   422  0.39334814E-02     0   453    10     0     0     0
   6
   423  0.54001874E+00     0   450    11     0     0     0
   423  0.12384373E+00     0   451    11     0     0     0
   423  0.11048995E-01     0   452    11     0     0     0
   423  0.21932673E-01     0   453    11     0     0     0
   423  0.13478315E+00     0   454    12     0     0     0
   423  0.16837269E+00     0   198   412     0     0     0
   7
   424  0.21322995E+00     0   456    11     0     0     0
   424  0.28347906E+00     0   457    11     0     0     0
   424  0.29566154E+00     0   200   412     0     0     0
   424  0.52617345E-01     0   203   412     0     0     0
   424  0.23510568E-01     0   450    12     0     0     0
   424  0.10407866E+00     0   451    12     0     0     0
   424  0.27422870E-01     0   452    12     0     0     0
   3
   425  0.15909694E+00     0   450   121     0     0     0
   425  0.31774005E+00     0   451   121     0     0     0
   425  0.52316296E+00     0   456   122     0     0     0
   3
   426  0.51192814E+00     0   450   122     0     0     0
   426  0.11488747E+00     0   451   122     0     0     0
   426  0.37318435E+00     0   454   121     0     0     0
   3
   427  0.15909696E+00     0   450   123     0     0     0
   427  0.31773937E+00     0   451   123     0     0     0
   427  0.52316368E+00     0   456   124     0     0     0
   3
   428  0.51192957E+00     0   450   124     0     0     0
   428  0.11488778E+00     0   451   124     0     0     0
   428  0.37318268E+00     0   454   123     0     0     0
   2
   429  0.99987096E+00     0   450   125     0     0     0
   429  0.12905245E-03     0   456   126     0     0     0
   3
   430  0.52252984E+00     0   450   126     0     0     0
   430  0.11233035E+00     0   451   126     0     0     0
   430  0.36513975E+00     0   454   125     0     0     0
   3
   431  0.15909694E+00     0   450   127     0     0     0
   431  0.31774005E+00     0   451   127     0     0     0
   431  0.52316296E+00     0   454   128     0     0     0
   3
   432  0.51192814E+00     0   450   128     0     0     0
   432  0.11488747E+00     0   451   128     0     0     0
   432  0.37318435E+00     0   456   127     0     0     0
   3
   433  0.15909696E+00     0   450   129     0     0     0
   433  0.31773937E+00     0   451   129     0     0     0
   433  0.52316368E+00     0   454   130     0     0     0
   3
   434  0.51192957E+00     0   450   130     0     0     0
   434  0.11488778E+00     0   451   130     0     0     0
   434  0.37318268E+00     0   456   129     0     0     0
   2
   435  0.99987096E+00     0   450   131     0     0     0
   435  0.12905245E-03     0   454   132     0     0     0
   3
   436  0.52252984E+00     0   450   132     0     0     0
   436  0.11233035E+00     0   451   132     0     0     0
   436  0.36513975E+00     0   456   131     0     0     0
   2
   437  0.99998617E+00     0   450   121     0     0     0
   437  0.13856281E-04     0   451   121     0     0     0
   0
   2
   439  0.99998629E+00     0   450   123     0     0     0
   439  0.13738448E-04     0   451   123     0     0     0
   0
   3
   441  0.17655922E+00     0   450   125     0     0     0
   441  0.31095392E+00     0   451   125     0     0     0
   441  0.51248688E+00     0   456   126     0     0     0
   0
   2
   443  0.99998617E+00     0   450   127     0     0     0
   443  0.13856281E-04     0   451   127     0     0     0
   0
   2
   445  0.99998629E+00     0   450   129     0     0     0
   445  0.13738448E-04     0   451   129     0     0     0
   0
   3
   447  0.17655922E+00     0   450   131     0     0     0
   447  0.31095392E+00     0   451   131     0     0     0
   447  0.51248688E+00     0   454   132     0     0     0
   0
  26
   449  0.68155729E-04     0   454     5    12     0     0
   449  0.68155729E-04     0   456     6    11     0     0
   449  0.22189088E-04     0   452    13     0     0     0
   449  0.10805891E-04     0   453    13     0     0     0
   449  0.29238189E-01     0   408     2     0     0     0
   449  0.29238189E-01     0   402     8     0     0     0
   449  0.19951729E-01     0   407     1     0     0     0
   449  0.19951729E-01     0   401     7     0     0     0
   449  0.53638853E-01     0   420     2     0     0     0
   449  0.53638853E-01     0   414     8     0     0     0
   449  0.53264838E-01     0   419     1     0     0     0
   449  0.53264838E-01     0   413     7     0     0     0
   449  0.19951137E-01     0   409     3     0     0     0
   449  0.19951137E-01     0   403     9     0     0     0
   449  0.53264230E-01     0   421     3     0     0     0
   449  0.53264230E-01     0   415     9     0     0     0
   449  0.29211819E-01     0   410     4     0     0     0
   449  0.29211819E-01     0   404    10     0     0     0
   449  0.53612314E-01     0   422     4     0     0     0
   449  0.53612314E-01     0   416    10     0     0     0
   449  0.10634944E+00     0   411     5     0     0     0
   449  0.10634944E+00     0   405    11     0     0     0
   449  0.55607997E-01     0   423     5     0     0     0
   449  0.55607997E-01     0   417    11     0     0     0
   449  0.25824806E-01     0   412     6     0     0     0
   449  0.25824806E-01     0   406    12     0     0     0
   0
  12
   451  0.81095705E-03     0   450    59     0     0     0
   451  0.87067867E-02     0   450     2     8     0     0
   451  0.14599947E-01     0   450     1     7     0     0
   451  0.14599945E-01     0   450     3     9     0     0
   451  0.87067736E-02     0   450     4    10     0     0
   451  0.15415458E-01     0   450     5    11     0     0
   451  0.20469147E+00     0   450   121   127     0     0
   451  0.20469037E+00     0   450   123   129     0     0
   451  0.24841394E+00     0   450   125   131     0     0
   451  0.91550104E-01     0   450   122   128     0     0
   451  0.91550104E-01     0   450   124   130     0     0
   451  0.96264131E-01     0   450   126   132     0     0
  24
   452  0.30588990E+00     0   454   199     0     0     0
   452  0.30588990E+00     0   456   198     0     0     0
   452  0.15288919E+00     0   450   200     0     0     0
   452  0.19490752E+00     0   451   200     0     0     0
   452  0.13121589E-01     0   450   203     0     0     0
   452  0.72575947E-02     0   451   203     0     0     0
   452  0.36063409E-03     0   425   127     0     0     0
   452  0.36063409E-03     0   431   121     0     0     0
   452  0.36063397E-03     0   427   129     0     0     0
   452  0.36063397E-03     0   433   123     0     0     0
   452  0.70982293E-03     0   437   127     0     0     0
   452  0.70982293E-03     0   443   121     0     0     0
   452  0.70982269E-03     0   439   129     0     0     0
   452  0.70982269E-03     0   445   123     0     0     0
   452  0.95599139E-03     0   429   131     0     0     0
   452  0.95599139E-03     0   435   125     0     0     0
   452  0.96796569E-03     0   441   131     0     0     0
   452  0.96796569E-03     0   447   125     0     0     0
   452  0.19802926E-02     0   426   128     0     0     0
   452  0.19802926E-02     0   432   122     0     0     0
   452  0.19802926E-02     0   428   130     0     0     0
   452  0.19802926E-02     0   434   124     0     0     0
   452  0.19967039E-02     0   430   132     0     0     0
   452  0.19967039E-02     0   436   126     0     0     0
  24
   453  0.26367652E+00     0   454   199     0     0     0
   453  0.26367652E+00     0   456   198     0     0     0
   453  0.11926568E-01     0   450   200     0     0     0
   453  0.82604680E-02     0   451   200     0     0     0
   453  0.78822240E-01     0   450   203     0     0     0
   453  0.11167973E+00     0   451   203     0     0     0
   453  0.10546651E-01     0   425   127     0     0     0
   453  0.10546651E-01     0   431   121     0     0     0
   453  0.10546648E-01     0   427   129     0     0     0
   453  0.10546648E-01     0   433   123     0     0     0
   453  0.42634965E-02     0   437   127     0     0     0
   453  0.42634965E-02     0   443   121     0     0     0
   453  0.42634956E-02     0   439   129     0     0     0
   453  0.42634956E-02     0   445   123     0     0     0
   453  0.38660874E-02     0   429   131     0     0     0
   453  0.38660874E-02     0   435   125     0     0     0
   453  0.11325466E-01     0   441   131     0     0     0
   453  0.11325466E-01     0   447   125     0     0     0
   453  0.28661387E-01     0   426   128     0     0     0
   453  0.28661385E-01     0   432   122     0     0     0
   453  0.28661387E-01     0   428   130     0     0     0
   453  0.28661385E-01     0   434   124     0     0     0
   453  0.28844377E-01     0   430   132     0     0     0
   453  0.28844377E-01     0   436   126     0     0     0
   5
   454  0.26457569E+00     0   450     2     7     0     0
   454  0.26457569E+00     0   450     4     9     0     0
   454  0.15322822E+00     0   450   127   122     0     0
   454  0.15322822E+00     0   450   129   124     0     0
   454  0.16439214E+00     0   450   131   126     0     0
  12
   455  0.26993405E-01     0   450   198     0     0     0
   455  0.31483954E+00     0   451   198     0     0     0
   455  0.21924155E-01     0   406    11     0     0     0
   455  0.26388243E-01     0   426   127     0     0     0
   455  0.26388239E-01     0   428   129     0     0     0
   455  0.27054437E-01     0   430   131     0     0     0
   455  0.49601898E-01     0   431   122     0     0     0
   455  0.49601898E-01     0   433   124     0     0     0
   455  0.78411860E-04     0   435   126     0     0     0
   455  0.50150085E-01     0   447   126     0     0     0
   455  0.24508607E+00     0   454   200     0     0     0
   455  0.16189361E+00     0   454   203     0     0     0
   5
   456  0.26457569E+00     0   450     8     1     0     0
   456  0.26457569E+00     0   450    10     3     0     0
   456  0.15322822E+00     0   450   121   128     0     0
   456  0.15322822E+00     0   450   123   130     0     0
   456  0.16439214E+00     0   450   125   132     0     0
  12
   457  0.26993405E-01     0   450   199     0     0     0
   457  0.31483954E+00     0   451   199     0     0     0
   457  0.21924155E-01     0   412     5     0     0     0
   457  0.26388243E-01     0   432   121     0     0     0
   457  0.26388239E-01     0   434   123     0     0     0
   457  0.27054437E-01     0   436   125     0     0     0
   457  0.49601898E-01     0   425   128     0     0     0
   457  0.49601898E-01     0   427   130     0     0     0
   457  0.78411860E-04     0   429   132     0     0     0
   457  0.50150085E-01     0   441   132     0     0     0
   457  0.24508607E+00     0   456   200     0     0     0
   457  0.16189361E+00     0   456   203     0     0     0
  17
   203  0.21647794E-03     0   123   129     0     0     0
   203  0.61872702E-01     0   125   131     0     0     0
   203  0.26078660E-02     0     3     9     0     0     0
   203  0.87833595E+00     0     5    11     0     0     0
   203  0.31833041E-01     0     4    10     0     0     0
   203  0.98827831E-03     0    59    59     0     0     0
   203  0.23215385E-01     0    13    13     0     0     0
   203  0.51682662E-04     0   198   121   128     0     0
   203  0.51682662E-04     0   198   123   130     0     0
   203  0.51682662E-04     0   198   125   132     0     0
   203  0.15504799E-03     0   198     8     1     0     0
   203  0.15504799E-03     0   198    10     3     0     0
   203  0.51682662E-04     0   199   127   122     0     0
   203  0.51682662E-04     0   199   129   124     0     0
   203  0.51682662E-04     0   199   131   126     0     0
   203  0.15504799E-03     0   199     2     7     0     0
   203  0.15504799E-03     0   199     4     9     0     0
  26
   204  0.36977475E-04     0   123   129     0     0     0
   204  0.10589492E-01     0   125   131     0     0     0
   204  0.43743517E-03     0     3     9     0     0     0
   204  0.69487907E-01     0     5    11     0     0     0
   204  0.85703883E-04     0     4    10     0     0     0
   204  0.39128360E+00     0     6    12     0     0     0
   204  0.22193693E-04     0    59    59     0     0     0
   204  0.29954996E-02     0    13    13     0     0     0
   204  0.26508857E-01     0   198   199     0     0     0
   204  0.12598596E-01     0   200   200     0     0     0
   204  0.35401601E-01     0   450   450     0     0     0
   204  0.84290594E-01     0   450   451     0     0     0
   204  0.40929362E-01     0   451   451     0     0     0
   204  0.15771584E+00     0   454   456     0     0     0
   204  0.80977336E-01     0   203   203     0     0     0
   204  0.35477644E-02     0   425   431     0     0     0
   204  0.57478906E-02     0   437   443     0     0     0
   204  0.35475984E-02     0   427   433     0     0     0
   204  0.57475832E-02     0   439   445     0     0     0
   204  0.57897228E-02     0   429   435     0     0     0
   204  0.34699040E-02     0   441   447     0     0     0
   204  0.10156014E-04     0   429   447     0     0     0
   204  0.10156014E-04     0   441   435     0     0     0
   204  0.19488132E-01     0   426   432     0     0     0
   204  0.19488132E-01     0   428   434     0     0     0
   204  0.19791968E-01     0   430   436     0     0     0
  12
   205  0.11256165E-04     0   123   129     0     0     0
   205  0.32237882E-02     0   125   131     0     0     0
   205  0.13318226E-03     0     3     9     0     0     0
   205  0.21164116E-01     0     5    11     0     0     0
   205  0.20786267E-04     0     4    10     0     0     0
   205  0.55282962E+00     0     6    12     0     0     0
   205  0.62952744E-03     0    13    13     0     0     0
   205  0.27293922E-01     0   450   450     0     0     0
   205  0.86266160E-01     0   450   451     0     0     0
   205  0.66306010E-01     0   451   451     0     0     0
   205  0.23562418E+00     0   454   456     0     0     0
   205  0.64974441E-02     0   203   200     0     0     0
  11
   206  0.15084670E-04     0   124   129     0     0     0
   206  0.43202913E-02     0   126   131     0     0     0
   206  0.18781766E-03     0     4     9     0     0     0
   206  0.84434640E+00     0     6    11     0     0     0
   206  0.11396344E+00     0   454   450     0     0     0
   206  0.56655784E-02     0   454   451     0     0     0
   206  0.98498026E-02     0   203   198     0     0     0
   206  0.71694539E-02     0   431   426     0     0     0
   206  0.71693305E-02     0   433   428     0     0     0
   206  0.29013469E-03     0   435   430     0     0     0
   206  0.70226528E-02     0   447   430     0     0     0
  11
   207  0.15084670E-04     0   130   123     0     0     0
   207  0.43202913E-02     0   132   125     0     0     0
   207  0.18781766E-03     0    10     3     0     0     0
   207  0.84434640E+00     0    12     5     0     0     0
   207  0.11396344E+00     0   456   450     0     0     0
   207  0.56655784E-02     0   456   451     0     0     0
   207  0.98498026E-02     0   203   199     0     0     0
   207  0.71694539E-02     0   425   432     0     0     0
   207  0.71693305E-02     0   427   434     0     0     0
   207  0.29013469E-03     0   429   436     0     0     0
   207  0.70226528E-02     0   441   436     0     0     0
   0
   5
     6  0.33333334E+00   100     2     7     5     0     0
     6  0.33333334E+00   100     4     9     5     0     0
     6  0.11111111E+00   100   122   127     5     0     0
     6  0.11111111E+00   100   124   129     5     0     0
     6  0.11111111E+00   100   126   131     5     0     0
   5
    12  0.33333334E+00   100     8     1    11     0     0
    12  0.33333334E+00   100    10     3    11     0     0
    12  0.11111111E+00   100   128   121    11     0     0
    12  0.11111111E+00   100   130   123    11     0     0
    12  0.11111111E+00   100   132   125    11     0     0
      3.00000000     -0.35782042
      0.96605295     -0.14599764      0.18818140     -0.10006938
     -0.21150558     -0.91982365      0.27372542     -0.18510635
     -0.05054561      0.07572960      0.69664973      0.71161062
     -0.13947037      0.35619411      0.63587856     -0.67032248
     -0.95500439      0.29659155     -0.29659155     -0.95500439
     -0.90091813      0.43398908     -0.43398908     -0.90091813
     -0.95032376     -0.21019855     -1.43443811
   -363.23797607   -580.87225342   -127.38433075
    306.61734009
    T
