  65
  401    383.6593    0.18348E-24
  402    376.3585    0.17269E-24
  403    383.6594    0.18348E-24
  404    376.3611    0.17269E-24
  405    351.7625    0.30087E-24
  406    247.8600    0.46276E-24
  407    383.6593    0.18348E-24
  408    376.3585    0.17269E-24
  409    383.6594    0.18348E-24
  410    376.3611    0.17269E-24
  411    351.7625    0.30087E-24
  412    247.8600    0.46276E-24
  413    368.2240    0.34199E-23
  414    367.2603    0.85753E-24
  415    368.2241    0.34199E-23
  416    367.2631    0.85755E-24
  417    368.6872    0.18116E-23
  418    432.4297    0.16473E-24
  419    368.2240    0.34199E-23
  420    367.2603    0.85753E-24
  421    368.2241    0.34199E-23
  422    367.2631    0.85755E-24
  423    368.6872    0.18116E-23
  424    432.4297    0.16473E-24
  425    139.2201    0.14694E-23
  426    118.4518    0.21206E-23
  427    139.2201    0.14694E-23
  428    118.4518    0.21206E-23
  429    102.2029    0.28174E-23
  430    117.6490    0.21980E-23
  431    139.2201    0.14694E-23
  432    118.4518    0.21206E-23
  433    139.2201    0.14694E-23
  434    118.4518    0.21206E-23
  435    102.2029    0.28174E-23
  436    117.6490    0.21980E-23
  437    102.7786    0.27259E-23
  438      0.0000    0.10000E+31
  439    102.7786    0.27259E-23
  440      0.0000    0.10000E+31
  441    139.2646    0.14862E-23
  442      0.0000    0.10000E+31
  443    102.7786    0.27259E-23
  444      0.0000    0.10000E+31
  445    102.7786    0.27259E-23
  446      0.0000    0.10000E+31
  447    139.2646    0.14862E-23
  448      0.0000    0.10000E+31
  449    406.6837    0.21824E-24
  450     53.4740    0.10000E+31
  451     99.1296    0.23212E-19
  452   -250.4992    0.49135E-24
  453    286.6611    0.26739E-24
  454     94.8733    0.15738E-19
  455    281.3075    0.26747E-24
  456     94.8733    0.15738E-19
  457    281.3075    0.26747E-24
  203     92.0453    0.15860E-21
  204    298.8011    0.14369E-23
  205    291.4632    0.67145E-24
  206    303.7628    0.59387E-24
  207    303.7628    0.59387E-24
  458      0.0000    0.10000E+31
    6    172.5000    0.57395E-24
   12    172.5000    0.57395E-24
   6
   401  0.69161475E-01     0   450     1     0     0     0
   401  0.26650730E+00     0   451     1     0     0     0
   401  0.16898705E-02     0   452     1     0     0     0
   401  0.16042730E-01     0   453     1     0     0     0
   401  0.59952414E+00     0   456     2     0     0     0
   401  0.47074478E-01     0   457     2     0     0     0
   6
   402  0.13632586E-02     0   450     2     0     0     0
   402  0.31938857E+00     0   451     2     0     0     0
   402  0.90136140E-03     0   452     2     0     0     0
   402  0.99562937E-02     0   453     2     0     0     0
   402  0.65109104E+00     0   454     1     0     0     0
   402  0.17299511E-01     0   455     1     0     0     0
   6
   403  0.69163002E-01     0   450     3     0     0     0
   403  0.26651323E+00     0   451     3     0     0     0
   403  0.16899087E-02     0   452     3     0     0     0
   403  0.16043099E-01     0   453     3     0     0     0
   403  0.59952068E+00     0   456     4     0     0     0
   403  0.47070097E-01     0   457     4     0     0     0
   6
   404  0.13632339E-02     0   450     4     0     0     0
   404  0.31938234E+00     0   451     4     0     0     0
   404  0.90131431E-03     0   452     4     0     0     0
   404  0.99553084E-02     0   453     4     0     0     0
   404  0.65109754E+00     0   454     3     0     0     0
   404  0.17300270E-01     0   455     3     0     0     0
   6
   405  0.10752339E+00     0   450     5     0     0     0
   405  0.36874291E+00     0   451     5     0     0     0
   405  0.16981541E-02     0   452     5     0     0     0
   405  0.12207255E-01     0   453     5     0     0     0
   405  0.36905015E+00     0   456     6     0     0     0
   405  0.14077815E+00     0   199   406     0     0     0
   2
   406  0.41237742E-01     0   450     6     0     0     0
   406  0.95876223E+00     0   454     5     0     0     0
   6
   407  0.69161475E-01     0   450     7     0     0     0
   407  0.26650730E+00     0   451     7     0     0     0
   407  0.16898705E-02     0   452     7     0     0     0
   407  0.16042730E-01     0   453     7     0     0     0
   407  0.59952414E+00     0   454     8     0     0     0
   407  0.47074478E-01     0   455     8     0     0     0
   6
   408  0.13632586E-02     0   450     8     0     0     0
   408  0.31938857E+00     0   451     8     0     0     0
   408  0.90136140E-03     0   452     8     0     0     0
   408  0.99562937E-02     0   453     8     0     0     0
   408  0.65109104E+00     0   456     7     0     0     0
   408  0.17299511E-01     0   457     7     0     0     0
   6
   409  0.69163002E-01     0   450     9     0     0     0
   409  0.26651323E+00     0   451     9     0     0     0
   409  0.16899087E-02     0   452     9     0     0     0
   409  0.16043099E-01     0   453     9     0     0     0
   409  0.59952068E+00     0   454    10     0     0     0
   409  0.47070097E-01     0   455    10     0     0     0
   6
   410  0.13632339E-02     0   450    10     0     0     0
   410  0.31938234E+00     0   451    10     0     0     0
   410  0.90131431E-03     0   452    10     0     0     0
   410  0.99553084E-02     0   453    10     0     0     0
   410  0.65109754E+00     0   456     9     0     0     0
   410  0.17300270E-01     0   457     9     0     0     0
   6
   411  0.10752339E+00     0   450    11     0     0     0
   411  0.36874291E+00     0   451    11     0     0     0
   411  0.16981541E-02     0   452    11     0     0     0
   411  0.12207255E-01     0   453    11     0     0     0
   411  0.36905015E+00     0   454    12     0     0     0
   411  0.14077815E+00     0   198   412     0     0     0
   2
   412  0.41237742E-01     0   450    12     0     0     0
   412  0.95876223E+00     0   456    11     0     0     0
   4
   413  0.89880794E+00     0   450     1     0     0     0
   413  0.95631152E-01     0   451     1     0     0     0
   413  0.12497901E-02     0   452     1     0     0     0
   413  0.43111369E-02     0   453     1     0     0     0
   4
   414  0.89893049E+00     0   450     2     0     0     0
   414  0.95587306E-01     0   451     2     0     0     0
   414  0.12389496E-02     0   452     2     0     0     0
   414  0.42432533E-02     0   453     2     0     0     0
   4
   415  0.89880788E+00     0   450     3     0     0     0
   415  0.95631160E-01     0   451     3     0     0     0
   415  0.12497908E-02     0   452     3     0     0     0
   415  0.43111411E-02     0   453     3     0     0     0
   4
   416  0.89893109E+00     0   450     4     0     0     0
   416  0.95587216E-01     0   451     4     0     0     0
   416  0.12388993E-02     0   452     4     0     0     0
   416  0.42428174E-02     0   453     4     0     0     0
   6
   417  0.45335016E+00     0   450     5     0     0     0
   417  0.18995368E+00     0   451     5     0     0     0
   417  0.12975846E-01     0   452     5     0     0     0
   417  0.24643604E-01     0   453     5     0     0     0
   417  0.15902422E+00     0   456     6     0     0     0
   417  0.16005248E+00     0   199   406     0     0     0
   8
   418  0.17766257E+00     0   454     5     0     0     0
   418  0.35856563E+00     0   455     5     0     0     0
   418  0.30172127E+00     0   200   406     0     0     0
   418  0.36519174E-01     0   203   406     0     0     0
   418  0.13755438E-03     0   198   405     0     0     0
   418  0.15503636E-01     0   450     6     0     0     0
   418  0.98210260E-01     0   451     6     0     0     0
   418  0.11679925E-01     0   452     6     0     0     0
   4
   419  0.89880794E+00     0   450     7     0     0     0
   419  0.95631152E-01     0   451     7     0     0     0
   419  0.12497901E-02     0   452     7     0     0     0
   419  0.43111369E-02     0   453     7     0     0     0
   4
   420  0.89893049E+00     0   450     8     0     0     0
   420  0.95587306E-01     0   451     8     0     0     0
   420  0.12389496E-02     0   452     8     0     0     0
   420  0.42432533E-02     0   453     8     0     0     0
   4
   421  0.89880788E+00     0   450     9     0     0     0
   421  0.95631160E-01     0   451     9     0     0     0
   421  0.12497908E-02     0   452     9     0     0     0
   421  0.43111411E-02     0   453     9     0     0     0
   4
   422  0.89893109E+00     0   450    10     0     0     0
   422  0.95587216E-01     0   451    10     0     0     0
   422  0.12388993E-02     0   452    10     0     0     0
   422  0.42428174E-02     0   453    10     0     0     0
   6
   423  0.45335016E+00     0   450    11     0     0     0
   423  0.18995368E+00     0   451    11     0     0     0
   423  0.12975846E-01     0   452    11     0     0     0
   423  0.24643604E-01     0   453    11     0     0     0
   423  0.15902422E+00     0   454    12     0     0     0
   423  0.16005248E+00     0   198   412     0     0     0
   8
   424  0.17766257E+00     0   456    11     0     0     0
   424  0.35856563E+00     0   457    11     0     0     0
   424  0.30172127E+00     0   200   412     0     0     0
   424  0.36519174E-01     0   203   412     0     0     0
   424  0.13755438E-03     0   199   411     0     0     0
   424  0.15503636E-01     0   450    12     0     0     0
   424  0.98210260E-01     0   451    12     0     0     0
   424  0.11679925E-01     0   452    12     0     0     0
   3
   425  0.76047584E-01     0   450   121     0     0     0
   425  0.35689986E+00     0   451   121     0     0     0
   425  0.56705254E+00     0   456   122     0     0     0
   3
   426  0.55914980E+00     0   450   122     0     0     0
   426  0.72084874E-01     0   451   122     0     0     0
   426  0.36876532E+00     0   454   121     0     0     0
   3
   427  0.76047555E-01     0   450   123     0     0     0
   427  0.35689881E+00     0   451   123     0     0     0
   427  0.56705362E+00     0   456   124     0     0     0
   3
   428  0.55915231E+00     0   450   124     0     0     0
   428  0.72085202E-01     0   451   124     0     0     0
   428  0.36876246E+00     0   454   123     0     0     0
   3
   429  0.99676222E+00     0   450   125     0     0     0
   429  0.12287759E-02     0   451   125     0     0     0
   429  0.20090095E-02     0   456   126     0     0     0
   3
   430  0.57160950E+00     0   450   126     0     0     0
   430  0.69535650E-01     0   451   126     0     0     0
   430  0.35885489E+00     0   454   125     0     0     0
   3
   431  0.76047584E-01     0   450   127     0     0     0
   431  0.35689986E+00     0   451   127     0     0     0
   431  0.56705254E+00     0   454   128     0     0     0
   3
   432  0.55914980E+00     0   450   128     0     0     0
   432  0.72084874E-01     0   451   128     0     0     0
   432  0.36876532E+00     0   456   127     0     0     0
   3
   433  0.76047555E-01     0   450   129     0     0     0
   433  0.35689881E+00     0   451   129     0     0     0
   433  0.56705362E+00     0   454   130     0     0     0
   3
   434  0.55915231E+00     0   450   130     0     0     0
   434  0.72085202E-01     0   451   130     0     0     0
   434  0.36876246E+00     0   456   129     0     0     0
   3
   435  0.99676222E+00     0   450   131     0     0     0
   435  0.12287759E-02     0   451   131     0     0     0
   435  0.20090095E-02     0   454   132     0     0     0
   3
   436  0.57160950E+00     0   450   132     0     0     0
   436  0.69535650E-01     0   451   132     0     0     0
   436  0.35885489E+00     0   456   131     0     0     0
   2
   437  0.99891728E+00     0   450   121     0     0     0
   437  0.10826904E-02     0   451   121     0     0     0
   0
   2
   439  0.99891776E+00     0   450   123     0     0     0
   439  0.10822590E-02     0   451   123     0     0     0
   0
   3
   441  0.97999461E-01     0   450   125     0     0     0
   441  0.34887442E+00     0   451   125     0     0     0
   441  0.55312610E+00     0   456   126     0     0     0
   0
   2
   443  0.99891728E+00     0   450   127     0     0     0
   443  0.10826904E-02     0   451   127     0     0     0
   0
   2
   445  0.99891776E+00     0   450   129     0     0     0
   445  0.10822590E-02     0   451   129     0     0     0
   0
   3
   447  0.97999461E-01     0   450   131     0     0     0
   447  0.34887442E+00     0   451   131     0     0     0
   447  0.55312610E+00     0   454   132     0     0     0
   0
  25
   449  0.24766178E-03     0   454     5    12     0     0
   449  0.24766178E-03     0   456     6    11     0     0
   449  0.21372585E-04     0   451    13     0     0     0
   449  0.54375290E-04     0   452    13     0     0     0
   449  0.44800425E-04     0   453    13     0     0     0
   449  0.35258397E-01     0   408     2     0     0     0
   449  0.35258397E-01     0   402     8     0     0     0
   449  0.20705776E-01     0   407     1     0     0     0
   449  0.20705776E-01     0   401     7     0     0     0
   449  0.58211770E-01     0   420     2     0     0     0
   449  0.58211770E-01     0   414     8     0     0     0
   449  0.55538703E-01     0   419     1     0     0     0
   449  0.55538703E-01     0   413     7     0     0     0
   449  0.20704942E-01     0   409     3     0     0     0
   449  0.20704942E-01     0   403     9     0     0     0
   449  0.55537857E-01     0   421     3     0     0     0
   449  0.55537857E-01     0   415     9     0     0     0
   449  0.35220157E-01     0   410     4     0     0     0
   449  0.35220157E-01     0   404    10     0     0     0
   449  0.58173414E-01     0   422     4     0     0     0
   449  0.58173414E-01     0   416    10     0     0     0
   449  0.10265614E+00     0   411     5     0     0     0
   449  0.10265614E+00     0   405    11     0     0     0
   449  0.57684913E-01     0   423     5     0     0     0
   449  0.57684913E-01     0   417    11     0     0     0
   0
  22
   451  0.65994915E-04     0   450    59     0     0     0
   451  0.60777817E-04     0   456     2     7     0     0
   451  0.20259273E-04     0   456   122   127     0     0
   451  0.20259273E-04     0   456   124   129     0     0
   451  0.60777820E-04     0   454     1     8     0     0
   451  0.20259273E-04     0   454   121   128     0     0
   451  0.20259273E-04     0   454   123   130     0     0
   451  0.60777820E-04     0   456     4     9     0     0
   451  0.20259273E-04     0   456   126   131     0     0
   451  0.60777820E-04     0   454     3    10     0     0
   451  0.20259273E-04     0   454   125   132     0     0
   451  0.36365064E-02     0   450     2     8     0     0
   451  0.74173077E-02     0   450     1     7     0     0
   451  0.74173058E-02     0   450     3     9     0     0
   451  0.36364996E-02     0   450     4    10     0     0
   451  0.74915425E-02     0   450     5    11     0     0
   451  0.21646893E+00     0   450   121   127     0     0
   451  0.21646740E+00     0   450   123   129     0     0
   451  0.24972034E+00     0   450   125   131     0     0
   451  0.93868859E-01     0   450   122   128     0     0
   451  0.93868859E-01     0   450   124   130     0     0
   451  0.99575795E-01     0   450   126   132     0     0
  24
   452  0.30478278E+00     0   454   199     0     0     0
   452  0.30478278E+00     0   456   198     0     0     0
   452  0.18708996E+00     0   450   200     0     0     0
   452  0.14241409E+00     0   451   200     0     0     0
   452  0.16706958E-01     0   450   203     0     0     0
   452  0.61835079E-02     0   451   203     0     0     0
   452  0.68619131E-03     0   425   127     0     0     0
   452  0.68619131E-03     0   431   121     0     0     0
   452  0.68619091E-03     0   427   129     0     0     0
   452  0.68619091E-03     0   433   123     0     0     0
   452  0.13174537E-02     0   437   127     0     0     0
   452  0.13174537E-02     0   443   121     0     0     0
   452  0.13174530E-02     0   439   129     0     0     0
   452  0.13174530E-02     0   445   123     0     0     0
   452  0.14086475E-02     0   429   131     0     0     0
   452  0.14086475E-02     0   435   125     0     0     0
   452  0.15472801E-02     0   441   131     0     0     0
   452  0.15472801E-02     0   447   125     0     0     0
   452  0.40085027E-02     0   426   128     0     0     0
   452  0.40085027E-02     0   432   122     0     0     0
   452  0.40085027E-02     0   428   130     0     0     0
   452  0.40085027E-02     0   434   124     0     0     0
   452  0.40397556E-02     0   430   132     0     0     0
   452  0.40397556E-02     0   436   126     0     0     0
  25
   453  0.24101673E+00     0   454   199     0     0     0
   453  0.24101673E+00     0   456   198     0     0     0
   453  0.14303002E-01     0   450   200     0     0     0
   453  0.68442035E-02     0   451   200     0     0     0
   453  0.12231152E-04     0   451     5    11     0     0
   453  0.73883139E-01     0   450   203     0     0     0
   453  0.65771200E-01     0   451   203     0     0     0
   453  0.13744494E-01     0   425   127     0     0     0
   453  0.13744494E-01     0   431   121     0     0     0
   453  0.13744488E-01     0   427   129     0     0     0
   453  0.13744488E-01     0   433   123     0     0     0
   453  0.57788240E-02     0   437   127     0     0     0
   453  0.57788240E-02     0   443   121     0     0     0
   453  0.57788221E-02     0   439   129     0     0     0
   453  0.57788221E-02     0   445   123     0     0     0
   453  0.52064103E-02     0   429   131     0     0     0
   453  0.52064103E-02     0   435   125     0     0     0
   453  0.14621639E-01     0   441   131     0     0     0
   453  0.14621639E-01     0   447   125     0     0     0
   453  0.39826609E-01     0   426   128     0     0     0
   453  0.39826609E-01     0   432   122     0     0     0
   453  0.39826609E-01     0   428   130     0     0     0
   453  0.39826609E-01     0   434   124     0     0     0
   453  0.40048480E-01     0   430   132     0     0     0
   453  0.40048480E-01     0   436   126     0     0     0
   5
   454  0.22087285E+00     0   450     2     7     0     0
   454  0.22087285E+00     0   450     4     9     0     0
   454  0.18178011E+00     0   450   127   122     0     0
   454  0.18178010E+00     0   450   129   124     0     0
   454  0.19469407E+00     0   450   131   126     0     0
  14
   455  0.89931628E-02     0   450   198     0     0     0
   455  0.29557624E+00     0   451   198     0     0     0
   455  0.55675581E-01     0   406    11     0     0     0
   455  0.34799863E-01     0   426   127     0     0     0
   455  0.34799863E-01     0   428   129     0     0     0
   455  0.35465244E-01     0   430   131     0     0     0
   455  0.67091942E-01     0   431   122     0     0     0
   455  0.67091927E-01     0   433   124     0     0     0
   455  0.58148114E-03     0   435   126     0     0     0
   455  0.67129880E-01     0   447   126     0     0     0
   455  0.21275468E+00     0   454   200     0     0     0
   455  0.14839582E-04     0   454     2     8     0     0
   455  0.14839568E-04     0   454     4    10     0     0
   455  0.12001047E+00     0   454   203     0     0     0
   5
   456  0.22087285E+00     0   450     8     1     0     0
   456  0.22087285E+00     0   450    10     3     0     0
   456  0.18178011E+00     0   450   121   128     0     0
   456  0.18178010E+00     0   450   123   130     0     0
   456  0.19469407E+00     0   450   125   132     0     0
  14
   457  0.89931628E-02     0   450   199     0     0     0
   457  0.29557624E+00     0   451   199     0     0     0
   457  0.55675581E-01     0   412     5     0     0     0
   457  0.34799863E-01     0   432   121     0     0     0
   457  0.34799863E-01     0   434   123     0     0     0
   457  0.35465244E-01     0   436   125     0     0     0
   457  0.67091942E-01     0   425   128     0     0     0
   457  0.67091927E-01     0   427   130     0     0     0
   457  0.58148114E-03     0   429   132     0     0     0
   457  0.67129880E-01     0   441   132     0     0     0
   457  0.21275468E+00     0   456   200     0     0     0
   457  0.14839582E-04     0   456     8     2     0     0
   457  0.14839568E-04     0   456    10     4     0     0
   457  0.12001047E+00     0   456   203     0     0     0
  17
   203  0.21730416E-03     0   123   129     0     0     0
   203  0.62100589E-01     0   125   131     0     0     0
   203  0.26191028E-02     0     3     9     0     0     0
   203  0.88589960E+00     0     5    11     0     0     0
   203  0.28400801E-01     0     4    10     0     0     0
   203  0.85079082E-03     0    59    59     0     0     0
   203  0.19609546E-01     0    13    13     0     0     0
   203  0.16790411E-04     0   198   121   128     0     0
   203  0.16790411E-04     0   198   123   130     0     0
   203  0.16790411E-04     0   198   125   132     0     0
   203  0.50371233E-04     0   198     8     1     0     0
   203  0.50371233E-04     0   198    10     3     0     0
   203  0.16790411E-04     0   199   127   122     0     0
   203  0.16790411E-04     0   199   129   124     0     0
   203  0.16790411E-04     0   199   131   126     0     0
   203  0.50371233E-04     0   199     2     7     0     0
   203  0.50371233E-04     0   199     4     9     0     0
  24
   204  0.40413364E-04     0   123   129     0     0     0
   204  0.11572559E-01     0   125   131     0     0     0
   204  0.47928016E-03     0     3     9     0     0     0
   204  0.82734428E-01     0     5    11     0     0     0
   204  0.10946496E-03     0     4    10     0     0     0
   204  0.16114274E-02     0    13    13     0     0     0
   204  0.39736997E-01     0   198   199     0     0     0
   204  0.18142201E-01     0   200   200     0     0     0
   204  0.84458925E-01     0   450   450     0     0     0
   204  0.13222630E+00     0   450   451     0     0     0
   204  0.44485044E-01     0   451   451     0     0     0
   204  0.27449048E+00     0   454   456     0     0     0
   204  0.12680699E+00     0   203   203     0     0     0
   204  0.72991420E-02     0   425   431     0     0     0
   204  0.10941577E-01     0   437   443     0     0     0
   204  0.72988071E-02     0   427   433     0     0     0
   204  0.10941011E-01     0   439   445     0     0     0
   204  0.10999198E-01     0   429   435     0     0     0
   204  0.70974403E-02     0   441   447     0     0     0
   204  0.10589663E-04     0   429   447     0     0     0
   204  0.10589663E-04     0   441   435     0     0     0
   204  0.42673998E-01     0   426   432     0     0     0
   204  0.42673998E-01     0   428   434     0     0     0
   204  0.43159131E-01     0   430   436     0     0     0
  11
   205  0.19200428E-04     0   123   129     0     0     0
   205  0.54988903E-02     0   125   131     0     0     0
   205  0.22777314E-03     0     3     9     0     0     0
   205  0.39341826E-01     0     5    11     0     0     0
   205  0.36672955E-04     0     4    10     0     0     0
   205  0.36379870E-03     0    13    13     0     0     0
   205  0.99863999E-01     0   450   450     0     0     0
   205  0.20141090E+00     0   450   451     0     0     0
   205  0.10041773E+00     0   451   451     0     0     0
   205  0.54021400E+00     0   454   456     0     0     0
   205  0.12605210E-01     0   203   200     0     0     0
  11
   206  0.17698439E-04     0   124   129     0     0     0
   206  0.50687590E-02     0   126   131     0     0     0
   206  0.22123961E-03     0     4     9     0     0     0
   206  0.74082106E+00     0     6    11     0     0     0
   206  0.17152423E+00     0   454   450     0     0     0
   206  0.21245643E-01     0   454   451     0     0     0
   206  0.14738294E-01     0   203   198     0     0     0
   206  0.15380619E-01     0   431   426     0     0     0
   206  0.15380354E-01     0   433   428     0     0     0
   206  0.75571076E-03     0   435   430     0     0     0
   206  0.14846386E-01     0   447   430     0     0     0
  11
   207  0.17698439E-04     0   130   123     0     0     0
   207  0.50687590E-02     0   132   125     0     0     0
   207  0.22123961E-03     0    10     3     0     0     0
   207  0.74082106E+00     0    12     5     0     0     0
   207  0.17152423E+00     0   456   450     0     0     0
   207  0.21245643E-01     0   456   451     0     0     0
   207  0.14738294E-01     0   203   199     0     0     0
   207  0.15380619E-01     0   425   432     0     0     0
   207  0.15380354E-01     0   427   434     0     0     0
   207  0.75571076E-03     0   429   436     0     0     0
   207  0.14846386E-01     0   441   436     0     0     0
   0
   5
     6  0.33333334E+00   100     2     7     5     0     0
     6  0.33333334E+00   100     4     9     5     0     0
     6  0.11111111E+00   100   122   127     5     0     0
     6  0.11111111E+00   100   124   129     5     0     0
     6  0.11111111E+00   100   126   131     5     0     0
   5
    12  0.33333334E+00   100     8     1    11     0     0
    12  0.33333334E+00   100    10     3    11     0     0
    12  0.11111111E+00   100   128   121    11     0     0
    12  0.11111111E+00   100   130   123    11     0     0
    12  0.11111111E+00   100   132   125    11     0     0
      3.00000000     -0.37850645
      0.93139291     -0.22908837      0.25128418     -0.12993127
     -0.32063892     -0.88320738      0.28629154     -0.18754336
      0.06328794     -0.09520166     -0.69062245     -0.71412319
      0.16028935     -0.39799482     -0.61476344      0.66179574
     -0.94506633      0.32687867     -0.32687867     -0.94506633
     -0.86916596      0.49452055     -0.49452055     -0.86916596
     -0.91528821     -0.27157781     -1.40341771
   -296.89294434   -477.79965210   -102.97815704
    247.16319275
    T
