#  ISAJET SUSY parameters in SUSY Les Houches Accord 2 format
#  Created by ISALHA 2.0 Last revision: C. Balazs 21 Apr 2009
Block SPINFO   # Program information
     1   ISASUGRA from ISAJET          # Spectrum Calculator
     2   7.80   29-OCT-2009 12:50:36   # Version number
Block MODSEL   # Model selection
     1     1   # Minimal supergravity (mSUGRA) model               
Block SMINPUTS   # Standard Model inputs
     1     1.27845558E+02   # alpha_em^(-1)
     2     1.16570000E-05   # G_Fermi
     3     1.17200002E-01   # alpha_s(M_Z)
     4     9.11699982E+01   # m_{Z}(pole)
     5     4.19999981E+00   # m_{b}(m_{b})
     6     1.72500000E+02   # m_{top}(pole)
     7     1.77699995E+00   # m_{tau}(pole)
Block MINPAR   # SUSY breaking input parameters
     1     5.20000000E+02   # m_0
     2     3.10000000E+02   # m_{1/2}
     3     4.00000000E+01   # tan(beta)
     4     1.00000000E+00   # sign(mu)
     5     0.00000000E+00   # A_0
Block EXTPAR   # Non-universal SUSY breaking parameters
     0     2.21278347E+16   # Input scale
Block MASS   # Scalar and gaugino mass spectrum
#  PDG code   mass                 particle
        24     8.04229965E+01   #  W^+
        25     1.12092491E+02   #  h^0            
        35     5.00745331E+02   #  H^0            
        36     4.97472260E+02   #  A^0            
        37     5.08168732E+02   #  H^+            
   1000001     8.53520264E+02   #  dnl            
   1000002     8.49653564E+02   #  upl            
   1000003     8.53520264E+02   #  stl            
   1000004     8.49654602E+02   #  chl            
   1000005     7.09402344E+02   #  b1             
   1000006     5.99608093E+02   #  t1             
   1000011     5.60911926E+02   #  el-            
   1000012     5.54753540E+02   #  nuel           
   1000013     5.60911926E+02   #  mul-           
   1000014     5.54753540E+02   #  numl           
   1000015     4.28195007E+02   #  tau1           
   1000016     5.12648254E+02   #  nutl           
   1000021     7.65622925E+02   #  glss           
   1000022     1.25246048E+02   #  z1ss           
   1000023     2.33288010E+02   #  z2ss           
   1000024     2.33802216E+02   #  w1ss           
   1000025    -3.97028992E+02   #  z3ss           
   1000035     4.15138550E+02   #  z4ss           
   1000037     4.15297272E+02   #  w2ss           
   2000001     8.33479858E+02   #  dnr            
   2000002     8.34226868E+02   #  upr            
   2000003     8.33479980E+02   #  str            
   2000004     8.34227966E+02   #  chr            
   2000005     7.72875916E+02   #  b2             
   2000006     7.62066956E+02   #  t2             
   2000011     5.33639038E+02   #  er-            
   2000013     5.33639038E+02   #  mur-           
   2000015     5.28137756E+02   #  tau2           
Block ALPHA   # Effective Higgs mixing parameter
         -2.60607395E-02   # alpha
Block STOPMIX   # stop mixing matrix
  1  1     4.36822057E-01   # O_{11}
  1  2     8.99547935E-01   # O_{12}
  2  1    -8.99547935E-01   # O_{21}
  2  2     4.36822057E-01   # O_{22}
Block SBOTMIX   # sbottom mixing matrix
  1  1     8.92644584E-01   # O_{11}
  1  2     4.50761199E-01   # O_{12}
  2  1    -4.50761199E-01   # O_{21}
  2  2     8.92644584E-01   # O_{22}
Block STAUMIX   # stau mixing matrix
  1  1     3.20842147E-01   # O_{11}
  1  2     9.47132707E-01   # O_{12}
  2  1    -9.47132707E-01   # O_{21}
  2  2     3.20842147E-01   # O_{22}
Block NMIX   # neutralino mixing matrix
  1  1    -9.90000904E-01   #
  1  2     3.11950929E-02   #
  1  3    -1.30294502E-01   #
  1  4     4.41358052E-02   #
  2  1     7.45374411E-02   #
  2  2     9.40472364E-01   #
  2  3    -2.82197416E-01   #
  2  4     1.74127474E-01   #
  3  1    -5.76333553E-02   #
  3  2     8.26947391E-02   #
  3  3     6.97897375E-01   #
  3  4     7.09069312E-01   #
  4  1     1.04977861E-01   #
  4  2    -3.28176826E-01   #
  4  3    -6.45234585E-01   #
  4  4     6.81873858E-01   #
Block UMIX   # chargino U mixing matrix
  1  1    -9.15460765E-01   # U_{11}
  1  2     4.02407169E-01   # U_{12}
  2  1    -4.02407169E-01   # U_{21}
  2  2    -9.15460765E-01   # U_{22}
Block VMIX   # chargino V mixing matrix
  1  1    -9.68639016E-01   # V_{11}
  1  2     2.48472139E-01   # V_{12}
  2  1    -2.48472139E-01   # V_{21}
  2  2    -9.68639016E-01   # V_{22}
Block GAUGE Q=  6.40624695E+02   #
     1     3.57492208E-01   # g`
     2     6.52475119E-01   # g_2
     3     1.22083211E+00   # g_3
Block YU Q=  6.40624695E+02   #
  3  3     8.68858039E-01   # y_t
Block YD Q=  6.40624695E+02   #
  3  3     5.00846624E-01   # y_b
Block YE Q=  6.40624695E+02   #
  3  3     4.20953661E-01   # y_tau
Block HMIX Q=  6.40624695E+02   # Higgs mixing parameters
     1     3.89697083E+02   # mu(Q)
     2     4.00000000E+01   # tan(beta)(M_GUT)
     3     2.50564987E+02   # Higgs vev at Q
     4     2.47478656E+05   # m_A^2(Q)
Block MSOFT Q=  6.40624695E+02   # DRbar SUSY breaking parameters
     1     1.28085571E+02   # M_1(Q)          
     2     2.40230865E+02   # M_2(Q)          
     3     7.08032654E+02   # M_3(Q)          
    31     5.57227844E+02   # MeL(Q)          
    32     5.57227844E+02   # MmuL(Q)         
    33     5.15922058E+02   # MtauL(Q)        
    34     5.31331360E+02   # MeR(Q)          
    35     5.31331360E+02   # MmuR(Q)         
    36     4.39379883E+02   # MtauR(Q)        
    41     8.14318787E+02   # MqL1(Q)         
    42     8.14318787E+02   # MqL2(Q)         
    43     6.90224182E+02   # MqL3(Q)         
    44     7.97768738E+02   # MuR(Q)          
    45     7.97768738E+02   # McR(Q)          
    46     5.94589417E+02   # MtR(Q)          
    47     7.95806335E+02   # MdR(Q)          
    48     7.95806335E+02   # MsR(Q)          
    49     7.32444397E+02   # MbR(Q)          
Block AU Q=  6.40624695E+02   #
  1  1    -5.49803528E+02   # A_u
  2  2    -5.49803528E+02   # A_c
  3  3    -5.49803528E+02   # A_t
Block AD Q=  6.40624695E+02   #
  1  1    -7.27615845E+02   # A_d
  2  2    -7.27615845E+02   # A_s
  3  3    -7.27615845E+02   # A_b
Block AE Q=  6.40624695E+02   #
  1  1    -1.11289169E+02   # A_e
  2  2    -1.11289169E+02   # A_mu
  3  3    -1.11289169E+02   # A_tau
#  ISAJET decay tables in SUSY Les Houches accord format
#  Created by ISALHD. Last revision: C. Balazs, 2005 May 25
Block DCINFO                           # Program information
     1   ISASUGRA from ISAJET          # Spectrum Calculator
     2   7.80   29-OCT-2009 12:50:36   # Version number
#         PDG         Width
DECAY         6  1.14680779E+00   # TP    decays
#          BR          NDA       ID1       ID2       ID3       ID4
      3.33333343E-01    3            2        -1         5             # TP     -->  UP     DB     BT          
      3.33333343E-01    3            4        -3         5             # TP     -->  CH     SB     BT          
      1.11111112E-01    3          -11        12         5             # TP     -->  E+     NUE    BT          
      1.11111112E-01    3          -13        14         5             # TP     -->  MU+    NUM    BT          
      1.11111112E-01    3          -15        16         5             # TP     -->  TAU+   NUT    BT          
#         PDG         Width
DECAY   1000021  4.21021610E-01   # GLSS  decays
#          BR          NDA       ID1       ID2       ID3       ID4
      1.19148809E-02    3      1000024         1        -2             # GLSS   -->  W1SS+  DN     UB          
      1.19148809E-02    3     -1000024         2        -1             # GLSS   -->  W1SS-  UP     DB          
      1.19148185E-02    3      1000024         3        -4             # GLSS   -->  W1SS+  ST     CB          
      1.19148185E-02    3     -1000024         4        -3             # GLSS   -->  W1SS-  CH     SB          
      1.25704985E-02    3      1000024         5        -6             # GLSS   -->  W1SS+  BT     TB          
      1.25704985E-02    3     -1000024         6        -5             # GLSS   -->  W1SS-  TP     BB          
      4.98761539E-04    3      1000037         1        -2             # GLSS   -->  W2SS+  DN     UB          
      4.98761539E-04    3     -1000037         2        -1             # GLSS   -->  W2SS-  UP     DB          
      4.98759618E-04    3      1000037         3        -4             # GLSS   -->  W2SS+  ST     CB          
      4.98759618E-04    3     -1000037         4        -3             # GLSS   -->  W2SS-  CH     SB          
      2.10667495E-02    3      1000037         5        -6             # GLSS   -->  W2SS+  BT     TB          
      2.10667495E-02    3     -1000037         6        -5             # GLSS   -->  W2SS-  TP     BB          
      7.84674512E-08    2      1000022        21                       # GLSS   -->  Z1SS   GL                 
      5.61608048E-03    3      1000022         2        -2             # GLSS   -->  Z1SS   UP     UB          
      1.75260915E-03    3      1000022         1        -1             # GLSS   -->  Z1SS   DN     DB          
      1.75260752E-03    3      1000022         3        -3             # GLSS   -->  Z1SS   ST     SB          
      5.61602134E-03    3      1000022         4        -4             # GLSS   -->  Z1SS   CH     CB          
      1.55907194E-03    3      1000022         5        -5             # GLSS   -->  Z1SS   BT     BB          
      2.13813521E-02    3      1000022         6        -6             # GLSS   -->  Z1SS   TP     TB          
      1.10846653E-04    2      1000023        21                       # GLSS   -->  Z2SS   GL                 
      6.24807552E-03    3      1000023         2        -2             # GLSS   -->  Z2SS   UP     UB          
      5.67221502E-03    3      1000023         1        -1             # GLSS   -->  Z2SS   DN     DB          
      5.67221502E-03    3      1000023         3        -3             # GLSS   -->  Z2SS   ST     SB          
      6.24801358E-03    3      1000023         4        -4             # GLSS   -->  Z2SS   CH     CB          
      7.36257818E-04    3      1000023         5        -5             # GLSS   -->  Z2SS   BT     BB          
      8.07773322E-03    3      1000023         6        -6             # GLSS   -->  Z2SS   TP     TB          
      1.00621756E-03    2      1000025        21                       # GLSS   -->  Z3SS   GL                 
      9.45106058E-06    3      1000025         2        -2             # GLSS   -->  Z3SS   UP     UB          
      1.13303649E-05    3      1000025         1        -1             # GLSS   -->  Z3SS   DN     DB          
      1.13303649E-05    3      1000025         3        -3             # GLSS   -->  Z3SS   ST     SB          
      9.45093598E-06    3      1000025         4        -4             # GLSS   -->  Z3SS   CH     CB          
      4.90246108E-03    3      1000025         5        -5             # GLSS   -->  Z3SS   BT     BB          
      3.74180195E-03    3      1000025         6        -6             # GLSS   -->  Z3SS   TP     TB          
      1.13004097E-03    2      1000035        21                       # GLSS   -->  Z4SS   GL                 
      2.42374968E-04    3      1000035         2        -2             # GLSS   -->  Z4SS   UP     UB          
      2.77932384E-04    3      1000035         1        -1             # GLSS   -->  Z4SS   DN     DB          
      2.77932355E-04    3      1000035         3        -3             # GLSS   -->  Z4SS   ST     SB          
      2.42372189E-04    3      1000035         4        -4             # GLSS   -->  Z4SS   CH     CB          
      5.79449674E-03    3      1000035         5        -5             # GLSS   -->  Z4SS   BT     BB          
      2.15238979E-04    3      1000035         6        -6             # GLSS   -->  Z4SS   TP     TB          
      3.97377700E-01    2     -1000005         5                       # GLSS   -->  BB1    BT                 
      3.97377700E-01    2      1000005        -5                       # GLSS   -->  BT1    BB                 
#         PDG         Width
DECAY   1000002  1.09348507E+01   # UPL   decays
#          BR          NDA       ID1       ID2       ID3       ID4
      7.05965608E-03    2      1000022         2                       # UPL    -->  Z1SS   UP                 
      2.54550368E-01    2      1000023         2                       # UPL    -->  Z2SS   UP                 
      1.03983516E-03    2      1000025         2                       # UPL    -->  Z3SS   UP                 
      1.80917848E-02    2      1000035         2                       # UPL    -->  Z4SS   UP                 
      1.71538368E-01    2      1000021         2                       # UPL    -->  GLSS   UP                 
      5.24326384E-01    2      1000024         1                       # UPL    -->  W1SS+  DN                 
      2.33936794E-02    2      1000037         1                       # UPL    -->  W2SS+  DN                 
#         PDG         Width
DECAY   1000001  1.09328356E+01   # DNL   decays
#          BR          NDA       ID1       ID2       ID3       ID4
      1.42164249E-02    2      1000022         1                       # DNL    -->  Z1SS   DN                 
      2.41679564E-01    2      1000023         1                       # DNL    -->  Z2SS   DN                 
      1.75483117E-03    2      1000025         1                       # DNL    -->  Z3SS   DN                 
      2.31161602E-02    2      1000035         1                       # DNL    -->  Z4SS   DN                 
      1.85982615E-01    2      1000021         1                       # DNL    -->  GLSS   DN                 
      4.71250951E-01    2     -1000024         2                       # DNL    -->  W1SS-  UP                 
      6.19994514E-02    2     -1000037         2                       # DNL    -->  W2SS-  UP                 
#         PDG         Width
DECAY   1000003  1.09328003E+01   # STL   decays
#          BR          NDA       ID1       ID2       ID3       ID4
      1.42164705E-02    2      1000022         3                       # STL    -->  Z1SS   ST                 
      2.41680339E-01    2      1000023         3                       # STL    -->  Z2SS   ST                 
      1.75483676E-03    2      1000025         3                       # STL    -->  Z3SS   ST                 
      2.31162347E-02    2      1000035         3                       # STL    -->  Z4SS   ST                 
      1.85983211E-01    2      1000021         3                       # STL    -->  GLSS   ST                 
      4.71249759E-01    2     -1000024         4                       # STL    -->  W1SS-  CH                 
      6.19991161E-02    2     -1000037         4                       # STL    -->  W2SS-  CH                 
#         PDG         Width
DECAY   1000004  1.09346209E+01   # CHL   decays
#          BR          NDA       ID1       ID2       ID3       ID4
      7.05977669E-03    2      1000022         4                       # CHL    -->  Z1SS   CH                 
      2.54554659E-01    2      1000023         4                       # CHL    -->  Z2SS   CH                 
      1.03985134E-03    2      1000025         4                       # CHL    -->  Z3SS   CH                 
      1.80920623E-02    2      1000035         4                       # CHL    -->  Z4SS   CH                 
      1.71521261E-01    2      1000021         4                       # CHL    -->  GLSS   CH                 
      5.24338245E-01    2      1000024         3                       # CHL    -->  W1SS+  ST                 
      2.33942326E-02    2      1000037         3                       # CHL    -->  W2SS+  ST                 
#         PDG         Width
DECAY   1000005  1.04255419E+01   # BT1   decays
#          BR          NDA       ID1       ID2       ID3       ID4
      3.98991667E-02    2      1000022         5                       # BT1    -->  Z1SS   BT                 
      2.27744430E-01    2      1000023         5                       # BT1    -->  Z2SS   BT                 
      7.03847259E-02    2      1000025         5                       # BT1    -->  Z3SS   BT                 
      4.62577939E-02    2      1000035         5                       # BT1    -->  Z4SS   BT                 
      3.48049194E-01    2     -1000024         6                       # BT1    -->  W1SS-  TP                 
      2.42903844E-01    2     -1000037         6                       # BT1    -->  W2SS-  TP                 
      2.47608665E-02    2          -24   1000006                       # BT1    -->  W-     TP1                
#         PDG         Width
DECAY   1000006  6.24344635E+00   # TP1   decays
#          BR          NDA       ID1       ID2       ID3       ID4
      1.44430935E-01    2      1000022         6                       # TP1    -->  Z1SS   TP                 
      1.07241146E-01    2      1000023         6                       # TP1    -->  Z2SS   TP                 
      1.72308072E-01    2      1000025         6                       # TP1    -->  Z3SS   TP                 
      1.16584431E-02    2      1000035         6                       # TP1    -->  Z4SS   TP                 
      3.09507638E-01    2      1000024         5                       # TP1    -->  W1SS+  BT                 
      2.54853755E-01    2      1000037         5                       # TP1    -->  W2SS+  BT                 
#         PDG         Width
DECAY   2000002  3.08859968E+00   # UPR   decays
#          BR          NDA       ID1       ID2       ID3       ID4
      5.71752012E-01    2      1000022         2                       # UPR    -->  Z1SS   UP                 
      2.88243522E-03    2      1000023         2                       # UPR    -->  Z2SS   UP                 
      1.21339632E-03    2      1000025         2                       # UPR    -->  Z3SS   UP                 
      3.80879547E-03    2      1000035         2                       # UPR    -->  Z4SS   UP                 
      4.20343399E-01    2      1000021         2                       # UPR    -->  GLSS   UP                 
#         PDG         Width
DECAY   2000001  1.71964180E+00   # DNR   decays
#          BR          NDA       ID1       ID2       ID3       ID4
      2.56475806E-01    2      1000022         1                       # DNR    -->  Z1SS   DN                 
      1.29271275E-03    2      1000023         1                       # DNR    -->  Z2SS   DN                 
      5.43777191E-04    2      1000025         1                       # DNR    -->  Z3SS   DN                 
      1.70666922E-03    2      1000035         1                       # DNR    -->  Z4SS   DN                 
      7.39980996E-01    2      1000021         1                       # DNR    -->  GLSS   DN                 
#         PDG         Width
DECAY   2000003  1.71964598E+00   # STR   decays
#          BR          NDA       ID1       ID2       ID3       ID4
      2.56475240E-01    2      1000022         3                       # STR    -->  Z1SS   ST                 
      1.29270984E-03    2      1000023         3                       # STR    -->  Z2SS   ST                 
      5.43776026E-04    2      1000025         3                       # STR    -->  Z3SS   ST                 
      1.70666585E-03    2      1000035         3                       # STR    -->  Z4SS   ST                 
      7.39981592E-01    2      1000021         3                       # STR    -->  GLSS   ST                 
#         PDG         Width
DECAY   2000004  3.08835793E+00   # CHR   decays
#          BR          NDA       ID1       ID2       ID3       ID4
      5.71794569E-01    2      1000022         4                       # CHR    -->  Z1SS   CH                 
      2.88264849E-03    2      1000023         4                       # CHR    -->  Z2SS   CH                 
      1.21348398E-03    2      1000025         4                       # CHR    -->  Z3SS   CH                 
      3.80906975E-03    2      1000035         4                       # CHR    -->  Z4SS   CH                 
      4.20300275E-01    2      1000021         4                       # CHR    -->  GLSS   CH                 
#         PDG         Width
DECAY   2000005  6.91070366E+00   # BT2   decays
#          BR          NDA       ID1       ID2       ID3       ID4
      3.05196624E-02    2      1000022         5                       # BT2    -->  Z1SS   BT                 
      1.82140786E-02    2      1000023         5                       # BT2    -->  Z2SS   BT                 
      1.65194213E-01    2      1000025         5                       # BT2    -->  Z3SS   BT                 
      1.77679956E-01    2      1000035         5                       # BT2    -->  Z4SS   BT                 
      7.94626656E-04    2      1000021         5                       # BT2    -->  GLSS   BT                 
      2.32321005E-02    2     -1000024         6                       # BT2    -->  W1SS-  TP                 
      5.10833263E-01    2     -1000037         6                       # BT2    -->  W2SS-  TP                 
      7.35321045E-02    2          -24   1000006                       # BT2    -->  W-     TP1                
#         PDG         Width
DECAY   2000006  1.42983742E+01   # TP2   decays
#          BR          NDA       ID1       ID2       ID3       ID4
      2.23252177E-01    2      1000024         5                       # TP2    -->  W1SS+  BT                 
      2.27323353E-01    2      1000037         5                       # TP2    -->  W2SS+  BT                 
      4.90493178E-02    2           23   1000006                       # TP2    -->  Z0     TP1                
      3.05241160E-02    2           25   1000006                       # TP2    -->  HL0    TP1                
      1.54886357E-02    2      1000022         6                       # TP2    -->  Z1SS   TP                 
      8.73503163E-02    2      1000023         6                       # TP2    -->  Z2SS   TP                 
      1.17482588E-01    2      1000025         6                       # TP2    -->  Z3SS   TP                 
      2.49529615E-01    2      1000035         6                       # TP2    -->  Z4SS   TP                 
#         PDG         Width
DECAY   1000011  5.01098251E+00   # EL-   decays
#          BR          NDA       ID1       ID2       ID3       ID4
      1.11912124E-01    2      1000022        11                       # EL-    -->  Z1SS   E-                 
      3.10415447E-01    2      1000023        11                       # EL-    -->  Z2SS   E-                 
      3.05352121E-04    2      1000025        11                       # EL-    -->  Z3SS   E-                 
      7.04973191E-03    2      1000035        11                       # EL-    -->  Z4SS   E-                 
      5.39167106E-01    2     -1000024        12                       # EL-    -->  W1SS-  NUE                
      3.11503150E-02    2     -1000037        12                       # EL-    -->  W2SS-  NUE                
#         PDG         Width
DECAY   1000013  5.01098251E+00   # MUL-  decays
#          BR          NDA       ID1       ID2       ID3       ID4
      1.11912124E-01    2      1000022        13                       # MUL-   -->  Z1SS   MU-                
      3.10415387E-01    2      1000023        13                       # MUL-   -->  Z2SS   MU-                
      3.05352005E-04    2      1000025        13                       # MUL-   -->  Z3SS   MU-                
      7.04972818E-03    2      1000035        13                       # MUL-   -->  Z4SS   MU-                
      5.39167106E-01    2     -1000024        14                       # MUL-   -->  W1SS-  NUM                
      3.11503150E-02    2     -1000037        14                       # MUL-   -->  W2SS-  NUM                
#         PDG         Width
DECAY   1000015  2.54327869E+00   # TAU1- decays
#          BR          NDA       ID1       ID2       ID3       ID4
      6.79012954E-01    2      1000022        15                       # TAU1-  -->  Z1SS   TAU-               
      1.09907523E-01    2      1000023        15                       # TAU1-  -->  Z2SS   TAU-               
      5.27070230E-03    2      1000025        15                       # TAU1-  -->  Z3SS   TAU-               
      5.58844069E-04    2      1000035        15                       # TAU1-  -->  Z4SS   TAU-               
      2.04312995E-01    2     -1000024        16                       # TAU1-  -->  W1SS-  NUT                
      9.36948811E-04    2     -1000037        16                       # TAU1-  -->  W2SS-  NUT                
#         PDG         Width
DECAY   1000012  5.07017946E+00   # NUEL  decays
#          BR          NDA       ID1       ID2       ID3       ID4
      1.37298867E-01    2      1000022        12                       # NUEL   -->  Z1SS   NUE                
      2.52500832E-01    2      1000023        12                       # NUEL   -->  Z2SS   NUE                
      1.43349532E-03    2      1000025        12                       # NUEL   -->  Z3SS   NUE                
      1.32767716E-02    2      1000035        12                       # NUEL   -->  Z4SS   NUE                
      5.84501565E-01    2      1000024        11                       # NUEL   -->  W1SS+  E-                 
      1.09885139E-02    2      1000037        11                       # NUEL   -->  W2SS+  E-                 
#         PDG         Width
DECAY   1000014  5.07017899E+00   # NUML  decays
#          BR          NDA       ID1       ID2       ID3       ID4
      1.37298882E-01    2      1000022        14                       # NUML   -->  Z1SS   NUM                
      2.52500862E-01    2      1000023        14                       # NUML   -->  Z2SS   NUM                
      1.43349543E-03    2      1000025        14                       # NUML   -->  Z3SS   NUM                
      1.32767735E-02    2      1000035        14                       # NUML   -->  Z4SS   NUM                
      5.84501445E-01    2      1000024        13                       # NUML   -->  W1SS+  MU-                
      1.09885093E-02    2      1000037        13                       # NUML   -->  W2SS+  MU-                
#         PDG         Width
DECAY   1000016  4.71147919E+00   # NUTL  decays
#          BR          NDA       ID1       ID2       ID3       ID4
      1.34040996E-01    2      1000022        16                       # NUTL   -->  Z1SS   NUT                
      2.32989386E-01    2      1000023        16                       # NUTL   -->  Z2SS   NUT                
      9.59544326E-04    2      1000025        16                       # NUTL   -->  Z3SS   NUT                
      8.08130391E-03    2      1000035        16                       # NUTL   -->  Z4SS   NUT                
      5.77081025E-01    2      1000024        15                       # NUTL   -->  W1SS+  TAU-               
      4.53587323E-02    2      1000037        15                       # NUTL   -->  W2SS+  TAU-               
      1.48910366E-03    2           24   1000015                       # NUTL   -->  W+     TAU1-              
#         PDG         Width
DECAY   2000011  2.39154267E+00   # ER-   decays
#          BR          NDA       ID1       ID2       ID3       ID4
      9.93173361E-01    2      1000022        11                       # ER-    -->  Z1SS   E-                 
      4.12565796E-03    2      1000023        11                       # ER-    -->  Z2SS   E-                 
      7.51416374E-04    2      1000025        11                       # ER-    -->  Z3SS   E-                 
      1.94958609E-03    2      1000035        11                       # ER-    -->  Z4SS   E-                 
#         PDG         Width
DECAY   2000013  2.39154267E+00   # MUR-  decays
#          BR          NDA       ID1       ID2       ID3       ID4
      9.93173361E-01    2      1000022        13                       # MUR-   -->  Z1SS   MU-                
      4.12565749E-03    2      1000023        13                       # MUR-   -->  Z2SS   MU-                
      7.51416082E-04    2      1000025        13                       # MUR-   -->  Z3SS   MU-                
      1.94958551E-03    2      1000035        13                       # MUR-   -->  Z4SS   MU-                
#         PDG         Width
DECAY   2000015  4.15007067E+00   # TAU2- decays
#          BR          NDA       ID1       ID2       ID3       ID4
      1.57445908E-01    2      1000022        15                       # TAU2-  -->  Z1SS   TAU-               
      2.73646444E-01    2      1000023        15                       # TAU2-  -->  Z2SS   TAU-               
      4.59259525E-02    2      1000025        15                       # TAU2-  -->  Z3SS   TAU-               
      4.40750495E-02    2      1000035        15                       # TAU2-  -->  Z4SS   TAU-               
      4.24957752E-01    2     -1000024        16                       # TAU2-  -->  W1SS-  NUT                
      5.09994477E-02    2     -1000037        16                       # TAU2-  -->  W2SS-  NUT                
      2.94945878E-03    2           23   1000015                       # TAU2-  -->  Z0     TAU1-              
#         PDG         Width
DECAY   1000023  1.50526350E-03   # Z2SS  decays
#          BR          NDA       ID1       ID2       ID3       ID4
      1.72366945E-05    2      1000022        22                       # Z2SS   -->  Z1SS   GM                 
      9.98037279E-01    2      1000022        23                       # Z2SS   -->  Z1SS   Z0                 
      5.26693975E-06    3      1000022         2        -2             # Z2SS   -->  Z1SS   UP     UB          
      9.04881836E-06    3      1000022         1        -1             # Z2SS   -->  Z1SS   DN     DB          
      9.04881836E-06    3      1000022         3        -3             # Z2SS   -->  Z1SS   ST     SB          
      5.26691292E-06    3      1000022         4        -4             # Z2SS   -->  Z1SS   CH     CB          
      5.33235783E-04    3      1000022         5        -5             # Z2SS   -->  Z1SS   BT     BB          
      1.24596656E-04    3      1000022        11       -11             # Z2SS   -->  Z1SS   E-     E+          
      1.24596656E-04    3      1000022        13       -13             # Z2SS   -->  Z1SS   MU-    MU+         
      6.77769363E-04    3      1000022        15       -15             # Z2SS   -->  Z1SS   TAU-   TAU+        
      1.33120499E-04    3      1000022        12       -12             # Z2SS   -->  Z1SS   NUE    ANUE        
      1.33120499E-04    3      1000022        14       -14             # Z2SS   -->  Z1SS   NUM    ANUM        
      1.90396633E-04    3      1000022        16       -16             # Z2SS   -->  Z1SS   NUT    ANUT        
#         PDG         Width
DECAY   1000025  1.52281094E+00   # Z3SS  decays
#          BR          NDA       ID1       ID2       ID3       ID4
      6.49355627E-08    2      1000022        22                       # Z3SS   -->  Z1SS   GM                 
      4.93480456E-07    2      1000023        22                       # Z3SS   -->  Z2SS   GM                 
      3.01355302E-01    2      1000024       -24                       # Z3SS   -->  W1SS+  W-                 
      3.01355302E-01    2     -1000024        24                       # Z3SS   -->  W1SS-  W+                 
      1.29095703E-01    2      1000022        23                       # Z3SS   -->  Z1SS   Z0                 
      2.30696246E-01    2      1000023        23                       # Z3SS   -->  Z2SS   Z0                 
      7.76790632E-09    3      1000022         2        -2             # Z3SS   -->  Z1SS   UP     UB          
      3.06414072E-09    3      1000022         1        -1             # Z3SS   -->  Z1SS   DN     DB          
      3.06414050E-09    3      1000022         3        -3             # Z3SS   -->  Z1SS   ST     SB          
      7.76786013E-09    3      1000022         4        -4             # Z3SS   -->  Z1SS   CH     CB          
      2.71634999E-05    3      1000022         5        -5             # Z3SS   -->  Z1SS   BT     BB          
      1.28105199E-07    3      1000022        11       -11             # Z3SS   -->  Z1SS   E-     E+          
      1.28105199E-07    3      1000022        13       -13             # Z3SS   -->  Z1SS   MU-    MU+         
      1.12947899E-04    3      1000022        15       -15             # Z3SS   -->  Z1SS   TAU-   TAU+        
      8.37385770E-08    3      1000022        12       -12             # Z3SS   -->  Z1SS   NUE    ANUE        
      8.37385770E-08    3      1000022        14       -14             # Z3SS   -->  Z1SS   NUM    ANUM        
      1.35222407E-07    3      1000022        16       -16             # Z3SS   -->  Z1SS   NUT    ANUT        
      4.50122473E-09    3      1000023         2        -2             # Z3SS   -->  Z2SS   UP     UB          
      6.93981272E-09    3      1000023         1        -1             # Z3SS   -->  Z2SS   DN     DB          
      6.93981272E-09    3      1000023         3        -3             # Z3SS   -->  Z2SS   ST     SB          
      4.50119897E-09    3      1000023         4        -4             # Z3SS   -->  Z2SS   CH     CB          
      1.02674958E-05    3      1000023         5        -5             # Z3SS   -->  Z2SS   BT     BB          
      7.25028970E-09    3      1000023        11       -11             # Z3SS   -->  Z2SS   E-     E+          
      7.25028970E-09    3      1000023        13       -13             # Z3SS   -->  Z2SS   MU-    MU+         
      9.18758360E-06    3      1000023        15       -15             # Z3SS   -->  Z2SS   TAU-   TAU+        
      3.23333538E-08    3      1000023        12       -12             # Z3SS   -->  Z2SS   NUE    ANUE        
      3.23333538E-08    3      1000023        14       -14             # Z3SS   -->  Z2SS   NUM    ANUM        
      5.49825998E-08    3      1000023        16       -16             # Z3SS   -->  Z2SS   NUT    ANUT        
      2.77369283E-02    2      1000022        25                       # Z3SS   -->  Z1SS   HL0                
      9.59971920E-03    2      1000023        25                       # Z3SS   -->  Z2SS   HL0                
#         PDG         Width
DECAY   1000035  1.80955577E+00   # Z4SS  decays
#          BR          NDA       ID1       ID2       ID3       ID4
      5.56315527E-08    2      1000022        22                       # Z4SS   -->  Z1SS   GM                 
      5.78767470E-08    2      1000023        22                       # Z4SS   -->  Z2SS   GM                 
      1.62803437E-09    2      1000025        22                       # Z4SS   -->  Z3SS   GM                 
      3.32101464E-01    2      1000024       -24                       # Z4SS   -->  W1SS+  W-                 
      3.32101464E-01    2     -1000024        24                       # Z4SS   -->  W1SS-  W+                 
      3.10556889E-02    2      1000022        23                       # Z4SS   -->  Z1SS   Z0                 
      2.11444572E-02    2      1000023        23                       # Z4SS   -->  Z2SS   Z0                 
      9.16543286E-08    3      1000022         2        -2             # Z4SS   -->  Z1SS   UP     UB          
      9.19457790E-08    3      1000022         1        -1             # Z4SS   -->  Z1SS   DN     DB          
      9.19457790E-08    3      1000022         3        -3             # Z4SS   -->  Z1SS   ST     SB          
      9.16538028E-08    3      1000022         4        -4             # Z4SS   -->  Z1SS   CH     CB          
      2.13956519E-05    3      1000022         5        -5             # Z4SS   -->  Z1SS   BT     BB          
      1.73236185E-06    3      1000022        11       -11             # Z4SS   -->  Z1SS   E-     E+          
      1.73236185E-06    3      1000022        13       -13             # Z4SS   -->  Z1SS   MU-    MU+         
      1.14387542E-04    3      1000022        15       -15             # Z4SS   -->  Z1SS   TAU-   TAU+        
      2.25576855E-06    3      1000022        12       -12             # Z4SS   -->  Z1SS   NUE    ANUE        
      2.25576855E-06    3      1000022        14       -14             # Z4SS   -->  Z1SS   NUM    ANUM        
      3.61438879E-06    3      1000022        16       -16             # Z4SS   -->  Z1SS   NUT    ANUT        
      3.08905129E-07    3      1000023         2        -2             # Z4SS   -->  Z2SS   UP     UB          
      3.60699033E-07    3      1000023         1        -1             # Z4SS   -->  Z2SS   DN     DB          
      3.60699033E-07    3      1000023         3        -3             # Z4SS   -->  Z2SS   ST     SB          
      3.08903367E-07    3      1000023         4        -4             # Z4SS   -->  Z2SS   CH     CB          
      1.00485668E-05    3      1000023         5        -5             # Z4SS   -->  Z2SS   BT     BB          
      7.54774476E-07    3      1000023        11       -11             # Z4SS   -->  Z2SS   E-     E+          
      7.54774476E-07    3      1000023        13       -13             # Z4SS   -->  Z2SS   MU-    MU+         
      1.00585657E-05    3      1000023        15       -15             # Z4SS   -->  Z2SS   TAU-   TAU+        
      1.38099745E-06    3      1000023        12       -12             # Z4SS   -->  Z2SS   NUE    ANUE        
      1.38099745E-06    3      1000023        14       -14             # Z4SS   -->  Z2SS   NUM    ANUM        
      2.34851109E-06    3      1000023        16       -16             # Z4SS   -->  Z2SS   NUT    ANUT        
      1.13859365E-07    3      1000025         2        -2             # Z4SS   -->  Z3SS   UP     UB          
      1.47056340E-07    3      1000025         1        -1             # Z4SS   -->  Z3SS   DN     DB          
      1.47056340E-07    3      1000025         3        -3             # Z4SS   -->  Z3SS   ST     SB          
      1.13859365E-07    3      1000025         4        -4             # Z4SS   -->  Z3SS   CH     CB          
      6.27312104E-08    3      1000025         5        -5             # Z4SS   -->  Z3SS   BT     BB          
      3.33996297E-08    3      1000025        11       -11             # Z4SS   -->  Z3SS   E-     E+          
      3.33996297E-08    3      1000025        13       -13             # Z4SS   -->  Z3SS   MU-    MU+         
      3.88452293E-08    3      1000025        15       -15             # Z4SS   -->  Z3SS   TAU-   TAU+        
      6.60387940E-08    3      1000025        12       -12             # Z4SS   -->  Z3SS   NUE    ANUE        
      6.60387940E-08    3      1000025        14       -14             # Z4SS   -->  Z3SS   NUM    ANUM        
      6.59115074E-08    3      1000025        16       -16             # Z4SS   -->  Z3SS   NUT    ANUT        
      9.44260657E-02    2      1000022        25                       # Z4SS   -->  Z1SS   HL0                
      1.88994095E-01    2      1000023        25                       # Z4SS   -->  Z2SS   HL0                
#         PDG         Width
DECAY   1000024  6.76532974E-03   # W1SS+ decays
#          BR          NDA       ID1       ID2       ID3       ID4
      3.10277164E-06    3      1000022         2        -1             # W1SS+  -->  Z1SS   UP     DB          
      3.10276482E-06    3      1000022         4        -3             # W1SS+  -->  Z1SS   CH     SB          
      5.84733789E-05    3      1000022       -11        12             # W1SS+  -->  Z1SS   E+     NUE         
      5.84733789E-05    3      1000022       -13        14             # W1SS+  -->  Z1SS   MU+    NUM         
      1.68946630E-04    3      1000022       -15        16             # W1SS+  -->  Z1SS   TAU+   NUT         
      9.99707878E-01    2      1000022        24                       # W1SS+  -->  Z1SS   W+                 
      2.67202449E-12    3      1000023       -11        12             # W1SS+  -->  Z2SS   E+     NUE         
      2.67202449E-12    3      1000023       -13        14             # W1SS+  -->  Z2SS   MU+    NUM         
#         PDG         Width
DECAY   1000037  1.66499901E+00   # W2SS+ decays
#          BR          NDA       ID1       ID2       ID3       ID4
      1.43811164E-07    3      1000022         2        -1             # W2SS+  -->  Z1SS   UP     DB          
      1.43810965E-07    3      1000022         4        -3             # W2SS+  -->  Z1SS   CH     SB          
      2.97610609E-06    3      1000022       -11        12             # W2SS+  -->  Z1SS   E+     NUE         
      2.97610609E-06    3      1000022       -13        14             # W2SS+  -->  Z1SS   MU+    NUM         
      1.18527292E-04    3      1000022       -15        16             # W2SS+  -->  Z1SS   TAU+   NUT         
      1.12999938E-01    2      1000022        24                       # W2SS+  -->  Z1SS   W+                 
      2.98988340E-07    3      1000023         2        -1             # W2SS+  -->  Z2SS   UP     DB          
      2.98988027E-07    3      1000023         4        -3             # W2SS+  -->  Z2SS   CH     SB          
      1.06147991E-06    3      1000023       -11        12             # W2SS+  -->  Z2SS   E+     NUE         
      1.06147991E-06    3      1000023       -13        14             # W2SS+  -->  Z2SS   MU+    NUM         
      1.18896178E-05    3      1000023       -15        16             # W2SS+  -->  Z2SS   TAU+   NUT         
      3.55121940E-01    2      1000023        24                       # W2SS+  -->  Z2SS   W+                 
      4.59675391E-07    3      1000025         2        -1             # W2SS+  -->  Z3SS   UP     DB          
      4.59675391E-07    3      1000025         4        -3             # W2SS+  -->  Z3SS   CH     SB          
      1.53142352E-07    3      1000025       -11        12             # W2SS+  -->  Z3SS   E+     NUE         
      1.53142352E-07    3      1000025       -13        14             # W2SS+  -->  Z3SS   MU+    NUM         
      1.71644160E-07    3      1000025       -15        16             # W2SS+  -->  Z3SS   TAU+   NUT         
      9.14040393E-20    3      1000035       -11        12             # W2SS+  -->  Z4SS   E+     NUE         
      9.14040393E-20    3      1000035       -13        14             # W2SS+  -->  Z4SS   MU+    NUM         
      3.02184343E-01    2      1000024        23                       # W2SS+  -->  W1SS+  Z0                 
      3.04956529E-07    3      1000024         1        -1             # W2SS+  -->  W1SS+  DN     DB          
      3.04954767E-07    3      1000024         3        -3             # W2SS+  -->  W1SS+  ST     SB          
      6.99277450E-07    3      1000024         2        -2             # W2SS+  -->  W1SS+  UP     UB          
      6.99277450E-07    3      1000024         4        -4             # W2SS+  -->  W1SS+  CH     CB          
      2.18720902E-06    3      1000024        12       -12             # W2SS+  -->  W1SS+  NUE    ANUE        
      2.18720902E-06    3      1000024        14       -14             # W2SS+  -->  W1SS+  NUM    ANUM        
      2.41175330E-05    3      1000024        16       -16             # W2SS+  -->  W1SS+  NUT    ANUT        
      1.00199793E-06    3      1000024        11       -11             # W2SS+  -->  W1SS+  E-     E+          
      1.00199793E-06    3      1000024        13       -13             # W2SS+  -->  W1SS+  MU-    MU+         
      1.72206205E-06    3      1000024        15       -15             # W2SS+  -->  W1SS+  TAU-   TAU+        
      2.29518726E-01    2      1000024        25                       # W2SS+  -->  W1SS+  HL0                
#         PDG         Width
DECAY        25  4.17146878E-03   # HL0   decays
#          BR          NDA       ID1       ID2       ID3       ID4
      4.96417263E-09    2           11       -11                       # HL0    -->  E-     E+                 
      2.09595222E-04    2           13       -13                       # HL0    -->  MU-    MU+                
      5.99411055E-02    2           15       -15                       # HL0    -->  TAU-   TAU+               
      6.23297092E-06    2            1        -1                       # HL0    -->  DN     DB                 
      2.51843221E-03    2            3        -3                       # HL0    -->  ST     SB                 
      8.28591585E-01    2            5        -5                       # HL0    -->  BT     BB                 
      1.83447185E-06    2            2        -2                       # HL0    -->  UP     UB                 
      3.46701927E-02    2            4        -4                       # HL0    -->  CH     CB                 
      1.61011133E-03    2           22        22                       # HL0    -->  GM     GM                 
      3.58128622E-02    2           21        21                       # HL0    -->  GL     GL                 
      1.91838993E-03    3           24        11       -12             # HL0    -->  W+     E-     ANUE        
      1.91838993E-03    3           24        13       -14             # HL0    -->  W+     MU-    ANUM        
      1.91838993E-03    3           24        15       -16             # HL0    -->  W+     TAU-   ANUT        
      5.75517025E-03    3           24        -2         1             # HL0    -->  W+     UB     DN          
      5.75517025E-03    3           24        -4         3             # HL0    -->  W+     CB     ST          
      1.91838993E-03    3          -24       -11        12             # HL0    -->  W-     E+     NUE         
      1.91838993E-03    3          -24       -13        14             # HL0    -->  W-     MU+    NUM         
      1.91838993E-03    3          -24       -15        16             # HL0    -->  W-     TAU+   NUT         
      5.75517025E-03    3          -24         2        -1             # HL0    -->  W-     UP     DB          
      5.75517025E-03    3          -24         4        -3             # HL0    -->  W-     CH     SB          
      1.44086385E-04    3           23        12       -12             # HL0    -->  Z0     NUE    ANUE        
      1.44086385E-04    3           23        14       -14             # HL0    -->  Z0     NUM    ANUM        
      1.44086385E-04    3           23        16       -16             # HL0    -->  Z0     NUT    ANUT        
      7.25172213E-05    3           23        11       -11             # HL0    -->  Z0     E-     E+          
      7.25172213E-05    3           23        13       -13             # HL0    -->  Z0     MU-    MU+         
      7.25172213E-05    3           23        15       -15             # HL0    -->  Z0     TAU-   TAU+        
      2.48437864E-04    3           23         2        -2             # HL0    -->  Z0     UP     UB          
      2.48437864E-04    3           23         4        -4             # HL0    -->  Z0     CH     CB          
      3.20049206E-04    3           23         1        -1             # HL0    -->  Z0     DN     DB          
      3.20049206E-04    3           23         3        -3             # HL0    -->  Z0     ST     SB          
      3.20049206E-04    3           23         5        -5             # HL0    -->  Z0     BT     BB          
#         PDG         Width
DECAY        35  1.28152542E+01   # HH0   decays
#          BR          NDA       ID1       ID2       ID3       ID4
      1.06237765E-08    2           11       -11                       # HH0    -->  E-     E+                 
      4.48554900E-04    2           13       -13                       # HH0    -->  MU-    MU+                
      1.28463328E-01    2           15       -15                       # HH0    -->  TAU-   TAU+               
      1.30952776E-05    2            1        -1                       # HH0    -->  DN     DB                 
      5.29115507E-03    2            3        -3                       # HH0    -->  ST     SB                 
      8.56574595E-01    2            5        -5                       # HH0    -->  BT     BB                 
      1.77938914E-12    2            2        -2                       # HH0    -->  UP     UB                 
      2.72961653E-08    2            4        -4                       # HH0    -->  CH     CB                 
      6.41691149E-04    2            6        -6                       # HH0    -->  TP     TB                 
      1.23405485E-07    2           22        22                       # HH0    -->  GM     GM                 
      1.69840405E-05    2           21        21                       # HH0    -->  GL     GL                 
      3.10394194E-06    2           24       -24                       # HH0    -->  W+     W-                 
      1.52493112E-06    2           23        23                       # HH0    -->  Z0     Z0                 
      1.17812050E-03    2      1000022   1000022                       # HH0    -->  Z1SS   Z1SS               
      4.15658299E-03    2      1000022   1000023                       # HH0    -->  Z1SS   Z2SS               
      9.81353922E-04    2      1000023   1000023                       # HH0    -->  Z2SS   Z2SS               
      2.21779826E-03    2      1000024  -1000024                       # HH0    -->  W1SS+  W1SS-              
      1.20816994E-05    2           25        25                       # HH0    -->  HL0    HL0                
#         PDG         Width
DECAY        36  1.30805397E+01   # HA0   decays
#          BR          NDA       ID1       ID2       ID3       ID4
      1.03408473E-08    2           11       -11                       # HA0    -->  E-     E+                 
      4.36609145E-04    2           13       -13                       # HA0    -->  MU-    MU+                
      1.25048369E-01    2           15       -15                       # HA0    -->  TAU-   TAU+               
      1.27473268E-05    2            1        -1                       # HA0    -->  DN     DB                 
      5.15056541E-03    2            3        -3                       # HA0    -->  ST     SB                 
      8.33979726E-01    2            5        -5                       # HA0    -->  BT     BB                 
      1.59325645E-12    2            2        -2                       # HA0    -->  UP     UB                 
      2.44614977E-08    2            4        -4                       # HA0    -->  CH     CB                 
      1.04084087E-03    2            6        -6                       # HA0    -->  TP     TB                 
      8.33415044E-08    2           22        22                       # HA0    -->  GM     GM                 
      3.00377378E-05    2           21        21                       # HA0    -->  GL     GL                 
      1.57983950E-03    2      1000022   1000022                       # HA0    -->  Z1SS   Z1SS               
      8.26456118E-03    2      1000022   1000023                       # HA0    -->  Z1SS   Z2SS               
      7.37491669E-03    2      1000023   1000023                       # HA0    -->  Z2SS   Z2SS               
      1.70790441E-02    2      1000024  -1000024                       # HA0    -->  W1SS+  W1SS-              
      2.67370683E-06    2           25        23                       # HA0    -->  HL0    Z0                 
#         PDG         Width
DECAY        37  9.86165428E+00   # H+    decays
#          BR          NDA       ID1       ID2       ID3       ID4
      1.40110625E-08    2           12       -11                       # H+     -->  NUE    E+                 
      5.91572258E-04    2           14       -13                       # H+     -->  NUM    MU+                
      1.69431239E-01    2           16       -15                       # H+     -->  NUT    TAU+               
      1.57768736E-05    2            2        -1                       # H+     -->  UP     DB                 
      6.37459336E-03    2            4        -3                       # H+     -->  CH     SB                 
      8.08076918E-01    2            6        -5                       # H+     -->  TP     BB                 
      1.54625969E-02    2      1000024   1000022                       # H+     -->  W1SS+  Z1SS               
      4.34607209E-05    2      1000024   1000023                       # H+     -->  W1SS+  Z2SS               
      3.87699629E-06    2           25        24                       # H+     -->  HL0    W+                 
