  65
  401    702.2107    0.90435E-24
  402    698.1886    0.96111E-24
  403    702.2108    0.90440E-24
  404    698.1899    0.96112E-24
  405   2000.1373    0.74062E-26
  406   2004.0999    0.55876E-26
  407    702.2107    0.90435E-24
  408    698.1886    0.96111E-24
  409    702.2108    0.90440E-24
  410    698.1899    0.96112E-24
  411   2000.1373    0.74062E-26
  412   2004.0999    0.55876E-26
  413   2000.1418    0.74198E-26
  414   1999.7164    0.71503E-26
  415   2000.1418    0.74198E-26
  416   1999.7168    0.71503E-26
  417   2000.7828    0.53960E-26
  418   2004.4734    0.54506E-26
  419   2000.1418    0.74198E-26
  420   1999.7164    0.71503E-26
  421   2000.1418    0.74198E-26
  422   1999.7168    0.71503E-26
  423   2000.7828    0.53960E-26
  424   2004.4734    0.54506E-26
  425    352.7967    0.17627E-23
  426    344.7216    0.17691E-23
  427    352.7968    0.17627E-23
  428    344.7216    0.17691E-23
  429   2000.4075    0.64624E-25
  430   1999.0830    0.28240E-25
  431    352.7967    0.17627E-23
  432    344.7216    0.17691E-23
  433    352.7968    0.17627E-23
  434    344.7216    0.17691E-23
  435   2000.4075    0.64624E-25
  436   1999.0830    0.28240E-25
  437   2000.4253    0.65077E-25
  438      0.0000    0.10000E+31
  439   2000.4253    0.65077E-25
  440      0.0000    0.10000E+31
  441   2000.5106    0.28277E-25
  442      0.0000    0.10000E+31
  443   2000.4253    0.65077E-25
  444      0.0000    0.10000E+31
  445   2000.4253    0.65077E-25
  446      0.0000    0.10000E+31
  447   2000.5106    0.28277E-25
  448      0.0000    0.10000E+31
  449    710.0000    0.12428E-22
  450     99.9839    0.10000E+31
  451    599.8620    0.15183E-24
  452  -1051.4829    0.76916E-25
  453   1062.0250    0.70757E-25
  454    599.8259    0.15180E-24
  455   1061.5713    0.70428E-25
  456    599.8259    0.15180E-24
  457   1061.5713    0.70428E-25
  203    105.4012    0.17895E-21
  204   1007.8633    0.20372E-24
  205   1000.0000    0.19461E-24
  206    999.3905    0.23883E-24
  207    999.3905    0.23883E-24
  458      0.0000    0.10000E+31
    6    172.5000    0.57395E-24
   12    172.5000    0.57395E-24
   3
   401  0.13608140E+00     0   450     1     0     0     0
   401  0.28859055E+00     0   451     1     0     0     0
   401  0.57532805E+00     0   456     2     0     0     0
   3
   402  0.13221788E+00     0   450     2     0     0     0
   402  0.28841296E+00     0   451     2     0     0     0
   402  0.57936913E+00     0   454     1     0     0     0
   3
   403  0.13608921E+00     0   450     3     0     0     0
   403  0.28860739E+00     0   451     3     0     0     0
   403  0.57530344E+00     0   456     4     0     0     0
   3
   404  0.13221879E+00     0   450     4     0     0     0
   404  0.28839165E+00     0   451     4     0     0     0
   404  0.57938957E+00     0   454     3     0     0     0
   7
   405  0.12632661E-01     0   450     5     0     0     0
   405  0.23779330E-04     0   451     5     0     0     0
   405  0.46727035E-03     0   452     5     0     0     0
   405  0.45561933E-03     0   453     5     0     0     0
   405  0.98551065E+00     0   449     5     0     0     0
   405  0.44724733E-04     0   456     6     0     0     0
   405  0.86532015E-03     0   457     6     0     0     0
   7
   406  0.73130798E+00     0   449     6     0     0     0
   406  0.37645988E-01     0   450     6     0     0     0
   406  0.14514303E-02     0   451     6     0     0     0
   406  0.57291962E-01     0   452     6     0     0     0
   406  0.55518780E-01     0   453     6     0     0     0
   406  0.29569420E-02     0   454     5     0     0     0
   406  0.11382689E+00     0   455     5     0     0     0
   3
   407  0.13608140E+00     0   450     7     0     0     0
   407  0.28859055E+00     0   451     7     0     0     0
   407  0.57532805E+00     0   454     8     0     0     0
   3
   408  0.13221788E+00     0   450     8     0     0     0
   408  0.28841296E+00     0   451     8     0     0     0
   408  0.57936913E+00     0   456     7     0     0     0
   3
   409  0.13608921E+00     0   450     9     0     0     0
   409  0.28860739E+00     0   451     9     0     0     0
   409  0.57530344E+00     0   454    10     0     0     0
   3
   410  0.13221879E+00     0   450    10     0     0     0
   410  0.28839165E+00     0   451    10     0     0     0
   410  0.57938957E+00     0   456     9     0     0     0
   7
   411  0.12632661E-01     0   450    11     0     0     0
   411  0.23779330E-04     0   451    11     0     0     0
   411  0.46727035E-03     0   452    11     0     0     0
   411  0.45561933E-03     0   453    11     0     0     0
   411  0.98551065E+00     0   449    11     0     0     0
   411  0.44724733E-04     0   454    12     0     0     0
   411  0.86532015E-03     0   455    12     0     0     0
   7
   412  0.73130798E+00     0   449    12     0     0     0
   412  0.37645988E-01     0   450    12     0     0     0
   412  0.14514303E-02     0   451    12     0     0     0
   412  0.57291962E-01     0   452    12     0     0     0
   412  0.55518780E-01     0   453    12     0     0     0
   412  0.29569420E-02     0   456    11     0     0     0
   412  0.11382689E+00     0   457    11     0     0     0
   3
   413  0.12652914E-01     0   450     1     0     0     0
   413  0.10013954E-04     0   453     1     0     0     0
   413  0.98733711E+00     0   449     1     0     0     0
   4
   414  0.48763499E-01     0   450     2     0     0     0
   414  0.10037992E-04     0   452     2     0     0     0
   414  0.38580311E-04     0   453     2     0     0     0
   414  0.95118791E+00     0   449     2     0     0     0
   3
   415  0.12652914E-01     0   450     3     0     0     0
   415  0.10013954E-04     0   453     3     0     0     0
   415  0.98733711E+00     0   449     3     0     0     0
   4
   416  0.48763514E-01     0   450     4     0     0     0
   416  0.10037989E-04     0   452     4     0     0     0
   416  0.38580300E-04     0   453     4     0     0     0
   416  0.95118785E+00     0   449     4     0     0     0
   7
   417  0.24004576E-02     0   450     5     0     0     0
   417  0.55650841E-01     0   451     5     0     0     0
   417  0.36780845E-03     0   452     5     0     0     0
   417  0.12170046E-02     0   453     5     0     0     0
   417  0.71836638E+00     0   449     5     0     0     0
   417  0.10966887E+00     0   456     6     0     0     0
   417  0.11232863E+00     0   457     6     0     0     0
   7
   418  0.71359509E+00     0   449     6     0     0     0
   418  0.11401188E+00     0   454     5     0     0     0
   418  0.18197469E-02     0   455     5     0     0     0
   418  0.22489056E-02     0   450     6     0     0     0
   418  0.56165602E-01     0   451     6     0     0     0
   418  0.56002900E-01     0   452     6     0     0     0
   418  0.56155883E-01     0   453     6     0     0     0
   3
   419  0.12652914E-01     0   450     7     0     0     0
   419  0.10013954E-04     0   453     7     0     0     0
   419  0.98733711E+00     0   449     7     0     0     0
   4
   420  0.48763499E-01     0   450     8     0     0     0
   420  0.10037992E-04     0   452     8     0     0     0
   420  0.38580311E-04     0   453     8     0     0     0
   420  0.95118791E+00     0   449     8     0     0     0
   3
   421  0.12652914E-01     0   450     9     0     0     0
   421  0.10013954E-04     0   453     9     0     0     0
   421  0.98733711E+00     0   449     9     0     0     0
   4
   422  0.48763514E-01     0   450    10     0     0     0
   422  0.10037989E-04     0   452    10     0     0     0
   422  0.38580300E-04     0   453    10     0     0     0
   422  0.95118785E+00     0   449    10     0     0     0
   7
   423  0.24004576E-02     0   450    11     0     0     0
   423  0.55650841E-01     0   451    11     0     0     0
   423  0.36780845E-03     0   452    11     0     0     0
   423  0.12170046E-02     0   453    11     0     0     0
   423  0.71836638E+00     0   449    11     0     0     0
   423  0.10966887E+00     0   454    12     0     0     0
   423  0.11232863E+00     0   455    12     0     0     0
   7
   424  0.71359509E+00     0   449    12     0     0     0
   424  0.11401188E+00     0   456    11     0     0     0
   424  0.18197469E-02     0   457    11     0     0     0
   424  0.22489056E-02     0   450    12     0     0     0
   424  0.56165602E-01     0   451    12     0     0     0
   424  0.56002900E-01     0   452    12     0     0     0
   424  0.56155883E-01     0   453    12     0     0     0
   1
   425  0.10000000E+01     0   450   121     0     0     0
   1
   426  0.10000000E+01     0   450   122     0     0     0
   1
   427  0.10000000E+01     0   450   123     0     0     0
   1
   428  0.10000000E+01     0   450   124     0     0     0
   6
   429  0.99196768E+00     0   450   125     0     0     0
   429  0.17238181E-03     0   451   125     0     0     0
   429  0.19322498E-02     0   452   125     0     0     0
   429  0.24440775E-02     0   453   125     0     0     0
   429  0.16944614E-03     0   456   126     0     0     0
   429  0.33141703E-02     0   457   126     0     0     0
   6
   430  0.10980884E+00     0   450   126     0     0     0
   430  0.28861615E+00     0   451   126     0     0     0
   430  0.24224882E-03     0   452   126     0     0     0
   430  0.55182613E-02     0   453   126     0     0     0
   430  0.58841246E+00     0   454   125     0     0     0
   430  0.74020522E-02     0   455   125     0     0     0
   1
   431  0.10000000E+01     0   450   127     0     0     0
   1
   432  0.10000000E+01     0   450   128     0     0     0
   1
   433  0.10000000E+01     0   450   129     0     0     0
   1
   434  0.10000000E+01     0   450   130     0     0     0
   6
   435  0.99196768E+00     0   450   131     0     0     0
   435  0.17238181E-03     0   451   131     0     0     0
   435  0.19322498E-02     0   452   131     0     0     0
   435  0.24440775E-02     0   453   131     0     0     0
   435  0.16944614E-03     0   454   132     0     0     0
   435  0.33141703E-02     0   455   132     0     0     0
   6
   436  0.10980884E+00     0   450   132     0     0     0
   436  0.28861615E+00     0   451   132     0     0     0
   436  0.24224882E-03     0   452   132     0     0     0
   436  0.55182613E-02     0   453   132     0     0     0
   436  0.58841246E+00     0   456   131     0     0     0
   436  0.74020522E-02     0   457   131     0     0     0
   4
   437  0.99891484E+00     0   450   121     0     0     0
   437  0.88650566E-04     0   451   121     0     0     0
   437  0.20573779E-03     0   452   121     0     0     0
   437  0.79075049E-03     0   453   121     0     0     0
   0
   4
   439  0.99891484E+00     0   450   123     0     0     0
   439  0.88650566E-04     0   451   123     0     0     0
   439  0.20573779E-03     0   452   123     0     0     0
   439  0.79075049E-03     0   453   123     0     0     0
   0
   6
   441  0.10701847E+00     0   450   125     0     0     0
   441  0.29602847E+00     0   451   125     0     0     0
   441  0.79404277E-03     0   452   125     0     0     0
   441  0.38494230E-02     0   453   125     0     0     0
   441  0.58078647E+00     0   456   126     0     0     0
   441  0.11523154E-01     0   457   126     0     0     0
   0
   4
   443  0.99891484E+00     0   450   127     0     0     0
   443  0.88650566E-04     0   451   127     0     0     0
   443  0.20573779E-03     0   452   127     0     0     0
   443  0.79075049E-03     0   453   127     0     0     0
   0
   4
   445  0.99891484E+00     0   450   129     0     0     0
   445  0.88650566E-04     0   451   129     0     0     0
   445  0.20573779E-03     0   452   129     0     0     0
   445  0.79075049E-03     0   453   129     0     0     0
   0
   6
   447  0.10701847E+00     0   450   131     0     0     0
   447  0.29602847E+00     0   451   131     0     0     0
   447  0.79404277E-03     0   452   131     0     0     0
   447  0.38494230E-02     0   453   131     0     0     0
   447  0.58078647E+00     0   454   132     0     0     0
   447  0.11523154E-01     0   455   132     0     0     0
   0
  14
   449  0.33860386E-03     0   450     2     8     0     0
   449  0.84574975E-04     0   450     1     7     0     0
   449  0.84574975E-04     0   450     3     9     0     0
   449  0.33860354E-03     0   450     4    10     0     0
   449  0.11224744E-03     0   450     5    11     0     0
   449  0.10102779E-03     0   450     6    12     0     0
   449  0.17415416E+00     0   408     2     0     0     0
   449  0.17415416E+00     0   402     8     0     0     0
   449  0.76173700E-01     0   407     1     0     0     0
   449  0.76173700E-01     0   401     7     0     0     0
   449  0.76148160E-01     0   409     3     0     0     0
   449  0.76148160E-01     0   403     9     0     0     0
   449  0.17299415E+00     0   410     4     0     0     0
   449  0.17299415E+00     0   404    10     0     0     0
   0
  10
   451  0.24468135E-03     0   450   200     0     0     0
   451  0.28531444E-02     0   450   203     0     0     0
   451  0.12309565E+00     0   425   127     0     0     0
   451  0.12309565E+00     0   431   121     0     0     0
   451  0.12309563E+00     0   427   129     0     0     0
   451  0.12309563E+00     0   433   123     0     0     0
   451  0.12612991E+00     0   426   128     0     0     0
   451  0.12612991E+00     0   432   122     0     0     0
   451  0.12612991E+00     0   428   130     0     0     0
   451  0.12612991E+00     0   434   124     0     0     0
  22
   452  0.30508763E+00     0   454   199     0     0     0
   452  0.30508763E+00     0   456   198     0     0     0
   452  0.69736540E-01     0   450   200     0     0     0
   452  0.29357925E+00     0   451   200     0     0     0
   452  0.16494457E-01     0   450   203     0     0     0
   452  0.75772791E-02     0   451   203     0     0     0
   452  0.11033287E-03     0   402     8     0     0     0
   452  0.11033287E-03     0   408     2     0     0     0
   452  0.19436303E-03     0   401     7     0     0     0
   452  0.19436303E-03     0   407     1     0     0     0
   452  0.19436298E-03     0   403     9     0     0     0
   452  0.19436298E-03     0   409     3     0     0     0
   452  0.11033172E-03     0   404    10     0     0     0
   452  0.11033172E-03     0   410     4     0     0     0
   452  0.40426581E-04     0   425   127     0     0     0
   452  0.40426581E-04     0   431   121     0     0     0
   452  0.40426581E-04     0   427   129     0     0     0
   452  0.40426581E-04     0   433   123     0     0     0
   452  0.26418071E-03     0   426   128     0     0     0
   452  0.26418071E-03     0   432   122     0     0     0
   452  0.26418071E-03     0   428   130     0     0     0
   452  0.26418071E-03     0   434   124     0     0     0
  22
   453  0.28977203E+00     0   454   199     0     0     0
   453  0.28977203E+00     0   456   198     0     0     0
   453  0.15805403E-01     0   450   200     0     0     0
   453  0.80101760E-02     0   451   200     0     0     0
   453  0.60872197E-01     0   450   203     0     0     0
   453  0.25825995E+00     0   451   203     0     0     0
   453  0.47947005E-02     0   402     8     0     0     0
   453  0.47947005E-02     0   408     2     0     0     0
   453  0.56957779E-02     0   401     7     0     0     0
   453  0.56957779E-02     0   407     1     0     0     0
   453  0.56957761E-02     0   403     9     0     0     0
   453  0.56957761E-02     0   409     3     0     0     0
   453  0.47946535E-02     0   404    10     0     0     0
   453  0.47946535E-02     0   410     4     0     0     0
   453  0.31808983E-02     0   425   127     0     0     0
   453  0.31808983E-02     0   431   121     0     0     0
   453  0.31808980E-02     0   427   129     0     0     0
   453  0.31808980E-02     0   433   123     0     0     0
   453  0.57056993E-02     0   426   128     0     0     0
   453  0.57056998E-02     0   432   122     0     0     0
   453  0.57056993E-02     0   428   130     0     0     0
   453  0.57056998E-02     0   434   124     0     0     0
   7
   454  0.16438966E-04     0   450     2     7     0     0
   454  0.16438858E-04     0   450     4     9     0     0
   454  0.31374353E-02     0   450   198     0     0     0
   454  0.25699785E+00     0   426   127     0     0     0
   454  0.25699785E+00     0   428   129     0     0     0
   454  0.24141702E+00     0   431   122     0     0     0
   454  0.24141696E+00     0   433   124     0     0     0
  12
   455  0.74884526E-01     0   450   198     0     0     0
   455  0.29117268E+00     0   451   198     0     0     0
   455  0.73802904E-02     0   402     7     0     0     0
   455  0.14001885E-01     0   407     2     0     0     0
   455  0.73802490E-02     0   404     9     0     0     0
   455  0.14251704E-01     0   409     4     0     0     0
   455  0.61139902E-02     0   426   127     0     0     0
   455  0.61139902E-02     0   428   129     0     0     0
   455  0.11674966E-01     0   431   122     0     0     0
   455  0.11674966E-01     0   433   124     0     0     0
   455  0.28823623E+00     0   454   200     0     0     0
   455  0.26711455E+00     0   454   203     0     0     0
   7
   456  0.16438966E-04     0   450     8     1     0     0
   456  0.16438858E-04     0   450    10     3     0     0
   456  0.31374353E-02     0   450   199     0     0     0
   456  0.25699785E+00     0   432   121     0     0     0
   456  0.25699785E+00     0   434   123     0     0     0
   456  0.24141702E+00     0   425   128     0     0     0
   456  0.24141696E+00     0   427   130     0     0     0
  12
   457  0.74884526E-01     0   450   199     0     0     0
   457  0.29117268E+00     0   451   199     0     0     0
   457  0.73802904E-02     0   408     1     0     0     0
   457  0.14001885E-01     0   401     8     0     0     0
   457  0.73802490E-02     0   410     3     0     0     0
   457  0.14251704E-01     0   403    10     0     0     0
   457  0.61139902E-02     0   432   121     0     0     0
   457  0.61139902E-02     0   434   123     0     0     0
   457  0.11674966E-01     0   425   128     0     0     0
   457  0.11674966E-01     0   427   130     0     0     0
   457  0.28823623E+00     0   456   200     0     0     0
   457  0.26711455E+00     0   456   203     0     0     0
  28
   203  0.21322463E-03     0   123   129     0     0     0
   203  0.60967039E-01     0   125   131     0     0     0
   203  0.25644575E-02     0     3     9     0     0     0
   203  0.85110229E+00     0     5    11     0     0     0
   203  0.37277486E-01     0     4    10     0     0     0
   203  0.14674370E-02     0    59    59     0     0     0
   203  0.33270855E-01     0    13    13     0     0     0
   203  0.70846494E-03     0   198   121   128     0     0
   203  0.70846494E-03     0   198   123   130     0     0
   203  0.70846494E-03     0   198   125   132     0     0
   203  0.21253948E-02     0   198     8     1     0     0
   203  0.21253948E-02     0   198    10     3     0     0
   203  0.70846494E-03     0   199   127   122     0     0
   203  0.70846494E-03     0   199   129   124     0     0
   203  0.70846494E-03     0   199   131   126     0     0
   203  0.21253948E-02     0   199     2     7     0     0
   203  0.21253948E-02     0   199     4     9     0     0
   203  0.26321120E-04     0   200   122   128     0     0
   203  0.26321120E-04     0   200   124   130     0     0
   203  0.26321120E-04     0   200   126   132     0     0
   203  0.13247156E-04     0   200   121   127     0     0
   203  0.13247156E-04     0   200   123   129     0     0
   203  0.13247156E-04     0   200   125   131     0     0
   203  0.45383633E-04     0   200     2     8     0     0
   203  0.45383633E-04     0   200     4    10     0     0
   203  0.58465295E-04     0   200     1     7     0     0
   203  0.58465295E-04     0   200     3     9     0     0
   203  0.58465295E-04     0   200     5    11     0     0
  16
   204  0.35728193E-04     0   123   129     0     0     0
   204  0.10232912E-01     0   125   131     0     0     0
   204  0.41883549E-03     0     3     9     0     0     0
   204  0.10327043E+00     0     5    11     0     0     0
   204  0.18963161E-04     0     4    10     0     0     0
   204  0.86538535E+00     0     6    12     0     0     0
   204  0.50671207E-03     0    13    13     0     0     0
   204  0.20916539E-02     0   198   199     0     0     0
   204  0.10619939E-02     0   200   200     0     0     0
   204  0.10682899E-02     0   450   450     0     0     0
   204  0.35296502E-02     0   450   451     0     0     0
   204  0.93951505E-02     0   203   203     0     0     0
   204  0.32753980E-03     0   425   431     0     0     0
   204  0.32751283E-03     0   427   433     0     0     0
   204  0.11646112E-02     0   426   432     0     0     0
   204  0.11646112E-02     0   428   434     0     0     0
  10
   205  0.33942440E-04     0   123   129     0     0     0
   205  0.97215744E-02     0   125   131     0     0     0
   205  0.39792727E-03     0     3     9     0     0     0
   205  0.98210320E-01     0     5    11     0     0     0
   205  0.17348828E-04     0     4    10     0     0     0
   205  0.87905234E+00     0     6    12     0     0     0
   205  0.51337975E-03     0    13    13     0     0     0
   205  0.14861966E-02     0   450   450     0     0     0
   205  0.86310012E-02     0   450   451     0     0     0
   205  0.19359505E-02     0   203   200     0     0     0
   8
   206  0.41630647E-04     0   124   129     0     0     0
   206  0.11923580E-01     0   126   131     0     0     0
   206  0.46816046E-03     0     4     9     0     0     0
   206  0.96764958E+00     0     6    11     0     0     0
   206  0.14427829E-01     0   454   450     0     0     0
   206  0.23540442E-02     0   203   198     0     0     0
   206  0.15676121E-02     0   431   426     0     0     0
   206  0.15675667E-02     0   433   428     0     0     0
   8
   207  0.41630647E-04     0   130   123     0     0     0
   207  0.11923580E-01     0   132   125     0     0     0
   207  0.46816046E-03     0    10     3     0     0     0
   207  0.96764958E+00     0    12     5     0     0     0
   207  0.14427829E-01     0   456   450     0     0     0
   207  0.23540442E-02     0   203   199     0     0     0
   207  0.15676121E-02     0   425   432     0     0     0
   207  0.15675667E-02     0   427   434     0     0     0
   0
   5
     6  0.33333334E+00   100     2     7     5     0     0
     6  0.33333334E+00   100     4     9     5     0     0
     6  0.11111111E+00   100   122   127     5     0     0
     6  0.11111111E+00   100   124   129     5     0     0
     6  0.11111111E+00   100   126   131     5     0     0
   5
    12  0.33333334E+00   100     8     1    11     0     0
    12  0.33333334E+00   100    10     3    11     0     0
    12  0.11111111E+00   100   128   121    11     0     0
    12  0.11111111E+00   100   130   123    11     0     0
    12  0.11111111E+00   100   132   125    11     0     0
      4.00000000     -0.24956954
      0.99898893     -0.00381781      0.04244567     -0.01431248
     -0.01031506     -0.98824400      0.12386724     -0.08901796
      0.01976062     -0.02494994     -0.70591706     -0.70757896
     -0.03904068      0.15078664      0.69608647     -0.70085883
     -0.99197787      0.12641175     -0.12641175     -0.99197787
     -0.98444992      0.17566542     -0.17566542     -0.98444992
      1.57070661     -1.57079577     -1.57079363
    262.50000000   4200.00000000   4200.00000000
   1050.00000000
    T
