#  ISAJET SUSY parameters in Les Houches accord format
#  Created by ISALHA3. Last revision by C. Balazs on 2005 Jan. 10
Block SPINFO   # Program information
     1   ISASUGRA from ISAJET          # Spectrum Calculator
     2   7.79   16-DEC-2008 15:42:00   # Version number
Block MODSEL   # Model selection
     1     1   # Minimal supergravity (mSUGRA,CMSSM) model         
Block SMINPUTS   # Standard Model inputs
     1     1.27838684E+02   # alpha_em^(-1)
     2     1.16570000E-05   # G_Fermi
     3     1.17200002E-01   # alpha_s(M_Z)
     4     9.11699982E+01   # m_{Z}(pole)
     5     4.19999981E+00   # m_{b}(m_{b})
     6     1.72500000E+02   # m_{top}(pole)
     7     1.77699995E+00   # m_{tau}(pole)
Block MINPAR   # SUSY breaking input parameters
     1     2.00000000E+02   # m_0
     2     1.75000000E+02   # m_{1/2}
     3     3.00000000E+00   # tan(beta)
     4     1.00000000E+00   # sign(mu)
     5     0.00000000E+00   # A_0
#  
#  M_{GUT} =   0.25498667E+17
Block MASS   # Scalar and gaugino mass spectrum
#  PDG code   mass                 particle
        24     8.04229965E+01   #  W^+
        25     9.36709976E+01   #  h^0            
        35     3.90431641E+02   #  H^0            
        36     3.83865479E+02   #  A^0            
        37     3.94341309E+02   #  H^+            
   1000001     4.52572968E+02   #  dnl            
   1000002     4.46513519E+02   #  upl            
   1000003     4.52573029E+02   #  stl            
   1000004     4.46515717E+02   #  chl            
   1000005     4.07503571E+02   #  b1             
   1000006     2.93329224E+02   #  t1             
   1000011     2.35947327E+02   #  el-            
   1000012     2.24286514E+02   #  nuel           
   1000013     2.35947342E+02   #  mul-           
   1000014     2.24286514E+02   #  numl           
   1000015     2.12771317E+02   #  tau1           
   1000016     2.23963531E+02   #  nutl           
   1000021     4.47538361E+02   #  glss           
   1000022     6.19667587E+01   #  z1ss           
   1000023     1.13963951E+02   #  z2ss           
   1000024     1.11130669E+02   #  w1ss           
   1000025    -2.86781616E+02   #  z3ss           
   1000035     3.19121643E+02   #  z4ss           
   1000037     3.14173462E+02   #  w2ss           
   2000001     4.38210907E+02   #  dnr            
   2000002     4.37589935E+02   #  upr            
   2000003     4.38210968E+02   #  str            
   2000004     4.37592133E+02   #  chr            
   2000005     4.37490509E+02   #  b2             
   2000006     4.76328308E+02   #  t2             
   2000011     2.13414139E+02   #  er-            
   2000013     2.13414169E+02   #  mur-           
   2000015     2.36204468E+02   #  tau2           
#  Higgs mixing
Block ALPHA   # Effective Higgs mixing parameter
         -3.54194105E-01   # alpha
Block STOPMIX   # stop mixing matrix
  1  1     5.66312194E-01   # O_{11}
  1  2    -8.24190855E-01   # O_{12}
  2  1     8.24190855E-01   # O_{21}
  2  2     5.66312194E-01   # O_{22}
Block SBOTMIX   # sbottom mixing matrix
  1  1     9.90401208E-01   # O_{11}
  1  2    -1.38222530E-01   # O_{12}
  2  1     1.38222530E-01   # O_{21}
  2  2     9.90401208E-01   # O_{22}
Block STAUMIX   # stau mixing matrix
  1  1     1.63107395E-01   # O_{11}
  1  2    -9.86608326E-01   # O_{12}
  2  1     9.86608326E-01   # O_{21}
  2  2     1.63107395E-01   # O_{22}
Block NMIX   # neutralino mixing matrix
  1  1     9.55509365E-01   #
  1  2    -1.78280383E-01   #
  1  3     2.08638385E-01   #
  1  4    -1.08111054E-01   #
  2  1    -2.50123143E-01   #
  2  2    -9.11153018E-01   #
  2  3     2.73972273E-01   #
  2  4    -1.79381922E-01   #
  3  1     5.53912818E-02   #
  3  2    -8.37398693E-02   #
  3  3    -6.94438934E-01   #
  3  4    -7.12512612E-01   #
  4  1     1.46192089E-01   #
  4  2    -3.61944675E-01   #
  4  3    -6.31794274E-01   #
  4  4     6.69671416E-01   #
Block UMIX   # chargino U mixing matrix
  1  1    -8.94646108E-01   # U_{11}
  1  2     4.46775466E-01   # U_{12}
  2  1    -4.46775466E-01   # U_{21}
  2  2    -8.94646108E-01   # U_{22}
Block VMIX   # chargino V mixing matrix
  1  1    -9.55192685E-01   # V_{11}
  1  2     2.95984596E-01   # V_{12}
  2  1    -2.95984596E-01   # V_{21}
  2  2    -9.55192685E-01   # V_{22}
Block GAUGE Q=  3.50318329E+02   #
     1     3.57523680E-01   # g`
     2     6.52359724E-01   # g_2
     3     1.21925080E+00   # g_3
Block YU Q=  3.50318329E+02   #
  3  3     9.36089218E-01   # y_t
Block YD Q=  3.50318329E+02   #
  3  3     4.51076701E-02   # y_b
Block YE Q=  3.50318329E+02   #
  3  3     3.17393541E-02   # y_tau
Block HMIX Q=  3.50318329E+02   # Higgs mixing parameters
     1     2.83796539E+02   # mu(Q)
     2     3.00000000E+00   # tan(beta)(M_{GUT})
     3     2.49937851E+02   # Higgs vev at Q
     4     1.47352703E+05   # m_A^2(Q)
Block MSOFT Q=  3.50318329E+02   # DRbar SUSY breaking parameters
     1     7.02986908E+01   # M_1(Q)          
     2     1.33589050E+02   # M_2(Q)          
     3     4.17416870E+02   # M_3(Q)          
    31     2.31595551E+02   # MeL(Q)          
    32     2.31595551E+02   # MmuL(Q)         
    33     2.31285919E+02   # MtauL(Q)        
    34     2.09809296E+02   # MeR(Q)          
    35     2.09809296E+02   # MmuR(Q)         
    36     2.09574600E+02   # MtauR(Q)        
    41     4.27555176E+02   # MqL1(Q)         
    42     4.27555176E+02   # MqL2(Q)         
    43     3.85805115E+02   # MqL3(Q)         
    44     4.17341705E+02   # MuR(Q)          
    45     4.17341705E+02   # McR(Q)          
    46     3.18095642E+02   # MtR(Q)          
    47     4.16098083E+02   # MdR(Q)          
    48     4.16098083E+02   # MsR(Q)          
    49     4.18877197E+02   # MbR(Q)          
Block AU Q=  3.50318329E+02   #
  1  1    -3.19958130E+02   # A_u
  2  2    -3.19958130E+02   # A_c
  3  3    -3.19958130E+02   # A_t
Block AD Q=  3.50318329E+02   #
  1  1    -5.13805420E+02   # A_d
  2  2    -5.13805420E+02   # A_s
  3  3    -5.13805420E+02   # A_b
Block AE Q=  3.50318329E+02   #
  1  1    -1.11910515E+02   # A_e
  2  2    -1.11910515E+02   # A_mu
  3  3    -1.11910515E+02   # A_tau
#  ISAJET decay tables in SUSY Les Houches accord format
#  Created by ISALHD. Last revision: C. Balazs, 2005 May 25
Block DCINFO                           # Program information
     1   ISASUGRA from ISAJET          # Spectrum Calculator
     2   7.79   16-DEC-2008 15:42:00   # Version number
#         PDG         Width
DECAY         6  1.14680767E+00   # TP    decays
#          BR          NDA       ID1       ID2       ID3       ID4
      3.33333343E-01    3            2        -1         5             # TP     -->  UP     DB     BT          
      3.33333343E-01    3            4        -3         5             # TP     -->  CH     SB     BT          
      1.11111112E-01    3          -11        12         5             # TP     -->  E+     NUE    BT          
      1.11111112E-01    3          -13        14         5             # TP     -->  MU+    NUM    BT          
      1.11111112E-01    3          -15        16         5             # TP     -->  TAU+   NUT    BT          
#         PDG         Width
DECAY   1000021  4.46171165E-01   # GLSS  decays
#          BR          NDA       ID1       ID2       ID3       ID4
      8.09451565E-03    3      1000024         1        -2             # GLSS   -->  W1SS+  DN     UB          
      8.09451565E-03    3     -1000024         2        -1             # GLSS   -->  W1SS-  UP     DB          
      8.09449703E-03    3      1000024         3        -4             # GLSS   -->  W1SS+  ST     CB          
      8.09449703E-03    3     -1000024         4        -3             # GLSS   -->  W1SS-  CH     SB          
      1.77305227E-03    3      1000024         5        -6             # GLSS   -->  W1SS+  BT     TB          
      1.77305227E-03    3     -1000024         6        -5             # GLSS   -->  W1SS-  TP     BB          
      2.12062005E-04    3      1000037         1        -2             # GLSS   -->  W2SS+  DN     UB          
      2.12062005E-04    3     -1000037         2        -1             # GLSS   -->  W2SS-  UP     DB          
      2.12061175E-04    3      1000037         3        -4             # GLSS   -->  W2SS+  ST     CB          
      2.12061175E-04    3     -1000037         4        -3             # GLSS   -->  W2SS-  CH     SB          
      1.13186878E-04    2      1000022        21                       # GLSS   -->  Z1SS   GL                 
      1.64369994E-03    3      1000022         1        -1             # GLSS   -->  Z1SS   DN     DB          
      1.64369633E-03    3      1000022         3        -3             # GLSS   -->  Z1SS   ST     SB          
      2.54334009E-04    3      1000022         6        -6             # GLSS   -->  Z1SS   TP     TB          
      2.54597864E-04    2      1000023        21                       # GLSS   -->  Z2SS   GL                 
      9.80944559E-03    3      1000023         1        -1             # GLSS   -->  Z2SS   DN     DB          
      9.80942417E-03    3      1000023         3        -3             # GLSS   -->  Z2SS   ST     SB          
      3.62579594E-04    2      1000025        21                       # GLSS   -->  Z3SS   GL                 
      9.21949904E-05    3      1000025         1        -1             # GLSS   -->  Z3SS   DN     DB          
      9.21947503E-05    3      1000025         3        -3             # GLSS   -->  Z3SS   ST     SB          
      2.76085048E-04    2      1000035        21                       # GLSS   -->  Z4SS   GL                 
      1.37182057E-03    3      1000035         1        -1             # GLSS   -->  Z4SS   DN     DB          
      1.37181685E-03    3      1000035         3        -3             # GLSS   -->  Z4SS   ST     SB          
      2.63417343E-04    2     -1000002         2                       # GLSS   -->  UBL    UP                 
      2.63417343E-04    2      1000002        -2                       # GLSS   -->  UPL    UB                 
      2.43295096E-02    2     -2000002         2                       # GLSS   -->  UBR    UP                 
      2.43295096E-02    2      2000002        -2                       # GLSS   -->  UPR    UB                 
      2.14170590E-02    2     -2000001         1                       # GLSS   -->  DBR    DN                 
      2.14170590E-02    2      2000001        -1                       # GLSS   -->  DNR    DB                 
      2.14120355E-02    2     -2000003         3                       # GLSS   -->  SBR    ST                 
      2.14120355E-02    2      2000003        -3                       # GLSS   -->  STR    SB                 
      2.40987986E-02    2     -2000004         4                       # GLSS   -->  CBR    CH                 
      2.40987986E-02    2      2000004        -4                       # GLSS   -->  CHR    CB                 
      3.51997346E-01    2     -1000005         5                       # GLSS   -->  BB1    BT                 
      3.51997346E-01    2      1000005        -5                       # GLSS   -->  BT1    BB                 
      2.45481040E-02    2     -2000005         5                       # GLSS   -->  BB2    BT                 
      2.45481040E-02    2      2000005        -5                       # GLSS   -->  BT2    BB                 
#         PDG         Width
DECAY   1000002  4.66032219E+00   # UPL   decays
#          BR          NDA       ID1       ID2       ID3       ID4
      4.03299146E-06    2      1000022         2                       # UPL    -->  Z1SS   UP                 
      3.22793454E-01    2      1000023         2                       # UPL    -->  Z2SS   UP                 
      7.53862492E-04    2      1000025         2                       # UPL    -->  Z3SS   UP                 
      1.08424444E-02    2      1000035         2                       # UPL    -->  Z4SS   UP                 
      6.47590339E-01    2      1000024         1                       # UPL    -->  W1SS+  DN                 
      1.80158671E-02    2      1000037         1                       # UPL    -->  W2SS+  DN                 
#         PDG         Width
DECAY   1000001  4.47090864E+00   # DNL   decays
#          BR          NDA       ID1       ID2       ID3       ID4
      5.12204431E-02    2      1000022         1                       # DNL    -->  Z1SS   DN                 
      2.79876322E-01    2      1000023         1                       # DNL    -->  Z2SS   DN                 
      1.34523876E-03    2      1000025         1                       # DNL    -->  Z3SS   DN                 
      1.62771754E-02    2      1000035         1                       # DNL    -->  Z4SS   DN                 
      3.31224501E-03    2      1000021         1                       # DNL    -->  GLSS   DN                 
      6.02308989E-01    2     -1000024         2                       # DNL    -->  W1SS-  UP                 
      4.56595570E-02    2     -1000037         2                       # DNL    -->  W2SS-  UP                 
#         PDG         Width
DECAY   1000003  4.47084236E+00   # STL   decays
#          BR          NDA       ID1       ID2       ID3       ID4
      5.12212142E-02    2      1000022         3                       # STL    -->  Z1SS   ST                 
      2.79880553E-01    2      1000023         3                       # STL    -->  Z2SS   ST                 
      1.34525949E-03    2      1000025         3                       # STL    -->  Z3SS   ST                 
      1.62774287E-02    2      1000035         3                       # STL    -->  Z4SS   ST                 
      3.31237400E-03    2      1000021         3                       # STL    -->  GLSS   ST                 
      6.02306008E-01    2     -1000024         4                       # STL    -->  W1SS-  CH                 
      4.56572399E-02    2     -1000037         4                       # STL    -->  W2SS-  CH                 
#         PDG         Width
DECAY   1000004  4.66031837E+00   # CHL   decays
#          BR          NDA       ID1       ID2       ID3       ID4
      4.03293916E-06    2      1000022         4                       # CHL    -->  Z1SS   CH                 
      3.22788984E-01    2      1000023         4                       # CHL    -->  Z2SS   CH                 
      7.53837288E-04    2      1000025         4                       # CHL    -->  Z3SS   CH                 
      1.08419005E-02    2      1000035         4                       # CHL    -->  Z4SS   CH                 
      6.47594929E-01    2      1000024         3                       # CHL    -->  W1SS+  ST                 
      1.80163160E-02    2      1000037         3                       # CHL    -->  W2SS+  ST                 
#         PDG         Width
DECAY   1000005  3.21651816E+00   # BT1   decays
#          BR          NDA       ID1       ID2       ID3       ID4
      6.56495392E-02    2      1000022         5                       # BT1    -->  Z1SS   BT                 
      3.35637152E-01    2      1000023         5                       # BT1    -->  Z2SS   BT                 
      1.47737819E-03    2      1000025         5                       # BT1    -->  Z3SS   BT                 
      1.16744265E-02    2      1000035         5                       # BT1    -->  Z4SS   BT                 
      4.16612595E-01    2     -1000024         6                       # BT1    -->  W1SS-  TP                 
      1.68948904E-01    2          -24   1000006                       # BT1    -->  W-     TP1                
#         PDG         Width
DECAY   1000006  1.68675721E+00   # TP1   decays
#          BR          NDA       ID1       ID2       ID3       ID4
      1.04309060E-01    2      1000022         6                       # TP1    -->  Z1SS   TP                 
      4.86356355E-02    2      1000023         6                       # TP1    -->  Z2SS   TP                 
      8.47055316E-01    2      1000024         5                       # TP1    -->  W1SS+  BT                 
#         PDG         Width
DECAY   2000002  9.26675379E-01   # UPR   decays
#          BR          NDA       ID1       ID2       ID3       ID4
      9.35903072E-01    2      1000022         2                       # UPR    -->  Z1SS   UP                 
      5.80306016E-02    2      1000023         2                       # UPR    -->  Z2SS   UP                 
      1.06596481E-03    2      1000025         2                       # UPR    -->  Z3SS   UP                 
      5.00033936E-03    2      1000035         2                       # UPR    -->  Z4SS   UP                 
#         PDG         Width
DECAY   2000001  2.32036859E-01   # DNR   decays
#          BR          NDA       ID1       ID2       ID3       ID4
      9.35853243E-01    2      1000022         1                       # DNR    -->  Z1SS   DN                 
      5.80447018E-02    2      1000023         1                       # DNR    -->  Z2SS   DN                 
      1.07033423E-03    2      1000025         1                       # DNR    -->  Z3SS   DN                 
      5.03171468E-03    2      1000035         1                       # DNR    -->  Z4SS   DN                 
#         PDG         Width
DECAY   2000003  2.32036904E-01   # STR   decays
#          BR          NDA       ID1       ID2       ID3       ID4
      9.35853243E-01    2      1000022         3                       # STR    -->  Z1SS   ST                 
      5.80447055E-02    2      1000023         3                       # STR    -->  Z2SS   ST                 
      1.07033469E-03    2      1000025         3                       # STR    -->  Z3SS   ST                 
      5.03171748E-03    2      1000035         3                       # STR    -->  Z4SS   ST                 
#         PDG         Width
DECAY   2000004  9.26661730E-01   # CHR   decays
#          BR          NDA       ID1       ID2       ID3       ID4
      9.35903370E-01    2      1000022         4                       # CHR    -->  Z1SS   CH                 
      5.80305606E-02    2      1000023         4                       # CHR    -->  Z2SS   CH                 
      1.06593966E-03    2      1000025         4                       # CHR    -->  Z3SS   CH                 
      5.00011723E-03    2      1000035         4                       # CHR    -->  Z4SS   CH                 
#         PDG         Width
DECAY   2000005  3.01172554E-01   # BT2   decays
#          BR          NDA       ID1       ID2       ID3       ID4
      6.99253678E-01    2      1000022         5                       # BT2    -->  Z1SS   BT                 
      9.24465954E-02    2      1000023         5                       # BT2    -->  Z2SS   BT                 
      1.46443490E-02    2      1000025         5                       # BT2    -->  Z3SS   BT                 
      2.37514246E-02    2      1000035         5                       # BT2    -->  Z4SS   BT                 
      6.61120638E-02    2     -1000024         6                       # BT2    -->  W1SS-  TP                 
      1.03791863E-01    2          -24   1000006                       # BT2    -->  W-     TP1                
#         PDG         Width
DECAY   2000006  4.56218052E+00   # TP2   decays
#          BR          NDA       ID1       ID2       ID3       ID4
      2.36703381E-01    2      1000024         5                       # TP2    -->  W1SS+  BT                 
      2.90191352E-01    2      1000037         5                       # TP2    -->  W2SS+  BT                 
      2.59763330E-01    2           23   1000006                       # TP2    -->  Z0     TP1                
      5.84418178E-02    2           25   1000006                       # TP2    -->  HL0    TP1                
      1.77081209E-02    2      1000022         6                       # TP2    -->  Z1SS   TP                 
      1.13771096E-01    2      1000023         6                       # TP2    -->  Z2SS   TP                 
      2.34208759E-02    2      1000025         6                       # TP2    -->  Z3SS   TP                 
#         PDG         Width
DECAY   1000011  1.70829523E+00   # EL-   decays
#          BR          NDA       ID1       ID2       ID3       ID4
      6.06408492E-02    2      1000022        11                       # EL-    -->  Z1SS   E-                 
      3.75804842E-01    2      1000023        11                       # EL-    -->  Z2SS   E-                 
      5.63554347E-01    2     -1000024        12                       # EL-    -->  W1SS-  NUE                
      1.10484720E-11    3      1000015        11       -15             # EL-    -->  TAU1-  E-     TAU+        
      8.74342439E-12    3     -1000015        11        15             # EL-    -->  TAU1+  E-     TAU-        
#         PDG         Width
DECAY   1000013  1.70829499E+00   # MUL-  decays
#          BR          NDA       ID1       ID2       ID3       ID4
      6.06408380E-02    2      1000022        13                       # MUL-   -->  Z1SS   MU-                
      3.75804663E-01    2      1000023        13                       # MUL-   -->  Z2SS   MU-                
      5.63554466E-01    2     -1000024        14                       # MUL-   -->  W1SS-  NUM                
      1.10485076E-11    3      1000015        13       -15             # MUL-   -->  TAU1-  MU-    TAU+        
      8.74345561E-12    3     -1000015        13        15             # MUL-   -->  TAU1+  MU-    TAU-        
#         PDG         Width
DECAY   1000015  8.87186289E-01   # TAU1- decays
#          BR          NDA       ID1       ID2       ID3       ID4
      9.13890660E-01    2      1000022        15                       # TAU1-  -->  Z1SS   TAU-               
      5.60729243E-02    2      1000023        15                       # TAU1-  -->  Z2SS   TAU-               
      3.00364047E-02    2     -1000024        16                       # TAU1-  -->  W1SS-  NUT                
#         PDG         Width
DECAY   1000012  1.69026148E+00   # NUEL  decays
#          BR          NDA       ID1       ID2       ID3       ID4
      2.35807151E-01    2      1000022        12                       # NUEL   -->  Z1SS   NUE                
      1.83982730E-01    2      1000023        12                       # NUEL   -->  Z2SS   NUE                
      5.80210090E-01    2      1000024        11                       # NUEL   -->  W1SS+  E-                 
      7.14034734E-13    3      1000015        12       -15             # NUEL   -->  TAU1-  NUE    TAU+        
      6.63408618E-13    3     -1000015        12        15             # NUEL   -->  TAU1+  NUE    TAU-        
      1.80949995E-13    3     -1000015        11        16             # NUEL   -->  TAU1+  E-     NUT         
#         PDG         Width
DECAY   1000014  1.69026065E+00   # NUML  decays
#          BR          NDA       ID1       ID2       ID3       ID4
      2.35807255E-01    2      1000022        14                       # NUML   -->  Z1SS   NUM                
      1.83982804E-01    2      1000023        14                       # NUML   -->  Z2SS   NUM                
      5.80209911E-01    2      1000024        13                       # NUML   -->  W1SS+  MU-                
      7.14035059E-13    3      1000015        14       -15             # NUML   -->  TAU1-  NUM    TAU+        
      6.63408889E-13    3     -1000015        14        15             # NUML   -->  TAU1+  NUM    TAU-        
      1.80952950E-13    3     -1000015        13        16             # NUML   -->  TAU1+  MU-    NUT         
#         PDG         Width
DECAY   1000016  1.68500948E+00   # NUTL  decays
#          BR          NDA       ID1       ID2       ID3       ID4
      2.36088827E-01    2      1000022        16                       # NUTL   -->  Z1SS   NUT                
      1.83920339E-01    2      1000023        16                       # NUTL   -->  Z2SS   NUT                
      5.79990804E-01    2      1000024        15                       # NUTL   -->  W1SS+  TAU-               
      6.18004834E-13    3     -1000015        16        15             # NUTL   -->  TAU1+  NUT    TAU-        
      7.47901407E-10    3      1000015        16       -15             # NUTL   -->  TAU1-  NUT    TAU+        
      7.47327145E-10    3      1000015        12       -11             # NUTL   -->  TAU1-  NUE    E+          
      7.47327145E-10    3      1000015        14       -13             # NUTL   -->  TAU1-  NUM    MU+         
      2.24198149E-09    3      1000015         2        -1             # NUTL   -->  TAU1-  UP     DB          
      2.24198149E-09    3      1000015         4        -3             # NUTL   -->  TAU1-  CH     SB          
#         PDG         Width
DECAY   2000011  8.65680754E-01   # ER-   decays
#          BR          NDA       ID1       ID2       ID3       ID4
      9.59914327E-01    2      1000022        11                       # ER-    -->  Z1SS   E-                 
      4.00857106E-02    2      1000023        11                       # ER-    -->  Z2SS   E-                 
      1.42581168E-29    3      1000015        12       -16             # ER-    -->  TAU1-  NUE    ANUT        
#         PDG         Width
DECAY   2000013  8.65680456E-01   # MUR-  decays
#          BR          NDA       ID1       ID2       ID3       ID4
      9.59914327E-01    2      1000022        13                       # MUR-   -->  Z1SS   MU-                
      4.00857031E-02    2      1000023        13                       # MUR-   -->  Z2SS   MU-                
      6.12316990E-25    3      1000015        14       -16             # MUR-   -->  TAU1-  NUM    ANUT        
#         PDG         Width
DECAY   2000015  1.67900741E+00   # TAU2- decays
#          BR          NDA       ID1       ID2       ID3       ID4
      7.33799189E-02    2      1000022        15                       # TAU2-  -->  Z1SS   TAU-               
      3.71747524E-01    2      1000023        15                       # TAU2-  -->  Z2SS   TAU-               
      5.54872572E-01    2     -1000024        16                       # TAU2-  -->  W1SS-  NUT                
#         PDG         Width
DECAY   1000023  1.38111864E-06   # Z2SS  decays
#          BR          NDA       ID1       ID2       ID3       ID4
      2.70585966E-04    2      1000022        22                       # Z2SS   -->  Z1SS   GM                 
      1.79880619E-04    3     -1000024         2        -1             # Z2SS   -->  W1SS-  UP     DB          
      5.99602026E-05    3     -1000024        12       -11             # Z2SS   -->  W1SS-  NUE    E+          
      5.99602026E-05    3     -1000024        14       -13             # Z2SS   -->  W1SS-  NUM    MU+         
      1.79880619E-04    3      1000024         1        -2             # Z2SS   -->  W1SS+  DN     UB          
      5.99602026E-05    3      1000024        11       -12             # Z2SS   -->  W1SS+  E-     ANUE        
      5.99602026E-05    3      1000024        13       -14             # Z2SS   -->  W1SS+  MU-    ANUM        
      1.79880619E-04    3     -1000024         4        -3             # Z2SS   -->  W1SS-  CH     SB          
      5.99602026E-05    3     -1000024        16       -15             # Z2SS   -->  W1SS-  NUT    TAU+        
      1.79880619E-04    3      1000024         3        -4             # Z2SS   -->  W1SS+  ST     CB          
      5.99602026E-05    3      1000024        15       -16             # Z2SS   -->  W1SS+  TAU-   ANUT        
      1.03227116E-01    3      1000022         2        -2             # Z2SS   -->  Z1SS   UP     UB          
      1.85212895E-01    3      1000022         1        -1             # Z2SS   -->  Z1SS   DN     DB          
      1.85212880E-01    3      1000022         3        -3             # Z2SS   -->  Z1SS   ST     SB          
      1.03226982E-01    3      1000022         4        -4             # Z2SS   -->  Z1SS   CH     CB          
      1.93446875E-01    3      1000022         5        -5             # Z2SS   -->  Z1SS   BT     BB          
      3.72781940E-02    3      1000022        11       -11             # Z2SS   -->  Z1SS   E-     E+          
      3.72781493E-02    3      1000022        13       -13             # Z2SS   -->  Z1SS   MU-    MU+         
      4.21213359E-02    3      1000022        15       -15             # Z2SS   -->  Z1SS   TAU-   TAU+        
      3.70298438E-02    3      1000022        12       -12             # Z2SS   -->  Z1SS   NUE    ANUE        
      3.70298438E-02    3      1000022        14       -14             # Z2SS   -->  Z1SS   NUM    ANUM        
      3.75860445E-02    3      1000022        16       -16             # Z2SS   -->  Z1SS   NUT    ANUT        
#         PDG         Width
DECAY   1000025  1.69801998E+00   # Z3SS  decays
#          BR          NDA       ID1       ID2       ID3       ID4
      3.77566153E-07    2      1000022        22                       # Z3SS   -->  Z1SS   GM                 
      1.76388639E-07    2      1000023        22                       # Z3SS   -->  Z2SS   GM                 
      3.11759979E-01    2      1000024       -24                       # Z3SS   -->  W1SS+  W-                 
      3.11759979E-01    2     -1000024        24                       # Z3SS   -->  W1SS-  W+                 
      1.63731903E-01    2      1000022        23                       # Z3SS   -->  Z1SS   Z0                 
      1.82262495E-01    2      1000023        23                       # Z3SS   -->  Z2SS   Z0                 
      2.87848838E-08    3      1000022         2        -2             # Z3SS   -->  Z1SS   UP     UB          
      3.47264191E-08    3      1000022         1        -1             # Z3SS   -->  Z1SS   DN     DB          
      3.47263942E-08    3      1000022         3        -3             # Z3SS   -->  Z1SS   ST     SB          
      2.87841271E-08    3      1000022         4        -4             # Z3SS   -->  Z1SS   CH     CB          
      2.69373686E-07    3      1000022         5        -5             # Z3SS   -->  Z1SS   BT     BB          
      1.45175258E-08    3      1000022        15       -15             # Z3SS   -->  Z1SS   TAU-   TAU+        
      6.66092461E-08    3      1000023         2        -2             # Z3SS   -->  Z2SS   UP     UB          
      8.15137895E-08    3      1000023         1        -1             # Z3SS   -->  Z2SS   DN     DB          
      8.15137327E-08    3      1000023         3        -3             # Z3SS   -->  Z2SS   ST     SB          
      6.66074769E-08    3      1000023         4        -4             # Z3SS   -->  Z2SS   CH     CB          
      3.54212830E-07    3      1000023         5        -5             # Z3SS   -->  Z2SS   BT     BB          
      5.09274933E-09    3      1000023        15       -15             # Z3SS   -->  Z2SS   TAU-   TAU+        
      1.54807698E-02    2      1000022        25                       # Z3SS   -->  Z1SS   HL0                
      8.16289335E-03    2      1000023        25                       # Z3SS   -->  Z2SS   HL0                
      1.05398743E-04    2      1000011       -11                       # Z3SS   -->  EL-    E+                 
      1.05398743E-04    2     -1000011        11                       # Z3SS   -->  EL+    E-                 
      1.05398503E-04    2      1000013       -13                       # Z3SS   -->  MUL-   MU+                
      1.05398503E-04    2     -1000013        13                       # Z3SS   -->  MUL+   MU-                
      2.62386748E-04    2      2000011       -11                       # Z3SS   -->  ER-    E+                 
      2.62386748E-04    2     -2000011        11                       # Z3SS   -->  ER+    E-                 
      2.62386369E-04    2      2000013       -13                       # Z3SS   -->  MUR-   MU+                
      2.62386369E-04    2     -2000013        13                       # Z3SS   -->  MUR+   MU-                
      3.13961093E-04    2      1000015       -15                       # Z3SS   -->  TAU1-  TAU+               
      3.13961093E-04    2     -1000015        15                       # Z3SS   -->  TAU1+  TAU-               
      2.67460331E-04    2      2000015       -15                       # Z3SS   -->  TAU2-  TAU+               
      2.67460331E-04    2     -2000015        15                       # Z3SS   -->  TAU2+  TAU-               
      6.98949734E-04    2      1000012       -12                       # Z3SS   -->  NUEL   ANUE               
      6.98949734E-04    2     -1000012        12                       # Z3SS   -->  ANUEL  NUE                
      6.98949734E-04    2      1000014       -14                       # Z3SS   -->  NUML   ANUM               
      6.98949734E-04    2     -1000014        14                       # Z3SS   -->  ANUML  NUM                
      7.05300597E-04    2      1000016       -16                       # Z3SS   -->  NUTL   ANUT               
      7.05300597E-04    2     -1000016        16                       # Z3SS   -->  ANUTL  NUT                
#         PDG         Width
DECAY   1000035  2.22452044E+00   # Z4SS  decays
#          BR          NDA       ID1       ID2       ID3       ID4
      5.69167241E-07    2      1000022        22                       # Z4SS   -->  Z1SS   GM                 
      5.48214985E-07    2      1000023        22                       # Z4SS   -->  Z2SS   GM                 
      1.57551749E-08    2      1000025        22                       # Z4SS   -->  Z3SS   GM                 
      3.13448191E-01    2      1000024       -24                       # Z4SS   -->  W1SS+  W-                 
      3.13448191E-01    2     -1000024        24                       # Z4SS   -->  W1SS-  W+                 
      7.05572101E-10    3     -1000037         2        -1             # Z4SS   -->  W2SS-  UP     DB          
      2.35190700E-10    3     -1000037        12       -11             # Z4SS   -->  W2SS-  NUE    E+          
      2.35190700E-10    3     -1000037        14       -13             # Z4SS   -->  W2SS-  NUM    MU+         
      7.05572156E-10    3      1000037         1        -2             # Z4SS   -->  W2SS+  DN     UB          
      2.35190700E-10    3      1000037        11       -12             # Z4SS   -->  W2SS+  E-     ANUE        
      2.35190700E-10    3      1000037        13       -14             # Z4SS   -->  W2SS+  MU-    ANUM        
      7.05572156E-10    3     -1000037         4        -3             # Z4SS   -->  W2SS-  CH     SB          
      2.35190700E-10    3     -1000037        16       -15             # Z4SS   -->  W2SS-  NUT    TAU+        
      7.05572156E-10    3      1000037         3        -4             # Z4SS   -->  W2SS+  ST     CB          
      2.35190700E-10    3      1000037        15       -16             # Z4SS   -->  W2SS+  TAU-   ANUT        
      1.62305851E-02    2      1000022        23                       # Z4SS   -->  Z1SS   Z0                 
      1.04778521E-02    2      1000023        23                       # Z4SS   -->  Z2SS   Z0                 
      5.42452767E-07    3      1000022         2        -2             # Z4SS   -->  Z1SS   UP     UB          
      1.55228133E-06    3      1000022         1        -1             # Z4SS   -->  Z1SS   DN     DB          
      1.55228020E-06    3      1000022         3        -3             # Z4SS   -->  Z1SS   ST     SB          
      5.42437874E-07    3      1000022         4        -4             # Z4SS   -->  Z1SS   CH     CB          
      2.83768077E-06    3      1000022         5        -5             # Z4SS   -->  Z1SS   BT     BB          
      1.25895605E-08    3      1000022        15       -15             # Z4SS   -->  Z1SS   TAU-   TAU+        
      5.61001980E-06    3      1000023         2        -2             # Z4SS   -->  Z2SS   UP     UB          
      5.70577549E-06    3      1000023         1        -1             # Z4SS   -->  Z2SS   DN     DB          
      5.70577231E-06    3      1000023         3        -3             # Z4SS   -->  Z2SS   ST     SB          
      5.60986791E-06    3      1000023         4        -4             # Z4SS   -->  Z2SS   CH     CB          
      1.04642768E-05    3      1000023         5        -5             # Z4SS   -->  Z2SS   BT     BB          
      4.22198765E-09    3      1000023        15       -15             # Z4SS   -->  Z2SS   TAU-   TAU+        
      1.55553141E-06    3      1000025         2        -2             # Z4SS   -->  Z3SS   UP     UB          
      2.02410502E-06    3      1000025         1        -1             # Z4SS   -->  Z3SS   DN     DB          
      2.02410502E-06    3      1000025         3        -3             # Z4SS   -->  Z3SS   ST     SB          
      1.55553153E-06    3      1000025         4        -4             # Z4SS   -->  Z3SS   CH     CB          
      1.55250052E-06    3      1000025         5        -5             # Z4SS   -->  Z3SS   BT     BB          
      4.56875370E-07    3      1000025        11       -11             # Z4SS   -->  Z3SS   E-     E+          
      4.56875370E-07    3      1000025        13       -13             # Z4SS   -->  Z3SS   MU-    MU+         
      4.37017690E-07    3      1000025        15       -15             # Z4SS   -->  Z3SS   TAU-   TAU+        
      9.09038363E-07    3      1000025        12       -12             # Z4SS   -->  Z3SS   NUE    ANUE        
      9.09038363E-07    3      1000025        14       -14             # Z4SS   -->  Z3SS   NUM    ANUM        
      9.09038363E-07    3      1000025        16       -16             # Z4SS   -->  Z3SS   NUT    ANUT        
      9.47087035E-02    2      1000022        25                       # Z4SS   -->  Z1SS   HL0                
      1.16722934E-01    2      1000023        25                       # Z4SS   -->  Z2SS   HL0                
      4.92036808E-03    2      1000011       -11                       # Z4SS   -->  EL-    E+                 
      4.92036808E-03    2     -1000011        11                       # Z4SS   -->  EL+    E-                 
      4.92036343E-03    2      1000013       -13                       # Z4SS   -->  MUL-   MU+                
      4.92036343E-03    2     -1000013        13                       # Z4SS   -->  MUL+   MU-                
      2.38243258E-03    2      2000011       -11                       # Z4SS   -->  ER-    E+                 
      2.38243258E-03    2     -2000011        11                       # Z4SS   -->  ER+    E-                 
      2.38243095E-03    2      2000013       -13                       # Z4SS   -->  MUR-   MU+                
      2.38243095E-03    2     -2000013        13                       # Z4SS   -->  MUR+   MU-                
      2.13522580E-03    2      1000015       -15                       # Z4SS   -->  TAU1-  TAU+               
      2.13522580E-03    2     -1000015        15                       # Z4SS   -->  TAU1+  TAU-               
      5.25419926E-03    2      2000015       -15                       # Z4SS   -->  TAU2-  TAU+               
      5.25419926E-03    2     -2000015        15                       # Z4SS   -->  TAU2+  TAU-               
      1.51248714E-02    2      1000012       -12                       # Z4SS   -->  NUEL   ANUE               
      1.51248714E-02    2     -1000012        12                       # Z4SS   -->  ANUEL  NUE                
      1.51248714E-02    2      1000014       -14                       # Z4SS   -->  NUML   ANUM               
      1.51248714E-02    2     -1000014        14                       # Z4SS   -->  ANUML  NUM                
      1.52099738E-02    2      1000016       -16                       # Z4SS   -->  NUTL   ANUT               
      1.52099738E-02    2     -1000016        16                       # Z4SS   -->  ANUTL  NUT                
#         PDG         Width
DECAY   1000024  4.43455720E-05   # W1SS+ decays
#          BR          NDA       ID1       ID2       ID3       ID4
      3.23287934E-01    3      1000022         2        -1             # W1SS+  -->  Z1SS   UP     DB          
      3.23287934E-01    3      1000022         4        -3             # W1SS+  -->  Z1SS   CH     SB          
      1.17759556E-01    3      1000022       -11        12             # W1SS+  -->  Z1SS   E+     NUE         
      1.17759556E-01    3      1000022       -13        14             # W1SS+  -->  Z1SS   MU+    NUM         
      1.17905028E-01    3      1000022       -15        16             # W1SS+  -->  Z1SS   TAU+   NUT         
#         PDG         Width
DECAY   1000037  2.21961427E+00   # W2SS+ decays
#          BR          NDA       ID1       ID2       ID3       ID4
      1.44556714E-06    3      1000022         2        -1             # W2SS+  -->  Z1SS   UP     DB          
      1.44556623E-06    3      1000022         4        -3             # W2SS+  -->  Z1SS   CH     SB          
      1.32510136E-09    3      1000022       -15        16             # W2SS+  -->  Z1SS   TAU+   NUT         
      2.37218086E-02    2      1000022        24                       # W2SS+  -->  Z1SS   W+                 
      5.01449585E-06    3      1000023         2        -1             # W2SS+  -->  Z2SS   UP     DB          
      5.01444993E-06    3      1000023         4        -3             # W2SS+  -->  Z2SS   CH     SB          
      2.00500541E-08    3      1000023       -15        16             # W2SS+  -->  Z2SS   TAU+   NUT         
      3.76232415E-01    2      1000023        24                       # W2SS+  -->  Z2SS   W+                 
      2.45681440E-06    3      1000025         2        -1             # W2SS+  -->  Z3SS   UP     DB          
      2.45681440E-06    3      1000025         4        -3             # W2SS+  -->  Z3SS   CH     SB          
      8.17810871E-07    3      1000025       -11        12             # W2SS+  -->  Z3SS   E+     NUE         
      8.17810871E-07    3      1000025       -13        14             # W2SS+  -->  Z3SS   MU+    NUM         
      8.17811042E-07    3      1000025       -15        16             # W2SS+  -->  Z3SS   TAU+   NUT         
      2.65736319E-02    2      1000006        -5                       # W2SS+  -->  TP1    BB                 
      1.25505971E-02    2      1000012       -11                       # W2SS+  -->  NUEL   E+                 
      1.25505915E-02    2      1000014       -13                       # W2SS+  -->  NUML   MU+                
      1.28194392E-02    2      1000016       -15                       # W2SS+  -->  NUTL   TAU+               
      2.26060431E-02    2     -1000011        12                       # W2SS+  -->  EL+    NUE                
      2.26060338E-02    2     -1000013        14                       # W2SS+  -->  MUL+   NUM                
      1.49024563E-04    2     -1000015        16                       # W2SS+  -->  TAU1+  NUT                
      2.26030573E-02    2     -2000015        16                       # W2SS+  -->  TAU2+  NUT                
      2.85562813E-01    2      1000024        23                       # W2SS+  -->  W1SS+  Z0                 
      5.86793840E-06    3      1000024         1        -1             # W2SS+  -->  W1SS+  DN     DB          
      5.86777696E-06    3      1000024         3        -3             # W2SS+  -->  W1SS+  ST     SB          
      1.08864706E-05    3      1000024         2        -2             # W2SS+  -->  W1SS+  UP     UB          
      1.08864624E-05    3      1000024         4        -4             # W2SS+  -->  W1SS+  CH     CB          
      1.81970775E-01    2      1000024        25                       # W2SS+  -->  W1SS+  HL0                
#         PDG         Width
DECAY        25  3.74313560E-03   # HL0   decays
#          BR          NDA       ID1       ID2       ID3       ID4
      5.11573139E-09    2           11       -11                       # HL0    -->  E-     E+                 
      2.15993772E-04    2           13       -13                       # HL0    -->  MU-    MU+                
      6.17308579E-02    2           15       -15                       # HL0    -->  TAU-   TAU+               
      6.44123566E-06    2            1        -1                       # HL0    -->  DN     DB                 
      2.60257977E-03    2            3        -3                       # HL0    -->  ST     SB                 
      8.78168166E-01    2            5        -5                       # HL0    -->  BT     BB                 
      1.67465373E-06    2            2        -2                       # HL0    -->  UP     UB                 
      3.25493962E-02    2            4        -4                       # HL0    -->  CH     CB                 
      1.00473769E-03    2           22        22                       # HL0    -->  GM     GM                 
      2.30935216E-02    2           21        21                       # HL0    -->  GL     GL                 
      3.48142094E-05    3           24        11       -12             # HL0    -->  W+     E-     ANUE        
      3.48142094E-05    3           24        13       -14             # HL0    -->  W+     MU-    ANUM        
      3.48142094E-05    3           24        15       -16             # HL0    -->  W+     TAU-   ANUT        
      1.04442632E-04    3           24        -2         1             # HL0    -->  W+     UB     DN          
      1.04442632E-04    3           24        -4         3             # HL0    -->  W+     CB     ST          
      3.48142094E-05    3          -24       -11        12             # HL0    -->  W-     E+     NUE         
      3.48142094E-05    3          -24       -13        14             # HL0    -->  W-     MU+    NUM         
      3.48142094E-05    3          -24       -15        16             # HL0    -->  W-     TAU+   NUT         
      1.04442632E-04    3          -24         2        -1             # HL0    -->  W-     UP     DB          
      1.04442632E-04    3          -24         4        -3             # HL0    -->  W-     CH     SB          
#         PDG         Width
DECAY        35  1.01640475E+00   # HH0   decays
#          BR          NDA       ID1       ID2       ID3       ID4
      5.74260639E-10    2           11       -11                       # HH0    -->  E-     E+                 
      2.42463102E-05    2           13       -13                       # HH0    -->  MU-    MU+                
      6.94365427E-03    2           15       -15                       # HH0    -->  TAU-   TAU+               
      7.09586118E-07    2            1        -1                       # HH0    -->  DN     DB                 
      2.86708702E-04    2            3        -3                       # HH0    -->  ST     SB                 
      4.53220010E-02    2            5        -5                       # HH0    -->  BT     BB                 
      3.44965612E-09    2            2        -2                       # HH0    -->  UP     UB                 
      5.46436204E-05    2            4        -4                       # HH0    -->  CH     CB                 
      4.04055268E-01    2            6        -6                       # HH0    -->  TP     TB                 
      1.82261483E-05    2           22        22                       # HH0    -->  GM     GM                 
      2.03439151E-03    2           21        21                       # HH0    -->  GL     GL                 
      1.55627504E-02    2           24       -24                       # HH0    -->  W+     W-                 
      7.43963663E-03    2           23        23                       # HH0    -->  Z0     Z0                 
      3.41476537E-02    2      1000022   1000022                       # HH0    -->  Z1SS   Z1SS               
      7.67090246E-02    2      1000022   1000023                       # HH0    -->  Z1SS   Z2SS               
      1.49751022E-01    2      1000022   1000025                       # HH0    -->  Z1SS   Z3SS               
      4.21254430E-04    2      1000022   1000035                       # HH0    -->  Z1SS   Z4SS               
      3.92933935E-02    2      1000023   1000023                       # HH0    -->  Z2SS   Z2SS               
      1.70950353E-01    2      1000024  -1000024                       # HH0    -->  W1SS+  W1SS-              
      4.69851270E-02    2           25        25                       # HH0    -->  HL0    HL0                
#         PDG         Width
DECAY        36  2.58187222E+00   # HA0   decays
#          BR          NDA       ID1       ID2       ID3       ID4
      2.27394534E-10    2           11       -11                       # HA0    -->  E-     E+                 
      9.60100624E-06    2           13       -13                       # HA0    -->  MU-    MU+                
      2.74975784E-03    2           15       -15                       # HA0    -->  TAU-   TAU+               
      2.81028576E-07    2            1        -1                       # HA0    -->  DN     DB                 
      1.13549773E-04    2            3        -3                       # HA0    -->  ST     SB                 
      1.79555826E-02    2            5        -5                       # HA0    -->  BT     BB                 
      1.11012355E-09    2            2        -2                       # HA0    -->  UP     UB                 
      1.76240901E-05    2            4        -4                       # HA0    -->  CH     CB                 
      5.40637851E-01    2            6        -6                       # HA0    -->  TP     TB                 
      1.58923854E-06    2           22        22                       # HA0    -->  GM     GM                 
      5.81850763E-04    2           21        21                       # HA0    -->  GL     GL                 
      3.15842628E-02    2      1000022   1000022                       # HA0    -->  Z1SS   Z1SS               
      8.75681043E-02    2      1000022   1000023                       # HA0    -->  Z1SS   Z2SS               
      2.86898389E-03    2      1000022   1000025                       # HA0    -->  Z1SS   Z3SS               
      6.73352135E-03    2      1000022   1000035                       # HA0    -->  Z1SS   Z4SS               
      6.04415014E-02    2      1000023   1000023                       # HA0    -->  Z2SS   Z2SS               
      2.43619695E-01    2      1000024  -1000024                       # HA0    -->  W1SS+  W1SS-              
      5.11622662E-03    2           25        23                       # HA0    -->  HL0    Z0                 
#         PDG         Width
DECAY        37  1.75072110E+00   # H+    decays
#          BR          NDA       ID1       ID2       ID3       ID4
      3.44501427E-10    2           12       -11                       # H+     -->  NUE    E+                 
      1.45454705E-05    2           14       -13                       # H+     -->  NUM    MU+                
      4.16587712E-03    2           16       -15                       # H+     -->  NUT    TAU+               
      3.89451230E-07    2            2        -1                       # H+     -->  UP     DB                 
      1.80975723E-04    2            4        -3                       # H+     -->  CH     SB                 
      8.43930542E-01    2            6        -5                       # H+     -->  TP     BB                 
      1.28988817E-01    2      1000024   1000022                       # H+     -->  W1SS+  Z1SS               
      9.64249671E-03    2      1000024   1000023                       # H+     -->  W1SS+  Z2SS               
      4.42750566E-03    2      1000037   1000022                       # H+     -->  W2SS+  Z1SS               
      8.64887610E-03    2           25        24                       # H+     -->  HL0    W+                 
