#  ISAJET SUSY parameters in SUSY Les Houches Accord 2 format
#  Created by ISALHA 2.0 Last revision: C. Balazs 21 Apr 2009
Block SPINFO   # Program information
     1   ISASUGRA from ISAJET          # Spectrum Calculator
     2   7.80   29-OCT-2009 12:50:36   # Version number
Block MODSEL   # Model selection
     1     1   # Minimal supergravity (mSUGRA) model               
Block SMINPUTS   # Standard Model inputs
     1     1.27845505E+02   # alpha_em^(-1)
     2     1.16570000E-05   # G_Fermi
     3     1.17200002E-01   # alpha_s(M_Z)
     4     9.11699982E+01   # m_{Z}(pole)
     5     4.19999981E+00   # m_{b}(m_{b})
     6     1.72500000E+02   # m_{top}(pole)
     7     1.77699995E+00   # m_{tau}(pole)
Block MINPAR   # SUSY breaking input parameters
     1     1.00000000E+03   # m_0
     2     1.90000000E+02   # m_{1/2}
     3     4.00000000E+01   # tan(beta)
     4     1.00000000E+00   # sign(mu)
     5    -5.00000000E+02   # A_0
Block EXTPAR   # Non-universal SUSY breaking parameters
     0     2.52626862E+16   # Input scale
Block MASS   # Scalar and gaugino mass spectrum
#  PDG code   mass                 particle
        24     8.04229965E+01   #  W^+
        25     1.11984093E+02   #  h^0            
        35     7.24273865E+02   #  H^0            
        36     7.19526978E+02   #  A^0            
        37     7.29485107E+02   #  H^+            
   1000001     1.07374304E+03   #  dnl            
   1000002     1.07070032E+03   #  upl            
   1000003     1.07374304E+03   #  stl            
   1000004     1.07070117E+03   #  chl            
   1000005     7.97270447E+02   #  b1             
   1000006     6.34829529E+02   #  t1             
   1000011     1.00662903E+03   #  el-            
   1000012     1.00345197E+03   #  nuel           
   1000013     1.00662903E+03   #  mul-           
   1000014     1.00345197E+03   #  numl           
   1000015     8.23582397E+02   #  tau1           
   1000016     9.19965149E+02   #  nutl           
   1000021     5.27540833E+02   #  glss           
   1000022     7.72575912E+01   #  z1ss           
   1000023     1.45769440E+02   #  z2ss           
   1000024     1.46419998E+02   #  w1ss           
   1000025    -3.45289978E+02   #  z3ss           
   1000035     3.58572388E+02   #  z4ss           
   1000037     3.59686981E+02   #  w2ss           
   2000001     1.07092859E+03   #  dnr            
   2000002     1.07004065E+03   #  upr            
   2000003     1.07092859E+03   #  str            
   2000004     1.07004150E+03   #  chr            
   2000005     9.23581909E+02   #  b2             
   2000006     8.23291992E+02   #  t2             
   2000011     1.00220062E+03   #  er-            
   2000013     1.00220062E+03   #  mur-           
   2000015     9.25098450E+02   #  tau2           
Block ALPHA   # Effective Higgs mixing parameter
         -2.56519262E-02   # alpha
Block STOPMIX   # stop mixing matrix
  1  1     2.59409159E-01   # O_{11}
  1  2     9.65767503E-01   # O_{12}
  2  1    -9.65767503E-01   # O_{21}
  2  2     2.59409159E-01   # O_{22}
Block SBOTMIX   # sbottom mixing matrix
  1  1     9.86885488E-01   # O_{11}
  1  2     1.61422044E-01   # O_{12}
  2  1    -1.61422044E-01   # O_{21}
  2  2     9.86885488E-01   # O_{22}
Block STAUMIX   # stau mixing matrix
  1  1     1.51749343E-01   # O_{11}
  1  2     9.88418996E-01   # O_{12}
  2  1    -9.88418996E-01   # O_{21}
  2  2     1.51749343E-01   # O_{22}
Block NMIX   # neutralino mixing matrix
  1  1    -9.87790406E-01   #
  1  2     4.23919633E-02   #
  1  3    -1.45444512E-01   #
  1  4     3.63197103E-02   #
  2  1     8.41043293E-02   #
  2  2     9.53372657E-01   #
  2  3    -2.62791842E-01   #
  2  4     1.22259341E-01   #
  3  1    -7.13516027E-02   #
  3  2     1.06242679E-01   #
  3  3     6.92776442E-01   #
  3  4     7.09705412E-01   #
  4  1    -1.10026173E-01   #
  4  2     2.79277384E-01   #
  4  3     6.55626774E-01   #
  4  4    -6.92857563E-01   #
Block UMIX   # chargino U mixing matrix
  1  1    -9.27392364E-01   # U_{11}
  1  2     3.74090046E-01   # U_{12}
  2  1    -3.74090046E-01   # U_{21}
  2  2    -9.27392364E-01   # U_{22}
Block VMIX   # chargino V mixing matrix
  1  1    -9.84869599E-01   # V_{11}
  1  2     1.73297033E-01   # V_{12}
  2  1    -1.73297033E-01   # V_{21}
  2  2    -9.84869599E-01   # V_{22}
Block GAUGE Q=  6.95447571E+02   #
     1     3.57491910E-01   # g`
     2     6.52477562E-01   # g_2
     3     1.22057855E+00   # g_3
Block YU Q=  6.95447571E+02   #
  3  3     8.70615423E-01   # y_t
Block YD Q=  6.95447571E+02   #
  3  3     5.26809096E-01   # y_b
Block YE Q=  6.95447571E+02   #
  3  3     4.10463750E-01   # y_tau
Block HMIX Q=  6.95447571E+02   # Higgs mixing parameters
     1     3.35119659E+02   # mu(Q)
     2     4.00000000E+01   # tan(beta)(M_GUT)
     3     2.50816223E+02   # Higgs vev at Q
     4     5.17719062E+05   # m_A^2(Q)
Block MSOFT Q=  6.95447571E+02   # DRbar SUSY breaking parameters
     1     7.90953751E+01   # M_1(Q)          
     2     1.48763351E+02   # M_2(Q)          
     3     4.56014465E+02   # M_3(Q)          
    31     1.00269238E+03   # MeL(Q)          
    32     1.00269238E+03   # MmuL(Q)         
    33     9.20626343E+02   # MtauL(Q)        
    34     1.00037244E+03   # MeR(Q)          
    35     1.00037244E+03   # MmuR(Q)         
    36     8.26171204E+02   # MtauR(Q)        
    41     1.04994226E+03   # MqL1(Q)         
    42     1.04994226E+03   # MqL2(Q)         
    43     7.81346375E+02   # MqL3(Q)         
    44     1.04853040E+03   # MuR(Q)          
    45     1.04853040E+03   # McR(Q)          
    46     6.18992188E+02   # MtR(Q)          
    47     1.04849768E+03   # MdR(Q)          
    48     1.04849768E+03   # MsR(Q)          
    49     9.06499146E+02   # MbR(Q)          
Block AU Q=  6.95447571E+02   #
  1  1    -4.86256226E+02   # A_u
  2  2    -4.86256226E+02   # A_c
  3  3    -4.86256226E+02   # A_t
Block AD Q=  6.95447571E+02   #
  1  1    -7.40726929E+02   # A_d
  2  2    -7.40726929E+02   # A_s
  3  3    -7.40726929E+02   # A_b
Block AE Q=  6.95447571E+02   #
  1  1    -4.05498077E+02   # A_e
  2  2    -4.05498077E+02   # A_mu
  3  3    -4.05498077E+02   # A_tau
#  ISAJET decay tables in SUSY Les Houches accord format
#  Created by ISALHD. Last revision: C. Balazs, 2005 May 25
Block DCINFO                           # Program information
     1   ISASUGRA from ISAJET          # Spectrum Calculator
     2   7.80   29-OCT-2009 12:50:36   # Version number
#         PDG         Width
DECAY         6  1.14680779E+00   # TP    decays
#          BR          NDA       ID1       ID2       ID3       ID4
      3.33333343E-01    3            2        -1         5             # TP     -->  UP     DB     BT          
      3.33333343E-01    3            4        -3         5             # TP     -->  CH     SB     BT          
      1.11111112E-01    3          -11        12         5             # TP     -->  E+     NUE    BT          
      1.11111112E-01    3          -13        14         5             # TP     -->  MU+    NUM    BT          
      1.11111112E-01    3          -15        16         5             # TP     -->  TAU+   NUT    BT          
#         PDG         Width
DECAY   1000021  1.96524244E-03   # GLSS  decays
#          BR          NDA       ID1       ID2       ID3       ID4
      7.74485096E-02    3      1000024         1        -2             # GLSS   -->  W1SS+  DN     UB          
      7.74485096E-02    3     -1000024         2        -1             # GLSS   -->  W1SS-  UP     DB          
      7.74483532E-02    3      1000024         3        -4             # GLSS   -->  W1SS+  ST     CB          
      7.74483532E-02    3     -1000024         4        -3             # GLSS   -->  W1SS-  CH     SB          
      7.57087767E-02    3      1000024         5        -6             # GLSS   -->  W1SS+  BT     TB          
      7.57087767E-02    3     -1000024         6        -5             # GLSS   -->  W1SS-  TP     BB          
      3.59641796E-04    3      1000037         1        -2             # GLSS   -->  W2SS+  DN     UB          
      3.59641796E-04    3     -1000037         2        -1             # GLSS   -->  W2SS-  UP     DB          
      3.59641446E-04    3      1000037         3        -4             # GLSS   -->  W2SS+  ST     CB          
      3.59641446E-04    3     -1000037         4        -3             # GLSS   -->  W2SS-  CH     SB          
      1.44876642E-04    2      1000022        21                       # GLSS   -->  Z1SS   GL                 
      3.07979025E-02    3      1000022         2        -2             # GLSS   -->  Z1SS   UP     UB          
      1.01861153E-02    3      1000022         1        -1             # GLSS   -->  Z1SS   DN     DB          
      1.01861153E-02    3      1000022         3        -3             # GLSS   -->  Z1SS   ST     SB          
      3.07977907E-02    3      1000022         4        -4             # GLSS   -->  Z1SS   CH     CB          
      3.91969271E-02    3      1000022         5        -5             # GLSS   -->  Z1SS   BT     BB          
      1.84677038E-02    3      1000022         6        -6             # GLSS   -->  Z1SS   TP     TB          
      3.91195342E-03    2      1000023        21                       # GLSS   -->  Z2SS   GL                 
      4.03017290E-02    3      1000023         2        -2             # GLSS   -->  Z2SS   UP     UB          
      3.71870808E-02    3      1000023         1        -1             # GLSS   -->  Z2SS   DN     DB          
      3.71870808E-02    3      1000023         3        -3             # GLSS   -->  Z2SS   ST     SB          
      4.03015837E-02    3      1000023         4        -4             # GLSS   -->  Z2SS   CH     CB          
      1.79904178E-01    3      1000023         5        -5             # GLSS   -->  Z2SS   BT     BB          
      3.89908120E-04    3      1000023         6        -6             # GLSS   -->  Z2SS   TP     TB          
      1.82910487E-02    2      1000025        21                       # GLSS   -->  Z3SS   GL                 
      1.32699652E-05    3      1000025         2        -2             # GLSS   -->  Z3SS   UP     UB          
      1.71045813E-05    3      1000025         1        -1             # GLSS   -->  Z3SS   DN     DB          
      1.71045813E-05    3      1000025         3        -3             # GLSS   -->  Z3SS   ST     SB          
      1.32699106E-05    3      1000025         4        -4             # GLSS   -->  Z3SS   CH     CB          
      1.36193065E-02    3      1000025         5        -5             # GLSS   -->  Z3SS   BT     BB          
      1.55722676E-02    2      1000035        21                       # GLSS   -->  Z4SS   GL                 
      1.75393405E-04    3      1000035         2        -2             # GLSS   -->  Z4SS   UP     UB          
      2.14435553E-04    3      1000035         1        -1             # GLSS   -->  Z4SS   DN     DB          
      2.14435553E-04    3      1000035         3        -3             # GLSS   -->  Z4SS   ST     SB          
      1.75392721E-04    3      1000035         4        -4             # GLSS   -->  Z4SS   CH     CB          
      1.00662429E-02    3      1000035         5        -5             # GLSS   -->  Z4SS   BT     BB          
#         PDG         Width
DECAY   1000002  5.05001602E+01   # UPL   decays
#          BR          NDA       ID1       ID2       ID3       ID4
      1.69606577E-03    2      1000022         2                       # UPL    -->  Z1SS   UP                 
      8.06841329E-02    2      1000023         2                       # UPL    -->  Z2SS   UP                 
      6.21957937E-04    2      1000025         2                       # UPL    -->  Z3SS   UP                 
      4.72349022E-03    2      1000035         2                       # UPL    -->  Z4SS   UP                 
      7.41339505E-01    2      1000021         2                       # UPL    -->  GLSS   UP                 
      1.66716054E-01    2      1000024         1                       # UPL    -->  W1SS+  DN                 
      4.21881629E-03    2      1000037         1                       # UPL    -->  W2SS+  DN                 
#         PDG         Width
DECAY   1000001  5.05805817E+01   # DNL   decays
#          BR          NDA       ID1       ID2       ID3       ID4
      4.41203732E-03    2      1000022         1                       # DNL    -->  Z1SS   DN                 
      7.57431611E-02    2      1000023         1                       # DNL    -->  Z2SS   DN                 
      1.02259556E-03    2      1000025         1                       # DNL    -->  Z3SS   DN                 
      6.32454036E-03    2      1000035         1                       # DNL    -->  Z4SS   DN                 
      7.44744778E-01    2      1000021         1                       # DNL    -->  GLSS   DN                 
      1.48041025E-01    2     -1000024         2                       # DNL    -->  W1SS-  UP                 
      1.97118372E-02    2     -1000037         2                       # DNL    -->  W2SS-  UP                 
#         PDG         Width
DECAY   1000003  5.05805511E+01   # STL   decays
#          BR          NDA       ID1       ID2       ID3       ID4
      4.41204011E-03    2      1000022         3                       # STL    -->  Z1SS   ST                 
      7.57432058E-02    2      1000023         3                       # STL    -->  Z2SS   ST                 
      1.02259626E-03    2      1000025         3                       # STL    -->  Z3SS   ST                 
      6.32454408E-03    2      1000035         3                       # STL    -->  Z4SS   ST                 
      7.44745255E-01    2      1000021         3                       # STL    -->  GLSS   ST                 
      1.48040622E-01    2     -1000024         4                       # STL    -->  W1SS-  CH                 
      1.97117664E-02    2     -1000037         4                       # STL    -->  W2SS-  CH                 
#         PDG         Width
DECAY   1000004  5.05000191E+01   # CHL   decays
#          BR          NDA       ID1       ID2       ID3       ID4
      1.69606670E-03    2      1000022         4                       # CHL    -->  Z1SS   CH                 
      8.06841701E-02    2      1000023         4                       # CHL    -->  Z2SS   CH                 
      6.21957995E-04    2      1000025         4                       # CHL    -->  Z3SS   CH                 
      4.72349022E-03    2      1000035         4                       # CHL    -->  Z4SS   CH                 
      7.41338789E-01    2      1000021         4                       # CHL    -->  GLSS   CH                 
      1.66716695E-01    2      1000024         3                       # CHL    -->  W1SS+  ST                 
      4.21883352E-03    2      1000037         3                       # CHL    -->  W2SS+  ST                 
#         PDG         Width
DECAY   1000005  3.49624481E+01   # BT1   decays
#          BR          NDA       ID1       ID2       ID3       ID4
      1.04488228E-02    2      1000022         5                       # BT1    -->  Z1SS   BT                 
      9.27094743E-02    2      1000023         5                       # BT1    -->  Z2SS   BT                 
      3.86684574E-02    2      1000025         5                       # BT1    -->  Z3SS   BT                 
      3.51092555E-02    2      1000035         5                       # BT1    -->  Z4SS   BT                 
      4.55093503E-01    2      1000021         5                       # BT1    -->  GLSS   BT                 
      1.52517751E-01    2     -1000024         6                       # BT1    -->  W1SS-  TP                 
      1.95669070E-01    2     -1000037         6                       # BT1    -->  W2SS-  TP                 
      1.97836719E-02    2          -24   1000006                       # BT1    -->  W-     TP1                
#         PDG         Width
DECAY   1000006  9.58347511E+00   # TP1   decays
#          BR          NDA       ID1       ID2       ID3       ID4
      1.18141331E-01    2      1000022         6                       # TP1    -->  Z1SS   TP                 
      4.69290428E-02    2      1000023         6                       # TP1    -->  Z2SS   TP                 
      2.29384378E-01    2      1000025         6                       # TP1    -->  Z3SS   TP                 
      1.02803044E-01    2      1000035         6                       # TP1    -->  Z4SS   TP                 
      1.16580755E-01    2      1000024         5                       # TP1    -->  W1SS+  BT                 
      3.86161447E-01    2      1000037         5                       # TP1    -->  W2SS+  BT                 
#         PDG         Width
DECAY   2000002  3.97725525E+01   # UPR   decays
#          BR          NDA       ID1       ID2       ID3       ID4
      5.87249994E-02    2      1000022         2                       # UPR    -->  Z1SS   UP                 
      4.14380251E-04    2      1000023         2                       # UPR    -->  Z2SS   UP                 
      2.48503464E-04    2      1000025         2                       # UPR    -->  Z3SS   UP                 
      5.80182008E-04    2      1000035         2                       # UPR    -->  Z4SS   UP                 
      9.40031946E-01    2      1000021         2                       # UPR    -->  GLSS   UP                 
#         PDG         Width
DECAY   2000001  3.80519447E+01   # DNR   decays
#          BR          NDA       ID1       ID2       ID3       ID4
      1.53580979E-02    2      1000022         1                       # DNR    -->  Z1SS   DN                 
      1.08375993E-04    2      1000023         1                       # DNR    -->  Z2SS   DN                 
      6.50139627E-05    2      1000025         1                       # DNR    -->  Z3SS   DN                 
      1.51793531E-04    2      1000035         1                       # DNR    -->  Z4SS   DN                 
      9.84316707E-01    2      1000021         1                       # DNR    -->  GLSS   DN                 
#         PDG         Width
DECAY   2000003  3.80519447E+01   # STR   decays
#          BR          NDA       ID1       ID2       ID3       ID4
      1.53580979E-02    2      1000022         3                       # STR    -->  Z1SS   ST                 
      1.08375993E-04    2      1000023         3                       # STR    -->  Z2SS   ST                 
      6.50139627E-05    2      1000025         3                       # STR    -->  Z3SS   ST                 
      1.51793531E-04    2      1000035         3                       # STR    -->  Z4SS   ST                 
      9.84316707E-01    2      1000021         3                       # STR    -->  GLSS   ST                 
#         PDG         Width
DECAY   2000004  3.97723999E+01   # CHR   decays
#          BR          NDA       ID1       ID2       ID3       ID4
      5.87250777E-02    2      1000022         4                       # CHR    -->  Z1SS   CH                 
      4.14380745E-04    2      1000023         4                       # CHR    -->  Z2SS   CH                 
      2.48503726E-04    2      1000025         4                       # CHR    -->  Z3SS   CH                 
      5.80182590E-04    2      1000035         4                       # CHR    -->  Z4SS   CH                 
      9.40031826E-01    2      1000021         4                       # CHR    -->  GLSS   CH                 
#         PDG         Width
DECAY   2000005  3.45570793E+01   # BT2   decays
#          BR          NDA       ID1       ID2       ID3       ID4
      1.39283603E-02    2      1000022         5                       # BT2    -->  Z1SS   BT                 
      2.96991854E-03    2      1000023         5                       # BT2    -->  Z2SS   BT                 
      5.57756908E-02    2      1000025         5                       # BT2    -->  Z3SS   BT                 
      5.30538186E-02    2      1000035         5                       # BT2    -->  Z4SS   BT                 
      7.48794734E-01    2      1000021         5                       # BT2    -->  GLSS   BT                 
      4.88459412E-03    2     -1000024         6                       # BT2    -->  W1SS-  TP                 
      1.09961525E-01    2     -1000037         6                       # BT2    -->  W2SS-  TP                 
      3.37030063E-03    2          -24   1000006                       # BT2    -->  W-     TP1                
      6.64112624E-04    2          -24   2000006                       # BT2    -->  W-     TP2                
      1.04202016E-03    2           23   1000005                       # BT2    -->  Z0     BT1                
      5.55498991E-03    2           25   1000005                       # BT2    -->  HL0    BT1                
#         PDG         Width
DECAY   2000006  3.07658005E+01   # TP2   decays
#          BR          NDA       ID1       ID2       ID3       ID4
      3.27203333E-01    2      1000021         6                       # TP2    -->  GLSS   TP                 
      1.85914129E-01    2      1000024         5                       # TP2    -->  W1SS+  BT                 
      1.16393954E-01    2      1000037         5                       # TP2    -->  W2SS+  BT                 
      1.66698843E-02    2           23   1000006                       # TP2    -->  Z0     TP1                
      2.32925620E-02    2           25   1000006                       # TP2    -->  HL0    TP1                
      3.66932969E-03    2      1000022         6                       # TP2    -->  Z1SS   TP                 
      7.59193227E-02    2      1000023         6                       # TP2    -->  Z2SS   TP                 
      1.02031492E-01    2      1000025         6                       # TP2    -->  Z3SS   TP                 
      1.48906052E-01    2      1000035         6                       # TP2    -->  Z4SS   TP                 
#         PDG         Width
DECAY   1000011  1.31624174E+01   # EL-   decays
#          BR          NDA       ID1       ID2       ID3       ID4
      7.96993151E-02    2      1000022        11                       # EL-    -->  Z1SS   E-                 
      3.08310956E-01    2      1000023        11                       # EL-    -->  Z2SS   E-                 
      1.12592313E-03    2      1000025        11                       # EL-    -->  Z3SS   E-                 
      1.17489956E-02    2      1000035        11                       # EL-    -->  Z4SS   E-                 
      5.30552804E-01    2     -1000024        12                       # EL-    -->  W1SS-  NUE                
      6.85619935E-02    2     -1000037        12                       # EL-    -->  W2SS-  NUE                
#         PDG         Width
DECAY   1000013  1.31624174E+01   # MUL-  decays
#          BR          NDA       ID1       ID2       ID3       ID4
      7.96993151E-02    2      1000022        13                       # MUL-   -->  Z1SS   MU-                
      3.08310956E-01    2      1000023        13                       # MUL-   -->  Z2SS   MU-                
      1.12592313E-03    2      1000025        13                       # MUL-   -->  Z3SS   MU-                
      1.17489956E-02    2      1000035        13                       # MUL-   -->  Z4SS   MU-                
      5.30552804E-01    2     -1000024        14                       # MUL-   -->  W1SS-  NUM                
      6.85619935E-02    2     -1000037        14                       # MUL-   -->  W2SS-  NUM                
#         PDG         Width
DECAY   1000015  8.26456928E+00   # TAU1- decays
#          BR          NDA       ID1       ID2       ID3       ID4
      4.93457556E-01    2      1000022        15                       # TAU1-  -->  Z1SS   TAU-               
      5.93222305E-02    2      1000023        15                       # TAU1-  -->  Z2SS   TAU-               
      1.03599653E-01    2      1000025        15                       # TAU1-  -->  Z3SS   TAU-               
      8.26512799E-02    2      1000035        15                       # TAU1-  -->  Z4SS   TAU-               
      1.10482104E-01    2     -1000024        16                       # TAU1-  -->  W1SS-  NUT                
      1.50487214E-01    2     -1000037        16                       # TAU1-  -->  W2SS-  NUT                
#         PDG         Width
DECAY   1000012  1.32425613E+01   # NUEL  decays
#          BR          NDA       ID1       ID2       ID3       ID4
      1.07977480E-01    2      1000022        12                       # NUEL   -->  Z1SS   NUE                
      2.51516432E-01    2      1000023        12                       # NUEL   -->  Z2SS   NUE                
      5.24511421E-03    2      1000025        12                       # NUEL   -->  Z3SS   NUE                
      2.80153770E-02    2      1000035        12                       # NUEL   -->  Z4SS   NUE                
      5.92694402E-01    2      1000024        11                       # NUEL   -->  W1SS+  E-                 
      1.45511562E-02    2      1000037        11                       # NUEL   -->  W2SS+  E-                 
#         PDG         Width
DECAY   1000014  1.32425613E+01   # NUML  decays
#          BR          NDA       ID1       ID2       ID3       ID4
      1.07977480E-01    2      1000022        14                       # NUML   -->  Z1SS   NUM                
      2.51516432E-01    2      1000023        14                       # NUML   -->  Z2SS   NUM                
      5.24511421E-03    2      1000025        14                       # NUML   -->  Z3SS   NUM                
      2.80153770E-02    2      1000035        14                       # NUML   -->  Z4SS   NUM                
      5.92694402E-01    2      1000024        13                       # NUML   -->  W1SS+  MU-                
      1.45511562E-02    2      1000037        13                       # NUML   -->  W2SS+  MU-                
#         PDG         Width
DECAY   1000016  1.43640251E+01   # NUTL  decays
#          BR          NDA       ID1       ID2       ID3       ID4
      9.10585001E-02    2      1000022        16                       # NUTL   -->  Z1SS   NUT                
      2.10851625E-01    2      1000023        16                       # NUTL   -->  Z2SS   NUT                
      4.21021413E-03    2      1000025        16                       # NUTL   -->  Z3SS   NUT                
      2.23821327E-02    2      1000035        16                       # NUTL   -->  Z4SS   NUT                
      5.25386274E-01    2      1000024        15                       # NUTL   -->  W1SS+  TAU-               
      1.45050034E-01    2      1000037        15                       # NUTL   -->  W2SS+  TAU-               
      1.06123940E-03    2           24   1000015                       # NUTL   -->  W+     TAU1-              
#         PDG         Width
DECAY   2000011  5.01642704E+00   # ER-   decays
#          BR          NDA       ID1       ID2       ID3       ID4
      9.79741573E-01    2      1000022        11                       # ER-    -->  Z1SS   E-                 
      6.88688783E-03    2      1000023        11                       # ER-    -->  Z2SS   E-                 
      4.01801709E-03    2      1000025        11                       # ER-    -->  Z3SS   E-                 
      9.35349241E-03    2      1000035        11                       # ER-    -->  Z4SS   E-                 
#         PDG         Width
DECAY   2000013  5.01642704E+00   # MUR-  decays
#          BR          NDA       ID1       ID2       ID3       ID4
      9.79741573E-01    2      1000022        13                       # MUR-   -->  Z1SS   MU-                
      6.88688783E-03    2      1000023        13                       # MUR-   -->  Z2SS   MU-                
      4.01801709E-03    2      1000025        13                       # MUR-   -->  Z3SS   MU-                
      9.35349241E-03    2      1000035        13                       # MUR-   -->  Z4SS   MU-                
#         PDG         Width
DECAY   2000015  1.40013380E+01   # TAU2- decays
#          BR          NDA       ID1       ID2       ID3       ID4
      7.29444474E-02    2      1000022        15                       # TAU2-  -->  Z1SS   TAU-               
      2.55857468E-01    2      1000023        15                       # TAU2-  -->  Z2SS   TAU-               
      8.56456235E-02    2      1000025        15                       # TAU2-  -->  Z3SS   TAU-               
      9.07504931E-02    2      1000035        15                       # TAU2-  -->  Z4SS   TAU-               
      4.10114765E-01    2     -1000024        16                       # TAU2-  -->  W1SS-  NUT                
      8.43700320E-02    2     -1000037        16                       # TAU2-  -->  W2SS-  NUT                
      3.17187398E-04    2           23   1000015                       # TAU2-  -->  Z0     TAU1-              
#         PDG         Width
DECAY   1000023  4.89171407E-06   # Z2SS  decays
#          BR          NDA       ID1       ID2       ID3       ID4
      1.89357449E-03    2      1000022        22                       # Z2SS   -->  Z1SS   GM                 
      1.22735128E-01    3      1000022         2        -2             # Z2SS   -->  Z1SS   UP     UB          
      1.60025015E-01    3      1000022         1        -1             # Z2SS   -->  Z1SS   DN     DB          
      1.60025015E-01    3      1000022         3        -3             # Z2SS   -->  Z1SS   ST     SB          
      1.22735098E-01    3      1000022         4        -4             # Z2SS   -->  Z1SS   CH     CB          
      1.67409942E-01    3      1000022         5        -5             # Z2SS   -->  Z1SS   BT     BB          
      2.92477682E-02    3      1000022        11       -11             # Z2SS   -->  Z1SS   E-     E+          
      2.92477682E-02    3      1000022        13       -13             # Z2SS   -->  Z1SS   MU-    MU+         
      2.97125112E-02    3      1000022        15       -15             # Z2SS   -->  Z1SS   TAU-   TAU+        
      5.95415682E-02    3      1000022        12       -12             # Z2SS   -->  Z1SS   NUE    ANUE        
      5.95415682E-02    3      1000022        14       -14             # Z2SS   -->  Z1SS   NUM    ANUM        
      5.78851365E-02    3      1000022        16       -16             # Z2SS   -->  Z1SS   NUT    ANUT        
#         PDG         Width
DECAY   1000025  1.75864184E+00   # Z3SS  decays
#          BR          NDA       ID1       ID2       ID3       ID4
      1.75820460E-08    2      1000022        22                       # Z3SS   -->  Z1SS   GM                 
      3.91070614E-07    2      1000023        22                       # Z3SS   -->  Z2SS   GM                 
      3.11091065E-01    2      1000024       -24                       # Z3SS   -->  W1SS+  W-                 
      3.11091065E-01    2     -1000024        24                       # Z3SS   -->  W1SS-  W+                 
      9.40202326E-02    2      1000022        23                       # Z3SS   -->  Z1SS   Z0                 
      2.28799537E-01    2      1000023        23                       # Z3SS   -->  Z2SS   Z0                 
      2.53065191E-09    3      1000022         2        -2             # Z3SS   -->  Z1SS   UP     UB          
      1.24906552E-09    3      1000022         1        -1             # Z3SS   -->  Z1SS   DN     DB          
      1.24906552E-09    3      1000022         3        -3             # Z3SS   -->  Z1SS   ST     SB          
      2.53064347E-09    3      1000022         4        -4             # Z3SS   -->  Z1SS   CH     CB          
      4.18806349E-06    3      1000022         5        -5             # Z3SS   -->  Z1SS   BT     BB          
      5.81942583E-09    3      1000022        11       -11             # Z3SS   -->  Z1SS   E-     E+          
      5.81942583E-09    3      1000022        13       -13             # Z3SS   -->  Z1SS   MU-    MU+         
      2.43434556E-06    3      1000022        15       -15             # Z3SS   -->  Z1SS   TAU-   TAU+        
      5.02046182E-09    3      1000022        12       -12             # Z3SS   -->  Z1SS   NUE    ANUE        
      5.02046182E-09    3      1000022        14       -14             # Z3SS   -->  Z1SS   NUM    ANUM        
      7.28110283E-09    3      1000022        16       -16             # Z3SS   -->  Z1SS   NUT    ANUT        
      4.37941461E-09    3      1000023         2        -2             # Z3SS   -->  Z2SS   UP     UB          
      6.64331523E-09    3      1000023         1        -1             # Z3SS   -->  Z2SS   DN     DB          
      6.64331523E-09    3      1000023         3        -3             # Z3SS   -->  Z2SS   ST     SB          
      4.37939907E-09    3      1000023         4        -4             # Z3SS   -->  Z2SS   CH     CB          
      5.76567390E-06    3      1000023         5        -5             # Z3SS   -->  Z2SS   BT     BB          
      1.05859876E-09    3      1000023        11       -11             # Z3SS   -->  Z2SS   E-     E+          
      1.05859876E-09    3      1000023        13       -13             # Z3SS   -->  Z2SS   MU-    MU+         
      8.95717847E-07    3      1000023        15       -15             # Z3SS   -->  Z2SS   TAU-   TAU+        
      4.11317114E-09    3      1000023        12       -12             # Z3SS   -->  Z2SS   NUE    ANUE        
      4.11317114E-09    3      1000023        14       -14             # Z3SS   -->  Z2SS   NUM    ANUM        
      5.99277028E-09    3      1000023        16       -16             # Z3SS   -->  Z2SS   NUT    ANUT        
      2.88477745E-02    2      1000022        25                       # Z3SS   -->  Z1SS   HL0                
      2.61366796E-02    2      1000023        25                       # Z3SS   -->  Z2SS   HL0                
#         PDG         Width
DECAY   1000035  1.94691539E+00   # Z4SS  decays
#          BR          NDA       ID1       ID2       ID3       ID4
      1.56233337E-08    2      1000022        22                       # Z4SS   -->  Z1SS   GM                 
      1.53352559E-07    2      1000023        22                       # Z4SS   -->  Z2SS   GM                 
      1.50459478E-09    2      1000025        22                       # Z4SS   -->  Z3SS   GM                 
      3.34454715E-01    2      1000024       -24                       # Z4SS   -->  W1SS+  W-                 
      3.34454715E-01    2     -1000024        24                       # Z4SS   -->  W1SS-  W+                 
      3.57040726E-02    2      1000022        23                       # Z4SS   -->  Z1SS   Z0                 
      4.09381315E-02    2      1000023        23                       # Z4SS   -->  Z2SS   Z0                 
      1.57018398E-08    3      1000022         2        -2             # Z4SS   -->  Z1SS   UP     UB          
      1.54615964E-08    3      1000022         1        -1             # Z4SS   -->  Z1SS   DN     DB          
      1.54615964E-08    3      1000022         3        -3             # Z4SS   -->  Z1SS   ST     SB          
      1.57017883E-08    3      1000022         4        -4             # Z4SS   -->  Z1SS   CH     CB          
      3.58685202E-06    3      1000022         5        -5             # Z4SS   -->  Z1SS   BT     BB          
      4.26703224E-08    3      1000022        11       -11             # Z4SS   -->  Z1SS   E-     E+          
      4.26703224E-08    3      1000022        13       -13             # Z4SS   -->  Z1SS   MU-    MU+         
      2.33366563E-06    3      1000022        15       -15             # Z4SS   -->  Z1SS   TAU-   TAU+        
      5.78417207E-08    3      1000022        12       -12             # Z4SS   -->  Z1SS   NUE    ANUE        
      5.78417207E-08    3      1000022        14       -14             # Z4SS   -->  Z1SS   NUM    ANUM        
      8.37434726E-08    3      1000022        16       -16             # Z4SS   -->  Z1SS   NUT    ANUT        
      1.00137818E-07    3      1000023         2        -2             # Z4SS   -->  Z2SS   UP     UB          
      1.23800504E-07    3      1000023         1        -1             # Z4SS   -->  Z2SS   DN     DB          
      1.23800504E-07    3      1000023         3        -3             # Z4SS   -->  Z2SS   ST     SB          
      1.00137456E-07    3      1000023         4        -4             # Z4SS   -->  Z2SS   CH     CB          
      5.85564976E-06    3      1000023         5        -5             # Z4SS   -->  Z2SS   BT     BB          
      3.30500498E-08    3      1000023        11       -11             # Z4SS   -->  Z2SS   E-     E+          
      3.30500498E-08    3      1000023        13       -13             # Z4SS   -->  Z2SS   MU-    MU+         
      8.44879821E-07    3      1000023        15       -15             # Z4SS   -->  Z2SS   TAU-   TAU+        
      6.63459687E-08    3      1000023        12       -12             # Z4SS   -->  Z2SS   NUE    ANUE        
      6.63459687E-08    3      1000023        14       -14             # Z4SS   -->  Z2SS   NUM    ANUM        
      9.65473888E-08    3      1000023        16       -16             # Z4SS   -->  Z2SS   NUT    ANUT        
      2.30341577E-08    3      1000025         2        -2             # Z4SS   -->  Z3SS   UP     UB          
      2.97308898E-08    3      1000025         1        -1             # Z4SS   -->  Z3SS   DN     DB          
      2.97308898E-08    3      1000025         3        -3             # Z4SS   -->  Z3SS   ST     SB          
      2.30341577E-08    3      1000025         4        -4             # Z4SS   -->  Z3SS   CH     CB          
      4.60781990E-09    3      1000025         5        -5             # Z4SS   -->  Z3SS   BT     BB          
      6.74331213E-09    3      1000025        11       -11             # Z4SS   -->  Z3SS   E-     E+          
      6.74331213E-09    3      1000025        13       -13             # Z4SS   -->  Z3SS   MU-    MU+         
      5.47322410E-09    3      1000025        15       -15             # Z4SS   -->  Z3SS   TAU-   TAU+        
      1.34020359E-08    3      1000025        12       -12             # Z4SS   -->  Z3SS   NUE    ANUE        
      1.34020359E-08    3      1000025        14       -14             # Z4SS   -->  Z3SS   NUM    ANUM        
      1.33997968E-08    3      1000025        16       -16             # Z4SS   -->  Z3SS   NUT    ANUT        
      7.29389042E-02    2      1000022        25                       # Z4SS   -->  Z1SS   HL0                
      1.81495339E-01    2      1000023        25                       # Z4SS   -->  Z2SS   HL0                
#         PDG         Width
DECAY   1000024  3.64684820E-05   # W1SS+ decays
#          BR          NDA       ID1       ID2       ID3       ID4
      3.36734027E-01    3      1000022         2        -1             # W1SS+  -->  Z1SS   UP     DB          
      3.36734027E-01    3      1000022         4        -3             # W1SS+  -->  Z1SS   CH     SB          
      1.08871982E-01    3      1000022       -11        12             # W1SS+  -->  Z1SS   E+     NUE         
      1.08871982E-01    3      1000022       -13        14             # W1SS+  -->  Z1SS   MU+    NUM         
      1.08787976E-01    3      1000022       -15        16             # W1SS+  -->  Z1SS   TAU+   NUT         
      1.72829562E-09    3      1000023       -11        12             # W1SS+  -->  Z2SS   E+     NUE         
      1.72829562E-09    3      1000023       -13        14             # W1SS+  -->  Z2SS   MU+    NUM         
#         PDG         Width
DECAY   1000037  1.76518154E+00   # W2SS+ decays
#          BR          NDA       ID1       ID2       ID3       ID4
      2.50052956E-08    3      1000022         2        -1             # W2SS+  -->  Z1SS   UP     DB          
      2.50052832E-08    3      1000022         4        -3             # W2SS+  -->  Z1SS   CH     SB          
      7.10126429E-08    3      1000022       -11        12             # W2SS+  -->  Z1SS   E+     NUE         
      7.10126429E-08    3      1000022       -13        14             # W2SS+  -->  Z1SS   MU+    NUM         
      2.43631666E-06    3      1000022       -15        16             # W2SS+  -->  Z1SS   TAU+   NUT         
      9.52444300E-02    2      1000022        24                       # W2SS+  -->  Z1SS   W+                 
      1.28296620E-07    3      1000023         2        -1             # W2SS+  -->  Z2SS   UP     DB          
      1.28296620E-07    3      1000023         4        -3             # W2SS+  -->  Z2SS   CH     SB          
      6.37403161E-08    3      1000023       -11        12             # W2SS+  -->  Z2SS   E+     NUE         
      6.37403161E-08    3      1000023       -13        14             # W2SS+  -->  Z2SS   MU+    NUM         
      1.60282389E-06    3      1000023       -15        16             # W2SS+  -->  Z2SS   TAU+   NUT         
      3.51146668E-01    2      1000023        24                       # W2SS+  -->  Z2SS   W+                 
      1.36557347E-07    3      1000025         2        -1             # W2SS+  -->  Z3SS   UP     DB          
      1.36557347E-07    3      1000025         4        -3             # W2SS+  -->  Z3SS   CH     SB          
      4.55106779E-08    3      1000025       -11        12             # W2SS+  -->  Z3SS   E+     NUE         
      4.55106779E-08    3      1000025       -13        14             # W2SS+  -->  Z3SS   MU+    NUM         
      4.57142839E-08    3      1000025       -15        16             # W2SS+  -->  Z3SS   TAU+   NUT         
      4.63962256E-13    3      1000035         2        -1             # W2SS+  -->  Z4SS   UP     DB          
      1.54659570E-13    3      1000035       -11        12             # W2SS+  -->  Z4SS   E+     NUE         
      1.54659570E-13    3      1000035       -13        14             # W2SS+  -->  Z4SS   MU+    NUM         
      3.07667196E-01    2      1000024        23                       # W2SS+  -->  W1SS+  Z0                 
      7.30664169E-08    3      1000024         1        -1             # W2SS+  -->  W1SS+  DN     DB          
      7.30661682E-08    3      1000024         3        -3             # W2SS+  -->  W1SS+  ST     SB          
      2.98267622E-07    3      1000024         2        -2             # W2SS+  -->  W1SS+  UP     UB          
      2.98267622E-07    3      1000024         4        -4             # W2SS+  -->  W1SS+  CH     CB          
      1.31049987E-07    3      1000024        12       -12             # W2SS+  -->  W1SS+  NUE    ANUE        
      1.31049987E-07    3      1000024        14       -14             # W2SS+  -->  W1SS+  NUM    ANUM        
      3.15505787E-07    3      1000024        16       -16             # W2SS+  -->  W1SS+  NUT    ANUT        
      3.21515081E-08    3      1000024        11       -11             # W2SS+  -->  W1SS+  E-     E+          
      3.21515081E-08    3      1000024        13       -13             # W2SS+  -->  W1SS+  MU-    MU+         
      4.68428389E-08    3      1000024        15       -15             # W2SS+  -->  W1SS+  TAU-   TAU+        
      2.45935425E-01    2      1000024        25                       # W2SS+  -->  W1SS+  HL0                
#         PDG         Width
DECAY        25  4.04763641E-03   # HL0   decays
#          BR          NDA       ID1       ID2       ID3       ID4
      4.95203611E-09    2           11       -11                       # HL0    -->  E-     E+                 
      2.09082791E-04    2           13       -13                       # HL0    -->  MU-    MU+                
      5.97943813E-02    2           15       -15                       # HL0    -->  TAU-   TAU+               
      6.21782328E-06    2            1        -1                       # HL0    -->  DN     DB                 
      2.51231180E-03    2            3        -3                       # HL0    -->  ST     SB                 
      8.26691091E-01    2            5        -5                       # HL0    -->  BT     BB                 
      1.88883450E-06    2            2        -2                       # HL0    -->  UP     UB                 
      3.57029326E-02    2            4        -4                       # HL0    -->  CH     CB                 
      1.66377542E-03    2           22        22                       # HL0    -->  GM     GM                 
      3.62874009E-02    2           21        21                       # HL0    -->  GL     GL                 
      1.94510503E-03    3           24        11       -12             # HL0    -->  W+     E-     ANUE        
      1.94510503E-03    3           24        13       -14             # HL0    -->  W+     MU-    ANUM        
      1.94510503E-03    3           24        15       -16             # HL0    -->  W+     TAU-   ANUT        
      5.83531568E-03    3           24        -2         1             # HL0    -->  W+     UB     DN          
      5.83531568E-03    3           24        -4         3             # HL0    -->  W+     CB     ST          
      1.94510503E-03    3          -24       -11        12             # HL0    -->  W-     E+     NUE         
      1.94510503E-03    3          -24       -13        14             # HL0    -->  W-     MU+    NUM         
      1.94510503E-03    3          -24       -15        16             # HL0    -->  W-     TAU+   NUT         
      5.83531568E-03    3          -24         2        -1             # HL0    -->  W-     UP     DB          
      5.83531568E-03    3          -24         4        -3             # HL0    -->  W-     CH     SB          
      1.44901132E-04    3           23        12       -12             # HL0    -->  Z0     NUE    ANUE        
      1.44901132E-04    3           23        14       -14             # HL0    -->  Z0     NUM    ANUM        
      1.44901132E-04    3           23        16       -16             # HL0    -->  Z0     NUT    ANUT        
      7.29272870E-05    3           23        11       -11             # HL0    -->  Z0     E-     E+          
      7.29272870E-05    3           23        13       -13             # HL0    -->  Z0     MU-    MU+         
      7.29272870E-05    3           23        15       -15             # HL0    -->  Z0     TAU-   TAU+        
      2.49842706E-04    3           23         2        -2             # HL0    -->  Z0     UP     UB          
      2.49842706E-04    3           23         4        -4             # HL0    -->  Z0     CH     CB          
      3.21858941E-04    3           23         1        -1             # HL0    -->  Z0     DN     DB          
      3.21858941E-04    3           23         3        -3             # HL0    -->  Z0     ST     SB          
      3.21858941E-04    3           23         5        -5             # HL0    -->  Z0     BT     BB          
#         PDG         Width
DECAY        35  2.12035618E+01   # HH0   decays
#          BR          NDA       ID1       ID2       ID3       ID4
      9.28736288E-09    2           11       -11                       # HH0    -->  E-     E+                 
      3.92129179E-04    2           13       -13                       # HH0    -->  MU-    MU+                
      1.12307757E-01    2           15       -15                       # HH0    -->  TAU-   TAU+               
      1.14091799E-05    2            1        -1                       # HH0    -->  DN     DB                 
      4.60988609E-03    2            3        -3                       # HH0    -->  ST     SB                 
      6.31535232E-01    2            5        -5                       # HH0    -->  BT     BB                 
      1.50200392E-12    2            2        -2                       # HH0    -->  UP     UB                 
      2.20054144E-08    2            4        -4                       # HH0    -->  CH     CB                 
      8.51897523E-04    2            6        -6                       # HH0    -->  TP     TB                 
      7.76588749E-08    2           22        22                       # HH0    -->  GM     GM                 
      8.12142662E-06    2           21        21                       # HH0    -->  GL     GL                 
      2.33827132E-06    2           24       -24                       # HH0    -->  W+     W-                 
      1.17519573E-06    2           23        23                       # HH0    -->  Z0     Z0                 
      1.91724417E-03    2      1000022   1000022                       # HH0    -->  Z1SS   Z1SS               
      9.87097062E-03    2      1000022   1000023                       # HH0    -->  Z1SS   Z2SS               
      1.46077871E-02    2      1000022   1000025                       # HH0    -->  Z1SS   Z3SS               
      7.09190452E-03    2      1000022   1000035                       # HH0    -->  Z1SS   Z4SS               
      1.22304950E-02    2      1000023   1000023                       # HH0    -->  Z2SS   Z2SS               
      3.45933847E-02    2      1000023   1000025                       # HH0    -->  Z2SS   Z3SS               
      1.22116692E-02    2      1000023   1000035                       # HH0    -->  Z2SS   Z4SS               
      8.42052905E-05    2      1000025   1000025                       # HH0    -->  Z3SS   Z3SS               
      3.78436735E-03    2      1000025   1000035                       # HH0    -->  Z3SS   Z4SS               
      3.70027519E-05    2      1000035   1000035                       # HH0    -->  Z4SS   Z4SS               
      2.91810632E-02    2      1000024  -1000024                       # HH0    -->  W1SS+  W1SS-              
      1.02960512E-05    2      1000037  -1000037                       # HH0    -->  W2SS+  W2SS-              
      6.23298623E-02    2      1000024  -1000037                       # HH0    -->  W1SS+  W2SS-              
      6.23298623E-02    2     -1000024   1000037                       # HH0    -->  W1SS-  W2SS+              
      6.65349820E-09    2           25        25                       # HH0    -->  HL0    HL0                
#         PDG         Width
DECAY        36  2.08913021E+01   # HA0   decays
#          BR          NDA       ID1       ID2       ID3       ID4
      9.36471345E-09    2           11       -11                       # HA0    -->  E-     E+                 
      3.95395036E-04    2           13       -13                       # HA0    -->  MU-    MU+                
      1.13245830E-01    2           15       -15                       # HA0    -->  TAU-   TAU+               
      1.15048715E-05    2            1        -1                       # HA0    -->  DN     DB                 
      4.64855041E-03    2            3        -3                       # HA0    -->  ST     SB                 
      6.36889458E-01    2            5        -5                       # HA0    -->  BT     BB                 
      1.43796509E-12    2            2        -2                       # HA0    -->  UP     UB                 
      2.10842295E-08    2            4        -4                       # HA0    -->  CH     CB                 
      1.02277717E-03    2            6        -6                       # HA0    -->  TP     TB                 
      3.74442699E-08    2           22        22                       # HA0    -->  GM     GM                 
      2.02689971E-05    2           21        21                       # HA0    -->  GL     GL                 
      2.07663933E-03    2      1000022   1000022                       # HA0    -->  Z1SS   Z1SS               
      1.12989889E-02    2      1000022   1000023                       # HA0    -->  Z1SS   Z2SS               
      9.96268168E-03    2      1000022   1000025                       # HA0    -->  Z1SS   Z3SS               
      1.06463861E-02    2      1000022   1000035                       # HA0    -->  Z1SS   Z4SS               
      1.54075697E-02    2      1000023   1000023                       # HA0    -->  Z2SS   Z2SS               
      1.78889446E-02    2      1000023   1000025                       # HA0    -->  Z2SS   Z3SS               
      2.43703350E-02    2      1000023   1000035                       # HA0    -->  Z2SS   Z4SS               
      7.84450502E-04    2      1000025   1000025                       # HA0    -->  Z3SS   Z3SS               
      1.38636038E-04    2      1000025   1000035                       # HA0    -->  Z3SS   Z4SS               
      1.23156048E-03    2      1000035   1000035                       # HA0    -->  Z4SS   Z4SS               
      3.67163643E-02    2      1000024  -1000024                       # HA0    -->  W1SS+  W1SS-              
      1.72545202E-04    2      1000037  -1000037                       # HA0    -->  W2SS+  W2SS-              
      5.65344617E-02    2      1000024  -1000037                       # HA0    -->  W1SS+  W2SS-              
      5.65344617E-02    2     -1000024   1000037                       # HA0    -->  W1SS-  W2SS+              
      2.23829647E-06    2           25        23                       # HA0    -->  HL0    Z0                 
#         PDG         Width
DECAY        37  1.87623062E+01   # H+    decays
#          BR          NDA       ID1       ID2       ID3       ID4
      1.05716582E-08    2           12       -11                       # H+     -->  NUE    E+                 
      4.46354446E-04    2           14       -13                       # H+     -->  NUM    MU+                
      1.27841249E-01    2           16       -15                       # H+     -->  NUT    TAU+               
      1.19040023E-05    2            2        -1                       # H+     -->  UP     DB                 
      4.80980705E-03    2            4        -3                       # H+     -->  CH     SB                 
      5.87921917E-01    2            6        -5                       # H+     -->  TP     BB                 
      2.10215412E-02    2      1000024   1000022                       # H+     -->  W1SS+  Z1SS               
      1.18228447E-04    2      1000024   1000023                       # H+     -->  W1SS+  Z2SS               
      7.56053701E-02    2      1000024   1000025                       # H+     -->  W1SS+  Z3SS               
      7.30221495E-02    2      1000024   1000035                       # H+     -->  W1SS+  Z4SS               
      1.36333397E-02    2      1000037   1000022                       # H+     -->  W2SS+  Z1SS               
      9.31179225E-02    2      1000037   1000023                       # H+     -->  W2SS+  Z2SS               
      2.14691623E-03    2      1000037   1000025                       # H+     -->  W2SS+  Z3SS               
      3.00594897E-04    2      1000037   1000035                       # H+     -->  W2SS+  Z4SS               
      2.60183674E-06    2           25        24                       # H+     -->  HL0    W+                 
