  65
  401    406.0777    0.17207E-24
  402    399.1911    0.16304E-24
  403    406.0778    0.17208E-24
  404    399.1936    0.16304E-24
  405    372.1722    0.26307E-24
  406    264.3533    0.44409E-24
  407    406.0777    0.17207E-24
  408    399.1911    0.16304E-24
  409    406.0778    0.17208E-24
  410    399.1936    0.16304E-24
  411    372.1722    0.26307E-24
  412    264.3533    0.44409E-24
  413    390.0470    0.32246E-23
  414    389.3010    0.80790E-24
  415    390.0470    0.32246E-23
  416    389.3036    0.80792E-24
  417    390.3353    0.17720E-23
  418    450.5311    0.15600E-24
  419    390.0470    0.32246E-23
  420    389.3010    0.80790E-24
  421    390.0470    0.32246E-23
  422    389.3036    0.80792E-24
  423    390.3353    0.17720E-23
  424    450.5311    0.15600E-24
  425    149.9963    0.13900E-23
  426    130.8319    0.18826E-23
  427    149.9964    0.13900E-23
  428    130.8319    0.18826E-23
  429    111.7891    0.25001E-23
  430    130.0249    0.19450E-23
  431    149.9963    0.13900E-23
  432    130.8319    0.18826E-23
  433    149.9964    0.13900E-23
  434    130.8319    0.18826E-23
  435    111.7891    0.25001E-23
  436    130.0249    0.19450E-23
  437    112.2833    0.24321E-23
  438      0.0000    0.10000E+31
  439    112.2833    0.24322E-23
  440      0.0000    0.10000E+31
  441    149.9873    0.14053E-23
  442      0.0000    0.10000E+31
  443    112.2833    0.24321E-23
  444      0.0000    0.10000E+31
  445    112.2833    0.24322E-23
  446      0.0000    0.10000E+31
  447    149.9873    0.14053E-23
  448      0.0000    0.10000E+31
  449    429.8331    0.21674E-24
  450     58.4447    0.10000E+31
  451    107.5606    0.27407E-19
  452   -265.4858    0.44719E-24
  453    300.4342    0.25906E-24
  454    103.9708    0.12798E-19
  455    295.1760    0.25990E-24
  456    103.9708    0.12798E-19
  457    295.1760    0.25990E-24
  203     92.8987    0.16264E-21
  204    318.8227    0.15013E-23
  205    311.7244    0.67338E-24
  206    323.5059    0.52773E-24
  207    323.5059    0.52773E-24
  458      0.0000    0.10000E+31
    6    172.5000    0.57395E-24
   12    172.5000    0.57395E-24
   6
   401  0.60563758E-01     0   450     1     0     0     0
   401  0.27440125E+00     0   451     1     0     0     0
   401  0.14722849E-02     0   452     1     0     0     0
   401  0.15742607E-01     0   453     1     0     0     0
   401  0.60251075E+00     0   456     2     0     0     0
   401  0.45309361E-01     0   457     2     0     0     0
   6
   402  0.36280762E-03     0   450     2     0     0     0
   402  0.32155707E+00     0   451     2     0     0     0
   402  0.79694885E-03     0   452     2     0     0     0
   402  0.10032946E-01     0   453     2     0     0     0
   402  0.64989084E+00     0   454     1     0     0     0
   402  0.17359382E-01     0   455     1     0     0     0
   6
   403  0.60564954E-01     0   450     3     0     0     0
   403  0.27440664E+00     0   451     3     0     0     0
   403  0.14723145E-02     0   452     3     0     0     0
   403  0.15742928E-01     0   453     3     0     0     0
   403  0.60250735E+00     0   456     4     0     0     0
   403  0.45305777E-01     0   457     4     0     0     0
   6
   404  0.36280177E-03     0   450     4     0     0     0
   404  0.32155147E+00     0   451     4     0     0     0
   404  0.79691183E-03     0   452     4     0     0     0
   404  0.10032126E-01     0   453     4     0     0     0
   404  0.64989668E+00     0   454     3     0     0     0
   404  0.17360032E-01     0   455     3     0     0     0
   6
   405  0.88239819E-01     0   450     5     0     0     0
   405  0.35646081E+00     0   451     5     0     0     0
   405  0.14789056E-02     0   452     5     0     0     0
   405  0.11636085E-01     0   453     5     0     0     0
   405  0.38213724E+00     0   456     6     0     0     0
   405  0.16004713E+00     0   199   406     0     0     0
   2
   406  0.64178139E-01     0   450     6     0     0     0
   406  0.93582189E+00     0   454     5     0     0     0
   6
   407  0.60563758E-01     0   450     7     0     0     0
   407  0.27440125E+00     0   451     7     0     0     0
   407  0.14722849E-02     0   452     7     0     0     0
   407  0.15742607E-01     0   453     7     0     0     0
   407  0.60251075E+00     0   454     8     0     0     0
   407  0.45309361E-01     0   455     8     0     0     0
   6
   408  0.36280762E-03     0   450     8     0     0     0
   408  0.32155707E+00     0   451     8     0     0     0
   408  0.79694885E-03     0   452     8     0     0     0
   408  0.10032946E-01     0   453     8     0     0     0
   408  0.64989084E+00     0   456     7     0     0     0
   408  0.17359382E-01     0   457     7     0     0     0
   6
   409  0.60564954E-01     0   450     9     0     0     0
   409  0.27440664E+00     0   451     9     0     0     0
   409  0.14723145E-02     0   452     9     0     0     0
   409  0.15742928E-01     0   453     9     0     0     0
   409  0.60250735E+00     0   454    10     0     0     0
   409  0.45305777E-01     0   455    10     0     0     0
   6
   410  0.36280177E-03     0   450    10     0     0     0
   410  0.32155147E+00     0   451    10     0     0     0
   410  0.79691183E-03     0   452    10     0     0     0
   410  0.10032126E-01     0   453    10     0     0     0
   410  0.64989668E+00     0   456     9     0     0     0
   410  0.17360032E-01     0   457     9     0     0     0
   6
   411  0.88239819E-01     0   450    11     0     0     0
   411  0.35646081E+00     0   451    11     0     0     0
   411  0.14789056E-02     0   452    11     0     0     0
   411  0.11636085E-01     0   453    11     0     0     0
   411  0.38213724E+00     0   454    12     0     0     0
   411  0.16004713E+00     0   198   412     0     0     0
   2
   412  0.64178139E-01     0   450    12     0     0     0
   412  0.93582189E+00     0   456    11     0     0     0
   4
   413  0.91890514E+00     0   450     1     0     0     0
   413  0.75733811E-01     0   451     1     0     0     0
   413  0.10998524E-02     0   452     1     0     0     0
   413  0.42612040E-02     0   453     1     0     0     0
   4
   414  0.91898632E+00     0   450     2     0     0     0
   414  0.75706020E-01     0   451     2     0     0     0
   414  0.10928699E-02     0   452     2     0     0     0
   414  0.42147646E-02     0   453     2     0     0     0
   4
   415  0.91890514E+00     0   450     3     0     0     0
   415  0.75733811E-01     0   451     3     0     0     0
   415  0.10998530E-02     0   452     3     0     0     0
   415  0.42612078E-02     0   453     3     0     0     0
   4
   416  0.91898680E+00     0   450     4     0     0     0
   416  0.75705945E-01     0   451     4     0     0     0
   416  0.10928308E-02     0   452     4     0     0     0
   416  0.42144153E-02     0   453     4     0     0     0
   6
   417  0.47996885E+00     0   450     5     0     0     0
   417  0.16782027E+00     0   451     5     0     0     0
   417  0.12348054E-01     0   452     5     0     0     0
   417  0.23891717E-01     0   453     5     0     0     0
   417  0.15174748E+00     0   456     6     0     0     0
   417  0.16422363E+00     0   199   406     0     0     0
   7
   418  0.18796721E+00     0   454     5     0     0     0
   418  0.33689409E+00     0   455     5     0     0     0
   418  0.30108580E+00     0   200   406     0     0     0
   418  0.40769693E-01     0   203   406     0     0     0
   418  0.17988369E-01     0   450     6     0     0     0
   418  0.99693745E-01     0   451     6     0     0     0
   418  0.15601078E-01     0   452     6     0     0     0
   4
   419  0.91890514E+00     0   450     7     0     0     0
   419  0.75733811E-01     0   451     7     0     0     0
   419  0.10998524E-02     0   452     7     0     0     0
   419  0.42612040E-02     0   453     7     0     0     0
   4
   420  0.91898632E+00     0   450     8     0     0     0
   420  0.75706020E-01     0   451     8     0     0     0
   420  0.10928699E-02     0   452     8     0     0     0
   420  0.42147646E-02     0   453     8     0     0     0
   4
   421  0.91890514E+00     0   450     9     0     0     0
   421  0.75733811E-01     0   451     9     0     0     0
   421  0.10998530E-02     0   452     9     0     0     0
   421  0.42612078E-02     0   453     9     0     0     0
   4
   422  0.91898680E+00     0   450    10     0     0     0
   422  0.75705945E-01     0   451    10     0     0     0
   422  0.10928308E-02     0   452    10     0     0     0
   422  0.42144153E-02     0   453    10     0     0     0
   6
   423  0.47996885E+00     0   450    11     0     0     0
   423  0.16782027E+00     0   451    11     0     0     0
   423  0.12348054E-01     0   452    11     0     0     0
   423  0.23891717E-01     0   453    11     0     0     0
   423  0.15174748E+00     0   454    12     0     0     0
   423  0.16422363E+00     0   198   412     0     0     0
   7
   424  0.18796721E+00     0   456    11     0     0     0
   424  0.33689409E+00     0   457    11     0     0     0
   424  0.30108580E+00     0   200   412     0     0     0
   424  0.40769693E-01     0   203   412     0     0     0
   424  0.17988369E-01     0   450    12     0     0     0
   424  0.99693745E-01     0   451    12     0     0     0
   424  0.15601078E-01     0   452    12     0     0     0
   3
   425  0.95535614E-01     0   450   121     0     0     0
   425  0.34874710E+00     0   451   121     0     0     0
   425  0.55571729E+00     0   456   122     0     0     0
   3
   426  0.52565306E+00     0   450   122     0     0     0
   426  0.90052135E-01     0   451   122     0     0     0
   426  0.38429478E+00     0   454   121     0     0     0
   3
   427  0.95535554E-01     0   450   123     0     0     0
   427  0.34874627E+00     0   451   123     0     0     0
   427  0.55571818E+00     0   456   124     0     0     0
   3
   428  0.52565497E+00     0   450   124     0     0     0
   428  0.90052456E-01     0   451   124     0     0     0
   428  0.38429254E+00     0   454   123     0     0     0
   3
   429  0.99671310E+00     0   450   125     0     0     0
   429  0.15742813E-02     0   451   125     0     0     0
   429  0.17126370E-02     0   456   126     0     0     0
   3
   430  0.53636223E+00     0   450   126     0     0     0
   430  0.87720394E-01     0   451   126     0     0     0
   430  0.37591740E+00     0   454   125     0     0     0
   3
   431  0.95535614E-01     0   450   127     0     0     0
   431  0.34874710E+00     0   451   127     0     0     0
   431  0.55571729E+00     0   454   128     0     0     0
   3
   432  0.52565306E+00     0   450   128     0     0     0
   432  0.90052135E-01     0   451   128     0     0     0
   432  0.38429478E+00     0   456   127     0     0     0
   3
   433  0.95535554E-01     0   450   129     0     0     0
   433  0.34874627E+00     0   451   129     0     0     0
   433  0.55571818E+00     0   454   130     0     0     0
   3
   434  0.52565497E+00     0   450   130     0     0     0
   434  0.90052456E-01     0   451   130     0     0     0
   434  0.38429254E+00     0   456   129     0     0     0
   3
   435  0.99671310E+00     0   450   131     0     0     0
   435  0.15742813E-02     0   451   131     0     0     0
   435  0.17126370E-02     0   454   132     0     0     0
   3
   436  0.53636223E+00     0   450   132     0     0     0
   436  0.87720394E-01     0   451   132     0     0     0
   436  0.37591740E+00     0   456   131     0     0     0
   2
   437  0.99882430E+00     0   450   121     0     0     0
   437  0.11756950E-02     0   451   121     0     0     0
   0
   2
   439  0.99882460E+00     0   450   123     0     0     0
   439  0.11754156E-02     0   451   123     0     0     0
   0
   3
   441  0.11590949E+00     0   450   125     0     0     0
   441  0.34112889E+00     0   451   125     0     0     0
   441  0.54296160E+00     0   456   126     0     0     0
   0
   2
   443  0.99882430E+00     0   450   127     0     0     0
   443  0.11756950E-02     0   451   127     0     0     0
   0
   2
   445  0.99882460E+00     0   450   129     0     0     0
   445  0.11754156E-02     0   451   129     0     0     0
   0
   3
   447  0.11590949E+00     0   450   131     0     0     0
   447  0.34112889E+00     0   451   131     0     0     0
   447  0.54296160E+00     0   454   132     0     0     0
   0
  26
   449  0.48380229E-03     0   454     5    12     0     0
   449  0.48380229E-03     0   456     6    11     0     0
   449  0.32175460E-04     0   450     6    12     0     0
   449  0.24193894E-04     0   451    13     0     0     0
   449  0.58665140E-04     0   452    13     0     0     0
   449  0.53420979E-04     0   453    13     0     0     0
   449  0.33729140E-01     0   408     2     0     0     0
   449  0.33729140E-01     0   402     8     0     0     0
   449  0.20610154E-01     0   407     1     0     0     0
   449  0.20610154E-01     0   401     7     0     0     0
   449  0.57616249E-01     0   420     2     0     0     0
   449  0.57616249E-01     0   414     8     0     0     0
   449  0.55616200E-01     0   419     1     0     0     0
   449  0.55616200E-01     0   413     7     0     0     0
   449  0.20609373E-01     0   409     3     0     0     0
   449  0.20609373E-01     0   403     9     0     0     0
   449  0.55615421E-01     0   421     3     0     0     0
   449  0.55615421E-01     0   415     9     0     0     0
   449  0.33693448E-01     0   410     4     0     0     0
   449  0.33693448E-01     0   404    10     0     0     0
   449  0.57580344E-01     0   422     4     0     0     0
   449  0.57580344E-01     0   416    10     0     0     0
   449  0.10644205E+00     0   411     5     0     0     0
   449  0.10644205E+00     0   405    11     0     0     0
   449  0.57919584E-01     0   423     5     0     0     0
   449  0.57919584E-01     0   417    11     0     0     0
   0
  22
   451  0.14235715E-03     0   450    59     0     0     0
   451  0.32055155E-04     0   456     2     7     0     0
   451  0.10685052E-04     0   456   122   127     0     0
   451  0.10685052E-04     0   456   124   129     0     0
   451  0.32055155E-04     0   454     1     8     0     0
   451  0.10685052E-04     0   454   121   128     0     0
   451  0.10685052E-04     0   454   123   130     0     0
   451  0.32055155E-04     0   456     4     9     0     0
   451  0.10685052E-04     0   456   126   131     0     0
   451  0.32055155E-04     0   454     3    10     0     0
   451  0.10685052E-04     0   454   125   132     0     0
   451  0.55331844E-02     0   450     2     8     0     0
   451  0.10638944E-01     0   450     1     7     0     0
   451  0.10638942E-01     0   450     3     9     0     0
   451  0.55331746E-02     0   450     4    10     0     0
   451  0.10904008E-01     0   450     5    11     0     0
   451  0.20475984E+00     0   450   121   127     0     0
   451  0.20475873E+00     0   450   123   129     0     0
   451  0.23682828E+00     0   450   125   131     0     0
   451  0.10151622E+00     0   450   122   128     0     0
   451  0.10151622E+00     0   450   124   130     0     0
   451  0.10703776E+00     0   450   126   132     0     0
  24
   452  0.30548751E+00     0   454   199     0     0     0
   452  0.30548751E+00     0   456   198     0     0     0
   452  0.17683868E+00     0   450   200     0     0     0
   452  0.15871122E+00     0   451   200     0     0     0
   452  0.15598471E-01     0   450   203     0     0     0
   452  0.66029574E-02     0   451   203     0     0     0
   452  0.56513329E-03     0   425   127     0     0     0
   452  0.56513329E-03     0   431   121     0     0     0
   452  0.56513282E-03     0   427   129     0     0     0
   452  0.56513282E-03     0   433   123     0     0     0
   452  0.10935110E-02     0   437   127     0     0     0
   452  0.10935110E-02     0   443   121     0     0     0
   452  0.10935105E-02     0   439   129     0     0     0
   452  0.10935105E-02     0   445   123     0     0     0
   452  0.12380580E-02     0   429   131     0     0     0
   452  0.12380580E-02     0   435   125     0     0     0
   452  0.13325701E-02     0   441   131     0     0     0
   452  0.13325701E-02     0   447   125     0     0     0
   452  0.32410915E-02     0   426   128     0     0     0
   452  0.32410915E-02     0   432   122     0     0     0
   452  0.32410915E-02     0   428   130     0     0     0
   452  0.32410915E-02     0   434   124     0     0     0
   452  0.32667127E-02     0   430   132     0     0     0
   452  0.32667127E-02     0   436   126     0     0     0
  25
   453  0.24879719E+00     0   454   199     0     0     0
   453  0.24879719E+00     0   456   198     0     0     0
   453  0.13643486E-01     0   450   200     0     0     0
   453  0.73922104E-02     0   451   200     0     0     0
   453  0.11047023E-04     0   451     5    11     0     0
   453  0.75893298E-01     0   450   203     0     0     0
   453  0.78256994E-01     0   451   203     0     0     0
   453  0.12749862E-01     0   425   127     0     0     0
   453  0.12749862E-01     0   431   121     0     0     0
   453  0.12749854E-01     0   427   129     0     0     0
   453  0.12749854E-01     0   433   123     0     0     0
   453  0.53096670E-02     0   437   127     0     0     0
   453  0.53096670E-02     0   443   121     0     0     0
   453  0.53096656E-02     0   439   129     0     0     0
   453  0.53096656E-02     0   445   123     0     0     0
   453  0.47835717E-02     0   429   131     0     0     0
   453  0.47835717E-02     0   435   125     0     0     0
   453  0.13599523E-01     0   441   131     0     0     0
   453  0.13599523E-01     0   447   125     0     0     0
   453  0.36297638E-01     0   426   128     0     0     0
   453  0.36297638E-01     0   432   122     0     0     0
   453  0.36297638E-01     0   428   130     0     0     0
   453  0.36297638E-01     0   434   124     0     0     0
   453  0.36506880E-01     0   430   132     0     0     0
   453  0.36506880E-01     0   436   126     0     0     0
   5
   454  0.23892231E+00     0   450     2     7     0     0
   454  0.23892231E+00     0   450     4     9     0     0
   454  0.17055544E+00     0   450   127   122     0     0
   454  0.17055544E+00     0   450   129   124     0     0
   454  0.18104450E+00     0   450   131   126     0     0
  14
   455  0.13473525E-01     0   450   198     0     0     0
   455  0.30332634E+00     0   451   198     0     0     0
   455  0.45921229E-01     0   406    11     0     0     0
   455  0.32159444E-01     0   426   127     0     0     0
   455  0.32159440E-01     0   428   129     0     0     0
   455  0.32822140E-01     0   430   131     0     0     0
   455  0.61530553E-01     0   431   122     0     0     0
   455  0.61530523E-01     0   433   124     0     0     0
   455  0.38122563E-03     0   435   126     0     0     0
   455  0.61759349E-01     0   447   126     0     0     0
   455  0.22300188E+00     0   454   200     0     0     0
   455  0.12868296E-04     0   454     2     8     0     0
   455  0.12868285E-04     0   454     4    10     0     0
   455  0.13190861E+00     0   454   203     0     0     0
   5
   456  0.23892231E+00     0   450     8     1     0     0
   456  0.23892231E+00     0   450    10     3     0     0
   456  0.17055544E+00     0   450   121   128     0     0
   456  0.17055544E+00     0   450   123   130     0     0
   456  0.18104450E+00     0   450   125   132     0     0
  14
   457  0.13473525E-01     0   450   199     0     0     0
   457  0.30332634E+00     0   451   199     0     0     0
   457  0.45921229E-01     0   412     5     0     0     0
   457  0.32159444E-01     0   432   121     0     0     0
   457  0.32159440E-01     0   434   123     0     0     0
   457  0.32822140E-01     0   436   125     0     0     0
   457  0.61530553E-01     0   425   128     0     0     0
   457  0.61530523E-01     0   427   130     0     0     0
   457  0.38122563E-03     0   429   132     0     0     0
   457  0.61759349E-01     0   441   132     0     0     0
   457  0.22300188E+00     0   456   200     0     0     0
   457  0.12868296E-04     0   456     8     2     0     0
   457  0.12868285E-04     0   456    10     4     0     0
   457  0.13190861E+00     0   456   203     0     0     0
  17
   203  0.21704777E-03     0   123   129     0     0     0
   203  0.62029857E-01     0   125   131     0     0     0
   203  0.26156262E-02     0     3     9     0     0     0
   203  0.88358849E+00     0     5    11     0     0     0
   203  0.29509310E-01     0     4    10     0     0     0
   203  0.89163438E-03     0    59    59     0     0     0
   203  0.20713180E-01     0    13    13     0     0     0
   203  0.24158755E-04     0   198   121   128     0     0
   203  0.24158755E-04     0   198   123   130     0     0
   203  0.24158755E-04     0   198   125   132     0     0
   203  0.72476265E-04     0   198     8     1     0     0
   203  0.72476265E-04     0   198    10     3     0     0
   203  0.24158755E-04     0   199   127   122     0     0
   203  0.24158755E-04     0   199   129   124     0     0
   203  0.24158755E-04     0   199   131   126     0     0
   203  0.72476265E-04     0   199     2     7     0     0
   203  0.72476265E-04     0   199     4     9     0     0
  25
   204  0.45301920E-04     0   123   129     0     0     0
   204  0.12972754E-01     0   125   131     0     0     0
   204  0.53684996E-03     0     3     9     0     0     0
   204  0.92047513E-01     0     5    11     0     0     0
   204  0.11665806E-03     0     4    10     0     0     0
   204  0.16126663E-04     0    59    59     0     0     0
   204  0.24996947E-02     0    13    13     0     0     0
   204  0.40792648E-01     0   198   199     0     0     0
   204  0.18868173E-01     0   200   200     0     0     0
   204  0.75994708E-01     0   450   450     0     0     0
   204  0.13620895E+00     0   450   451     0     0     0
   204  0.51936813E-01     0   451   451     0     0     0
   204  0.27312136E+00     0   454   456     0     0     0
   204  0.12828255E+00     0   203   203     0     0     0
   204  0.65588877E-02     0   425   431     0     0     0
   204  0.10304837E-01     0   437   443     0     0     0
   204  0.65585771E-02     0   427   433     0     0     0
   204  0.10304295E-01     0   439   445     0     0     0
   204  0.10368055E-01     0   429   435     0     0     0
   204  0.63835457E-02     0   441   447     0     0     0
   204  0.11792312E-04     0   429   447     0     0     0
   204  0.11792312E-04     0   441   435     0     0     0
   204  0.38524121E-01     0   426   432     0     0     0
   204  0.38524121E-01     0   428   434     0     0     0
   204  0.39009906E-01     0   430   436     0     0     0
  11
   205  0.20594278E-04     0   123   129     0     0     0
   205  0.58981348E-02     0   125   131     0     0     0
   205  0.24411592E-03     0     3     9     0     0     0
   205  0.41877225E-01     0     5    11     0     0     0
   205  0.38949885E-04     0     4    10     0     0     0
   205  0.57857169E-03     0    13    13     0     0     0
   205  0.86331077E-01     0   450   450     0     0     0
   205  0.20057029E+00     0   450   451     0     0     0
   205  0.11477832E+00     0   451   451     0     0     0
   205  0.53637838E+00     0   454   456     0     0     0
   205  0.13284354E-01     0   203   200     0     0     0
  11
   206  0.16749445E-04     0   124   129     0     0     0
   206  0.47970098E-02     0   126   131     0     0     0
   206  0.20913479E-03     0     4     9     0     0     0
   206  0.77787352E+00     0     6    11     0     0     0
   206  0.15293364E+00     0   454   450     0     0     0
   206  0.14739182E-01     0   454   451     0     0     0
   206  0.13124171E-01     0   203   198     0     0     0
   206  0.12037379E-01     0   431   426     0     0     0
   206  0.12037168E-01     0   433   428     0     0     0
   206  0.56308263E-03     0   435   430     0     0     0
   206  0.11669010E-01     0   447   430     0     0     0
  11
   207  0.16749445E-04     0   130   123     0     0     0
   207  0.47970098E-02     0   132   125     0     0     0
   207  0.20913479E-03     0    10     3     0     0     0
   207  0.77787352E+00     0    12     5     0     0     0
   207  0.15293364E+00     0   456   450     0     0     0
   207  0.14739182E-01     0   456   451     0     0     0
   207  0.13124171E-01     0   203   199     0     0     0
   207  0.12037379E-01     0   425   432     0     0     0
   207  0.12037168E-01     0   427   434     0     0     0
   207  0.56308263E-03     0   429   436     0     0     0
   207  0.11669010E-01     0   441   436     0     0     0
   0
   5
     6  0.33333334E+00   100     2     7     5     0     0
     6  0.33333334E+00   100     4     9     5     0     0
     6  0.11111111E+00   100   122   127     5     0     0
     6  0.11111111E+00   100   124   129     5     0     0
     6  0.11111111E+00   100   126   131     5     0     0
   5
    12  0.33333334E+00   100     8     1    11     0     0
    12  0.33333334E+00   100    10     3    11     0     0
    12  0.11111111E+00   100   128   121    11     0     0
    12  0.11111111E+00   100   130   123    11     0     0
    12  0.11111111E+00   100   132   125    11     0     0
      3.00000000     -0.37150636
      0.94364160     -0.20305283      0.23172320     -0.12089030
     -0.28661838     -0.89526284      0.28458557     -0.18805756
      0.05946122     -0.08935577     -0.69257915     -0.71331227
      0.15445006     -0.38638029     -0.62100714      0.66423327
     -0.94788325      0.31861788     -0.31861788     -0.94788325
     -0.87867612      0.47741830     -0.47741830     -0.87867612
     -0.92468679     -0.25057098     -1.41211164
   -313.56890869   -503.74124146   -109.08660126
    262.41372681
    T
