#  ISAJET SUSY parameters in SUSY Les Houches Accord 2 format
#  Created by ISALHA 2.0 Last revision: C. Balazs 21 Apr 2009
Block SPINFO   # Program information
     1   ISASUGRA from ISAJET          # Spectrum Calculator
     2   7.80   29-OCT-2009 12:50:36   # Version number
Block MODSEL   # Model selection
     1     1   # Minimal supergravity (mSUGRA) model               
Block SMINPUTS   # Standard Model inputs
     1     1.27839302E+02   # alpha_em^(-1)
     2     1.16570000E-05   # G_Fermi
     3     1.17200002E-01   # alpha_s(M_Z)
     4     9.11699982E+01   # m_{Z}(pole)
     5     4.19999981E+00   # m_{b}(m_{b})
     6     1.72500000E+02   # m_{top}(pole)
     7     1.77699995E+00   # m_{tau}(pole)
Block MINPAR   # SUSY breaking input parameters
     1     4.40000000E+02   # m_0
     2     1.60000000E+02   # m_{1/2}
     3     4.00000000E+01   # tan(beta)
     4     1.00000000E+00   # sign(mu)
     5    -5.00000000E+02   # A_0
Block EXTPAR   # Non-universal SUSY breaking parameters
     0     2.65811467E+16   # Input scale
Block MASS   # Scalar and gaugino mass spectrum
#  PDG code   mass                 particle
        24     8.04229965E+01   #  W^+
        25     1.10110245E+02   #  h^0            
        35     3.66352203E+02   #  H^0            
        36     3.64110107E+02   #  A^0            
        37     3.76367035E+02   #  H^+            
   1000001     5.72443481E+02   #  dnl            
   1000002     5.66728577E+02   #  upl            
   1000003     5.72443481E+02   #  stl            
   1000004     5.66730164E+02   #  chl            
   1000005     4.18332764E+02   #  b1             
   1000006     3.02112762E+02   #  t1             
   1000011     4.54203186E+02   #  el-            
   1000012     4.46936371E+02   #  nuel           
   1000013     4.54203186E+02   #  mul-           
   1000014     4.46936371E+02   #  numl           
   1000015     3.24564850E+02   #  tau1           
   1000016     3.98009094E+02   #  nutl           
   1000021     4.28767578E+02   #  glss           
   1000022     6.32643051E+01   #  z1ss           
   1000023     1.18762482E+02   #  z2ss           
   1000024     1.19035759E+02   #  w1ss           
   1000025    -3.20159546E+02   #  z3ss           
   1000035     3.33504364E+02   #  z4ss           
   1000037     3.34031097E+02   #  w2ss           
   2000001     5.63604004E+02   #  dnr            
   2000002     5.62349304E+02   #  upr            
   2000003     5.63604004E+02   #  str            
   2000004     5.62350952E+02   #  chr            
   2000005     4.97964508E+02   #  b2             
   2000006     4.98406342E+02   #  t2             
   2000011     4.45581543E+02   #  er-            
   2000013     4.45581604E+02   #  mur-           
   2000015     4.17346466E+02   #  tau2           
Block ALPHA   # Effective Higgs mixing parameter
         -2.52354220E-02   # alpha
Block STOPMIX   # stop mixing matrix
  1  1     5.33534944E-01   # O_{11}
  1  2     8.45777988E-01   # O_{12}
  2  1    -8.45777988E-01   # O_{21}
  2  2     5.33534944E-01   # O_{22}
Block SBOTMIX   # sbottom mixing matrix
  1  1     8.87705743E-01   # O_{11}
  1  2     4.60411191E-01   # O_{12}
  2  1    -4.60411191E-01   # O_{21}
  2  2     8.87705743E-01   # O_{22}
Block STAUMIX   # stau mixing matrix
  1  1     3.70656818E-01   # O_{11}
  1  2     9.28769886E-01   # O_{12}
  2  1    -9.28769886E-01   # O_{21}
  2  2     3.70656818E-01   # O_{22}
Block NMIX   # neutralino mixing matrix
  1  1     9.85835969E-01   #
  1  2    -4.75074053E-02   #
  1  3     1.56999767E-01   #
  1  4    -3.49529721E-02   #
  2  1    -9.25202146E-02   #
  2  2    -9.52649534E-01   #
  2  3     2.68493026E-01   #
  2  4    -1.08674698E-01   #
  3  1    -7.88736492E-02   #
  3  2     1.21166199E-01   #
  3  3     6.89855576E-01   #
  3  4     7.09363878E-01   #
  4  1    -1.15527295E-01   #
  4  2     2.74809927E-01   #
  4  3     6.53729439E-01   #
  4  4    -6.95536494E-01   #
Block UMIX   # chargino U mixing matrix
  1  1    -9.22019541E-01   # U_{11}
  1  2     3.87143344E-01   # U_{12}
  2  1    -3.87143344E-01   # U_{21}
  2  2    -9.22019541E-01   # U_{22}
Block VMIX   # chargino V mixing matrix
  1  1    -9.87354815E-01   # V_{11}
  1  2     1.58526018E-01   # V_{12}
  2  1    -1.58526018E-01   # V_{21}
  2  2    -9.87354815E-01   # V_{22}
Block GAUGE Q=  3.67441040E+02   #
     1     3.57506931E-01   # g`
     2     6.52454615E-01   # g_2
     3     1.22031426E+00   # g_3
Block YU Q=  3.67441040E+02   #
  3  3     8.84654999E-01   # y_t
Block YD Q=  3.67441040E+02   #
  3  3     5.06625533E-01   # y_b
Block YE Q=  3.67441040E+02   #
  3  3     4.16413426E-01   # y_tau
Block HMIX Q=  3.67441040E+02   # Higgs mixing parameters
     1     3.11971222E+02   # mu(Q)
     2     4.00000000E+01   # tan(beta)(M_GUT)
     3     2.50207703E+02   # Higgs vev at Q
     4     1.32576172E+05   # m_A^2(Q)
Block MSOFT Q=  3.67441040E+02   # DRbar SUSY breaking parameters
     1     6.51558533E+01   # M_1(Q)          
     2     1.23989319E+02   # M_2(Q)          
     3     3.87544952E+02   # M_3(Q)          
    31     4.50800385E+02   # MeL(Q)          
    32     4.50800385E+02   # MmuL(Q)         
    33     4.02939911E+02   # MtauL(Q)        
    34     4.43066071E+02   # MeR(Q)          
    35     4.43066071E+02   # MmuR(Q)         
    36     3.37261017E+02   # MtauR(Q)        
    41     5.49920532E+02   # MqL1(Q)         
    42     5.49920532E+02   # MqL2(Q)         
    43     4.14475311E+02   # MqL3(Q)         
    44     5.44047913E+02   # MuR(Q)          
    45     5.44047913E+02   # McR(Q)          
    46     3.25744202E+02   # MtR(Q)          
    47     5.43548889E+02   # MdR(Q)          
    48     5.43548889E+02   # MsR(Q)          
    49     4.69624939E+02   # MbR(Q)          
Block AU Q=  3.67441040E+02   #
  1  1    -4.53131805E+02   # A_u
  2  2    -4.53131805E+02   # A_c
  3  3    -4.53131805E+02   # A_t
Block AD Q=  3.67441040E+02   #
  1  1    -7.14808655E+02   # A_d
  2  2    -7.14808655E+02   # A_s
  3  3    -7.14808655E+02   # A_b
Block AE Q=  3.67441040E+02   #
  1  1    -3.99703491E+02   # A_e
  2  2    -3.99703491E+02   # A_mu
  3  3    -3.99703491E+02   # A_tau
#  ISAJET decay tables in SUSY Les Houches accord format
#  Created by ISALHD. Last revision: C. Balazs, 2005 May 25
Block DCINFO                           # Program information
     1   ISASUGRA from ISAJET          # Spectrum Calculator
     2   7.80   29-OCT-2009 12:50:36   # Version number
#         PDG         Width
DECAY         6  1.14680779E+00   # TP    decays
#          BR          NDA       ID1       ID2       ID3       ID4
      3.33333343E-01    3            2        -1         5             # TP     -->  UP     DB     BT          
      3.33333343E-01    3            4        -3         5             # TP     -->  CH     SB     BT          
      1.11111112E-01    3          -11        12         5             # TP     -->  E+     NUE    BT          
      1.11111112E-01    3          -13        14         5             # TP     -->  MU+    NUM    BT          
      1.11111112E-01    3          -15        16         5             # TP     -->  TAU+   NUT    BT          
#         PDG         Width
DECAY   1000021  2.12696306E-02   # GLSS  decays
#          BR          NDA       ID1       ID2       ID3       ID4
      4.89340015E-02    3      1000024         1        -2             # GLSS   -->  W1SS+  DN     UB          
      4.89340015E-02    3     -1000024         2        -1             # GLSS   -->  W1SS-  UP     DB          
      4.89335768E-02    3      1000024         3        -4             # GLSS   -->  W1SS+  ST     CB          
      4.89335768E-02    3     -1000024         4        -3             # GLSS   -->  W1SS-  CH     SB          
      6.32461021E-03    3      1000024         5        -6             # GLSS   -->  W1SS+  BT     TB          
      6.32461021E-03    3     -1000024         6        -5             # GLSS   -->  W1SS-  TP     BB          
      6.66941778E-05    3      1000037         1        -2             # GLSS   -->  W2SS+  DN     UB          
      6.66941778E-05    3     -1000037         2        -1             # GLSS   -->  W2SS-  UP     DB          
      6.66938504E-05    3      1000037         3        -4             # GLSS   -->  W2SS+  ST     CB          
      6.66938504E-05    3     -1000037         4        -3             # GLSS   -->  W2SS-  CH     SB          
      7.98213368E-05    2      1000022        21                       # GLSS   -->  Z1SS   GL                 
      1.97812188E-02    3      1000022         2        -2             # GLSS   -->  Z1SS   UP     UB          
      6.45994907E-03    3      1000022         1        -1             # GLSS   -->  Z1SS   DN     DB          
      6.45994907E-03    3      1000022         3        -3             # GLSS   -->  Z1SS   ST     SB          
      1.97808966E-02    3      1000022         4        -4             # GLSS   -->  Z1SS   CH     CB          
      4.36748331E-03    3      1000022         5        -5             # GLSS   -->  Z1SS   BT     BB          
      7.81536335E-04    3      1000022         6        -6             # GLSS   -->  Z1SS   TP     TB          
      7.48748484E-04    2      1000023        21                       # GLSS   -->  Z2SS   GL                 
      2.60832012E-02    3      1000023         2        -2             # GLSS   -->  Z2SS   UP     UB          
      2.28579938E-02    3      1000023         1        -1             # GLSS   -->  Z2SS   DN     DB          
      2.28579938E-02    3      1000023         3        -3             # GLSS   -->  Z2SS   ST     SB          
      2.60827802E-02    3      1000023         4        -4             # GLSS   -->  Z2SS   CH     CB          
      2.63373158E-03    3      1000023         5        -5             # GLSS   -->  Z2SS   BT     BB          
      2.08591926E-03    2      1000025        21                       # GLSS   -->  Z3SS   GL                 
      4.20095057E-06    3      1000025         2        -2             # GLSS   -->  Z3SS   UP     UB          
      5.04925765E-06    3      1000025         1        -1             # GLSS   -->  Z3SS   DN     DB          
      5.04925765E-06    3      1000025         3        -3             # GLSS   -->  Z3SS   ST     SB          
      4.20086099E-06    3      1000025         4        -4             # GLSS   -->  Z3SS   CH     CB          
      1.12568249E-03    3      1000025         5        -5             # GLSS   -->  Z3SS   BT     BB          
      2.44419347E-03    2      1000035        21                       # GLSS   -->  Z4SS   GL                 
      3.28811329E-05    3      1000035         2        -2             # GLSS   -->  Z4SS   UP     UB          
      3.80425263E-05    3      1000035         1        -1             # GLSS   -->  Z4SS   DN     DB          
      3.80425263E-05    3      1000035         3        -3             # GLSS   -->  Z4SS   ST     SB          
      3.28804454E-05    3      1000035         4        -4             # GLSS   -->  Z4SS   CH     CB          
      1.10813917E-03    3      1000035         5        -5             # GLSS   -->  Z4SS   BT     BB          
      3.12724620E-01    2     -1000005         5                       # GLSS   -->  BB1    BT                 
      3.12724620E-01    2      1000005        -5                       # GLSS   -->  BT1    BB                 
#         PDG         Width
DECAY   1000002  1.32272978E+01   # UPL   decays
#          BR          NDA       ID1       ID2       ID3       ID4
      3.11609497E-03    2      1000022         2                       # UPL    -->  Z1SS   UP                 
      1.54986754E-01    2      1000023         2                       # UPL    -->  Z2SS   UP                 
      9.52114991E-04    2      1000025         2                       # UPL    -->  Z3SS   UP                 
      4.95819654E-03    2      1000035         2                       # UPL    -->  Z4SS   UP                 
      5.10832608E-01    2      1000021         2                       # UPL    -->  GLSS   UP                 
      3.21293652E-01    2      1000024         1                       # UPL    -->  W1SS+  DN                 
      3.86053906E-03    2      1000037         1                       # UPL    -->  W2SS+  DN                 
#         PDG         Width
DECAY   1000001  1.34168367E+01   # DNL   decays
#          BR          NDA       ID1       ID2       ID3       ID4
      9.11895745E-03    2      1000022         1                       # DNL    -->  Z1SS   DN                 
      1.43996790E-01    2      1000023         1                       # DNL    -->  Z2SS   DN                 
      1.55985611E-03    2      1000025         1                       # DNL    -->  Z3SS   DN                 
      6.86524622E-03    2      1000035         1                       # DNL    -->  Z4SS   DN                 
      5.35525084E-01    2      1000021         1                       # DNL    -->  GLSS   DN                 
      2.79518425E-01    2     -1000024         2                       # DNL    -->  W1SS-  UP                 
      2.34156679E-02    2     -1000037         2                       # DNL    -->  W2SS-  UP                 
#         PDG         Width
DECAY   1000003  1.34167843E+01   # STL   decays
#          BR          NDA       ID1       ID2       ID3       ID4
      9.11899284E-03    2      1000022         3                       # STL    -->  Z1SS   ST                 
      1.43997341E-01    2      1000023         3                       # STL    -->  Z2SS   ST                 
      1.55986217E-03    2      1000025         3                       # STL    -->  Z3SS   ST                 
      6.86527323E-03    2      1000035         3                       # STL    -->  Z4SS   ST                 
      5.35527170E-01    2      1000021         3                       # STL    -->  GLSS   ST                 
      2.79516160E-01    2     -1000024         4                       # STL    -->  W1SS-  CH                 
      2.34151613E-02    2     -1000037         4                       # STL    -->  W2SS-  CH                 
#         PDG         Width
DECAY   1000004  1.32269926E+01   # CHL   decays
#          BR          NDA       ID1       ID2       ID3       ID4
      3.11613991E-03    2      1000022         4                       # CHL    -->  Z1SS   CH                 
      1.54988915E-01    2      1000023         4                       # CHL    -->  Z2SS   CH                 
      9.52121394E-04    2      1000025         4                       # CHL    -->  Z3SS   CH                 
      4.95822262E-03    2      1000035         4                       # CHL    -->  Z4SS   CH                 
      5.10821819E-01    2      1000021         4                       # CHL    -->  GLSS   CH                 
      3.21302146E-01    2      1000024         3                       # CHL    -->  W1SS+  ST                 
      3.86066246E-03    2      1000037         3                       # CHL    -->  W2SS+  ST                 
#         PDG         Width
DECAY   1000005  4.03451633E+00   # BT1   decays
#          BR          NDA       ID1       ID2       ID3       ID4
      7.57103413E-02    2      1000022         5                       # BT1    -->  Z1SS   BT                 
      3.66434127E-01    2      1000023         5                       # BT1    -->  Z2SS   BT                 
      3.79349887E-02    2      1000025         5                       # BT1    -->  Z3SS   BT                 
      2.24024784E-02    2      1000035         5                       # BT1    -->  Z4SS   BT                 
      3.90395552E-01    2     -1000024         6                       # BT1    -->  W1SS-  TP                 
      1.07122459E-01    2          -24   1000006                       # BT1    -->  W-     TP1                
#         PDG         Width
DECAY   1000006  1.22072124E+00   # TP1   decays
#          BR          NDA       ID1       ID2       ID3       ID4
      1.62842780E-01    2      1000022         6                       # TP1    -->  Z1SS   TP                 
      5.92546389E-02    2      1000023         6                       # TP1    -->  Z2SS   TP                 
      7.77902603E-01    2      1000024         5                       # TP1    -->  W1SS+  BT                 
#         PDG         Width
DECAY   2000002  7.65751266E+00   # UPR   decays
#          BR          NDA       ID1       ID2       ID3       ID4
      1.57282621E-01    2      1000022         2                       # UPR    -->  Z1SS   UP                 
      1.29711174E-03    2      1000023         2                       # UPR    -->  Z2SS   UP                 
      4.71762702E-04    2      1000025         2                       # UPR    -->  Z3SS   UP                 
      9.31185321E-04    2      1000035         2                       # UPR    -->  Z4SS   UP                 
      8.40017319E-01    2      1000021         2                       # UPR    -->  GLSS   UP                 
#         PDG         Width
DECAY   2000001  6.83207941E+00   # DNR   decays
#          BR          NDA       ID1       ID2       ID3       ID4
      4.41746414E-02    2      1000022         1                       # DNR    -->  Z1SS   DN                 
      3.64418520E-04    2      1000023         1                       # DNR    -->  Z2SS   DN                 
      1.33050649E-04    2      1000025         1                       # DNR    -->  Z3SS   DN                 
      2.62767775E-04    2      1000035         1                       # DNR    -->  Z4SS   DN                 
      9.55065131E-01    2      1000021         1                       # DNR    -->  GLSS   DN                 
#         PDG         Width
DECAY   2000003  6.83207941E+00   # STR   decays
#          BR          NDA       ID1       ID2       ID3       ID4
      4.41746414E-02    2      1000022         3                       # STR    -->  Z1SS   ST                 
      3.64418520E-04    2      1000023         3                       # STR    -->  Z2SS   ST                 
      1.33050649E-04    2      1000025         3                       # STR    -->  Z3SS   ST                 
      2.62767775E-04    2      1000035         3                       # STR    -->  Z4SS   ST                 
      9.55065131E-01    2      1000021         3                       # STR    -->  GLSS   ST                 
#         PDG         Width
DECAY   2000004  7.65720034E+00   # CHR   decays
#          BR          NDA       ID1       ID2       ID3       ID4
      1.57287672E-01    2      1000022         4                       # CHR    -->  Z1SS   CH                 
      1.29715283E-03    2      1000023         4                       # CHR    -->  Z2SS   CH                 
      4.71774052E-04    2      1000025         4                       # CHR    -->  Z3SS   CH                 
      9.31206276E-04    2      1000035         4                       # CHR    -->  Z4SS   CH                 
      8.40012193E-01    2      1000021         4                       # CHR    -->  GLSS   CH                 
#         PDG         Width
DECAY   2000005  4.26199865E+00   # BT2   decays
#          BR          NDA       ID1       ID2       ID3       ID4
      2.87027601E-02    2      1000022         5                       # BT2    -->  Z1SS   BT                 
      2.42810939E-02    2      1000023         5                       # BT2    -->  Z2SS   BT                 
      1.14425629E-01    2      1000025         5                       # BT2    -->  Z3SS   BT                 
      1.13020711E-01    2      1000035         5                       # BT2    -->  Z4SS   BT                 
      4.87068623E-01    2      1000021         5                       # BT2    -->  GLSS   BT                 
      1.81512125E-02    2     -1000024         6                       # BT2    -->  W1SS-  TP                 
      2.14350000E-01    2          -24   1000006                       # BT2    -->  W-     TP1                
#         PDG         Width
DECAY   2000006  6.36457777E+00   # TP2   decays
#          BR          NDA       ID1       ID2       ID3       ID4
      3.41838479E-01    2      1000024         5                       # TP2    -->  W1SS+  BT                 
      2.22214624E-01    2      1000037         5                       # TP2    -->  W2SS+  BT                 
      2.25148916E-01    2           23   1000006                       # TP2    -->  Z0     TP1                
      6.78005964E-02    2           25   1000006                       # TP2    -->  HL0    TP1                
      2.94507686E-02    2      1000022         6                       # TP2    -->  Z1SS   TP                 
      1.06816702E-01    2      1000023         6                       # TP2    -->  Z2SS   TP                 
      6.72987243E-03    2      1000025         6                       # TP2    -->  Z3SS   TP                 
#         PDG         Width
DECAY   1000011  5.08162594E+00   # EL-   decays
#          BR          NDA       ID1       ID2       ID3       ID4
      8.84045288E-02    2      1000022        11                       # EL-    -->  Z1SS   E-                 
      3.28838617E-01    2      1000023        11                       # EL-    -->  Z2SS   E-                 
      5.76730992E-04    2      1000025        11                       # EL-    -->  Z3SS   E-                 
      3.56820854E-03    2      1000035        11                       # EL-    -->  Z4SS   E-                 
      5.54835260E-01    2     -1000024        12                       # EL-    -->  W1SS-  NUE                
      2.37766281E-02    2     -1000037        12                       # EL-    -->  W2SS-  NUE                
#         PDG         Width
DECAY   1000013  5.08162546E+00   # MUL-  decays
#          BR          NDA       ID1       ID2       ID3       ID4
      8.84045288E-02    2      1000022        13                       # MUL-   -->  Z1SS   MU-                
      3.28838617E-01    2      1000023        13                       # MUL-   -->  Z2SS   MU-                
      5.76730876E-04    2      1000025        13                       # MUL-   -->  Z3SS   MU-                
      3.56820785E-03    2      1000035        13                       # MUL-   -->  Z4SS   MU-                
      5.54835320E-01    2     -1000024        14                       # MUL-   -->  W1SS-  NUM                
      2.37766299E-02    2     -1000037        14                       # MUL-   -->  W2SS-  NUM                
#         PDG         Width
DECAY   1000015  2.46140027E+00   # TAU1- decays
#          BR          NDA       ID1       ID2       ID3       ID4
      5.77873111E-01    2      1000022        15                       # TAU1-  -->  Z1SS   TAU-               
      1.49169222E-01    2      1000023        15                       # TAU1-  -->  Z2SS   TAU-               
      1.46272272E-04    2      1000025        15                       # TAU1-  -->  Z3SS   TAU-               
      2.72811413E-01    2     -1000024        16                       # TAU1-  -->  W1SS-  NUT                
#         PDG         Width
DECAY   1000012  5.18791246E+00   # NUEL  decays
#          BR          NDA       ID1       ID2       ID3       ID4
      1.20954454E-01    2      1000022        12                       # NUEL   -->  Z1SS   NUE                
      2.54729927E-01    2      1000023        12                       # NUEL   -->  Z2SS   NUE                
      2.32638768E-03    2      1000025        12                       # NUEL   -->  Z3SS   NUE                
      8.15179665E-03    2      1000035        12                       # NUEL   -->  Z4SS   NUE                
      6.10285997E-01    2      1000024        11                       # NUEL   -->  W1SS+  E-                 
      3.55146686E-03    2      1000037        11                       # NUEL   -->  W2SS+  E-                 
#         PDG         Width
DECAY   1000014  5.18791199E+00   # NUML  decays
#          BR          NDA       ID1       ID2       ID3       ID4
      1.20954469E-01    2      1000022        14                       # NUML   -->  Z1SS   NUM                
      2.54729956E-01    2      1000023        14                       # NUML   -->  Z2SS   NUM                
      2.32638791E-03    2      1000025        14                       # NUML   -->  Z3SS   NUM                
      8.15179758E-03    2      1000035        14                       # NUML   -->  Z4SS   NUM                
      6.10285938E-01    2      1000024        13                       # NUML   -->  W1SS+  MU-                
      3.55146569E-03    2      1000037        13                       # NUML   -->  W2SS+  MU-                
#         PDG         Width
DECAY   1000016  4.69494200E+00   # NUTL  decays
#          BR          NDA       ID1       ID2       ID3       ID4
      1.17756389E-01    2      1000022        16                       # NUTL   -->  Z1SS   NUT                
      2.40821302E-01    2      1000023        16                       # NUTL   -->  Z2SS   NUT                
      1.20306329E-03    2      1000025        16                       # NUTL   -->  Z3SS   NUT                
      3.62368533E-03    2      1000035        16                       # NUTL   -->  Z4SS   NUT                
      6.12577975E-01    2      1000024        15                       # NUTL   -->  W1SS+  TAU-               
      2.37472244E-02    2      1000037        15                       # NUTL   -->  W2SS+  TAU-               
      3.00236770E-05    3      1000015        16       -15             # NUTL   -->  TAU1-  NUT    TAU+        
      3.00236770E-05    3      1000015        12       -11             # NUTL   -->  TAU1-  NUE    E+          
      3.00236770E-05    3      1000015        14       -13             # NUTL   -->  TAU1-  NUM    MU+         
      9.00710365E-05    3      1000015         2        -1             # NUTL   -->  TAU1-  UP     DB          
      9.00710365E-05    3      1000015         4        -3             # NUTL   -->  TAU1-  CH     SB          
#         PDG         Width
DECAY   2000011  2.14058089E+00   # ER-   decays
#          BR          NDA       ID1       ID2       ID3       ID4
      9.87904668E-01    2      1000022        11                       # ER-    -->  Z1SS   E-                 
      7.82098342E-03    2      1000023        11                       # ER-    -->  Z2SS   E-                 
      1.54120603E-03    2      1000025        11                       # ER-    -->  Z3SS   E-                 
      2.73312698E-03    2      1000035        11                       # ER-    -->  Z4SS   E-                 
#         PDG         Width
DECAY   2000013  2.14058113E+00   # MUR-  decays
#          BR          NDA       ID1       ID2       ID3       ID4
      9.87904668E-01    2      1000022        13                       # MUR-   -->  Z1SS   MU-                
      7.82098342E-03    2      1000023        13                       # MUR-   -->  Z2SS   MU-                
      1.54120673E-03    2      1000025        13                       # MUR-   -->  Z3SS   MU-                
      2.73312791E-03    2      1000035        13                       # MUR-   -->  Z4SS   MU-                
#         PDG         Width
DECAY   2000015  3.86018085E+00   # TAU2- decays
#          BR          NDA       ID1       ID2       ID3       ID4
      1.45190150E-01    2      1000022        15                       # TAU2-  -->  Z1SS   TAU-               
      2.98627228E-01    2      1000023        15                       # TAU2-  -->  Z2SS   TAU-               
      3.57698053E-02    2      1000025        15                       # TAU2-  -->  Z3SS   TAU-               
      3.21732499E-02    2      1000035        15                       # TAU2-  -->  Z4SS   TAU-               
      4.48519975E-01    2     -1000024        16                       # TAU2-  -->  W1SS-  NUT                
      3.94358449E-02    2     -1000037        16                       # TAU2-  -->  W2SS-  NUT                
      2.83709087E-04    2           23   1000015                       # TAU2-  -->  Z0     TAU1-              
#         PDG         Width
DECAY   1000023  1.69060502E-06   # Z2SS  decays
#          BR          NDA       ID1       ID2       ID3       ID4
      1.15951349E-03    2      1000022        22                       # Z2SS   -->  Z1SS   GM                 
      1.29882440E-01    3      1000022         2        -2             # Z2SS   -->  Z1SS   UP     UB          
      1.74871847E-01    3      1000022         1        -1             # Z2SS   -->  Z1SS   DN     DB          
      1.74871847E-01    3      1000022         3        -3             # Z2SS   -->  Z1SS   ST     SB          
      1.29882336E-01    3      1000022         4        -4             # Z2SS   -->  Z1SS   CH     CB          
      2.45462522E-01    3      1000022         5        -5             # Z2SS   -->  Z1SS   BT     BB          
      1.24220541E-02    3      1000022        11       -11             # Z2SS   -->  Z1SS   E-     E+          
      1.24220559E-02    3      1000022        13       -13             # Z2SS   -->  Z1SS   MU-    MU+         
      4.93346341E-02    3      1000022        15       -15             # Z2SS   -->  Z1SS   TAU-   TAU+        
      2.57671978E-02    3      1000022        12       -12             # Z2SS   -->  Z1SS   NUE    ANUE        
      2.57671978E-02    3      1000022        14       -14             # Z2SS   -->  Z1SS   NUM    ANUM        
      1.81562547E-02    3      1000022        16       -16             # Z2SS   -->  Z1SS   NUT    ANUT        
#         PDG         Width
DECAY   1000025  1.69181824E+00   # Z3SS  decays
#          BR          NDA       ID1       ID2       ID3       ID4
      6.18683316E-07    2      1000022        22                       # Z3SS   -->  Z1SS   GM                 
      1.03090208E-07    2      1000023        22                       # Z3SS   -->  Z2SS   GM                 
      3.18194509E-01    2      1000024       -24                       # Z3SS   -->  W1SS+  W-                 
      3.18194509E-01    2     -1000024        24                       # Z3SS   -->  W1SS-  W+                 
      8.88236836E-02    2      1000022        23                       # Z3SS   -->  Z1SS   Z0                 
      2.12617725E-01    2      1000023        23                       # Z3SS   -->  Z2SS   Z0                 
      4.10895495E-08    3      1000022         2        -2             # Z3SS   -->  Z1SS   UP     UB          
      2.09169428E-08    3      1000022         1        -1             # Z3SS   -->  Z1SS   DN     DB          
      2.09169428E-08    3      1000022         3        -3             # Z3SS   -->  Z1SS   ST     SB          
      4.10889740E-08    3      1000022         4        -4             # Z3SS   -->  Z1SS   CH     CB          
      7.14581329E-05    3      1000022         5        -5             # Z3SS   -->  Z1SS   BT     BB          
      2.38365715E-07    3      1000022        11       -11             # Z3SS   -->  Z1SS   E-     E+          
      2.38365516E-07    3      1000022        13       -13             # Z3SS   -->  Z1SS   MU-    MU+         
      1.87095269E-04    3      1000022        15       -15             # Z3SS   -->  Z1SS   TAU-   TAU+        
      2.16876586E-07    3      1000022        12       -12             # Z3SS   -->  Z1SS   NUE    ANUE        
      2.16876586E-07    3      1000022        14       -14             # Z3SS   -->  Z1SS   NUM    ANUM        
      4.34433758E-07    3      1000022        16       -16             # Z3SS   -->  Z1SS   NUT    ANUT        
      9.61963096E-08    3      1000023         2        -2             # Z3SS   -->  Z2SS   UP     UB          
      1.37509033E-07    3      1000023         1        -1             # Z3SS   -->  Z2SS   DN     DB          
      1.37509033E-07    3      1000023         3        -3             # Z3SS   -->  Z2SS   ST     SB          
      9.61949667E-08    3      1000023         4        -4             # Z3SS   -->  Z2SS   CH     CB          
      1.03629354E-04    3      1000023         5        -5             # Z3SS   -->  Z2SS   BT     BB          
      5.98555800E-08    3      1000023        11       -11             # Z3SS   -->  Z2SS   E-     E+          
      5.98555729E-08    3      1000023        13       -13             # Z3SS   -->  Z2SS   MU-    MU+         
      4.53878965E-05    3      1000023        15       -15             # Z3SS   -->  Z2SS   TAU-   TAU+        
      2.34094870E-07    3      1000023        12       -12             # Z3SS   -->  Z2SS   NUE    ANUE        
      2.34094870E-07    3      1000023        14       -14             # Z3SS   -->  Z2SS   NUM    ANUM        
      4.89809395E-07    3      1000023        16       -16             # Z3SS   -->  Z2SS   NUT    ANUT        
      2.98464019E-02    2      1000022        25                       # Z3SS   -->  Z1SS   HL0                
      3.19120027E-02    2      1000023        25                       # Z3SS   -->  Z2SS   HL0                
#         PDG         Width
DECAY   1000035  1.83178079E+00   # Z4SS  decays
#          BR          NDA       ID1       ID2       ID3       ID4
      9.92812943E-07    2      1000022        22                       # Z4SS   -->  Z1SS   GM                 
      1.35718238E-07    2      1000023        22                       # Z4SS   -->  Z2SS   GM                 
      4.69042805E-10    2      1000025        22                       # Z4SS   -->  Z3SS   GM                 
      3.31820965E-01    2      1000024       -24                       # Z4SS   -->  W1SS+  W-                 
      3.31820965E-01    2     -1000024        24                       # Z4SS   -->  W1SS-  W+                 
      3.90918776E-02    2      1000022        23                       # Z4SS   -->  Z1SS   Z0                 
      5.13828695E-02    2      1000023        23                       # Z4SS   -->  Z2SS   Z0                 
      2.09964099E-07    3      1000022         2        -2             # Z4SS   -->  Z1SS   UP     UB          
      1.91789141E-07    3      1000022         1        -1             # Z4SS   -->  Z1SS   DN     DB          
      1.91789141E-07    3      1000022         3        -3             # Z4SS   -->  Z1SS   ST     SB          
      2.09961215E-07    3      1000022         4        -4             # Z4SS   -->  Z1SS   CH     CB          
      6.76901036E-05    3      1000022         5        -5             # Z4SS   -->  Z1SS   BT     BB          
      1.36188385E-06    3      1000022        11       -11             # Z4SS   -->  Z1SS   E-     E+          
      1.36188328E-06    3      1000022        13       -13             # Z4SS   -->  Z1SS   MU-    MU+         
      1.70311378E-05    3      1000022        15       -15             # Z4SS   -->  Z1SS   TAU-   TAU+        
      1.85105989E-06    3      1000022        12       -12             # Z4SS   -->  Z1SS   NUE    ANUE        
      1.85105989E-06    3      1000022        14       -14             # Z4SS   -->  Z1SS   NUM    ANUM        
      3.68259498E-06    3      1000022        16       -16             # Z4SS   -->  Z1SS   NUT    ANUT        
      1.53257815E-06    3      1000023         2        -2             # Z4SS   -->  Z2SS   UP     UB          
      1.84973203E-06    3      1000023         1        -1             # Z4SS   -->  Z2SS   DN     DB          
      1.84973203E-06    3      1000023         3        -3             # Z4SS   -->  Z2SS   ST     SB          
      1.53255723E-06    3      1000023         4        -4             # Z4SS   -->  Z2SS   CH     CB          
      1.11496454E-04    3      1000023         5        -5             # Z4SS   -->  Z2SS   BT     BB          
      1.21217045E-06    3      1000023        11       -11             # Z4SS   -->  Z2SS   E-     E+          
      1.21217045E-06    3      1000023        13       -13             # Z4SS   -->  Z2SS   MU-    MU+         
      3.02116969E-05    3      1000023        15       -15             # Z4SS   -->  Z2SS   TAU-   TAU+        
      2.74090735E-06    3      1000023        12       -12             # Z4SS   -->  Z2SS   NUE    ANUE        
      2.74090735E-06    3      1000023        14       -14             # Z4SS   -->  Z2SS   NUM    ANUM        
      5.64688389E-06    3      1000023        16       -16             # Z4SS   -->  Z2SS   NUT    ANUT        
      2.48291894E-08    3      1000025         2        -2             # Z4SS   -->  Z3SS   UP     UB          
      3.21788960E-08    3      1000025         1        -1             # Z4SS   -->  Z3SS   DN     DB          
      3.21788960E-08    3      1000025         3        -3             # Z4SS   -->  Z3SS   ST     SB          
      2.48291894E-08    3      1000025         4        -4             # Z4SS   -->  Z3SS   CH     CB          
      5.48873746E-09    3      1000025         5        -5             # Z4SS   -->  Z3SS   BT     BB          
      7.30741778E-09    3      1000025        11       -11             # Z4SS   -->  Z3SS   E-     E+          
      7.30741778E-09    3      1000025        13       -13             # Z4SS   -->  Z3SS   MU-    MU+         
      6.45543885E-09    3      1000025        15       -15             # Z4SS   -->  Z3SS   TAU-   TAU+        
      1.43669574E-08    3      1000025        12       -12             # Z4SS   -->  Z3SS   NUE    ANUE        
      1.43669574E-08    3      1000025        14       -14             # Z4SS   -->  Z3SS   NUM    ANUM        
      1.42737218E-08    3      1000025        16       -16             # Z4SS   -->  Z3SS   NUT    ANUT        
      6.99059069E-02    2      1000022        25                       # Z4SS   -->  Z1SS   HL0                
      1.75184622E-01    2      1000023        25                       # Z4SS   -->  Z2SS   HL0                
      2.67012976E-04    2      1000015       -15                       # Z4SS   -->  TAU1-  TAU+               
      2.67012976E-04    2     -1000015        15                       # Z4SS   -->  TAU1+  TAU-               
#         PDG         Width
DECAY   1000024  1.08363056E-05   # W1SS+ decays
#          BR          NDA       ID1       ID2       ID3       ID4
      3.45093727E-01    3      1000022         2        -1             # W1SS+  -->  Z1SS   UP     DB          
      3.45093727E-01    3      1000022         4        -3             # W1SS+  -->  Z1SS   CH     SB          
      1.01551734E-01    3      1000022       -11        12             # W1SS+  -->  Z1SS   E+     NUE         
      1.01551734E-01    3      1000022       -13        14             # W1SS+  -->  Z1SS   MU+    NUM         
      1.06709123E-01    3      1000022       -15        16             # W1SS+  -->  Z1SS   TAU+   NUT         
      7.04757919E-11    3      1000023       -11        12             # W1SS+  -->  Z2SS   E+     NUE         
      7.04757919E-11    3      1000023       -13        14             # W1SS+  -->  Z2SS   MU+    NUM         
#         PDG         Width
DECAY   1000037  1.88433397E+00   # W2SS+ decays
#          BR          NDA       ID1       ID2       ID3       ID4
      2.87746957E-07    3      1000022         2        -1             # W2SS+  -->  Z1SS   UP     DB          
      2.87746559E-07    3      1000022         4        -3             # W2SS+  -->  Z1SS   CH     SB          
      1.86196166E-06    3      1000022       -11        12             # W2SS+  -->  Z1SS   E+     NUE         
      1.86196166E-06    3      1000022       -13        14             # W2SS+  -->  Z1SS   MU+    NUM         
      2.07404228E-05    3      1000022       -15        16             # W2SS+  -->  Z1SS   TAU+   NUT         
      8.14995319E-02    2      1000022        24                       # W2SS+  -->  Z1SS   W+                 
      1.95188977E-06    3      1000023         2        -1             # W2SS+  -->  Z2SS   UP     DB          
      1.95188841E-06    3      1000023         4        -3             # W2SS+  -->  Z2SS   CH     SB          
      2.58892760E-06    3      1000023       -11        12             # W2SS+  -->  Z2SS   E+     NUE         
      2.58892760E-06    3      1000023       -13        14             # W2SS+  -->  Z2SS   MU+    NUM         
      4.83467484E-05    3      1000023       -15        16             # W2SS+  -->  Z2SS   TAU+   NUT         
      3.27356189E-01    2      1000023        24                       # W2SS+  -->  Z2SS   W+                 
      1.06576536E-07    3      1000025         2        -1             # W2SS+  -->  Z3SS   UP     DB          
      1.06576536E-07    3      1000025         4        -3             # W2SS+  -->  Z3SS   CH     SB          
      3.54978340E-08    3      1000025       -11        12             # W2SS+  -->  Z3SS   E+     NUE         
      3.54978340E-08    3      1000025       -13        14             # W2SS+  -->  Z3SS   MU+    NUM         
      3.61132315E-08    3      1000025       -15        16             # W2SS+  -->  Z3SS   TAU+   NUT         
      4.48861605E-15    3      1000035       -11        12             # W2SS+  -->  Z4SS   E+     NUE         
      4.48861605E-15    3      1000035       -13        14             # W2SS+  -->  Z4SS   MU+    NUM         
      1.00275606E-01    2      1000006        -5                       # W2SS+  -->  TP1    BB                 
      3.85364780E-04    2     -1000015        16                       # W2SS+  -->  TAU1+  NUT                
      2.75366127E-01    2      1000024        23                       # W2SS+  -->  W1SS+  Z0                 
      8.84195970E-07    3      1000024         1        -1             # W2SS+  -->  W1SS+  DN     DB          
      8.84183635E-07    3      1000024         3        -3             # W2SS+  -->  W1SS+  ST     SB          
      4.37702056E-06    3      1000024         2        -2             # W2SS+  -->  W1SS+  UP     UB          
      4.37702056E-06    3      1000024         4        -4             # W2SS+  -->  W1SS+  CH     CB          
      4.96214489E-06    3      1000024        12       -12             # W2SS+  -->  W1SS+  NUE    ANUE        
      4.96214489E-06    3      1000024        14       -14             # W2SS+  -->  W1SS+  NUM    ANUM        
      1.04875392E-06    3      1000024        11       -11             # W2SS+  -->  W1SS+  E-     E+          
      1.04875392E-06    3      1000024        13       -13             # W2SS+  -->  W1SS+  MU-    MU+         
      2.20795073E-06    3      1000024        15       -15             # W2SS+  -->  W1SS+  TAU-   TAU+        
      2.15009674E-01    2      1000024        25                       # W2SS+  -->  W1SS+  HL0                
#         PDG         Width
DECAY        25  3.83717683E-03   # HL0   decays
#          BR          NDA       ID1       ID2       ID3       ID4
      4.97083175E-09    2           11       -11                       # HL0    -->  E-     E+                 
      2.09876365E-04    2           13       -13                       # HL0    -->  MU-    MU+                
      6.00182228E-02    2           15       -15                       # HL0    -->  TAU-   TAU+               
      6.24302584E-06    2            1        -1                       # HL0    -->  DN     DB                 
      2.52249488E-03    2            3        -3                       # HL0    -->  ST     SB                 
      8.32025051E-01    2            5        -5                       # HL0    -->  BT     BB                 
      1.95963730E-06    2            2        -2                       # HL0    -->  UP     UB                 
      3.71378623E-02    2            4        -4                       # HL0    -->  CH     CB                 
      1.61363429E-03    2           22        22                       # HL0    -->  GM     GM                 
      3.74102928E-02    2           21        21                       # HL0    -->  GL     GL                 
      1.53459678E-03    3           24        11       -12             # HL0    -->  W+     E-     ANUE        
      1.53459678E-03    3           24        13       -14             # HL0    -->  W+     MU-    ANUM        
      1.53459678E-03    3           24        15       -16             # HL0    -->  W+     TAU-   ANUT        
      4.60379012E-03    3           24        -2         1             # HL0    -->  W+     UB     DN          
      4.60379012E-03    3           24        -4         3             # HL0    -->  W+     CB     ST          
      1.53459678E-03    3          -24       -11        12             # HL0    -->  W-     E+     NUE         
      1.53459678E-03    3          -24       -13        14             # HL0    -->  W-     MU+    NUM         
      1.53459678E-03    3          -24       -15        16             # HL0    -->  W-     TAU+   NUT         
      4.60379012E-03    3          -24         2        -1             # HL0    -->  W-     UP     DB          
      4.60379012E-03    3          -24         4        -3             # HL0    -->  W-     CH     SB          
      9.79127362E-05    3           23        12       -12             # HL0    -->  Z0     NUE    ANUE        
      9.79127362E-05    3           23        14       -14             # HL0    -->  Z0     NUM    ANUM        
      9.79127362E-05    3           23        16       -16             # HL0    -->  Z0     NUT    ANUT        
      4.92785002E-05    3           23        11       -11             # HL0    -->  Z0     E-     E+          
      4.92785002E-05    3           23        13       -13             # HL0    -->  Z0     MU-    MU+         
      4.92785002E-05    3           23        15       -15             # HL0    -->  Z0     TAU-   TAU+        
      1.68823957E-04    3           23         2        -2             # HL0    -->  Z0     UP     UB          
      1.68823957E-04    3           23         4        -4             # HL0    -->  Z0     CH     CB          
      2.17486857E-04    3           23         1        -1             # HL0    -->  Z0     DN     DB          
      2.17486857E-04    3           23         3        -3             # HL0    -->  Z0     ST     SB          
      2.17486857E-04    3           23         5        -5             # HL0    -->  Z0     BT     BB          
#         PDG         Width
DECAY        35  7.93965101E+00   # HH0   decays
#          BR          NDA       ID1       ID2       ID3       ID4
      1.25459927E-08    2           11       -11                       # HH0    -->  E-     E+                 
      5.29714162E-04    2           13       -13                       # HH0    -->  MU-    MU+                
      1.51696920E-01    2           15       -15                       # HH0    -->  TAU-   TAU+               
      1.55124944E-05    2            1        -1                       # HH0    -->  DN     DB                 
      6.26783213E-03    2            3        -3                       # HH0    -->  ST     SB                 
      7.92956233E-01    2            5        -5                       # HH0    -->  BT     BB                 
      1.97639279E-12    2            2        -2                       # HH0    -->  UP     UB                 
      3.15692716E-08    2            4        -4                       # HH0    -->  CH     CB                 
      9.79243196E-05    2            6        -6                       # HH0    -->  TP     TB                 
      1.28734882E-07    2           22        22                       # HH0    -->  GM     GM                 
      3.68573928E-05    2           21        21                       # HH0    -->  GL     GL                 
      8.75398385E-08    2           24       -24                       # HH0    -->  W+     W-                 
      4.14649080E-08    2           23        23                       # HH0    -->  Z0     Z0                 
      2.71617458E-03    2      1000022   1000022                       # HH0    -->  Z1SS   Z1SS               
      1.10914810E-02    2      1000022   1000023                       # HH0    -->  Z1SS   Z2SS               
      9.83935036E-03    2      1000023   1000023                       # HH0    -->  Z2SS   Z2SS               
      2.44279318E-02    2      1000024  -1000024                       # HH0    -->  W1SS+  W1SS-              
      3.23696528E-04    2           25        25                       # HH0    -->  HL0    HL0                
#         PDG         Width
DECAY        36  8.14358044E+00   # HA0   decays
#          BR          NDA       ID1       ID2       ID3       ID4
      1.21571073E-08    2           11       -11                       # HA0    -->  E-     E+                 
      5.13294886E-04    2           13       -13                       # HA0    -->  MU-    MU+                
      1.47008553E-01    2           15       -15                       # HA0    -->  TAU-   TAU+               
      1.50325995E-05    2            1        -1                       # HA0    -->  DN     DB                 
      6.07393170E-03    2            3        -3                       # HA0    -->  ST     SB                 
      7.68721461E-01    2            5        -5                       # HA0    -->  BT     BB                 
      1.87888702E-12    2            2        -2                       # HA0    -->  UP     UB                 
      3.00366736E-08    2            4        -4                       # HA0    -->  CH     CB                 
      7.60094728E-04    2            6        -6                       # HA0    -->  TP     TB                 
      4.77570268E-08    2           22        22                       # HA0    -->  GM     GM                 
      5.13102532E-05    2           21        21                       # HA0    -->  GL     GL                 
      3.05350544E-03    2      1000022   1000022                       # HA0    -->  Z1SS   Z1SS               
      1.43616470E-02    2      1000022   1000023                       # HA0    -->  Z1SS   Z2SS               
      1.70546696E-02    2      1000023   1000023                       # HA0    -->  Z2SS   Z2SS               
      4.23862264E-02    2      1000024  -1000024                       # HA0    -->  W1SS+  W1SS-              
      6.52089724E-08    2           25        23                       # HA0    -->  HL0    Z0                 
#         PDG         Width
DECAY        37  5.14828014E+00   # H+    decays
#          BR          NDA       ID1       ID2       ID3       ID4
      1.98775254E-08    2           12       -11                       # H+     -->  NUE    E+                 
      8.39264831E-04    2           14       -13                       # H+     -->  NUM    MU+                
      2.40367636E-01    2           16       -15                       # H+     -->  NUT    TAU+               
      2.23826864E-05    2            2        -1                       # H+     -->  UP     DB                 
      9.04354360E-03    2            4        -3                       # H+     -->  CH     SB                 
      7.12981701E-01    2            6        -5                       # H+     -->  TP     BB                 
      3.64633240E-02    2      1000024   1000022                       # H+     -->  W1SS+  Z1SS               
      2.82036577E-04    2      1000024   1000023                       # H+     -->  W1SS+  Z2SS               
      1.23961797E-07    2           25        24                       # H+     -->  HL0    W+                 
