#  ISAJET SUSY parameters in Les Houches accord format
#  Created by ISALHA3. Last revision by C. Balazs on 2005 Jan. 10
Block SPINFO   # Program information
     1   ISASUGRA from ISAJET          # Spectrum Calculator
     2   7.79   16-DEC-2008 15:42:00   # Version number
Block MODSEL   # Model selection
     1     1   # Minimal supergravity (mSUGRA,CMSSM) model         
Block SMINPUTS   # Standard Model inputs
     1     1.27835777E+02   # alpha_em^(-1)
     2     1.16570000E-05   # G_Fermi
     3     1.17200002E-01   # alpha_s(M_Z)
     4     9.11699982E+01   # m_{Z}(pole)
     5     4.19999981E+00   # m_{b}(m_{b})
     6     1.72500000E+02   # m_{top}(pole)
     7     1.77699995E+00   # m_{tau}(pole)
Block MINPAR   # SUSY breaking input parameters
     1     2.80000000E+02   # m_0
     2     1.75000000E+02   # m_{1/2}
     3     3.00000000E+00   # tan(beta)
     4     1.00000000E+00   # sign(mu)
     5     0.00000000E+00   # A_0
#  
#  M_{GUT} =   0.26084266E+17
Block MASS   # Scalar and gaugino mass spectrum
#  PDG code   mass                 particle
        24     8.04229965E+01   #  W^+
        25     9.39386978E+01   #  h^0            
        35     4.53745087E+02   #  H^0            
        36     4.47352295E+02   #  A^0            
        37     4.57141449E+02   #  H^+            
   1000001     4.91481140E+02   #  dnl            
   1000002     4.86051849E+02   #  upl            
   1000003     4.91481171E+02   #  stl            
   1000004     4.86053772E+02   #  chl            
   1000005     4.35360718E+02   #  b1             
   1000006     3.15540100E+02   #  t1             
   1000011     3.06120758E+02   #  el-            
   1000012     2.97239349E+02   #  nuel           
   1000013     3.06120758E+02   #  mul-           
   1000014     2.97239349E+02   #  numl           
   1000015     2.88824402E+02   #  tau1           
   1000016     2.97031158E+02   #  nutl           
   1000021     4.52871613E+02   #  glss           
   1000022     6.28971329E+01   #  z1ss           
   1000023     1.16028740E+02   #  z2ss           
   1000024     1.13667130E+02   #  w1ss           
   1000025    -3.02664917E+02   #  z3ss           
   1000035     3.32952301E+02   #  z4ss           
   1000037     3.28256378E+02   #  w2ss           
   2000001     4.78762817E+02   #  dnr            
   2000002     4.78162262E+02   #  upr            
   2000003     4.78762878E+02   #  str            
   2000004     4.78164246E+02   #  chr            
   2000005     4.77415741E+02   #  b2             
   2000006     4.96204315E+02   #  t2             
   2000011     2.89552094E+02   #  er-            
   2000013     2.89552124E+02   #  mur-           
   2000015     3.06419678E+02   #  tau2           
#  Higgs mixing
Block ALPHA   # Effective Higgs mixing parameter
         -3.45494866E-01   # alpha
Block STOPMIX   # stop mixing matrix
  1  1     5.29051900E-01   # O_{11}
  1  2    -8.48589480E-01   # O_{12}
  2  1     8.48589480E-01   # O_{21}
  2  2     5.29051900E-01   # O_{22}
Block SBOTMIX   # sbottom mixing matrix
  1  1     9.95744407E-01   # O_{11}
  1  2    -9.21578184E-02   # O_{12}
  2  1     9.21578184E-02   # O_{21}
  2  2     9.95744407E-01   # O_{22}
Block STAUMIX   # stau mixing matrix
  1  1     1.73293427E-01   # O_{11}
  1  2    -9.84870255E-01   # O_{12}
  2  1     9.84870255E-01   # O_{21}
  2  2     1.73293427E-01   # O_{22}
Block NMIX   # neutralino mixing matrix
  1  1     9.62072670E-01   #
  1  2    -1.64537147E-01   #
  1  3     1.93706259E-01   #
  1  4    -9.91040021E-02   #
  2  1    -2.28119761E-01   #
  2  2    -9.21935737E-01   #
  2  3     2.63099402E-01   #
  2  4    -1.69630811E-01   #
  3  1     5.29056415E-02   #
  3  2    -8.05540010E-02   #
  3  3    -6.95485830E-01   #
  3  4    -7.12047160E-01   #
  4  1     1.39923438E-01   #
  4  2    -3.41281414E-01   #
  4  3    -6.39965475E-01   #
  4  4     6.74086154E-01   #
Block UMIX   # chargino U mixing matrix
  1  1    -9.06592488E-01   # U_{11}
  1  2     4.22007143E-01   # U_{12}
  2  1    -4.22007143E-01   # U_{21}
  2  2    -9.06592488E-01   # U_{22}
Block VMIX   # chargino V mixing matrix
  1  1    -9.61260557E-01   # V_{11}
  1  2     2.75641382E-01   # V_{12}
  2  1    -2.75641382E-01   # V_{21}
  2  2    -9.61260557E-01   # V_{22}
Block GAUGE Q=  3.69600830E+02   #
     1     3.57525736E-01   # g`
     2     6.52379334E-01   # g_2
     3     1.21911907E+00   # g_3
Block YU Q=  3.69600830E+02   #
  3  3     9.34123158E-01   # y_t
Block YD Q=  3.69600830E+02   #
  3  3     4.50112931E-02   # y_b
Block YE Q=  3.69600830E+02   #
  3  3     3.17283608E-02   # y_tau
Block HMIX Q=  3.69600830E+02   # Higgs mixing parameters
     1     2.99650970E+02   # mu(Q)
     2     3.00000000E+00   # tan(beta)(M_{GUT})
     3     2.50033310E+02   # Higgs vev at Q
     4     2.00124078E+05   # m_A^2(Q)
Block MSOFT Q=  3.69600830E+02   # DRbar SUSY breaking parameters
     1     7.04396210E+01   # M_1(Q)          
     2     1.33776016E+02   # M_2(Q)          
     3     4.17805939E+02   # M_3(Q)          
    31     3.02517059E+02   # MeL(Q)          
    32     3.02517059E+02   # MmuL(Q)         
    33     3.02314850E+02   # MtauL(Q)        
    34     2.86770996E+02   # MeR(Q)          
    35     2.86770996E+02   # MmuR(Q)         
    36     2.86494507E+02   # MtauR(Q)        
    41     4.66418365E+02   # MqL1(Q)         
    42     4.66418365E+02   # MqL2(Q)         
    43     4.12843170E+02   # MqL3(Q)         
    44     4.57151398E+02   # MuR(Q)          
    45     4.57151398E+02   # McR(Q)          
    46     3.30887817E+02   # MtR(Q)          
    47     4.56063599E+02   # MdR(Q)          
    48     4.56063599E+02   # MsR(Q)          
    49     4.59044586E+02   # MbR(Q)          
Block AU Q=  3.69600830E+02   #
  1  1    -3.17933258E+02   # A_u
  2  2    -3.17933258E+02   # A_c
  3  3    -3.17933258E+02   # A_t
Block AD Q=  3.69600830E+02   #
  1  1    -5.10598969E+02   # A_d
  2  2    -5.10598969E+02   # A_s
  3  3    -5.10598969E+02   # A_b
Block AE Q=  3.69600830E+02   #
  1  1    -1.11685623E+02   # A_e
  2  2    -1.11685623E+02   # A_mu
  3  3    -1.11685623E+02   # A_tau
#  ISAJET decay tables in SUSY Les Houches accord format
#  Created by ISALHD. Last revision: C. Balazs, 2005 May 25
Block DCINFO                           # Program information
     1   ISASUGRA from ISAJET          # Spectrum Calculator
     2   7.79   16-DEC-2008 15:42:00   # Version number
#         PDG         Width
DECAY         6  1.14680767E+00   # TP    decays
#          BR          NDA       ID1       ID2       ID3       ID4
      3.33333343E-01    3            2        -1         5             # TP     -->  UP     DB     BT          
      3.33333343E-01    3            4        -3         5             # TP     -->  CH     SB     BT          
      1.11111112E-01    3          -11        12         5             # TP     -->  E+     NUE    BT          
      1.11111112E-01    3          -13        14         5             # TP     -->  MU+    NUM    BT          
      1.11111112E-01    3          -15        16         5             # TP     -->  TAU+   NUT    BT          
#         PDG         Width
DECAY   1000021  9.33966488E-02   # GLSS  decays
#          BR          NDA       ID1       ID2       ID3       ID4
      4.83832210E-02    3      1000024         1        -2             # GLSS   -->  W1SS+  DN     UB          
      4.83832210E-02    3     -1000024         2        -1             # GLSS   -->  W1SS-  UP     DB          
      4.83822748E-02    3      1000024         3        -4             # GLSS   -->  W1SS+  ST     CB          
      4.83822748E-02    3     -1000024         4        -3             # GLSS   -->  W1SS-  CH     SB          
      4.27050795E-03    3      1000024         5        -6             # GLSS   -->  W1SS+  BT     TB          
      4.27050795E-03    3     -1000024         6        -5             # GLSS   -->  W1SS-  TP     BB          
      4.14466660E-04    3      1000037         1        -2             # GLSS   -->  W2SS+  DN     UB          
      4.14466660E-04    3     -1000037         2        -1             # GLSS   -->  W2SS-  UP     DB          
      4.14458278E-04    3      1000037         3        -4             # GLSS   -->  W2SS+  ST     CB          
      4.14458278E-04    3     -1000037         4        -3             # GLSS   -->  W2SS-  CH     SB          
      1.40185715E-04    2      1000022        21                       # GLSS   -->  Z1SS   GL                 
      1.93869658E-02    3      1000022         2        -2             # GLSS   -->  Z1SS   UP     UB          
      8.34527239E-03    3      1000022         1        -1             # GLSS   -->  Z1SS   DN     DB          
      8.34526494E-03    3      1000022         3        -3             # GLSS   -->  Z1SS   ST     SB          
      1.93862058E-02    3      1000022         4        -4             # GLSS   -->  Z1SS   CH     CB          
      4.87827323E-03    3      1000022         5        -5             # GLSS   -->  Z1SS   BT     BB          
      8.66307993E-04    3      1000022         6        -6             # GLSS   -->  Z1SS   TP     TB          
      3.92927468E-04    2      1000023        21                       # GLSS   -->  Z2SS   GL                 
      2.75725592E-02    3      1000023         2        -2             # GLSS   -->  Z2SS   UP     UB          
      2.04084534E-02    3      1000023         1        -1             # GLSS   -->  Z2SS   DN     DB          
      2.04084441E-02    3      1000023         3        -3             # GLSS   -->  Z2SS   ST     SB          
      2.75715794E-02    3      1000023         4        -4             # GLSS   -->  Z2SS   CH     CB          
      3.17533704E-04    3      1000023         5        -5             # GLSS   -->  Z2SS   BT     BB          
      1.21897960E-03    2      1000025        21                       # GLSS   -->  Z3SS   GL                 
      1.04707651E-05    3      1000025         2        -2             # GLSS   -->  Z3SS   UP     UB          
      1.12286880E-05    3      1000025         1        -1             # GLSS   -->  Z3SS   DN     DB          
      1.12286762E-05    3      1000025         3        -3             # GLSS   -->  Z3SS   ST     SB          
      1.04701376E-05    3      1000025         4        -4             # GLSS   -->  Z3SS   CH     CB          
      2.02595820E-05    3      1000025         5        -5             # GLSS   -->  Z3SS   BT     BB          
      1.03636482E-03    2      1000035        21                       # GLSS   -->  Z4SS   GL                 
      1.81217169E-04    3      1000035         2        -2             # GLSS   -->  Z4SS   UP     UB          
      1.91859770E-04    3      1000035         1        -1             # GLSS   -->  Z4SS   DN     DB          
      1.91859595E-04    3      1000035         3        -3             # GLSS   -->  Z4SS   ST     SB          
      1.81207230E-04    3      1000035         4        -4             # GLSS   -->  Z4SS   CH     CB          
      2.35084390E-05    3      1000035         5        -5             # GLSS   -->  Z4SS   BT     BB          
      3.17580760E-01    2     -1000005         5                       # GLSS   -->  BB1    BT                 
      3.17580760E-01    2      1000005        -5                       # GLSS   -->  BT1    BB                 
#         PDG         Width
DECAY   1000002  5.78259706E+00   # UPL   decays
#          BR          NDA       ID1       ID2       ID3       ID4
      4.69955121E-05    2      1000022         2                       # UPL    -->  Z1SS   UP                 
      2.92225480E-01    2      1000023         2                       # UPL    -->  Z2SS   UP                 
      6.65945583E-04    2      1000025         2                       # UPL    -->  Z3SS   UP                 
      9.93032102E-03    2      1000035         2                       # UPL    -->  Z4SS   UP                 
      9.69305560E-02    2      1000021         2                       # UPL    -->  GLSS   UP                 
      5.84295988E-01    2      1000024         1                       # UPL    -->  W1SS+  DN                 
      1.59047525E-02    2      1000037         1                       # UPL    -->  W2SS+  DN                 
#         PDG         Width
DECAY   1000001  5.76387644E+00   # DNL   decays
#          BR          NDA       ID1       ID2       ID3       ID4
      4.03319523E-02    2      1000022         1                       # DNL    -->  Z1SS   DN                 
      2.47913063E-01    2      1000023         1                       # DNL    -->  Z2SS   DN                 
      1.12646783E-03    2      1000025         1                       # DNL    -->  Z3SS   DN                 
      1.41461678E-02    2      1000035         1                       # DNL    -->  Z4SS   DN                 
      1.28676742E-01    2      1000021         1                       # DNL    -->  GLSS   DN                 
      5.28580129E-01    2     -1000024         2                       # DNL    -->  W1SS-  UP                 
      3.92254740E-02    2     -1000037         2                       # DNL    -->  W2SS-  UP                 
#         PDG         Width
DECAY   1000003  5.76381493E+00   # STL   decays
#          BR          NDA       ID1       ID2       ID3       ID4
      4.03323807E-02    2      1000022         3                       # STL    -->  Z1SS   ST                 
      2.47915715E-01    2      1000023         3                       # STL    -->  Z2SS   ST                 
      1.12647994E-03    2      1000025         3                       # STL    -->  Z3SS   ST                 
      1.41463215E-02    2      1000035         3                       # STL    -->  Z4SS   ST                 
      1.28678292E-01    2      1000021         3                       # STL    -->  GLSS   ST                 
      5.28576851E-01    2     -1000024         4                       # STL    -->  W1SS-  CH                 
      3.92239727E-02    2     -1000037         4                       # STL    -->  W2SS-  CH                 
#         PDG         Width
DECAY   1000004  5.78215504E+00   # CHL   decays
#          BR          NDA       ID1       ID2       ID3       ID4
      4.69985571E-05    2      1000022         4                       # CHL    -->  Z1SS   CH                 
      2.92244196E-01    2      1000023         4                       # CHL    -->  Z2SS   CH                 
      6.65978354E-04    2      1000025         4                       # CHL    -->  Z3SS   CH                 
      9.93071403E-03    2      1000035         4                       # CHL    -->  Z4SS   CH                 
      9.68623608E-02    2      1000021         4                       # CHL    -->  GLSS   CH                 
      5.84343493E-01    2      1000024         3                       # CHL    -->  W1SS+  ST                 
      1.59062427E-02    2      1000037         3                       # CHL    -->  W2SS+  ST                 
#         PDG         Width
DECAY   1000005  3.77739263E+00   # BT1   decays
#          BR          NDA       ID1       ID2       ID3       ID4
      5.52887395E-02    2      1000022         5                       # BT1    -->  Z1SS   BT                 
      3.23291183E-01    2      1000023         5                       # BT1    -->  Z2SS   BT                 
      1.43733306E-03    2      1000025         5                       # BT1    -->  Z3SS   BT                 
      1.12229120E-02    2      1000035         5                       # BT1    -->  Z4SS   BT                 
      4.39801782E-01    2     -1000024         6                       # BT1    -->  W1SS-  TP                 
      1.68958083E-01    2          -24   1000006                       # BT1    -->  W-     TP1                
#         PDG         Width
DECAY   1000006  1.84518576E+00   # TP1   decays
#          BR          NDA       ID1       ID2       ID3       ID4
      1.32648587E-01    2      1000022         6                       # TP1    -->  Z1SS   TP                 
      9.67778489E-02    2      1000023         6                       # TP1    -->  Z2SS   TP                 
      7.70573556E-01    2      1000024         5                       # TP1    -->  W1SS+  BT                 
#         PDG         Width
DECAY   2000002  1.35959744E+00   # UPR   decays
#          BR          NDA       ID1       ID2       ID3       ID4
      7.10618734E-01    2      1000022         2                       # UPR    -->  Z1SS   UP                 
      3.66433747E-02    2      1000023         2                       # UPR    -->  Z2SS   UP                 
      7.99346308E-04    2      1000025         2                       # UPR    -->  Z3SS   UP                 
      4.13064891E-03    2      1000035         2                       # UPR    -->  Z4SS   UP                 
      2.47807890E-01    2      1000021         2                       # UPR    -->  GLSS   UP                 
#         PDG         Width
DECAY   2000001  6.08211279E-01   # DNR   decays
#          BR          NDA       ID1       ID2       ID3       ID4
      3.97663713E-01    2      1000022         1                       # DNR    -->  Z1SS   DN                 
      2.05103327E-02    2      1000023         1                       # DNR    -->  Z2SS   DN                 
      4.48776962E-04    2      1000025         1                       # DNR    -->  Z3SS   DN                 
      2.32223677E-03    2      1000035         1                       # DNR    -->  Z4SS   DN                 
      5.79054952E-01    2      1000021         1                       # DNR    -->  GLSS   DN                 
#         PDG         Width
DECAY   2000003  6.08212888E-01   # STR   decays
#          BR          NDA       ID1       ID2       ID3       ID4
      3.97662699E-01    2      1000022         3                       # STR    -->  Z1SS   ST                 
      2.05102805E-02    2      1000023         3                       # STR    -->  Z2SS   ST                 
      4.48775972E-04    2      1000025         3                       # STR    -->  Z3SS   ST                 
      2.32223212E-03    2      1000035         3                       # STR    -->  Z4SS   ST                 
      5.79055965E-01    2      1000021         3                       # STR    -->  GLSS   ST                 
#         PDG         Width
DECAY   2000004  1.35912812E+00   # CHR   decays
#          BR          NDA       ID1       ID2       ID3       ID4
      7.10855544E-01    2      1000022         4                       # CHR    -->  Z1SS   CH                 
      3.66555564E-02    2      1000023         4                       # CHR    -->  Z2SS   CH                 
      7.99599045E-04    2      1000025         4                       # CHR    -->  Z3SS   CH                 
      4.13190760E-03    2      1000035         4                       # CHR    -->  Z4SS   CH                 
      2.47557357E-01    2      1000021         4                       # CHR    -->  GLSS   CH                 
#         PDG         Width
DECAY   2000005  5.95031917E-01   # BT2   decays
#          BR          NDA       ID1       ID2       ID3       ID4
      3.98238212E-01    2      1000022         5                       # BT2    -->  Z1SS   BT                 
      3.08498256E-02    2      1000023         5                       # BT2    -->  Z2SS   BT                 
      7.85663165E-03    2      1000025         5                       # BT2    -->  Z3SS   BT                 
      1.15488498E-02    2      1000035         5                       # BT2    -->  Z4SS   BT                 
      5.04158437E-01    2      1000021         5                       # BT2    -->  GLSS   BT                 
      1.48260230E-02    2     -1000024         6                       # BT2    -->  W1SS-  TP                 
      3.25220414E-02    2          -24   1000006                       # BT2    -->  W-     TP1                
#         PDG         Width
DECAY   2000006  4.91649294E+00   # TP2   decays
#          BR          NDA       ID1       ID2       ID3       ID4
      2.82693207E-01    2      1000024         5                       # TP2    -->  W1SS+  BT                 
      2.47279242E-01    2      1000037         5                       # TP2    -->  W2SS+  BT                 
      2.20296979E-01    2           23   1000006                       # TP2    -->  Z0     TP1                
      7.42986426E-02    2           25   1000006                       # TP2    -->  HL0    TP1                
      1.57695208E-02    2      1000022         6                       # TP2    -->  Z1SS   TP                 
      1.28545970E-01    2      1000023         6                       # TP2    -->  Z2SS   TP                 
      3.11164204E-02    2      1000025         6                       # TP2    -->  Z3SS   TP                 
#         PDG         Width
DECAY   1000011  2.76762152E+00   # EL-   decays
#          BR          NDA       ID1       ID2       ID3       ID4
      5.66636361E-02    2      1000022        11                       # EL-    -->  Z1SS   E-                 
      3.74491632E-01    2      1000023        11                       # EL-    -->  Z2SS   E-                 
      6.21830850E-07    2      1000025        11                       # EL-    -->  Z3SS   E-                 
      5.68844080E-01    2     -1000024        12                       # EL-    -->  W1SS-  NUE                
      5.49741676E-12    3      1000015        11       -15             # EL-    -->  TAU1-  E-     TAU+        
      4.41527761E-12    3     -1000015        11        15             # EL-    -->  TAU1+  E-     TAU-        
#         PDG         Width
DECAY   1000013  2.76762128E+00   # MUL-  decays
#          BR          NDA       ID1       ID2       ID3       ID4
      5.66636324E-02    2      1000022        13                       # MUL-   -->  Z1SS   MU-                
      3.74491572E-01    2      1000023        13                       # MUL-   -->  Z2SS   MU-                
      6.21540551E-07    2      1000025        13                       # MUL-   -->  Z3SS   MU-                
      5.68844199E-01    2     -1000024        14                       # MUL-   -->  W1SS-  NUM                
      5.49741763E-12    3      1000015        13       -15             # MUL-   -->  TAU1-  MU-    TAU+        
      4.41527847E-12    3     -1000015        13        15             # MUL-   -->  TAU1+  MU-    TAU-        
#         PDG         Width
DECAY   1000015  1.34529543E+00   # TAU1- decays
#          BR          NDA       ID1       ID2       ID3       ID4
      8.95799577E-01    2      1000022        15                       # TAU1-  -->  Z1SS   TAU-               
      6.34524375E-02    2      1000023        15                       # TAU1-  -->  Z2SS   TAU-               
      4.07479517E-02    2     -1000024        16                       # TAU1-  -->  W1SS-  NUT                
#         PDG         Width
DECAY   1000012  2.80454516E+00   # NUEL  decays
#          BR          NDA       ID1       ID2       ID3       ID4
      1.95669979E-01    2      1000022        12                       # NUEL   -->  Z1SS   NUE                
      2.03373685E-01    2      1000023        12                       # NUEL   -->  Z2SS   NUE                
      6.00956321E-01    2      1000024        11                       # NUEL   -->  W1SS+  E-                 
      8.81452436E-14    3      1000015        12       -15             # NUEL   -->  TAU1-  NUE    TAU+        
      5.22553192E-13    3     -1000015        12        15             # NUEL   -->  TAU1+  NUE    TAU-        
      6.82339723E-14    3     -1000015        11        16             # NUEL   -->  TAU1+  E-     NUT         
#         PDG         Width
DECAY   1000014  2.80454445E+00   # NUML  decays
#          BR          NDA       ID1       ID2       ID3       ID4
      1.95670009E-01    2      1000022        14                       # NUML   -->  Z1SS   NUM                
      2.03373715E-01    2      1000023        14                       # NUML   -->  Z2SS   NUM                
      6.00956202E-01    2      1000024        13                       # NUML   -->  W1SS+  MU-                
      8.81452572E-14    3      1000015        14       -15             # NUML   -->  TAU1-  NUM    TAU+        
      5.22553301E-13    3     -1000015        14        15             # NUML   -->  TAU1+  NUM    TAU-        
      6.82360391E-14    3     -1000015        13        16             # NUML   -->  TAU1+  MU-    NUT         
#         PDG         Width
DECAY   1000016  2.80164862E+00   # NUTL  decays
#          BR          NDA       ID1       ID2       ID3       ID4
      1.95709348E-01    2      1000022        16                       # NUTL   -->  Z1SS   NUT                
      2.03338772E-01    2      1000023        16                       # NUTL   -->  Z2SS   NUT                
      6.00951850E-01    2      1000024        15                       # NUTL   -->  W1SS+  TAU-               
      7.73811963E-14    3     -1000015        16        15             # NUTL   -->  TAU1+  NUT    TAU-        
      1.11212609E-10    3      1000015        16       -15             # NUTL   -->  TAU1-  NUT    TAU+        
      1.10759714E-10    3      1000015        12       -11             # NUTL   -->  TAU1-  NUE    E+          
      1.10759714E-10    3      1000015        14       -13             # NUTL   -->  TAU1-  NUM    MU+         
      3.32279121E-10    3      1000015         2        -1             # NUTL   -->  TAU1-  UP     DB          
      3.32279121E-10    3      1000015         4        -3             # NUTL   -->  TAU1-  CH     SB          
#         PDG         Width
DECAY   2000011  1.29153895E+00   # ER-   decays
#          BR          NDA       ID1       ID2       ID3       ID4
      9.58187342E-01    2      1000022        11                       # ER-    -->  Z1SS   E-                 
      4.18126471E-02    2      1000023        11                       # ER-    -->  Z2SS   E-                 
      8.82289572E-29    3      1000015        12       -16             # ER-    -->  TAU1-  NUE    ANUT        
#         PDG         Width
DECAY   2000013  1.29153872E+00   # MUR-  decays
#          BR          NDA       ID1       ID2       ID3       ID4
      9.58187342E-01    2      1000022        13                       # MUR-   -->  Z1SS   MU-                
      4.18126434E-02    2      1000023        13                       # MUR-   -->  Z2SS   MU-                
      3.74728612E-24    3      1000015        14       -16             # MUR-   -->  TAU1-  NUM    ANUT        
#         PDG         Width
DECAY   2000015  2.70885825E+00   # TAU2- decays
#          BR          NDA       ID1       ID2       ID3       ID4
      6.94325939E-02    2      1000022        15                       # TAU2-  -->  Z1SS   TAU-               
      3.70499551E-01    2      1000023        15                       # TAU2-  -->  Z2SS   TAU-               
      9.01946009E-07    2      1000025        15                       # TAU2-  -->  Z3SS   TAU-               
      5.60066998E-01    2     -1000024        16                       # TAU2-  -->  W1SS-  NUT                
#         PDG         Width
DECAY   1000023  9.75384637E-07   # Z2SS  decays
#          BR          NDA       ID1       ID2       ID3       ID4
      5.25646843E-04    2      1000022        22                       # Z2SS   -->  Z1SS   GM                 
      1.05912419E-04    3     -1000024         2        -1             # Z2SS   -->  W1SS-  UP     DB          
      3.53041396E-05    3     -1000024        12       -11             # Z2SS   -->  W1SS-  NUE    E+          
      3.53041396E-05    3     -1000024        14       -13             # Z2SS   -->  W1SS-  NUM    MU+         
      1.05912419E-04    3      1000024         1        -2             # Z2SS   -->  W1SS+  DN     UB          
      3.53041396E-05    3      1000024        11       -12             # Z2SS   -->  W1SS+  E-     ANUE        
      3.53041396E-05    3      1000024        13       -14             # Z2SS   -->  W1SS+  MU-    ANUM        
      1.35396153E-01    3      1000022         2        -2             # Z2SS   -->  Z1SS   UP     UB          
      2.33691320E-01    3      1000022         1        -1             # Z2SS   -->  Z1SS   DN     DB          
      2.33691305E-01    3      1000022         3        -3             # Z2SS   -->  Z1SS   ST     SB          
      1.35396019E-01    3      1000022         4        -4             # Z2SS   -->  Z1SS   CH     CB          
      2.46855140E-01    3      1000022         5        -5             # Z2SS   -->  Z1SS   BT     BB          
      2.62876600E-03    3      1000022        11       -11             # Z2SS   -->  Z1SS   E-     E+          
      2.62876600E-03    3      1000022        13       -13             # Z2SS   -->  Z1SS   MU-    MU+         
      5.21152560E-03    3      1000022        15       -15             # Z2SS   -->  Z1SS   TAU-   TAU+        
      1.20175723E-03    3      1000022        12       -12             # Z2SS   -->  Z1SS   NUE    ANUE        
      1.20175723E-03    3      1000022        14       -14             # Z2SS   -->  Z1SS   NUM    ANUM        
      1.21884723E-03    3      1000022        16       -16             # Z2SS   -->  Z1SS   NUT    ANUT        
#         PDG         Width
DECAY   1000025  1.89794374E+00   # Z3SS  decays
#          BR          NDA       ID1       ID2       ID3       ID4
      4.37995482E-07    2      1000022        22                       # Z3SS   -->  Z1SS   GM                 
      1.37999891E-07    2      1000023        22                       # Z3SS   -->  Z2SS   GM                 
      3.12981158E-01    2      1000024       -24                       # Z3SS   -->  W1SS+  W-                 
      3.12981158E-01    2     -1000024        24                       # Z3SS   -->  W1SS-  W+                 
      1.53167099E-01    2      1000022        23                       # Z3SS   -->  Z1SS   Z0                 
      1.95840821E-01    2      1000023        23                       # Z3SS   -->  Z2SS   Z0                 
      2.17048122E-08    3      1000022         2        -2             # Z3SS   -->  Z1SS   UP     UB          
      2.52367851E-08    3      1000022         1        -1             # Z3SS   -->  Z1SS   DN     DB          
      2.52367762E-08    3      1000022         3        -3             # Z3SS   -->  Z1SS   ST     SB          
      2.17043503E-08    3      1000022         4        -4             # Z3SS   -->  Z1SS   CH     CB          
      1.91931747E-07    3      1000022         5        -5             # Z3SS   -->  Z1SS   BT     BB          
      8.76218706E-08    3      1000022        11       -11             # Z3SS   -->  Z1SS   E-     E+          
      8.76218706E-08    3      1000022        13       -13             # Z3SS   -->  Z1SS   MU-    MU+         
      3.22368010E-07    3      1000022        15       -15             # Z3SS   -->  Z1SS   TAU-   TAU+        
      5.43560219E-08    3      1000023         2        -2             # Z3SS   -->  Z2SS   UP     UB          
      6.87479869E-08    3      1000023         1        -1             # Z3SS   -->  Z2SS   DN     DB          
      6.87479726E-08    3      1000023         3        -3             # Z3SS   -->  Z2SS   ST     SB          
      5.43548992E-08    3      1000023         4        -4             # Z3SS   -->  Z2SS   CH     CB          
      3.24617304E-07    3      1000023         5        -5             # Z3SS   -->  Z2SS   BT     BB          
      4.23848235E-07    3      1000023        11       -11             # Z3SS   -->  Z2SS   E-     E+          
      4.23848235E-07    3      1000023        13       -13             # Z3SS   -->  Z2SS   MU-    MU+         
      1.24188011E-06    3      1000023        15       -15             # Z3SS   -->  Z2SS   TAU-   TAU+        
      1.53987063E-02    2      1000022        25                       # Z3SS   -->  Z1SS   HL0                
      9.53957438E-03    2      1000023        25                       # Z3SS   -->  Z2SS   HL0                
      8.15750809E-06    2      2000011       -11                       # Z3SS   -->  ER-    E+                 
      8.15750809E-06    2     -2000011        11                       # Z3SS   -->  ER+    E-                 
      8.15722251E-06    2      2000013       -13                       # Z3SS   -->  MUR-   MU+                
      8.15722251E-06    2     -2000013        13                       # Z3SS   -->  MUR+   MU-                
      1.17198879E-05    2      1000015       -15                       # Z3SS   -->  TAU1-  TAU+               
      1.17198879E-05    2     -1000015        15                       # Z3SS   -->  TAU1+  TAU-               
      5.09262691E-06    2      1000012       -12                       # Z3SS   -->  NUEL   ANUE               
      5.09262691E-06    2     -1000012        12                       # Z3SS   -->  ANUEL  NUE                
      5.09262691E-06    2      1000014       -14                       # Z3SS   -->  NUML   ANUM               
      5.09262691E-06    2     -1000014        14                       # Z3SS   -->  ANUML  NUM                
      5.48714479E-06    2      1000016       -16                       # Z3SS   -->  NUTL   ANUT               
      5.48714479E-06    2     -1000016        16                       # Z3SS   -->  ANUTL  NUT                
#         PDG         Width
DECAY   1000035  2.14585257E+00   # Z4SS  decays
#          BR          NDA       ID1       ID2       ID3       ID4
      6.86924921E-07    2      1000022        22                       # Z4SS   -->  Z1SS   GM                 
      5.69317194E-07    2      1000023        22                       # Z4SS   -->  Z2SS   GM                 
      1.24502195E-08    2      1000025        22                       # Z4SS   -->  Z3SS   GM                 
      3.49744678E-01    2      1000024       -24                       # Z4SS   -->  W1SS+  W-                 
      3.49744678E-01    2     -1000024        24                       # Z4SS   -->  W1SS-  W+                 
      5.51578894E-10    3     -1000037         2        -1             # Z4SS   -->  W2SS-  UP     DB          
      1.83859636E-10    3     -1000037        12       -11             # Z4SS   -->  W2SS-  NUE    E+          
      1.83859636E-10    3     -1000037        14       -13             # Z4SS   -->  W2SS-  NUM    MU+         
      5.51578894E-10    3      1000037         1        -2             # Z4SS   -->  W2SS+  DN     UB          
      1.83859636E-10    3      1000037        11       -12             # Z4SS   -->  W2SS+  E-     ANUE        
      1.83859636E-10    3      1000037        13       -14             # Z4SS   -->  W2SS+  MU-    ANUM        
      5.51578894E-10    3     -1000037         4        -3             # Z4SS   -->  W2SS-  CH     SB          
      1.83859636E-10    3     -1000037        16       -15             # Z4SS   -->  W2SS-  NUT    TAU+        
      5.51578894E-10    3      1000037         3        -4             # Z4SS   -->  W2SS+  ST     CB          
      1.83859636E-10    3      1000037        15       -16             # Z4SS   -->  W2SS+  TAU-   ANUT        
      1.76974162E-02    2      1000022        23                       # Z4SS   -->  Z1SS   Z0                 
      1.29412794E-02    2      1000023        23                       # Z4SS   -->  Z2SS   Z0                 
      4.30737799E-07    3      1000022         2        -2             # Z4SS   -->  Z1SS   UP     UB          
      1.14203544E-06    3      1000022         1        -1             # Z4SS   -->  Z1SS   DN     DB          
      1.14203533E-06    3      1000022         3        -3             # Z4SS   -->  Z1SS   ST     SB          
      4.30728335E-07    3      1000022         4        -4             # Z4SS   -->  Z1SS   CH     CB          
      2.24938344E-06    3      1000022         5        -5             # Z4SS   -->  Z1SS   BT     BB          
      8.75657680E-09    3      1000022        15       -15             # Z4SS   -->  Z1SS   TAU-   TAU+        
      4.48298351E-06    3      1000023         2        -2             # Z4SS   -->  Z2SS   UP     UB          
      4.74693479E-06    3      1000023         1        -1             # Z4SS   -->  Z2SS   DN     DB          
      4.74693343E-06    3      1000023         3        -3             # Z4SS   -->  Z2SS   ST     SB          
      4.48288893E-06    3      1000023         4        -4             # Z4SS   -->  Z2SS   CH     CB          
      9.42872430E-06    3      1000023         5        -5             # Z4SS   -->  Z2SS   BT     BB          
      3.64154040E-09    3      1000023        15       -15             # Z4SS   -->  Z2SS   TAU-   TAU+        
      1.19413789E-06    3      1000025         2        -2             # Z4SS   -->  Z3SS   UP     UB          
      1.54993415E-06    3      1000025         1        -1             # Z4SS   -->  Z3SS   DN     DB          
      1.54993415E-06    3      1000025         3        -3             # Z4SS   -->  Z3SS   ST     SB          
      1.19413789E-06    3      1000025         4        -4             # Z4SS   -->  Z3SS   CH     CB          
      1.14417219E-06    3      1000025         5        -5             # Z4SS   -->  Z3SS   BT     BB          
      3.50327809E-07    3      1000025        11       -11             # Z4SS   -->  Z3SS   E-     E+          
      3.50327809E-07    3      1000025        13       -13             # Z4SS   -->  Z3SS   MU-    MU+         
      3.33110393E-07    3      1000025        15       -15             # Z4SS   -->  Z3SS   TAU-   TAU+        
      6.97042196E-07    3      1000025        12       -12             # Z4SS   -->  Z3SS   NUE    ANUE        
      6.97042196E-07    3      1000025        14       -14             # Z4SS   -->  Z3SS   NUM    ANUM        
      6.97042196E-07    3      1000025        16       -16             # Z4SS   -->  Z3SS   NUT    ANUT        
      1.04872949E-01    2      1000022        25                       # Z4SS   -->  Z1SS   HL0                
      1.44799799E-01    2      1000023        25                       # Z4SS   -->  Z2SS   HL0                
      5.46102528E-04    2      1000011       -11                       # Z4SS   -->  EL-    E+                 
      5.46102528E-04    2     -1000011        11                       # Z4SS   -->  EL+    E-                 
      5.46098745E-04    2      1000013       -13                       # Z4SS   -->  MUL-   MU+                
      5.46098745E-04    2     -1000013        13                       # Z4SS   -->  MUL+   MU-                
      4.58851544E-04    2      2000011       -11                       # Z4SS   -->  ER-    E+                 
      4.58851544E-04    2     -2000011        11                       # Z4SS   -->  ER+    E-                 
      4.58849798E-04    2      2000013       -13                       # Z4SS   -->  MUR-   MU+                
      4.58849798E-04    2     -2000013        13                       # Z4SS   -->  MUR+   MU-                
      4.13424277E-04    2      1000015       -15                       # Z4SS   -->  TAU1-  TAU+               
      4.13424277E-04    2     -1000015        15                       # Z4SS   -->  TAU1+  TAU-               
      5.66679752E-04    2      2000015       -15                       # Z4SS   -->  TAU2-  TAU+               
      5.66679752E-04    2     -2000015        15                       # Z4SS   -->  TAU2+  TAU-               
      2.35381559E-03    2      1000012       -12                       # Z4SS   -->  NUEL   ANUE               
      2.35381559E-03    2     -1000012        12                       # Z4SS   -->  ANUEL  NUE                
      2.35381559E-03    2      1000014       -14                       # Z4SS   -->  NUML   ANUM               
      2.35381559E-03    2     -1000014        14                       # Z4SS   -->  ANUML  NUM                
      2.37976597E-03    2      1000016       -16                       # Z4SS   -->  NUTL   ANUT               
      2.37976597E-03    2     -1000016        16                       # Z4SS   -->  ANUTL  NUT                
#         PDG         Width
DECAY   1000024  4.33975292E-05   # W1SS+ decays
#          BR          NDA       ID1       ID2       ID3       ID4
      3.30819428E-01    3      1000022         2        -1             # W1SS+  -->  Z1SS   UP     DB          
      3.30819428E-01    3      1000022         4        -3             # W1SS+  -->  Z1SS   CH     SB          
      1.12776689E-01    3      1000022       -11        12             # W1SS+  -->  Z1SS   E+     NUE         
      1.12776689E-01    3      1000022       -13        14             # W1SS+  -->  Z1SS   MU+    NUM         
      1.12807773E-01    3      1000022       -15        16             # W1SS+  -->  Z1SS   TAU+   NUT         
#         PDG         Width
DECAY   1000037  2.15055394E+00   # W2SS+ decays
#          BR          NDA       ID1       ID2       ID3       ID4
      1.08833922E-06    3      1000022         2        -1             # W2SS+  -->  Z1SS   UP     DB          
      1.08833876E-06    3      1000022         4        -3             # W2SS+  -->  Z1SS   CH     SB          
      1.29809452E-09    3      1000022       -15        16             # W2SS+  -->  Z1SS   TAU+   NUT         
      3.13032083E-02    2      1000022        24                       # W2SS+  -->  Z1SS   W+                 
      4.14959959E-06    3      1000023         2        -1             # W2SS+  -->  Z2SS   UP     DB          
      4.14957321E-06    3      1000023         4        -3             # W2SS+  -->  Z2SS   CH     SB          
      1.41661367E-08    3      1000023       -15        16             # W2SS+  -->  Z2SS   TAU+   NUT         
      4.11371708E-01    2      1000023        24                       # W2SS+  -->  Z2SS   W+                 
      1.84578494E-06    3      1000025         2        -1             # W2SS+  -->  Z3SS   UP     DB          
      1.84578494E-06    3      1000025         4        -3             # W2SS+  -->  Z3SS   CH     SB          
      6.14646240E-07    3      1000025       -11        12             # W2SS+  -->  Z3SS   E+     NUE         
      6.14646240E-07    3      1000025       -13        14             # W2SS+  -->  Z3SS   MU+    NUM         
      6.14646297E-07    3      1000025       -15        16             # W2SS+  -->  Z3SS   TAU+   NUT         
      1.08352108E-02    2      1000006        -5                       # W2SS+  -->  TP1    BB                 
      1.58255966E-03    2      1000012       -11                       # W2SS+  -->  NUEL   E+                 
      1.58255151E-03    2      1000014       -13                       # W2SS+  -->  NUML   MU+                
      1.61171868E-03    2      1000016       -15                       # W2SS+  -->  NUTL   TAU+               
      1.94330234E-03    2     -1000011        12                       # W2SS+  -->  EL+    NUE                
      1.94330234E-03    2     -1000013        14                       # W2SS+  -->  MUL+   NUM                
      2.74816157E-05    2     -1000015        16                       # W2SS+  -->  TAU1+  NUT                
      1.90541847E-03    2     -2000015        16                       # W2SS+  -->  TAU2+  NUT                
      3.19993854E-01    2      1000024        23                       # W2SS+  -->  W1SS+  Z0                 
      4.59163539E-06    3      1000024         1        -1             # W2SS+  -->  W1SS+  DN     DB          
      4.59153762E-06    3      1000024         3        -3             # W2SS+  -->  W1SS+  ST     SB          
      9.02192824E-06    3      1000024         2        -2             # W2SS+  -->  W1SS+  UP     UB          
      9.02192460E-06    3      1000024         4        -4             # W2SS+  -->  W1SS+  CH     CB          
      2.15856478E-01    2      1000024        25                       # W2SS+  -->  W1SS+  HL0                
#         PDG         Width
DECAY        25  3.58908647E-03   # HL0   decays
#          BR          NDA       ID1       ID2       ID3       ID4
      5.10138110E-09    2           11       -11                       # HL0    -->  E-     E+                 
      2.15387903E-04    2           13       -13                       # HL0    -->  MU-    MU+                
      6.15584552E-02    2           15       -15                       # HL0    -->  TAU-   TAU+               
      6.42287478E-06    2            1        -1                       # HL0    -->  DN     DB                 
      2.59516132E-03    2            3        -3                       # HL0    -->  ST     SB                 
      8.75316739E-01    2            5        -5                       # HL0    -->  BT     BB                 
      1.76259744E-06    2            2        -2                       # HL0    -->  UP     UB                 
      3.42432633E-02    2            4        -4                       # HL0    -->  CH     CB                 
      1.05951354E-03    2           22        22                       # HL0    -->  GM     GM                 
      2.42841579E-02    2           21        21                       # HL0    -->  GL     GL                 
      3.99508535E-05    3           24        11       -12             # HL0    -->  W+     E-     ANUE        
      3.99508535E-05    3           24        13       -14             # HL0    -->  W+     MU-    ANUM        
      3.99508535E-05    3           24        15       -16             # HL0    -->  W+     TAU-   ANUT        
      1.19852564E-04    3           24        -2         1             # HL0    -->  W+     UB     DN          
      1.19852564E-04    3           24        -4         3             # HL0    -->  W+     CB     ST          
      3.99508535E-05    3          -24       -11        12             # HL0    -->  W-     E+     NUE         
      3.99508535E-05    3          -24       -13        14             # HL0    -->  W-     MU+    NUM         
      3.99508535E-05    3          -24       -15        16             # HL0    -->  W-     TAU+   NUT         
      1.19852564E-04    3          -24         2        -1             # HL0    -->  W-     UP     DB          
      1.19852564E-04    3          -24         4        -3             # HL0    -->  W-     CH     SB          
#         PDG         Width
DECAY        35  2.59629250E+00   # HH0   decays
#          BR          NDA       ID1       ID2       ID3       ID4
      2.62933397E-10    2           11       -11                       # HH0    -->  E-     E+                 
      1.11015197E-05    2           13       -13                       # HH0    -->  MU-    MU+                
      3.17935366E-03    2           15       -15                       # HH0    -->  TAU-   TAU+               
      3.24410394E-07    2            1        -1                       # HH0    -->  DN     DB                 
      1.31078210E-04    2            3        -3                       # HH0    -->  ST     SB                 
      2.04121489E-02    2            5        -5                       # HH0    -->  BT     BB                 
      1.49416168E-09    2            2        -2                       # HH0    -->  UP     UB                 
      2.32113489E-05    2            4        -4                       # HH0    -->  CH     CB                 
      4.08797234E-01    2            6        -6                       # HH0    -->  TP     TB                 
      9.71698137E-06    2           22        22                       # HH0    -->  GM     GM                 
      9.81078832E-04    2           21        21                       # HH0    -->  GL     GL                 
      5.46894129E-03    2           24       -24                       # HH0    -->  W+     W-                 
      2.66181747E-03    2           23        23                       # HH0    -->  Z0     Z0                 
      1.38696134E-02    2      1000022   1000022                       # HH0    -->  Z1SS   Z1SS               
      3.55069675E-02    2      1000022   1000023                       # HH0    -->  Z1SS   Z2SS               
      9.74723473E-02    2      1000022   1000025                       # HH0    -->  Z1SS   Z3SS               
      2.67965905E-03    2      1000022   1000035                       # HH0    -->  Z1SS   Z4SS               
      2.14088932E-02    2      1000023   1000023                       # HH0    -->  Z2SS   Z2SS               
      1.02961004E-01    2      1000023   1000025                       # HH0    -->  Z2SS   Z3SS               
      9.29610687E-05    2      1000023   1000035                       # HH0    -->  Z2SS   Z4SS               
      8.41567069E-02    2      1000024  -1000024                       # HH0    -->  W1SS+  W1SS-              
      9.19361189E-02    2      1000024  -1000037                       # HH0    -->  W1SS+  W2SS-              
      9.19361189E-02    2     -1000024   1000037                       # HH0    -->  W1SS-  W2SS+              
      1.63035486E-02    2           25        25                       # HH0    -->  HL0    HL0                
#         PDG         Width
DECAY        36  3.63696027E+00   # HA0   decays
#          BR          NDA       ID1       ID2       ID3       ID4
      1.88125127E-10    2           11       -11                       # HA0    -->  E-     E+                 
      7.94298103E-06    2           13       -13                       # HA0    -->  MU-    MU+                
      2.27492023E-03    2           15       -15                       # HA0    -->  TAU-   TAU+               
      2.32143236E-07    2            1        -1                       # HA0    -->  DN     DB                 
      9.37976147E-05    2            3        -3                       # HA0    -->  ST     SB                 
      1.46101760E-02    2            5        -5                       # HA0    -->  BT     BB                 
      9.17015908E-10    2            2        -2                       # HA0    -->  UP     UB                 
      1.42717736E-05    2            4        -4                       # HA0    -->  CH     CB                 
      5.58972478E-01    2            6        -6                       # HA0    -->  TP     TB                 
      1.52554117E-06    2           22        22                       # HA0    -->  GM     GM                 
      5.71177399E-04    2           21        21                       # HA0    -->  GL     GL                 
      2.21017394E-02    2      1000022   1000022                       # HA0    -->  Z1SS   Z1SS               
      6.76385686E-02    2      1000022   1000023                       # HA0    -->  Z1SS   Z2SS               
      6.45750668E-03    2      1000022   1000025                       # HA0    -->  Z1SS   Z3SS               
      2.80122533E-02    2      1000022   1000035                       # HA0    -->  Z1SS   Z4SS               
      5.16525805E-02    2      1000023   1000023                       # HA0    -->  Z2SS   Z2SS               
      2.01289402E-03    2      1000023   1000025                       # HA0    -->  Z2SS   Z3SS               
      1.91896662E-01    2      1000024  -1000024                       # HA0    -->  W1SS+  W1SS-              
      2.51149423E-02    2      1000024  -1000037                       # HA0    -->  W1SS+  W2SS-              
      2.51149423E-02    2     -1000024   1000037                       # HA0    -->  W1SS-  W2SS+              
      3.45141627E-03    2           25        23                       # HA0    -->  HL0    Z0                 
#         PDG         Width
DECAY        37  3.15019107E+00   # H+    decays
#          BR          NDA       ID1       ID2       ID3       ID4
      2.21947086E-10    2           12       -11                       # H+     -->  NUE    E+                 
      9.37100504E-06    2           14       -13                       # H+     -->  NUM    MU+                
      2.68391869E-03    2           16       -15                       # H+     -->  NUT    TAU+               
      2.50906254E-07    2            2        -1                       # H+     -->  UP     DB                 
      1.16299379E-04    2            4        -3                       # H+     -->  CH     SB                 
      6.01471305E-01    2            6        -5                       # H+     -->  TP     BB                 
      7.99073651E-02    2      1000024   1000022                       # H+     -->  W1SS+  Z1SS               
      4.94709844E-03    2      1000024   1000023                       # H+     -->  W1SS+  Z2SS               
      1.36191860E-01    2      1000024   1000025                       # H+     -->  W1SS+  Z3SS               
      6.39181659E-02    2      1000024   1000035                       # H+     -->  W1SS+  Z4SS               
      8.16962216E-03    2      1000037   1000022                       # H+     -->  W2SS+  Z1SS               
      9.81965363E-02    2      1000037   1000023                       # H+     -->  W2SS+  Z2SS               
      4.38820338E-03    2           25        24                       # H+     -->  HL0    W+                 
