  65
  401   9977.1016    0.10620E-26
  402   9976.7734    0.10620E-26
  403   9977.1016    0.10620E-26
  404   9976.7734    0.10620E-26
  405   3581.8689    0.21594E-26
  406   2641.9189    0.46651E-26
  407   9977.1016    0.10620E-26
  408   9976.7734    0.10620E-26
  409   9977.1016    0.10620E-26
  410   9976.7734    0.10620E-26
  411   3581.8689    0.21594E-26
  412   2641.9189    0.46651E-26
  413  10032.4277    0.13146E-26
  414   9919.5205    0.12849E-26
  415  10032.4277    0.13146E-26
  416   9919.5205    0.12849E-26
  417   4025.2532    0.25989E-26
  418   3585.6328    0.20989E-26
  419  10032.4277    0.13146E-26
  420   9919.5205    0.12849E-26
  421  10032.4277    0.13146E-26
  422   9919.5205    0.12849E-26
  423   4025.2532    0.25989E-26
  424   3585.6328    0.20989E-26
  425   9940.4404    0.47676E-26
  426   9942.8262    0.47660E-26
  427   9940.4404    0.47676E-26
  428   9942.8262    0.47660E-26
  429   4274.9849    0.22391E-25
  430   7528.6753    0.43591E-26
  431   9940.4404    0.47676E-26
  432   9942.8262    0.47660E-26
  433   9940.4404    0.47676E-26
  434   9942.8262    0.47660E-26
  435   4274.9849    0.22391E-25
  436   7528.6753    0.43591E-26
  437  10095.4912    0.12821E-25
  438      0.0000    0.10000E+31
  439  10095.4912    0.12821E-25
  440      0.0000    0.10000E+31
  441   7524.6870    0.43836E-26
  442      0.0000    0.10000E+31
  443  10095.4912    0.12821E-25
  444      0.0000    0.10000E+31
  445  10095.4912    0.12821E-25
  446      0.0000    0.10000E+31
  447   7524.6870    0.43836E-26
  448      0.0000    0.10000E+31
  449    563.0806    0.34859E-18
  450     82.6051    0.10000E+31
  451    181.5281    0.80509E-17
  452  -3265.5583    0.25444E-25
  453   3266.1738    0.20428E-25
  454    182.2978    0.26228E-18
  455   3246.0913    0.22120E-25
  456    182.2978    0.26228E-18
  457   3246.0913    0.22120E-25
  203    127.9316    0.12160E-21
  204   2980.1404    0.65900E-26
  205   2960.7197    0.66328E-26
  206   2987.3145    0.70487E-26
  207   2987.3145    0.70487E-26
  458      0.0000    0.10000E+31
    6    172.5000    0.57395E-24
   12    172.5000    0.57395E-24
   7
   401  0.23098481E-02     0   450     1     0     0     0
   401  0.67633234E-01     0   451     1     0     0     0
   401  0.17734219E-04     0   452     1     0     0     0
   401  0.18811694E-04     0   453     1     0     0     0
   401  0.79462308E+00     0   449     1     0     0     0
   401  0.13527077E+00     0   456     2     0     0     0
   401  0.12654523E-03     0   457     2     0     0     0
   6
   402  0.22376201E-02     0   450     2     0     0     0
   402  0.67718320E-01     0   451     2     0     0     0
   402  0.11979020E-04     0   452     2     0     0     0
   402  0.12311708E-04     0   453     2     0     0     0
   402  0.79459667E+00     0   449     2     0     0     0
   402  0.13542312E+00     0   454     1     0     0     0
   7
   403  0.23098481E-02     0   450     3     0     0     0
   403  0.67633234E-01     0   451     3     0     0     0
   403  0.17734219E-04     0   452     3     0     0     0
   403  0.18811694E-04     0   453     3     0     0     0
   403  0.79462308E+00     0   449     3     0     0     0
   403  0.13527077E+00     0   456     4     0     0     0
   403  0.12654523E-03     0   457     4     0     0     0
   6
   404  0.22376201E-02     0   450     4     0     0     0
   404  0.67718305E-01     0   451     4     0     0     0
   404  0.11979022E-04     0   452     4     0     0     0
   404  0.12311708E-04     0   453     4     0     0     0
   404  0.79459667E+00     0   449     4     0     0     0
   404  0.13542312E+00     0   454     3     0     0     0
   8
   405  0.20383666E-02     0   450     5     0     0     0
   405  0.48456654E-01     0   451     5     0     0     0
   405  0.18452954E-02     0   452     5     0     0     0
   405  0.18213061E-02     0   453     5     0     0     0
   405  0.60697532E+00     0   449     5     0     0     0
   405  0.96353114E-01     0   456     6     0     0     0
   405  0.35110447E-02     0   457     6     0     0     0
   405  0.23899888E+00     0   199   406     0     0     0
   4
   406  0.95276153E+00     0   449     6     0     0     0
   406  0.40826082E-01     0   450     6     0     0     0
   406  0.20589475E-02     0   451     6     0     0     0
   406  0.43535121E-02     0   454     5     0     0     0
   7
   407  0.23098481E-02     0   450     7     0     0     0
   407  0.67633234E-01     0   451     7     0     0     0
   407  0.17734219E-04     0   452     7     0     0     0
   407  0.18811694E-04     0   453     7     0     0     0
   407  0.79462308E+00     0   449     7     0     0     0
   407  0.13527077E+00     0   454     8     0     0     0
   407  0.12654523E-03     0   455     8     0     0     0
   6
   408  0.22376201E-02     0   450     8     0     0     0
   408  0.67718320E-01     0   451     8     0     0     0
   408  0.11979020E-04     0   452     8     0     0     0
   408  0.12311708E-04     0   453     8     0     0     0
   408  0.79459667E+00     0   449     8     0     0     0
   408  0.13542312E+00     0   456     7     0     0     0
   7
   409  0.23098481E-02     0   450     9     0     0     0
   409  0.67633234E-01     0   451     9     0     0     0
   409  0.17734219E-04     0   452     9     0     0     0
   409  0.18811694E-04     0   453     9     0     0     0
   409  0.79462308E+00     0   449     9     0     0     0
   409  0.13527077E+00     0   454    10     0     0     0
   409  0.12654523E-03     0   455    10     0     0     0
   6
   410  0.22376201E-02     0   450    10     0     0     0
   410  0.67718305E-01     0   451    10     0     0     0
   410  0.11979022E-04     0   452    10     0     0     0
   410  0.12311708E-04     0   453    10     0     0     0
   410  0.79459667E+00     0   449    10     0     0     0
   410  0.13542312E+00     0   456     9     0     0     0
   8
   411  0.20383666E-02     0   450    11     0     0     0
   411  0.48456654E-01     0   451    11     0     0     0
   411  0.18452954E-02     0   452    11     0     0     0
   411  0.18213061E-02     0   453    11     0     0     0
   411  0.60697532E+00     0   449    11     0     0     0
   411  0.96353114E-01     0   454    12     0     0     0
   411  0.35110447E-02     0   455    12     0     0     0
   411  0.23899888E+00     0   198   412     0     0     0
   4
   412  0.95276153E+00     0   449    12     0     0     0
   412  0.40826082E-01     0   450    12     0     0     0
   412  0.20589475E-02     0   451    12     0     0     0
   412  0.43535121E-02     0   456    11     0     0     0
   2
   413  0.11319939E-01     0   450     1     0     0     0
   413  0.98868018E+00     0   449     1     0     0     0
   2
   414  0.43759163E-01     0   450     2     0     0     0
   414  0.95624083E+00     0   449     2     0     0     0
   2
   415  0.11319939E-01     0   450     3     0     0     0
   415  0.98868018E+00     0   449     3     0     0     0
   2
   416  0.43759163E-01     0   450     4     0     0     0
   416  0.95624083E+00     0   449     4     0     0     0
  11
   417  0.85546039E-02     0   450     5     0     0     0
   417  0.11323919E-02     0   451     5     0     0     0
   417  0.10291979E-01     0   452     5     0     0     0
   417  0.10320197E-01     0   453     5     0     0     0
   417  0.82071620E+00     0   449     5     0     0     0
   417  0.22179740E-02     0   456     6     0     0     0
   417  0.22572096E-01     0   457     6     0     0     0
   417  0.23188440E-01     0   199   406     0     0     0
   417  0.38488485E-01     0   199   418     0     0     0
   417  0.19670522E-01     0   200   405     0     0     0
   417  0.42847134E-01     0   203   405     0     0     0
   9
   418  0.58470023E+00     0   449     6     0     0     0
   418  0.93235008E-01     0   454     5     0     0     0
   418  0.41469433E-02     0   455     5     0     0     0
   418  0.11875454E+00     0   200   406     0     0     0
   418  0.14705029E+00     0   203   406     0     0     0
   418  0.22304975E-02     0   450     6     0     0     0
   418  0.46396054E-01     0   451     6     0     0     0
   418  0.14604188E-02     0   452     6     0     0     0
   418  0.20260834E-02     0   453     6     0     0     0
   2
   419  0.11319939E-01     0   450     7     0     0     0
   419  0.98868018E+00     0   449     7     0     0     0
   2
   420  0.43759163E-01     0   450     8     0     0     0
   420  0.95624083E+00     0   449     8     0     0     0
   2
   421  0.11319939E-01     0   450     9     0     0     0
   421  0.98868018E+00     0   449     9     0     0     0
   2
   422  0.43759163E-01     0   450    10     0     0     0
   422  0.95624083E+00     0   449    10     0     0     0
  11
   423  0.85546039E-02     0   450    11     0     0     0
   423  0.11323919E-02     0   451    11     0     0     0
   423  0.10291979E-01     0   452    11     0     0     0
   423  0.10320197E-01     0   453    11     0     0     0
   423  0.82071620E+00     0   449    11     0     0     0
   423  0.22179740E-02     0   454    12     0     0     0
   423  0.22572096E-01     0   455    12     0     0     0
   423  0.23188440E-01     0   198   412     0     0     0
   423  0.38488485E-01     0   198   424     0     0     0
   423  0.19670522E-01     0   200   411     0     0     0
   423  0.42847134E-01     0   203   411     0     0     0
   9
   424  0.58470023E+00     0   449    12     0     0     0
   424  0.93235008E-01     0   456    11     0     0     0
   424  0.41469433E-02     0   457    11     0     0     0
   424  0.11875454E+00     0   200   412     0     0     0
   424  0.14705029E+00     0   203   412     0     0     0
   424  0.22304975E-02     0   450    12     0     0     0
   424  0.46396054E-01     0   451    12     0     0     0
   424  0.14604188E-02     0   452    12     0     0     0
   424  0.20260834E-02     0   453    12     0     0     0
   6
   425  0.91042027E-01     0   450   121     0     0     0
   425  0.30329144E+00     0   451   121     0     0     0
   425  0.32817621E-04     0   452   121     0     0     0
   425  0.32081512E-04     0   453   121     0     0     0
   425  0.60503662E+00     0   456   122     0     0     0
   425  0.56502206E-03     0   457   122     0     0     0
   5
   426  0.92001267E-01     0   450   122     0     0     0
   426  0.30208865E+00     0   451   122     0     0     0
   426  0.10990023E-03     0   452   122     0     0     0
   426  0.11914018E-03     0   453   122     0     0     0
   426  0.60568112E+00     0   454   121     0     0     0
   6
   427  0.91042027E-01     0   450   123     0     0     0
   427  0.30329144E+00     0   451   123     0     0     0
   427  0.32817621E-04     0   452   123     0     0     0
   427  0.32081512E-04     0   453   123     0     0     0
   427  0.60503662E+00     0   456   124     0     0     0
   427  0.56502206E-03     0   457   124     0     0     0
   5
   428  0.92001267E-01     0   450   124     0     0     0
   428  0.30208865E+00     0   451   124     0     0     0
   428  0.10990023E-03     0   452   124     0     0     0
   428  0.11914018E-03     0   453   124     0     0     0
   428  0.60568112E+00     0   454   123     0     0     0
   6
   429  0.73917598E+00     0   450   125     0     0     0
   429  0.75824221E-03     0   451   125     0     0     0
   429  0.63605949E-01     0   452   125     0     0     0
   429  0.63539483E-01     0   453   125     0     0     0
   429  0.15669301E-02     0   456   126     0     0     0
   429  0.13135344E+00     0   457   126     0     0     0
   8
   430  0.63709304E-01     0   450   126     0     0     0
   430  0.20910890E+00     0   451   126     0     0     0
   430  0.63031606E-04     0   452   126     0     0     0
   430  0.68325346E-04     0   453   126     0     0     0
   430  0.41955033E+00     0   454   125     0     0     0
   430  0.16662370E+00     0   455   125     0     0     0
   430  0.50316308E-01     0   198   429     0     0     0
   430  0.90560153E-01     0   206   429     0     0     0
   6
   431  0.91042027E-01     0   450   127     0     0     0
   431  0.30329144E+00     0   451   127     0     0     0
   431  0.32817621E-04     0   452   127     0     0     0
   431  0.32081512E-04     0   453   127     0     0     0
   431  0.60503662E+00     0   454   128     0     0     0
   431  0.56502206E-03     0   455   128     0     0     0
   5
   432  0.92001267E-01     0   450   128     0     0     0
   432  0.30208865E+00     0   451   128     0     0     0
   432  0.10990023E-03     0   452   128     0     0     0
   432  0.11914018E-03     0   453   128     0     0     0
   432  0.60568112E+00     0   456   127     0     0     0
   6
   433  0.91042027E-01     0   450   129     0     0     0
   433  0.30329144E+00     0   451   129     0     0     0
   433  0.32817621E-04     0   452   129     0     0     0
   433  0.32081512E-04     0   453   129     0     0     0
   433  0.60503662E+00     0   454   130     0     0     0
   433  0.56502206E-03     0   455   130     0     0     0
   5
   434  0.92001267E-01     0   450   130     0     0     0
   434  0.30208865E+00     0   451   130     0     0     0
   434  0.10990023E-03     0   452   130     0     0     0
   434  0.11914018E-03     0   453   130     0     0     0
   434  0.60568112E+00     0   456   129     0     0     0
   6
   435  0.73917598E+00     0   450   131     0     0     0
   435  0.75824221E-03     0   451   131     0     0     0
   435  0.63605949E-01     0   452   131     0     0     0
   435  0.63539483E-01     0   453   131     0     0     0
   435  0.15669301E-02     0   454   132     0     0     0
   435  0.13135344E+00     0   455   132     0     0     0
   8
   436  0.63709304E-01     0   450   132     0     0     0
   436  0.20910890E+00     0   451   132     0     0     0
   436  0.63031606E-04     0   452   132     0     0     0
   436  0.68325346E-04     0   453   132     0     0     0
   436  0.41955033E+00     0   456   131     0     0     0
   436  0.16662370E+00     0   457   131     0     0     0
   436  0.50316308E-01     0   199   435     0     0     0
   436  0.90560153E-01     0   207   435     0     0     0
   3
   437  0.99986190E+00     0   450   121     0     0     0
   437  0.62194827E-04     0   452   121     0     0     0
   437  0.75860291E-04     0   453   121     0     0     0
   0
   3
   439  0.99986190E+00     0   450   123     0     0     0
   439  0.62194827E-04     0   452   123     0     0     0
   439  0.75860291E-04     0   453   123     0     0     0
   0
  10
   441  0.63388817E-01     0   450   125     0     0     0
   441  0.21100886E+00     0   451   125     0     0     0
   441  0.83332717E-01     0   452   125     0     0     0
   441  0.83319455E-01     0   453   125     0     0     0
   441  0.42065442E+00     0   456   126     0     0     0
   441  0.47981902E-03     0   457   126     0     0     0
   441  0.25544574E-01     0   200   429     0     0     0
   441  0.19053524E-01     0   203   429     0     0     0
   441  0.47402039E-01     0   205   429     0     0     0
   441  0.45815617E-01     0   204   429     0     0     0
   0
   3
   443  0.99986190E+00     0   450   127     0     0     0
   443  0.62194827E-04     0   452   127     0     0     0
   443  0.75860291E-04     0   453   127     0     0     0
   0
   3
   445  0.99986190E+00     0   450   129     0     0     0
   445  0.62194827E-04     0   452   129     0     0     0
   445  0.75860291E-04     0   453   129     0     0     0
   0
  10
   447  0.63388817E-01     0   450   131     0     0     0
   447  0.21100886E+00     0   451   131     0     0     0
   447  0.83332717E-01     0   452   131     0     0     0
   447  0.83319455E-01     0   453   131     0     0     0
   447  0.42065442E+00     0   454   132     0     0     0
   447  0.47981902E-03     0   455   132     0     0     0
   447  0.25544574E-01     0   200   435     0     0     0
   447  0.19053524E-01     0   203   435     0     0     0
   447  0.47402039E-01     0   205   435     0     0     0
   447  0.45815617E-01     0   204   435     0     0     0
   0
  20
   449  0.10718162E-01     0   454     1     8     0     0
   449  0.10718162E-01     0   456     2     7     0     0
   449  0.10718162E-01     0   454     3    10     0     0
   449  0.10718162E-01     0   456     4     9     0     0
   449  0.20785104E+00     0   454     5    12     0     0
   449  0.20785104E+00     0   456     6    11     0     0
   449  0.13000748E-03     0   450    13     0     0     0
   449  0.50676158E-02     0   450     2     8     0     0
   449  0.14386751E-02     0   450     1     7     0     0
   449  0.14386751E-02     0   450     3     9     0     0
   449  0.50676158E-02     0   450     4    10     0     0
   449  0.63847519E-01     0   450     5    11     0     0
   449  0.10957833E+00     0   450     6    12     0     0
   449  0.86394191E-03     0   451    13     0     0     0
   449  0.53938334E-02     0   451     2     8     0     0
   449  0.53861495E-02     0   451     1     7     0     0
   449  0.53861495E-02     0   451     3     9     0     0
   449  0.53938334E-02     0   451     4    10     0     0
   449  0.32688561E+00     0   451     5    11     0     0
   449  0.55473284E-02     0   451     6    12     0     0
   0
   8
   451  0.99962962E+00     0   450   200     0     0     0
   451  0.25282503E-03     0   450     5    11     0     0
   451  0.11195119E-04     0   450   121   127     0     0
   451  0.11195119E-04     0   450   123   129     0     0
   451  0.38360406E-04     0   450   125   131     0     0
   451  0.11259408E-04     0   450   122   128     0     0
   451  0.11259408E-04     0   450   124   130     0     0
   451  0.34260924E-04     0   450   126   132     0     0
  17
   452  0.19908194E+00     0   454   199     0     0     0
   452  0.19908194E+00     0   456   198     0     0     0
   452  0.55813622E-02     0   454   207     0     0     0
   452  0.55813622E-02     0   456   206     0     0     0
   452  0.42112920E-01     0   450   200     0     0     0
   452  0.12493556E+00     0   451   200     0     0     0
   452  0.26394500E-04     0   450     5    11     0     0
   452  0.30631498E-04     0   450   125   131     0     0
   452  0.45342461E-03     0   451     5    11     0     0
   452  0.39692208E-01     0   450   203     0     0     0
   452  0.72476798E-03     0   450   204     0     0     0
   452  0.16431400E-02     0   450   205     0     0     0
   452  0.12209888E+00     0   451   203     0     0     0
   452  0.96719764E-03     0   451   204     0     0     0
   452  0.57423310E-02     0   451   205     0     0     0
   452  0.12612303E+00     0   406    12     0     0     0
   452  0.12612303E+00     0   412     6     0     0     0
  17
   453  0.23227146E+00     0   454   199     0     0     0
   453  0.23227146E+00     0   456   198     0     0     0
   453  0.45061731E-02     0   454   207     0     0     0
   453  0.45061731E-02     0   456   206     0     0     0
   453  0.27749671E-01     0   450   200     0     0     0
   453  0.96017577E-01     0   451   200     0     0     0
   453  0.21257667E-04     0   450     5    11     0     0
   453  0.24623772E-04     0   450   125   131     0     0
   453  0.36484035E-03     0   451     5    11     0     0
   453  0.32574840E-01     0   450   203     0     0     0
   453  0.11782111E-02     0   450   204     0     0     0
   453  0.68365503E-03     0   450   205     0     0     0
   453  0.11316951E+00     0   451   203     0     0     0
   453  0.40235617E-02     0   451   204     0     0     0
   453  0.10262505E-02     0   451   205     0     0     0
   453  0.12480532E+00     0   406    12     0     0     0
   453  0.12480532E+00     0   412     6     0     0     0
   1
   454  0.99999994E+00     0   450   198     0     0     0
  10
   455  0.25595940E-04     0   450   131   126     0     0
   455  0.63892983E-01     0   450   198     0     0     0
   455  0.15127608E-02     0   450   206     0     0     0
   455  0.23324512E+00     0   451   198     0     0     0
   455  0.38097580E-02     0   451   206     0     0     0
   455  0.23848139E+00     0   406    11     0     0     0
   455  0.22037798E+00     0   454   200     0     0     0
   455  0.22962222E+00     0   454   203     0     0     0
   455  0.40868735E-02     0   454   204     0     0     0
   455  0.49452889E-02     0   454   205     0     0     0
   1
   456  0.99999994E+00     0   450   199     0     0     0
  10
   457  0.25595940E-04     0   450   125   132     0     0
   457  0.63892983E-01     0   450   199     0     0     0
   457  0.15127608E-02     0   450   207     0     0     0
   457  0.23324512E+00     0   451   199     0     0     0
   457  0.38097580E-02     0   451   207     0     0     0
   457  0.23848139E+00     0   412     5     0     0     0
   457  0.22037798E+00     0   456   200     0     0     0
   457  0.22962222E+00     0   456   203     0     0     0
   457  0.40868735E-02     0   456   204     0     0     0
   457  0.49452889E-02     0   456   205     0     0     0
  28
   203  0.17011784E-03     0   123   129     0     0     0
   203  0.48668161E-01     0   125   131     0     0     0
   203  0.20400616E-02     0     3     9     0     0     0
   203  0.65874708E+00     0     5    11     0     0     0
   203  0.29828317E-01     0     4    10     0     0     0
   203  0.21243235E-02     0    59    59     0     0     0
   203  0.40628769E-01     0    13    13     0     0     0
   203  0.10810613E-01     0   198   121   128     0     0
   203  0.10810613E-01     0   198   123   130     0     0
   203  0.10810613E-01     0   198   125   132     0     0
   203  0.32431841E-01     0   198     8     1     0     0
   203  0.32431841E-01     0   198    10     3     0     0
   203  0.10810613E-01     0   199   127   122     0     0
   203  0.10810613E-01     0   199   129   124     0     0
   203  0.10810613E-01     0   199   131   126     0     0
   203  0.32431841E-01     0   199     2     7     0     0
   203  0.32431841E-01     0   199     4     9     0     0
   203  0.15868049E-02     0   200   122   128     0     0
   203  0.15868049E-02     0   200   124   130     0     0
   203  0.15868049E-02     0   200   126   132     0     0
   203  0.79862302E-03     0   200   121   127     0     0
   203  0.79862302E-03     0   200   123   129     0     0
   203  0.79862302E-03     0   200   125   131     0     0
   203  0.27360143E-02     0   200     2     8     0     0
   203  0.27360143E-02     0   200     4    10     0     0
   203  0.35246608E-02     0   200     1     7     0     0
   203  0.35246608E-02     0   200     3     9     0     0
   203  0.35246608E-02     0   200     5    11     0     0
  10
   204  0.54380781E-03     0   123   129     0     0     0
   204  0.15575458E+00     0   125   131     0     0     0
   204  0.15650128E-04     0     1     7     0     0     0
   204  0.63234442E-02     0     3     9     0     0     0
   204  0.83633822E+00     0     5    11     0     0     0
   204  0.50445739E-03     0     6    12     0     0     0
   204  0.13135745E-04     0   450   450     0     0     0
   204  0.84725296E-04     0   450   451     0     0     0
   204  0.13629951E-03     0   451   451     0     0     0
   204  0.28578570E-03     0   454   456     0     0     0
  10
   205  0.54377865E-03     0   123   129     0     0     0
   205  0.15574643E+00     0   125   131     0     0     0
   205  0.15649981E-04     0     1     7     0     0     0
   205  0.63233851E-02     0     3     9     0     0     0
   205  0.83633417E+00     0     5    11     0     0     0
   205  0.50829648E-03     0     6    12     0     0     0
   205  0.13123536E-04     0   450   450     0     0     0
   205  0.85085085E-04     0   450   451     0     0     0
   205  0.13820884E-03     0   451   451     0     0     0
   205  0.29193718E-03     0   454   456     0     0     0
   6
   206  0.58306352E-03     0   124   129     0     0     0
   206  0.16699821E+00     0   126   131     0     0     0
   206  0.15549949E-04     0     2     7     0     0     0
   206  0.62829726E-02     0     4     9     0     0     0
   206  0.82593453E+00     0     6    11     0     0     0
   206  0.18569169E-03     0   454   450     0     0     0
   6
   207  0.58306352E-03     0   130   123     0     0     0
   207  0.16699821E+00     0   132   125     0     0     0
   207  0.15549949E-04     0     8     1     0     0     0
   207  0.62829726E-02     0    10     3     0     0     0
   207  0.82593453E+00     0    12     5     0     0     0
   207  0.18569169E-03     0   456   450     0     0     0
   0
   5
     6  0.33333334E+00   100     2     7     5     0     0
     6  0.33333334E+00   100     4     9     5     0     0
     6  0.11111111E+00   100   122   127     5     0     0
     6  0.11111111E+00   100   124   129     5     0     0
     6  0.11111111E+00   100   126   131     5     0     0
   5
    12  0.33333334E+00   100     8     1    11     0     0
    12  0.33333334E+00   100    10     3    11     0     0
    12  0.11111111E+00   100   128   121    11     0     0
    12  0.11111111E+00   100   130   123    11     0     0
    12  0.11111111E+00   100   132   125    11     0     0
     50.40000153     -0.01986978
      0.99991232     -0.00145329      0.01314372      0.00065098
      0.00176321      0.99972022     -0.02358584     -0.00026387
     -0.00880720      0.01650534      0.70685327     -0.70711273
      0.00972718     -0.01687995     -0.70684439     -0.70710063
     -0.99999624      0.00274221     -0.00274221     -0.99999624
     -0.99941587      0.03417546     -0.03417546     -0.99941587
     -1.40653610     -0.16874178     -1.56141376
  -6419.07080078  -6543.17333984  -8779.39746094
   3317.47412109
    T
