  65
  401    403.8563    0.80366E-25
  402    396.8215    0.86058E-25
  403    403.8563    0.80367E-25
  404    396.8238    0.86063E-25
  405   2000.1373    0.59316E-26
  406   2004.0999    0.41283E-26
  407    403.8563    0.80366E-25
  408    396.8215    0.86058E-25
  409    403.8563    0.80367E-25
  410    396.8238    0.86063E-25
  411   2000.1373    0.59316E-26
  412   2004.0999    0.41283E-26
  413   2000.1418    0.59467E-26
  414   1999.7164    0.57722E-26
  415   2000.1418    0.59467E-26
  416   1999.7168    0.57722E-26
  417   2000.7828    0.41699E-26
  418   2004.4734    0.42050E-26
  419   2000.1418    0.59467E-26
  420   1999.7164    0.57722E-26
  421   2000.1418    0.59467E-26
  422   1999.7168    0.57722E-26
  423   2000.7828    0.41699E-26
  424   2004.4734    0.42050E-26
  425    156.4146    0.11888E-22
  426    137.2332    0.14413E-22
  427    156.4147    0.11888E-22
  428    137.2332    0.14413E-22
  429   2000.4075    0.64327E-25
  430   1999.0830    0.24197E-25
  431    156.4146    0.11888E-22
  432    137.2332    0.14413E-22
  433    156.4147    0.11888E-22
  434    137.2332    0.14413E-22
  435   2000.4075    0.64327E-25
  436   1999.0830    0.24197E-25
  437   2000.4253    0.65100E-25
  438      0.0000    0.10000E+31
  439   2000.4253    0.65100E-25
  440      0.0000    0.10000E+31
  441   2000.5106    0.24234E-25
  442      0.0000    0.10000E+31
  443   2000.4253    0.65100E-25
  444      0.0000    0.10000E+31
  445   2000.4253    0.65100E-25
  446      0.0000    0.10000E+31
  447   2000.5106    0.24234E-25
  448      0.0000    0.10000E+31
  449    300.0000    0.14885E-20
  450     99.9443    0.10000E+31
  451    199.7935    0.10126E-23
  452   -453.5260    0.19487E-24
  453    472.5786    0.16462E-24
  454    199.1624    0.98357E-24
  455    471.3311    0.16328E-24
  456    199.1624    0.98357E-24
  457    471.3311    0.16328E-24
  203    105.4010    0.17893E-21
  204   1007.6904    0.55694E-25
  205   1000.0000    0.56476E-25
  206   1007.8588    0.58559E-25
  207   1007.8588    0.58559E-25
  458      0.0000    0.10000E+31
    6    172.5000    0.57395E-24
   12    172.5000    0.57395E-24
   4
   401  0.10169744E-01     0   450     1     0     0     0
   401  0.10605860E+00     0   451     1     0     0     0
   401  0.67062575E+00     0   449     1     0     0     0
   401  0.21314599E+00     0   456     2     0     0     0
   4
   402  0.30967179E-02     0   450     2     0     0     0
   402  0.11635304E+00     0   451     2     0     0     0
   402  0.64611983E+00     0   449     2     0     0     0
   402  0.23443036E+00     0   454     1     0     0     0
   4
   403  0.10169826E-01     0   450     3     0     0     0
   403  0.10605945E+00     0   451     3     0     0     0
   403  0.67063135E+00     0   449     3     0     0     0
   403  0.21313941E+00     0   456     4     0     0     0
   4
   404  0.30968401E-02     0   450     4     0     0     0
   404  0.11635660E+00     0   451     4     0     0     0
   404  0.64609927E+00     0   449     4     0     0     0
   404  0.23444724E+00     0   454     3     0     0     0
   7
   405  0.99626733E-02     0   450     5     0     0     0
   405  0.14040581E-03     0   451     5     0     0     0
   405  0.64541021E-03     0   452     5     0     0     0
   405  0.66003646E-03     0   453     5     0     0     0
   405  0.98732668E+00     0   449     5     0     0     0
   405  0.14262753E-03     0   456     6     0     0     0
   405  0.11221718E-02     0   457     6     0     0     0
   7
   406  0.67789841E+00     0   449     6     0     0     0
   406  0.27698506E-01     0   450     6     0     0     0
   406  0.32254262E-02     0   451     6     0     0     0
   406  0.73832832E-01     0   452     6     0     0     0
   406  0.69383129E-01     0   453     6     0     0     0
   406  0.66318922E-02     0   454     5     0     0     0
   406  0.14132981E+00     0   455     5     0     0     0
   4
   407  0.10169744E-01     0   450     7     0     0     0
   407  0.10605860E+00     0   451     7     0     0     0
   407  0.67062575E+00     0   449     7     0     0     0
   407  0.21314599E+00     0   454     8     0     0     0
   4
   408  0.30967179E-02     0   450     8     0     0     0
   408  0.11635304E+00     0   451     8     0     0     0
   408  0.64611983E+00     0   449     8     0     0     0
   408  0.23443036E+00     0   456     7     0     0     0
   4
   409  0.10169826E-01     0   450     9     0     0     0
   409  0.10605945E+00     0   451     9     0     0     0
   409  0.67063135E+00     0   449     9     0     0     0
   409  0.21313941E+00     0   454    10     0     0     0
   4
   410  0.30968401E-02     0   450    10     0     0     0
   410  0.11635660E+00     0   451    10     0     0     0
   410  0.64609927E+00     0   449    10     0     0     0
   410  0.23444724E+00     0   456     9     0     0     0
   7
   411  0.99626733E-02     0   450    11     0     0     0
   411  0.14040581E-03     0   451    11     0     0     0
   411  0.64541021E-03     0   452    11     0     0     0
   411  0.66003646E-03     0   453    11     0     0     0
   411  0.98732668E+00     0   449    11     0     0     0
   411  0.14262753E-03     0   454    12     0     0     0
   411  0.11221718E-02     0   455    12     0     0     0
   7
   412  0.67789841E+00     0   449    12     0     0     0
   412  0.27698506E-01     0   450    12     0     0     0
   412  0.32254262E-02     0   451    12     0     0     0
   412  0.73832832E-01     0   452    12     0     0     0
   412  0.69383129E-01     0   453    12     0     0     0
   412  0.66318922E-02     0   456    11     0     0     0
   412  0.14132981E+00     0   457    11     0     0     0
   5
   413  0.99694552E-02     0   450     1     0     0     0
   413  0.73094350E-04     0   451     1     0     0     0
   413  0.15567368E-04     0   452     1     0     0     0
   413  0.90097172E-04     0   453     1     0     0     0
   413  0.98985177E+00     0   449     1     0     0     0
   5
   414  0.38699515E-01     0   450     2     0     0     0
   414  0.28373647E-03     0   451     2     0     0     0
   414  0.60426890E-04     0   452     2     0     0     0
   414  0.34972312E-03     0   453     2     0     0     0
   414  0.96060658E+00     0   449     2     0     0     0
   5
   415  0.99694552E-02     0   450     3     0     0     0
   415  0.73094350E-04     0   451     3     0     0     0
   415  0.15567368E-04     0   452     3     0     0     0
   415  0.90097172E-04     0   453     3     0     0     0
   415  0.98985177E+00     0   449     3     0     0     0
   5
   416  0.38699519E-01     0   450     4     0     0     0
   416  0.28373650E-03     0   451     4     0     0     0
   416  0.60426886E-04     0   452     4     0     0     0
   416  0.34972312E-03     0   453     4     0     0     0
   416  0.96060663E+00     0   449     4     0     0     0
   7
   417  0.29647802E-02     0   450     5     0     0     0
   417  0.46892315E-01     0   451     5     0     0     0
   417  0.67693193E-03     0   452     5     0     0     0
   417  0.40797843E-02     0   453     5     0     0     0
   417  0.69431710E+00     0   449     5     0     0     0
   417  0.98086186E-01     0   456     6     0     0     0
   417  0.15298298E+00     0   457     6     0     0     0
   7
   418  0.69062394E+00     0   449     6     0     0     0
   418  0.10145773E+00     0   454     5     0     0     0
   418  0.47564832E-02     0   455     5     0     0     0
   418  0.13032691E-02     0   450     6     0     0     0
   418  0.52380390E-01     0   451     6     0     0     0
   418  0.75444892E-01     0   452     6     0     0     0
   418  0.74033275E-01     0   453     6     0     0     0
   5
   419  0.99694552E-02     0   450     7     0     0     0
   419  0.73094350E-04     0   451     7     0     0     0
   419  0.15567368E-04     0   452     7     0     0     0
   419  0.90097172E-04     0   453     7     0     0     0
   419  0.98985177E+00     0   449     7     0     0     0
   5
   420  0.38699515E-01     0   450     8     0     0     0
   420  0.28373647E-03     0   451     8     0     0     0
   420  0.60426890E-04     0   452     8     0     0     0
   420  0.34972312E-03     0   453     8     0     0     0
   420  0.96060658E+00     0   449     8     0     0     0
   5
   421  0.99694552E-02     0   450     9     0     0     0
   421  0.73094350E-04     0   451     9     0     0     0
   421  0.15567368E-04     0   452     9     0     0     0
   421  0.90097172E-04     0   453     9     0     0     0
   421  0.98985177E+00     0   449     9     0     0     0
   5
   422  0.38699519E-01     0   450    10     0     0     0
   422  0.28373650E-03     0   451    10     0     0     0
   422  0.60426886E-04     0   452    10     0     0     0
   422  0.34972312E-03     0   453    10     0     0     0
   422  0.96060663E+00     0   449    10     0     0     0
   7
   423  0.29647802E-02     0   450    11     0     0     0
   423  0.46892315E-01     0   451    11     0     0     0
   423  0.67693193E-03     0   452    11     0     0     0
   423  0.40797843E-02     0   453    11     0     0     0
   423  0.69431710E+00     0   449    11     0     0     0
   423  0.98086186E-01     0   454    12     0     0     0
   423  0.15298298E+00     0   455    12     0     0     0
   7
   424  0.69062394E+00     0   449    12     0     0     0
   424  0.10145773E+00     0   456    11     0     0     0
   424  0.47564832E-02     0   457    11     0     0     0
   424  0.13032691E-02     0   450    12     0     0     0
   424  0.52380390E-01     0   451    12     0     0     0
   424  0.75444892E-01     0   452    12     0     0     0
   424  0.74033275E-01     0   453    12     0     0     0
   1
   425  0.10000000E+01     0   450   121     0     0     0
   1
   426  0.10000000E+01     0   450   122     0     0     0
   1
   427  0.10000000E+01     0   450   123     0     0     0
   1
   428  0.10000000E+01     0   450   124     0     0     0
   6
   429  0.97078967E+00     0   450   125     0     0     0
   429  0.74293041E-02     0   451   125     0     0     0
   429  0.44267341E-02     0   452   125     0     0     0
   429  0.11410070E-01     0   453   125     0     0     0
   429  0.66945597E-03     0   456   126     0     0     0
   429  0.52747726E-02     0   457   126     0     0     0
   6
   430  0.11033828E+00     0   450   126     0     0     0
   430  0.25392741E+00     0   451   126     0     0     0
   430  0.20097133E-02     0   452   126     0     0     0
   430  0.27264286E-01     0   453   126     0     0     0
   430  0.58185899E+00     0   454   125     0     0     0
   430  0.24601355E-01     0   455   125     0     0     0
   1
   431  0.10000000E+01     0   450   127     0     0     0
   1
   432  0.10000000E+01     0   450   128     0     0     0
   1
   433  0.10000000E+01     0   450   129     0     0     0
   1
   434  0.10000000E+01     0   450   130     0     0     0
   6
   435  0.97078967E+00     0   450   131     0     0     0
   435  0.74293041E-02     0   451   131     0     0     0
   435  0.44267341E-02     0   452   131     0     0     0
   435  0.11410070E-01     0   453   131     0     0     0
   435  0.66945597E-03     0   454   132     0     0     0
   435  0.52747726E-02     0   455   132     0     0     0
   6
   436  0.11033828E+00     0   450   132     0     0     0
   436  0.25392741E+00     0   451   132     0     0     0
   436  0.20097133E-02     0   452   132     0     0     0
   436  0.27264286E-01     0   453   132     0     0     0
   436  0.58185899E+00     0   456   131     0     0     0
   436  0.24601355E-01     0   457   131     0     0     0
   4
   437  0.98238480E+00     0   450   121     0     0     0
   437  0.72027100E-02     0   451   121     0     0     0
   437  0.15340451E-02     0   452   121     0     0     0
   437  0.88784127E-02     0   453   121     0     0     0
   0
   4
   439  0.98238480E+00     0   450   123     0     0     0
   439  0.72027100E-02     0   451   123     0     0     0
   439  0.15340451E-02     0   452   123     0     0     0
   439  0.88784127E-02     0   453   123     0     0     0
   0
   6
   441  0.74125051E-01     0   450   125     0     0     0
   441  0.30954331E+00     0   451   125     0     0     0
   441  0.15371999E-02     0   452   125     0     0     0
   441  0.12621483E-01     0   453   125     0     0     0
   441  0.54490918E+00     0   456   126     0     0     0
   441  0.57263754E-01     0   457   126     0     0     0
   0
   4
   443  0.98238480E+00     0   450   127     0     0     0
   443  0.72027100E-02     0   451   127     0     0     0
   443  0.15340451E-02     0   452   127     0     0     0
   443  0.88784127E-02     0   453   127     0     0     0
   0
   4
   445  0.98238480E+00     0   450   129     0     0     0
   445  0.72027100E-02     0   451   129     0     0     0
   445  0.15340451E-02     0   452   129     0     0     0
   445  0.88784127E-02     0   453   129     0     0     0
   0
   6
   447  0.74125051E-01     0   450   131     0     0     0
   447  0.30954331E+00     0   451   131     0     0     0
   447  0.15371999E-02     0   452   131     0     0     0
   447  0.12621483E-01     0   453   131     0     0     0
   447  0.54490918E+00     0   454   132     0     0     0
   447  0.57263754E-01     0   455   132     0     0     0
   0
  15
   449  0.14959441E+00     0   454     1     8     0     0
   449  0.14959441E+00     0   456     2     7     0     0
   449  0.14959122E+00     0   454     3    10     0     0
   449  0.14959122E+00     0   456     4     9     0     0
   449  0.16417984E-02     0   450    13     0     0     0
   449  0.13383734E-01     0   450     2     8     0     0
   449  0.40629726E-01     0   450     1     7     0     0
   449  0.40629704E-01     0   450     3     9     0     0
   449  0.13383295E-01     0   450     4    10     0     0
   449  0.11824258E-03     0   450     5    11     0     0
   449  0.79639621E-01     0   451     2     8     0     0
   449  0.66262983E-01     0   451     1     7     0     0
   449  0.66262946E-01     0   451     3     9     0     0
   449  0.79636469E-01     0   451     4    10     0     0
   449  0.40208688E-04     0   451     5    11     0     0
   0
   9
   451  0.53317810E-03     0   450   200     0     0     0
   451  0.98706618E-01     0   425   127     0     0     0
   451  0.98706618E-01     0   431   121     0     0     0
   451  0.98706268E-01     0   427   129     0     0     0
   451  0.98706268E-01     0   433   123     0     0     0
   451  0.15116027E+00     0   426   128     0     0     0
   451  0.15116027E+00     0   432   122     0     0     0
   451  0.15116027E+00     0   428   130     0     0     0
   451  0.15116027E+00     0   434   124     0     0     0
  22
   452  0.30579662E+00     0   454   199     0     0     0
   452  0.30579662E+00     0   456   198     0     0     0
   452  0.10125216E+00     0   450   200     0     0     0
   452  0.25137842E+00     0   451   200     0     0     0
   452  0.13829816E-01     0   450   203     0     0     0
   452  0.12554961E-01     0   451   203     0     0     0
   452  0.13998398E-03     0   402     8     0     0     0
   452  0.13998398E-03     0   408     2     0     0     0
   452  0.17754141E-03     0   401     7     0     0     0
   452  0.17754141E-03     0   407     1     0     0     0
   452  0.17753991E-03     0   403     9     0     0     0
   452  0.17753991E-03     0   409     3     0     0     0
   452  0.13993889E-03     0   404    10     0     0     0
   452  0.13993889E-03     0   410     4     0     0     0
   452  0.34629833E-03     0   425   127     0     0     0
   452  0.34629833E-03     0   431   121     0     0     0
   452  0.34629827E-03     0   427   129     0     0     0
   452  0.34629827E-03     0   433   123     0     0     0
   452  0.16840327E-02     0   426   128     0     0     0
   452  0.16840327E-02     0   432   122     0     0     0
   452  0.16840327E-02     0   428   130     0     0     0
   452  0.16840327E-02     0   434   124     0     0     0
  22
   453  0.28528565E+00     0   454   199     0     0     0
   453  0.28528565E+00     0   456   198     0     0     0
   453  0.13716199E-01     0   450   200     0     0     0
   453  0.14849618E-01     0   451   200     0     0     0
   453  0.71399607E-01     0   450   203     0     0     0
   453  0.18185833E+00     0   451   203     0     0     0
   453  0.37869266E-02     0   402     8     0     0     0
   453  0.37869266E-02     0   408     2     0     0     0
   453  0.41948496E-02     0   401     7     0     0     0
   453  0.41948496E-02     0   407     1     0     0     0
   453  0.41948310E-02     0   403     9     0     0     0
   453  0.41948310E-02     0   409     3     0     0     0
   453  0.37862167E-02     0   404    10     0     0     0
   453  0.37862167E-02     0   410     4     0     0     0
   453  0.82967328E-02     0   425   127     0     0     0
   453  0.82967328E-02     0   431   121     0     0     0
   453  0.82967319E-02     0   427   129     0     0     0
   453  0.82967319E-02     0   433   123     0     0     0
   453  0.20623097E-01     0   426   128     0     0     0
   453  0.20623097E-01     0   432   122     0     0     0
   453  0.20623097E-01     0   428   130     0     0     0
   453  0.20623097E-01     0   434   124     0     0     0
   5
   454  0.73759002E-02     0   450   198     0     0     0
   454  0.33139688E+00     0   426   127     0     0     0
   454  0.33139655E+00     0   428   129     0     0     0
   454  0.16491541E+00     0   431   122     0     0     0
   454  0.16491522E+00     0   433   124     0     0     0
  12
   455  0.59552144E-01     0   450   198     0     0     0
   455  0.30598882E+00     0   451   198     0     0     0
   455  0.51297699E-02     0   402     7     0     0     0
   455  0.10800647E-01     0   407     2     0     0     0
   455  0.51294668E-02     0   404     9     0     0     0
   455  0.12956765E-01     0   409     4     0     0     0
   455  0.16893551E-01     0   426   127     0     0     0
   455  0.16893551E-01     0   428   129     0     0     0
   455  0.40346082E-01     0   431   122     0     0     0
   455  0.40346079E-01     0   433   124     0     0     0
   455  0.27297804E+00     0   454   200     0     0     0
   455  0.21298505E+00     0   454   203     0     0     0
   5
   456  0.73759002E-02     0   450   199     0     0     0
   456  0.33139688E+00     0   432   121     0     0     0
   456  0.33139655E+00     0   434   123     0     0     0
   456  0.16491541E+00     0   425   128     0     0     0
   456  0.16491522E+00     0   427   130     0     0     0
  12
   457  0.59552144E-01     0   450   199     0     0     0
   457  0.30598882E+00     0   451   199     0     0     0
   457  0.51297699E-02     0   408     1     0     0     0
   457  0.10800647E-01     0   401     8     0     0     0
   457  0.51294668E-02     0   410     3     0     0     0
   457  0.12956765E-01     0   403    10     0     0     0
   457  0.16893551E-01     0   432   121     0     0     0
   457  0.16893551E-01     0   434   123     0     0     0
   457  0.40346082E-01     0   425   128     0     0     0
   457  0.40346079E-01     0   427   130     0     0     0
   457  0.27297804E+00     0   456   200     0     0     0
   457  0.21298505E+00     0   456   203     0     0     0
  28
   203  0.21320753E-03     0   123   129     0     0     0
   203  0.60962152E-01     0   125   131     0     0     0
   203  0.25642517E-02     0     3     9     0     0     0
   203  0.85103440E+00     0     5    11     0     0     0
   203  0.37273996E-01     0     4    10     0     0     0
   203  0.14857594E-02     0    59    59     0     0     0
   203  0.33330906E-01     0    13    13     0     0     0
   203  0.70836599E-03     0   198   121   128     0     0
   203  0.70836599E-03     0   198   123   130     0     0
   203  0.70836599E-03     0   198   125   132     0     0
   203  0.21250981E-02     0   198     8     1     0     0
   203  0.21250981E-02     0   198    10     3     0     0
   203  0.70836599E-03     0   199   127   122     0     0
   203  0.70836599E-03     0   199   129   124     0     0
   203  0.70836599E-03     0   199   131   126     0     0
   203  0.21250981E-02     0   199     2     7     0     0
   203  0.21250981E-02     0   199     4     9     0     0
   203  0.26316449E-04     0   200   122   128     0     0
   203  0.26316449E-04     0   200   124   130     0     0
   203  0.26316449E-04     0   200   126   132     0     0
   203  0.13244804E-04     0   200   121   127     0     0
   203  0.13244804E-04     0   200   123   129     0     0
   203  0.13244804E-04     0   200   125   131     0     0
   203  0.45375578E-04     0   200     2     8     0     0
   203  0.45375578E-04     0   200     4    10     0     0
   203  0.58454920E-04     0   200     1     7     0     0
   203  0.58454920E-04     0   200     3     9     0     0
   203  0.58454920E-04     0   200     5    11     0     0
  30
   204  0.27971086E-02     0   125   131     0     0     0
   204  0.11448648E-03     0     3     9     0     0     0
   204  0.28229000E-01     0     5    11     0     0     0
   204  0.23654337E+00     0     6    12     0     0     0
   204  0.14281471E-03     0    13    13     0     0     0
   204  0.57194923E-03     0   198   199     0     0     0
   204  0.29039424E-03     0   200   200     0     0     0
   204  0.23724742E-02     0   450   450     0     0     0
   204  0.12143734E-01     0   450   451     0     0     0
   204  0.62304795E-01     0   450   452     0     0     0
   204  0.12104012E-01     0   450   453     0     0     0
   204  0.14884033E-01     0   451   451     0     0     0
   204  0.14550264E+00     0   451   452     0     0     0
   204  0.20768769E-01     0   451   453     0     0     0
   204  0.31258806E-03     0   452   452     0     0     0
   204  0.13519467E-01     0   452   453     0     0     0
   204  0.67697203E-03     0   453   453     0     0     0
   204  0.37029374E-01     0   454   456     0     0     0
   204  0.36894003E-03     0   455   457     0     0     0
   204  0.20197266E+00     0   454   457     0     0     0
   204  0.20197266E+00     0   456   455     0     0     0
   204  0.24101003E-02     0   203   203     0     0     0
   204  0.11923069E-03     0   425   431     0     0     0
   204  0.11922087E-03     0   427   433     0     0     0
   204  0.38498800E-03     0   402   408     0     0     0
   204  0.38472563E-03     0   404   410     0     0     0
   204  0.55961835E-03     0   401   407     0     0     0
   204  0.55972283E-03     0   403   409     0     0     0
   204  0.42007407E-03     0   426   432     0     0     0
   204  0.42007407E-03     0   428   434     0     0     0
  20
   205  0.28213107E-02     0   125   131     0     0     0
   205  0.11548300E-03     0     3     9     0     0     0
   205  0.28501743E-01     0     5    11     0     0     0
   205  0.25511074E+00     0     6    12     0     0     0
   205  0.14898849E-03     0    13    13     0     0     0
   205  0.39213290E-02     0   450   450     0     0     0
   205  0.23161640E-01     0   450   451     0     0     0
   205  0.16788771E-01     0   450   452     0     0     0
   205  0.47845595E-01     0   450   453     0     0     0
   205  0.33635281E-01     0   451   451     0     0     0
   205  0.29818559E-01     0   451   452     0     0     0
   205  0.10674313E+00     0   451   453     0     0     0
   205  0.56557293E-03     0   452   452     0     0     0
   205  0.10163633E-02     0   452   453     0     0     0
   205  0.15545130E-01     0   453   453     0     0     0
   205  0.82175158E-01     0   454   456     0     0     0
   205  0.16595367E-01     0   455   457     0     0     0
   205  0.16746381E+00     0   454   457     0     0     0
   205  0.16746381E+00     0   456   455     0     0     0
   205  0.56223845E-03     0   203   200     0     0     0
  17
   206  0.10293808E-04     0   124   129     0     0     0
   206  0.29482860E-02     0   126   131     0     0     0
   206  0.11575496E-03     0     4     9     0     0     0
   206  0.23928188E+00     0     6    11     0     0     0
   206  0.32194342E-01     0   454   450     0     0     0
   206  0.29246186E-03     0   454   451     0     0     0
   206  0.21297257E+00     0   454   452     0     0     0
   206  0.20914827E+00     0   454   453     0     0     0
   206  0.40806912E-01     0   455   450     0     0     0
   206  0.24906135E+00     0   455   451     0     0     0
   206  0.87781725E-02     0   455   452     0     0     0
   206  0.83973381E-03     0   455   453     0     0     0
   206  0.59294666E-03     0   203   198     0     0     0
   206  0.96968462E-03     0   402   407     0     0     0
   206  0.96928893E-03     0   404   409     0     0     0
   206  0.50902495E-03     0   431   426     0     0     0
   206  0.50901010E-03     0   433   428     0     0     0
  17
   207  0.10293808E-04     0   130   123     0     0     0
   207  0.29482860E-02     0   132   125     0     0     0
   207  0.11575496E-03     0    10     3     0     0     0
   207  0.23928188E+00     0    12     5     0     0     0
   207  0.32194342E-01     0   456   450     0     0     0
   207  0.29246186E-03     0   456   451     0     0     0
   207  0.21297257E+00     0   456   452     0     0     0
   207  0.20914827E+00     0   456   453     0     0     0
   207  0.40806912E-01     0   457   450     0     0     0
   207  0.24906135E+00     0   457   451     0     0     0
   207  0.87781725E-02     0   457   452     0     0     0
   207  0.83973381E-03     0   457   453     0     0     0
   207  0.59294666E-03     0   203   199     0     0     0
   207  0.96968462E-03     0   408   401     0     0     0
   207  0.96928893E-03     0   410   403     0     0     0
   207  0.50902495E-03     0   425   432     0     0     0
   207  0.50901010E-03     0   427   434     0     0     0
   0
   5
     6  0.33333334E+00   100     2     7     5     0     0
     6  0.33333334E+00   100     4     9     5     0     0
     6  0.11111111E+00   100   122   127     5     0     0
     6  0.11111111E+00   100   124   129     5     0     0
     6  0.11111111E+00   100   126   131     5     0     0
   5
    12  0.33333334E+00   100     8     1    11     0     0
    12  0.33333334E+00   100    10     3    11     0     0
    12  0.11111111E+00   100   128   121    11     0     0
    12  0.11111111E+00   100   130   123    11     0     0
    12  0.11111111E+00   100   132   125    11     0     0
      4.00000000     -0.24957114
      0.99050856     -0.05432416      0.11525794     -0.05155066
     -0.08545429     -0.96212214      0.21956412     -0.13715105
     -0.04115928      0.06235380      0.70052958      0.70970184
     -0.09948091      0.25977319      0.66915327     -0.68909770
     -0.97929603      0.20243336     -0.20243336     -0.97929603
     -0.94682342      0.32175359     -0.32175359     -0.94682342
      1.57075787     -1.57079613     -1.57079518
    112.50000000   1800.00000000   1800.00000000
    450.00000000
    T
