#  ISAJET SUSY parameters in SUSY Les Houches Accord 2 format
#  Created by ISALHA 2.0 Last revision: C. Balazs 21 Apr 2009
Block SPINFO   # Program information
     1   ISASUGRA from ISAJET          # Spectrum Calculator
     2   7.80   29-OCT-2009 12:50:36   # Version number
Block MODSEL   # Model selection
     1     1   # Minimal supergravity (mSUGRA) model               
Block SMINPUTS   # Standard Model inputs
     1     1.27843811E+02   # alpha_em^(-1)
     2     1.16570000E-05   # G_Fermi
     3     1.17200002E-01   # alpha_s(M_Z)
     4     9.11699982E+01   # m_{Z}(pole)
     5     4.19999981E+00   # m_{b}(m_{b})
     6     1.72500000E+02   # m_{top}(pole)
     7     1.77699995E+00   # m_{tau}(pole)
Block MINPAR   # SUSY breaking input parameters
     1     9.20000000E+02   # m_0
     2     2.80000000E+02   # m_{1/2}
     3     4.00000000E+01   # tan(beta)
     4     1.00000000E+00   # sign(mu)
     5     0.00000000E+00   # A_0
Block EXTPAR   # Non-universal SUSY breaking parameters
     0     2.29814895E+16   # Input scale
Block MASS   # Scalar and gaugino mass spectrum
#  PDG code   mass                 particle
        24     8.04229965E+01   #  W^+
        25     1.12273033E+02   #  h^0            
        35     7.08618591E+02   #  H^0            
        36     7.03970215E+02   #  A^0            
        37     7.13916809E+02   #  H^+            
   1000001     1.09419202E+03   #  dnl            
   1000002     1.09121399E+03   #  upl            
   1000003     1.09419202E+03   #  stl            
   1000004     1.09121484E+03   #  chl            
   1000005     8.65440918E+02   #  b1             
   1000006     7.18471802E+02   #  t1             
   1000011     9.37749939E+02   #  el-            
   1000012     9.34201355E+02   #  nuel           
   1000013     9.37749939E+02   #  mul-           
   1000014     9.34201355E+02   #  numl           
   1000015     7.69305786E+02   #  tau1           
   1000016     8.62254150E+02   #  nutl           
   1000021     7.24859924E+02   #  glss           
   1000022     1.13634819E+02   #  z1ss           
   1000023     2.10132156E+02   #  z2ss           
   1000024     2.10843857E+02   #  w1ss           
   1000025    -3.55257172E+02   #  z3ss           
   1000035     3.75805023E+02   #  z4ss           
   1000037     3.75847687E+02   #  w2ss           
   2000001     1.08421912E+03   #  dnr            
   2000002     1.08415991E+03   #  upr            
   2000003     1.08421912E+03   #  str            
   2000004     1.08416077E+03   #  chr            
   2000005     9.66247375E+02   #  b2             
   2000006     8.93381165E+02   #  t2             
   2000011     9.25703003E+02   #  er-            
   2000013     9.25703003E+02   #  mur-           
   2000015     8.67971863E+02   #  tau2           
Block ALPHA   # Effective Higgs mixing parameter
         -2.57410277E-02   # alpha
Block STOPMIX   # stop mixing matrix
  1  1     2.63597935E-01   # O_{11}
  1  2     9.64632630E-01   # O_{12}
  2  1    -9.64632630E-01   # O_{21}
  2  2     2.63597935E-01   # O_{22}
Block SBOTMIX   # sbottom mixing matrix
  1  1     9.81666744E-01   # O_{11}
  1  2     1.90605283E-01   # O_{12}
  2  1    -1.90605283E-01   # O_{21}
  2  2     9.81666744E-01   # O_{22}
Block STAUMIX   # stau mixing matrix
  1  1     1.69101551E-01   # O_{11}
  1  2     9.85598624E-01   # O_{12}
  2  1    -9.85598624E-01   # O_{21}
  2  2     1.69101551E-01   # O_{22}
Block NMIX   # neutralino mixing matrix
  1  1    -9.86773551E-01   #
  1  2     3.97702493E-02   #
  1  3    -1.48533180E-01   #
  1  4     5.13274819E-02   #
  2  1     9.45276693E-02   #
  2  2     9.24563885E-01   #
  2  3    -3.12616169E-01   #
  2  4     1.96257517E-01   #
  3  1    -6.41087666E-02   #
  3  2     9.10745412E-02   #
  3  3     6.95562303E-01   #
  3  4     7.09780633E-01   #
  4  1     1.15034238E-01   #
  4  2    -3.67838442E-01   #
  4  3    -6.29604638E-01   #
  4  4     6.74581289E-01   #
Block UMIX   # chargino U mixing matrix
  1  1    -8.95451248E-01   # U_{11}
  1  2     4.45159614E-01   # U_{12}
  2  1    -4.45159614E-01   # U_{21}
  2  2    -8.95451248E-01   # U_{22}
Block VMIX   # chargino V mixing matrix
  1  1    -9.60476816E-01   # V_{11}
  1  2     2.78360099E-01   # V_{12}
  2  1    -2.78360099E-01   # V_{21}
  2  2    -9.60476816E-01   # V_{22}
Block GAUGE Q=  7.63985168E+02   #
     1     3.57497424E-01   # g`
     2     6.52462661E-01   # g_2
     3     1.22092462E+00   # g_3
Block YU Q=  7.63985168E+02   #
  3  3     8.66529703E-01   # y_t
Block YD Q=  7.63985168E+02   #
  3  3     5.16701400E-01   # y_b
Block YE Q=  7.63985168E+02   #
  3  3     4.13547307E-01   # y_tau
Block HMIX Q=  7.63985168E+02   # Higgs mixing parameters
     1     3.46005768E+02   # mu(Q)
     2     4.00000000E+01   # tan(beta)(M_GUT)
     3     2.50822327E+02   # Higgs vev at Q
     4     4.95574062E+05   # m_A^2(Q)
Block MSOFT Q=  7.63985168E+02   # DRbar SUSY breaking parameters
     1     1.16364304E+02   # M_1(Q)          
     2     2.17764145E+02   # M_2(Q)          
     3     6.47259888E+02   # M_3(Q)          
    31     9.33834961E+02   # MeL(Q)          
    32     9.33834961E+02   # MmuL(Q)         
    33     8.63122864E+02   # MtauL(Q)        
    34     9.23834167E+02   # MeR(Q)          
    35     9.23834167E+02   # MmuR(Q)         
    36     7.72800964E+02   # MtauR(Q)        
    41     1.06124121E+03   # MqL1(Q)         
    42     1.06124121E+03   # MqL2(Q)         
    43     8.39917053E+02   # MqL3(Q)         
    44     1.05338354E+03   # MuR(Q)          
    45     1.05338354E+03   # McR(Q)          
    46     6.94917847E+02   # MtR(Q)          
    47     1.05252881E+03   # MdR(Q)          
    48     1.05252881E+03   # MsR(Q)          
    49     9.39661316E+02   # MbR(Q)          
Block AU Q=  7.63985168E+02   #
  1  1    -4.86244324E+02   # A_u
  2  2    -4.86244324E+02   # A_c
  3  3    -4.86244324E+02   # A_t
Block AD Q=  7.63985168E+02   #
  1  1    -6.39463867E+02   # A_d
  2  2    -6.39463867E+02   # A_s
  3  3    -6.39463867E+02   # A_b
Block AE Q=  7.63985168E+02   #
  1  1    -9.77288589E+01   # A_e
  2  2    -9.77288589E+01   # A_mu
  3  3    -9.77288589E+01   # A_tau
#  ISAJET decay tables in SUSY Les Houches accord format
#  Created by ISALHD. Last revision: C. Balazs, 2005 May 25
Block DCINFO                           # Program information
     1   ISASUGRA from ISAJET          # Spectrum Calculator
     2   7.80   29-OCT-2009 12:50:36   # Version number
#         PDG         Width
DECAY         6  1.14680779E+00   # TP    decays
#          BR          NDA       ID1       ID2       ID3       ID4
      3.33333343E-01    3            2        -1         5             # TP     -->  UP     DB     BT          
      3.33333343E-01    3            4        -3         5             # TP     -->  CH     SB     BT          
      1.11111112E-01    3          -11        12         5             # TP     -->  E+     NUE    BT          
      1.11111112E-01    3          -13        14         5             # TP     -->  MU+    NUM    BT          
      1.11111112E-01    3          -15        16         5             # TP     -->  TAU+   NUT    BT          
#         PDG         Width
DECAY   1000021  1.53376386E-02   # GLSS  decays
#          BR          NDA       ID1       ID2       ID3       ID4
      4.96506840E-02    3      1000024         1        -2             # GLSS   -->  W1SS+  DN     UB          
      4.96506840E-02    3     -1000024         2        -1             # GLSS   -->  W1SS-  UP     DB          
      4.96505797E-02    3      1000024         3        -4             # GLSS   -->  W1SS+  ST     CB          
      4.96505797E-02    3     -1000024         4        -3             # GLSS   -->  W1SS-  CH     SB          
      8.44536722E-02    3      1000024         5        -6             # GLSS   -->  W1SS+  BT     TB          
      8.44536722E-02    3     -1000024         6        -5             # GLSS   -->  W1SS-  TP     BB          
      2.43916316E-03    3      1000037         1        -2             # GLSS   -->  W2SS+  DN     UB          
      2.43916316E-03    3     -1000037         2        -1             # GLSS   -->  W2SS-  UP     DB          
      2.43915967E-03    3      1000037         3        -4             # GLSS   -->  W2SS+  ST     CB          
      2.43915967E-03    3     -1000037         4        -3             # GLSS   -->  W2SS-  CH     SB          
      8.14621300E-02    3      1000037         5        -6             # GLSS   -->  W2SS+  BT     TB          
      8.14621300E-02    3     -1000037         6        -5             # GLSS   -->  W2SS-  TP     BB          
      6.78778597E-05    2      1000022        21                       # GLSS   -->  Z1SS   GL                 
      2.17234418E-02    3      1000022         2        -2             # GLSS   -->  Z1SS   UP     UB          
      7.09725264E-03    3      1000022         1        -1             # GLSS   -->  Z1SS   DN     DB          
      7.09725264E-03    3      1000022         3        -3             # GLSS   -->  Z1SS   ST     SB          
      2.17233542E-02    3      1000022         4        -4             # GLSS   -->  Z1SS   CH     CB          
      2.55917534E-02    3      1000022         5        -5             # GLSS   -->  Z1SS   BT     BB          
      4.28934544E-02    3      1000022         6        -6             # GLSS   -->  Z1SS   TP     TB          
      2.67480686E-03    2      1000023        21                       # GLSS   -->  Z2SS   GL                 
      2.59537194E-02    3      1000023         2        -2             # GLSS   -->  Z2SS   UP     UB          
      2.36486252E-02    3      1000023         1        -1             # GLSS   -->  Z2SS   DN     DB          
      2.36486252E-02    3      1000023         3        -3             # GLSS   -->  Z2SS   ST     SB          
      2.59536132E-02    3      1000023         4        -4             # GLSS   -->  Z2SS   CH     CB          
      1.15082107E-01    3      1000023         5        -5             # GLSS   -->  Z2SS   BT     BB          
      8.96890648E-03    3      1000023         6        -6             # GLSS   -->  Z2SS   TP     TB          
      1.25395888E-02    2      1000025        21                       # GLSS   -->  Z3SS   GL                 
      3.90572786E-05    3      1000025         2        -2             # GLSS   -->  Z3SS   UP     UB          
      4.99747839E-05    3      1000025         1        -1             # GLSS   -->  Z3SS   DN     DB          
      4.99747839E-05    3      1000025         3        -3             # GLSS   -->  Z3SS   ST     SB          
      3.90571004E-05    3      1000025         4        -4             # GLSS   -->  Z3SS   CH     CB          
      4.38120887E-02    3      1000025         5        -5             # GLSS   -->  Z3SS   BT     BB          
      7.18200812E-04    3      1000025         6        -6             # GLSS   -->  Z3SS   TP     TB          
      1.04802204E-02    2      1000035        21                       # GLSS   -->  Z4SS   GL                 
      1.17671420E-03    3      1000035         2        -2             # GLSS   -->  Z4SS   UP     UB          
      1.39093061E-03    3      1000035         1        -1             # GLSS   -->  Z4SS   DN     DB          
      1.39093061E-03    3      1000035         3        -3             # GLSS   -->  Z4SS   ST     SB          
      1.17670919E-03    3      1000035         4        -4             # GLSS   -->  Z4SS   CH     CB          
      3.46769094E-02    3      1000035         5        -5             # GLSS   -->  Z4SS   BT     BB          
      1.44130929E-04    3      1000035         6        -6             # GLSS   -->  Z4SS   TP     TB          
#         PDG         Width
DECAY   1000002  3.34601059E+01   # UPL   decays
#          BR          NDA       ID1       ID2       ID3       ID4
      2.67082732E-03    2      1000022         2                       # UPL    -->  Z1SS   UP                 
      1.12918787E-01    2      1000023         2                       # UPL    -->  Z2SS   UP                 
      6.90473709E-04    2      1000025         2                       # UPL    -->  Z3SS   UP                 
      1.28233572E-02    2      1000035         2                       # UPL    -->  Z4SS   UP                 
      6.19651198E-01    2      1000021         2                       # UPL    -->  GLSS   UP                 
      2.34719917E-01    2      1000024         1                       # UPL    -->  W1SS+  DN                 
      1.65254269E-02    2      1000037         1                       # UPL    -->  W2SS+  DN                 
#         PDG         Width
DECAY   1000001  3.35479240E+01   # DNL   decays
#          BR          NDA       ID1       ID2       ID3       ID4
      6.53508445E-03    2      1000022         1                       # DNL    -->  Z1SS   DN                 
      1.04821451E-01    2      1000023         1                       # DNL    -->  Z2SS   DN                 
      1.16154726E-03    2      1000025         1                       # DNL    -->  Z3SS   DN                 
      1.61555503E-02    2      1000035         1                       # DNL    -->  Z4SS   DN                 
      6.24874711E-01    2      1000021         1                       # DNL    -->  GLSS   DN                 
      2.04121351E-01    2     -1000024         2                       # DNL    -->  W1SS-  UP                 
      4.23302464E-02    2     -1000037         2                       # DNL    -->  W2SS-  UP                 
#         PDG         Width
DECAY   1000003  3.35478935E+01   # STL   decays
#          BR          NDA       ID1       ID2       ID3       ID4
      6.53509051E-03    2      1000022         3                       # STL    -->  Z1SS   ST                 
      1.04821540E-01    2      1000023         3                       # STL    -->  Z2SS   ST                 
      1.16154831E-03    2      1000025         3                       # STL    -->  Z3SS   ST                 
      1.61555652E-02    2      1000035         3                       # STL    -->  Z4SS   ST                 
      6.24875247E-01    2      1000021         3                       # STL    -->  GLSS   ST                 
      2.04120830E-01    2     -1000024         4                       # STL    -->  W1SS-  CH                 
      4.23301123E-02    2     -1000037         4                       # STL    -->  W2SS-  CH                 
#         PDG         Width
DECAY   1000004  3.34599648E+01   # CHL   decays
#          BR          NDA       ID1       ID2       ID3       ID4
      2.67083244E-03    2      1000022         4                       # CHL    -->  Z1SS   CH                 
      1.12918980E-01    2      1000023         4                       # CHL    -->  Z2SS   CH                 
      6.90474757E-04    2      1000025         4                       # CHL    -->  Z3SS   CH                 
      1.28233759E-02    2      1000035         4                       # CHL    -->  Z4SS   CH                 
      6.19649708E-01    2      1000021         4                       # CHL    -->  GLSS   CH                 
      2.34721124E-01    2      1000024         3                       # CHL    -->  W1SS+  ST                 
      1.65255181E-02    2      1000037         3                       # CHL    -->  W2SS+  ST                 
#         PDG         Width
DECAY   1000005  2.50348110E+01   # BT1   decays
#          BR          NDA       ID1       ID2       ID3       ID4
      1.62831303E-02    2      1000022         5                       # BT1    -->  Z1SS   BT                 
      1.32746503E-01    2      1000023         5                       # BT1    -->  Z2SS   BT                 
      5.90723939E-02    2      1000025         5                       # BT1    -->  Z3SS   BT                 
      5.13787381E-02    2      1000035         5                       # BT1    -->  Z4SS   BT                 
      1.94162205E-01    2      1000021         5                       # BT1    -->  GLSS   BT                 
      2.23515734E-01    2     -1000024         6                       # BT1    -->  W1SS-  TP                 
      3.03054988E-01    2     -1000037         6                       # BT1    -->  W2SS-  TP                 
      1.97863895E-02    2          -24   1000006                       # BT1    -->  W-     TP1                
#         PDG         Width
DECAY   1000006  1.26658878E+01   # TP1   decays
#          BR          NDA       ID1       ID2       ID3       ID4
      1.03877097E-01    2      1000022         6                       # TP1    -->  Z1SS   TP                 
      6.14525415E-02    2      1000023         6                       # TP1    -->  Z2SS   TP                 
      2.37799466E-01    2      1000025         6                       # TP1    -->  Z3SS   TP                 
      1.09217070E-01    2      1000035         6                       # TP1    -->  Z4SS   TP                 
      1.49814442E-01    2      1000024         5                       # TP1    -->  W1SS+  BT                 
      3.37839365E-01    2      1000037         5                       # TP1    -->  W2SS+  BT                 
#         PDG         Width
DECAY   2000002  2.25779819E+01   # UPR   decays
#          BR          NDA       ID1       ID2       ID3       ID4
      1.03386648E-01    2      1000022         2                       # UPR    -->  Z1SS   UP                 
      8.98429600E-04    2      1000023         2                       # UPR    -->  Z2SS   UP                 
      3.55466327E-04    2      1000025         2                       # UPR    -->  Z3SS   UP                 
      1.11196737E-03    2      1000035         2                       # UPR    -->  Z4SS   UP                 
      8.94247472E-01    2      1000021         2                       # UPR    -->  GLSS   UP                 
#         PDG         Width
DECAY   2000001  2.07918148E+01   # DNR   decays
#          BR          NDA       ID1       ID2       ID3       ID4
      2.80686766E-02    2      1000022         1                       # DNR    -->  Z1SS   DN                 
      2.43918184E-04    2      1000023         1                       # DNR    -->  Z2SS   DN                 
      9.65086583E-05    2      1000025         1                       # DNR    -->  Z3SS   DN                 
      3.01898835E-04    2      1000035         1                       # DNR    -->  Z4SS   DN                 
      9.71288979E-01    2      1000021         1                       # DNR    -->  GLSS   DN                 
#         PDG         Width
DECAY   2000003  2.07918148E+01   # STR   decays
#          BR          NDA       ID1       ID2       ID3       ID4
      2.80686766E-02    2      1000022         3                       # STR    -->  Z1SS   ST                 
      2.43918184E-04    2      1000023         3                       # STR    -->  Z2SS   ST                 
      9.65086583E-05    2      1000025         3                       # STR    -->  Z3SS   ST                 
      3.01898835E-04    2      1000035         3                       # STR    -->  Z4SS   ST                 
      9.71288979E-01    2      1000021         3                       # STR    -->  GLSS   ST                 
#         PDG         Width
DECAY   2000004  2.25778389E+01   # CHR   decays
#          BR          NDA       ID1       ID2       ID3       ID4
      1.03387050E-01    2      1000022         4                       # CHR    -->  Z1SS   CH                 
      8.98433034E-04    2      1000023         4                       # CHR    -->  Z2SS   CH                 
      3.55467637E-04    2      1000025         4                       # CHR    -->  Z3SS   CH                 
      1.11197133E-03    2      1000035         4                       # CHR    -->  Z4SS   CH                 
      8.94247055E-01    2      1000021         4                       # CHR    -->  GLSS   CH                 
#         PDG         Width
DECAY   2000005  2.00642376E+01   # BT2   decays
#          BR          NDA       ID1       ID2       ID3       ID4
      2.34967414E-02    2      1000022         5                       # BT2    -->  Z1SS   BT                 
      7.38227274E-03    2      1000023         5                       # BT2    -->  Z2SS   BT                 
      9.85951722E-02    2      1000025         5                       # BT2    -->  Z3SS   BT                 
      9.13501531E-02    2      1000035         5                       # BT2    -->  Z4SS   BT                 
      5.63388169E-01    2      1000021         5                       # BT2    -->  GLSS   BT                 
      1.31447818E-02    2     -1000024         6                       # BT2    -->  W1SS-  TP                 
      1.96764469E-01    2     -1000037         6                       # BT2    -->  W2SS-  TP                 
      5.56759723E-03    2          -24   1000006                       # BT2    -->  W-     TP1                
      3.10679723E-04    2           23   1000005                       # BT2    -->  Z0     BT1                
#         PDG         Width
DECAY   2000006  2.18969460E+01   # TP2   decays
#          BR          NDA       ID1       ID2       ID3       ID4
      2.46330470E-01    2      1000024         5                       # TP2    -->  W1SS+  BT                 
      1.95294619E-01    2      1000037         5                       # TP2    -->  W2SS+  BT                 
      1.89247765E-02    2           23   1000006                       # TP2    -->  Z0     TP1                
      2.48511937E-02    2           25   1000006                       # TP2    -->  HL0    TP1                
      5.23138791E-03    2      1000022         6                       # TP2    -->  Z1SS   TP                 
      1.03666484E-01    2      1000023         6                       # TP2    -->  Z2SS   TP                 
      1.67191729E-01    2      1000025         6                       # TP2    -->  Z3SS   TP                 
      2.38509372E-01    2      1000035         6                       # TP2    -->  Z4SS   TP                 
#         PDG         Width
DECAY   1000011  1.14391327E+01   # EL-   decays
#          BR          NDA       ID1       ID2       ID3       ID4
      8.46193209E-02    2      1000022        11                       # EL-    -->  Z1SS   E-                 
      2.96838224E-01    2      1000023        11                       # EL-    -->  Z2SS   E-                 
      7.89252925E-04    2      1000025        11                       # EL-    -->  Z3SS   E-                 
      2.25600135E-02    2      1000035        11                       # EL-    -->  Z4SS   E-                 
      4.98840034E-01    2     -1000024        12                       # EL-    -->  W1SS-  NUE                
      9.63530838E-02    2     -1000037        12                       # EL-    -->  W2SS-  NUE                
#         PDG         Width
DECAY   1000013  1.14391327E+01   # MUL-  decays
#          BR          NDA       ID1       ID2       ID3       ID4
      8.46193209E-02    2      1000022        13                       # MUL-   -->  Z1SS   MU-                
      2.96838224E-01    2      1000023        13                       # MUL-   -->  Z2SS   MU-                
      7.89252925E-04    2      1000025        13                       # MUL-   -->  Z3SS   MU-                
      2.25600135E-02    2      1000035        13                       # MUL-   -->  Z4SS   MU-                
      4.98840034E-01    2     -1000024        14                       # MUL-   -->  W1SS-  NUM                
      9.63530838E-02    2     -1000037        14                       # MUL-   -->  W2SS-  NUM                
#         PDG         Width
DECAY   1000015  7.40321875E+00   # TAU1- decays
#          BR          NDA       ID1       ID2       ID3       ID4
      4.99718279E-01    2      1000022        15                       # TAU1-  -->  Z1SS   TAU-               
      7.46087059E-02    2      1000023        15                       # TAU1-  -->  Z2SS   TAU-               
      1.00636847E-01    2      1000025        15                       # TAU1-  -->  Z3SS   TAU-               
      6.56166226E-02    2      1000035        15                       # TAU1-  -->  Z4SS   TAU-               
      1.39051646E-01    2     -1000024        16                       # TAU1-  -->  W1SS-  NUT                
      1.20367907E-01    2     -1000037        16                       # TAU1-  -->  W2SS-  NUT                
#         PDG         Width
DECAY   1000012  1.15146856E+01   # NUEL  decays
#          BR          NDA       ID1       ID2       ID3       ID4
      1.12326108E-01    2      1000022        12                       # NUEL   -->  Z1SS   NUE                
      2.34392554E-01    2      1000023        12                       # NUEL   -->  Z2SS   NUE                
      3.98659892E-03    2      1000025        12                       # NUEL   -->  Z3SS   NUE                
      4.45813611E-02    2      1000035        12                       # NUEL   -->  Z4SS   NUE                
      5.67536175E-01    2      1000024        11                       # NUEL   -->  W1SS+  E-                 
      3.71771678E-02    2      1000037        11                       # NUEL   -->  W2SS+  E-                 
#         PDG         Width
DECAY   1000014  1.15146856E+01   # NUML  decays
#          BR          NDA       ID1       ID2       ID3       ID4
      1.12326108E-01    2      1000022        14                       # NUML   -->  Z1SS   NUM                
      2.34392554E-01    2      1000023        14                       # NUML   -->  Z2SS   NUM                
      3.98659892E-03    2      1000025        14                       # NUML   -->  Z3SS   NUM                
      4.45813611E-02    2      1000035        14                       # NUML   -->  Z4SS   NUM                
      5.67536175E-01    2      1000024        13                       # NUML   -->  W1SS+  MU-                
      3.71771678E-02    2      1000037        13                       # NUML   -->  W2SS+  MU-                
#         PDG         Width
DECAY   1000016  1.24839783E+01   # NUTL  decays
#          BR          NDA       ID1       ID2       ID3       ID4
      9.51270238E-02    2      1000022        16                       # NUTL   -->  Z1SS   NUT                
      1.95863396E-01    2      1000023        16                       # NUTL   -->  Z2SS   NUT                
      3.19731864E-03    2      1000025        16                       # NUTL   -->  Z3SS   NUT                
      3.54481637E-02    2      1000035        16                       # NUTL   -->  Z4SS   NUT                
      5.15254617E-01    2      1000024        15                       # NUTL   -->  W1SS+  TAU-               
      1.54091135E-01    2      1000037        15                       # NUTL   -->  W2SS+  TAU-               
      1.01827621E-03    2           24   1000015                       # NUTL   -->  W+     TAU1-              
#         PDG         Width
DECAY   2000011  4.54289293E+00   # ER-   decays
#          BR          NDA       ID1       ID2       ID3       ID4
      9.79004681E-01    2      1000022        11                       # ER-    -->  Z1SS   E-                 
      8.33115354E-03    2      1000023        11                       # ER-    -->  Z2SS   E-                 
      3.09732091E-03    2      1000025        11                       # ER-    -->  Z3SS   E-                 
      9.56672803E-03    2      1000035        11                       # ER-    -->  Z4SS   E-                 
#         PDG         Width
DECAY   2000013  4.54289293E+00   # MUR-  decays
#          BR          NDA       ID1       ID2       ID3       ID4
      9.79004681E-01    2      1000022        13                       # MUR-   -->  Z1SS   MU-                
      8.33115354E-03    2      1000023        13                       # MUR-   -->  Z2SS   MU-                
      3.09732091E-03    2      1000025        13                       # MUR-   -->  Z3SS   MU-                
      9.56672803E-03    2      1000035        13                       # MUR-   -->  Z4SS   MU-                
#         PDG         Width
DECAY   2000015  1.21018105E+01   # TAU2- decays
#          BR          NDA       ID1       ID2       ID3       ID4
      7.90130123E-02    2      1000022        15                       # TAU2-  -->  Z1SS   TAU-               
      2.47080475E-01    2      1000023        15                       # TAU2-  -->  Z2SS   TAU-               
      8.83392692E-02    2      1000025        15                       # TAU2-  -->  Z3SS   TAU-               
      9.87021774E-02    2      1000035        15                       # TAU2-  -->  Z4SS   TAU-               
      3.72393519E-01    2     -1000024        16                       # TAU2-  -->  W1SS-  NUT                
      1.14200130E-01    2     -1000037        16                       # TAU2-  -->  W2SS-  NUT                
      2.71398632E-04    2           23   1000015                       # TAU2-  -->  Z0     TAU1-              
#         PDG         Width
DECAY   1000023  1.15548004E-03   # Z2SS  decays
#          BR          NDA       ID1       ID2       ID3       ID4
      2.45260107E-05    2      1000022        22                       # Z2SS   -->  Z1SS   GM                 
      9.99683261E-01    2      1000022        23                       # Z2SS   -->  Z1SS   Z0                 
      1.25399220E-06    3      1000022         2        -2             # Z2SS   -->  Z1SS   UP     UB          
      2.46584750E-06    3      1000022         1        -1             # Z2SS   -->  Z1SS   DN     DB          
      2.46584750E-06    3      1000022         3        -3             # Z2SS   -->  Z1SS   ST     SB          
      1.25398810E-06    3      1000022         4        -4             # Z2SS   -->  Z1SS   CH     CB          
      1.67101971E-04    3      1000022         5        -5             # Z2SS   -->  Z1SS   BT     BB          
      9.79851029E-06    3      1000022        11       -11             # Z2SS   -->  Z1SS   E-     E+          
      9.79851029E-06    3      1000022        13       -13             # Z2SS   -->  Z1SS   MU-    MU+         
      6.40795624E-05    3      1000022        15       -15             # Z2SS   -->  Z1SS   TAU-   TAU+        
      1.01003461E-05    3      1000022        12       -12             # Z2SS   -->  Z1SS   NUE    ANUE        
      1.01003461E-05    3      1000022        14       -14             # Z2SS   -->  Z1SS   NUM    ANUM        
      1.40726524E-05    3      1000022        16       -16             # Z2SS   -->  Z1SS   NUT    ANUT        
#         PDG         Width
DECAY   1000025  1.17640555E+00   # Z3SS  decays
#          BR          NDA       ID1       ID2       ID3       ID4
      6.59558985E-09    2      1000022        22                       # Z3SS   -->  Z1SS   GM                 
      5.37404219E-07    2      1000023        22                       # Z3SS   -->  Z2SS   GM                 
      2.99844772E-01    2      1000024       -24                       # Z3SS   -->  W1SS+  W-                 
      2.99844772E-01    2     -1000024        24                       # Z3SS   -->  W1SS-  W+                 
      1.48754314E-01    2      1000022        23                       # Z3SS   -->  Z1SS   Z0                 
      2.14888498E-01    2      1000023        23                       # Z3SS   -->  Z2SS   Z0                 
      2.08367390E-09    3      1000022         2        -2             # Z3SS   -->  Z1SS   UP     UB          
      9.25387544E-10    3      1000022         1        -1             # Z3SS   -->  Z1SS   DN     DB          
      9.25387544E-10    3      1000022         3        -3             # Z3SS   -->  Z1SS   ST     SB          
      2.08366746E-09    3      1000022         4        -4             # Z3SS   -->  Z1SS   CH     CB          
      4.72245165E-06    3      1000022         5        -5             # Z3SS   -->  Z1SS   BT     BB          
      7.07063075E-09    3      1000022        11       -11             # Z3SS   -->  Z1SS   E-     E+          
      7.07063075E-09    3      1000022        13       -13             # Z3SS   -->  Z1SS   MU-    MU+         
      3.83686029E-06    3      1000022        15       -15             # Z3SS   -->  Z1SS   TAU-   TAU+        
      5.57667779E-09    3      1000022        12       -12             # Z3SS   -->  Z1SS   NUE    ANUE        
      5.57667779E-09    3      1000022        14       -14             # Z3SS   -->  Z1SS   NUM    ANUM        
      7.92046162E-09    3      1000022        16       -16             # Z3SS   -->  Z1SS   NUT    ANUT        
      1.17066545E-09    3      1000023         2        -2             # Z3SS   -->  Z2SS   UP     UB          
      1.79995130E-09    3      1000023         1        -1             # Z3SS   -->  Z2SS   DN     DB          
      1.79995130E-09    3      1000023         3        -3             # Z3SS   -->  Z2SS   ST     SB          
      1.17066157E-09    3      1000023         4        -4             # Z3SS   -->  Z2SS   CH     CB          
      2.03373816E-06    3      1000023         5        -5             # Z3SS   -->  Z2SS   BT     BB          
      4.09885487E-10    3      1000023        11       -11             # Z3SS   -->  Z2SS   E-     E+          
      4.09885487E-10    3      1000023        13       -13             # Z3SS   -->  Z2SS   MU-    MU+         
      4.60109163E-07    3      1000023        15       -15             # Z3SS   -->  Z2SS   TAU-   TAU+        
      1.67121184E-09    3      1000023        12       -12             # Z3SS   -->  Z2SS   NUE    ANUE        
      1.67121184E-09    3      1000023        14       -14             # Z3SS   -->  Z2SS   NUM    ANUM        
      2.39340547E-09    3      1000023        16       -16             # Z3SS   -->  Z2SS   NUT    ANUT        
      2.98465155E-02    2      1000022        25                       # Z3SS   -->  Z1SS   HL0                
      6.80954242E-03    2      1000023        25                       # Z3SS   -->  Z2SS   HL0                
#         PDG         Width
DECAY   1000035  1.52083337E+00   # Z4SS  decays
#          BR          NDA       ID1       ID2       ID3       ID4
      4.93277086E-10    2      1000022        22                       # Z4SS   -->  Z1SS   GM                 
      2.00414107E-07    2      1000023        22                       # Z4SS   -->  Z2SS   GM                 
      7.74974662E-09    2      1000025        22                       # Z4SS   -->  Z3SS   GM                 
      3.45695436E-01    2      1000024       -24                       # Z4SS   -->  W1SS+  W-                 
      3.45695436E-01    2     -1000024        24                       # Z4SS   -->  W1SS-  W+                 
      3.30519266E-02    2      1000022        23                       # Z4SS   -->  Z1SS   Z0                 
      2.00460404E-02    2      1000023        23                       # Z4SS   -->  Z2SS   Z0                 
      2.40440183E-08    3      1000022         2        -2             # Z4SS   -->  Z1SS   UP     UB          
      2.90806152E-08    3      1000022         1        -1             # Z4SS   -->  Z1SS   DN     DB          
      2.90806152E-08    3      1000022         3        -3             # Z4SS   -->  Z1SS   ST     SB          
      2.40439402E-08    3      1000022         4        -4             # Z4SS   -->  Z1SS   CH     CB          
      3.23103063E-06    3      1000022         5        -5             # Z4SS   -->  Z1SS   BT     BB          
      1.07002521E-07    3      1000022        11       -11             # Z4SS   -->  Z1SS   E-     E+          
      1.07002521E-07    3      1000022        13       -13             # Z4SS   -->  Z1SS   MU-    MU+         
      3.27144539E-06    3      1000022        15       -15             # Z4SS   -->  Z1SS   TAU-   TAU+        
      1.58050000E-07    3      1000022        12       -12             # Z4SS   -->  Z1SS   NUE    ANUE        
      1.58050000E-07    3      1000022        14       -14             # Z4SS   -->  Z1SS   NUM    ANUM        
      2.24263800E-07    3      1000022        16       -16             # Z4SS   -->  Z1SS   NUT    ANUT        
      8.71527490E-08    3      1000023         2        -2             # Z4SS   -->  Z2SS   UP     UB          
      1.00491640E-07    3      1000023         1        -1             # Z4SS   -->  Z2SS   DN     DB          
      1.00491640E-07    3      1000023         3        -3             # Z4SS   -->  Z2SS   ST     SB          
      8.71524435E-08    3      1000023         4        -4             # Z4SS   -->  Z2SS   CH     CB          
      2.02200272E-06    3      1000023         5        -5             # Z4SS   -->  Z2SS   BT     BB          
      4.68870596E-08    3      1000023        11       -11             # Z4SS   -->  Z2SS   E-     E+          
      4.68870596E-08    3      1000023        13       -13             # Z4SS   -->  Z2SS   MU-    MU+         
      4.30719524E-07    3      1000023        15       -15             # Z4SS   -->  Z2SS   TAU-   TAU+        
      7.60936558E-08    3      1000023        12       -12             # Z4SS   -->  Z2SS   NUE    ANUE        
      7.60936558E-08    3      1000023        14       -14             # Z4SS   -->  Z2SS   NUM    ANUM        
      1.09102608E-07    3      1000023        16       -16             # Z4SS   -->  Z2SS   NUT    ANUT        
      2.43079256E-07    3      1000025         2        -2             # Z4SS   -->  Z3SS   UP     UB          
      3.13782550E-07    3      1000025         1        -1             # Z4SS   -->  Z3SS   DN     DB          
      3.13782550E-07    3      1000025         3        -3             # Z4SS   -->  Z3SS   ST     SB          
      2.43079256E-07    3      1000025         4        -4             # Z4SS   -->  Z3SS   CH     CB          
      1.62932679E-07    3      1000025         5        -5             # Z4SS   -->  Z3SS   BT     BB          
      7.11740498E-08    3      1000025        11       -11             # Z4SS   -->  Z3SS   E-     E+          
      7.11740498E-08    3      1000025        13       -13             # Z4SS   -->  Z3SS   MU-    MU+         
      6.54503438E-08    3      1000025        15       -15             # Z4SS   -->  Z3SS   TAU-   TAU+        
      1.41401401E-07    3      1000025        12       -12             # Z4SS   -->  Z3SS   NUE    ANUE        
      1.41401401E-07    3      1000025        14       -14             # Z4SS   -->  Z3SS   NUM    ANUM        
      1.41371061E-07    3      1000025        16       -16             # Z4SS   -->  Z3SS   NUT    ANUT        
      9.55407023E-02    2      1000022        25                       # Z4SS   -->  Z1SS   HL0                
      1.59958020E-01    2      1000023        25                       # Z4SS   -->  Z2SS   HL0                
#         PDG         Width
DECAY   1000024  5.11664432E-03   # W1SS+ decays
#          BR          NDA       ID1       ID2       ID3       ID4
      8.06798084E-07    3      1000022         2        -1             # W1SS+  -->  Z1SS   UP     DB          
      8.06797004E-07    3      1000022         4        -3             # W1SS+  -->  Z1SS   CH     SB          
      4.64047253E-06    3      1000022       -11        12             # W1SS+  -->  Z1SS   E+     NUE         
      4.64047253E-06    3      1000022       -13        14             # W1SS+  -->  Z1SS   MU+    NUM         
      1.20756631E-05    3      1000022       -15        16             # W1SS+  -->  Z1SS   TAU+   NUT         
      9.99977052E-01    2      1000022        24                       # W1SS+  -->  Z1SS   W+                 
      1.78181879E-11    3      1000023       -11        12             # W1SS+  -->  Z2SS   E+     NUE         
      1.78181879E-11    3      1000023       -13        14             # W1SS+  -->  Z2SS   MU+    NUM         
#         PDG         Width
DECAY   1000037  1.33661187E+00   # W2SS+ decays
#          BR          NDA       ID1       ID2       ID3       ID4
      4.47989912E-08    3      1000022         2        -1             # W2SS+  -->  Z1SS   UP     DB          
      4.47989557E-08    3      1000022         4        -3             # W2SS+  -->  Z1SS   CH     SB          
      2.13063416E-07    3      1000022       -11        12             # W2SS+  -->  Z1SS   E+     NUE         
      2.13063416E-07    3      1000022       -13        14             # W2SS+  -->  Z1SS   MU+    NUM         
      3.67395251E-06    3      1000022       -15        16             # W2SS+  -->  Z1SS   TAU+   NUT         
      1.16210654E-01    2      1000022        24                       # W2SS+  -->  Z1SS   W+                 
      8.45116261E-08    3      1000023         2        -1             # W2SS+  -->  Z2SS   UP     DB          
      8.45115480E-08    3      1000023         4        -3             # W2SS+  -->  Z2SS   CH     SB          
      6.23053893E-08    3      1000023       -11        12             # W2SS+  -->  Z2SS   E+     NUE         
      6.23053893E-08    3      1000023       -13        14             # W2SS+  -->  Z2SS   MU+    NUM         
      9.82207439E-07    3      1000023       -15        16             # W2SS+  -->  Z2SS   TAU+   NUT         
      3.71089399E-01    2      1000023        24                       # W2SS+  -->  Z2SS   W+                 
      1.00678437E-06    3      1000025         2        -1             # W2SS+  -->  Z3SS   UP     DB          
      1.00678437E-06    3      1000025         4        -3             # W2SS+  -->  Z3SS   CH     SB          
      3.35515409E-07    3      1000025       -11        12             # W2SS+  -->  Z3SS   E+     NUE         
      3.35515409E-07    3      1000025       -13        14             # W2SS+  -->  Z3SS   MU+    NUM         
      3.37355686E-07    3      1000025       -15        16             # W2SS+  -->  Z3SS   TAU+   NUT         
      1.63583325E-23    3      1000035       -11        12             # W2SS+  -->  Z4SS   E+     NUE         
      3.03730816E-01    2      1000024        23                       # W2SS+  -->  W1SS+  Z0                 
      8.94547938E-08    3      1000024         1        -1             # W2SS+  -->  W1SS+  DN     DB          
      8.94544954E-08    3      1000024         3        -3             # W2SS+  -->  W1SS+  ST     SB          
      1.96521910E-07    3      1000024         2        -2             # W2SS+  -->  W1SS+  UP     UB          
      1.96521910E-07    3      1000024         4        -4             # W2SS+  -->  W1SS+  CH     CB          
      1.28904574E-07    3      1000024        12       -12             # W2SS+  -->  W1SS+  NUE    ANUE        
      1.28904574E-07    3      1000024        14       -14             # W2SS+  -->  W1SS+  NUM    ANUM        
      3.19280844E-07    3      1000024        16       -16             # W2SS+  -->  W1SS+  NUT    ANUT        
      5.89771929E-08    3      1000024        11       -11             # W2SS+  -->  W1SS+  E-     E+          
      5.89771929E-08    3      1000024        13       -13             # W2SS+  -->  W1SS+  MU-    MU+         
      8.46348556E-08    3      1000024        15       -15             # W2SS+  -->  W1SS+  TAU-   TAU+        
      2.08959222E-01    2      1000024        25                       # W2SS+  -->  W1SS+  HL0                
#         PDG         Width
DECAY        25  4.08950355E-03   # HL0   decays
#          BR          NDA       ID1       ID2       ID3       ID4
      4.94817387E-09    2           11       -11                       # HL0    -->  E-     E+                 
      2.08919722E-04    2           13       -13                       # HL0    -->  MU-    MU+                
      5.97482100E-02    2           15       -15                       # HL0    -->  TAU-   TAU+               
      6.21273102E-06    2            1        -1                       # HL0    -->  DN     DB                 
      2.51025427E-03    2            3        -3                       # HL0    -->  ST     SB                 
      8.25712979E-01    2            5        -5                       # HL0    -->  BT     BB                 
      1.87423927E-06    2            2        -2                       # HL0    -->  UP     UB                 
      3.54129784E-02    2            4        -4                       # HL0    -->  CH     CB                 
      1.66031660E-03    2           22        22                       # HL0    -->  GM     GM                 
      3.63118649E-02    2           21        21                       # HL0    -->  GL     GL                 
      2.01048469E-03    3           24        11       -12             # HL0    -->  W+     E-     ANUE        
      2.01048469E-03    3           24        13       -14             # HL0    -->  W+     MU-    ANUM        
      2.01048469E-03    3           24        15       -16             # HL0    -->  W+     TAU-   ANUT        
      6.03145408E-03    3           24        -2         1             # HL0    -->  W+     UB     DN          
      6.03145408E-03    3           24        -4         3             # HL0    -->  W+     CB     ST          
      2.01048469E-03    3          -24       -11        12             # HL0    -->  W-     E+     NUE         
      2.01048469E-03    3          -24       -13        14             # HL0    -->  W-     MU+    NUM         
      2.01048469E-03    3          -24       -15        16             # HL0    -->  W-     TAU+   NUT         
      6.03145408E-03    3          -24         2        -1             # HL0    -->  W-     UP     DB          
      6.03145408E-03    3          -24         4        -3             # HL0    -->  W-     CH     SB          
      1.53051384E-04    3           23        12       -12             # HL0    -->  Z0     NUE    ANUE        
      1.53051384E-04    3           23        14       -14             # HL0    -->  Z0     NUM    ANUM        
      1.53051384E-04    3           23        16       -16             # HL0    -->  Z0     NUT    ANUT        
      7.70292245E-05    3           23        11       -11             # HL0    -->  Z0     E-     E+          
      7.70292245E-05    3           23        13       -13             # HL0    -->  Z0     MU-    MU+         
      7.70292245E-05    3           23        15       -15             # HL0    -->  Z0     TAU-   TAU+        
      2.63895607E-04    3           23         2        -2             # HL0    -->  Z0     UP     UB          
      2.63895607E-04    3           23         4        -4             # HL0    -->  Z0     CH     CB          
      3.39962513E-04    3           23         1        -1             # HL0    -->  Z0     DN     DB          
      3.39962513E-04    3           23         3        -3             # HL0    -->  Z0     ST     SB          
      3.39962513E-04    3           23         5        -5             # HL0    -->  Z0     BT     BB          
#         PDG         Width
DECAY        35  2.12703114E+01   # HH0   decays
#          BR          NDA       ID1       ID2       ID3       ID4
      9.05805830E-09    2           11       -11                       # HH0    -->  E-     E+                 
      3.82447557E-04    2           13       -13                       # HH0    -->  MU-    MU+                
      1.09534718E-01    2           15       -15                       # HH0    -->  TAU-   TAU+               
      1.11296458E-05    2            1        -1                       # HH0    -->  DN     DB                 
      4.49693995E-03    2            3        -3                       # HH0    -->  ST     SB                 
      7.02488065E-01    2            5        -5                       # HH0    -->  BT     BB                 
      1.47540433E-12    2            2        -2                       # HH0    -->  UP     UB                 
      2.16735465E-08    2            4        -4                       # HH0    -->  CH     CB                 
      8.25194700E-04    2            6        -6                       # HH0    -->  TP     TB                 
      1.00010830E-07    2           22        22                       # HH0    -->  GM     GM                 
      7.77024252E-06    2           21        21                       # HH0    -->  GL     GL                 
      2.80589734E-06    2           24       -24                       # HH0    -->  W+     W-                 
      1.40889949E-06    2           23        23                       # HH0    -->  Z0     Z0                 
      1.74901506E-03    2      1000022   1000022                       # HH0    -->  Z1SS   Z1SS               
      9.23946500E-03    2      1000022   1000023                       # HH0    -->  Z1SS   Z2SS               
      1.37542244E-02    2      1000022   1000025                       # HH0    -->  Z1SS   Z3SS               
      4.22501750E-03    2      1000022   1000035                       # HH0    -->  Z1SS   Z4SS               
      1.05372397E-02    2      1000023   1000023                       # HH0    -->  Z2SS   Z2SS               
      2.70235930E-02    2      1000023   1000025                       # HH0    -->  Z2SS   Z3SS               
      3.91015690E-03    2      1000023   1000035                       # HH0    -->  Z2SS   Z4SS               
      2.58038659E-02    2      1000024  -1000024                       # HH0    -->  W1SS+  W1SS-              
      4.30031791E-02    2      1000024  -1000037                       # HH0    -->  W1SS+  W2SS-              
      4.30031791E-02    2     -1000024   1000037                       # HH0    -->  W1SS-  W2SS+              
      4.22316418E-07    2           25        25                       # HH0    -->  HL0    HL0                
#         PDG         Width
DECAY        36  2.09337196E+01   # HA0   decays
#          BR          NDA       ID1       ID2       ID3       ID4
      9.14367426E-09    2           11       -11                       # HA0    -->  E-     E+                 
      3.86062457E-04    2           13       -13                       # HA0    -->  MU-    MU+                
      1.10572793E-01    2           15       -15                       # HA0    -->  TAU-   TAU+               
      1.12355001E-05    2            1        -1                       # HA0    -->  DN     DB                 
      4.53971047E-03    2            3        -3                       # HA0    -->  ST     SB                 
      7.09236443E-01    2            5        -5                       # HA0    -->  BT     BB                 
      1.40429693E-12    2            2        -2                       # HA0    -->  UP     UB                 
      2.06457198E-08    2            4        -4                       # HA0    -->  CH     CB                 
      9.97107360E-04    2            6        -6                       # HA0    -->  TP     TB                 
      3.11089998E-08    2           22        22                       # HA0    -->  GM     GM                 
      1.94616405E-05    2           21        21                       # HA0    -->  GL     GL                 
      2.03668652E-03    2      1000022   1000022                       # HA0    -->  Z1SS   Z1SS               
      1.21582849E-02    2      1000022   1000023                       # HA0    -->  Z1SS   Z2SS               
      7.78075773E-03    2      1000022   1000025                       # HA0    -->  Z1SS   Z3SS               
      7.89885595E-03    2      1000022   1000035                       # HA0    -->  Z1SS   Z4SS               
      1.74251348E-02    2      1000023   1000023                       # HA0    -->  Z2SS   Z2SS               
      8.89946893E-03    2      1000023   1000025                       # HA0    -->  Z2SS   Z3SS               
      1.31403422E-02    2      1000023   1000035                       # HA0    -->  Z2SS   Z4SS               
      4.26326618E-02    2      1000024  -1000024                       # HA0    -->  W1SS+  W1SS-              
      3.11311390E-02    2      1000024  -1000037                       # HA0    -->  W1SS+  W2SS-              
      3.11311390E-02    2     -1000024   1000037                       # HA0    -->  W1SS-  W2SS+              
      2.68082931E-06    2           25        23                       # HA0    -->  HL0    Z0                 
#         PDG         Width
DECAY        37  1.84683838E+01   # H+    decays
#          BR          NDA       ID1       ID2       ID3       ID4
      1.05106990E-08    2           12       -11                       # H+     -->  NUE    E+                 
      4.43780649E-04    2           14       -13                       # H+     -->  NUM    MU+                
      1.27104014E-01    2           16       -15                       # H+     -->  NUT    TAU+               
      1.18353610E-05    2            2        -1                       # H+     -->  UP     DB                 
      4.78207134E-03    2            4        -3                       # H+     -->  CH     SB                 
      6.62955940E-01    2            6        -5                       # H+     -->  TP     BB                 
      2.16597971E-02    2      1000024   1000022                       # H+     -->  W1SS+  Z1SS               
      1.63762437E-04    2      1000024   1000023                       # H+     -->  W1SS+  Z2SS               
      5.42020164E-02    2      1000024   1000025                       # H+     -->  W1SS+  Z3SS               
      5.12264781E-02    2      1000024   1000035                       # H+     -->  W1SS+  Z4SS               
      9.92419105E-03    2      1000037   1000022                       # H+     -->  W2SS+  Z1SS               
      6.75229803E-02    2      1000037   1000023                       # H+     -->  W2SS+  Z2SS               
      3.17757122E-06    2           25        24                       # H+     -->  HL0    W+                 
