  65
  401   3000.5166    0.33423E-26
  402   2999.5779    0.33423E-26
  403   3000.5166    0.33423E-26
  404   2999.5781    0.33423E-26
  405   2997.8540    0.34979E-26
  406   2994.8535    0.30217E-26
  407   3000.5166    0.33423E-26
  408   2999.5779    0.33423E-26
  409   3000.5166    0.33423E-26
  410   2999.5781    0.33423E-26
  411   2997.8540    0.34979E-26
  412   2994.8535    0.30217E-26
  413   3000.0945    0.40783E-26
  414   2999.8110    0.39558E-26
  415   3000.0945    0.40783E-26
  416   2999.8113    0.39558E-26
  417   3002.7573    0.34041E-26
  418   3010.5735    0.30971E-26
  419   3000.0945    0.40783E-26
  420   2999.8110    0.39558E-26
  421   3000.0945    0.40783E-26
  422   2999.8113    0.39558E-26
  423   3002.7573    0.34041E-26
  424   3010.5735    0.30971E-26
  425   3000.3276    0.16236E-25
  426   2999.3887    0.16227E-25
  427   3000.3276    0.16236E-25
  428   2999.3887    0.16227E-25
  429   2998.6755    0.23694E-25
  430   2999.3887    0.16202E-25
  431   3000.3276    0.16236E-25
  432   2999.3887    0.16227E-25
  433   3000.3276    0.16236E-25
  434   2999.3887    0.16227E-25
  435   2998.6755    0.23694E-25
  436   2999.3887    0.16202E-25
  437   3000.2837    0.43759E-25
  438      0.0000    0.10000E+31
  439   3000.2837    0.43759E-25
  440      0.0000    0.10000E+31
  441   3001.9358    0.23518E-25
  442      0.0000    0.10000E+31
  443   3000.2837    0.43759E-25
  444      0.0000    0.10000E+31
  445   3000.2837    0.43759E-25
  446      0.0000    0.10000E+31
  447   3001.9358    0.23518E-25
  448      0.0000    0.10000E+31
  449    400.0000    0.14027E-16
  450    249.9874    0.10000E+31
  451    349.9488    0.12767E-18
  452  -1401.2905    0.38588E-25
  453   1405.7676    0.38649E-25
  454    349.9126    0.13987E-20
  455   1405.5006    0.38437E-25
  456    349.9126    0.13987E-20
  457   1405.5006    0.38437E-25
  203    106.5847    0.15959E-21
  204    505.5095    0.55771E-24
  205    500.0000    0.41563E-24
  206    509.5998    0.52563E-24
  207    509.5998    0.52563E-24
  458      0.0000    0.10000E+31
    6    172.5000    0.57395E-24
   12    172.5000    0.57395E-24
   7
   401  0.25300053E-02     0   450     1     0     0     0
   401  0.61638914E-01     0   451     1     0     0     0
   401  0.26761891E-04     0   452     1     0     0     0
   401  0.19922102E-03     0   453     1     0     0     0
   401  0.81117094E+00     0   449     1     0     0     0
   401  0.12381537E+00     0   456     2     0     0     0
   401  0.61879447E-03     0   457     2     0     0     0
   7
   402  0.17445359E-02     0   450     2     0     0     0
   402  0.62505044E-01     0   451     2     0     0     0
   402  0.17407478E-04     0   452     2     0     0     0
   402  0.13778325E-03     0   453     2     0     0     0
   402  0.81091589E+00     0   449     2     0     0     0
   402  0.12454204E+00     0   454     1     0     0     0
   402  0.13728786E-03     0   455     1     0     0     0
   7
   403  0.25300055E-02     0   450     3     0     0     0
   403  0.61638921E-01     0   451     3     0     0     0
   403  0.26761893E-04     0   452     3     0     0     0
   403  0.19922103E-03     0   453     3     0     0     0
   403  0.81117100E+00     0   449     3     0     0     0
   403  0.12381533E+00     0   456     4     0     0     0
   403  0.61879412E-03     0   457     4     0     0     0
   7
   404  0.17445356E-02     0   450     4     0     0     0
   404  0.62505044E-01     0   451     4     0     0     0
   404  0.17407472E-04     0   452     4     0     0     0
   404  0.13778321E-03     0   453     4     0     0     0
   404  0.81091589E+00     0   449     4     0     0     0
   404  0.12454208E+00     0   454     3     0     0     0
   404  0.13728792E-03     0   455     3     0     0     0
   7
   405  0.61930679E-02     0   450     5     0     0     0
   405  0.29989105E-01     0   451     5     0     0     0
   405  0.26111765E-03     0   452     5     0     0     0
   405  0.14205102E-03     0   453     5     0     0     0
   405  0.84857428E+00     0   449     5     0     0     0
   405  0.59910923E-01     0   456     6     0     0     0
   405  0.54929469E-01     0   457     6     0     0     0
   7
   406  0.73838955E+00     0   449     6     0     0     0
   406  0.16631614E-01     0   450     6     0     0     0
   406  0.31345453E-01     0   451     6     0     0     0
   406  0.57250928E-01     0   452     6     0     0     0
   406  0.44985935E-01     0   453     6     0     0     0
   406  0.62947929E-01     0   454     5     0     0     0
   406  0.48448641E-01     0   455     5     0     0     0
   7
   407  0.25300053E-02     0   450     7     0     0     0
   407  0.61638914E-01     0   451     7     0     0     0
   407  0.26761891E-04     0   452     7     0     0     0
   407  0.19922102E-03     0   453     7     0     0     0
   407  0.81117094E+00     0   449     7     0     0     0
   407  0.12381537E+00     0   454     8     0     0     0
   407  0.61879447E-03     0   455     8     0     0     0
   7
   408  0.17445359E-02     0   450     8     0     0     0
   408  0.62505044E-01     0   451     8     0     0     0
   408  0.17407478E-04     0   452     8     0     0     0
   408  0.13778325E-03     0   453     8     0     0     0
   408  0.81091589E+00     0   449     8     0     0     0
   408  0.12454204E+00     0   456     7     0     0     0
   408  0.13728786E-03     0   457     7     0     0     0
   7
   409  0.25300055E-02     0   450     9     0     0     0
   409  0.61638921E-01     0   451     9     0     0     0
   409  0.26761893E-04     0   452     9     0     0     0
   409  0.19922103E-03     0   453     9     0     0     0
   409  0.81117100E+00     0   449     9     0     0     0
   409  0.12381533E+00     0   454    10     0     0     0
   409  0.61879412E-03     0   455    10     0     0     0
   7
   410  0.17445356E-02     0   450    10     0     0     0
   410  0.62505044E-01     0   451    10     0     0     0
   410  0.17407472E-04     0   452    10     0     0     0
   410  0.13778321E-03     0   453    10     0     0     0
   410  0.81091589E+00     0   449    10     0     0     0
   410  0.12454208E+00     0   456     9     0     0     0
   410  0.13728792E-03     0   457     9     0     0     0
   7
   411  0.61930679E-02     0   450    11     0     0     0
   411  0.29989105E-01     0   451    11     0     0     0
   411  0.26111765E-03     0   452    11     0     0     0
   411  0.14205102E-03     0   453    11     0     0     0
   411  0.84857428E+00     0   449    11     0     0     0
   411  0.59910923E-01     0   454    12     0     0     0
   411  0.54929469E-01     0   455    12     0     0     0
   7
   412  0.73838955E+00     0   449    12     0     0     0
   412  0.16631614E-01     0   450    12     0     0     0
   412  0.31345453E-01     0   451    12     0     0     0
   412  0.57250928E-01     0   452    12     0     0     0
   412  0.44985935E-01     0   453    12     0     0     0
   412  0.62947929E-01     0   456    11     0     0     0
   412  0.48448641E-01     0   457    11     0     0     0
   2
   413  0.10342855E-01     0   450     1     0     0     0
   413  0.98965710E+00     0   449     1     0     0     0
   4
   414  0.40124509E-01     0   450     2     0     0     0
   414  0.15003886E-04     0   451     2     0     0     0
   414  0.26634374E-04     0   453     2     0     0     0
   414  0.95983380E+00     0   449     2     0     0     0
   2
   415  0.10342855E-01     0   450     3     0     0     0
   415  0.98965710E+00     0   449     3     0     0     0
   4
   416  0.40124509E-01     0   450     4     0     0     0
   416  0.15003886E-04     0   451     4     0     0     0
   416  0.26634369E-04     0   453     4     0     0     0
   416  0.95983386E+00     0   449     4     0     0     0
   7
   417  0.51850011E-02     0   450     5     0     0     0
   417  0.33603478E-01     0   451     5     0     0     0
   417  0.49121148E-03     0   452     5     0     0     0
   417  0.78332744E-03     0   453     5     0     0     0
   417  0.82638085E+00     0   449     5     0     0     0
   417  0.67106567E-01     0   456     6     0     0     0
   417  0.66449620E-01     0   457     6     0     0     0
   7
   418  0.73734832E+00     0   449     6     0     0     0
   418  0.51285952E-01     0   454     5     0     0     0
   418  0.59309911E-01     0   455     5     0     0     0
   418  0.15846005E-01     0   450     6     0     0     0
   418  0.25672726E-01     0   451     6     0     0     0
   418  0.49131919E-01     0   452     6     0     0     0
   418  0.61405167E-01     0   453     6     0     0     0
   2
   419  0.10342855E-01     0   450     7     0     0     0
   419  0.98965710E+00     0   449     7     0     0     0
   4
   420  0.40124509E-01     0   450     8     0     0     0
   420  0.15003886E-04     0   451     8     0     0     0
   420  0.26634374E-04     0   453     8     0     0     0
   420  0.95983380E+00     0   449     8     0     0     0
   2
   421  0.10342855E-01     0   450     9     0     0     0
   421  0.98965710E+00     0   449     9     0     0     0
   4
   422  0.40124509E-01     0   450    10     0     0     0
   422  0.15003886E-04     0   451    10     0     0     0
   422  0.26634369E-04     0   453    10     0     0     0
   422  0.95983386E+00     0   449    10     0     0     0
   7
   423  0.51850011E-02     0   450    11     0     0     0
   423  0.33603478E-01     0   451    11     0     0     0
   423  0.49121148E-03     0   452    11     0     0     0
   423  0.78332744E-03     0   453    11     0     0     0
   423  0.82638085E+00     0   449    11     0     0     0
   423  0.67106567E-01     0   454    12     0     0     0
   423  0.66449620E-01     0   455    12     0     0     0
   7
   424  0.73734832E+00     0   449    12     0     0     0
   424  0.51285952E-01     0   456    11     0     0     0
   424  0.59309911E-01     0   457    11     0     0     0
   424  0.15846005E-01     0   450    12     0     0     0
   424  0.25672726E-01     0   451    12     0     0     0
   424  0.49131919E-01     0   452    12     0     0     0
   424  0.61405167E-01     0   453    12     0     0     0
   6
   425  0.87023951E-01     0   450   121     0     0     0
   425  0.30806163E+00     0   451   121     0     0     0
   425  0.48934373E-04     0   452   121     0     0     0
   425  0.42640397E-03     0   453   121     0     0     0
   425  0.60143346E+00     0   456   122     0     0     0
   425  0.30055929E-02     0   457   122     0     0     0
   6
   426  0.98370768E-01     0   450   122     0     0     0
   426  0.29485661E+00     0   451   122     0     0     0
   426  0.18483838E-03     0   452   122     0     0     0
   426  0.13186211E-02     0   453   122     0     0     0
   426  0.60460269E+00     0   454   121     0     0     0
   426  0.66643354E-03     0   455   121     0     0     0
   6
   427  0.87023951E-01     0   450   123     0     0     0
   427  0.30806163E+00     0   451   123     0     0     0
   427  0.48934373E-04     0   452   123     0     0     0
   427  0.42640397E-03     0   453   123     0     0     0
   427  0.60143346E+00     0   456   124     0     0     0
   427  0.30055929E-02     0   457   124     0     0     0
   6
   428  0.98370768E-01     0   450   124     0     0     0
   428  0.29485661E+00     0   451   124     0     0     0
   428  0.18483838E-03     0   452   124     0     0     0
   428  0.13186211E-02     0   453   124     0     0     0
   428  0.60460269E+00     0   454   123     0     0     0
   428  0.66643354E-03     0   455   123     0     0     0
   6
   429  0.33735588E+00     0   450   125     0     0     0
   429  0.22413389E+00     0   451   125     0     0     0
   429  0.63071924E-03     0   452   125     0     0     0
   429  0.13335363E-03     0   453   125     0     0     0
   429  0.43757480E+00     0   456   126     0     0     0
   429  0.17135889E-03     0   457   126     0     0     0
   6
   430  0.98220818E-01     0   450   126     0     0     0
   430  0.29440716E+00     0   451   126     0     0     0
   430  0.18455663E-03     0   452   126     0     0     0
   430  0.13166111E-02     0   453   126     0     0     0
   430  0.60369891E+00     0   454   125     0     0     0
   430  0.21719651E-02     0   455   125     0     0     0
   6
   431  0.87023951E-01     0   450   127     0     0     0
   431  0.30806163E+00     0   451   127     0     0     0
   431  0.48934373E-04     0   452   127     0     0     0
   431  0.42640397E-03     0   453   127     0     0     0
   431  0.60143346E+00     0   454   128     0     0     0
   431  0.30055929E-02     0   455   128     0     0     0
   6
   432  0.98370768E-01     0   450   128     0     0     0
   432  0.29485661E+00     0   451   128     0     0     0
   432  0.18483838E-03     0   452   128     0     0     0
   432  0.13186211E-02     0   453   128     0     0     0
   432  0.60460269E+00     0   456   127     0     0     0
   432  0.66643354E-03     0   457   127     0     0     0
   6
   433  0.87023951E-01     0   450   129     0     0     0
   433  0.30806163E+00     0   451   129     0     0     0
   433  0.48934373E-04     0   452   129     0     0     0
   433  0.42640397E-03     0   453   129     0     0     0
   433  0.60143346E+00     0   454   130     0     0     0
   433  0.30055929E-02     0   455   130     0     0     0
   6
   434  0.98370768E-01     0   450   130     0     0     0
   434  0.29485661E+00     0   451   130     0     0     0
   434  0.18483838E-03     0   452   130     0     0     0
   434  0.13186211E-02     0   453   130     0     0     0
   434  0.60460269E+00     0   456   129     0     0     0
   434  0.66643354E-03     0   457   129     0     0     0
   6
   435  0.33735588E+00     0   450   131     0     0     0
   435  0.22413389E+00     0   451   131     0     0     0
   435  0.63071924E-03     0   452   131     0     0     0
   435  0.13335363E-03     0   453   131     0     0     0
   435  0.43757480E+00     0   454   132     0     0     0
   435  0.17135889E-03     0   455   132     0     0     0
   6
   436  0.98220818E-01     0   450   132     0     0     0
   436  0.29440716E+00     0   451   132     0     0     0
   436  0.18455663E-03     0   452   132     0     0     0
   436  0.13166111E-02     0   453   132     0     0     0
   436  0.60369891E+00     0   456   131     0     0     0
   436  0.21719651E-02     0   457   131     0     0     0
   4
   437  0.99884564E+00     0   450   121     0     0     0
   437  0.37350314E-03     0   451   121     0     0     0
   437  0.11770990E-03     0   452   121     0     0     0
   437  0.66314137E-03     0   453   121     0     0     0
   0
   4
   439  0.99884564E+00     0   450   123     0     0     0
   439  0.37350314E-03     0   451   123     0     0     0
   439  0.11770990E-03     0   452   123     0     0     0
   439  0.66314137E-03     0   453   123     0     0     0
   0
   6
   441  0.32803550E+00     0   450   125     0     0     0
   441  0.22397685E+00     0   451   125     0     0     0
   441  0.17146326E-02     0   452   125     0     0     0
   441  0.30330908E-02     0   453   125     0     0     0
   441  0.43686312E+00     0   456   126     0     0     0
   441  0.63768202E-02     0   457   126     0     0     0
   0
   4
   443  0.99884564E+00     0   450   127     0     0     0
   443  0.37350314E-03     0   451   127     0     0     0
   443  0.11770990E-03     0   452   127     0     0     0
   443  0.66314137E-03     0   453   127     0     0     0
   0
   4
   445  0.99884564E+00     0   450   129     0     0     0
   445  0.37350314E-03     0   451   129     0     0     0
   445  0.11770990E-03     0   452   129     0     0     0
   445  0.66314137E-03     0   453   129     0     0     0
   0
   6
   447  0.32803550E+00     0   450   131     0     0     0
   447  0.22397685E+00     0   451   131     0     0     0
   447  0.17146326E-02     0   452   131     0     0     0
   447  0.30330908E-02     0   453   131     0     0     0
   447  0.43686312E+00     0   454   132     0     0     0
   447  0.63768202E-02     0   455   132     0     0     0
   0
  16
   449  0.76211910E-02     0   454     1     8     0     0
   449  0.76211910E-02     0   456     2     7     0     0
   449  0.76211900E-02     0   454     3    10     0     0
   449  0.76211900E-02     0   456     4     9     0     0
   449  0.18876583E-02     0   450    13     0     0     0
   449  0.32463413E+00     0   450     2     8     0     0
   449  0.10016850E+00     0   450     1     7     0     0
   449  0.10016850E+00     0   450     3     9     0     0
   449  0.32463408E+00     0   450     4    10     0     0
   449  0.98997056E-01     0   450     5    11     0     0
   449  0.45980886E-03     0   451    13     0     0     0
   449  0.38267355E-02     0   451     2     8     0     0
   449  0.37670711E-02     0   451     1     7     0     0
   449  0.37670711E-02     0   451     3     9     0     0
   449  0.38267346E-02     0   451     4    10     0     0
   449  0.33779331E-02     0   451     5    11     0     0
   0
  13
   451  0.84047439E-04     0   450    59     0     0     0
   451  0.99495625E+00     0   450   200     0     0     0
   451  0.11320356E-04     0   450     2     8     0     0
   451  0.16097929E-04     0   450     1     7     0     0
   451  0.16097929E-04     0   450     3     9     0     0
   451  0.11320353E-04     0   450     4    10     0     0
   451  0.40527233E-02     0   450     5    11     0     0
   451  0.39173188E-04     0   450   121   127     0     0
   451  0.39173188E-04     0   450   123   129     0     0
   451  0.64649695E-03     0   450   125   131     0     0
   451  0.42434098E-04     0   450   122   128     0     0
   451  0.42434098E-04     0   450   124   130     0     0
   451  0.42434098E-04     0   450   126   132     0     0
  12
   452  0.20878628E+00     0   454   199     0     0     0
   452  0.20878628E+00     0   456   198     0     0     0
   452  0.93564309E-01     0   454   207     0     0     0
   452  0.93564309E-01     0   456   206     0     0     0
   452  0.55278286E-01     0   450   200     0     0     0
   452  0.18254554E+00     0   451   200     0     0     0
   452  0.89082709E-02     0   450   203     0     0     0
   452  0.18702488E-01     0   450   204     0     0     0
   452  0.15207108E-01     0   450   205     0     0     0
   452  0.21820329E-01     0   451   203     0     0     0
   452  0.42889860E-01     0   451   204     0     0     0
   452  0.49946930E-01     0   451   205     0     0     0
  12
   453  0.20999086E+00     0   454   199     0     0     0
   453  0.20999086E+00     0   456   198     0     0     0
   453  0.94350375E-01     0   454   207     0     0     0
   453  0.94350375E-01     0   456   206     0     0     0
   453  0.97785918E-02     0   450   200     0     0     0
   453  0.24037747E-01     0   451   200     0     0     0
   453  0.55020001E-01     0   450   203     0     0     0
   453  0.14018699E-01     0   450   204     0     0     0
   453  0.18361829E-01     0   450   205     0     0     0
   453  0.18182713E+00     0   451   203     0     0     0
   453  0.46035029E-01     0   451   204     0     0     0
   453  0.42238511E-01     0   451   205     0     0     0
   1
   454  0.10000000E+01     0   450   198     0     0     0
   8
   455  0.56259040E-01     0   450   198     0     0     0
   455  0.28917529E-01     0   450   206     0     0     0
   455  0.21309720E+00     0   451   198     0     0     0
   455  0.96864000E-01     0   451   206     0     0     0
   455  0.21080603E+00     0   454   200     0     0     0
   455  0.20708065E+00     0   454   203     0     0     0
   455  0.91933824E-01     0   454   204     0     0     0
   455  0.95041707E-01     0   454   205     0     0     0
   1
   456  0.10000000E+01     0   450   199     0     0     0
   8
   457  0.56259040E-01     0   450   199     0     0     0
   457  0.28917529E-01     0   450   207     0     0     0
   457  0.21309720E+00     0   451   199     0     0     0
   457  0.96864000E-01     0   451   207     0     0     0
   457  0.21080603E+00     0   456   200     0     0     0
   457  0.20708065E+00     0   456   203     0     0     0
   457  0.91933824E-01     0   456   204     0     0     0
   457  0.95041707E-01     0   456   205     0     0     0
  28
   203  0.21482336E-03     0   123   129     0     0     0
   203  0.61426479E-01     0   125   131     0     0     0
   203  0.25832409E-02     0     3     9     0     0     0
   203  0.85598701E+00     0     5    11     0     0     0
   203  0.33297706E-01     0     4    10     0     0     0
   203  0.13683650E-02     0    59    59     0     0     0
   203  0.30481571E-01     0    13    13     0     0     0
   203  0.78550645E-03     0   198   121   128     0     0
   203  0.78550645E-03     0   198   123   130     0     0
   203  0.78550645E-03     0   198   125   132     0     0
   203  0.23565192E-02     0   198     8     1     0     0
   203  0.23565192E-02     0   198    10     3     0     0
   203  0.78550645E-03     0   199   127   122     0     0
   203  0.78550645E-03     0   199   129   124     0     0
   203  0.78550645E-03     0   199   131   126     0     0
   203  0.23565192E-02     0   199     2     7     0     0
   203  0.23565192E-02     0   199     4     9     0     0
   203  0.34313918E-04     0   200   122   128     0     0
   203  0.34313918E-04     0   200   124   130     0     0
   203  0.34313918E-04     0   200   126   132     0     0
   203  0.17269851E-04     0   200   121   127     0     0
   203  0.17269851E-04     0   200   123   129     0     0
   203  0.17269851E-04     0   200   125   131     0     0
   203  0.59165042E-04     0   200     2     8     0     0
   203  0.59165042E-04     0   200     4    10     0     0
   203  0.76219156E-04     0   200     1     7     0     0
   203  0.76219156E-04     0   200     3     9     0     0
   203  0.76219156E-04     0   200     5    11     0     0
  10
   204  0.48685877E-04     0   123   129     0     0     0
   204  0.13943350E-01     0   125   131     0     0     0
   204  0.57424686E-03     0     3     9     0     0     0
   204  0.15403751E+00     0     5    11     0     0     0
   204  0.31848416E-04     0     4    10     0     0     0
   204  0.76538450E+00     0     6    12     0     0     0
   204  0.10919316E-02     0    13    13     0     0     0
   204  0.11211479E-01     0   198   199     0     0     0
   204  0.55125337E-02     0   200   200     0     0     0
   204  0.48163895E-01     0   203   203     0     0     0
   9
   205  0.36246125E-04     0   123   129     0     0     0
   205  0.10381184E-01     0   125   131     0     0     0
   205  0.42756542E-03     0     3     9     0     0     0
   205  0.11487336E+00     0     5    11     0     0     0
   205  0.20293153E-04     0     4    10     0     0     0
   205  0.86617017E+00     0     6    12     0     0     0
   205  0.70466904E-03     0    13    13     0     0     0
   205  0.11321762E-04     0   450   450     0     0     0
   205  0.73751952E-02     0   203   200     0     0     0
   5
   206  0.46718764E-04     0   124   129     0     0     0
   206  0.13380646E-01     0   126   131     0     0     0
   206  0.52725914E-03     0     4     9     0     0     0
   206  0.97594541E+00     0     6    11     0     0     0
   206  0.10099929E-01     0   203   198     0     0     0
   5
   207  0.46718764E-04     0   130   123     0     0     0
   207  0.13380646E-01     0   132   125     0     0     0
   207  0.52725914E-03     0    10     3     0     0     0
   207  0.97594541E+00     0    12     5     0     0     0
   207  0.10099929E-01     0   203   199     0     0     0
   0
   5
     6  0.33333334E+00   100     2     7     5     0     0
     6  0.33333334E+00   100     4     9     5     0     0
     6  0.11111111E+00   100   122   127     5     0     0
     6  0.11111111E+00   100   124   129     5     0     0
     6  0.11111111E+00   100   126   131     5     0     0
   5
    12  0.33333334E+00   100     8     1    11     0     0
    12  0.33333334E+00   100    10     3    11     0     0
    12  0.11111111E+00   100   128   121    11     0     0
    12  0.11111111E+00   100   130   123    11     0     0
    12  0.11111111E+00   100   132   125    11     0     0
      4.00000000     -0.26411885
      0.99917907     -0.01694829      0.03404354     -0.01396637
     -0.01945202     -0.99743545      0.06232144     -0.02932578
      0.01377670     -0.02360150     -0.70629966     -0.70738512
      0.03275803     -0.06540696     -0.70434195      0.70608163
     -0.99912071      0.04192594     -0.04192594     -0.99912071
     -0.99603337      0.08898030     -0.08898030     -0.99603337
     -0.77800179     -0.82854742     -0.79221922
      0.00000000      0.00000000      0.00000000
   1400.00000000
    T
