#  ISAJET SUSY parameters in Les Houches accord format
#  Created by ISALHA3. Last revision by C. Balazs on 2005 Jan. 10
Block SPINFO   # Program information
     1   ISASUGRA from ISAJET          # Spectrum Calculator
     2   7.79   16-DEC-2008 15:42:00   # Version number
Block MODSEL   # Model selection
     1     1   # Minimal supergravity (mSUGRA,CMSSM) model         
Block SMINPUTS   # Standard Model inputs
     1     1.27835091E+02   # alpha_em^(-1)
     2     1.16570000E-05   # G_Fermi
     3     1.17200002E-01   # alpha_s(M_Z)
     4     9.11699982E+01   # m_{Z}(pole)
     5     4.19999981E+00   # m_{b}(m_{b})
     6     1.72500000E+02   # m_{top}(pole)
     7     1.77699995E+00   # m_{tau}(pole)
Block MINPAR   # SUSY breaking input parameters
     1     2.00000000E+02   # m_0
     2     2.20000000E+02   # m_{1/2}
     3     3.00000000E+00   # tan(beta)
     4     1.00000000E+00   # sign(mu)
     5     0.00000000E+00   # A_0
#  
#  M_{GUT} =   0.23819575E+17
Block MASS   # Scalar and gaugino mass spectrum
#  PDG code   mass                 particle
        24     8.04229965E+01   #  W^+
        25     9.61241379E+01   #  h^0            
        35     4.53104919E+02   #  H^0            
        36     4.46676483E+02   #  A^0            
        37     4.56471405E+02   #  H^+            
   1000001     5.38137390E+02   #  dnl            
   1000002     5.33014526E+02   #  upl            
   1000003     5.38137451E+02   #  stl            
   1000004     5.33016357E+02   #  chl            
   1000005     4.88105865E+02   #  b1             
   1000006     3.60008331E+02   #  t1             
   1000011     2.52802216E+02   #  el-            
   1000012     2.41655380E+02   #  nuel           
   1000013     2.52802231E+02   #  mul-           
   1000014     2.41655380E+02   #  numl           
   1000015     2.18573715E+02   #  tau1           
   1000016     2.41118317E+02   #  nutl           
   1000021     5.47637390E+02   #  glss           
   1000022     8.23178711E+01   #  z1ss           
   1000023     1.51496292E+02   #  z2ss           
   1000024     1.49936691E+02   #  w1ss           
   1000025    -3.46793304E+02   #  z3ss           
   1000035     3.75798401E+02   #  z4ss           
   1000037     3.71247711E+02   #  w2ss           
   2000001     5.20008484E+02   #  dnr            
   2000002     5.19715881E+02   #  upr            
   2000003     5.20008545E+02   #  str            
   2000004     5.19717773E+02   #  chr            
   2000005     5.19145020E+02   #  b2             
   2000006     5.52437866E+02   #  t2             
   2000011     2.18992950E+02   #  er-            
   2000013     2.18992966E+02   #  mur-           
   2000015     2.52813309E+02   #  tau2           
#  Higgs mixing
Block ALPHA   # Effective Higgs mixing parameter
         -3.46278012E-01   # alpha
Block STOPMIX   # stop mixing matrix
  1  1     5.46879113E-01   # O_{11}
  1  2    -8.37211609E-01   # O_{12}
  2  1     8.37211609E-01   # O_{21}
  2  2     5.46879113E-01   # O_{22}
Block SBOTMIX   # sbottom mixing matrix
  1  1     9.90746617E-01   # O_{11}
  1  2    -1.35724619E-01   # O_{12}
  2  1     1.35724619E-01   # O_{21}
  2  2     9.90746617E-01   # O_{22}
Block STAUMIX   # stau mixing matrix
  1  1     1.28229350E-01   # O_{11}
  1  2    -9.91744518E-01   # O_{12}
  2  1     9.91744518E-01   # O_{21}
  2  2     1.28229350E-01   # O_{22}
Block NMIX   # neutralino mixing matrix
  1  1     9.76289332E-01   #
  1  2    -1.15199529E-01   #
  1  3     1.61735222E-01   #
  1  4    -8.61975104E-02   #
  2  1    -1.68525100E-01   #
  2  2    -9.35099423E-01   #
  2  3     2.57831365E-01   #
  2  4    -1.75246686E-01   #
  3  1    -4.50387336E-02   #
  3  2     6.75993934E-02   #
  3  3     6.98789835E-01   #
  3  4     7.10700393E-01   #
  4  1    -1.28179669E-01   #
  4  2     3.28250617E-01   #
  4  3     6.47346854E-01   #
  4  4    -6.75843000E-01   #
Block UMIX   # chargino U mixing matrix
  1  1    -9.17608500E-01   # U_{11}
  1  2     3.97485465E-01   # U_{12}
  2  1    -3.97485465E-01   # U_{21}
  2  2    -9.17608500E-01   # U_{22}
Block VMIX   # chargino V mixing matrix
  1  1    -9.61964846E-01   # V_{11}
  1  2     2.73173332E-01   # V_{12}
  2  1    -2.73173332E-01   # V_{21}
  2  2    -9.61964846E-01   # V_{22}
Block GAUGE Q=  4.23019073E+02   #
     1     3.57524574E-01   # g`
     2     6.52393878E-01   # g_2
     3     1.21922970E+00   # g_3
Block YU Q=  4.23019073E+02   #
  3  3     9.27954197E-01   # y_t
Block YD Q=  4.23019073E+02   #
  3  3     4.45010215E-02   # y_b
Block YE Q=  4.23019073E+02   #
  3  3     3.17766145E-02   # y_tau
Block HMIX Q=  4.23019073E+02   # Higgs mixing parameters
     1     3.44528656E+02   # mu(Q)
     2     3.00000000E+00   # tan(beta)(M_{GUT})
     3     2.50101166E+02   # Higgs vev at Q
     4     1.99519875E+05   # m_A^2(Q)
Block MSOFT Q=  4.23019073E+02   # DRbar SUSY breaking parameters
     1     8.91579895E+01   # M_1(Q)          
     2     1.68682007E+02   # M_2(Q)          
     3     5.14628479E+02   # M_3(Q)          
    31     2.48408539E+02   # MeL(Q)          
    32     2.48408539E+02   # MmuL(Q)         
    33     2.47891754E+02   # MtauL(Q)        
    34     2.15528595E+02   # MeR(Q)          
    35     2.15528595E+02   # MmuR(Q)         
    36     2.15242508E+02   # MtauR(Q)        
    41     5.09041595E+02   # MqL1(Q)         
    42     5.09041595E+02   # MqL2(Q)         
    43     4.63255981E+02   # MqL3(Q)         
    44     4.94856323E+02   # MuR(Q)          
    45     4.94856323E+02   # McR(Q)          
    46     3.86277008E+02   # MtR(Q)          
    47     4.93579926E+02   # MdR(Q)          
    48     4.93579926E+02   # MsR(Q)          
    49     4.96713013E+02   # MbR(Q)          
Block AU Q=  4.23019073E+02   #
  1  1    -3.94675201E+02   # A_u
  2  2    -3.94675201E+02   # A_c
  3  3    -3.94675201E+02   # A_t
Block AD Q=  4.23019073E+02   #
  1  1    -6.29904053E+02   # A_d
  2  2    -6.29904053E+02   # A_s
  3  3    -6.29904053E+02   # A_b
Block AE Q=  4.23019073E+02   #
  1  1    -1.39386246E+02   # A_e
  2  2    -1.39386246E+02   # A_mu
  3  3    -1.39386246E+02   # A_tau
#  ISAJET decay tables in SUSY Les Houches accord format
#  Created by ISALHD. Last revision: C. Balazs, 2005 May 25
Block DCINFO                           # Program information
     1   ISASUGRA from ISAJET          # Spectrum Calculator
     2   7.79   16-DEC-2008 15:42:00   # Version number
#         PDG         Width
DECAY         6  1.14680767E+00   # TP    decays
#          BR          NDA       ID1       ID2       ID3       ID4
      3.33333343E-01    3            2        -1         5             # TP     -->  UP     DB     BT          
      3.33333343E-01    3            4        -3         5             # TP     -->  CH     SB     BT          
      1.11111112E-01    3          -11        12         5             # TP     -->  E+     NUE    BT          
      1.11111112E-01    3          -13        14         5             # TP     -->  MU+    NUM    BT          
      1.11111112E-01    3          -15        16         5             # TP     -->  TAU+   NUT    BT          
#         PDG         Width
DECAY   1000021  1.59388971E+00   # GLSS  decays
#          BR          NDA       ID1       ID2       ID3       ID4
      2.50332640E-04    3      1000024         5        -6             # GLSS   -->  W1SS+  BT     TB          
      2.50332640E-04    3     -1000024         6        -5             # GLSS   -->  W1SS-  TP     BB          
      7.13475913E-07    2      1000022        21                       # GLSS   -->  Z1SS   GL                 
      1.46395678E-05    3      1000022         6        -6             # GLSS   -->  Z1SS   TP     TB          
      6.00133717E-07    2      1000023        21                       # GLSS   -->  Z2SS   GL                 
      1.63947570E-05    3      1000023         6        -6             # GLSS   -->  Z2SS   TP     TB          
      5.09282836E-05    2      1000025        21                       # GLSS   -->  Z3SS   GL                 
      2.56853527E-05    2      1000035        21                       # GLSS   -->  Z4SS   GL                 
      1.17059881E-02    2     -1000002         2                       # GLSS   -->  UBL    UP                 
      1.17059881E-02    2      1000002        -2                       # GLSS   -->  UPL    UB                 
      4.98767430E-03    2     -1000001         1                       # GLSS   -->  DBL    DN                 
      4.98767430E-03    2      1000001        -1                       # GLSS   -->  DNL    DB                 
      4.16356958E-02    2     -2000002         2                       # GLSS   -->  UBR    UP                 
      4.16356958E-02    2      2000002        -2                       # GLSS   -->  UPR    UB                 
      4.07899953E-02    2     -2000001         1                       # GLSS   -->  DBR    DN                 
      4.07899953E-02    2      2000001        -1                       # GLSS   -->  DNR    DB                 
      4.98654367E-03    2     -1000003         3                       # GLSS   -->  SBL    ST                 
      4.98654367E-03    2      1000003        -3                       # GLSS   -->  STL    SB                 
      4.07888070E-02    2     -2000003         3                       # GLSS   -->  SBR    ST                 
      4.07888070E-02    2      2000003        -3                       # GLSS   -->  STR    SB                 
      1.16544422E-02    2     -1000004         4                       # GLSS   -->  CBL    CH                 
      1.16544422E-02    2      1000004        -4                       # GLSS   -->  CHL    CB                 
      4.15840149E-02    2     -2000004         4                       # GLSS   -->  CBR    CH                 
      4.15840149E-02    2      2000004        -4                       # GLSS   -->  CHR    CB                 
      1.73423782E-01    2     -1000005         5                       # GLSS   -->  BB1    BT                 
      1.73423782E-01    2      1000005        -5                       # GLSS   -->  BT1    BB                 
      4.47377339E-02    2     -2000005         5                       # GLSS   -->  BB2    BT                 
      4.47377339E-02    2      2000005        -5                       # GLSS   -->  BT2    BB                 
      8.34005252E-02    2     -1000006         6                       # GLSS   -->  TB1    TP                 
      8.34005252E-02    2      1000006        -6                       # GLSS   -->  TP1    TB                 
#         PDG         Width
DECAY   1000002  5.44297838E+00   # UPL   decays
#          BR          NDA       ID1       ID2       ID3       ID4
      1.59194460E-03    2      1000022         2                       # UPL    -->  Z1SS   UP                 
      3.24998111E-01    2      1000023         2                       # UPL    -->  Z2SS   UP                 
      4.82841133E-04    2      1000025         2                       # UPL    -->  Z3SS   UP                 
      9.68362484E-03    2      1000035         2                       # UPL    -->  Z4SS   UP                 
      6.46934271E-01    2      1000024         1                       # UPL    -->  W1SS+  DN                 
      1.63091980E-02    2      1000037         1                       # UPL    -->  W2SS+  DN                 
#         PDG         Width
DECAY   1000001  5.27690315E+00   # DNL   decays
#          BR          NDA       ID1       ID2       ID3       ID4
      3.54029797E-02    2      1000022         1                       # DNL    -->  Z1SS   DN                 
      2.97549307E-01    2      1000023         1                       # DNL    -->  Z2SS   DN                 
      8.44349968E-04    2      1000025         1                       # DNL    -->  Z3SS   DN                 
      1.39398901E-02    2      1000035         1                       # DNL    -->  Z4SS   DN                 
      6.15008831E-01    2     -1000024         2                       # DNL    -->  W1SS-  UP                 
      3.72546613E-02    2     -1000037         2                       # DNL    -->  W2SS-  UP                 
#         PDG         Width
DECAY   1000003  5.27684736E+00   # STL   decays
#          BR          NDA       ID1       ID2       ID3       ID4
      3.54033634E-02    2      1000022         3                       # STL    -->  Z1SS   ST                 
      2.97552526E-01    2      1000023         3                       # STL    -->  Z2SS   ST                 
      8.44359281E-04    2      1000025         3                       # STL    -->  Z3SS   ST                 
      1.39400456E-02    2      1000035         3                       # STL    -->  Z4SS   ST                 
      6.15006387E-01    2     -1000024         4                       # STL    -->  W1SS-  CH                 
      3.72533724E-02    2     -1000037         4                       # STL    -->  W2SS-  CH                 
#         PDG         Width
DECAY   1000004  5.44297552E+00   # CHL   decays
#          BR          NDA       ID1       ID2       ID3       ID4
      1.59193005E-03    2      1000022         4                       # CHL    -->  Z1SS   CH                 
      3.24994832E-01    2      1000023         4                       # CHL    -->  Z2SS   CH                 
      4.82829288E-04    2      1000025         4                       # CHL    -->  Z3SS   CH                 
      9.68330260E-03    2      1000035         4                       # CHL    -->  Z4SS   CH                 
      6.46937609E-01    2      1000024         3                       # CHL    -->  W1SS+  ST                 
      1.63094737E-02    2      1000037         3                       # CHL    -->  W2SS+  ST                 
#         PDG         Width
DECAY   1000005  4.44576025E+00   # BT1   decays
#          BR          NDA       ID1       ID2       ID3       ID4
      3.93125564E-02    2      1000022         5                       # BT1    -->  Z1SS   BT                 
      3.05157244E-01    2      1000023         5                       # BT1    -->  Z2SS   BT                 
      9.51243332E-04    2      1000025         5                       # BT1    -->  Z3SS   BT                 
      9.20031033E-03    2      1000035         5                       # BT1    -->  Z4SS   BT                 
      4.24932301E-01    2     -1000024         6                       # BT1    -->  W1SS-  TP                 
      2.20446318E-01    2          -24   1000006                       # BT1    -->  W-     TP1                
#         PDG         Width
DECAY   1000006  2.04992247E+00   # TP1   decays
#          BR          NDA       ID1       ID2       ID3       ID4
      1.61914915E-01    2      1000022         6                       # TP1    -->  Z1SS   TP                 
      1.11396737E-01    2      1000023         6                       # TP1    -->  Z2SS   TP                 
      7.26688266E-01    2      1000024         5                       # TP1    -->  W1SS+  BT                 
#         PDG         Width
DECAY   2000002  1.09738123E+00   # UPR   decays
#          BR          NDA       ID1       ID2       ID3       ID4
      9.69869018E-01    2      1000022         2                       # UPR    -->  Z1SS   UP                 
      2.54579466E-02    2      1000023         2                       # UPR    -->  Z2SS   UP                 
      6.68317545E-04    2      1000025         2                       # UPR    -->  Z3SS   UP                 
      4.00471035E-03    2      1000035         2                       # UPR    -->  Z4SS   UP                 
#         PDG         Width
DECAY   2000001  2.74519742E-01   # DNR   decays
#          BR          NDA       ID1       ID2       ID3       ID4
      9.69854832E-01    2      1000022         1                       # DNR    -->  Z1SS   DN                 
      2.54614148E-02    2      1000023         1                       # DNR    -->  Z2SS   DN                 
      6.69476402E-04    2      1000025         1                       # DNR    -->  Z3SS   DN                 
      4.01429925E-03    2      1000035         1                       # DNR    -->  Z4SS   DN                 
#         PDG         Width
DECAY   2000003  2.74519771E-01   # STR   decays
#          BR          NDA       ID1       ID2       ID3       ID4
      9.69854832E-01    2      1000022         3                       # STR    -->  Z1SS   ST                 
      2.54614167E-02    2      1000023         3                       # STR    -->  Z2SS   ST                 
      6.69476634E-04    2      1000025         3                       # STR    -->  Z3SS   ST                 
      4.01430158E-03    2      1000035         3                       # STR    -->  Z4SS   ST                 
#         PDG         Width
DECAY   2000004  1.09737003E+00   # CHR   decays
#          BR          NDA       ID1       ID2       ID3       ID4
      9.69869256E-01    2      1000022         4                       # CHR    -->  Z1SS   CH                 
      2.54579280E-02    2      1000023         4                       # CHR    -->  Z2SS   CH                 
      6.68305380E-04    2      1000025         4                       # CHR    -->  Z3SS   CH                 
      4.00459301E-03    2      1000035         4                       # CHR    -->  Z4SS   CH                 
#         PDG         Width
DECAY   2000005  3.67580533E-01   # BT2   decays
#          BR          NDA       ID1       ID2       ID3       ID4
      7.04533458E-01    2      1000022         5                       # BT2    -->  Z1SS   BT                 
      6.78131506E-02    2      1000023         5                       # BT2    -->  Z2SS   BT                 
      1.21898521E-02    2      1000025         5                       # BT2    -->  Z3SS   BT                 
      2.10708454E-02    2      1000035         5                       # BT2    -->  Z4SS   BT                 
      7.32635260E-02    2     -1000024         6                       # BT2    -->  W1SS-  TP                 
      1.21129155E-01    2          -24   1000006                       # BT2    -->  W-     TP1                
#         PDG         Width
DECAY   2000006  6.17472982E+00   # TP2   decays
#          BR          NDA       ID1       ID2       ID3       ID4
      2.28823185E-01    2      1000024         5                       # TP2    -->  W1SS+  BT                 
      2.14349762E-01    2      1000037         5                       # TP2    -->  W2SS+  BT                 
      2.41768315E-01    2           23   1000006                       # TP2    -->  Z0     TP1                
      6.41145185E-02    2           25   1000006                       # TP2    -->  HL0    TP1                
      2.18190663E-02    2      1000022         6                       # TP2    -->  Z1SS   TP                 
      1.05671041E-01    2      1000023         6                       # TP2    -->  Z2SS   TP                 
      3.62157896E-02    2      1000025         6                       # TP2    -->  Z3SS   TP                 
      8.72382969E-02    2      1000035         6                       # TP2    -->  Z4SS   TP                 
#         PDG         Width
DECAY   1000011  1.36565411E+00   # EL-   decays
#          BR          NDA       ID1       ID2       ID3       ID4
      1.10577404E-01    2      1000022        11                       # EL-    -->  Z1SS   E-                 
      3.38030607E-01    2      1000023        11                       # EL-    -->  Z2SS   E-                 
      5.51392019E-01    2     -1000024        12                       # EL-    -->  W1SS-  NUE                
      2.94755921E-11    3      1000015        11       -15             # EL-    -->  TAU1-  E-     TAU+        
      1.53777199E-11    3     -1000015        11        15             # EL-    -->  TAU1+  E-     TAU-        
#         PDG         Width
DECAY   1000013  1.36565399E+00   # MUL-  decays
#          BR          NDA       ID1       ID2       ID3       ID4
      1.10577367E-01    2      1000022        13                       # MUL-   -->  Z1SS   MU-                
      3.38030398E-01    2      1000023        13                       # MUL-   -->  Z2SS   MU-                
      5.51392198E-01    2     -1000024        14                       # MUL-   -->  W1SS-  NUM                
      2.94756650E-11    3      1000015        13       -15             # MUL-   -->  TAU1-  MU-    TAU+        
      1.53777529E-11    3     -1000015        13        15             # MUL-   -->  TAU1+  MU-    TAU-        
#         PDG         Width
DECAY   1000015  7.94902384E-01   # TAU1- decays
#          BR          NDA       ID1       ID2       ID3       ID4
      9.70138907E-01    2      1000022        15                       # TAU1-  -->  Z1SS   TAU-               
      1.76460948E-02    2      1000023        15                       # TAU1-  -->  Z2SS   TAU-               
      1.22150313E-02    2     -1000024        16                       # TAU1-  -->  W1SS-  NUT                
#         PDG         Width
DECAY   1000012  1.31578708E+00   # NUEL  decays
#          BR          NDA       ID1       ID2       ID3       ID4
      2.56628603E-01    2      1000022        12                       # NUEL   -->  Z1SS   NUE                
      2.02157512E-01    2      1000023        12                       # NUEL   -->  Z2SS   NUE                
      5.41213870E-01    2      1000024        11                       # NUEL   -->  W1SS+  E-                 
      9.87024785E-12    3      1000015        12       -15             # NUEL   -->  TAU1-  NUE    TAU+        
      5.56040413E-12    3     -1000015        12        15             # NUEL   -->  TAU1+  NUE    TAU-        
      1.01379266E-13    3     -1000015        11        16             # NUEL   -->  TAU1+  E-     NUT         
#         PDG         Width
DECAY   1000014  1.31578636E+00   # NUML  decays
#          BR          NDA       ID1       ID2       ID3       ID4
      2.56628752E-01    2      1000022        14                       # NUML   -->  Z1SS   NUM                
      2.02157632E-01    2      1000023        14                       # NUML   -->  Z2SS   NUM                
      5.41213632E-01    2      1000024        13                       # NUML   -->  W1SS+  MU-                
      9.87025305E-12    3      1000015        14       -15             # NUML   -->  TAU1-  NUM    TAU+        
      5.56040717E-12    3     -1000015        14        15             # NUML   -->  TAU1+  NUM    TAU-        
      1.01381021E-13    3     -1000015        13        16             # NUML   -->  TAU1+  MU-    NUT         
#         PDG         Width
DECAY   1000016  1.30663657E+00   # NUTL  decays
#          BR          NDA       ID1       ID2       ID3       ID4
      2.57549644E-01    2      1000022        16                       # NUTL   -->  Z1SS   NUT                
      2.01949418E-01    2      1000023        16                       # NUTL   -->  Z2SS   NUT                
      5.40500760E-01    2      1000024        15                       # NUTL   -->  W1SS+  TAU-               
      8.83945955E-12    3     -1000015        16        15             # NUTL   -->  TAU1+  NUT    TAU-        
      1.91083913E-08    3      1000015        16       -15             # NUTL   -->  TAU1-  NUT    TAU+        
      1.91034211E-08    3      1000015        12       -11             # NUTL   -->  TAU1-  NUE    E+          
      1.91034211E-08    3      1000015        14       -13             # NUTL   -->  TAU1-  NUM    MU+         
      5.73102596E-08    3      1000015         2        -1             # NUTL   -->  TAU1-  UP     DB          
      5.73102596E-08    3      1000015         4        -3             # NUTL   -->  TAU1-  CH     SB          
#         PDG         Width
DECAY   2000011  7.91442096E-01   # ER-   decays
#          BR          NDA       ID1       ID2       ID3       ID4
      9.89132404E-01    2      1000022        11                       # ER-    -->  Z1SS   E-                 
      1.08676124E-02    2      1000023        11                       # ER-    -->  Z2SS   E-                 
      1.31431576E-34    3      1000015        12       -16             # ER-    -->  TAU1-  NUE    ANUT        
#         PDG         Width
DECAY   2000013  7.91441739E-01   # MUR-  decays
#          BR          NDA       ID1       ID2       ID3       ID4
      9.89132404E-01    2      1000022        13                       # MUR-   -->  Z1SS   MU-                
      1.08676013E-02    2      1000023        13                       # MUR-   -->  Z2SS   MU-                
      5.33830052E-30    3      1000015        14       -16             # MUR-   -->  TAU1-  NUM    ANUT        
#         PDG         Width
DECAY   2000015  1.35150433E+00   # TAU2- decays
#          BR          NDA       ID1       ID2       ID3       ID4
      1.20363690E-01    2      1000022        15                       # TAU2-  -->  Z1SS   TAU-               
      3.34595650E-01    2      1000023        15                       # TAU2-  -->  Z2SS   TAU-               
      5.45040607E-01    2     -1000024        16                       # TAU2-  -->  W1SS-  NUT                
#         PDG         Width
DECAY   1000023  4.71050453E-06   # Z2SS  decays
#          BR          NDA       ID1       ID2       ID3       ID4
      2.61942641E-05    2      1000022        22                       # Z2SS   -->  Z1SS   GM                 
      2.88889396E-06    3     -1000024         2        -1             # Z2SS   -->  W1SS-  UP     DB          
      9.62964577E-07    3     -1000024        12       -11             # Z2SS   -->  W1SS-  NUE    E+          
      9.62964577E-07    3     -1000024        14       -13             # Z2SS   -->  W1SS-  NUM    MU+         
      2.88889396E-06    3      1000024         1        -2             # Z2SS   -->  W1SS+  DN     UB          
      9.62964577E-07    3      1000024        11       -12             # Z2SS   -->  W1SS+  E-     ANUE        
      9.62964577E-07    3      1000024        13       -14             # Z2SS   -->  W1SS+  MU-    ANUM        
      9.70365256E-02    3      1000022         2        -2             # Z2SS   -->  Z1SS   UP     UB          
      1.49585947E-01    3      1000022         1        -1             # Z2SS   -->  Z1SS   DN     DB          
      1.49585947E-01    3      1000022         3        -3             # Z2SS   -->  Z1SS   ST     SB          
      9.70364287E-02    3      1000022         4        -4             # Z2SS   -->  Z1SS   CH     CB          
      1.60387963E-01    3      1000022         5        -5             # Z2SS   -->  Z1SS   BT     BB          
      5.44742867E-02    3      1000022        11       -11             # Z2SS   -->  Z1SS   E-     E+          
      5.44742495E-02    3      1000022        13       -13             # Z2SS   -->  Z1SS   MU-    MU+         
      6.22618198E-02    3      1000022        15       -15             # Z2SS   -->  Z1SS   TAU-   TAU+        
      5.79497367E-02    3      1000022        12       -12             # Z2SS   -->  Z1SS   NUE    ANUE        
      5.79497367E-02    3      1000022        14       -14             # Z2SS   -->  Z1SS   NUM    ANUM        
      5.92215434E-02    3      1000022        16       -16             # Z2SS   -->  Z1SS   NUT    ANUT        
#         PDG         Width
DECAY   1000025  2.24765563E+00   # Z3SS  decays
#          BR          NDA       ID1       ID2       ID3       ID4
      2.89196635E-07    2      1000022        22                       # Z3SS   -->  Z1SS   GM                 
      2.17864653E-07    2      1000023        22                       # Z3SS   -->  Z2SS   GM                 
      3.08061808E-01    2      1000024       -24                       # Z3SS   -->  W1SS+  W-                 
      3.08061808E-01    2     -1000024        24                       # Z3SS   -->  W1SS-  W+                 
      1.37603447E-01    2      1000022        23                       # Z3SS   -->  Z1SS   Z0                 
      2.18335658E-01    2      1000023        23                       # Z3SS   -->  Z2SS   Z0                 
      1.87458138E-08    3      1000022         2        -2             # Z3SS   -->  Z1SS   UP     UB          
      1.47618460E-08    3      1000022         1        -1             # Z3SS   -->  Z1SS   DN     DB          
      1.47618398E-08    3      1000022         3        -3             # Z3SS   -->  Z1SS   ST     SB          
      1.87454532E-08    3      1000022         4        -4             # Z3SS   -->  Z1SS   CH     CB          
      2.03690220E-07    3      1000022         5        -5             # Z3SS   -->  Z1SS   BT     BB          
      1.29689894E-08    3      1000022        15       -15             # Z3SS   -->  Z1SS   TAU-   TAU+        
      3.35994699E-08    3      1000023         2        -2             # Z3SS   -->  Z2SS   UP     UB          
      4.53899176E-08    3      1000023         1        -1             # Z3SS   -->  Z2SS   DN     DB          
      4.53898856E-08    3      1000023         3        -3             # Z3SS   -->  Z2SS   ST     SB          
      3.35988339E-08    3      1000023         4        -4             # Z3SS   -->  Z2SS   CH     CB          
      2.65370346E-07    3      1000023         5        -5             # Z3SS   -->  Z2SS   BT     BB          
      5.22281995E-09    3      1000023        15       -15             # Z3SS   -->  Z2SS   TAU-   TAU+        
      1.21147335E-02    2      1000022        25                       # Z3SS   -->  Z1SS   HL0                
      8.06519669E-03    2      1000023        25                       # Z3SS   -->  Z2SS   HL0                
      1.30898174E-04    2      1000011       -11                       # Z3SS   -->  EL-    E+                 
      1.30898174E-04    2     -1000011        11                       # Z3SS   -->  EL+    E-                 
      1.30898101E-04    2      1000013       -13                       # Z3SS   -->  MUL-   MU+                
      1.30898101E-04    2     -1000013        13                       # Z3SS   -->  MUL+   MU-                
      2.87718576E-04    2      2000011       -11                       # Z3SS   -->  ER-    E+                 
      2.87718576E-04    2     -2000011        11                       # Z3SS   -->  ER+    E-                 
      2.87718489E-04    2      2000013       -13                       # Z3SS   -->  MUR-   MU+                
      2.87718489E-04    2     -2000013        13                       # Z3SS   -->  MUR+   MU-                
      4.42738499E-04    2      1000015       -15                       # Z3SS   -->  TAU1-  TAU+               
      4.42738499E-04    2     -1000015        15                       # Z3SS   -->  TAU1+  TAU-               
      3.93027120E-04    2      2000015       -15                       # Z3SS   -->  TAU2-  TAU+               
      3.93027120E-04    2     -2000015        15                       # Z3SS   -->  TAU2+  TAU-               
      7.32966175E-04    2      1000012       -12                       # Z3SS   -->  NUEL   ANUE               
      7.32966175E-04    2     -1000012        12                       # Z3SS   -->  ANUEL  NUE                
      7.32966175E-04    2      1000014       -14                       # Z3SS   -->  NUML   ANUM               
      7.32966175E-04    2     -1000014        14                       # Z3SS   -->  ANUML  NUM                
      7.39122508E-04    2      1000016       -16                       # Z3SS   -->  NUTL   ANUT               
      7.39122508E-04    2     -1000016        16                       # Z3SS   -->  ANUTL  NUT                
#         PDG         Width
DECAY   1000035  2.84850931E+00   # Z4SS  decays
#          BR          NDA       ID1       ID2       ID3       ID4
      6.59217903E-07    2      1000022        22                       # Z4SS   -->  Z1SS   GM                 
      4.02655445E-07    2      1000023        22                       # Z4SS   -->  Z2SS   GM                 
      8.05817368E-09    2      1000025        22                       # Z4SS   -->  Z3SS   GM                 
      2.99745262E-01    2      1000024       -24                       # Z4SS   -->  W1SS+  W-                 
      2.99745262E-01    2     -1000024        24                       # Z4SS   -->  W1SS-  W+                 
      3.51218721E-10    3     -1000037         2        -1             # Z4SS   -->  W2SS-  UP     DB          
      1.17072893E-10    3     -1000037        12       -11             # Z4SS   -->  W2SS-  NUE    E+          
      1.17072893E-10    3     -1000037        14       -13             # Z4SS   -->  W2SS-  NUM    MU+         
      3.51218721E-10    3      1000037         1        -2             # Z4SS   -->  W2SS+  DN     UB          
      1.17072893E-10    3      1000037        11       -12             # Z4SS   -->  W2SS+  E-     ANUE        
      1.17072893E-10    3      1000037        13       -14             # Z4SS   -->  W2SS+  MU-    ANUM        
      3.51218721E-10    3     -1000037         4        -3             # Z4SS   -->  W2SS-  CH     SB          
      1.17072893E-10    3     -1000037        16       -15             # Z4SS   -->  W2SS-  NUT    TAU+        
      3.51218721E-10    3      1000037         3        -4             # Z4SS   -->  W2SS+  ST     CB          
      1.17072893E-10    3      1000037        15       -16             # Z4SS   -->  W2SS+  TAU-   ANUT        
      1.22016212E-02    2      1000022        23                       # Z4SS   -->  Z1SS   Z0                 
      9.84450988E-03    2      1000023        23                       # Z4SS   -->  Z2SS   Z0                 
      3.91789598E-07    3      1000022         2        -2             # Z4SS   -->  Z1SS   UP     UB          
      7.41215047E-07    3      1000022         1        -1             # Z4SS   -->  Z1SS   DN     DB          
      7.41214535E-07    3      1000022         3        -3             # Z4SS   -->  Z1SS   ST     SB          
      3.91781924E-07    3      1000022         4        -4             # Z4SS   -->  Z1SS   CH     CB          
      1.35930452E-06    3      1000022         5        -5             # Z4SS   -->  Z1SS   BT     BB          
      1.12526264E-08    3      1000022        15       -15             # Z4SS   -->  Z1SS   TAU-   TAU+        
      3.27759381E-06    3      1000023         2        -2             # Z4SS   -->  Z2SS   UP     UB          
      3.62173910E-06    3      1000023         1        -1             # Z4SS   -->  Z2SS   DN     DB          
      3.62173660E-06    3      1000023         3        -3             # Z4SS   -->  Z2SS   ST     SB          
      3.27753105E-06    3      1000023         4        -4             # Z4SS   -->  Z2SS   CH     CB          
      6.44354850E-06    3      1000023         5        -5             # Z4SS   -->  Z2SS   BT     BB          
      4.45823112E-09    3      1000023        15       -15             # Z4SS   -->  Z2SS   TAU-   TAU+        
      7.48784487E-07    3      1000025         2        -2             # Z4SS   -->  Z3SS   UP     UB          
      9.70036467E-07    3      1000025         1        -1             # Z4SS   -->  Z3SS   DN     DB          
      9.70036467E-07    3      1000025         3        -3             # Z4SS   -->  Z3SS   ST     SB          
      7.48784487E-07    3      1000025         4        -4             # Z4SS   -->  Z3SS   CH     CB          
      6.95945744E-07    3      1000025         5        -5             # Z4SS   -->  Z3SS   BT     BB          
      2.19487362E-07    3      1000025        11       -11             # Z4SS   -->  Z3SS   E-     E+          
      2.19487362E-07    3      1000025        13       -13             # Z4SS   -->  Z3SS   MU-    MU+         
      2.07815674E-07    3      1000025        15       -15             # Z4SS   -->  Z3SS   TAU-   TAU+        
      4.36710820E-07    3      1000025        12       -12             # Z4SS   -->  Z3SS   NUE    ANUE        
      4.36710820E-07    3      1000025        14       -14             # Z4SS   -->  Z3SS   NUM    ANUM        
      4.36710820E-07    3      1000025        16       -16             # Z4SS   -->  Z3SS   NUT    ANUT        
      8.78969952E-02    2      1000022        25                       # Z4SS   -->  Z1SS   HL0                
      1.51180133E-01    2      1000023        25                       # Z4SS   -->  Z2SS   HL0                
      5.53094829E-03    2      1000011       -11                       # Z4SS   -->  EL-    E+                 
      5.53094829E-03    2     -1000011        11                       # Z4SS   -->  EL+    E-                 
      5.53094549E-03    2      1000013       -13                       # Z4SS   -->  MUL-   MU+                
      5.53094549E-03    2     -1000013        13                       # Z4SS   -->  MUL+   MU-                
      2.40423088E-03    2      2000011       -11                       # Z4SS   -->  ER-    E+                 
      2.40423088E-03    2     -2000011        11                       # Z4SS   -->  ER+    E-                 
      2.40423018E-03    2      2000013       -13                       # Z4SS   -->  MUR-   MU+                
      2.40423018E-03    2     -2000013        13                       # Z4SS   -->  MUR+   MU-                
      2.19212170E-03    2      1000015       -15                       # Z4SS   -->  TAU1-  TAU+               
      2.19212170E-03    2     -1000015        15                       # Z4SS   -->  TAU1+  TAU-               
      5.97285619E-03    2      2000015       -15                       # Z4SS   -->  TAU2-  TAU+               
      5.97285619E-03    2     -2000015        15                       # Z4SS   -->  TAU2+  TAU-               
      1.51823508E-02    2      1000012       -12                       # Z4SS   -->  NUEL   ANUE               
      1.51823508E-02    2     -1000012        12                       # Z4SS   -->  ANUEL  NUE                
      1.51823508E-02    2      1000014       -14                       # Z4SS   -->  NUML   ANUM               
      1.51823508E-02    2     -1000014        14                       # Z4SS   -->  ANUML  NUM                
      1.52775533E-02    2      1000016       -16                       # Z4SS   -->  NUTL   ANUT               
      1.52775533E-02    2     -1000016        16                       # Z4SS   -->  ANUTL  NUT                
#         PDG         Width
DECAY   1000024  1.35837108E-04   # W1SS+ decays
#          BR          NDA       ID1       ID2       ID3       ID4
      3.24584574E-01    3      1000022         2        -1             # W1SS+  -->  Z1SS   UP     DB          
      3.24584603E-01    3      1000022         4        -3             # W1SS+  -->  Z1SS   CH     SB          
      1.16857305E-01    3      1000022       -11        12             # W1SS+  -->  Z1SS   E+     NUE         
      1.16857305E-01    3      1000022       -13        14             # W1SS+  -->  Z1SS   MU+    NUM         
      1.17116243E-01    3      1000022       -15        16             # W1SS+  -->  Z1SS   TAU+   NUT         
#         PDG         Width
DECAY   1000037  2.81483984E+00   # W2SS+ decays
#          BR          NDA       ID1       ID2       ID3       ID4
      7.43926591E-07    3      1000022         2        -1             # W2SS+  -->  Z1SS   UP     DB          
      7.43925398E-07    3      1000022         4        -3             # W2SS+  -->  Z1SS   CH     SB          
      3.39465966E-09    3      1000022       -15        16             # W2SS+  -->  Z1SS   TAU+   NUT         
      4.06135581E-02    2      1000022        24                       # W2SS+  -->  Z1SS   W+                 
      3.00137208E-06    3      1000023         2        -1             # W2SS+  -->  Z2SS   UP     DB          
      3.00135343E-06    3      1000023         4        -3             # W2SS+  -->  Z2SS   CH     SB          
      1.40926000E-08    3      1000023       -15        16             # W2SS+  -->  Z2SS   TAU+   NUT         
      3.49565625E-01    2      1000023        24                       # W2SS+  -->  Z2SS   W+                 
      1.14643206E-06    3      1000025         2        -1             # W2SS+  -->  Z3SS   UP     DB          
      1.14643217E-06    3      1000025         4        -3             # W2SS+  -->  Z3SS   CH     SB          
      3.81894722E-07    3      1000025       -11        12             # W2SS+  -->  Z3SS   E+     NUE         
      3.81894722E-07    3      1000025       -13        14             # W2SS+  -->  Z3SS   MU+    NUM         
      3.81894779E-07    3      1000025       -15        16             # W2SS+  -->  Z3SS   TAU+   NUT         
      5.34410123E-03    2      1000006        -5                       # W2SS+  -->  TP1    BB                 
      1.37589667E-02    2      1000012       -11                       # W2SS+  -->  NUEL   E+                 
      1.37589658E-02    2      1000014       -13                       # W2SS+  -->  NUML   MU+                
      1.41557502E-02    2      1000016       -15                       # W2SS+  -->  NUTL   TAU+               
      2.52281427E-02    2     -1000011        12                       # W2SS+  -->  EL+    NUE                
      2.52281372E-02    2     -1000013        14                       # W2SS+  -->  MUL+   NUM                
      8.13178940E-06    2     -1000015        16                       # W2SS+  -->  TAU1+  NUT                
      2.55491715E-02    2     -2000015        16                       # W2SS+  -->  TAU2+  NUT                
      2.84000307E-01    2      1000024        23                       # W2SS+  -->  W1SS+  Z0                 
      3.50834512E-06    3      1000024         1        -1             # W2SS+  -->  W1SS+  DN     DB          
      3.50827736E-06    3      1000024         3        -3             # W2SS+  -->  W1SS+  ST     SB          
      6.40811231E-06    3      1000024         2        -2             # W2SS+  -->  W1SS+  UP     UB          
      6.40811004E-06    3      1000024         4        -4             # W2SS+  -->  W1SS+  CH     CB          
      2.02758327E-01    2      1000024        25                       # W2SS+  -->  W1SS+  HL0                
#         PDG         Width
DECAY        25  3.68227810E-03   # HL0   decays
#          BR          NDA       ID1       ID2       ID3       ID4
      5.11011367E-09    2           11       -11                       # HL0    -->  E-     E+                 
      2.15756692E-04    2           13       -13                       # HL0    -->  MU-    MU+                
      6.16697930E-02    2           15       -15                       # HL0    -->  TAU-   TAU+               
      6.43151816E-06    2            1        -1                       # HL0    -->  DN     DB                 
      2.59865401E-03    2            3        -3                       # HL0    -->  ST     SB                 
      8.73685062E-01    2            5        -5                       # HL0    -->  BT     BB                 
      1.75632363E-06    2            2        -2                       # HL0    -->  UP     UB                 
      3.39977928E-02    2            4        -4                       # HL0    -->  CH     CB                 
      1.08544901E-03    2           22        22                       # HL0    -->  GM     GM                 
      2.53124926E-02    2           21        21                       # HL0    -->  GL     GL                 
      7.92673527E-05    3           24        11       -12             # HL0    -->  W+     E-     ANUE        
      7.92673527E-05    3           24        13       -14             # HL0    -->  W+     MU-    ANUM        
      7.92673527E-05    3           24        15       -16             # HL0    -->  W+     TAU-   ANUT        
      2.37802073E-04    3           24        -2         1             # HL0    -->  W+     UB     DN          
      2.37802073E-04    3           24        -4         3             # HL0    -->  W+     CB     ST          
      7.92673527E-05    3          -24       -11        12             # HL0    -->  W-     E+     NUE         
      7.92673527E-05    3          -24       -13        14             # HL0    -->  W-     MU+    NUM         
      7.92673527E-05    3          -24       -15        16             # HL0    -->  W-     TAU+   NUT         
      2.37802073E-04    3          -24         2        -1             # HL0    -->  W-     UP     DB          
      2.37802073E-04    3          -24         4        -3             # HL0    -->  W-     CH     SB          
#         PDG         Width
DECAY        35  1.53785896E+00   # HH0   decays
#          BR          NDA       ID1       ID2       ID3       ID4
      4.43021370E-10    2           11       -11                       # HH0    -->  E-     E+                 
      1.87051555E-05    2           13       -13                       # HH0    -->  MU-    MU+                
      5.35695069E-03    2           15       -15                       # HH0    -->  TAU-   TAU+               
      5.46612625E-07    2            1        -1                       # HH0    -->  DN     DB                 
      2.20859147E-04    2            3        -3                       # HH0    -->  ST     SB                 
      3.42009664E-02    2            5        -5                       # HH0    -->  BT     BB                 
      2.52996868E-09    2            2        -2                       # HH0    -->  UP     UB                 
      3.93094269E-05    2            4        -4                       # HH0    -->  CH     CB                 
      6.88772380E-01    2            6        -6                       # HH0    -->  TP     TB                 
      1.51012273E-05    2           22        22                       # HH0    -->  GM     GM                 
      1.64367456E-03    2           21        21                       # HH0    -->  GL     GL                 
      9.80509631E-03    2           24       -24                       # HH0    -->  W+     W-                 
      4.77158930E-03    2           23        23                       # HH0    -->  Z0     Z0                 
      1.28664905E-02    2      1000022   1000022                       # HH0    -->  Z1SS   Z1SS               
      3.82490084E-02    2      1000022   1000023                       # HH0    -->  Z1SS   Z2SS               
      7.03122765E-02    2      1000022   1000025                       # HH0    -->  Z1SS   Z3SS               
      2.42474135E-02    2      1000023   1000023                       # HH0    -->  Z2SS   Z2SS               
      7.87967965E-02    2      1000024  -1000024                       # HH0    -->  W1SS+  W1SS-              
      2.85567585E-02    2           25        25                       # HH0    -->  HL0    HL0                
      7.00910343E-04    2      2000011  -2000011                       # HH0    -->  ER-    ER+                
      7.00871926E-04    2      2000013  -2000013                       # HH0    -->  MUR-   MUR+               
      7.24305457E-04    2      1000015  -1000015                       # HH0    -->  TAU1-  TAU1+              
#         PDG         Width
DECAY        36  3.06271696E+00   # HA0   decays
#          BR          NDA       ID1       ID2       ID3       ID4
      2.23060126E-10    2           11       -11                       # HA0    -->  E-     E+                 
      9.41799954E-06    2           13       -13                       # HA0    -->  MU-    MU+                
      2.69737444E-03    2           15       -15                       # HA0    -->  TAU-   TAU+               
      2.75256497E-07    2            1        -1                       # HA0    -->  DN     DB                 
      1.11217560E-04    2            3        -3                       # HA0    -->  ST     SB                 
      1.72266997E-02    2            5        -5                       # HA0    -->  BT     BB                 
      1.08732268E-09    2            2        -2                       # HA0    -->  UP     UB                 
      1.69256000E-05    2            4        -4                       # HA0    -->  CH     CB                 
      6.61926568E-01    2            6        -6                       # HA0    -->  TP     TB                 
      1.08240351E-06    2           22        22                       # HA0    -->  GM     GM                 
      6.70403359E-04    2           21        21                       # HA0    -->  GL     GL                 
      1.58314835E-02    2      1000022   1000022                       # HA0    -->  Z1SS   Z1SS               
      6.10034615E-02    2      1000022   1000023                       # HA0    -->  Z1SS   Z2SS               
      7.65954552E-04    2      1000022   1000025                       # HA0    -->  Z1SS   Z3SS               
      5.76345176E-02    2      1000023   1000023                       # HA0    -->  Z2SS   Z2SS               
      1.77787781E-01    2      1000024  -1000024                       # HA0    -->  W1SS+  W1SS-              
      4.31678770E-03    2           25        23                       # HA0    -->  HL0    Z0                 
#         PDG         Width
DECAY        37  2.12600684E+00   # H+    decays
#          BR          NDA       ID1       ID2       ID3       ID4
      3.28385985E-10    2           12       -11                       # H+     -->  NUE    E+                 
      1.38650475E-05    2           14       -13                       # H+     -->  NUM    MU+                
      3.97104211E-03    2           16       -15                       # H+     -->  NUT    TAU+               
      3.71233057E-07    2            2        -1                       # H+     -->  UP     DB                 
      1.72077198E-04    2            4        -3                       # H+     -->  CH     SB                 
      8.89101326E-01    2            6        -5                       # H+     -->  TP     BB                 
      9.31444094E-02    2      1000024   1000022                       # H+     -->  W1SS+  Z1SS               
      2.98281433E-03    2      1000024   1000023                       # H+     -->  W1SS+  Z2SS               
      3.75943189E-03    2      1000037   1000022                       # H+     -->  W2SS+  Z1SS               
      6.85468642E-03    2           25        24                       # H+     -->  HL0    W+                 
