#  ISAJET SUSY parameters in SUSY Les Houches Accord 2 format
#  Created by ISALHA 2.0 Last revision: C. Balazs 21 Apr 2009
Block SPINFO   # Program information
     1   ISASUGRA from ISAJET          # Spectrum Calculator
     2   7.80   29-OCT-2009 12:50:36   # Version number
Block MODSEL   # Model selection
     1     1   # Minimal supergravity (mSUGRA) model               
Block SMINPUTS   # Standard Model inputs
     1     1.27835068E+02   # alpha_em^(-1)
     2     1.16570000E-05   # G_Fermi
     3     1.17200002E-01   # alpha_s(M_Z)
     4     9.11699982E+01   # m_{Z}(pole)
     5     4.19999981E+00   # m_{b}(m_{b})
     6     1.72500000E+02   # m_{top}(pole)
     7     1.77699995E+00   # m_{tau}(pole)
Block MINPAR   # SUSY breaking input parameters
     1     5.20000000E+02   # m_0
     2     1.90000000E+02   # m_{1/2}
     3     4.00000000E+01   # tan(beta)
     4     1.00000000E+00   # sign(mu)
     5     0.00000000E+00   # A_0
Block EXTPAR   # Non-universal SUSY breaking parameters
     0     2.57453697E+16   # Input scale
Block MASS   # Scalar and gaugino mass spectrum
#  PDG code   mass                 particle
        24     8.04229965E+01   #  W^+
        25     1.08621658E+02   #  h^0            
        35     4.16765411E+02   #  H^0            
        36     4.14027161E+02   #  A^0            
        37     4.25409790E+02   #  H^+            
   1000001     6.71432922E+02   #  dnl            
   1000002     6.66567505E+02   #  upl            
   1000003     6.71432983E+02   #  stl            
   1000004     6.66568909E+02   #  chl            
   1000005     5.35134521E+02   #  b1             
   1000006     4.48506622E+02   #  t1             
   1000011     5.36021484E+02   #  el-            
   1000012     5.29761658E+02   #  nuel           
   1000013     5.36021484E+02   #  mul-           
   1000014     5.29761658E+02   #  numl           
   1000015     4.30316284E+02   #  tau1           
   1000016     4.88338867E+02   #  nutl           
   1000021     5.01849915E+02   #  glss           
   1000022     7.38088913E+01   #  z1ss           
   1000023     1.33009766E+02   #  z2ss           
   1000024     1.33106400E+02   #  w1ss           
   1000025    -2.60105652E+02   #  z3ss           
   1000035     2.82852570E+02   #  z4ss           
   1000037     2.83398224E+02   #  w2ss           
   2000001     6.61707092E+02   #  dnr            
   2000002     6.60957520E+02   #  upr            
   2000003     6.61707153E+02   #  str            
   2000004     6.60958923E+02   #  chr            
   2000005     5.99387695E+02   #  b2             
   2000006     5.82810120E+02   #  t2             
   2000011     5.25860413E+02   #  er-            
   2000013     5.25860413E+02   #  mur-           
   2000015     5.00500061E+02   #  tau2           
Block ALPHA   # Effective Higgs mixing parameter
         -2.67971326E-02   # alpha
Block STOPMIX   # stop mixing matrix
  1  1     4.30253327E-01   # O_{11}
  1  2     9.02708173E-01   # O_{12}
  2  1    -9.02708173E-01   # O_{21}
  2  2     4.30253327E-01   # O_{22}
Block SBOTMIX   # sbottom mixing matrix
  1  1     9.33906138E-01   # O_{11}
  1  2     3.57518345E-01   # O_{12}
  2  1    -3.57518345E-01   # O_{21}
  2  2     9.33906138E-01   # O_{22}
Block STAUMIX   # stau mixing matrix
  1  1     3.00608844E-01   # O_{11}
  1  2     9.53747511E-01   # O_{12}
  2  1    -9.53747511E-01   # O_{21}
  2  2     3.00608844E-01   # O_{22}
Block NMIX   # neutralino mixing matrix
  1  1    -9.71875370E-01   #
  1  2     7.63684511E-02   #
  1  3    -2.12393075E-01   #
  1  4     6.71943650E-02   #
  2  1     1.62435696E-01   #
  2  2     8.97843540E-01   #
  2  3    -3.57325196E-01   #
  2  4     1.99526116E-01   #
  3  1    -9.00568888E-02   #
  3  2     1.30384877E-01   #
  3  3     6.84184670E-01   #
  3  4     7.11885452E-01   #
  4  1    -1.44784048E-01   #
  4  2     4.13575739E-01   #
  4  3     5.99249065E-01   #
  4  4    -6.69994950E-01   #
Block UMIX   # chargino U mixing matrix
  1  1    -8.51011932E-01   # U_{11}
  1  2     5.25146365E-01   # U_{12}
  2  1    -5.25146365E-01   # U_{21}
  2  2    -8.51011932E-01   # U_{22}
Block VMIX   # chargino V mixing matrix
  1  1    -9.56440687E-01   # V_{11}
  1  2     2.91926771E-01   # V_{12}
  2  1    -2.91926771E-01   # V_{21}
  2  2    -9.56440687E-01   # V_{22}
Block GAUGE Q=  4.76472015E+02   #
     1     3.57525468E-01   # g`
     2     6.52388871E-01   # g_2
     3     1.21924841E+00   # g_3
Block YU Q=  4.76472015E+02   #
  3  3     8.80355060E-01   # y_t
Block YD Q=  4.76472015E+02   #
  3  3     5.22008777E-01   # y_b
Block YE Q=  4.76472015E+02   #
  3  3     4.14699137E-01   # y_tau
Block HMIX Q=  4.76472015E+02   # Higgs mixing parameters
     1     2.49462341E+02   # mu(Q)
     2     4.00000000E+01   # tan(beta)(M_GUT)
     3     2.50359558E+02   # Higgs vev at Q
     4     1.71418484E+05   # m_A^2(Q)
Block MSOFT Q=  4.76472015E+02   # DRbar SUSY breaking parameters
     1     7.73335114E+01   # M_1(Q)          
     2     1.46247543E+02   # M_2(Q)          
     3     4.51848236E+02   # M_3(Q)          
    31     5.32642944E+02   # MeL(Q)          
    32     5.32642944E+02   # MmuL(Q)         
    33     4.92034363E+02   # MtauL(Q)        
    34     5.23597107E+02   # MeR(Q)          
    35     5.23597107E+02   # MmuR(Q)         
    36     4.36158508E+02   # MtauR(Q)        
    41     6.46103882E+02   # MqL1(Q)         
    42     6.46103882E+02   # MqL2(Q)         
    43     5.20593933E+02   # MqL3(Q)         
    44     6.39198303E+02   # MuR(Q)          
    45     6.39198303E+02   # McR(Q)          
    46     4.36089569E+02   # MtR(Q)          
    47     6.38450745E+02   # MdR(Q)          
    48     6.38450745E+02   # MsR(Q)          
    49     5.74251404E+02   # MbR(Q)          
Block AU Q=  4.76472015E+02   #
  1  1    -3.46269379E+02   # A_u
  2  2    -3.46269379E+02   # A_c
  3  3    -3.46269379E+02   # A_t
Block AD Q=  4.76472015E+02   #
  1  1    -4.58942413E+02   # A_d
  2  2    -4.58942413E+02   # A_s
  3  3    -4.58942413E+02   # A_b
Block AE Q=  4.76472015E+02   #
  1  1    -6.59129257E+01   # A_e
  2  2    -6.59129257E+01   # A_mu
  3  3    -6.59129257E+01   # A_tau
#  ISAJET decay tables in SUSY Les Houches accord format
#  Created by ISALHD. Last revision: C. Balazs, 2005 May 25
Block DCINFO                           # Program information
     1   ISASUGRA from ISAJET          # Spectrum Calculator
     2   7.80   29-OCT-2009 12:50:36   # Version number
#         PDG         Width
DECAY         6  1.14680779E+00   # TP    decays
#          BR          NDA       ID1       ID2       ID3       ID4
      3.33333343E-01    3            2        -1         5             # TP     -->  UP     DB     BT          
      3.33333343E-01    3            4        -3         5             # TP     -->  CH     SB     BT          
      1.11111112E-01    3          -11        12         5             # TP     -->  E+     NUE    BT          
      1.11111112E-01    3          -13        14         5             # TP     -->  MU+    NUM    BT          
      1.11111112E-01    3          -15        16         5             # TP     -->  TAU+   NUT    BT          
#         PDG         Width
DECAY   1000021  1.70975532E-02   # GLSS  decays
#          BR          NDA       ID1       ID2       ID3       ID4
      6.36996850E-02    3      1000024         1        -2             # GLSS   -->  W1SS+  DN     UB          
      6.36996850E-02    3     -1000024         2        -1             # GLSS   -->  W1SS-  UP     DB          
      6.36992529E-02    3      1000024         3        -4             # GLSS   -->  W1SS+  ST     CB          
      6.36992529E-02    3     -1000024         4        -3             # GLSS   -->  W1SS-  CH     SB          
      7.40334019E-02    3      1000024         5        -6             # GLSS   -->  W1SS+  BT     TB          
      7.40334019E-02    3     -1000024         6        -5             # GLSS   -->  W1SS-  TP     BB          
      2.92918272E-03    3      1000037         1        -2             # GLSS   -->  W2SS+  DN     UB          
      2.92918272E-03    3     -1000037         2        -1             # GLSS   -->  W2SS-  UP     DB          
      2.92916922E-03    3      1000037         3        -4             # GLSS   -->  W2SS+  ST     CB          
      2.92916922E-03    3     -1000037         4        -3             # GLSS   -->  W2SS-  CH     SB          
      8.98080692E-03    3      1000037         5        -6             # GLSS   -->  W2SS+  BT     TB          
      8.98080692E-03    3     -1000037         6        -5             # GLSS   -->  W2SS-  TP     BB          
      4.18206386E-04    2      1000022        21                       # GLSS   -->  Z1SS   GL                 
      2.65402440E-02    3      1000022         2        -2             # GLSS   -->  Z1SS   UP     UB          
      9.51172877E-03    3      1000022         1        -1             # GLSS   -->  Z1SS   DN     DB          
      9.51172225E-03    3      1000022         3        -3             # GLSS   -->  Z1SS   ST     SB          
      2.65399273E-02    3      1000022         4        -4             # GLSS   -->  Z1SS   CH     CB          
      5.66099696E-02    3      1000022         5        -5             # GLSS   -->  Z1SS   BT     BB          
      4.63212049E-03    3      1000022         6        -6             # GLSS   -->  Z1SS   TP     TB          
      3.65973474E-03    2      1000023        21                       # GLSS   -->  Z2SS   GL                 
      3.47257666E-02    3      1000023         2        -2             # GLSS   -->  Z2SS   UP     UB          
      2.88374107E-02    3      1000023         1        -1             # GLSS   -->  Z2SS   DN     DB          
      2.88373940E-02    3      1000023         3        -3             # GLSS   -->  Z2SS   ST     SB          
      3.47253568E-02    3      1000023         4        -4             # GLSS   -->  Z2SS   CH     CB          
      1.86202854E-01    3      1000023         5        -5             # GLSS   -->  Z2SS   BT     BB          
      1.75997324E-04    3      1000023         6        -6             # GLSS   -->  Z2SS   TP     TB          
      1.06702298E-02    2      1000025        21                       # GLSS   -->  Z3SS   GL                 
      8.95974445E-05    3      1000025         2        -2             # GLSS   -->  Z3SS   UP     UB          
      1.10647576E-04    3      1000025         1        -1             # GLSS   -->  Z3SS   DN     DB          
      1.10647539E-04    3      1000025         3        -3             # GLSS   -->  Z3SS   ST     SB          
      8.95962075E-05    3      1000025         4        -4             # GLSS   -->  Z3SS   CH     CB          
      5.54463752E-02    3      1000025         5        -5             # GLSS   -->  Z3SS   BT     BB          
      7.41365645E-03    2      1000035        21                       # GLSS   -->  Z4SS   GL                 
      1.43191346E-03    3      1000035         2        -2             # GLSS   -->  Z4SS   UP     UB          
      1.66365027E-03    3      1000035         1        -1             # GLSS   -->  Z4SS   DN     DB          
      1.66364934E-03    3      1000035         3        -3             # GLSS   -->  Z4SS   ST     SB          
      1.43189426E-03    3      1000035         4        -4             # GLSS   -->  Z4SS   CH     CB          
      3.64066698E-02    3      1000035         5        -5             # GLSS   -->  Z4SS   BT     BB          
#         PDG         Width
DECAY   1000002  1.56293182E+01   # UPL   decays
#          BR          NDA       ID1       ID2       ID3       ID4
      1.81101554E-03    2      1000022         2                       # UPL    -->  Z1SS   UP                 
      1.42412335E-01    2      1000023         2                       # UPL    -->  Z2SS   UP                 
      1.67329225E-03    2      1000025         2                       # UPL    -->  Z3SS   UP                 
      1.80804282E-02    2      1000035         2                       # UPL    -->  Z4SS   UP                 
      5.12714028E-01    2      1000021         2                       # UPL    -->  GLSS   UP                 
      3.02772939E-01    2      1000024         1                       # UPL    -->  W1SS+  DN                 
      2.05359478E-02    2      1000037         1                       # UPL    -->  W2SS+  DN                 
#         PDG         Width
DECAY   1000001  1.57633286E+01   # DNL   decays
#          BR          NDA       ID1       ID2       ID3       ID4
      1.13271046E-02    2      1000022         1                       # DNL    -->  Z1SS   DN                 
      1.24714687E-01    2      1000023         1                       # DNL    -->  Z2SS   DN                 
      2.79435469E-03    2      1000025         1                       # DNL    -->  Z3SS   DN                 
      2.34952308E-02    2      1000035         1                       # DNL    -->  Z4SS   DN                 
      5.31187534E-01    2      1000021         1                       # DNL    -->  GLSS   DN                 
      2.39686519E-01    2     -1000024         2                       # DNL    -->  W1SS-  UP                 
      6.67945817E-02    2     -1000037         2                       # DNL    -->  W2SS-  UP                 
#         PDG         Width
DECAY   1000003  1.57632904E+01   # STL   decays
#          BR          NDA       ID1       ID2       ID3       ID4
      1.13271335E-02    2      1000022         3                       # STL    -->  Z1SS   ST                 
      1.24715008E-01    2      1000023         3                       # STL    -->  Z2SS   ST                 
      2.79436191E-03    2      1000025         3                       # STL    -->  Z3SS   ST                 
      2.34952886E-02    2      1000035         3                       # STL    -->  Z4SS   ST                 
      5.31189144E-01    2      1000021         3                       # STL    -->  GLSS   ST                 
      2.39685029E-01    2     -1000024         4                       # STL    -->  W1SS-  CH                 
      6.67939633E-02    2     -1000037         4                       # STL    -->  W2SS-  CH                 
#         PDG         Width
DECAY   1000004  1.56290674E+01   # CHL   decays
#          BR          NDA       ID1       ID2       ID3       ID4
      1.81103346E-03    2      1000022         4                       # CHL    -->  Z1SS   CH                 
      1.42413691E-01    2      1000023         4                       # CHL    -->  Z2SS   CH                 
      1.67330599E-03    2      1000025         4                       # CHL    -->  Z3SS   CH                 
      1.80805679E-02    2      1000035         4                       # CHL    -->  Z4SS   CH                 
      5.12706459E-01    2      1000021         4                       # CHL    -->  GLSS   CH                 
      3.02778572E-01    2      1000024         3                       # CHL    -->  W1SS+  ST                 
      2.05363575E-02    2      1000037         3                       # CHL    -->  W2SS+  ST                 
#         PDG         Width
DECAY   1000005  9.65545654E+00   # BT1   decays
#          BR          NDA       ID1       ID2       ID3       ID4
      5.14154397E-02    2      1000022         5                       # BT1    -->  Z1SS   BT                 
      2.13388249E-01    2      1000023         5                       # BT1    -->  Z2SS   BT                 
      7.26781189E-02    2      1000025         5                       # BT1    -->  Z3SS   BT                 
      4.99821305E-02    2      1000035         5                       # BT1    -->  Z4SS   BT                 
      5.72626814E-02    2      1000021         5                       # BT1    -->  GLSS   BT                 
      2.85294205E-01    2     -1000024         6                       # BT1    -->  W1SS-  TP                 
      2.67746270E-01    2     -1000037         6                       # BT1    -->  W2SS-  TP                 
      2.23287405E-03    2          -24   1000006                       # BT1    -->  W-     TP1                
#         PDG         Width
DECAY   1000006  5.50188065E+00   # TP1   decays
#          BR          NDA       ID1       ID2       ID3       ID4
      1.09998293E-01    2      1000022         6                       # TP1    -->  Z1SS   TP                 
      1.00762278E-01    2      1000023         6                       # TP1    -->  Z2SS   TP                 
      1.56569734E-01    2      1000025         6                       # TP1    -->  Z3SS   TP                 
      3.51346850E-01    2      1000024         5                       # TP1    -->  W1SS+  BT                 
      2.81322896E-01    2      1000037         5                       # TP1    -->  W2SS+  BT                 
#         PDG         Width
DECAY   2000002  9.04438686E+00   # UPR   decays
#          BR          NDA       ID1       ID2       ID3       ID4
      1.52171150E-01    2      1000022         2                       # UPR    -->  Z1SS   UP                 
      4.01297584E-03    2      1000023         2                       # UPR    -->  Z2SS   UP                 
      9.56967240E-04    2      1000025         2                       # UPR    -->  Z3SS   UP                 
      2.31074425E-03    2      1000035         2                       # UPR    -->  Z4SS   UP                 
      8.40548158E-01    2      1000021         2                       # UPR    -->  GLSS   UP                 
#         PDG         Width
DECAY   2000001  8.01789761E+00   # DNR   decays
#          BR          NDA       ID1       ID2       ID3       ID4
      4.29643318E-02    2      1000022         1                       # DNR    -->  Z1SS   DN                 
      1.13318395E-03    2      1000023         1                       # DNR    -->  Z2SS   DN                 
      2.70400953E-04    2      1000025         1                       # DNR    -->  Z3SS   DN                 
      6.53045718E-04    2      1000035         1                       # DNR    -->  Z4SS   DN                 
      9.54979002E-01    2      1000021         1                       # DNR    -->  GLSS   DN                 
#         PDG         Width
DECAY   2000003  8.01790237E+00   # STR   decays
#          BR          NDA       ID1       ID2       ID3       ID4
      4.29643095E-02    2      1000022         3                       # STR    -->  Z1SS   ST                 
      1.13318325E-03    2      1000023         3                       # STR    -->  Z2SS   ST                 
      2.70400837E-04    2      1000025         3                       # STR    -->  Z3SS   ST                 
      6.53045368E-04    2      1000035         3                       # STR    -->  Z4SS   ST                 
      9.54979002E-01    2      1000021         3                       # STR    -->  GLSS   ST                 
#         PDG         Width
DECAY   2000004  9.04412556E+00   # CHR   decays
#          BR          NDA       ID1       ID2       ID3       ID4
      1.52174592E-01    2      1000022         4                       # CHR    -->  Z1SS   CH                 
      4.01306525E-03    2      1000023         4                       # CHR    -->  Z2SS   CH                 
      9.56987264E-04    2      1000025         4                       # CHR    -->  Z3SS   CH                 
      2.31079152E-03    2      1000035         4                       # CHR    -->  Z4SS   CH                 
      8.40544522E-01    2      1000021         4                       # CHR    -->  GLSS   CH                 
#         PDG         Width
DECAY   2000005  8.86686325E+00   # BT2   decays
#          BR          NDA       ID1       ID2       ID3       ID4
      2.16946956E-02    2      1000022         5                       # BT2    -->  Z1SS   BT                 
      1.16575677E-02    2      1000023         5                       # BT2    -->  Z2SS   BT                 
      1.31079465E-01    2      1000025         5                       # BT2    -->  Z3SS   BT                 
      1.24055967E-01    2      1000035         5                       # BT2    -->  Z4SS   BT                 
      3.78798366E-01    2      1000021         5                       # BT2    -->  GLSS   BT                 
      1.33445347E-02    2     -1000024         6                       # BT2    -->  W1SS-  TP                 
      3.00232172E-01    2     -1000037         6                       # BT2    -->  W2SS-  TP                 
      1.91372000E-02    2          -24   1000006                       # BT2    -->  W-     TP1                
#         PDG         Width
DECAY   2000006  1.19055614E+01   # TP2   decays
#          BR          NDA       ID1       ID2       ID3       ID4
      2.31906220E-01    2      1000024         5                       # TP2    -->  W1SS+  BT                 
      2.54037350E-01    2      1000037         5                       # TP2    -->  W2SS+  BT                 
      2.19411552E-02    2           23   1000006                       # TP2    -->  Z0     TP1                
      1.75272655E-02    2           25   1000006                       # TP2    -->  HL0    TP1                
      8.81855655E-03    2      1000022         6                       # TP2    -->  Z1SS   TP                 
      7.92391822E-02    2      1000023         6                       # TP2    -->  Z2SS   TP                 
      1.19014792E-01    2      1000025         6                       # TP2    -->  Z3SS   TP                 
      2.67515391E-01    2      1000035         6                       # TP2    -->  Z4SS   TP                 
#         PDG         Width
DECAY   1000011  6.05435848E+00   # EL-   decays
#          BR          NDA       ID1       ID2       ID3       ID4
      7.51693100E-02    2      1000022        11                       # EL-    -->  Z1SS   E-                 
      3.19791466E-01    2      1000023        11                       # EL-    -->  Z2SS   E-                 
      1.42521621E-03    2      1000025        11                       # EL-    -->  Z3SS   E-                 
      2.16443092E-02    2      1000035        11                       # EL-    -->  Z4SS   E-                 
      4.75273818E-01    2     -1000024        12                       # EL-    -->  W1SS-  NUE                
      1.06695883E-01    2     -1000037        12                       # EL-    -->  W2SS-  NUE                
#         PDG         Width
DECAY   1000013  6.05435848E+00   # MUL-  decays
#          BR          NDA       ID1       ID2       ID3       ID4
      7.51693100E-02    2      1000022        13                       # MUL-   -->  Z1SS   MU-                
      3.19791466E-01    2      1000023        13                       # MUL-   -->  Z2SS   MU-                
      1.42521586E-03    2      1000025        13                       # MUL-   -->  Z3SS   MU-                
      2.16443017E-02    2      1000035        13                       # MUL-   -->  Z4SS   MU-                
      4.75273818E-01    2     -1000024        14                       # MUL-   -->  W1SS-  NUM                
      1.06695883E-01    2     -1000037        14                       # MUL-   -->  W2SS-  NUM                
#         PDG         Width
DECAY   1000015  4.00760841E+00   # TAU1- decays
#          BR          NDA       ID1       ID2       ID3       ID4
      4.94343936E-01    2      1000022        15                       # TAU1-  -->  Z1SS   TAU-               
      1.37349069E-01    2      1000023        15                       # TAU1-  -->  Z2SS   TAU-               
      5.99275157E-02    2      1000025        15                       # TAU1-  -->  Z3SS   TAU-               
      2.52776276E-02    2      1000035        15                       # TAU1-  -->  Z4SS   TAU-               
      2.45309860E-01    2     -1000024        16                       # TAU1-  -->  W1SS-  NUT                
      3.77920456E-02    2     -1000037        16                       # TAU1-  -->  W2SS-  NUT                
#         PDG         Width
DECAY   1000012  6.17247677E+00   # NUEL  decays
#          BR          NDA       ID1       ID2       ID3       ID4
      1.29486084E-01    2      1000022        12                       # NUEL   -->  Z1SS   NUE                
      2.07351416E-01    2      1000023        12                       # NUEL   -->  Z2SS   NUE                
      6.73310226E-03    2      1000025        12                       # NUEL   -->  Z3SS   NUE                
      4.49071787E-02    2      1000035        12                       # NUEL   -->  Z4SS   NUE                
      5.80146611E-01    2      1000024        11                       # NUEL   -->  W1SS+  E-                 
      3.13756838E-02    2      1000037        11                       # NUEL   -->  W2SS+  E-                 
#         PDG         Width
DECAY   1000014  6.17247677E+00   # NUML  decays
#          BR          NDA       ID1       ID2       ID3       ID4
      1.29486084E-01    2      1000022        14                       # NUML   -->  Z1SS   NUM                
      2.07351416E-01    2      1000023        14                       # NUML   -->  Z2SS   NUM                
      6.73310226E-03    2      1000025        14                       # NUML   -->  Z3SS   NUM                
      4.49071787E-02    2      1000035        14                       # NUML   -->  Z4SS   NUM                
      5.80146611E-01    2      1000024        13                       # NUML   -->  W1SS+  MU-                
      3.13756764E-02    2      1000037        13                       # NUML   -->  W2SS+  MU-                
#         PDG         Width
DECAY   1000016  6.44659233E+00   # NUTL  decays
#          BR          NDA       ID1       ID2       ID3       ID4
      1.13487266E-01    2      1000022        16                       # NUTL   -->  Z1SS   NUT                
      1.78681925E-01    2      1000023        16                       # NUTL   -->  Z2SS   NUT                
      5.29383728E-03    2      1000025        16                       # NUTL   -->  Z3SS   NUT                
      3.42428461E-02    2      1000035        16                       # NUTL   -->  Z4SS   NUT                
      5.60753167E-01    2      1000024        15                       # NUTL   -->  W1SS+  TAU-               
      1.07511789E-01    2      1000037        15                       # NUTL   -->  W2SS+  TAU-               
      3.22966957E-06    3      1000015        16       -15             # NUTL   -->  TAU1-  NUT    TAU+        
      3.22966957E-06    3      1000015        12       -11             # NUTL   -->  TAU1-  NUE    E+          
      3.22966957E-06    3      1000015        14       -13             # NUTL   -->  TAU1-  NUM    MU+         
      9.68900895E-06    3      1000015         2        -1             # NUTL   -->  TAU1-  UP     DB          
      9.68900895E-06    3      1000015         4        -3             # NUTL   -->  TAU1-  CH     SB          
#         PDG         Width
DECAY   2000011  2.53029752E+00   # ER-   decays
#          BR          NDA       ID1       ID2       ID3       ID4
      9.59481120E-01    2      1000022        11                       # ER-    -->  Z1SS   E-                 
      2.44361851E-02    2      1000023        11                       # ER-    -->  Z2SS   E-                 
      4.89124330E-03    2      1000025        11                       # ER-    -->  Z3SS   E-                 
      1.11914556E-02    2      1000035        11                       # ER-    -->  Z4SS   E-                 
#         PDG         Width
DECAY   2000013  2.53029752E+00   # MUR-  decays
#          BR          NDA       ID1       ID2       ID3       ID4
      9.59481120E-01    2      1000022        13                       # MUR-   -->  Z1SS   MU-                
      2.44361833E-02    2      1000023        13                       # MUR-   -->  Z2SS   MU-                
      4.89124283E-03    2      1000025        13                       # MUR-   -->  Z3SS   MU-                
      1.11914538E-02    2      1000035        13                       # MUR-   -->  Z4SS   MU-                
#         PDG         Width
DECAY   2000015  5.80789089E+00   # TAU2- decays
#          BR          NDA       ID1       ID2       ID3       ID4
      9.13905352E-02    2      1000022        15                       # TAU2-  -->  Z1SS   TAU-               
      2.63986617E-01    2      1000023        15                       # TAU2-  -->  Z2SS   TAU-               
      8.72961804E-02    2      1000025        15                       # TAU2-  -->  Z3SS   TAU-               
      9.30509418E-02    2      1000035        15                       # TAU2-  -->  Z4SS   TAU-               
      3.16451818E-01    2     -1000024        16                       # TAU2-  -->  W1SS-  NUT                
      1.47823974E-01    2     -1000037        16                       # TAU2-  -->  W2SS-  NUT                
#         PDG         Width
DECAY   1000023  6.65037078E-06   # Z2SS  decays
#          BR          NDA       ID1       ID2       ID3       ID4
      2.12514121E-03    2      1000022        22                       # Z2SS   -->  Z1SS   GM                 
      1.25329450E-01    3      1000022         2        -2             # Z2SS   -->  Z1SS   UP     UB          
      1.66477010E-01    3      1000022         1        -1             # Z2SS   -->  Z1SS   DN     DB          
      1.66476995E-01    3      1000022         3        -3             # Z2SS   -->  Z1SS   ST     SB          
      1.25329420E-01    3      1000022         4        -4             # Z2SS   -->  Z1SS   CH     CB          
      1.89505622E-01    3      1000022         5        -5             # Z2SS   -->  Z1SS   BT     BB          
      2.28614118E-02    3      1000022        11       -11             # Z2SS   -->  Z1SS   E-     E+          
      2.28614118E-02    3      1000022        13       -13             # Z2SS   -->  Z1SS   MU-    MU+         
      3.08024082E-02    3      1000022        15       -15             # Z2SS   -->  Z1SS   TAU-   TAU+        
      5.04408143E-02    3      1000022        12       -12             # Z2SS   -->  Z1SS   NUE    ANUE        
      5.04408143E-02    3      1000022        14       -14             # Z2SS   -->  Z1SS   NUM    ANUM        
      4.73493971E-02    3      1000022        16       -16             # Z2SS   -->  Z1SS   NUT    ANUT        
#         PDG         Width
DECAY   1000025  7.69339561E-01   # Z3SS  decays
#          BR          NDA       ID1       ID2       ID3       ID4
      1.50995334E-07    2      1000022        22                       # Z3SS   -->  Z1SS   GM                 
      4.21979848E-07    2      1000023        22                       # Z3SS   -->  Z2SS   GM                 
      3.17907304E-01    2      1000024       -24                       # Z3SS   -->  W1SS+  W-                 
      3.17907304E-01    2     -1000024        24                       # Z3SS   -->  W1SS-  W+                 
      1.60343736E-01    2      1000022        23                       # Z3SS   -->  Z1SS   Z0                 
      1.65348962E-01    2      1000023        23                       # Z3SS   -->  Z2SS   Z0                 
      1.13068790E-08    3      1000022         2        -2             # Z3SS   -->  Z1SS   UP     UB          
      6.96968439E-09    3      1000022         1        -1             # Z3SS   -->  Z1SS   DN     DB          
      6.96968083E-09    3      1000022         3        -3             # Z3SS   -->  Z1SS   ST     SB          
      1.13067751E-08    3      1000022         4        -4             # Z3SS   -->  Z1SS   CH     CB          
      1.58196308E-05    3      1000022         5        -5             # Z3SS   -->  Z1SS   BT     BB          
      5.57919293E-08    3      1000022        11       -11             # Z3SS   -->  Z1SS   E-     E+          
      5.57919293E-08    3      1000022        13       -13             # Z3SS   -->  Z1SS   MU-    MU+         
      1.47393894E-05    3      1000022        15       -15             # Z3SS   -->  Z1SS   TAU-   TAU+        
      5.22787325E-08    3      1000022        12       -12             # Z3SS   -->  Z1SS   NUE    ANUE        
      5.22787325E-08    3      1000022        14       -14             # Z3SS   -->  Z1SS   NUM    ANUM        
      7.64750112E-08    3      1000022        16       -16             # Z3SS   -->  Z1SS   NUT    ANUT        
      1.21957431E-08    3      1000023         2        -2             # Z3SS   -->  Z2SS   UP     UB          
      1.71100840E-08    3      1000023         1        -1             # Z3SS   -->  Z2SS   DN     DB          
      1.71100769E-08    3      1000023         3        -3             # Z3SS   -->  Z2SS   ST     SB          
      1.21956285E-08    3      1000023         4        -4             # Z3SS   -->  Z2SS   CH     CB          
      9.01878320E-06    3      1000023         5        -5             # Z3SS   -->  Z2SS   BT     BB          
      6.57796351E-09    3      1000023        11       -11             # Z3SS   -->  Z2SS   E-     E+          
      6.57796351E-09    3      1000023        13       -13             # Z3SS   -->  Z2SS   MU-    MU+         
      2.69140742E-06    3      1000023        15       -15             # Z3SS   -->  Z2SS   TAU-   TAU+        
      2.18995506E-08    3      1000023        12       -12             # Z3SS   -->  Z2SS   NUE    ANUE        
      2.18995506E-08    3      1000023        14       -14             # Z3SS   -->  Z2SS   NUM    ANUM        
      3.24366347E-08    3      1000023        16       -16             # Z3SS   -->  Z2SS   NUT    ANUT        
      3.24101783E-02    2      1000022        25                       # Z3SS   -->  Z1SS   HL0                
      6.03930140E-03    2      1000023        25                       # Z3SS   -->  Z2SS   HL0                
#         PDG         Width
DECAY   1000035  1.09759653E+00   # Z4SS  decays
#          BR          NDA       ID1       ID2       ID3       ID4
      5.18631111E-08    2      1000022        22                       # Z4SS   -->  Z1SS   GM                 
      1.24751665E-07    2      1000023        22                       # Z4SS   -->  Z2SS   GM                 
      1.34807969E-08    2      1000025        22                       # Z4SS   -->  Z3SS   GM                 
      3.64634156E-01    2      1000024       -24                       # Z4SS   -->  W1SS+  W-                 
      3.64634156E-01    2     -1000024        24                       # Z4SS   -->  W1SS-  W+                 
      4.17820476E-02    2      1000022        23                       # Z4SS   -->  Z1SS   Z0                 
      2.66633276E-02    2      1000023        23                       # Z4SS   -->  Z2SS   Z0                 
      8.50198063E-08    3      1000022         2        -2             # Z4SS   -->  Z1SS   UP     UB          
      1.42362325E-07    3      1000022         1        -1             # Z4SS   -->  Z1SS   DN     DB          
      1.42362296E-07    3      1000022         3        -3             # Z4SS   -->  Z1SS   ST     SB          
      8.50190247E-08    3      1000022         4        -4             # Z4SS   -->  Z1SS   CH     CB          
      9.40457358E-06    3      1000022         5        -5             # Z4SS   -->  Z1SS   BT     BB          
      5.52196752E-07    3      1000022        11       -11             # Z4SS   -->  Z1SS   E-     E+          
      5.52196752E-07    3      1000022        13       -13             # Z4SS   -->  Z1SS   MU-    MU+         
      1.18818789E-05    3      1000022        15       -15             # Z4SS   -->  Z1SS   TAU-   TAU+        
      9.61516434E-07    3      1000022        12       -12             # Z4SS   -->  Z1SS   NUE    ANUE        
      9.61516434E-07    3      1000022        14       -14             # Z4SS   -->  Z1SS   NUM    ANUM        
      1.40874488E-06    3      1000022        16       -16             # Z4SS   -->  Z1SS   NUT    ANUT        
      5.45212117E-07    3      1000023         2        -2             # Z4SS   -->  Z2SS   UP     UB          
      5.96954180E-07    3      1000023         1        -1             # Z4SS   -->  Z2SS   DN     DB          
      5.96953896E-07    3      1000023         3        -3             # Z4SS   -->  Z2SS   ST     SB          
      5.45207001E-07    3      1000023         4        -4             # Z4SS   -->  Z2SS   CH     CB          
      8.36191339E-06    3      1000023         5        -5             # Z4SS   -->  Z2SS   BT     BB          
      4.20290746E-07    3      1000023        11       -11             # Z4SS   -->  Z2SS   E-     E+          
      4.20290746E-07    3      1000023        13       -13             # Z4SS   -->  Z2SS   MU-    MU+         
      2.46327954E-06    3      1000023        15       -15             # Z4SS   -->  Z2SS   TAU-   TAU+        
      6.45008697E-07    3      1000023        12       -12             # Z4SS   -->  Z2SS   NUE    ANUE        
      6.45008697E-07    3      1000023        14       -14             # Z4SS   -->  Z2SS   NUM    ANUM        
      9.59443014E-07    3      1000023        16       -16             # Z4SS   -->  Z2SS   NUT    ANUT        
      5.06533979E-07    3      1000025         2        -2             # Z4SS   -->  Z3SS   UP     UB          
      6.56430871E-07    3      1000025         1        -1             # Z4SS   -->  Z3SS   DN     DB          
      6.56430871E-07    3      1000025         3        -3             # Z4SS   -->  Z3SS   ST     SB          
      5.06533979E-07    3      1000025         4        -4             # Z4SS   -->  Z3SS   CH     CB          
      3.97246737E-07    3      1000025         5        -5             # Z4SS   -->  Z3SS   BT     BB          
      1.48930894E-07    3      1000025        11       -11             # Z4SS   -->  Z3SS   E-     E+          
      1.48930894E-07    3      1000025        13       -13             # Z4SS   -->  Z3SS   MU-    MU+         
      1.46407089E-07    3      1000025        15       -15             # Z4SS   -->  Z3SS   TAU-   TAU+        
      2.93671206E-07    3      1000025        12       -12             # Z4SS   -->  Z3SS   NUE    ANUE        
      2.93671206E-07    3      1000025        14       -14             # Z4SS   -->  Z3SS   NUM    ANUM        
      2.93213446E-07    3      1000025        16       -16             # Z4SS   -->  Z3SS   NUT    ANUT        
      8.69379044E-02    2      1000022        25                       # Z4SS   -->  Z1SS   HL0                
      1.15301721E-01    2      1000023        25                       # Z4SS   -->  Z2SS   HL0                
#         PDG         Width
DECAY   1000024  4.54455148E-05   # W1SS+ decays
#          BR          NDA       ID1       ID2       ID3       ID4
      3.38210911E-01    3      1000022         2        -1             # W1SS+  -->  Z1SS   UP     DB          
      3.38210911E-01    3      1000022         4        -3             # W1SS+  -->  Z1SS   CH     SB          
      1.07352391E-01    3      1000022       -11        12             # W1SS+  -->  Z1SS   E+     NUE         
      1.07352391E-01    3      1000022       -13        14             # W1SS+  -->  Z1SS   MU+    NUM         
      1.08873308E-01    3      1000022       -15        16             # W1SS+  -->  Z1SS   TAU+   NUT         
      3.68249946E-13    3      1000023       -11        12             # W1SS+  -->  Z2SS   E+     NUE         
#         PDG         Width
DECAY   1000037  9.38004255E-01   # W2SS+ decays
#          BR          NDA       ID1       ID2       ID3       ID4
      2.10112830E-07    3      1000022         2        -1             # W2SS+  -->  Z1SS   UP     DB          
      2.10112546E-07    3      1000022         4        -3             # W2SS+  -->  Z1SS   CH     SB          
      1.07744063E-06    3      1000022       -11        12             # W2SS+  -->  Z1SS   E+     NUE         
      1.07744063E-06    3      1000022       -13        14             # W2SS+  -->  Z1SS   MU+    NUM         
      1.34347101E-05    3      1000022       -15        16             # W2SS+  -->  Z1SS   TAU+   NUT         
      9.58860442E-02    2      1000022        24                       # W2SS+  -->  Z1SS   W+                 
      5.91699234E-07    3      1000023         2        -1             # W2SS+  -->  Z2SS   UP     DB          
      5.91698210E-07    3      1000023         4        -3             # W2SS+  -->  Z2SS   CH     SB          
      7.02335171E-07    3      1000023       -11        12             # W2SS+  -->  Z2SS   E+     NUE         
      7.02335171E-07    3      1000023       -13        14             # W2SS+  -->  Z2SS   MU+    NUM         
      6.95953668E-06    3      1000023       -15        16             # W2SS+  -->  Z2SS   TAU+   NUT         
      4.28988874E-01    2      1000023        24                       # W2SS+  -->  Z2SS   W+                 
      2.50898665E-06    3      1000025         2        -1             # W2SS+  -->  Z3SS   UP     DB          
      2.50898665E-06    3      1000025         4        -3             # W2SS+  -->  Z3SS   CH     SB          
      8.35476555E-07    3      1000025       -11        12             # W2SS+  -->  Z3SS   E+     NUE         
      8.35476555E-07    3      1000025       -13        14             # W2SS+  -->  Z3SS   MU+    NUM         
      8.52630365E-07    3      1000025       -15        16             # W2SS+  -->  Z3SS   TAU+   NUT         
      9.62252806E-15    3      1000035       -11        12             # W2SS+  -->  Z4SS   E+     NUE         
      9.62252806E-15    3      1000035       -13        14             # W2SS+  -->  Z4SS   MU+    NUM         
      3.02372247E-01    2      1000024        23                       # W2SS+  -->  W1SS+  Z0                 
      5.44894135E-07    3      1000024         1        -1             # W2SS+  -->  W1SS+  DN     DB          
      5.44888906E-07    3      1000024         3        -3             # W2SS+  -->  W1SS+  ST     SB          
      1.35133996E-06    3      1000024         2        -2             # W2SS+  -->  W1SS+  UP     UB          
      1.35133939E-06    3      1000024         4        -4             # W2SS+  -->  W1SS+  CH     CB          
      1.27333669E-06    3      1000024        12       -12             # W2SS+  -->  W1SS+  NUE    ANUE        
      1.27333669E-06    3      1000024        14       -14             # W2SS+  -->  W1SS+  NUM    ANUM        
      3.88578655E-06    3      1000024        16       -16             # W2SS+  -->  W1SS+  NUT    ANUT        
      5.25903545E-07    3      1000024        11       -11             # W2SS+  -->  W1SS+  E-     E+          
      5.25903545E-07    3      1000024        13       -13             # W2SS+  -->  W1SS+  MU-    MU+         
      7.84527742E-07    3      1000024        15       -15             # W2SS+  -->  W1SS+  TAU-   TAU+        
      1.72707736E-01    2      1000024        25                       # W2SS+  -->  W1SS+  HL0                
#         PDG         Width
DECAY        25  4.19660937E-03   # HL0   decays
#          BR          NDA       ID1       ID2       ID3       ID4
      5.05562436E-09    2           11       -11                       # HL0    -->  E-     E+                 
      2.13456384E-04    2           13       -13                       # HL0    -->  MU-    MU+                
      6.10393733E-02    2           15       -15                       # HL0    -->  TAU-   TAU+               
      6.35083961E-06    2            1        -1                       # HL0    -->  DN     DB                 
      2.56605679E-03    2            3        -3                       # HL0    -->  ST     SB                 
      8.48023295E-01    2            5        -5                       # HL0    -->  BT     BB                 
      1.76779815E-06    2            2        -2                       # HL0    -->  UP     UB                 
      3.35728601E-02    2            4        -4                       # HL0    -->  CH     CB                 
      1.42175320E-03    2           22        22                       # HL0    -->  GM     GM                 
      3.24646793E-02    2           21        21                       # HL0    -->  GL     GL                 
      1.10008381E-03    3           24        11       -12             # HL0    -->  W+     E-     ANUE        
      1.10008381E-03    3           24        13       -14             # HL0    -->  W+     MU-    ANUM        
      1.10008381E-03    3           24        15       -16             # HL0    -->  W+     TAU-   ANUT        
      3.30025121E-03    3           24        -2         1             # HL0    -->  W+     UB     DN          
      3.30025121E-03    3           24        -4         3             # HL0    -->  W+     CB     ST          
      1.10008381E-03    3          -24       -11        12             # HL0    -->  W-     E+     NUE         
      1.10008381E-03    3          -24       -13        14             # HL0    -->  W-     MU+    NUM         
      1.10008381E-03    3          -24       -15        16             # HL0    -->  W-     TAU+   NUT         
      3.30025121E-03    3          -24         2        -1             # HL0    -->  W-     UP     DB          
      3.30025121E-03    3          -24         4        -3             # HL0    -->  W-     CH     SB          
      6.07834081E-05    3           23        12       -12             # HL0    -->  Z0     NUE    ANUE        
      6.07834081E-05    3           23        14       -14             # HL0    -->  Z0     NUM    ANUM        
      6.07834081E-05    3           23        16       -16             # HL0    -->  Z0     NUT    ANUT        
      3.05916801E-05    3           23        11       -11             # HL0    -->  Z0     E-     E+          
      3.05916801E-05    3           23        13       -13             # HL0    -->  Z0     MU-    MU+         
      3.05916801E-05    3           23        15       -15             # HL0    -->  Z0     TAU-   TAU+        
      1.04804494E-04    3           23         2        -2             # HL0    -->  Z0     UP     UB          
      1.04804494E-04    3           23         4        -4             # HL0    -->  Z0     CH     CB          
      1.35014008E-04    3           23         1        -1             # HL0    -->  Z0     DN     DB          
      1.35014008E-04    3           23         3        -3             # HL0    -->  Z0     ST     SB          
      1.35014008E-04    3           23         5        -5             # HL0    -->  Z0     BT     BB          
#         PDG         Width
DECAY        35  1.18584356E+01   # HH0   decays
#          BR          NDA       ID1       ID2       ID3       ID4
      9.55513091E-09    2           11       -11                       # HH0    -->  E-     E+                 
      4.03434708E-04    2           13       -13                       # HH0    -->  MU-    MU+                
      1.15537323E-01    2           15       -15                       # HH0    -->  TAU-   TAU+               
      1.17991058E-05    2            1        -1                       # HH0    -->  DN     DB                 
      4.76743607E-03    2            3        -3                       # HH0    -->  ST     SB                 
      7.90882528E-01    2            5        -5                       # HH0    -->  BT     BB                 
      1.69519542E-12    2            2        -2                       # HH0    -->  UP     UB                 
      2.66250897E-08    2            4        -4                       # HH0    -->  CH     CB                 
      3.18070932E-04    2            6        -6                       # HH0    -->  TP     TB                 
      1.18900346E-07    2           22        22                       # HH0    -->  GM     GM                 
      2.47761836E-05    2           21        21                       # HH0    -->  GL     GL                 
      5.16509272E-06    2           24       -24                       # HH0    -->  W+     W-                 
      2.48999049E-06    2           23        23                       # HH0    -->  Z0     Z0                 
      3.99729842E-03    2      1000022   1000022                       # HH0    -->  Z1SS   Z1SS               
      1.42061282E-02    2      1000022   1000023                       # HH0    -->  Z1SS   Z2SS               
      9.70427785E-03    2      1000022   1000025                       # HH0    -->  Z1SS   Z3SS               
      1.11593190E-03    2      1000022   1000035                       # HH0    -->  Z1SS   Z4SS               
      1.09237796E-02    2      1000023   1000023                       # HH0    -->  Z2SS   Z2SS               
      1.08279614E-02    2      1000023   1000025                       # HH0    -->  Z2SS   Z3SS               
      3.45262174E-06    2      1000023   1000035                       # HH0    -->  Z2SS   Z4SS               
      3.30785587E-02    2      1000024  -1000024                       # HH0    -->  W1SS+  W1SS-              
      2.09380826E-03    2      1000024  -1000037                       # HH0    -->  W1SS+  W2SS-              
      2.09380826E-03    2     -1000024   1000037                       # HH0    -->  W1SS-  W2SS+              
      2.01209764E-06    2           25        25                       # HH0    -->  HL0    HL0                
#         PDG         Width
DECAY        36  1.20524235E+01   # HA0   decays
#          BR          NDA       ID1       ID2       ID3       ID4
      9.34043953E-09    2           11       -11                       # HA0    -->  E-     E+                 
      3.94370174E-04    2           13       -13                       # HA0    -->  MU-    MU+                
      1.12949520E-01    2           15       -15                       # HA0    -->  TAU-   TAU+               
      1.15347530E-05    2            1        -1                       # HA0    -->  DN     DB                 
      4.66062408E-03    2            3        -3                       # HA0    -->  ST     SB                 
      7.73389399E-01    2            5        -5                       # HA0    -->  BT     BB                 
      1.44169984E-12    2            2        -2                       # HA0    -->  UP     UB                 
      2.26633663E-08    2            4        -4                       # HA0    -->  CH     CB                 
      8.08143232E-04    2            6        -6                       # HA0    -->  TP     TB                 
      4.36608012E-08    2           22        22                       # HA0    -->  GM     GM                 
      3.62995743E-05    2           21        21                       # HA0    -->  GL     GL                 
      4.61255852E-03    2      1000022   1000022                       # HA0    -->  Z1SS   Z1SS               
      1.88690089E-02    2      1000022   1000023                       # HA0    -->  Z1SS   Z2SS               
      3.61859961E-03    2      1000022   1000025                       # HA0    -->  Z1SS   Z3SS               
      3.45395645E-03    2      1000022   1000035                       # HA0    -->  Z1SS   Z4SS               
      1.90067030E-02    2      1000023   1000023                       # HA0    -->  Z2SS   Z2SS               
      9.53305513E-04    2      1000023   1000025                       # HA0    -->  Z2SS   Z3SS               
      5.72317727E-02    2      1000024  -1000024                       # HA0    -->  W1SS+  W1SS-              
      4.22617859E-06    2           25        23                       # HA0    -->  HL0    Z0                 
#         PDG         Width
DECAY        37  8.52169895E+00   # H+    decays
#          BR          NDA       ID1       ID2       ID3       ID4
      1.35735734E-08    2           12       -11                       # H+     -->  NUE    E+                 
      5.73100639E-04    2           14       -13                       # H+     -->  NUM    MU+                
      1.64139107E-01    2           16       -15                       # H+     -->  NUT    TAU+               
      1.52842476E-05    2            2        -1                       # H+     -->  UP     DB                 
      6.17551198E-03    2            4        -3                       # H+     -->  CH     SB                 
      7.15030611E-01    2            6        -5                       # H+     -->  TP     BB                 
      3.90973985E-02    2      1000024   1000022                       # H+     -->  W1SS+  Z1SS               
      1.03099621E-03    2      1000024   1000023                       # H+     -->  W1SS+  Z2SS               
      3.15084569E-02    2      1000024   1000025                       # H+     -->  W1SS+  Z3SS               
      1.60200037E-02    2      1000024   1000035                       # H+     -->  W1SS+  Z4SS               
      2.92132772E-03    2      1000037   1000022                       # H+     -->  W2SS+  Z1SS               
      2.34813094E-02    2      1000037   1000023                       # H+     -->  W2SS+  Z2SS               
      6.82028849E-06    2           25        24                       # H+     -->  HL0    W+                 
