#  ISAJET SUSY parameters in Les Houches accord format
#  Created by ISALHA3. Last revision by C. Balazs on 2005 Jan. 10
Block SPINFO   # Program information
     1   ISASUGRA from ISAJET          # Spectrum Calculator
     2   7.79   16-DEC-2008 15:42:00   # Version number
Block MODSEL   # Model selection
     1     1   # Minimal supergravity (mSUGRA,CMSSM) model         
Block SMINPUTS   # Standard Model inputs
     1     1.27843338E+02   # alpha_em^(-1)
     2     1.16570000E-05   # G_Fermi
     3     1.17200002E-01   # alpha_s(M_Z)
     4     9.11699982E+01   # m_{Z}(pole)
     5     4.19999981E+00   # m_{b}(m_{b})
     6     1.72500000E+02   # m_{top}(pole)
     7     1.77699995E+00   # m_{tau}(pole)
Block MINPAR   # SUSY breaking input parameters
     1     1.20000000E+02   # m_0
     2     1.45000000E+02   # m_{1/2}
     3     3.00000000E+00   # tan(beta)
     4     1.00000000E+00   # sign(mu)
     5     0.00000000E+00   # A_0
#  
#  M_{GUT} =   0.26683313E+17
Block MASS   # Scalar and gaugino mass spectrum
#  PDG code   mass                 particle
        24     8.04229965E+01   #  W^+
        25     9.08502731E+01   #  h^0            
        35     2.95188354E+02   #  H^0            
        36     2.87828064E+02   #  A^0            
        37     3.00231476E+02   #  H^+            
   1000001     3.64668762E+02   #  dnl            
   1000002     3.57037567E+02   #  upl            
   1000003     3.64668823E+02   #  stl            
   1000004     3.57040314E+02   #  chl            
   1000005     3.31355316E+02   #  b1             
   1000006     2.32265900E+02   #  t1             
   1000011     1.60897614E+02   #  el-            
   1000012     1.43511551E+02   #  nuel           
   1000013     1.60897644E+02   #  mul-           
   1000014     1.43511551E+02   #  numl           
   1000015     1.36026123E+02   #  tau1           
   1000016     1.43075211E+02   #  nutl           
   1000021     3.74384857E+02   #  glss           
   1000022     4.64325142E+01   #  z1ss           
   1000023     8.76294785E+01   #  z2ss           
   1000024     8.23973465E+01   #  w1ss           
   1000025    -2.33466125E+02   #  z3ss           
   1000035     2.70563385E+02   #  z4ss           
   1000037     2.65208405E+02   #  w2ss           
   2000001     3.50673615E+02   #  dnr            
   2000002     3.49400513E+02   #  upr            
   2000003     3.50673645E+02   #  str            
   2000004     3.49403351E+02   #  chr            
   2000005     3.50801331E+02   #  b2             
   2000006     4.11469238E+02   #  t2             
   2000011     1.36778564E+02   #  er-            
   2000013     1.36778610E+02   #  mur-           
   2000015     1.61210983E+02   #  tau2           
#  Higgs mixing
Block ALPHA   # Effective Higgs mixing parameter
         -3.79069060E-01   # alpha
Block STOPMIX   # stop mixing matrix
  1  1     6.07695401E-01   # O_{11}
  1  2    -7.94170201E-01   # O_{12}
  2  1     7.94170201E-01   # O_{21}
  2  2     6.07695401E-01   # O_{22}
Block SBOTMIX   # sbottom mixing matrix
  1  1     9.74469125E-01   # O_{11}
  1  2    -2.24521443E-01   # O_{12}
  2  1     2.24521443E-01   # O_{21}
  2  2     9.74469125E-01   # O_{22}
Block STAUMIX   # stau mixing matrix
  1  1     1.86317995E-01   # O_{11}
  1  2    -9.82489467E-01   # O_{12}
  2  1     9.82489467E-01   # O_{21}
  2  2     1.86317995E-01   # O_{22}
Block NMIX   # neutralino mixing matrix
  1  1     9.11356926E-01   #
  1  2    -2.68665403E-01   #
  1  3     2.78189182E-01   #
  1  4    -1.40919656E-01   #
  2  1    -3.69718671E-01   #
  2  2    -8.66313219E-01   #
  2  3     2.82639086E-01   #
  2  4    -1.81451321E-01   #
  3  1     6.86701983E-02   #
  3  2    -1.03801608E-01   #
  3  3    -6.87585175E-01   #
  3  4    -7.15357125E-01   #
  4  1     1.67395324E-01   #
  4  2    -4.08099741E-01   #
  4  3    -6.08236849E-01   #
  4  4     6.59909964E-01   #
Block UMIX   # chargino U mixing matrix
  1  1    -8.58863592E-01   # U_{11}
  1  2     5.12204349E-01   # U_{12}
  2  1    -5.12204349E-01   # U_{21}
  2  2    -8.58863592E-01   # U_{22}
Block VMIX   # chargino V mixing matrix
  1  1    -9.43487465E-01   # V_{11}
  1  2     3.31408232E-01   # V_{12}
  2  1    -3.31408232E-01   # V_{21}
  2  2    -9.43487465E-01   # V_{22}
Block GAUGE Q=  2.86333649E+02   #
     1     3.57488990E-01   # g`
     2     6.52519166E-01   # g_2
     3     1.22101617E+00   # g_3
Block YU Q=  2.86333649E+02   #
  3  3     9.44028497E-01   # y_t
Block YD Q=  2.86333649E+02   #
  3  3     4.56565879E-02   # y_b
Block YE Q=  2.86333649E+02   #
  3  3     3.17255482E-02   # y_tau
Block HMIX Q=  2.86333649E+02   # Higgs mixing parameters
     1     2.29658340E+02   # mu(Q)
     2     3.00000000E+00   # tan(beta)(M_{GUT})
     3     2.49712570E+02   # Higgs vev at Q
     4     8.28449922E+04   # m_A^2(Q)
Block MSOFT Q=  2.86333649E+02   # DRbar SUSY breaking parameters
     1     5.76774902E+01   # M_1(Q)          
     2     1.10121147E+02   # M_2(Q)          
     3     3.51008789E+02   # M_3(Q)          
    31     1.54999512E+02   # MeL(Q)          
    32     1.54999512E+02   # MmuL(Q)         
    33     1.54598831E+02   # MtauL(Q)        
    34     1.31266983E+02   # MeR(Q)          
    35     1.31266983E+02   # MmuR(Q)         
    36     1.31075562E+02   # MtauR(Q)        
    41     3.42651398E+02   # MqL1(Q)         
    42     3.42651398E+02   # MqL2(Q)         
    43     3.12583069E+02   # MqL3(Q)         
    44     3.33414612E+02   # MuR(Q)          
    45     3.33414612E+02   # McR(Q)          
    46     2.62288544E+02   # MtR(Q)          
    47     3.32329651E+02   # MdR(Q)          
    48     3.32329651E+02   # MsR(Q)          
    49     3.34603180E+02   # MbR(Q)          
Block AU Q=  2.86333649E+02   #
  1  1    -2.70669525E+02   # A_u
  2  2    -2.70669525E+02   # A_c
  3  3    -2.70669525E+02   # A_t
Block AD Q=  2.86333649E+02   #
  1  1    -4.36908905E+02   # A_d
  2  2    -4.36908905E+02   # A_s
  3  3    -4.36908905E+02   # A_b
Block AE Q=  2.86333649E+02   #
  1  1    -9.36282959E+01   # A_e
  2  2    -9.36282959E+01   # A_mu
  3  3    -9.36282959E+01   # A_tau
#  ISAJET decay tables in SUSY Les Houches accord format
#  Created by ISALHD. Last revision: C. Balazs, 2005 May 25
Block DCINFO                           # Program information
     1   ISASUGRA from ISAJET          # Spectrum Calculator
     2   7.79   16-DEC-2008 15:42:00   # Version number
#         PDG         Width
DECAY         6  1.14680767E+00   # TP    decays
#          BR          NDA       ID1       ID2       ID3       ID4
      3.33333343E-01    3            2        -1         5             # TP     -->  UP     DB     BT          
      3.33333343E-01    3            4        -3         5             # TP     -->  CH     SB     BT          
      1.11111112E-01    3          -11        12         5             # TP     -->  E+     NUE    BT          
      1.11111112E-01    3          -13        14         5             # TP     -->  MU+    NUM    BT          
      1.11111112E-01    3          -15        16         5             # TP     -->  TAU+   NUT    BT          
#         PDG         Width
DECAY   1000021  1.39166987E+00   # GLSS  decays
#          BR          NDA       ID1       ID2       ID3       ID4
      1.70755287E-04    3      1000024         5        -6             # GLSS   -->  W1SS+  BT     TB          
      1.70755287E-04    3     -1000024         6        -5             # GLSS   -->  W1SS-  TP     BB          
      1.57386839E-05    2      1000022        21                       # GLSS   -->  Z1SS   GL                 
      3.44959080E-05    2      1000023        21                       # GLSS   -->  Z2SS   GL                 
      9.44145431E-05    2      1000025        21                       # GLSS   -->  Z3SS   GL                 
      6.44104730E-05    2      1000035        21                       # GLSS   -->  Z4SS   GL                 
      2.82273665E-02    2     -1000002         2                       # GLSS   -->  UBL    UP                 
      2.82273665E-02    2      1000002        -2                       # GLSS   -->  UPL    UB                 
      9.04077664E-03    2     -1000001         1                       # GLSS   -->  DBL    DN                 
      9.04077664E-03    2      1000001        -1                       # GLSS   -->  DNL    DB                 
      5.73358536E-02    2     -2000002         2                       # GLSS   -->  UBR    UP                 
      5.73358536E-02    2      2000002        -2                       # GLSS   -->  UPR    UB                 
      5.18233441E-02    2     -2000001         1                       # GLSS   -->  DBR    DN                 
      5.18233441E-02    2      2000001        -1                       # GLSS   -->  DNR    DB                 
      9.03882645E-03    2     -1000003         3                       # GLSS   -->  SBL    ST                 
      9.03882645E-03    2      1000003        -3                       # GLSS   -->  STL    SB                 
      5.18214926E-02    2     -2000003         3                       # GLSS   -->  SBR    ST                 
      5.18214926E-02    2      2000003        -3                       # GLSS   -->  STR    SB                 
      2.81370450E-02    2     -1000004         4                       # GLSS   -->  CBL    CH                 
      2.81370450E-02    2      1000004        -4                       # GLSS   -->  CHL    CB                 
      5.72451688E-02    2     -2000004         4                       # GLSS   -->  CBR    CH                 
      5.72451688E-02    2      2000004        -4                       # GLSS   -->  CHR    CB                 
      1.52063280E-01    2     -1000005         5                       # GLSS   -->  BB1    BT                 
      1.52063280E-01    2      1000005        -5                       # GLSS   -->  BT1    BB                 
      5.49915582E-02    2     -2000005         5                       # GLSS   -->  BB2    BT                 
      5.49915582E-02    2      2000005        -5                       # GLSS   -->  BT2    BB                 
#         PDG         Width
DECAY   1000002  3.68045855E+00   # UPL   decays
#          BR          NDA       ID1       ID2       ID3       ID4
      4.08165716E-03    2      1000022         2                       # UPL    -->  Z1SS   UP                 
      3.14628631E-01    2      1000023         2                       # UPL    -->  Z2SS   UP                 
      1.11336377E-03    2      1000025         2                       # UPL    -->  Z3SS   UP                 
      1.05435140E-02    2      1000035         2                       # UPL    -->  Z4SS   UP                 
      6.51610553E-01    2      1000024         1                       # UPL    -->  W1SS+  DN                 
      1.80223100E-02    2      1000037         1                       # UPL    -->  W2SS+  DN                 
#         PDG         Width
DECAY   1000001  3.43602848E+00   # DNL   decays
#          BR          NDA       ID1       ID2       ID3       ID4
      8.20534751E-02    2      1000022         1                       # DNL    -->  Z1SS   DN                 
      2.52945572E-01    2      1000023         1                       # DNL    -->  Z2SS   DN                 
      2.10726052E-03    2      1000025         1                       # DNL    -->  Z3SS   DN                 
      1.73789244E-02    2      1000035         1                       # DNL    -->  Z4SS   DN                 
      5.93492627E-01    2     -1000024         2                       # DNL    -->  W1SS-  UP                 
      5.20221107E-02    2     -1000037         2                       # DNL    -->  W2SS-  UP                 
#         PDG         Width
DECAY   1000003  3.43594527E+00   # STL   decays
#          BR          NDA       ID1       ID2       ID3       ID4
      8.20554793E-02    2      1000022         3                       # STL    -->  Z1SS   ST                 
      2.52951771E-01    2      1000023         3                       # STL    -->  Z2SS   ST                 
      2.10731290E-03    2      1000025         3                       # STL    -->  Z3SS   ST                 
      1.73793640E-02    2      1000035         3                       # STL    -->  Z4SS   ST                 
      5.93489110E-01    2     -1000024         4                       # STL    -->  W1SS-  CH                 
      5.20169921E-02    2     -1000037         4                       # STL    -->  W2SS-  CH                 
#         PDG         Width
DECAY   1000004  3.68045282E+00   # CHL   decays
#          BR          NDA       ID1       ID2       ID3       ID4
      4.08157613E-03    2      1000022         4                       # CHL    -->  Z1SS   CH                 
      3.14621925E-01    2      1000023         4                       # CHL    -->  Z2SS   CH                 
      1.11330242E-03    2      1000025         4                       # CHL    -->  Z3SS   CH                 
      1.05423853E-02    2      1000035         4                       # CHL    -->  Z4SS   CH                 
      6.51617646E-01    2      1000024         3                       # CHL    -->  W1SS+  ST                 
      1.80231575E-02    2      1000037         3                       # CHL    -->  W2SS+  ST                 
#         PDG         Width
DECAY   1000005  1.96308732E+00   # BT1   decays
#          BR          NDA       ID1       ID2       ID3       ID4
      1.33538008E-01    2      1000022         5                       # BT1    -->  Z1SS   BT                 
      3.78140002E-01    2      1000023         5                       # BT1    -->  Z2SS   BT                 
      2.31612567E-03    2      1000025         5                       # BT1    -->  Z3SS   BT                 
      1.38451029E-02    2      1000035         5                       # BT1    -->  Z4SS   BT                 
      3.64555657E-01    2     -1000024         6                       # BT1    -->  W1SS-  TP                 
      1.07605085E-01    2          -24   1000006                       # BT1    -->  W-     TP1                
#         PDG         Width
DECAY   1000006  1.38473976E+00   # TP1   decays
#          BR          NDA       ID1       ID2       ID3       ID4
      2.29528435E-02    2      1000022         6                       # TP1    -->  Z1SS   TP                 
      9.77047145E-01    2      1000024         5                       # TP1    -->  W1SS+  BT                 
#         PDG         Width
DECAY   2000002  7.32551873E-01   # UPR   decays
#          BR          NDA       ID1       ID2       ID3       ID4
      8.64175260E-01    2      1000022         2                       # UPR    -->  Z1SS   UP                 
      1.29424259E-01    2      1000023         2                       # UPR    -->  Z2SS   UP                 
      1.55778253E-03    2      1000025         2                       # UPR    -->  Z3SS   UP                 
      4.84270882E-03    2      1000035         2                       # UPR    -->  Z4SS   UP                 
#         PDG         Width
DECAY   2000001  1.83892623E-01   # DNR   decays
#          BR          NDA       ID1       ID2       ID3       ID4
      8.63989949E-01    2      1000022         1                       # DNR    -->  Z1SS   DN                 
      1.29488692E-01    2      1000023         1                       # DNR    -->  Z2SS   DN                 
      1.57530105E-03    2      1000025         1                       # DNR    -->  Z3SS   DN                 
      4.94606653E-03    2      1000035         1                       # DNR    -->  Z4SS   DN                 
#         PDG         Width
DECAY   2000003  1.83892637E-01   # STR   decays
#          BR          NDA       ID1       ID2       ID3       ID4
      8.63989949E-01    2      1000022         3                       # STR    -->  Z1SS   ST                 
      1.29488692E-01    2      1000023         3                       # STR    -->  Z2SS   ST                 
      1.57530163E-03    2      1000025         3                       # STR    -->  Z3SS   ST                 
      4.94606933E-03    2      1000035         3                       # STR    -->  Z4SS   ST                 
#         PDG         Width
DECAY   2000004  7.32535005E-01   # CHR   decays
#          BR          NDA       ID1       ID2       ID3       ID4
      8.64175916E-01    2      1000022         4                       # CHR    -->  Z1SS   CH                 
      1.29424199E-01    2      1000023         4                       # CHR    -->  Z2SS   CH                 
      1.55772001E-03    2      1000025         4                       # CHR    -->  Z3SS   CH                 
      4.84219333E-03    2      1000035         4                       # CHR    -->  Z4SS   CH                 
#         PDG         Width
DECAY   2000005  2.89353877E-01   # BT2   decays
#          BR          NDA       ID1       ID2       ID3       ID4
      5.26847303E-01    2      1000022         5                       # BT2    -->  Z1SS   BT                 
      1.87533572E-01    2      1000023         5                       # BT2    -->  Z2SS   BT                 
      1.59470458E-02    2      1000025         5                       # BT2    -->  Z3SS   BT                 
      2.64451411E-02    2      1000035         5                       # BT2    -->  Z4SS   BT                 
      1.19884618E-01    2     -1000024         6                       # BT2    -->  W1SS-  TP                 
      1.23342395E-01    2          -24   1000006                       # BT2    -->  W-     TP1                
#         PDG         Width
DECAY   2000006  3.71235752E+00   # TP2   decays
#          BR          NDA       ID1       ID2       ID3       ID4
      1.81945875E-01    2      1000024         5                       # TP2    -->  W1SS+  BT                 
      3.79233390E-01    2      1000037         5                       # TP2    -->  W2SS+  BT                 
      2.82158315E-01    2           23   1000006                       # TP2    -->  Z0     TP1                
      3.65434662E-02    2           25   1000006                       # TP2    -->  HL0    TP1                
      1.11556007E-02    2      1000022         6                       # TP2    -->  Z1SS   TP                 
      1.01593487E-01    2      1000023         6                       # TP2    -->  Z2SS   TP                 
      7.36986194E-03    2      1000025         6                       # TP2    -->  Z3SS   TP                 
#         PDG         Width
DECAY   1000011  9.57791626E-01   # EL-   decays
#          BR          NDA       ID1       ID2       ID3       ID4
      3.20494547E-02    2      1000022        11                       # EL-    -->  Z1SS   E-                 
      4.00171846E-01    2      1000023        11                       # EL-    -->  Z2SS   E-                 
      5.67778707E-01    2     -1000024        12                       # EL-    -->  W1SS-  NUE                
      6.96965818E-11    3      1000015        11       -15             # EL-    -->  TAU1-  E-     TAU+        
      3.82271784E-11    3     -1000015        11        15             # EL-    -->  TAU1+  E-     TAU-        
#         PDG         Width
DECAY   1000013  9.57791448E-01   # MUL-  decays
#          BR          NDA       ID1       ID2       ID3       ID4
      3.20494361E-02    2      1000022        13                       # MUL-   -->  Z1SS   MU-                
      4.00171429E-01    2      1000023        13                       # MUL-   -->  Z2SS   MU-                
      5.67779124E-01    2     -1000024        14                       # MUL-   -->  W1SS-  NUM                
      6.96969982E-11    3      1000015        13       -15             # MUL-   -->  TAU1-  MU-    TAU+        
      3.82274143E-11    3     -1000015        13        15             # MUL-   -->  TAU1+  MU-    TAU-        
#         PDG         Width
DECAY   1000015  4.93092597E-01   # TAU1- decays
#          BR          NDA       ID1       ID2       ID3       ID4
      8.85099053E-01    2      1000022        15                       # TAU1-  -->  Z1SS   TAU-               
      8.30905810E-02    2      1000023        15                       # TAU1-  -->  Z2SS   TAU-               
      3.18103768E-02    2     -1000024        16                       # TAU1-  -->  W1SS-  NUT                
#         PDG         Width
DECAY   1000012  8.74541402E-01   # NUEL  decays
#          BR          NDA       ID1       ID2       ID3       ID4
      3.27918321E-01    2      1000022        12                       # NUEL   -->  Z1SS   NUE                
      1.19464509E-01    2      1000023        12                       # NUEL   -->  Z2SS   NUE                
      5.52617192E-01    2      1000024        11                       # NUEL   -->  W1SS+  E-                 
      4.12773358E-13    3      1000015        12       -15             # NUEL   -->  TAU1-  NUE    TAU+        
      2.74755099E-13    3     -1000015        12        15             # NUEL   -->  TAU1+  NUE    TAU-        
      3.16038021E-13    3     -1000015        11        16             # NUEL   -->  TAU1+  E-     NUT         
#         PDG         Width
DECAY   1000014  8.74540329E-01   # NUML  decays
#          BR          NDA       ID1       ID2       ID3       ID4
      3.27918738E-01    2      1000022        14                       # NUML   -->  Z1SS   NUM                
      1.19464658E-01    2      1000023        14                       # NUML   -->  Z2SS   NUM                
      5.52616596E-01    2      1000024        13                       # NUML   -->  W1SS+  MU-                
      4.12773873E-13    3      1000015        14       -15             # NUML   -->  TAU1-  NUM    TAU+        
      2.74755425E-13    3     -1000015        14        15             # NUML   -->  TAU1+  NUM    TAU-        
      3.16040434E-13    3     -1000015        13        16             # NUML   -->  TAU1+  MU-    NUT         
#         PDG         Width
DECAY   1000016  8.67292404E-01   # NUTL  decays
#          BR          NDA       ID1       ID2       ID3       ID4
      3.29183042E-01    2      1000022        16                       # NUTL   -->  Z1SS   NUT                
      1.19226038E-01    2      1000023        16                       # NUTL   -->  Z2SS   NUT                
      5.51590919E-01    2      1000024        15                       # NUTL   -->  W1SS+  TAU-               
      3.00165844E-13    3     -1000015        16        15             # NUTL   -->  TAU1+  NUT    TAU-        
      1.86879109E-10    3      1000015        16       -15             # NUTL   -->  TAU1-  NUT    TAU+        
      1.86678478E-10    3      1000015        12       -11             # NUTL   -->  TAU1-  NUE    E+          
      1.86678478E-10    3      1000015        14       -13             # NUTL   -->  TAU1-  NUM    MU+         
      5.60035407E-10    3      1000015         2        -1             # NUTL   -->  TAU1-  UP     DB          
      5.60035407E-10    3      1000015         4        -3             # NUTL   -->  TAU1-  CH     SB          
#         PDG         Width
DECAY   2000011  4.85369325E-01   # ER-   decays
#          BR          NDA       ID1       ID2       ID3       ID4
      9.31903839E-01    2      1000022        11                       # ER-    -->  Z1SS   E-                 
      6.80961758E-02    2      1000023        11                       # ER-    -->  Z2SS   E-                 
      6.88593815E-28    3      1000015        12       -16             # ER-    -->  TAU1-  NUE    ANUT        
#         PDG         Width
DECAY   2000013  4.85368878E-01   # MUR-  decays
#          BR          NDA       ID1       ID2       ID3       ID4
      9.31903899E-01    2      1000022        13                       # MUR-   -->  Z1SS   MU-                
      6.80961087E-02    2      1000023        13                       # MUR-   -->  Z2SS   MU-                
      2.94305450E-23    3      1000015        14       -16             # MUR-   -->  TAU1-  NUM    ANUT        
#         PDG         Width
DECAY   2000015  9.38938141E-01   # TAU2- decays
#          BR          NDA       ID1       ID2       ID3       ID4
      4.93785478E-02    2      1000022        15                       # TAU2-  -->  Z1SS   TAU-               
      3.95166874E-01    2      1000023        15                       # TAU2-  -->  Z2SS   TAU-               
      5.55454552E-01    2     -1000024        16                       # TAU2-  -->  W1SS-  NUT                
#         PDG         Width
DECAY   1000023  2.22396989E-06   # Z2SS  decays
#          BR          NDA       ID1       ID2       ID3       ID4
      2.30772246E-04    2      1000022        22                       # Z2SS   -->  Z1SS   GM                 
      2.02675792E-03    3     -1000024         2        -1             # Z2SS   -->  W1SS-  UP     DB          
      6.75585994E-04    3     -1000024        12       -11             # Z2SS   -->  W1SS-  NUE    E+          
      6.75585994E-04    3     -1000024        14       -13             # Z2SS   -->  W1SS-  NUM    MU+         
      2.02675792E-03    3      1000024         1        -2             # Z2SS   -->  W1SS+  DN     UB          
      6.75585994E-04    3      1000024        11       -12             # Z2SS   -->  W1SS+  E-     ANUE        
      6.75585994E-04    3      1000024        13       -14             # Z2SS   -->  W1SS+  MU-    ANUM        
      2.02675792E-03    3     -1000024         4        -3             # Z2SS   -->  W1SS-  CH     SB          
      6.75585994E-04    3     -1000024        16       -15             # Z2SS   -->  W1SS-  NUT    TAU+        
      2.02675792E-03    3      1000024         3        -4             # Z2SS   -->  W1SS+  ST     CB          
      6.75585994E-04    3      1000024        15       -16             # Z2SS   -->  W1SS+  TAU-   ANUT        
      3.06041297E-02    3      1000022         2        -2             # Z2SS   -->  Z1SS   UP     UB          
      6.73285648E-02    3      1000022         1        -1             # Z2SS   -->  Z1SS   DN     DB          
      6.73285574E-02    3      1000022         3        -3             # Z2SS   -->  Z1SS   ST     SB          
      3.06040719E-02    3      1000022         4        -4             # Z2SS   -->  Z1SS   CH     CB          
      6.67712390E-02    3      1000022         5        -5             # Z2SS   -->  Z1SS   BT     BB          
      1.33037180E-01    3      1000022        11       -11             # Z2SS   -->  Z1SS   E-     E+          
      1.33036941E-01    3      1000022        13       -13             # Z2SS   -->  Z1SS   MU-    MU+         
      1.40117541E-01    3      1000022        15       -15             # Z2SS   -->  Z1SS   TAU-   TAU+        
      1.05469912E-01    3      1000022        12       -12             # Z2SS   -->  Z1SS   NUE    ANUE        
      1.05469912E-01    3      1000022        14       -14             # Z2SS   -->  Z1SS   NUM    ANUM        
      1.07840650E-01    3      1000022        16       -16             # Z2SS   -->  Z1SS   NUT    ANUT        
#         PDG         Width
DECAY   1000025  1.19650555E+00   # Z3SS  decays
#          BR          NDA       ID1       ID2       ID3       ID4
      4.82593578E-07    2      1000022        22                       # Z3SS   -->  Z1SS   GM                 
      1.01593663E-07    2      1000023        22                       # Z3SS   -->  Z2SS   GM                 
      3.09636503E-01    2      1000024       -24                       # Z3SS   -->  W1SS+  W-                 
      3.09636503E-01    2     -1000024        24                       # Z3SS   -->  W1SS-  W+                 
      2.02208102E-01    2      1000022        23                       # Z3SS   -->  Z1SS   Z0                 
      1.23678677E-01    2      1000023        23                       # Z3SS   -->  Z2SS   Z0                 
      5.87004330E-08    3      1000022         2        -2             # Z3SS   -->  Z1SS   UP     UB          
      1.03473219E-07    3      1000022         1        -1             # Z3SS   -->  Z1SS   DN     DB          
      1.03473148E-07    3      1000022         3        -3             # Z3SS   -->  Z1SS   ST     SB          
      5.86979212E-08    3      1000022         4        -4             # Z3SS   -->  Z1SS   CH     CB          
      5.55373163E-07    3      1000022         5        -5             # Z3SS   -->  Z1SS   BT     BB          
      3.00831786E-08    3      1000022        15       -15             # Z3SS   -->  Z1SS   TAU-   TAU+        
      1.43297697E-07    3      1000023         2        -2             # Z3SS   -->  Z2SS   UP     UB          
      1.48147862E-07    3      1000023         1        -1             # Z3SS   -->  Z2SS   DN     DB          
      1.48147720E-07    3      1000023         3        -3             # Z3SS   -->  Z2SS   ST     SB          
      1.43291686E-07    3      1000023         4        -4             # Z3SS   -->  Z2SS   CH     CB          
      4.84099075E-07    3      1000023         5        -5             # Z3SS   -->  Z2SS   BT     BB          
      6.48098064E-09    3      1000023        15       -15             # Z3SS   -->  Z2SS   TAU-   TAU+        
      1.94459073E-02    2      1000022        25                       # Z3SS   -->  Z1SS   HL0                
      6.09854097E-03    2      1000023        25                       # Z3SS   -->  Z2SS   HL0                
      4.94026870E-04    2      1000011       -11                       # Z3SS   -->  EL-    E+                 
      4.94026870E-04    2     -1000011        11                       # Z3SS   -->  EL+    E-                 
      4.94026172E-04    2      1000013       -13                       # Z3SS   -->  MUL-   MU+                
      4.94026172E-04    2     -1000013        13                       # Z3SS   -->  MUL+   MU-                
      1.00934145E-03    2      2000011       -11                       # Z3SS   -->  ER-    E+                 
      1.00934145E-03    2     -2000011        11                       # Z3SS   -->  ER+    E-                 
      1.00934051E-03    2      2000013       -13                       # Z3SS   -->  MUR-   MU+                
      1.00934051E-03    2     -2000013        13                       # Z3SS   -->  MUR+   MU-                
      9.98568605E-04    2      1000015       -15                       # Z3SS   -->  TAU1-  TAU+               
      9.98568605E-04    2     -1000015        15                       # Z3SS   -->  TAU1+  TAU-               
      1.06392941E-03    2      2000015       -15                       # Z3SS   -->  TAU2-  TAU+               
      1.06392941E-03    2     -2000015        15                       # Z3SS   -->  TAU2+  TAU-               
      3.18462076E-03    2      1000012       -12                       # Z3SS   -->  NUEL   ANUE               
      3.18462076E-03    2     -1000012        12                       # Z3SS   -->  ANUEL  NUE                
      3.18462076E-03    2      1000014       -14                       # Z3SS   -->  NUML   ANUM               
      3.18462076E-03    2     -1000014        14                       # Z3SS   -->  ANUML  NUM                
      3.20815155E-03    2      1000016       -16                       # Z3SS   -->  NUTL   ANUT               
      3.20815155E-03    2     -1000016        16                       # Z3SS   -->  ANUTL  NUT                
#         PDG         Width
DECAY   1000035  2.09915686E+00   # Z4SS  decays
#          BR          NDA       ID1       ID2       ID3       ID4
      3.07729920E-07    2      1000022        22                       # Z4SS   -->  Z1SS   GM                 
      5.67214215E-07    2      1000023        22                       # Z4SS   -->  Z2SS   GM                 
      2.79686265E-08    2      1000025        22                       # Z4SS   -->  Z3SS   GM                 
      2.63004512E-01    2      1000024       -24                       # Z4SS   -->  W1SS+  W-                 
      2.63004512E-01    2     -1000024        24                       # Z4SS   -->  W1SS-  W+                 
      1.17122112E-09    3     -1000037         2        -1             # Z4SS   -->  W2SS-  UP     DB          
      3.90407068E-10    3     -1000037        12       -11             # Z4SS   -->  W2SS-  NUE    E+          
      3.90407068E-10    3     -1000037        14       -13             # Z4SS   -->  W2SS-  NUM    MU+         
      1.17122112E-09    3      1000037         1        -2             # Z4SS   -->  W2SS+  DN     UB          
      3.90407068E-10    3      1000037        11       -12             # Z4SS   -->  W2SS+  E-     ANUE        
      3.90407068E-10    3      1000037        13       -14             # Z4SS   -->  W2SS+  MU-    ANUM        
      1.17122112E-09    3     -1000037         4        -3             # Z4SS   -->  W2SS-  CH     SB          
      3.90407068E-10    3     -1000037        16       -15             # Z4SS   -->  W2SS-  NUT    TAU+        
      1.17122112E-09    3      1000037         3        -4             # Z4SS   -->  W2SS+  ST     CB          
      3.90407068E-10    3      1000037        15       -16             # Z4SS   -->  W2SS+  TAU-   ANUT        
      1.76438559E-02    2      1000022        23                       # Z4SS   -->  Z1SS   Z0                 
      7.12620793E-03    2      1000023        23                       # Z4SS   -->  Z2SS   Z0                 
      1.00195257E-06    3      1000022         2        -2             # Z4SS   -->  Z1SS   UP     UB          
      3.64387370E-06    3      1000022         1        -1             # Z4SS   -->  Z1SS   DN     DB          
      3.64387051E-06    3      1000022         3        -3             # Z4SS   -->  Z1SS   ST     SB          
      1.00190630E-06    3      1000022         4        -4             # Z4SS   -->  Z1SS   CH     CB          
      6.32068759E-06    3      1000022         5        -5             # Z4SS   -->  Z1SS   BT     BB          
      2.12885869E-08    3      1000022        15       -15             # Z4SS   -->  Z1SS   TAU-   TAU+        
      9.67614687E-06    3      1000023         2        -2             # Z4SS   -->  Z2SS   UP     UB          
      8.38496362E-06    3      1000023         1        -1             # Z4SS   -->  Z2SS   DN     DB          
      8.38495635E-06    3      1000023         3        -3             # Z4SS   -->  Z2SS   ST     SB          
      9.67571304E-06    3      1000023         4        -4             # Z4SS   -->  Z2SS   CH     CB          
      1.46431603E-05    3      1000023         5        -5             # Z4SS   -->  Z2SS   BT     BB          
      3.87294996E-09    3      1000023        15       -15             # Z4SS   -->  Z2SS   TAU-   TAU+        
      2.98412488E-06    3      1000025         2        -2             # Z4SS   -->  Z3SS   UP     UB          
      3.93100936E-06    3      1000025         1        -1             # Z4SS   -->  Z3SS   DN     DB          
      3.93100936E-06    3      1000025         3        -3             # Z4SS   -->  Z3SS   ST     SB          
      2.98412601E-06    3      1000025         4        -4             # Z4SS   -->  Z3SS   CH     CB          
      3.22953201E-06    3      1000025         5        -5             # Z4SS   -->  Z3SS   BT     BB          
      8.81463336E-07    3      1000025        11       -11             # Z4SS   -->  Z3SS   E-     E+          
      8.81463336E-07    3      1000025        13       -13             # Z4SS   -->  Z3SS   MU-    MU+         
      8.52035669E-07    3      1000025        15       -15             # Z4SS   -->  Z3SS   TAU-   TAU+        
      1.75383468E-06    3      1000025        12       -12             # Z4SS   -->  Z3SS   NUE    ANUE        
      1.75383468E-06    3      1000025        14       -14             # Z4SS   -->  Z3SS   NUM    ANUM        
      1.75383468E-06    3      1000025        16       -16             # Z4SS   -->  Z3SS   NUT    ANUT        
      8.10097605E-02    2      1000022        25                       # Z4SS   -->  Z1SS   HL0                
      5.87410517E-02    2      1000023        25                       # Z4SS   -->  Z2SS   HL0                
      1.13238143E-02    2      1000011       -11                       # Z4SS   -->  EL-    E+                 
      1.13238143E-02    2     -1000011        11                       # Z4SS   -->  EL+    E-                 
      1.13238078E-02    2      1000013       -13                       # Z4SS   -->  MUL-   MU+                
      1.13238078E-02    2     -1000013        13                       # Z4SS   -->  MUL+   MU-                
      5.09020640E-03    2      2000011       -11                       # Z4SS   -->  ER-    E+                 
      5.09020640E-03    2     -2000011        11                       # Z4SS   -->  ER+    E-                 
      5.09020314E-03    2      2000013       -13                       # Z4SS   -->  MUR-   MU+                
      5.09020314E-03    2     -2000013        13                       # Z4SS   -->  MUR+   MU-                
      4.58695367E-03    2      1000015       -15                       # Z4SS   -->  TAU1-  TAU+               
      4.58695367E-03    2     -1000015        15                       # Z4SS   -->  TAU1+  TAU-               
      1.19857220E-02    2      2000015       -15                       # Z4SS   -->  TAU2-  TAU+               
      1.19857220E-02    2     -2000015        15                       # Z4SS   -->  TAU2+  TAU-               
      3.50404829E-02    2      1000012       -12                       # Z4SS   -->  NUEL   ANUE               
      3.50404829E-02    2     -1000012        12                       # Z4SS   -->  ANUEL  NUE                
      3.50404829E-02    2      1000014       -14                       # Z4SS   -->  NUML   ANUM               
      3.50404829E-02    2     -1000014        14                       # Z4SS   -->  ANUML  NUM                
      3.52072604E-02    2      1000016       -16                       # Z4SS   -->  NUTL   ANUT               
      3.52072604E-02    2     -1000016        16                       # Z4SS   -->  ANUTL  NUT                
#         PDG         Width
DECAY   1000024  1.99638089E-05   # W1SS+ decays
#          BR          NDA       ID1       ID2       ID3       ID4
      2.93813795E-01    3      1000022         2        -1             # W1SS+  -->  Z1SS   UP     DB          
      2.93813735E-01    3      1000022         4        -3             # W1SS+  -->  Z1SS   CH     SB          
      1.37141541E-01    3      1000022       -11        12             # W1SS+  -->  Z1SS   E+     NUE         
      1.37141541E-01    3      1000022       -13        14             # W1SS+  -->  Z1SS   MU+    NUM         
      1.38089404E-01    3      1000022       -15        16             # W1SS+  -->  Z1SS   TAU+   NUT         
#         PDG         Width
DECAY   1000037  2.10867047E+00   # W2SS+ decays
#          BR          NDA       ID1       ID2       ID3       ID4
      3.32109448E-06    3      1000022         2        -1             # W2SS+  -->  Z1SS   UP     DB          
      3.32109221E-06    3      1000022         4        -3             # W2SS+  -->  Z1SS   CH     SB          
      3.10657139E-10    3      1000022       -15        16             # W2SS+  -->  Z1SS   TAU+   NUT         
      4.98469127E-03    2      1000022        24                       # W2SS+  -->  Z1SS   W+                 
      7.99356985E-06    3      1000023         2        -1             # W2SS+  -->  Z2SS   UP     DB          
      7.99343616E-06    3      1000023         4        -3             # W2SS+  -->  Z2SS   CH     SB          
      3.75810103E-08    3      1000023       -15        16             # W2SS+  -->  Z2SS   TAU+   NUT         
      3.24106753E-01    2      1000023        24                       # W2SS+  -->  Z2SS   W+                 
      5.06925335E-06    3      1000025         2        -1             # W2SS+  -->  Z3SS   UP     DB          
      5.06925380E-06    3      1000025         4        -3             # W2SS+  -->  Z3SS   CH     SB          
      1.68394320E-06    3      1000025       -11        12             # W2SS+  -->  Z3SS   E+     NUE         
      1.68394320E-06    3      1000025       -13        14             # W2SS+  -->  Z3SS   MU+    NUM         
      1.68394502E-06    3      1000025       -15        16             # W2SS+  -->  Z3SS   TAU+   NUT         
      6.67153373E-02    2      1000006        -5                       # W2SS+  -->  TP1    BB                 
      2.90789381E-02    2      1000012       -11                       # W2SS+  -->  NUEL   E+                 
      2.90789325E-02    2      1000014       -13                       # W2SS+  -->  NUML   MU+                
      2.95609422E-02    2      1000016       -15                       # W2SS+  -->  NUTL   TAU+               
      5.54653667E-02    2     -1000011        12                       # W2SS+  -->  EL+    NUE                
      5.54653443E-02    2     -1000013        14                       # W2SS+  -->  MUL+   NUM                
      8.31210578E-04    2     -1000015        16                       # W2SS+  -->  TAU1+  NUT                
      5.49837351E-02    2     -2000015        16                       # W2SS+  -->  TAU2+  NUT                
      2.27868542E-01    2      1000024        23                       # W2SS+  -->  W1SS+  Z0                 
      1.03409229E-05    3      1000024         1        -1             # W2SS+  -->  W1SS+  DN     DB          
      1.03404636E-05    3      1000024         3        -3             # W2SS+  -->  W1SS+  ST     SB          
      1.81327396E-05    3      1000024         2        -2             # W2SS+  -->  W1SS+  UP     UB          
      1.81327196E-05    3      1000024         4        -4             # W2SS+  -->  W1SS+  CH     CB          
      1.21765383E-01    2      1000024        25                       # W2SS+  -->  W1SS+  HL0                
#         PDG         Width
DECAY        25  4.11270326E-03   # HL0   decays
#          BR          NDA       ID1       ID2       ID3       ID4
      5.14074916E-09    2           11       -11                       # HL0    -->  E-     E+                 
      2.17049965E-04    2           13       -13                       # HL0    -->  MU-    MU+                
      6.20242842E-02    2           15       -15                       # HL0    -->  TAU-   TAU+               
      6.47590878E-06    2            1        -1                       # HL0    -->  DN     DB                 
      2.61658942E-03    2            3        -3                       # HL0    -->  ST     SB                 
      8.86657119E-01    2            5        -5                       # HL0    -->  BT     BB                 
      1.45100864E-06    2            2        -2                       # HL0    -->  UP     UB                 
      2.83394754E-02    2            4        -4                       # HL0    -->  CH     CB                 
      8.59837222E-04    2           22        22                       # HL0    -->  GM     GM                 
      1.90962143E-02    2           21        21                       # HL0    -->  GL     GL                 
      1.00840361E-05    3           24        11       -12             # HL0    -->  W+     E-     ANUE        
      1.00840361E-05    3           24        13       -14             # HL0    -->  W+     MU-    ANUM        
      1.00840361E-05    3           24        15       -16             # HL0    -->  W+     TAU-   ANUT        
      3.02521057E-05    3           24        -2         1             # HL0    -->  W+     UB     DN          
      3.02521057E-05    3           24        -4         3             # HL0    -->  W+     CB     ST          
      1.00840361E-05    3          -24       -11        12             # HL0    -->  W-     E+     NUE         
      1.00840361E-05    3          -24       -13        14             # HL0    -->  W-     MU+    NUM         
      1.00840361E-05    3          -24       -15        16             # HL0    -->  W-     TAU+   NUT         
      3.02521057E-05    3          -24         2        -1             # HL0    -->  W-     UP     DB          
      3.02521057E-05    3          -24         4        -3             # HL0    -->  W-     CH     SB          
#         PDG         Width
DECAY        35  5.52059114E-01   # HH0   decays
#          BR          NDA       ID1       ID2       ID3       ID4
      7.84236842E-10    2           11       -11                       # HH0    -->  E-     E+                 
      3.31118681E-05    2           13       -13                       # HH0    -->  MU-    MU+                
      9.48169269E-03    2           15       -15                       # HH0    -->  TAU-   TAU+               
      9.72018711E-07    2            1        -1                       # HH0    -->  DN     DB                 
      3.92744667E-04    2            3        -3                       # HH0    -->  ST     SB                 
      6.42424524E-02    2            5        -5                       # HH0    -->  BT     BB                 
      5.48317169E-09    2            2        -2                       # HH0    -->  UP     UB                 
      9.01428357E-05    2            4        -4                       # HH0    -->  CH     CB                 
      7.50546360E-06    2           22        22                       # HH0    -->  GM     GM                 
      1.25291105E-03    2           21        21                       # HH0    -->  GL     GL                 
      3.20919976E-02    2           24       -24                       # HH0    -->  W+     W-                 
      1.46139096E-02    2           23        23                       # HH0    -->  Z0     Z0                 
      9.70336273E-02    2      1000022   1000022                       # HH0    -->  Z1SS   Z1SS               
      1.29988924E-01    2      1000022   1000023                       # HH0    -->  Z1SS   Z2SS               
      1.46897063E-01    2      1000022   1000025                       # HH0    -->  Z1SS   Z3SS               
      3.93869244E-02    2      1000023   1000023                       # HH0    -->  Z2SS   Z2SS               
      3.03539336E-01    2      1000024  -1000024                       # HH0    -->  W1SS+  W1SS-              
      1.04530096E-01    2           25        25                       # HH0    -->  HL0    HL0                
      4.76410612E-03    2      2000011  -2000011                       # HH0    -->  ER-    ER+                
      4.76385094E-03    2      2000013  -2000013                       # HH0    -->  MUR-   MUR+               
      4.91709821E-03    2      1000015  -1000015                       # HH0    -->  TAU1-  TAU1+              
      1.37553364E-02    2      1000012  -1000012                       # HH0    -->  NUEL   ANUEL              
      1.37553364E-02    2      1000014  -1000014                       # HH0    -->  NUML   ANUML              
      1.44608943E-02    2      1000016  -1000016                       # HH0    -->  NUTL   ANUTL              
#         PDG         Width
DECAY        36  1.08661580E+00   # HA0   decays
#          BR          NDA       ID1       ID2       ID3       ID4
      4.05128542E-10    2           11       -11                       # HA0    -->  E-     E+                 
      1.71052543E-05    2           13       -13                       # HA0    -->  MU-    MU+                
      4.89883451E-03    2           15       -15                       # HA0    -->  TAU-   TAU+               
      5.02284422E-07    2            1        -1                       # HA0    -->  DN     DB                 
      2.02948373E-04    2            3        -3                       # HA0    -->  ST     SB                 
      3.32169123E-02    2            5        -5                       # HA0    -->  BT     BB                 
      1.98413219E-09    2            2        -2                       # HA0    -->  UP     UB                 
      3.27316011E-05    2            4        -4                       # HA0    -->  CH     CB                 
      2.94728352E-06    2           22        22                       # HA0    -->  GM     GM                 
      3.04543151E-04    2           21        21                       # HA0    -->  GL     GL                 
      1.18950158E-01    2      1000022   1000022                       # HA0    -->  Z1SS   Z1SS               
      1.98068723E-01    2      1000022   1000023                       # HA0    -->  Z1SS   Z2SS               
      8.67306720E-04    2      1000022   1000025                       # HA0    -->  Z1SS   Z3SS               
      8.24171081E-02    2      1000023   1000023                       # HA0    -->  Z2SS   Z2SS               
      5.49982786E-01    2      1000024  -1000024                       # HA0    -->  W1SS+  W1SS-              
      1.10373944E-02    2           25        23                       # HA0    -->  HL0    Z0                 
#         PDG         Width
DECAY        37  1.05780900E+00   # H+    decays
#          BR          NDA       ID1       ID2       ID3       ID4
      4.34094927E-10    2           12       -11                       # H+     -->  NUE    E+                 
      1.83282646E-05    2           14       -13                       # H+     -->  NUM    MU+                
      5.24913007E-03    2           16       -15                       # H+     -->  NUT    TAU+               
      4.90734635E-07    2            2        -1                       # H+     -->  UP     DB                 
      2.29162397E-04    2            4        -3                       # H+     -->  CH     SB                 
      7.49916732E-01    2            6        -5                       # H+     -->  TP     BB                 
      1.94651693E-01    2      1000024   1000022                       # H+     -->  W1SS+  Z1SS               
      3.43289264E-02    2      1000024   1000023                       # H+     -->  W1SS+  Z2SS               
      1.51092885E-02    2           25        24                       # H+     -->  HL0    W+                 
      4.96211345E-04    2     -1000015   1000016                       # H+     -->  TAU1+  NUTL               
