  65
  401   9981.8867    0.10650E-26
  402   9981.5586    0.10650E-26
  403   9981.8867    0.10650E-26
  404   9981.5586    0.10650E-26
  405   3692.0598    0.20650E-26
  406   2563.1240    0.51394E-26
  407   9981.8867    0.10650E-26
  408   9981.5586    0.10650E-26
  409   9981.8867    0.10650E-26
  410   9981.5586    0.10650E-26
  411   3692.0598    0.20650E-26
  412   2563.1240    0.51394E-26
  413  10036.7500    0.13193E-26
  414   9924.1182    0.12894E-26
  415  10036.7500    0.13193E-26
  416   9924.1182    0.12894E-26
  417   4246.2134    0.24808E-26
  418   3678.5620    0.20153E-26
  419  10036.7500    0.13193E-26
  420   9924.1182    0.12894E-26
  421  10036.7500    0.13193E-26
  422   9924.1182    0.12894E-26
  423   4246.2134    0.24808E-26
  424   3678.5620    0.20153E-26
  425   9940.6885    0.47694E-26
  426   9943.5596    0.47676E-26
  427   9940.6885    0.47694E-26
  428   9943.5596    0.47676E-26
  429   4262.7158    0.23792E-25
  430   7524.6787    0.48135E-26
  431   9940.6885    0.47694E-26
  432   9943.5596    0.47676E-26
  433   9940.6885    0.47694E-26
  434   9943.5596    0.47676E-26
  435   4262.7158    0.23792E-25
  436   7524.6787    0.48135E-26
  437  10095.8408    0.12822E-25
  438      0.0000    0.10000E+31
  439  10095.8408    0.12822E-25
  440      0.0000    0.10000E+31
  441   7525.0615    0.48520E-26
  442      0.0000    0.10000E+31
  443  10095.8408    0.12822E-25
  444      0.0000    0.10000E+31
  445  10095.8408    0.12822E-25
  446      0.0000    0.10000E+31
  447   7525.0615    0.48520E-26
  448      0.0000    0.10000E+31
  449    720.3036    0.76145E-19
  450    109.5018    0.10000E+31
  451    233.1237    0.31502E-17
  452  -3387.0962    0.21778E-25
  453   3387.6313    0.17603E-25
  454    234.0459    0.29558E-19
  455   3367.7832    0.19091E-25
  456    234.0459    0.29558E-19
  457   3367.7832    0.19091E-25
  203    128.0195    0.12133E-21
  204   3527.4485    0.44796E-26
  205   3504.4519    0.45090E-26
  206   3533.2412    0.47942E-26
  207   3533.2412    0.47942E-26
  458      0.0000    0.10000E+31
    6    172.5000    0.57395E-24
   12    172.5000    0.57395E-24
   7
   401  0.23375587E-02     0   450     1     0     0     0
   401  0.67813583E-01     0   451     1     0     0     0
   401  0.16730583E-04     0   452     1     0     0     0
   401  0.16924771E-04     0   453     1     0     0     0
   401  0.79402268E+00     0   449     1     0     0     0
   401  0.13567634E+00     0   456     2     0     0     0
   401  0.11610215E-03     0   457     2     0     0     0
   6
   402  0.22251233E-02     0   450     2     0     0     0
   402  0.67937836E-01     0   451     2     0     0     0
   402  0.11342552E-04     0   452     2     0     0     0
   402  0.11065955E-04     0   453     2     0     0     0
   402  0.79399669E+00     0   449     2     0     0     0
   402  0.13581802E+00     0   454     1     0     0     0
   7
   403  0.23375587E-02     0   450     3     0     0     0
   403  0.67813583E-01     0   451     3     0     0     0
   403  0.16730583E-04     0   452     3     0     0     0
   403  0.16924771E-04     0   453     3     0     0     0
   403  0.79402268E+00     0   449     3     0     0     0
   403  0.13567634E+00     0   456     4     0     0     0
   403  0.11610215E-03     0   457     4     0     0     0
   6
   404  0.22251233E-02     0   450     4     0     0     0
   404  0.67937836E-01     0   451     4     0     0     0
   404  0.11342553E-04     0   452     4     0     0     0
   404  0.11065954E-04     0   453     4     0     0     0
   404  0.79399669E+00     0   449     4     0     0     0
   404  0.13581802E+00     0   454     3     0     0     0
   8
   405  0.19132787E-02     0   450     5     0     0     0
   405  0.48002645E-01     0   451     5     0     0     0
   405  0.15391445E-02     0   452     5     0     0     0
   405  0.15230037E-02     0   453     5     0     0     0
   405  0.58044386E+00     0   449     5     0     0     0
   405  0.95507987E-01     0   456     6     0     0     0
   405  0.31404779E-02     0   457     6     0     0     0
   405  0.26792964E+00     0   199   406     0     0     0
   4
   406  0.95119381E+00     0   449     6     0     0     0
   406  0.43860070E-01     0   450     6     0     0     0
   406  0.15806416E-02     0   451     6     0     0     0
   406  0.33653914E-02     0   454     5     0     0     0
   7
   407  0.23375587E-02     0   450     7     0     0     0
   407  0.67813583E-01     0   451     7     0     0     0
   407  0.16730583E-04     0   452     7     0     0     0
   407  0.16924771E-04     0   453     7     0     0     0
   407  0.79402268E+00     0   449     7     0     0     0
   407  0.13567634E+00     0   454     8     0     0     0
   407  0.11610215E-03     0   455     8     0     0     0
   6
   408  0.22251233E-02     0   450     8     0     0     0
   408  0.67937836E-01     0   451     8     0     0     0
   408  0.11342552E-04     0   452     8     0     0     0
   408  0.11065955E-04     0   453     8     0     0     0
   408  0.79399669E+00     0   449     8     0     0     0
   408  0.13581802E+00     0   456     7     0     0     0
   7
   409  0.23375587E-02     0   450     9     0     0     0
   409  0.67813583E-01     0   451     9     0     0     0
   409  0.16730583E-04     0   452     9     0     0     0
   409  0.16924771E-04     0   453     9     0     0     0
   409  0.79402268E+00     0   449     9     0     0     0
   409  0.13567634E+00     0   454    10     0     0     0
   409  0.11610215E-03     0   455    10     0     0     0
   6
   410  0.22251233E-02     0   450    10     0     0     0
   410  0.67937836E-01     0   451    10     0     0     0
   410  0.11342553E-04     0   452    10     0     0     0
   410  0.11065954E-04     0   453    10     0     0     0
   410  0.79399669E+00     0   449    10     0     0     0
   410  0.13581802E+00     0   456     9     0     0     0
   8
   411  0.19132787E-02     0   450    11     0     0     0
   411  0.48002645E-01     0   451    11     0     0     0
   411  0.15391445E-02     0   452    11     0     0     0
   411  0.15230037E-02     0   453    11     0     0     0
   411  0.58044386E+00     0   449    11     0     0     0
   411  0.95507987E-01     0   454    12     0     0     0
   411  0.31404779E-02     0   455    12     0     0     0
   411  0.26792964E+00     0   198   412     0     0     0
   4
   412  0.95119381E+00     0   449    12     0     0     0
   412  0.43860070E-01     0   450    12     0     0     0
   412  0.15806416E-02     0   451    12     0     0     0
   412  0.33653914E-02     0   456    11     0     0     0
   2
   413  0.11364342E-01     0   450     1     0     0     0
   413  0.98863572E+00     0   449     1     0     0     0
   2
   414  0.43929029E-01     0   450     2     0     0     0
   414  0.95607108E+00     0   449     2     0     0     0
   2
   415  0.11364342E-01     0   450     3     0     0     0
   415  0.98863572E+00     0   449     3     0     0     0
   2
   416  0.43929026E-01     0   450     4     0     0     0
   416  0.95607108E+00     0   449     4     0     0     0
  11
   417  0.87544266E-02     0   450     5     0     0     0
   417  0.58418233E-03     0   451     5     0     0     0
   417  0.11266420E-01     0   452     5     0     0     0
   417  0.11285469E-01     0   453     5     0     0     0
   417  0.80712360E+00     0   449     5     0     0     0
   417  0.11407170E-02     0   456     6     0     0     0
   417  0.24162019E-01     0   457     6     0     0     0
   417  0.15427983E-01     0   199   406     0     0     0
   417  0.46336800E-01     0   199   418     0     0     0
   417  0.21771248E-01     0   200   405     0     0     0
   417  0.52147225E-01     0   203   405     0     0     0
   9
   418  0.55854487E+00     0   449     6     0     0     0
   418  0.92269279E-01     0   454     5     0     0     0
   418  0.31568133E-02     0   455     5     0     0     0
   418  0.12769878E+00     0   200   406     0     0     0
   418  0.16778034E+00     0   203   406     0     0     0
   418  0.20011466E-02     0   450     6     0     0     0
   418  0.45938462E-01     0   451     6     0     0     0
   418  0.11048622E-02     0   452     6     0     0     0
   418  0.15054529E-02     0   453     6     0     0     0
   2
   419  0.11364342E-01     0   450     7     0     0     0
   419  0.98863572E+00     0   449     7     0     0     0
   2
   420  0.43929029E-01     0   450     8     0     0     0
   420  0.95607108E+00     0   449     8     0     0     0
   2
   421  0.11364342E-01     0   450     9     0     0     0
   421  0.98863572E+00     0   449     9     0     0     0
   2
   422  0.43929026E-01     0   450    10     0     0     0
   422  0.95607108E+00     0   449    10     0     0     0
  11
   423  0.87544266E-02     0   450    11     0     0     0
   423  0.58418233E-03     0   451    11     0     0     0
   423  0.11266420E-01     0   452    11     0     0     0
   423  0.11285469E-01     0   453    11     0     0     0
   423  0.80712360E+00     0   449    11     0     0     0
   423  0.11407170E-02     0   454    12     0     0     0
   423  0.24162019E-01     0   455    12     0     0     0
   423  0.15427983E-01     0   198   412     0     0     0
   423  0.46336800E-01     0   198   424     0     0     0
   423  0.21771248E-01     0   200   411     0     0     0
   423  0.52147225E-01     0   203   411     0     0     0
   9
   424  0.55854487E+00     0   449    12     0     0     0
   424  0.92269279E-01     0   456    11     0     0     0
   424  0.31568133E-02     0   457    11     0     0     0
   424  0.12769878E+00     0   200   412     0     0     0
   424  0.16778034E+00     0   203   412     0     0     0
   424  0.20011466E-02     0   450    12     0     0     0
   424  0.45938462E-01     0   451    12     0     0     0
   424  0.11048622E-02     0   452    12     0     0     0
   424  0.15054529E-02     0   453    12     0     0     0
   6
   425  0.90803698E-01     0   450   121     0     0     0
   425  0.30355343E+00     0   451   121     0     0     0
   425  0.31147007E-04     0   452   121     0     0     0
   425  0.28694143E-04     0   453   121     0     0     0
   425  0.60506642E+00     0   456   122     0     0     0
   425  0.51667314E-03     0   457   122     0     0     0
   5
   426  0.92298061E-01     0   450   122     0     0     0
   426  0.30183065E+00     0   451   122     0     0     0
   426  0.10307560E-03     0   452   122     0     0     0
   426  0.10690821E-03     0   453   122     0     0     0
   426  0.60566133E+00     0   454   121     0     0     0
   6
   427  0.90803698E-01     0   450   123     0     0     0
   427  0.30355343E+00     0   451   123     0     0     0
   427  0.31147007E-04     0   452   123     0     0     0
   427  0.28694143E-04     0   453   123     0     0     0
   427  0.60506642E+00     0   456   124     0     0     0
   427  0.51667314E-03     0   457   124     0     0     0
   5
   428  0.92298061E-01     0   450   124     0     0     0
   428  0.30183065E+00     0   451   124     0     0     0
   428  0.10307560E-03     0   452   124     0     0     0
   428  0.10690821E-03     0   453   124     0     0     0
   428  0.60566133E+00     0   454   123     0     0     0
   6
   429  0.78269845E+00     0   450   125     0     0     0
   429  0.77653991E-03     0   451   125     0     0     0
   429  0.52735023E-01     0   452   125     0     0     0
   429  0.52680373E-01     0   453   125     0     0     0
   429  0.15938659E-02     0   456   126     0     0     0
   429  0.10951585E+00     0   457   126     0     0     0
   7
   430  0.70505813E-01     0   450   126     0     0     0
   430  0.23041874E+00     0   451   126     0     0     0
   430  0.64080268E-04     0   452   126     0     0     0
   430  0.66457775E-04     0   453   126     0     0     0
   430  0.46266204E+00     0   454   125     0     0     0
   430  0.17726152E+00     0   455   125     0     0     0
   430  0.59021302E-01     0   198   429     0     0     0
   6
   431  0.90803698E-01     0   450   127     0     0     0
   431  0.30355343E+00     0   451   127     0     0     0
   431  0.31147007E-04     0   452   127     0     0     0
   431  0.28694143E-04     0   453   127     0     0     0
   431  0.60506642E+00     0   454   128     0     0     0
   431  0.51667314E-03     0   455   128     0     0     0
   5
   432  0.92298061E-01     0   450   128     0     0     0
   432  0.30183065E+00     0   451   128     0     0     0
   432  0.10307560E-03     0   452   128     0     0     0
   432  0.10690821E-03     0   453   128     0     0     0
   432  0.60566133E+00     0   456   127     0     0     0
   6
   433  0.90803698E-01     0   450   129     0     0     0
   433  0.30355343E+00     0   451   129     0     0     0
   433  0.31147007E-04     0   452   129     0     0     0
   433  0.28694143E-04     0   453   129     0     0     0
   433  0.60506642E+00     0   454   130     0     0     0
   433  0.51667314E-03     0   455   130     0     0     0
   5
   434  0.92298061E-01     0   450   130     0     0     0
   434  0.30183065E+00     0   451   130     0     0     0
   434  0.10307560E-03     0   452   130     0     0     0
   434  0.10690821E-03     0   453   130     0     0     0
   434  0.60566133E+00     0   456   129     0     0     0
   6
   435  0.78269845E+00     0   450   131     0     0     0
   435  0.77653991E-03     0   451   131     0     0     0
   435  0.52735023E-01     0   452   131     0     0     0
   435  0.52680373E-01     0   453   131     0     0     0
   435  0.15938659E-02     0   454   132     0     0     0
   435  0.10951585E+00     0   455   132     0     0     0
   7
   436  0.70505813E-01     0   450   132     0     0     0
   436  0.23041874E+00     0   451   132     0     0     0
   436  0.64080268E-04     0   452   132     0     0     0
   436  0.66457775E-04     0   453   132     0     0     0
   436  0.46266204E+00     0   456   131     0     0     0
   436  0.17726152E+00     0   457   131     0     0     0
   436  0.59021302E-01     0   199   435     0     0     0
   3
   437  0.99987423E+00     0   450   121     0     0     0
   437  0.57514015E-04     0   452   121     0     0     0
   437  0.68328656E-04     0   453   121     0     0     0
   0
   3
   439  0.99987423E+00     0   450   123     0     0     0
   439  0.57514015E-04     0   452   123     0     0     0
   439  0.68328656E-04     0   453   123     0     0     0
   0
   8
   441  0.69945417E-01     0   450   125     0     0     0
   441  0.23358577E+00     0   451   125     0     0     0
   441  0.88932700E-01     0   452   125     0     0     0
   441  0.88920549E-01     0   453   125     0     0     0
   441  0.46530348E+00     0   456   126     0     0     0
   441  0.48826577E-03     0   457   126     0     0     0
   441  0.30136773E-01     0   200   429     0     0     0
   441  0.22687105E-01     0   203   429     0     0     0
   0
   3
   443  0.99987423E+00     0   450   127     0     0     0
   443  0.57514015E-04     0   452   127     0     0     0
   443  0.68328656E-04     0   453   127     0     0     0
   0
   3
   445  0.99987423E+00     0   450   129     0     0     0
   445  0.57514015E-04     0   452   129     0     0     0
   445  0.68328656E-04     0   453   129     0     0     0
   0
   8
   447  0.69945417E-01     0   450   131     0     0     0
   447  0.23358577E+00     0   451   131     0     0     0
   447  0.88932700E-01     0   452   131     0     0     0
   447  0.88920549E-01     0   453   131     0     0     0
   447  0.46530348E+00     0   454   132     0     0     0
   447  0.48826577E-03     0   455   132     0     0     0
   447  0.30136773E-01     0   200   435     0     0     0
   447  0.22687105E-01     0   203   435     0     0     0
   0
  20
   449  0.77720433E-02     0   454     1     8     0     0
   449  0.77720433E-02     0   456     2     7     0     0
   449  0.77720433E-02     0   454     3    10     0     0
   449  0.77720433E-02     0   456     4     9     0     0
   449  0.20820063E+00     0   454     5    12     0     0
   449  0.20820063E+00     0   456     6    11     0     0
   449  0.31714520E-03     0   450    13     0     0     0
   449  0.36655448E-02     0   450     2     8     0     0
   449  0.10430872E-02     0   450     1     7     0     0
   449  0.10430872E-02     0   450     3     9     0     0
   449  0.36655448E-02     0   450     4    10     0     0
   449  0.38769726E-01     0   450     5    11     0     0
   449  0.24075264E+00     0   450     6    12     0     0
   449  0.40250717E-03     0   451    13     0     0     0
   449  0.39109960E-02     0   451     2     8     0     0
   449  0.39031820E-02     0   451     1     7     0     0
   449  0.39031820E-02     0   451     3     9     0     0
   449  0.39109960E-02     0   451     4    10     0     0
   449  0.21364985E+00     0   451     5    11     0     0
   449  0.33573054E-01     0   451     6    12     0     0
   0
   8
   451  0.99958140E+00     0   450   200     0     0     0
   451  0.27430805E-03     0   450     5    11     0     0
   451  0.13838095E-04     0   450   121   127     0     0
   451  0.13838095E-04     0   450   123   129     0     0
   451  0.46239686E-04     0   450   125   131     0     0
   451  0.13972111E-04     0   450   122   128     0     0
   451  0.13972111E-04     0   450   124   130     0     0
   451  0.42626234E-04     0   450   126   132     0     0
  12
   452  0.17624615E+00     0   454   199     0     0     0
   452  0.17624615E+00     0   456   198     0     0     0
   452  0.36928914E-01     0   450   200     0     0     0
   452  0.10825003E+00     0   451   200     0     0     0
   452  0.31473636E-03     0   450     5    11     0     0
   452  0.87475259E-04     0   450   125   131     0     0
   452  0.13700713E-02     0   451     5    11     0     0
   452  0.10175984E-03     0   451   125   131     0     0
   452  0.34824040E-01     0   450   203     0     0     0
   452  0.10513174E+00     0   451   203     0     0     0
   452  0.18024951E+00     0   406    12     0     0     0
   452  0.18024951E+00     0   412     6     0     0     0
  12
   453  0.20843866E+00     0   454   199     0     0     0
   453  0.20843866E+00     0   456   198     0     0     0
   453  0.25161197E-01     0   450   200     0     0     0
   453  0.88029973E-01     0   451   200     0     0     0
   453  0.25127607E-03     0   450     5    11     0     0
   453  0.70210379E-04     0   450   125   131     0     0
   453  0.10948860E-02     0   451     5    11     0     0
   453  0.80415091E-04     0   451   125   131     0     0
   453  0.29596834E-01     0   450   203     0     0     0
   453  0.10346980E+00     0   451   203     0     0     0
   453  0.16768414E+00     0   406    12     0     0     0
   453  0.16768414E+00     0   412     6     0     0     0
   1
   454  0.10000001E+01     0   450   198     0     0     0
   7
   455  0.70109883E-04     0   450   131   126     0     0
   455  0.56894273E-01     0   450   198     0     0     0
   455  0.78875455E-04     0   451   131   126     0     0
   455  0.20853326E+00     0   451   198     0     0     0
   455  0.33133191E+00     0   406    11     0     0     0
   455  0.19721681E+00     0   454   200     0     0     0
   455  0.20587482E+00     0   454   203     0     0     0
   1
   456  0.10000001E+01     0   450   199     0     0     0
   7
   457  0.70109883E-04     0   450   125   132     0     0
   457  0.56894273E-01     0   450   199     0     0     0
   457  0.78875455E-04     0   451   125   132     0     0
   457  0.20853326E+00     0   451   199     0     0     0
   457  0.33133191E+00     0   412     5     0     0     0
   457  0.19721681E+00     0   456   200     0     0     0
   457  0.20587482E+00     0   456   203     0     0     0
  28
   203  0.16974045E-03     0   123   129     0     0     0
   203  0.48560269E-01     0   125   131     0     0     0
   203  0.20355154E-02     0     3     9     0     0     0
   203  0.65721506E+00     0     5    11     0     0     0
   203  0.29778870E-01     0     4    10     0     0     0
   203  0.21253757E-02     0    59    59     0     0     0
   203  0.40676981E-01     0    13    13     0     0     0
   203  0.10890133E-01     0   198   121   128     0     0
   203  0.10890133E-01     0   198   123   130     0     0
   203  0.10890133E-01     0   198   125   132     0     0
   203  0.32670401E-01     0   198     8     1     0     0
   203  0.32670401E-01     0   198    10     3     0     0
   203  0.10890133E-01     0   199   127   122     0     0
   203  0.10890133E-01     0   199   129   124     0     0
   203  0.10890133E-01     0   199   131   126     0     0
   203  0.32670401E-01     0   199     2     7     0     0
   203  0.32670401E-01     0   199     4     9     0     0
   203  0.16013919E-02     0   200   122   128     0     0
   203  0.16013919E-02     0   200   124   130     0     0
   203  0.16013919E-02     0   200   126   132     0     0
   203  0.80596446E-03     0   200   121   127     0     0
   203  0.80596446E-03     0   200   123   129     0     0
   203  0.80596446E-03     0   200   125   131     0     0
   203  0.27611658E-02     0   200     2     8     0     0
   203  0.27611658E-02     0   200     4    10     0     0
   203  0.35570620E-02     0   200     1     7     0     0
   203  0.35570620E-02     0   200     3     9     0     0
   203  0.35570620E-02     0   200     5    11     0     0
  11
   204  0.43754777E-03     0   123   129     0     0     0
   204  0.12532020E+00     0   125   131     0     0     0
   204  0.12577955E-04     0     1     7     0     0     0
   204  0.50821300E-02     0     3     9     0     0     0
   204  0.86825788E+00     0     5    11     0     0     0
   204  0.39967764E-03     0     6    12     0     0     0
   204  0.63473657E-04     0   450   451     0     0     0
   204  0.98283737E-04     0   450   452     0     0     0
   204  0.13199515E-04     0   450   453     0     0     0
   204  0.10194408E-03     0   451   451     0     0     0
   204  0.21308803E-03     0   454   456     0     0     0
  10
   205  0.43755627E-03     0   123   129     0     0     0
   205  0.12532276E+00     0   125   131     0     0     0
   205  0.12578738E-04     0     1     7     0     0     0
   205  0.50824466E-02     0     3     9     0     0     0
   205  0.86831462E+00     0     5    11     0     0     0
   205  0.40180483E-03     0     6    12     0     0     0
   205  0.63889107E-04     0   450   451     0     0     0
   205  0.42088897E-04     0   450   453     0     0     0
   205  0.10375681E-03     0   451   451     0     0     0
   205  0.21850901E-03     0   454   456     0     0     0
   7
   206  0.46904277E-03     0   124   129     0     0     0
   206  0.13434097E+00     0   126   131     0     0     0
   206  0.12509085E-04     0     2     7     0     0     0
   206  0.50543090E-02     0     4     9     0     0     0
   206  0.85977858E+00     0     6    11     0     0     0
   206  0.13863183E-03     0   454   450     0     0     0
   206  0.20590387E-03     0   455   450     0     0     0
   7
   207  0.46904277E-03     0   130   123     0     0     0
   207  0.13434097E+00     0   132   125     0     0     0
   207  0.12509085E-04     0     8     1     0     0     0
   207  0.50543090E-02     0    10     3     0     0     0
   207  0.85977858E+00     0    12     5     0     0     0
   207  0.13863183E-03     0   456   450     0     0     0
   207  0.20590387E-03     0   457   450     0     0     0
   0
   5
     6  0.33333334E+00   100     2     7     5     0     0
     6  0.33333334E+00   100     4     9     5     0     0
     6  0.11111111E+00   100   122   127     5     0     0
     6  0.11111111E+00   100   124   129     5     0     0
     6  0.11111111E+00   100   126   131     5     0     0
   5
    12  0.33333334E+00   100     8     1    11     0     0
    12  0.33333334E+00   100    10     3    11     0     0
    12  0.11111111E+00   100   128   121    11     0     0
    12  0.11111111E+00   100   130   123    11     0     0
    12  0.11111111E+00   100   132   125    11     0     0
     50.40000153     -0.01986307
      0.99991691     -0.00225588      0.01268235      0.00054374
      0.00254466      0.99973696     -0.02280093      0.00002816
     -0.00854449      0.01616298      0.70686501     -0.70711225
      0.00931361     -0.01612539     -0.70686716     -0.70710135
     -0.99999523      0.00309686     -0.00309686     -0.99999523
     -0.99945617      0.03297439     -0.03297439     -0.99945617
     -1.43170023     -0.12959646     -1.56115055
  -6567.11718750  -7058.59033203  -9041.39062500
   3437.29687500
    T
