  65
  401    403.8563    0.64536E-24
  402    396.8215    0.70524E-24
  403    403.8563    0.64540E-24
  404    396.8238    0.70524E-24
  405   2000.1373    0.64428E-26
  406   2004.0999    0.44824E-26
  407    403.8563    0.64536E-24
  408    396.8215    0.70524E-24
  409    403.8563    0.64540E-24
  410    396.8238    0.70524E-24
  411   2000.1373    0.64428E-26
  412   2004.0999    0.44824E-26
  413   2000.1418    0.64592E-26
  414   1999.7164    0.62539E-26
  415   2000.1418    0.64592E-26
  416   1999.7168    0.62539E-26
  417   2000.7828    0.44935E-26
  418   2004.4734    0.45334E-26
  419   2000.1418    0.64592E-26
  420   1999.7164    0.62539E-26
  421   2000.1418    0.64592E-26
  422   1999.7168    0.62539E-26
  423   2000.7828    0.44935E-26
  424   2004.4734    0.45334E-26
  425    204.8549    0.47029E-23
  426    190.6121    0.48677E-23
  427    204.8549    0.47029E-23
  428    190.6121    0.48677E-23
  429   2000.4075    0.64379E-25
  430   1999.0830    0.24784E-25
  431    204.8549    0.47029E-23
  432    190.6121    0.48677E-23
  433    204.8549    0.47029E-23
  434    190.6121    0.48677E-23
  435   2000.4075    0.64379E-25
  436   1999.0830    0.24784E-25
  437   2000.4253    0.65090E-25
  438      0.0000    0.10000E+31
  439   2000.4253    0.65090E-25
  440      0.0000    0.10000E+31
  441   2000.5106    0.24821E-25
  442      0.0000    0.10000E+31
  443   2000.4253    0.65090E-25
  444      0.0000    0.10000E+31
  445   2000.4253    0.65090E-25
  446      0.0000    0.10000E+31
  447   2000.5106    0.24821E-25
  448      0.0000    0.10000E+31
  449    500.0000    0.10298E-24
  450     99.9659    0.10000E+31
  451    299.8095    0.42733E-24
  452   -602.6187    0.13981E-24
  453    618.4748    0.11606E-24
  454    299.5957    0.42586E-24
  455    617.6038    0.11498E-24
  456    299.5957    0.42586E-24
  457    617.6038    0.11498E-24
  203    105.4009    0.17894E-21
  204   1007.7203    0.86670E-25
  205   1000.0000    0.87469E-25
  206   1006.3821    0.95104E-25
  207   1006.3821    0.95104E-25
  458      0.0000    0.10000E+31
    6    172.5000    0.57395E-24
   12    172.5000    0.57395E-24
   3
   401  0.59488673E-01     0   450     1     0     0     0
   401  0.31421632E+00     0   451     1     0     0     0
   401  0.62629509E+00     0   456     2     0     0     0
   3
   402  0.42102776E-01     0   450     2     0     0     0
   402  0.31710574E+00     0   451     2     0     0     0
   402  0.64079148E+00     0   454     1     0     0     0
   3
   403  0.59492767E-01     0   450     3     0     0     0
   403  0.31423804E+00     0   451     3     0     0     0
   403  0.62626916E+00     0   456     4     0     0     0
   3
   404  0.42102214E-01     0   450     4     0     0     0
   404  0.31707928E+00     0   451     4     0     0     0
   404  0.64081848E+00     0   454     3     0     0     0
   7
   405  0.10935134E-01     0   450     5     0     0     0
   405  0.65696346E-04     0   451     5     0     0     0
   405  0.64339180E-03     0   452     5     0     0     0
   405  0.63590967E-03     0   453     5     0     0     0
   405  0.98645926E+00     0   449     5     0     0     0
   405  0.10335973E-03     0   456     6     0     0     0
   405  0.11572496E-02     0   457     6     0     0     0
   7
   406  0.67635196E+00     0   449     6     0     0     0
   406  0.30149303E-01     0   450     6     0     0     0
   406  0.26459065E-02     0   451     6     0     0     0
   406  0.73330738E-01     0   452     6     0     0     0
   406  0.69890022E-01     0   453     6     0     0     0
   406  0.54377997E-02     0   454     5     0     0     0
   406  0.14219430E+00     0   455     5     0     0     0
   3
   407  0.59488673E-01     0   450     7     0     0     0
   407  0.31421632E+00     0   451     7     0     0     0
   407  0.62629509E+00     0   454     8     0     0     0
   3
   408  0.42102776E-01     0   450     8     0     0     0
   408  0.31710574E+00     0   451     8     0     0     0
   408  0.64079148E+00     0   456     7     0     0     0
   3
   409  0.59492767E-01     0   450     9     0     0     0
   409  0.31423804E+00     0   451     9     0     0     0
   409  0.62626916E+00     0   454    10     0     0     0
   3
   410  0.42102214E-01     0   450    10     0     0     0
   410  0.31707928E+00     0   451    10     0     0     0
   410  0.64081848E+00     0   456     9     0     0     0
   7
   411  0.10935134E-01     0   450    11     0     0     0
   411  0.65696346E-04     0   451    11     0     0     0
   411  0.64339180E-03     0   452    11     0     0     0
   411  0.63590967E-03     0   453    11     0     0     0
   411  0.98645926E+00     0   449    11     0     0     0
   411  0.10335973E-03     0   454    12     0     0     0
   411  0.11572496E-02     0   455    12     0     0     0
   7
   412  0.67635196E+00     0   449    12     0     0     0
   412  0.30149303E-01     0   450    12     0     0     0
   412  0.26459065E-02     0   451    12     0     0     0
   412  0.73330738E-01     0   452    12     0     0     0
   412  0.69890022E-01     0   453    12     0     0     0
   412  0.54377997E-02     0   456    11     0     0     0
   412  0.14219430E+00     0   457    11     0     0     0
   4
   413  0.10953649E-01     0   450     1     0     0     0
   413  0.14488450E-04     0   451     1     0     0     0
   413  0.46757094E-04     0   453     1     0     0     0
   413  0.98898512E+00     0   449     1     0     0     0
   5
   414  0.42412881E-01     0   450     2     0     0     0
   414  0.56098757E-04     0   451     2     0     0     0
   414  0.37298018E-04     0   452     2     0     0     0
   414  0.18102907E-03     0   453     2     0     0     0
   414  0.95731270E+00     0   449     2     0     0     0
   4
   415  0.10953649E-01     0   450     3     0     0     0
   415  0.14488450E-04     0   451     3     0     0     0
   415  0.46757094E-04     0   453     3     0     0     0
   415  0.98898512E+00     0   449     3     0     0     0
   5
   416  0.42412885E-01     0   450     4     0     0     0
   416  0.56098757E-04     0   451     4     0     0     0
   416  0.37298014E-04     0   452     4     0     0     0
   416  0.18102906E-03     0   453     4     0     0     0
   416  0.95731270E+00     0   449     4     0     0     0
   7
   417  0.23236792E-02     0   450     5     0     0     0
   417  0.51434793E-01     0   451     5     0     0     0
   417  0.56676968E-03     0   452     5     0     0     0
   417  0.29949294E-02     0   453     5     0     0     0
   417  0.68825948E+00     0   449     5     0     0     0
   417  0.10464449E+00     0   456     6     0     0     0
   417  0.14977586E+00     0   457     6     0     0     0
   7
   418  0.68420738E+00     0   449     6     0     0     0
   418  0.10763523E+00     0   454     5     0     0     0
   418  0.38574687E-02     0   455     5     0     0     0
   418  0.17141557E-02     0   450     6     0     0     0
   418  0.54602116E-01     0   451     6     0     0     0
   418  0.74339621E-01     0   452     6     0     0     0
   418  0.73644012E-01     0   453     6     0     0     0
   4
   419  0.10953649E-01     0   450     7     0     0     0
   419  0.14488450E-04     0   451     7     0     0     0
   419  0.46757094E-04     0   453     7     0     0     0
   419  0.98898512E+00     0   449     7     0     0     0
   5
   420  0.42412881E-01     0   450     8     0     0     0
   420  0.56098757E-04     0   451     8     0     0     0
   420  0.37298018E-04     0   452     8     0     0     0
   420  0.18102907E-03     0   453     8     0     0     0
   420  0.95731270E+00     0   449     8     0     0     0
   4
   421  0.10953649E-01     0   450     9     0     0     0
   421  0.14488450E-04     0   451     9     0     0     0
   421  0.46757094E-04     0   453     9     0     0     0
   421  0.98898512E+00     0   449     9     0     0     0
   5
   422  0.42412885E-01     0   450    10     0     0     0
   422  0.56098757E-04     0   451    10     0     0     0
   422  0.37298014E-04     0   452    10     0     0     0
   422  0.18102906E-03     0   453    10     0     0     0
   422  0.95731270E+00     0   449    10     0     0     0
   7
   423  0.23236792E-02     0   450    11     0     0     0
   423  0.51434793E-01     0   451    11     0     0     0
   423  0.56676968E-03     0   452    11     0     0     0
   423  0.29949294E-02     0   453    11     0     0     0
   423  0.68825948E+00     0   449    11     0     0     0
   423  0.10464449E+00     0   454    12     0     0     0
   423  0.14977586E+00     0   455    12     0     0     0
   7
   424  0.68420738E+00     0   449    12     0     0     0
   424  0.10763523E+00     0   456    11     0     0     0
   424  0.38574687E-02     0   457    11     0     0     0
   424  0.17141557E-02     0   450    12     0     0     0
   424  0.54602116E-01     0   451    12     0     0     0
   424  0.74339621E-01     0   452    12     0     0     0
   424  0.73644012E-01     0   453    12     0     0     0
   1
   425  0.10000000E+01     0   450   121     0     0     0
   1
   426  0.10000000E+01     0   450   122     0     0     0
   1
   427  0.10000000E+01     0   450   123     0     0     0
   1
   428  0.10000000E+01     0   450   124     0     0     0
   6
   429  0.98274517E+00     0   450   125     0     0     0
   429  0.15182459E-02     0   451   125     0     0     0
   429  0.35630732E-02     0   452   125     0     0     0
   429  0.67064255E-02     0   453   125     0     0     0
   429  0.44721665E-03     0   456   126     0     0     0
   429  0.50198748E-02     0   457   126     0     0     0
   6
   430  0.10109702E+00     0   450   126     0     0     0
   430  0.27537084E+00     0   451   126     0     0     0
   430  0.10455083E-02     0   452   126     0     0     0
   430  0.17588994E-01     0   453   126     0     0     0
   430  0.58649945E+00     0   454   125     0     0     0
   430  0.18398192E-01     0   455   125     0     0     0
   1
   431  0.10000000E+01     0   450   127     0     0     0
   1
   432  0.10000000E+01     0   450   128     0     0     0
   1
   433  0.10000000E+01     0   450   129     0     0     0
   1
   434  0.10000000E+01     0   450   130     0     0     0
   6
   435  0.98274517E+00     0   450   131     0     0     0
   435  0.15182459E-02     0   451   131     0     0     0
   435  0.35630732E-02     0   452   131     0     0     0
   435  0.67064255E-02     0   453   131     0     0     0
   435  0.44721665E-03     0   454   132     0     0     0
   435  0.50198748E-02     0   455   132     0     0     0
   6
   436  0.10109702E+00     0   450   132     0     0     0
   436  0.27537084E+00     0   451   132     0     0     0
   436  0.10455083E-02     0   452   132     0     0     0
   436  0.17588994E-01     0   453   132     0     0     0
   436  0.58649945E+00     0   456   131     0     0     0
   436  0.18398192E-01     0   457   131     0     0     0
   4
   437  0.99357045E+00     0   450   121     0     0     0
   437  0.13142161E-02     0   451   121     0     0     0
   437  0.87386952E-03     0   452   121     0     0     0
   437  0.42414349E-02     0   453   121     0     0     0
   0
   4
   439  0.99357045E+00     0   450   123     0     0     0
   439  0.13142161E-02     0   451   123     0     0     0
   439  0.87386952E-03     0   452   123     0     0     0
   439  0.42414349E-02     0   453   123     0     0     0
   0
   6
   441  0.88367984E-01     0   450   125     0     0     0
   441  0.30009845E+00     0   451   125     0     0     0
   441  0.12400900E-02     0   452   125     0     0     0
   441  0.95397001E-02     0   453   125     0     0     0
   441  0.56391102E+00     0   456   126     0     0     0
   441  0.36842760E-01     0   457   126     0     0     0
   0
   4
   443  0.99357045E+00     0   450   127     0     0     0
   443  0.13142161E-02     0   451   127     0     0     0
   443  0.87386952E-03     0   452   127     0     0     0
   443  0.42414349E-02     0   453   127     0     0     0
   0
   4
   445  0.99357045E+00     0   450   129     0     0     0
   445  0.13142161E-02     0   451   129     0     0     0
   445  0.87386952E-03     0   452   129     0     0     0
   445  0.42414349E-02     0   453   129     0     0     0
   0
   6
   447  0.88367984E-01     0   450   131     0     0     0
   447  0.30009845E+00     0   451   131     0     0     0
   447  0.12400900E-02     0   452   131     0     0     0
   447  0.95397001E-02     0   453   131     0     0     0
   447  0.56391102E+00     0   454   132     0     0     0
   447  0.36842760E-01     0   455   132     0     0     0
   0
   8
   449  0.13284385E+00     0   408     2     0     0     0
   449  0.13284385E+00     0   402     8     0     0     0
   449  0.11716335E+00     0   407     1     0     0     0
   449  0.11716335E+00     0   401     7     0     0     0
   449  0.11716309E+00     0   409     3     0     0     0
   449  0.11716309E+00     0   403     9     0     0     0
   449  0.13282973E+00     0   410     4     0     0     0
   449  0.13282973E+00     0   404    10     0     0     0
   0
  10
   451  0.54540508E-03     0   450   200     0     0     0
   451  0.99191219E-02     0   450   203     0     0     0
   451  0.11512148E+00     0   425   127     0     0     0
   451  0.11512148E+00     0   431   121     0     0     0
   451  0.11512142E+00     0   427   129     0     0     0
   451  0.11512142E+00     0   433   123     0     0     0
   451  0.13226242E+00     0   426   128     0     0     0
   451  0.13226242E+00     0   432   122     0     0     0
   451  0.13226242E+00     0   428   130     0     0     0
   451  0.13226242E+00     0   434   124     0     0     0
  22
   452  0.30437443E+00     0   454   199     0     0     0
   452  0.30437443E+00     0   456   198     0     0     0
   452  0.83281033E-01     0   450   200     0     0     0
   452  0.27467540E+00     0   451   200     0     0     0
   452  0.14520580E-01     0   450   203     0     0     0
   452  0.10454508E-01     0   451   203     0     0     0
   452  0.40313284E-03     0   402     8     0     0     0
   452  0.40313284E-03     0   408     2     0     0     0
   452  0.64566202E-03     0   401     7     0     0     0
   452  0.64566202E-03     0   407     1     0     0     0
   452  0.64566161E-03     0   403     9     0     0     0
   452  0.64566161E-03     0   409     3     0     0     0
   452  0.40312027E-03     0   404    10     0     0     0
   452  0.40312027E-03     0   410     4     0     0     0
   452  0.16001904E-03     0   425   127     0     0     0
   452  0.16001904E-03     0   431   121     0     0     0
   452  0.16001902E-03     0   427   129     0     0     0
   452  0.16001902E-03     0   433   123     0     0     0
   452  0.87108900E-03     0   426   128     0     0     0
   452  0.87108900E-03     0   432   122     0     0     0
   452  0.87108900E-03     0   428   130     0     0     0
   452  0.87108900E-03     0   434   124     0     0     0
  22
   453  0.27113524E+00     0   454   199     0     0     0
   453  0.27113524E+00     0   456   198     0     0     0
   453  0.13158110E-01     0   450   200     0     0     0
   453  0.11213069E-01     0   451   200     0     0     0
   453  0.61292395E-01     0   450   203     0     0     0
   453  0.20607024E+00     0   451   203     0     0     0
   453  0.10305131E-01     0   402     8     0     0     0
   453  0.10305131E-01     0   408     2     0     0     0
   453  0.12430811E-01     0   401     7     0     0     0
   453  0.12430811E-01     0   407     1     0     0     0
   453  0.12430805E-01     0   403     9     0     0     0
   453  0.12430805E-01     0   409     3     0     0     0
   453  0.10304849E-01     0   404    10     0     0     0
   453  0.10304849E-01     0   410     4     0     0     0
   453  0.60017039E-02     0   425   127     0     0     0
   453  0.60017039E-02     0   431   121     0     0     0
   453  0.60017034E-02     0   427   129     0     0     0
   453  0.60017034E-02     0   433   123     0     0     0
   453  0.12761438E-01     0   426   128     0     0     0
   453  0.12761438E-01     0   432   122     0     0     0
   453  0.12761438E-01     0   428   130     0     0     0
   453  0.12761438E-01     0   434   124     0     0     0
   5
   454  0.10374554E-01     0   450   198     0     0     0
   454  0.27988532E+00     0   426   127     0     0     0
   454  0.27988526E+00     0   428   129     0     0     0
   454  0.21492745E+00     0   431   122     0     0     0
   454  0.21492741E+00     0   433   124     0     0     0
  12
   455  0.66596568E-01     0   450   198     0     0     0
   455  0.27806410E+00     0   451   198     0     0     0
   455  0.14911041E-01     0   402     7     0     0     0
   455  0.31637724E-01     0   407     2     0     0     0
   455  0.14910797E-01     0   404     9     0     0     0
   455  0.33290233E-01     0   409     4     0     0     0
   455  0.11800811E-01     0   426   127     0     0     0
   455  0.11800813E-01     0   428   129     0     0     0
   455  0.25494061E-01     0   431   122     0     0     0
   455  0.25494061E-01     0   433   124     0     0     0
   455  0.26348299E+00     0   454   200     0     0     0
   455  0.22251680E+00     0   454   203     0     0     0
   5
   456  0.10374554E-01     0   450   199     0     0     0
   456  0.27988532E+00     0   432   121     0     0     0
   456  0.27988526E+00     0   434   123     0     0     0
   456  0.21492745E+00     0   425   128     0     0     0
   456  0.21492741E+00     0   427   130     0     0     0
  12
   457  0.66596568E-01     0   450   199     0     0     0
   457  0.27806410E+00     0   451   199     0     0     0
   457  0.14911041E-01     0   408     1     0     0     0
   457  0.31637724E-01     0   401     8     0     0     0
   457  0.14910797E-01     0   410     3     0     0     0
   457  0.33290233E-01     0   403    10     0     0     0
   457  0.11800811E-01     0   432   121     0     0     0
   457  0.11800813E-01     0   434   123     0     0     0
   457  0.25494061E-01     0   425   128     0     0     0
   457  0.25494061E-01     0   427   130     0     0     0
   457  0.26348299E+00     0   456   200     0     0     0
   457  0.22251680E+00     0   456   203     0     0     0
  28
   203  0.21320966E-03     0   123   129     0     0     0
   203  0.60962763E-01     0   125   131     0     0     0
   203  0.25642775E-02     0     3     9     0     0     0
   203  0.85104305E+00     0     5    11     0     0     0
   203  0.37274454E-01     0     4    10     0     0     0
   203  0.14757154E-02     0    59    59     0     0     0
   203  0.33331256E-01     0    13    13     0     0     0
   203  0.70836290E-03     0   198   121   128     0     0
   203  0.70836290E-03     0   198   123   130     0     0
   203  0.70836290E-03     0   198   125   132     0     0
   203  0.21250891E-02     0   198     8     1     0     0
   203  0.21250891E-02     0   198    10     3     0     0
   203  0.70836290E-03     0   199   127   122     0     0
   203  0.70836290E-03     0   199   129   124     0     0
   203  0.70836290E-03     0   199   131   126     0     0
   203  0.21250891E-02     0   199     2     7     0     0
   203  0.21250891E-02     0   199     4     9     0     0
   203  0.26315980E-04     0   200   122   128     0     0
   203  0.26315980E-04     0   200   124   130     0     0
   203  0.26315980E-04     0   200   126   132     0     0
   203  0.13244568E-04     0   200   121   127     0     0
   203  0.13244568E-04     0   200   123   129     0     0
   203  0.13244568E-04     0   200   125   131     0     0
   203  0.45374767E-04     0   200     2     8     0     0
   203  0.45374767E-04     0   200     4    10     0     0
   203  0.58453879E-04     0   200     1     7     0     0
   203  0.58453879E-04     0   200     3     9     0     0
   203  0.58453879E-04     0   200     5    11     0     0
  27
   204  0.15198083E-04     0   123   129     0     0     0
   204  0.43528830E-02     0   125   131     0     0     0
   204  0.17816473E-03     0     3     9     0     0     0
   204  0.43930035E-01     0     5    11     0     0     0
   204  0.36811212E+00     0     6    12     0     0     0
   204  0.22224388E-03     0    13    13     0     0     0
   204  0.89003443E-03     0   198   199     0     0     0
   204  0.45189512E-03     0   200   200     0     0     0
   204  0.15897892E-02     0   450   450     0     0     0
   204  0.95493533E-02     0   450   451     0     0     0
   204  0.60255378E-01     0   450   452     0     0     0
   204  0.11076628E-01     0   450   453     0     0     0
   204  0.11799620E-01     0   451   451     0     0     0
   204  0.14064555E+00     0   451   452     0     0     0
   204  0.67599155E-02     0   451   453     0     0     0
   204  0.25956199E-01     0   454   456     0     0     0
   204  0.15293416E+00     0   454   457     0     0     0
   204  0.15293416E+00     0   456   455     0     0     0
   204  0.37925770E-02     0   203   203     0     0     0
   204  0.17832010E-03     0   425   431     0     0     0
   204  0.17830542E-03     0   427   433     0     0     0
   204  0.59911434E-03     0   402   408     0     0     0
   204  0.59870601E-03     0   404   410     0     0     0
   204  0.87087625E-03     0   401   407     0     0     0
   204  0.87103888E-03     0   403   409     0     0     0
   204  0.62887900E-03     0   426   432     0     0     0
   204  0.62887900E-03     0   428   434     0     0     0
  17
   205  0.15256127E-04     0   123   129     0     0     0
   205  0.43695611E-02     0   125   131     0     0     0
   205  0.17885657E-03     0     3     9     0     0     0
   205  0.44142641E-01     0     5    11     0     0     0
   205  0.39510787E+00     0     6    12     0     0     0
   205  0.23074889E-03     0    13    13     0     0     0
   205  0.24915207E-02     0   450   450     0     0     0
   205  0.19188119E-01     0   450   451     0     0     0
   205  0.14035781E-01     0   450   452     0     0     0
   205  0.48766896E-01     0   450   453     0     0     0
   205  0.36060005E-01     0   451   451     0     0     0
   205  0.95649138E-02     0   451   452     0     0     0
   205  0.10221905E+00     0   451   453     0     0     0
   205  0.78371145E-01     0   454   456     0     0     0
   205  0.12219347E+00     0   454   457     0     0     0
   205  0.12219347E+00     0   456   455     0     0     0
   205  0.87068771E-03     0   203   200     0     0     0
  15
   206  0.16693373E-04     0   124   129     0     0     0
   206  0.47812085E-02     0   126   131     0     0     0
   206  0.18772011E-03     0     4     9     0     0     0
   206  0.38803715E+00     0     6    11     0     0     0
   206  0.29891830E-01     0   454   450     0     0     0
   206  0.51032948E-04     0   454   451     0     0     0
   206  0.17484555E+00     0   454   452     0     0     0
   206  0.16146962E+00     0   454   453     0     0     0
   206  0.57645377E-01     0   455   450     0     0     0
   206  0.17737782E+00     0   455   451     0     0     0
   206  0.95850974E-03     0   203   198     0     0     0
   206  0.15731790E-02     0   402   407     0     0     0
   206  0.15725368E-02     0   404   409     0     0     0
   206  0.79589774E-03     0   431   426     0     0     0
   206  0.79587451E-03     0   433   428     0     0     0
  15
   207  0.16693373E-04     0   130   123     0     0     0
   207  0.47812085E-02     0   132   125     0     0     0
   207  0.18772011E-03     0    10     3     0     0     0
   207  0.38803715E+00     0    12     5     0     0     0
   207  0.29891830E-01     0   456   450     0     0     0
   207  0.51032948E-04     0   456   451     0     0     0
   207  0.17484555E+00     0   456   452     0     0     0
   207  0.16146962E+00     0   456   453     0     0     0
   207  0.57645377E-01     0   457   450     0     0     0
   207  0.17737782E+00     0   457   451     0     0     0
   207  0.95850974E-03     0   203   199     0     0     0
   207  0.15731790E-02     0   408   401     0     0     0
   207  0.15725368E-02     0   410   403     0     0     0
   207  0.79589774E-03     0   425   432     0     0     0
   207  0.79587451E-03     0   427   434     0     0     0
   0
   5
     6  0.33333334E+00   100     2     7     5     0     0
     6  0.33333334E+00   100     4     9     5     0     0
     6  0.11111111E+00   100   122   127     5     0     0
     6  0.11111111E+00   100   124   129     5     0     0
     6  0.11111111E+00   100   126   131     5     0     0
   5
    12  0.33333334E+00   100     8     1    11     0     0
    12  0.33333334E+00   100    10     3    11     0     0
    12  0.11111111E+00   100   128   121    11     0     0
    12  0.11111111E+00   100   130   123    11     0     0
    12  0.11111111E+00   100   132   125    11     0     0
      4.00000000     -0.24957091
     -0.99620754      0.01873938     -0.07889357      0.03155365
     -0.03697126     -0.97401696      0.18593092     -0.12391019
      0.03241186     -0.04537013     -0.70344007     -0.70856428
      0.07178839     -0.22109117     -0.68145245      0.69396526
     -0.98399889      0.17817450     -0.17817450     -0.98399889
     -0.96390969      0.26622936     -0.26622936     -0.96390969
      1.57074499     -1.57079601     -1.57079482
    150.00000000   2400.00000000   2400.00000000
    600.00000000
    T
