#  ISAJET SUSY parameters in Les Houches accord format
#  Created by ISALHA3. Last revision by C. Balazs on 2005 Jan. 10
Block SPINFO   # Program information
     1   ISASUGRA from ISAJET          # Spectrum Calculator
     2   7.79   16-DEC-2008 15:42:00   # Version number
Block MODSEL   # Model selection
     1     1   # Minimal supergravity (mSUGRA,CMSSM) model         
Block SMINPUTS   # Standard Model inputs
     1     1.27834610E+02   # alpha_em^(-1)
     2     1.16570000E-05   # G_Fermi
     3     1.17200002E-01   # alpha_s(M_Z)
     4     9.11699982E+01   # m_{Z}(pole)
     5     4.19999981E+00   # m_{b}(m_{b})
     6     1.72500000E+02   # m_{top}(pole)
     7     1.77699995E+00   # m_{tau}(pole)
Block MINPAR   # SUSY breaking input parameters
     1     4.00000000E+02   # m_0
     2     1.45000000E+02   # m_{1/2}
     3     3.00000000E+00   # tan(beta)
     4     1.00000000E+00   # sign(mu)
     5     0.00000000E+00   # A_0
#  
#  M_{GUT} =   0.27923000E+17
Block MASS   # Scalar and gaugino mass spectrum
#  PDG code   mass                 particle
        24     8.04229965E+01   #  W^+
        25     9.26426392E+01   #  h^0            
        35     5.39535767E+02   #  H^0            
        36     5.33148132E+02   #  A^0            
        37     5.42418457E+02   #  H^+            
   1000001     5.20170105E+02   #  dnl            
   1000002     5.15132568E+02   #  upl            
   1000003     5.20170105E+02   #  stl            
   1000004     5.15134338E+02   #  chl            
   1000005     4.44430786E+02   #  b1             
   1000006     3.21513123E+02   #  t1             
   1000011     4.12576538E+02   #  el-            
   1000012     4.06092651E+02   #  nuel           
   1000013     4.12576538E+02   #  mul-           
   1000014     4.06092651E+02   #  numl           
   1000015     4.03866791E+02   #  tau1           
   1000016     4.05928925E+02   #  nutl           
   1000021     3.92770660E+02   #  glss           
   1000022     5.11330223E+01   #  z1ss           
   1000023     9.55238800E+01   #  z2ss           
   1000024     9.32000885E+01   #  w1ss           
   1000025    -3.01922607E+02   #  z3ss           
   1000035     3.29537048E+02   #  z4ss           
   1000037     3.25225922E+02   #  w2ss           
   2000001     5.12475647E+02   #  dnr            
   2000002     5.11492218E+02   #  upr            
   2000003     5.12475708E+02   #  str            
   2000004     5.11494019E+02   #  chr            
   2000005     5.10384094E+02   #  b2             
   2000006     4.93314545E+02   #  t2             
   2000011     4.04839844E+02   #  er-            
   2000013     4.04839844E+02   #  mur-           
   2000015     4.12915497E+02   #  tau2           
#  Higgs mixing
Block ALPHA   # Effective Higgs mixing parameter
         -3.38126898E-01   # alpha
Block STOPMIX   # stop mixing matrix
  1  1     4.49969262E-01   # O_{11}
  1  2    -8.93044055E-01   # O_{12}
  2  1     8.93044055E-01   # O_{21}
  2  2     4.49969262E-01   # O_{22}
Block SBOTMIX   # sbottom mixing matrix
  1  1     9.98702705E-01   # O_{11}
  1  2    -5.09200618E-02   # O_{12}
  2  1     5.09200618E-02   # O_{21}
  2  2     9.98702705E-01   # O_{22}
Block STAUMIX   # stau mixing matrix
  1  1     2.46471688E-01   # O_{11}
  1  2    -9.69150007E-01   # O_{12}
  2  1     9.69150007E-01   # O_{21}
  2  2     2.46471688E-01   # O_{22}
Block NMIX   # neutralino mixing matrix
  1  1     9.57597792E-01   #
  1  2    -1.89219192E-01   #
  1  3     1.95700541E-01   #
  1  4    -9.43607092E-02   #
  2  1    -2.47402012E-01   #
  2  2    -9.26020622E-01   #
  2  3     2.44675979E-01   #
  2  4    -1.46326631E-01   #
  3  1     5.48130274E-02   #
  3  2    -8.55596289E-02   #
  3  3    -6.94416165E-01   #
  3  4    -7.12363482E-01   #
  4  1     1.37092397E-01   #
  4  2    -3.15216094E-01   #
  4  3    -6.47782147E-01   #
  4  4     6.79869771E-01   #
Block UMIX   # chargino U mixing matrix
  1  1    -9.17245865E-01   # U_{11}
  1  2     3.98321450E-01   # U_{12}
  2  1    -3.98321450E-01   # U_{21}
  2  2    -9.17245865E-01   # U_{22}
Block VMIX   # chargino V mixing matrix
  1  1    -9.70270991E-01   # V_{11}
  1  2     2.42020994E-01   # V_{12}
  2  1    -2.42020994E-01   # V_{21}
  2  2    -9.70270991E-01   # V_{22}
Block GAUGE Q=  3.66576416E+02   #
     1     3.57529640E-01   # g`
     2     6.52368546E-01   # g_2
     3     1.21957409E+00   # g_3
Block YU Q=  3.66576416E+02   #
  3  3     9.35705602E-01   # y_t
Block YD Q=  3.66576416E+02   #
  3  3     4.51895222E-02   # y_b
Block YE Q=  3.66576416E+02   #
  3  3     3.17137949E-02   # y_tau
Block HMIX Q=  3.66576416E+02   # Higgs mixing parameters
     1     2.98322662E+02   # mu(Q)
     2     3.00000000E+00   # tan(beta)(M_{GUT})
     3     2.50120956E+02   # Higgs vev at Q
     4     2.84246938E+05   # m_A^2(Q)
Block MSOFT Q=  3.66576416E+02   # DRbar SUSY breaking parameters
     1     5.82919312E+01   # M_1(Q)          
     2     1.10863861E+02   # M_2(Q)          
     3     3.52600861E+02   # M_3(Q)          
    31     4.09561554E+02   # MeL(Q)          
    32     4.09561554E+02   # MmuL(Q)         
    33     4.09401337E+02   # MtauL(Q)        
    34     4.02677216E+02   # MeR(Q)          
    35     4.02677216E+02   # MmuR(Q)         
    36     4.02316132E+02   # MtauR(Q)        
    41     4.99588989E+02   # MqL1(Q)         
    42     4.99588989E+02   # MqL2(Q)         
    43     4.24257904E+02   # MqL3(Q)         
    44     4.94633514E+02   # MuR(Q)          
    45     4.94633514E+02   # McR(Q)          
    46     3.16737244E+02   # MtR(Q)          
    47     4.94070312E+02   # MdR(Q)          
    48     4.94070312E+02   # MsR(Q)          
    49     4.96428436E+02   # MbR(Q)          
Block AU Q=  3.66576416E+02   #
  1  1    -2.63483032E+02   # A_u
  2  2    -2.63483032E+02   # A_c
  3  3    -2.63483032E+02   # A_t
Block AD Q=  3.66576416E+02   #
  1  1    -4.24790894E+02   # A_d
  2  2    -4.24790894E+02   # A_s
  3  3    -4.24790894E+02   # A_b
Block AE Q=  3.66576416E+02   #
  1  1    -9.26986313E+01   # A_e
  2  2    -9.26986313E+01   # A_mu
  3  3    -9.26986313E+01   # A_tau
#  ISAJET decay tables in SUSY Les Houches accord format
#  Created by ISALHD. Last revision: C. Balazs, 2005 May 25
Block DCINFO                           # Program information
     1   ISASUGRA from ISAJET          # Spectrum Calculator
     2   7.79   16-DEC-2008 15:42:00   # Version number
#         PDG         Width
DECAY         6  1.14680767E+00   # TP    decays
#          BR          NDA       ID1       ID2       ID3       ID4
      3.33333343E-01    3            2        -1         5             # TP     -->  UP     DB     BT          
      3.33333343E-01    3            4        -3         5             # TP     -->  CH     SB     BT          
      1.11111112E-01    3          -11        12         5             # TP     -->  E+     NUE    BT          
      1.11111112E-01    3          -13        14         5             # TP     -->  MU+    NUM    BT          
      1.11111112E-01    3          -15        16         5             # TP     -->  TAU+   NUT    BT          
#         PDG         Width
DECAY   1000021  9.85004008E-03   # GLSS  decays
#          BR          NDA       ID1       ID2       ID3       ID4
      1.10536680E-01    3      1000024         1        -2             # GLSS   -->  W1SS+  DN     UB          
      1.10536680E-01    3     -1000024         2        -1             # GLSS   -->  W1SS-  UP     DB          
      1.10535517E-01    3      1000024         3        -4             # GLSS   -->  W1SS+  ST     CB          
      1.10535517E-01    3     -1000024         4        -3             # GLSS   -->  W1SS-  CH     SB          
      2.97220461E-02    3      1000024         5        -6             # GLSS   -->  W1SS+  BT     TB          
      2.97220461E-02    3     -1000024         6        -5             # GLSS   -->  W1SS-  TP     BB          
      6.41401639E-05    3      1000037         1        -2             # GLSS   -->  W2SS+  DN     UB          
      6.41401639E-05    3     -1000037         2        -1             # GLSS   -->  W2SS-  UP     DB          
      6.41395527E-05    3      1000037         3        -4             # GLSS   -->  W2SS+  ST     CB          
      6.41395527E-05    3     -1000037         4        -3             # GLSS   -->  W2SS-  CH     SB          
      1.29032868E-03    2      1000022        21                       # GLSS   -->  Z1SS   GL                 
      3.81191932E-02    3      1000022         2        -2             # GLSS   -->  Z1SS   UP     UB          
      1.87865086E-02    3      1000022         1        -1             # GLSS   -->  Z1SS   DN     DB          
      1.87865030E-02    3      1000022         3        -3             # GLSS   -->  Z1SS   ST     SB          
      3.81184369E-02    3      1000022         4        -4             # GLSS   -->  Z1SS   CH     CB          
      3.42140831E-02    3      1000022         5        -5             # GLSS   -->  Z1SS   BT     BB          
      3.89882200E-03    2      1000023        21                       # GLSS   -->  Z2SS   GL                 
      6.14217743E-02    3      1000023         2        -2             # GLSS   -->  Z2SS   UP     UB          
      4.66299243E-02    3      1000023         1        -1             # GLSS   -->  Z2SS   DN     DB          
      4.66299243E-02    3      1000023         3        -3             # GLSS   -->  Z2SS   ST     SB          
      6.14205673E-02    3      1000023         4        -4             # GLSS   -->  Z2SS   CH     CB          
      1.24162786E-01    3      1000023         5        -5             # GLSS   -->  Z2SS   BT     BB          
      3.02644214E-03    2      1000025        21                       # GLSS   -->  Z3SS   GL                 
      2.99899921E-06    3      1000025         2        -2             # GLSS   -->  Z3SS   UP     UB          
      3.60574995E-06    3      1000025         1        -1             # GLSS   -->  Z3SS   DN     DB          
      3.60574950E-06    3      1000025         3        -3             # GLSS   -->  Z3SS   ST     SB          
      2.99891872E-06    3      1000025         4        -4             # GLSS   -->  Z3SS   CH     CB          
      3.75106574E-05    3      1000025         5        -5             # GLSS   -->  Z3SS   BT     BB          
      1.37610268E-03    2      1000035        21                       # GLSS   -->  Z4SS   GL                 
      2.28755289E-05    3      1000035         2        -2             # GLSS   -->  Z4SS   UP     UB          
      2.65084054E-05    3      1000035         1        -1             # GLSS   -->  Z4SS   DN     DB          
      2.65084054E-05    3      1000035         3        -3             # GLSS   -->  Z4SS   ST     SB          
      2.28749032E-05    3      1000035         4        -4             # GLSS   -->  Z4SS   CH     CB          
      1.24109138E-04    3      1000035         5        -5             # GLSS   -->  Z4SS   BT     BB          
#         PDG         Width
DECAY   1000002  1.18376112E+01   # UPL   decays
#          BR          NDA       ID1       ID2       ID3       ID4
      3.41035920E-05    2      1000022         2                       # UPL    -->  Z1SS   UP                 
      1.61146969E-01    2      1000023         2                       # UPL    -->  Z2SS   UP                 
      4.50198364E-04    2      1000025         2                       # UPL    -->  Z3SS   UP                 
      5.38015226E-03    2      1000035         2                       # UPL    -->  Z4SS   UP                 
      5.02544820E-01    2      1000021         2                       # UPL    -->  GLSS   UP                 
      3.22682381E-01    2      1000024         1                       # UPL    -->  W1SS+  DN                 
      7.76133826E-03    2      1000037         1                       # UPL    -->  W2SS+  DN                 
#         PDG         Width
DECAY   1000001  1.20064535E+01   # DNL   decays
#          BR          NDA       ID1       ID2       ID3       ID4
      2.37837229E-02    2      1000022         1                       # DNL    -->  Z1SS   DN                 
      1.32067651E-01    2      1000023         1                       # DNL    -->  Z2SS   DN                 
      7.32880377E-04    2      1000025         1                       # DNL    -->  Z3SS   DN                 
      7.57011818E-03    2      1000035         1                       # DNL    -->  Z4SS   DN                 
      5.26900411E-01    2      1000021         1                       # DNL    -->  GLSS   DN                 
      2.87476808E-01    2     -1000024         2                       # DNL    -->  W1SS-  UP                 
      2.14683935E-02    2     -1000037         2                       # DNL    -->  W2SS-  UP                 
#         PDG         Width
DECAY   1000003  1.20063944E+01   # STL   decays
#          BR          NDA       ID1       ID2       ID3       ID4
      2.37838402E-02    2      1000022         3                       # STL    -->  Z1SS   ST                 
      1.32068306E-01    2      1000023         3                       # STL    -->  Z2SS   ST                 
      7.32883986E-04    2      1000025         3                       # STL    -->  Z3SS   ST                 
      7.57015543E-03    2      1000035         3                       # STL    -->  Z4SS   ST                 
      5.26902974E-01    2      1000021         3                       # STL    -->  GLSS   ST                 
      2.87474096E-01    2     -1000024         4                       # STL    -->  W1SS-  CH                 
      2.14677174E-02    2     -1000037         4                       # STL    -->  W2SS-  CH                 
#         PDG         Width
DECAY   1000004  1.18372707E+01   # CHL   decays
#          BR          NDA       ID1       ID2       ID3       ID4
      3.41042214E-05    2      1000022         4                       # CHL    -->  Z1SS   CH                 
      1.61149889E-01    2      1000023         4                       # CHL    -->  Z2SS   CH                 
      4.50201798E-04    2      1000025         4                       # CHL    -->  Z3SS   CH                 
      5.38016576E-03    2      1000035         4                       # CHL    -->  Z4SS   CH                 
      5.02531052E-01    2      1000021         4                       # CHL    -->  GLSS   CH                 
      3.22692961E-01    2      1000024         3                       # CHL    -->  W1SS+  ST                 
      7.76165957E-03    2      1000037         3                       # CHL    -->  W2SS+  ST                 
#         PDG         Width
DECAY   1000005  5.56062841E+00   # BT1   decays
#          BR          NDA       ID1       ID2       ID3       ID4
      4.41065170E-02    2      1000022         5                       # BT1    -->  Z1SS   BT                 
      2.37441733E-01    2      1000023         5                       # BT1    -->  Z2SS   BT                 
      1.24155835E-03    2      1000025         5                       # BT1    -->  Z3SS   BT                 
      8.08269624E-03    2      1000035         5                       # BT1    -->  Z4SS   BT                 
      2.57673323E-01    2      1000021         5                       # BT1    -->  GLSS   BT                 
      3.55875641E-01    2     -1000024         6                       # BT1    -->  W1SS-  TP                 
      9.55785587E-02    2          -24   1000006                       # BT1    -->  W-     TP1                
#         PDG         Width
DECAY   1000006  1.78396416E+00   # TP1   decays
#          BR          NDA       ID1       ID2       ID3       ID4
      1.64992347E-01    2      1000022         6                       # TP1    -->  Z1SS   TP                 
      1.30001828E-01    2      1000023         6                       # TP1    -->  Z2SS   TP                 
      7.05005825E-01    2      1000024         5                       # TP1    -->  W1SS+  BT                 
#         PDG         Width
DECAY   2000002  6.79333067E+00   # UPR   decays
#          BR          NDA       ID1       ID2       ID3       ID4
      1.52972996E-01    2      1000022         2                       # UPR    -->  Z1SS   UP                 
      9.70384572E-03    2      1000023         2                       # UPR    -->  Z2SS   UP                 
      2.17102497E-04    2      1000025         2                       # UPR    -->  Z3SS   UP                 
      1.09444547E-03    2      1000035         2                       # UPR    -->  Z4SS   UP                 
      8.36011589E-01    2      1000021         2                       # UPR    -->  GLSS   UP                 
#         PDG         Width
DECAY   2000001  6.03096104E+00   # DNR   decays
#          BR          NDA       ID1       ID2       ID3       ID4
      4.31637205E-02    2      1000022         1                       # DNR    -->  Z1SS   DN                 
      2.73863832E-03    2      1000023         1                       # DNR    -->  Z2SS   DN                 
      6.15055615E-05    2      1000025         1                       # DNR    -->  Z3SS   DN                 
      3.10473697E-04    2      1000035         1                       # DNR    -->  Z4SS   DN                 
      9.53725696E-01    2      1000021         1                       # DNR    -->  GLSS   DN                 
#         PDG         Width
DECAY   2000003  6.03096581E+00   # STR   decays
#          BR          NDA       ID1       ID2       ID3       ID4
      4.31636870E-02    2      1000022         3                       # STR    -->  Z1SS   ST                 
      2.73863645E-03    2      1000023         3                       # STR    -->  Z2SS   ST                 
      6.15055324E-05    2      1000025         3                       # STR    -->  Z3SS   ST                 
      3.10473581E-04    2      1000035         3                       # STR    -->  Z4SS   ST                 
      9.53725636E-01    2      1000021         3                       # STR    -->  GLSS   ST                 
#         PDG         Width
DECAY   2000004  6.79298162E+00   # CHR   decays
#          BR          NDA       ID1       ID2       ID3       ID4
      1.52979240E-01    2      1000022         4                       # CHR    -->  Z1SS   CH                 
      9.70423874E-03    2      1000023         4                       # CHR    -->  Z2SS   CH                 
      2.17108929E-04    2      1000025         4                       # CHR    -->  Z3SS   CH                 
      1.09447201E-03    2      1000035         4                       # CHR    -->  Z4SS   CH                 
      8.36004913E-01    2      1000021         4                       # CHR    -->  GLSS   CH                 
#         PDG         Width
DECAY   2000005  5.87644958E+00   # BT2   decays
#          BR          NDA       ID1       ID2       ID3       ID4
      4.37383987E-02    2      1000022         5                       # BT2    -->  Z1SS   BT                 
      3.00475419E-03    2      1000023         5                       # BT2    -->  Z2SS   BT                 
      9.21762490E-04    2      1000025         5                       # BT2    -->  Z3SS   BT                 
      1.21020968E-03    2      1000035         5                       # BT2    -->  Z4SS   BT                 
      9.47896302E-01    2      1000021         5                       # BT2    -->  GLSS   BT                 
      2.95275560E-04    2     -1000024         6                       # BT2    -->  W1SS-  TP                 
      1.69435295E-03    2     -1000037         6                       # BT2    -->  W2SS-  TP                 
      1.23894762E-03    2          -24   1000006                       # BT2    -->  W-     TP1                
#         PDG         Width
DECAY   2000006  5.15907049E+00   # TP2   decays
#          BR          NDA       ID1       ID2       ID3       ID4
      3.79105479E-01    2      1000024         5                       # TP2    -->  W1SS+  BT                 
      1.82007447E-01    2      1000037         5                       # TP2    -->  W2SS+  BT                 
      1.40894771E-01    2           23   1000006                       # TP2    -->  Z0     TP1                
      9.17895436E-02    2           25   1000006                       # TP2    -->  HL0    TP1                
      7.50635890E-03    2      1000022         6                       # TP2    -->  Z1SS   TP                 
      1.61870629E-01    2      1000023         6                       # TP2    -->  Z2SS   TP                 
      3.68257575E-02    2      1000025         6                       # TP2    -->  Z3SS   TP                 
#         PDG         Width
DECAY   1000011  4.67050982E+00   # EL-   decays
#          BR          NDA       ID1       ID2       ID3       ID4
      4.09653075E-02    2      1000022        11                       # EL-    -->  Z1SS   E-                 
      3.75615507E-01    2      1000023        11                       # EL-    -->  Z2SS   E-                 
      2.46497104E-04    2      1000025        11                       # EL-    -->  Z3SS   E-                 
      2.80405302E-03    2      1000035        11                       # EL-    -->  Z4SS   E-                 
      5.63454688E-01    2     -1000024        12                       # EL-    -->  W1SS-  NUE                
      1.69139002E-02    2     -1000037        12                       # EL-    -->  W2SS-  NUE                
#         PDG         Width
DECAY   1000013  4.67050934E+00   # MUL-  decays
#          BR          NDA       ID1       ID2       ID3       ID4
      4.09653112E-02    2      1000022        13                       # MUL-   -->  Z1SS   MU-                
      3.75615478E-01    2      1000023        13                       # MUL-   -->  Z2SS   MU-                
      2.46496988E-04    2      1000025        13                       # MUL-   -->  Z3SS   MU-                
      2.80405045E-03    2      1000035        13                       # MUL-   -->  Z4SS   MU-                
      5.63454747E-01    2     -1000024        14                       # MUL-   -->  W1SS-  NUM                
      1.69139020E-02    2     -1000037        14                       # MUL-   -->  W2SS-  NUM                
#         PDG         Width
DECAY   1000015  2.14126205E+00   # TAU1- decays
#          BR          NDA       ID1       ID2       ID3       ID4
      8.09119821E-01    2      1000022        15                       # TAU1-  -->  Z1SS   TAU-               
      1.02631740E-01    2      1000023        15                       # TAU1-  -->  Z2SS   TAU-               
      4.98169975E-04    2      1000025        15                       # TAU1-  -->  Z3SS   TAU-               
      1.62549585E-03    2      1000035        15                       # TAU1-  -->  Z4SS   TAU-               
      8.55482593E-02    2     -1000024        16                       # TAU1-  -->  W1SS-  NUT                
      5.76476741E-04    2     -1000037        16                       # TAU1-  -->  W2SS-  NUT                
#         PDG         Width
DECAY   1000012  4.74889946E+00   # NUEL  decays
#          BR          NDA       ID1       ID2       ID3       ID4
      1.78494468E-01    2      1000022        12                       # NUEL   -->  Z1SS   NUE                
      2.00495556E-01    2      1000023        12                       # NUEL   -->  Z2SS   NUE                
      9.63555009E-04    2      1000025        12                       # NUEL   -->  Z3SS   NUE                
      6.40328461E-03    2      1000035        12                       # NUEL   -->  Z4SS   NUE                
      6.08220220E-01    2      1000024        11                       # NUEL   -->  W1SS+  E-                 
      5.42291487E-03    2      1000037        11                       # NUEL   -->  W2SS+  E-                 
#         PDG         Width
DECAY   1000014  4.74889851E+00   # NUML  decays
#          BR          NDA       ID1       ID2       ID3       ID4
      1.78494483E-01    2      1000022        14                       # NUML   -->  Z1SS   NUM                
      2.00495571E-01    2      1000023        14                       # NUML   -->  Z2SS   NUM                
      9.63555067E-04    2      1000025        14                       # NUML   -->  Z3SS   NUM                
      6.40328508E-03    2      1000035        14                       # NUML   -->  Z4SS   NUM                
      6.08220220E-01    2      1000024        13                       # NUML   -->  W1SS+  MU-                
      5.42290974E-03    2      1000037        13                       # NUML   -->  W2SS+  MU-                
#         PDG         Width
DECAY   1000016  4.74833679E+00   # NUTL  decays
#          BR          NDA       ID1       ID2       ID3       ID4
      1.78438991E-01    2      1000022        16                       # NUTL   -->  Z1SS   NUT                
      2.00419500E-01    2      1000023        16                       # NUTL   -->  Z2SS   NUT                
      9.61360231E-04    2      1000025        16                       # NUTL   -->  Z3SS   NUT                
      6.38155732E-03    2      1000035        16                       # NUTL   -->  Z4SS   NUT                
      6.08164787E-01    2      1000024        15                       # NUTL   -->  W1SS+  TAU-               
      5.63373184E-03    2      1000037        15                       # NUTL   -->  W2SS+  TAU-               
      1.37019329E-13    3      1000015        16       -15             # NUTL   -->  TAU1-  NUT    TAU+        
      1.37019329E-13    3      1000015        12       -11             # NUTL   -->  TAU1-  NUE    E+          
      1.37019329E-13    3      1000015        14       -13             # NUTL   -->  TAU1-  NUM    MU+         
      4.11058015E-13    3      1000015         2        -1             # NUTL   -->  TAU1-  UP     DB          
      4.11058015E-13    3      1000015         4        -3             # NUTL   -->  TAU1-  CH     SB          
#         PDG         Width
DECAY   2000011  1.94645333E+00   # ER-   decays
#          BR          NDA       ID1       ID2       ID3       ID4
      9.39368963E-01    2      1000022        11                       # ER-    -->  Z1SS   E-                 
      5.77414669E-02    2      1000023        11                       # ER-    -->  Z2SS   E-                 
      6.26030960E-04    2      1000025        11                       # ER-    -->  Z3SS   E-                 
      2.26355973E-03    2      1000035        11                       # ER-    -->  Z4SS   E-                 
#         PDG         Width
DECAY   2000013  1.94645298E+00   # MUR-  decays
#          BR          NDA       ID1       ID2       ID3       ID4
      9.39368904E-01    2      1000022        13                       # MUR-   -->  Z1SS   MU-                
      5.77414632E-02    2      1000023        13                       # MUR-   -->  Z2SS   MU-                
      6.26030611E-04    2      1000025        13                       # MUR-   -->  Z3SS   MU-                
      2.26355717E-03    2      1000035        13                       # MUR-   -->  Z4SS   MU-                
#         PDG         Width
DECAY   2000015  4.47619534E+00   # TAU2- decays
#          BR          NDA       ID1       ID2       ID3       ID4
      6.37634397E-02    2      1000022        15                       # TAU2-  -->  Z1SS   TAU-               
      3.67760599E-01    2      1000023        15                       # TAU2-  -->  Z2SS   TAU-               
      6.76023017E-04    2      1000025        15                       # TAU2-  -->  Z3SS   TAU-               
      3.41204042E-03    2      1000035        15                       # TAU2-  -->  Z4SS   TAU-               
      5.46728432E-01    2     -1000024        16                       # TAU2-  -->  W1SS-  NUT                
      1.76594704E-02    2     -1000037        16                       # TAU2-  -->  W2SS-  NUT                
#         PDG         Width
DECAY   1000023  3.50865662E-07   # Z2SS  decays
#          BR          NDA       ID1       ID2       ID3       ID4
      7.49082246E-04    2      1000022        22                       # Z2SS   -->  Z1SS   GM                 
      2.72314617E-04    3     -1000024         2        -1             # Z2SS   -->  W1SS-  UP     DB          
      9.07715439E-05    3     -1000024        12       -11             # Z2SS   -->  W1SS-  NUE    E+          
      9.07715439E-05    3     -1000024        14       -13             # Z2SS   -->  W1SS-  NUM    MU+         
      2.72314617E-04    3      1000024         1        -2             # Z2SS   -->  W1SS+  DN     UB          
      9.07715439E-05    3      1000024        11       -12             # Z2SS   -->  W1SS+  E-     ANUE        
      9.07715439E-05    3      1000024        13       -14             # Z2SS   -->  W1SS+  MU-    ANUM        
      1.27151370E-01    3      1000022         2        -2             # Z2SS   -->  Z1SS   UP     UB          
      2.28392676E-01    3      1000022         1        -1             # Z2SS   -->  Z1SS   DN     DB          
      2.28392676E-01    3      1000022         3        -3             # Z2SS   -->  Z1SS   ST     SB          
      1.27151296E-01    3      1000022         4        -4             # Z2SS   -->  Z1SS   CH     CB          
      2.38141954E-01    3      1000022         5        -5             # Z2SS   -->  Z1SS   BT     BB          
      4.09292988E-03    3      1000022        11       -11             # Z2SS   -->  Z1SS   E-     E+          
      4.09292988E-03    3      1000022        13       -13             # Z2SS   -->  Z1SS   MU-    MU+         
      5.34103718E-03    3      1000022        15       -15             # Z2SS   -->  Z1SS   TAU-   TAU+        
      1.18713053E-02    3      1000022        12       -12             # Z2SS   -->  Z1SS   NUE    ANUE        
      1.18713053E-02    3      1000022        14       -14             # Z2SS   -->  Z1SS   NUM    ANUM        
      1.18437465E-02    3      1000022        16       -16             # Z2SS   -->  Z1SS   NUT    ANUT        
#         PDG         Width
DECAY   1000025  2.01331997E+00   # Z3SS  decays
#          BR          NDA       ID1       ID2       ID3       ID4
      4.51450916E-07    2      1000022        22                       # Z3SS   -->  Z1SS   GM                 
      1.39345033E-07    2      1000023        22                       # Z3SS   -->  Z2SS   GM                 
      3.13120425E-01    2      1000024       -24                       # Z3SS   -->  W1SS+  W-                 
      3.13120425E-01    2     -1000024        24                       # Z3SS   -->  W1SS-  W+                 
      1.50839314E-01    2      1000022        23                       # Z3SS   -->  Z1SS   Z0                 
      1.91758007E-01    2      1000023        23                       # Z3SS   -->  Z2SS   Z0                 
      1.76857391E-08    3      1000022         2        -2             # Z3SS   -->  Z1SS   UP     UB          
      2.59901274E-08    3      1000022         1        -1             # Z3SS   -->  Z1SS   DN     DB          
      2.59901274E-08    3      1000022         3        -3             # Z3SS   -->  Z1SS   ST     SB          
      1.76854389E-08    3      1000022         4        -4             # Z3SS   -->  Z1SS   CH     CB          
      1.56453808E-07    3      1000022         5        -5             # Z3SS   -->  Z1SS   BT     BB          
      1.09884759E-07    3      1000022        11       -11             # Z3SS   -->  Z1SS   E-     E+          
      1.09884759E-07    3      1000022        13       -13             # Z3SS   -->  Z1SS   MU-    MU+         
      2.36924620E-07    3      1000022        15       -15             # Z3SS   -->  Z1SS   TAU-   TAU+        
      1.70578545E-07    3      1000022        12       -12             # Z3SS   -->  Z1SS   NUE    ANUE        
      1.70578545E-07    3      1000022        14       -14             # Z3SS   -->  Z1SS   NUM    ANUM        
      1.70976293E-07    3      1000022        16       -16             # Z3SS   -->  Z1SS   NUT    ANUT        
      6.22113987E-08    3      1000023         2        -2             # Z3SS   -->  Z2SS   UP     UB          
      7.73394362E-08    3      1000023         1        -1             # Z3SS   -->  Z2SS   DN     DB          
      7.73394362E-08    3      1000023         3        -3             # Z3SS   -->  Z2SS   ST     SB          
      6.22103329E-08    3      1000023         4        -4             # Z3SS   -->  Z2SS   CH     CB          
      3.71215748E-07    3      1000023         5        -5             # Z3SS   -->  Z2SS   BT     BB          
      4.75354831E-08    3      1000023        11       -11             # Z3SS   -->  Z2SS   E-     E+          
      4.75354831E-08    3      1000023        13       -13             # Z3SS   -->  Z2SS   MU-    MU+         
      1.18930160E-07    3      1000023        15       -15             # Z3SS   -->  Z2SS   TAU-   TAU+        
      1.15927421E-07    3      1000023        12       -12             # Z3SS   -->  Z2SS   NUE    ANUE        
      1.15927421E-07    3      1000023        14       -14             # Z3SS   -->  Z2SS   NUM    ANUM        
      1.16210771E-07    3      1000023        16       -16             # Z3SS   -->  Z2SS   NUT    ANUT        
      1.82545260E-02    2      1000022        25                       # Z3SS   -->  Z1SS   HL0                
      1.29042575E-02    2      1000023        25                       # Z3SS   -->  Z2SS   HL0                
#         PDG         Width
DECAY   1000035  2.16183186E+00   # Z4SS  decays
#          BR          NDA       ID1       ID2       ID3       ID4
      9.55639280E-07    2      1000022        22                       # Z4SS   -->  Z1SS   GM                 
      9.47500666E-07    2      1000023        22                       # Z4SS   -->  Z2SS   GM                 
      7.90279397E-09    2      1000025        22                       # Z4SS   -->  Z3SS   GM                 
      3.53604794E-01    2      1000024       -24                       # Z4SS   -->  W1SS+  W-                 
      3.53604794E-01    2     -1000024        24                       # Z4SS   -->  W1SS-  W+                 
      3.45554085E-10    3     -1000037         2        -1             # Z4SS   -->  W2SS-  UP     DB          
      1.15184702E-10    3     -1000037        12       -11             # Z4SS   -->  W2SS-  NUE    E+          
      1.15184702E-10    3     -1000037        14       -13             # Z4SS   -->  W2SS-  NUM    MU+         
      3.45554085E-10    3      1000037         1        -2             # Z4SS   -->  W2SS+  DN     UB          
      1.15184702E-10    3      1000037        11       -12             # Z4SS   -->  W2SS+  E-     ANUE        
      1.15184702E-10    3      1000037        13       -14             # Z4SS   -->  W2SS+  MU-    ANUM        
      3.45554085E-10    3     -1000037         4        -3             # Z4SS   -->  W2SS-  CH     SB          
      1.15184702E-10    3     -1000037        16       -15             # Z4SS   -->  W2SS-  NUT    TAU+        
      3.45554085E-10    3      1000037         3        -4             # Z4SS   -->  W2SS+  ST     CB          
      1.15184702E-10    3      1000037        15       -16             # Z4SS   -->  W2SS+  TAU-   ANUT        
      2.08898019E-02    2      1000022        23                       # Z4SS   -->  Z1SS   Z0                 
      1.63406041E-02    2      1000023        23                       # Z4SS   -->  Z2SS   Z0                 
      2.84415790E-07    3      1000022         2        -2             # Z4SS   -->  Z1SS   UP     UB          
      8.26293558E-07    3      1000022         1        -1             # Z4SS   -->  Z1SS   DN     DB          
      8.26293558E-07    3      1000022         3        -3             # Z4SS   -->  Z1SS   ST     SB          
      2.84410930E-07    3      1000022         4        -4             # Z4SS   -->  Z1SS   CH     CB          
      1.90526953E-06    3      1000022         5        -5             # Z4SS   -->  Z1SS   BT     BB          
      2.09026462E-06    3      1000022        11       -11             # Z4SS   -->  Z1SS   E-     E+          
      2.09026462E-06    3      1000022        13       -13             # Z4SS   -->  Z1SS   MU-    MU+         
      2.23703137E-06    3      1000022        15       -15             # Z4SS   -->  Z1SS   TAU-   TAU+        
      5.16844739E-06    3      1000022        12       -12             # Z4SS   -->  Z1SS   NUE    ANUE        
      5.16844739E-06    3      1000022        14       -14             # Z4SS   -->  Z1SS   NUM    ANUM        
      5.18114757E-06    3      1000022        16       -16             # Z4SS   -->  Z1SS   NUT    ANUT        
      3.27612383E-06    3      1000023         2        -2             # Z4SS   -->  Z2SS   UP     UB          
      3.51557674E-06    3      1000023         1        -1             # Z4SS   -->  Z2SS   DN     DB          
      3.51557674E-06    3      1000023         3        -3             # Z4SS   -->  Z2SS   ST     SB          
      3.27606676E-06    3      1000023         4        -4             # Z4SS   -->  Z2SS   CH     CB          
      8.22942002E-06    3      1000023         5        -5             # Z4SS   -->  Z2SS   BT     BB          
      3.09304482E-06    3      1000023        11       -11             # Z4SS   -->  Z2SS   E-     E+          
      3.09304482E-06    3      1000023        13       -13             # Z4SS   -->  Z2SS   MU-    MU+         
      3.17463468E-06    3      1000023        15       -15             # Z4SS   -->  Z2SS   TAU-   TAU+        
      4.86582576E-06    3      1000023        12       -12             # Z4SS   -->  Z2SS   NUE    ANUE        
      4.86582576E-06    3      1000023        14       -14             # Z4SS   -->  Z2SS   NUM    ANUM        
      4.87817897E-06    3      1000023        16       -16             # Z4SS   -->  Z2SS   NUT    ANUT        
      7.61613933E-07    3      1000025         2        -2             # Z4SS   -->  Z3SS   UP     UB          
      9.87252292E-07    3      1000025         1        -1             # Z4SS   -->  Z3SS   DN     DB          
      9.87252292E-07    3      1000025         3        -3             # Z4SS   -->  Z3SS   ST     SB          
      7.61613933E-07    3      1000025         4        -4             # Z4SS   -->  Z3SS   CH     CB          
      6.85030159E-07    3      1000025         5        -5             # Z4SS   -->  Z3SS   BT     BB          
      2.24296414E-07    3      1000025        11       -11             # Z4SS   -->  Z3SS   E-     E+          
      2.24296414E-07    3      1000025        13       -13             # Z4SS   -->  Z3SS   MU-    MU+         
      2.11435847E-07    3      1000025        15       -15             # Z4SS   -->  Z3SS   TAU-   TAU+        
      4.40197056E-07    3      1000025        12       -12             # Z4SS   -->  Z3SS   NUE    ANUE        
      4.40197056E-07    3      1000025        14       -14             # Z4SS   -->  Z3SS   NUM    ANUM        
      4.40188614E-07    3      1000025        16       -16             # Z4SS   -->  Z3SS   NUT    ANUT        
      1.09766819E-01    2      1000022        25                       # Z4SS   -->  Z1SS   HL0                
      1.45713270E-01    2      1000023        25                       # Z4SS   -->  Z2SS   HL0                
#         PDG         Width
DECAY   1000024  1.86403377E-05   # W1SS+ decays
#          BR          NDA       ID1       ID2       ID3       ID4
      3.33204389E-01    3      1000022         2        -1             # W1SS+  -->  Z1SS   UP     DB          
      3.33204389E-01    3      1000022         4        -3             # W1SS+  -->  Z1SS   CH     SB          
      1.11194678E-01    3      1000022       -11        12             # W1SS+  -->  Z1SS   E+     NUE         
      1.11194678E-01    3      1000022       -13        14             # W1SS+  -->  Z1SS   MU+    NUM         
      1.11201890E-01    3      1000022       -15        16             # W1SS+  -->  Z1SS   TAU+   NUT         
#         PDG         Width
DECAY   1000037  2.14884830E+00   # W2SS+ decays
#          BR          NDA       ID1       ID2       ID3       ID4
      8.34250613E-07    3      1000022         2        -1             # W2SS+  -->  Z1SS   UP     DB          
      8.34250670E-07    3      1000022         4        -3             # W2SS+  -->  Z1SS   CH     SB          
      2.79140568E-06    3      1000022       -11        12             # W2SS+  -->  Z1SS   E+     NUE         
      2.79140568E-06    3      1000022       -13        14             # W2SS+  -->  Z1SS   MU+    NUM         
      2.98423583E-06    3      1000022       -15        16             # W2SS+  -->  Z1SS   TAU+   NUT         
      2.77443938E-02    2      1000022        24                       # W2SS+  -->  Z1SS   W+                 
      3.35271511E-06    3      1000023         2        -1             # W2SS+  -->  Z2SS   UP     DB          
      3.35270056E-06    3      1000023         4        -3             # W2SS+  -->  Z2SS   CH     SB          
      5.40446945E-06    3      1000023       -11        12             # W2SS+  -->  Z2SS   E+     NUE         
      5.40446945E-06    3      1000023       -13        14             # W2SS+  -->  Z2SS   MU+    NUM         
      5.46220417E-06    3      1000023       -15        16             # W2SS+  -->  Z2SS   TAU+   NUT         
      4.16253656E-01    2      1000023        24                       # W2SS+  -->  Z2SS   W+                 
      1.18178218E-06    3      1000025         2        -1             # W2SS+  -->  Z3SS   UP     DB          
      1.18178218E-06    3      1000025         4        -3             # W2SS+  -->  Z3SS   CH     SB          
      3.93399603E-07    3      1000025       -11        12             # W2SS+  -->  Z3SS   E+     NUE         
      3.93399603E-07    3      1000025       -13        14             # W2SS+  -->  Z3SS   MU+    NUM         
      3.93473044E-07    3      1000025       -15        16             # W2SS+  -->  Z3SS   TAU+   NUT         
      3.24884534E-01    2      1000024        23                       # W2SS+  -->  W1SS+  Z0                 
      3.20111280E-06    3      1000024         1        -1             # W2SS+  -->  W1SS+  DN     DB          
      3.20105642E-06    3      1000024         3        -3             # W2SS+  -->  W1SS+  ST     SB          
      7.37809387E-06    3      1000024         2        -2             # W2SS+  -->  W1SS+  UP     UB          
      7.37809387E-06    3      1000024         4        -4             # W2SS+  -->  W1SS+  CH     CB          
      8.80281186E-06    3      1000024        12       -12             # W2SS+  -->  W1SS+  NUE    ANUE        
      8.80281186E-06    3      1000024        14       -14             # W2SS+  -->  W1SS+  NUM    ANUM        
      1.00665566E-05    3      1000024        16       -16             # W2SS+  -->  W1SS+  NUT    ANUT        
      4.01558054E-06    3      1000024        11       -11             # W2SS+  -->  W1SS+  E-     E+          
      4.01558054E-06    3      1000024        13       -13             # W2SS+  -->  W1SS+  MU-    MU+         
      4.02585556E-06    3      1000024        15       -15             # W2SS+  -->  W1SS+  TAU-   TAU+        
      2.31019765E-01    2      1000024        25                       # W2SS+  -->  W1SS+  HL0                
#         PDG         Width
DECAY        25  3.40812374E-03   # HL0   decays
#          BR          NDA       ID1       ID2       ID3       ID4
      5.08315923E-09    2           11       -11                       # HL0    -->  E-     E+                 
      2.14618514E-04    2           13       -13                       # HL0    -->  MU-    MU+                
      6.13348596E-02    2           15       -15                       # HL0    -->  TAU-   TAU+               
      6.40135431E-06    2            1        -1                       # HL0    -->  DN     DB                 
      2.58646556E-03    2            3        -3                       # HL0    -->  ST     SB                 
      8.74073446E-01    2            5        -5                       # HL0    -->  BT     BB                 
      1.84060809E-06    2            2        -2                       # HL0    -->  UP     UB                 
      3.58375087E-02    2            4        -4                       # HL0    -->  CH     CB                 
      1.09430670E-03    2           22        22                       # HL0    -->  GM     GM                 
      2.43817009E-02    2           21        21                       # HL0    -->  GL     GL                 
      2.60456291E-05    3           24        11       -12             # HL0    -->  W+     E-     ANUE        
      2.60456291E-05    3           24        13       -14             # HL0    -->  W+     MU-    ANUM        
      2.60456291E-05    3           24        15       -16             # HL0    -->  W+     TAU-   ANUT        
      7.81368799E-05    3           24        -2         1             # HL0    -->  W+     UB     DN          
      7.81368799E-05    3           24        -4         3             # HL0    -->  W+     CB     ST          
      2.60456291E-05    3          -24       -11        12             # HL0    -->  W-     E+     NUE         
      2.60456291E-05    3          -24       -13        14             # HL0    -->  W-     MU+    NUM         
      2.60456291E-05    3          -24       -15        16             # HL0    -->  W-     TAU+   NUT         
      7.81368799E-05    3          -24         2        -1             # HL0    -->  W-     UP     DB          
      7.81368799E-05    3          -24         4        -3             # HL0    -->  W-     CH     SB          
#         PDG         Width
DECAY        35  5.41884661E+00   # HH0   decays
#          BR          NDA       ID1       ID2       ID3       ID4
      1.50583643E-10    2           11       -11                       # HH0    -->  E-     E+                 
      6.35791230E-06    2           13       -13                       # HH0    -->  MU-    MU+                
      1.82088534E-03    2           15       -15                       # HH0    -->  TAU-   TAU+               
      1.85483998E-07    2            1        -1                       # HH0    -->  DN     DB                 
      7.49449173E-05    2            3        -3                       # HH0    -->  ST     SB                 
      1.16005838E-02    2            5        -5                       # HH0    -->  BT     BB                 
      8.15348844E-10    2            2        -2                       # HH0    -->  UP     UB                 
      1.23900045E-05    2            4        -4                       # HH0    -->  CH     CB                 
      3.39832306E-01    2            6        -6                       # HH0    -->  TP     TB                 
      5.47127593E-06    2           22        22                       # HH0    -->  GM     GM                 
      5.45238145E-04    2           21        21                       # HH0    -->  GL     GL                 
      2.21385784E-03    2           24       -24                       # HH0    -->  W+     W-                 
      1.09418831E-03    2           23        23                       # HH0    -->  Z0     Z0                 
      9.54924710E-03    2      1000022   1000022                       # HH0    -->  Z1SS   Z1SS               
      2.35570483E-02    2      1000022   1000023                       # HH0    -->  Z1SS   Z2SS               
      8.45831707E-02    2      1000022   1000025                       # HH0    -->  Z1SS   Z3SS               
      5.96164912E-03    2      1000022   1000035                       # HH0    -->  Z1SS   Z4SS               
      1.42190969E-02    2      1000023   1000023                       # HH0    -->  Z2SS   Z2SS               
      1.04332529E-01    2      1000023   1000025                       # HH0    -->  Z2SS   Z3SS               
      4.80732182E-03    2      1000023   1000035                       # HH0    -->  Z2SS   Z4SS               
      5.86423576E-02    2      1000024  -1000024                       # HH0    -->  W1SS+  W1SS-              
      1.65207267E-01    2      1000024  -1000037                       # HH0    -->  W1SS+  W2SS-              
      1.65207267E-01    2     -1000024   1000037                       # HH0    -->  W1SS-  W2SS+              
      6.72665425E-03    2           25        25                       # HH0    -->  HL0    HL0                
#         PDG         Width
DECAY        36  6.04028654E+00   # HA0   decays
#          BR          NDA       ID1       ID2       ID3       ID4
      1.34997610E-10    2           11       -11                       # HA0    -->  E-     E+                 
      5.69984240E-06    2           13       -13                       # HA0    -->  MU-    MU+                
      1.63248612E-03    2           15       -15                       # HA0    -->  TAU-   TAU+               
      1.66304289E-07    2            1        -1                       # HA0    -->  DN     DB                 
      6.71953530E-05    2            3        -3                       # HA0    -->  ST     SB                 
      1.04027912E-02    2            5        -5                       # HA0    -->  BT     BB                 
      6.56937893E-10    2            2        -2                       # HA0    -->  UP     UB                 
      9.99789881E-06    2            4        -4                       # HA0    -->  CH     CB                 
      4.41825837E-01    2            6        -6                       # HA0    -->  TP     TB                 
      1.73303522E-06    2           22        22                       # HA0    -->  GM     GM                 
      4.37739945E-04    2           21        21                       # HA0    -->  GL     GL                 
      1.73395500E-02    2      1000022   1000022                       # HA0    -->  Z1SS   Z1SS               
      4.82503399E-02    2      1000022   1000023                       # HA0    -->  Z1SS   Z2SS               
      1.12250065E-02    2      1000022   1000025                       # HA0    -->  Z1SS   Z3SS               
      4.18682136E-02    2      1000022   1000035                       # HA0    -->  Z1SS   Z4SS               
      3.35587934E-02    2      1000023   1000023                       # HA0    -->  Z2SS   Z2SS               
      9.76667553E-03    2      1000023   1000025                       # HA0    -->  Z2SS   Z3SS               
      4.86135520E-02    2      1000023   1000035                       # HA0    -->  Z2SS   Z4SS               
      1.32855803E-01    2      1000024  -1000024                       # HA0    -->  W1SS+  W1SS-              
      1.00151882E-01    2      1000024  -1000037                       # HA0    -->  W1SS+  W2SS-              
      1.00151882E-01    2     -1000024   1000037                       # HA0    -->  W1SS-  W2SS+              
      1.83465495E-03    2           25        23                       # HA0    -->  HL0    Z0                 
#         PDG         Width
DECAY        37  5.78992224E+00   # H+    decays
#          BR          NDA       ID1       ID2       ID3       ID4
      1.43283940E-10    2           12       -11                       # H+     -->  NUE    E+                 
      6.04970546E-06    2           14       -13                       # H+     -->  NUM    MU+                
      1.73269142E-03    2           16       -15                       # H+     -->  NUT    TAU+               
      1.61979301E-07    2            2        -1                       # H+     -->  UP     DB                 
      7.48677121E-05    2            4        -3                       # H+     -->  CH     SB                 
      4.18278754E-01    2            6        -5                       # H+     -->  TP     BB                 
      5.16361743E-02    2      1000024   1000022                       # H+     -->  W1SS+  Z1SS               
      3.67720053E-03    2      1000024   1000023                       # H+     -->  W1SS+  Z2SS               
      1.67049512E-01    2      1000024   1000025                       # H+     -->  W1SS+  Z3SS               
      1.44390315E-01    2      1000024   1000035                       # H+     -->  W1SS+  Z4SS               
      7.83387106E-03    2      1000037   1000022                       # H+     -->  W2SS+  Z1SS               
      2.03274533E-01    2      1000037   1000023                       # H+     -->  W2SS+  Z2SS               
      2.04584654E-03    2           25        24                       # H+     -->  HL0    W+                 
