#  ISAJET SUSY parameters in SUSY Les Houches Accord 2 format
#  Created by ISALHA 2.0 Last revision: C. Balazs 21 Apr 2009
Block SPINFO   # Program information
     1   ISASUGRA from ISAJET          # Spectrum Calculator
     2   7.80   29-OCT-2009 12:50:36   # Version number
Block MODSEL   # Model selection
     1     1   # Minimal supergravity (mSUGRA) model               
Block SMINPUTS   # Standard Model inputs
     1     1.27837830E+02   # alpha_em^(-1)
     2     1.16570000E-05   # G_Fermi
     3     1.17200002E-01   # alpha_s(M_Z)
     4     9.11699982E+01   # m_{Z}(pole)
     5     4.19999981E+00   # m_{b}(m_{b})
     6     1.72500000E+02   # m_{top}(pole)
     7     1.77699995E+00   # m_{tau}(pole)
Block MINPAR   # SUSY breaking input parameters
     1     2.00000000E+02   # m_0
     2     2.80000000E+02   # m_{1/2}
     3     4.00000000E+01   # tan(beta)
     4     1.00000000E+00   # sign(mu)
     5     0.00000000E+00   # A_0
Block EXTPAR   # Non-universal SUSY breaking parameters
     0     2.17515118E+16   # Input scale
Block MASS   # Scalar and gaugino mass spectrum
#  PDG code   mass                 particle
        24     8.04229965E+01   #  W^+
        25     1.11224930E+02   #  h^0            
        35     3.45238251E+02   #  H^0            
        36     3.43034058E+02   #  A^0            
        37     3.55689240E+02   #  H^+            
   1000001     6.54056946E+02   #  dnl            
   1000002     6.48771118E+02   #  upl            
   1000003     6.54056946E+02   #  stl            
   1000004     6.48772644E+02   #  chl            
   1000005     5.51760681E+02   #  b1             
   1000006     4.72965271E+02   #  t1             
   1000011     2.79568176E+02   #  el-            
   1000012     2.66910980E+02   #  nuel           
   1000013     2.79568207E+02   #  mul-           
   1000014     2.66910980E+02   #  numl           
   1000015     1.39262711E+02   #  tau1           
   1000016     2.48738571E+02   #  nutl           
   1000021     6.80157776E+02   #  glss           
   1000022     1.11246643E+02   #  z1ss           
   1000023     2.06303879E+02   #  z2ss           
   1000024     2.06512772E+02   #  w1ss           
   1000025    -3.67918243E+02   #  z3ss           
   1000035     3.85997742E+02   #  z4ss           
   1000037     3.86253754E+02   #  w2ss           
   2000001     6.29685303E+02   #  dnr            
   2000002     6.30403748E+02   #  upr            
   2000003     6.29685303E+02   #  str            
   2000004     6.30405334E+02   #  chr            
   2000005     6.10880737E+02   #  b2             
   2000006     6.33862610E+02   #  t2             
   2000011     2.29227753E+02   #  er-            
   2000013     2.29227768E+02   #  mur-           
   2000015     2.88214264E+02   #  tau2           
Block ALPHA   # Effective Higgs mixing parameter
         -2.66387947E-02   # alpha
Block STOPMIX   # stop mixing matrix
  1  1     5.44894576E-01   # O_{11}
  1  2     8.38504553E-01   # O_{12}
  2  1    -8.38504553E-01   # O_{21}
  2  2     5.44894576E-01   # O_{22}
Block SBOTMIX   # sbottom mixing matrix
  1  1     7.45403230E-01   # O_{11}
  1  2     6.66613817E-01   # O_{12}
  2  1    -6.66613817E-01   # O_{21}
  2  2     7.45403230E-01   # O_{22}
Block STAUMIX   # stau mixing matrix
  1  1     4.75182563E-01   # O_{11}
  1  2     8.79887223E-01   # O_{12}
  2  1    -8.79887223E-01   # O_{21}
  2  2     4.75182563E-01   # O_{22}
Block NMIX   # neutralino mixing matrix
  1  1     9.88378048E-01   #
  1  2    -3.59946042E-02   #
  1  3     1.40404135E-01   #
  1  4    -4.58270684E-02   #
  2  1     8.30489770E-02   #
  2  2     9.38564479E-01   #
  2  3    -2.88409442E-01   #
  2  4     1.70351177E-01   #
  3  1    -6.27190322E-02   #
  3  2     9.07780230E-02   #
  3  3     6.96276605E-01   #
  3  4     7.09242463E-01   #
  4  1    -1.10807225E-01   #
  4  2     3.30999047E-01   #
  4  3     6.42110705E-01   #
  4  4    -6.82535946E-01   #
Block UMIX   # chargino U mixing matrix
  1  1    -9.10551012E-01   # U_{11}
  1  2     4.13396746E-01   # U_{12}
  2  1    -4.13396746E-01   # U_{21}
  2  2    -9.10551012E-01   # U_{22}
Block VMIX   # chargino V mixing matrix
  1  1    -9.69644248E-01   # V_{11}
  1  2     2.44520068E-01   # V_{12}
  2  1    -2.44520068E-01   # V_{21}
  2  2    -9.69644248E-01   # V_{22}
Block GAUGE Q=  5.18346130E+02   #
     1     3.57522219E-01   # g`
     2     6.52378201E-01   # g_2
     3     1.21905041E+00   # g_3
Block YU Q=  5.18346130E+02   #
  3  3     8.75384271E-01   # y_t
Block YD Q=  5.18346130E+02   #
  3  3     4.90502566E-01   # y_b
Block YE Q=  5.18346130E+02   #
  3  3     4.28631872E-01   # y_tau
Block HMIX Q=  5.18346130E+02   # Higgs mixing parameters
     1     3.61144867E+02   # mu(Q)
     2     4.00000000E+01   # tan(beta)(M_GUT)
     3     2.50287720E+02   # Higgs vev at Q
     4     1.17672367E+05   # m_A^2(Q)
Block MSOFT Q=  5.18346130E+02   # DRbar SUSY breaking parameters
     1     1.14708649E+02   # M_1(Q)          
     2     2.15974487E+02   # M_2(Q)          
     3     6.44276306E+02   # M_3(Q)          
    31     2.74363281E+02   # MeL(Q)          
    32     2.74363281E+02   # MmuL(Q)         
    33     2.56918091E+02   # MtauL(Q)        
    34     2.24846100E+02   # MeR(Q)          
    35     2.24846100E+02   # MmuR(Q)         
    36     1.80387039E+02   # MtauR(Q)        
    41     6.18834839E+02   # MqL1(Q)         
    42     6.18834839E+02   # MqL2(Q)         
    43     5.50822632E+02   # MqL3(Q)         
    44     5.99764221E+02   # MuR(Q)          
    45     5.99764221E+02   # McR(Q)          
    46     4.87784393E+02   # MtR(Q)          
    47     5.97460938E+02   # MdR(Q)          
    48     5.97460938E+02   # MsR(Q)          
    49     5.61756714E+02   # MbR(Q)          
Block AU Q=  5.18346130E+02   #
  1  1    -5.08342133E+02   # A_u
  2  2    -5.08342133E+02   # A_c
  3  3    -5.08342133E+02   # A_t
Block AD Q=  5.18346130E+02   #
  1  1    -6.78331055E+02   # A_d
  2  2    -6.78331055E+02   # A_s
  3  3    -6.78331055E+02   # A_b
Block AE Q=  5.18346130E+02   #
  1  1    -1.02477394E+02   # A_e
  2  2    -1.02477394E+02   # A_mu
  3  3    -1.02477394E+02   # A_tau
#  ISAJET decay tables in SUSY Les Houches accord format
#  Created by ISALHD. Last revision: C. Balazs, 2005 May 25
Block DCINFO                           # Program information
     1   ISASUGRA from ISAJET          # Spectrum Calculator
     2   7.80   29-OCT-2009 12:50:36   # Version number
#         PDG         Width
DECAY         6  1.14680779E+00   # TP    decays
#          BR          NDA       ID1       ID2       ID3       ID4
      3.33333343E-01    3            2        -1         5             # TP     -->  UP     DB     BT          
      3.33333343E-01    3            4        -3         5             # TP     -->  CH     SB     BT          
      1.11111112E-01    3          -11        12         5             # TP     -->  E+     NUE    BT          
      1.11111112E-01    3          -13        14         5             # TP     -->  MU+    NUM    BT          
      1.11111112E-01    3          -15        16         5             # TP     -->  TAU+   NUT    BT          
#         PDG         Width
DECAY   1000021  4.78744078E+00   # GLSS  decays
#          BR          NDA       ID1       ID2       ID3       ID4
      3.35997349E-04    3      1000024         5        -6             # GLSS   -->  W1SS+  BT     TB          
      3.35997349E-04    3     -1000024         6        -5             # GLSS   -->  W1SS-  TP     BB          
      7.74320288E-05    3      1000037         5        -6             # GLSS   -->  W2SS+  BT     TB          
      7.74320288E-05    3     -1000037         6        -5             # GLSS   -->  W2SS-  TP     BB          
      8.35615992E-07    2      1000022        21                       # GLSS   -->  Z1SS   GL                 
      5.50663499E-05    3      1000022         6        -6             # GLSS   -->  Z1SS   TP     TB          
      8.69842950E-07    2      1000023        21                       # GLSS   -->  Z2SS   GL                 
      8.38415799E-05    3      1000023         6        -6             # GLSS   -->  Z2SS   TP     TB          
      4.23120546E-05    2      1000025        21                       # GLSS   -->  Z3SS   GL                 
      3.09210445E-05    2      1000035        21                       # GLSS   -->  Z4SS   GL                 
      1.38451150E-02    2     -1000002         2                       # GLSS   -->  UBL    UP                 
      1.38451150E-02    2      1000002        -2                       # GLSS   -->  UPL    UB                 
      9.65078082E-03    2     -1000001         1                       # GLSS   -->  DBL    DN                 
      9.65078082E-03    2      1000001        -1                       # GLSS   -->  DNL    DB                 
      3.38356495E-02    2     -2000002         2                       # GLSS   -->  UBR    UP                 
      3.38356495E-02    2      2000002        -2                       # GLSS   -->  UPR    UB                 
      3.47816832E-02    2     -2000001         1                       # GLSS   -->  DBR    DN                 
      3.47816832E-02    2      2000001        -1                       # GLSS   -->  DNR    DB                 
      9.65052005E-03    2     -1000003         3                       # GLSS   -->  SBL    ST                 
      9.65052005E-03    2      1000003        -3                       # GLSS   -->  STL    SB                 
      3.47814485E-02    2     -2000003         3                       # GLSS   -->  SBR    ST                 
      3.47814485E-02    2      2000003        -3                       # GLSS   -->  STR    SB                 
      1.38315810E-02    2     -1000004         4                       # GLSS   -->  CBL    CH                 
      1.38315810E-02    2      1000004        -4                       # GLSS   -->  CHL    CB                 
      3.38220298E-02    2     -2000004         4                       # GLSS   -->  CBR    CH                 
      3.38220298E-02    2      2000004        -4                       # GLSS   -->  CHR    CB                 
      1.90479666E-01    2     -1000005         5                       # GLSS   -->  BB1    BT                 
      1.90479666E-01    2      1000005        -5                       # GLSS   -->  BT1    BB                 
      6.83086812E-02    2     -2000005         5                       # GLSS   -->  BB2    BT                 
      6.83086812E-02    2      2000005        -5                       # GLSS   -->  BT2    BB                 
      5.64924441E-02    2     -1000006         6                       # GLSS   -->  TB1    TP                 
      5.64924441E-02    2      1000006        -6                       # GLSS   -->  TP1    TB                 
#         PDG         Width
DECAY   1000002  6.46271753E+00   # UPL   decays
#          BR          NDA       ID1       ID2       ID3       ID4
      8.37916043E-03    2      1000022         2                       # UPL    -->  Z1SS   UP                 
      3.10591191E-01    2      1000023         2                       # UPL    -->  Z2SS   UP                 
      1.22254738E-03    2      1000025         2                       # UPL    -->  Z3SS   UP                 
      1.70235392E-02    2      1000035         2                       # UPL    -->  Z4SS   UP                 
      6.41726375E-01    2      1000024         1                       # UPL    -->  W1SS+  DN                 
      2.10571233E-02    2      1000037         1                       # UPL    -->  W2SS+  DN                 
#         PDG         Width
DECAY   1000001  6.28302050E+00   # DNL   decays
#          BR          NDA       ID1       ID2       ID3       ID4
      1.94701720E-02    2      1000022         1                       # DNL    -->  Z1SS   DN                 
      3.02947551E-01    2      1000023         1                       # DNL    -->  Z2SS   DN                 
      2.14148709E-03    2      1000025         1                       # DNL    -->  Z3SS   DN                 
      2.29681712E-02    2      1000035         1                       # DNL    -->  Z4SS   DN                 
      5.88951409E-01    2     -1000024         2                       # DNL    -->  W1SS-  UP                 
      6.35211840E-02    2     -1000037         2                       # DNL    -->  W2SS-  UP                 
#         PDG         Width
DECAY   1000003  6.28297377E+00   # STL   decays
#          BR          NDA       ID1       ID2       ID3       ID4
      1.94703173E-02    2      1000022         3                       # STL    -->  Z1SS   ST                 
      3.02949816E-01    2      1000023         3                       # STL    -->  Z2SS   ST                 
      2.14150292E-03    2      1000025         3                       # STL    -->  Z3SS   ST                 
      2.29683425E-02    2      1000035         3                       # STL    -->  Z4SS   ST                 
      5.88949680E-01    2     -1000024         4                       # STL    -->  W1SS-  CH                 
      6.35203868E-02    2     -1000037         4                       # STL    -->  W2SS-  CH                 
#         PDG         Width
DECAY   1000004  6.46271563E+00   # CHL   decays
#          BR          NDA       ID1       ID2       ID3       ID4
      8.37910827E-03    2      1000022         4                       # CHL    -->  Z1SS   CH                 
      3.10589015E-01    2      1000023         4                       # CHL    -->  Z2SS   CH                 
      1.22253294E-03    2      1000025         4                       # CHL    -->  Z3SS   CH                 
      1.70233157E-02    2      1000035         4                       # CHL    -->  Z4SS   CH                 
      6.41728699E-01    2      1000024         3                       # CHL    -->  W1SS+  ST                 
      2.10572891E-02    2      1000037         3                       # CHL    -->  W2SS+  ST                 
#         PDG         Width
DECAY   1000005  4.19058704E+00   # BT1   decays
#          BR          NDA       ID1       ID2       ID3       ID4
      9.82535928E-02    2      1000022         5                       # BT1    -->  Z1SS   BT                 
      3.44287843E-01    2      1000023         5                       # BT1    -->  Z2SS   BT                 
      8.15051571E-02    2      1000025         5                       # BT1    -->  Z3SS   BT                 
      3.87402400E-02    2      1000035         5                       # BT1    -->  Z4SS   BT                 
      4.37213212E-01    2     -1000024         6                       # BT1    -->  W1SS-  TP                 
#         PDG         Width
DECAY   1000006  3.17447472E+00   # TP1   decays
#          BR          NDA       ID1       ID2       ID3       ID4
      1.73671439E-01    2      1000022         6                       # TP1    -->  Z1SS   TP                 
      1.38262764E-01    2      1000023         6                       # TP1    -->  Z2SS   TP                 
      5.48595488E-01    2      1000024         5                       # TP1    -->  W1SS+  BT                 
      1.39470279E-01    2      1000037         5                       # TP1    -->  W2SS+  BT                 
#         PDG         Width
DECAY   2000002  1.32388973E+00   # UPR   decays
#          BR          NDA       ID1       ID2       ID3       ID4
      9.87075627E-01    2      1000022         2                       # UPR    -->  Z1SS   UP                 
      5.91916451E-03    2      1000023         2                       # UPR    -->  Z2SS   UP                 
      1.84102089E-03    2      1000025         2                       # UPR    -->  Z3SS   UP                 
      5.16414689E-03    2      1000035         2                       # UPR    -->  Z4SS   UP                 
#         PDG         Width
DECAY   2000001  3.30540150E-01   # DNR   decays
#          BR          NDA       ID1       ID2       ID3       ID4
      9.87095237E-01    2      1000022         1                       # DNR    -->  Z1SS   DN                 
      5.91690838E-03    2      1000023         1                       # DNR    -->  Z2SS   DN                 
      1.83698686E-03    2      1000025         1                       # DNR    -->  Z3SS   DN                 
      5.15087321E-03    2      1000035         1                       # DNR    -->  Z4SS   DN                 
#         PDG         Width
DECAY   2000003  3.30540150E-01   # STR   decays
#          BR          NDA       ID1       ID2       ID3       ID4
      9.87095237E-01    2      1000022         3                       # STR    -->  Z1SS   ST                 
      5.91690838E-03    2      1000023         3                       # STR    -->  Z2SS   ST                 
      1.83698686E-03    2      1000025         3                       # STR    -->  Z3SS   ST                 
      5.15087321E-03    2      1000035         3                       # STR    -->  Z4SS   ST                 
#         PDG         Width
DECAY   2000004  1.32388043E+00   # CHR   decays
#          BR          NDA       ID1       ID2       ID3       ID4
      9.87075806E-01    2      1000022         4                       # CHR    -->  Z1SS   CH                 
      5.91915986E-03    2      1000023         4                       # CHR    -->  Z2SS   CH                 
      1.84100890E-03    2      1000025         4                       # CHR    -->  Z3SS   CH                 
      5.16410638E-03    2      1000035         4                       # CHR    -->  Z4SS   CH                 
#         PDG         Width
DECAY   2000005  5.36824656E+00   # BT2   decays
#          BR          NDA       ID1       ID2       ID3       ID4
      1.34245437E-02    2      1000022         5                       # BT2    -->  Z1SS   BT                 
      7.50922039E-02    2      1000023         5                       # BT2    -->  Z2SS   BT                 
      1.24738090E-01    2      1000025         5                       # BT2    -->  Z3SS   BT                 
      1.39370024E-01    2      1000035         5                       # BT2    -->  Z4SS   BT                 
      8.98324847E-02    2     -1000024         6                       # BT2    -->  W1SS-  TP                 
      4.32935864E-01    2     -1000037         6                       # BT2    -->  W2SS-  TP                 
      1.24606811E-01    2          -24   1000006                       # BT2    -->  W-     TP1                
#         PDG         Width
DECAY   2000006  9.48420238E+00   # TP2   decays
#          BR          NDA       ID1       ID2       ID3       ID4
      2.11616352E-01    2      1000024         5                       # TP2    -->  W1SS+  BT                 
      2.61005402E-01    2      1000037         5                       # TP2    -->  W2SS+  BT                 
      8.91151205E-02    2           23   1000006                       # TP2    -->  Z0     TP1                
      2.45874114E-02    2           25   1000006                       # TP2    -->  HL0    TP1                
      7.85285141E-04    2           24   1000005                       # TP2    -->  W+     BT1                
      2.70619672E-02    2      1000022         6                       # TP2    -->  Z1SS   TP                 
      7.39355236E-02    2      1000023         6                       # TP2    -->  Z2SS   TP                 
      7.07510933E-02    2      1000025         6                       # TP2    -->  Z3SS   TP                 
      2.41141796E-01    2      1000035         6                       # TP2    -->  Z4SS   TP                 
#         PDG         Width
DECAY   1000011  8.53760421E-01   # EL-   decays
#          BR          NDA       ID1       ID2       ID3       ID4
      2.51222908E-01    2      1000022        11                       # EL-    -->  Z1SS   E-                 
      2.76959985E-01    2      1000023        11                       # EL-    -->  Z2SS   E-                 
      4.71816748E-01    2     -1000024        12                       # EL-    -->  W1SS-  NUE                
      1.84882992E-07    3      1000015        11       -15             # EL-    -->  TAU1-  E-     TAU+        
      1.69530423E-07    3     -1000015        11        15             # EL-    -->  TAU1+  E-     TAU-        
#         PDG         Width
DECAY   1000013  8.53760540E-01   # MUL-  decays
#          BR          NDA       ID1       ID2       ID3       ID4
      2.51222879E-01    2      1000022        13                       # MUL-   -->  Z1SS   MU-                
      2.76959717E-01    2      1000023        13                       # MUL-   -->  Z2SS   MU-                
      4.71817017E-01    2     -1000024        14                       # MUL-   -->  W1SS-  NUM                
      1.84883149E-07    3      1000015        13       -15             # MUL-   -->  TAU1-  MU-    TAU+        
      1.69530679E-07    3     -1000015        13        15             # MUL-   -->  TAU1+  MU-    TAU-        
#         PDG         Width
DECAY   1000015  8.17137286E-02   # TAU1- decays
#          BR          NDA       ID1       ID2       ID3       ID4
      1.00000000E+00    2      1000022        15                       # TAU1-  -->  Z1SS   TAU-               
#         PDG         Width
DECAY   1000012  7.42878497E-01   # NUEL  decays
#          BR          NDA       ID1       ID2       ID3       ID4
      3.46432090E-01    2      1000022        12                       # NUEL   -->  Z1SS   NUE                
      1.95426270E-01    2      1000023        12                       # NUEL   -->  Z2SS   NUE                
      4.58139777E-01    2      1000024        11                       # NUEL   -->  W1SS+  E-                 
      3.22884148E-07    3      1000015        12       -15             # NUEL   -->  TAU1-  NUE    TAU+        
      1.89073788E-07    3     -1000015        12        15             # NUEL   -->  TAU1+  NUE    TAU-        
      1.40058887E-06    3     -1000015        11        16             # NUEL   -->  TAU1+  E-     NUT         
#         PDG         Width
DECAY   1000014  7.42877781E-01   # NUML  decays
#          BR          NDA       ID1       ID2       ID3       ID4
      3.46432418E-01    2      1000022        14                       # NUML   -->  Z1SS   NUM                
      1.95426464E-01    2      1000023        14                       # NUML   -->  Z2SS   NUM                
      4.58139330E-01    2      1000024        13                       # NUML   -->  W1SS+  MU-                
      3.22884432E-07    3      1000015        14       -15             # NUML   -->  TAU1-  NUM    TAU+        
      1.89073972E-07    3     -1000015        14        15             # NUML   -->  TAU1+  NUM    TAU-        
      1.40312488E-06    3     -1000015        13        16             # NUML   -->  TAU1+  MU-    NUT         
#         PDG         Width
DECAY   1000016  7.20941305E-01   # NUTL  decays
#          BR          NDA       ID1       ID2       ID3       ID4
      3.11821163E-01    2      1000022        16                       # NUTL   -->  Z1SS   NUT                
      1.12785406E-01    2      1000023        16                       # NUTL   -->  Z2SS   NUT                
      2.78566152E-01    2      1000024        15                       # NUTL   -->  W1SS+  TAU-               
      2.96826601E-01    2           24   1000015                       # NUTL   -->  W+     TAU1-              
      5.57873250E-07    3     -1000015        16        15             # NUTL   -->  TAU1+  NUT    TAU-        
      9.76708989E-08    3      1000015        16       -15             # NUTL   -->  TAU1-  NUT    TAU+        
#         PDG         Width
DECAY   2000011  6.65927052E-01   # ER-   decays
#          BR          NDA       ID1       ID2       ID3       ID4
      9.99563992E-01    2      1000022        11                       # ER-    -->  Z1SS   E-                 
      4.35968017E-04    2      1000023        11                       # ER-    -->  Z2SS   E-                 
      2.12165108E-09    3      1000015        11       -15             # ER-    -->  TAU1-  E-     TAU+        
      8.81391671E-09    3     -1000015        11        15             # ER-    -->  TAU1+  E-     TAU-        
      1.24354199E-15    3      1000015        12       -16             # ER-    -->  TAU1-  NUE    ANUT        
#         PDG         Width
DECAY   2000013  6.65926635E-01   # MUR-  decays
#          BR          NDA       ID1       ID2       ID3       ID4
      9.99563992E-01    2      1000022        13                       # MUR-   -->  Z1SS   MU-                
      4.35963942E-04    2      1000023        13                       # MUR-   -->  Z2SS   MU-                
      2.12165352E-09    3      1000015        13       -15             # MUR-   -->  TAU1-  MU-    TAU+        
      8.81392737E-09    3     -1000015        13        15             # MUR-   -->  TAU1+  MU-    TAU-        
      5.27368253E-11    3      1000015        14       -16             # MUR-   -->  TAU1-  NUM    ANUT        
#         PDG         Width
DECAY   2000015  1.19750988E+00   # TAU2- decays
#          BR          NDA       ID1       ID2       ID3       ID4
      3.06018978E-01    2      1000022        15                       # TAU2-  -->  Z1SS   TAU-               
      1.48287922E-01    2      1000023        15                       # TAU2-  -->  Z2SS   TAU-               
      2.16290504E-01    2     -1000024        16                       # TAU2-  -->  W1SS-  NUT                
      2.39336282E-01    2           23   1000015                       # TAU2-  -->  Z0     TAU1-              
      9.00663510E-02    2           25   1000015                       # TAU2-  -->  HL0    TAU1-              
#         PDG         Width
DECAY   1000023  1.29676625E-01   # Z2SS  decays
#          BR          NDA       ID1       ID2       ID3       ID4
      8.66931032E-07    2      1000022        22                       # Z2SS   -->  Z1SS   GM                 
      6.01148047E-03    2      1000022        23                       # Z2SS   -->  Z1SS   Z0                 
      9.46637471E-08    3      1000022         2        -2             # Z2SS   -->  Z1SS   UP     UB          
      1.72723219E-07    3      1000022         1        -1             # Z2SS   -->  Z1SS   DN     DB          
      1.72723219E-07    3      1000022         3        -3             # Z2SS   -->  Z1SS   ST     SB          
      9.46627878E-08    3      1000022         4        -4             # Z2SS   -->  Z1SS   CH     CB          
      7.74927503E-06    3      1000022         5        -5             # Z2SS   -->  Z1SS   BT     BB          
      2.52815171E-05    3      1000022        11       -11             # Z2SS   -->  Z1SS   E-     E+          
      2.52815025E-05    3      1000022        13       -13             # Z2SS   -->  Z1SS   MU-    MU+         
      1.21713401E-05    3      1000022        15       -15             # Z2SS   -->  Z1SS   TAU-   TAU+        
      3.11669501E-05    3      1000022        12       -12             # Z2SS   -->  Z1SS   NUE    ANUE        
      3.11669501E-05    3      1000022        14       -14             # Z2SS   -->  Z1SS   NUM    ANUM        
      5.08502344E-05    3      1000022        16       -16             # Z2SS   -->  Z1SS   NUT    ANUT        
      4.96901721E-01    2      1000015       -15                       # Z2SS   -->  TAU1-  TAU+               
      4.96901721E-01    2     -1000015        15                       # Z2SS   -->  TAU1+  TAU-               
#         PDG         Width
DECAY   1000025  1.97577286E+00   # Z3SS  decays
#          BR          NDA       ID1       ID2       ID3       ID4
      1.91833664E-07    2      1000022        22                       # Z3SS   -->  Z1SS   GM                 
      1.17599662E-07    2      1000023        22                       # Z3SS   -->  Z2SS   GM                 
      2.21038580E-01    2      1000024       -24                       # Z3SS   -->  W1SS+  W-                 
      2.21038580E-01    2     -1000024        24                       # Z3SS   -->  W1SS-  W+                 
      9.09593999E-02    2      1000022        23                       # Z3SS   -->  Z1SS   Z0                 
      1.61733210E-01    2      1000023        23                       # Z3SS   -->  Z2SS   Z0                 
      1.82461886E-08    3      1000022         2        -2             # Z3SS   -->  Z1SS   UP     UB          
      7.17331172E-09    3      1000022         1        -1             # Z3SS   -->  Z1SS   DN     DB          
      7.17331172E-09    3      1000022         3        -3             # Z3SS   -->  Z1SS   ST     SB          
      1.82459594E-08    3      1000022         4        -4             # Z3SS   -->  Z1SS   CH     CB          
      8.77723360E-05    3      1000022         5        -5             # Z3SS   -->  Z1SS   BT     BB          
      1.66408972E-05    3      1000022        15       -15             # Z3SS   -->  Z1SS   TAU-   TAU+        
      1.29830884E-08    3      1000023         2        -2             # Z3SS   -->  Z2SS   UP     UB          
      1.93908782E-08    3      1000023         1        -1             # Z3SS   -->  Z2SS   DN     DB          
      1.93908782E-08    3      1000023         3        -3             # Z3SS   -->  Z2SS   ST     SB          
      1.29829312E-08    3      1000023         4        -4             # Z3SS   -->  Z2SS   CH     CB          
      2.82417932E-05    3      1000023         5        -5             # Z3SS   -->  Z2SS   BT     BB          
      4.15015438E-06    3      1000023        15       -15             # Z3SS   -->  Z2SS   TAU-   TAU+        
      2.03528926E-02    2      1000022        25                       # Z3SS   -->  Z1SS   HL0                
      7.92629458E-03    2      1000023        25                       # Z3SS   -->  Z2SS   HL0                
      2.21911876E-04    2      1000011       -11                       # Z3SS   -->  EL-    E+                 
      2.21911876E-04    2     -1000011        11                       # Z3SS   -->  EL+    E-                 
      2.21911643E-04    2      1000013       -13                       # Z3SS   -->  MUL-   MU+                
      2.21911643E-04    2     -1000013        13                       # Z3SS   -->  MUL+   MU-                
      6.97318057E-04    2      2000011       -11                       # Z3SS   -->  ER-    E+                 
      6.97318057E-04    2     -2000011        11                       # Z3SS   -->  ER+    E-                 
      6.97317650E-04    2      2000013       -13                       # Z3SS   -->  MUR-   MU+                
      6.97317650E-04    2     -2000013        13                       # Z3SS   -->  MUR+   MU-                
      1.02440022E-01    2      1000015       -15                       # Z3SS   -->  TAU1-  TAU+               
      1.02440022E-01    2     -1000015        15                       # Z3SS   -->  TAU1+  TAU-               
      2.95569040E-02    2      2000015       -15                       # Z3SS   -->  TAU2-  TAU+               
      2.95569040E-02    2     -2000015        15                       # Z3SS   -->  TAU2+  TAU-               
      1.37963332E-03    2      1000012       -12                       # Z3SS   -->  NUEL   ANUE               
      1.37963332E-03    2     -1000012        12                       # Z3SS   -->  ANUEL  NUE                
      1.37963332E-03    2      1000014       -14                       # Z3SS   -->  NUML   ANUM               
      1.37963332E-03    2     -1000014        14                       # Z3SS   -->  ANUML  NUM                
      1.81232521E-03    2      1000016       -16                       # Z3SS   -->  NUTL   ANUT               
      1.81232521E-03    2     -1000016        16                       # Z3SS   -->  ANUTL  NUT                
#         PDG         Width
DECAY   1000035  2.42298889E+00   # Z4SS  decays
#          BR          NDA       ID1       ID2       ID3       ID4
      1.76071026E-07    2      1000022        22                       # Z4SS   -->  Z1SS   GM                 
      4.12352685E-09    2      1000023        22                       # Z4SS   -->  Z2SS   GM                 
      1.97016781E-09    2      1000025        22                       # Z4SS   -->  Z3SS   GM                 
      2.33930245E-01    2      1000024       -24                       # Z4SS   -->  W1SS+  W-                 
      2.33930245E-01    2     -1000024        24                       # Z4SS   -->  W1SS-  W+                 
      2.28692070E-02    2      1000022        23                       # Z4SS   -->  Z1SS   Z0                 
      1.70626864E-02    2      1000023        23                       # Z4SS   -->  Z2SS   Z0                 
      1.81427922E-07    3      1000022         2        -2             # Z4SS   -->  Z1SS   UP     UB          
      1.76298911E-07    3      1000022         1        -1             # Z4SS   -->  Z1SS   DN     DB          
      1.76298911E-07    3      1000022         3        -3             # Z4SS   -->  Z1SS   ST     SB          
      1.81425719E-07    3      1000022         4        -4             # Z4SS   -->  Z1SS   CH     CB          
      7.32639382E-05    3      1000022         5        -5             # Z4SS   -->  Z1SS   BT     BB          
      1.41648889E-05    3      1000022        15       -15             # Z4SS   -->  Z1SS   TAU-   TAU+        
      7.15116130E-07    3      1000023         2        -2             # Z4SS   -->  Z2SS   UP     UB          
      8.21693845E-07    3      1000023         1        -1             # Z4SS   -->  Z2SS   DN     DB          
      8.21693845E-07    3      1000023         3        -3             # Z4SS   -->  Z2SS   ST     SB          
      7.15107603E-07    3      1000023         4        -4             # Z4SS   -->  Z2SS   CH     CB          
      2.61694840E-05    3      1000023         5        -5             # Z4SS   -->  Z2SS   BT     BB          
      3.49223797E-06    3      1000023        15       -15             # Z4SS   -->  Z2SS   TAU-   TAU+        
      8.33506917E-08    3      1000025         2        -2             # Z4SS   -->  Z3SS   UP     UB          
      1.07859968E-07    3      1000025         1        -1             # Z4SS   -->  Z3SS   DN     DB          
      1.07859968E-07    3      1000025         3        -3             # Z4SS   -->  Z3SS   ST     SB          
      8.33506917E-08    3      1000025         4        -4             # Z4SS   -->  Z3SS   CH     CB          
      4.69434447E-08    3      1000025         5        -5             # Z4SS   -->  Z3SS   BT     BB          
      2.44199914E-08    3      1000025        11       -11             # Z4SS   -->  Z3SS   E-     E+          
      2.44199914E-08    3      1000025        13       -13             # Z4SS   -->  Z3SS   MU-    MU+         
      2.14857536E-08    3      1000025        15       -15             # Z4SS   -->  Z3SS   TAU-   TAU+        
      4.85881060E-08    3      1000025        12       -12             # Z4SS   -->  Z3SS   NUE    ANUE        
      4.85881060E-08    3      1000025        14       -14             # Z4SS   -->  Z3SS   NUM    ANUM        
      4.85881060E-08    3      1000025        16       -16             # Z4SS   -->  Z3SS   NUT    ANUT        
      6.42542392E-02    2      1000022        25                       # Z4SS   -->  Z1SS   HL0                
      1.29168570E-01    2      1000023        25                       # Z4SS   -->  Z2SS   HL0                
      5.52869635E-03    2      1000011       -11                       # Z4SS   -->  EL-    E+                 
      5.52869635E-03    2     -1000011        11                       # Z4SS   -->  EL+    E-                 
      5.52869216E-03    2      1000013       -13                       # Z4SS   -->  MUL-   MU+                
      5.52869216E-03    2     -1000013        13                       # Z4SS   -->  MUL+   MU-                
      2.08446081E-03    2      2000011       -11                       # Z4SS   -->  ER-    E+                 
      2.08446081E-03    2     -2000011        11                       # Z4SS   -->  ER+    E-                 
      2.08445988E-03    2      2000013       -13                       # Z4SS   -->  MUR-   MU+                
      2.08445988E-03    2     -2000013        13                       # Z4SS   -->  MUR+   MU-                
      4.88531366E-02    2      1000015       -15                       # Z4SS   -->  TAU1-  TAU+               
      4.88531366E-02    2     -1000015        15                       # Z4SS   -->  TAU1+  TAU-               
      3.95971201E-02    2      2000015       -15                       # Z4SS   -->  TAU2-  TAU+               
      3.95971201E-02    2     -2000015        15                       # Z4SS   -->  TAU2+  TAU-               
      1.40236514E-02    2      1000012       -12                       # Z4SS   -->  NUEL   ANUE               
      1.40236514E-02    2     -1000012        12                       # Z4SS   -->  ANUEL  NUE                
      1.40236514E-02    2      1000014       -14                       # Z4SS   -->  NUML   ANUM               
      1.40236514E-02    2     -1000014        14                       # Z4SS   -->  ANUML  NUM                
      1.76075362E-02    2      1000016       -16                       # Z4SS   -->  NUTL   ANUT               
      1.76075362E-02    2     -1000016        16                       # Z4SS   -->  ANUTL  NUT                
#         PDG         Width
DECAY   1000024  1.20540954E-01   # W1SS+ decays
#          BR          NDA       ID1       ID2       ID3       ID4
      2.72862934E-07    3      1000022         2        -1             # W1SS+  -->  Z1SS   UP     DB          
      2.72861882E-07    3      1000022         4        -3             # W1SS+  -->  Z1SS   CH     SB          
      5.91818934E-05    3      1000022       -11        12             # W1SS+  -->  Z1SS   E+     NUE         
      5.91818825E-05    3      1000022       -13        14             # W1SS+  -->  Z1SS   MU+    NUM         
      6.86961139E-05    3      1000022       -15        16             # W1SS+  -->  Z1SS   TAU+   NUT         
      2.90600974E-02    2      1000022        24                       # W1SS+  -->  Z1SS   W+                 
      1.69591941E-15    3      1000023       -11        12             # W1SS+  -->  Z2SS   E+     NUE         
      1.69591931E-15    3      1000023       -13        14             # W1SS+  -->  Z2SS   MU+    NUM         
      9.70752299E-01    2     -1000015        16                       # W1SS+  -->  TAU1+  NUT                
#         PDG         Width
DECAY   1000037  2.24738050E+00   # W2SS+ decays
#          BR          NDA       ID1       ID2       ID3       ID4
      2.71548743E-07    3      1000022         2        -1             # W2SS+  -->  Z1SS   UP     DB          
      2.71548089E-07    3      1000022         4        -3             # W2SS+  -->  Z1SS   CH     SB          
      8.96197980E-06    3      1000022       -15        16             # W2SS+  -->  Z1SS   TAU+   NUT         
      7.56618977E-02    2      1000022        24                       # W2SS+  -->  Z1SS   W+                 
      7.14774444E-07    3      1000023         2        -1             # W2SS+  -->  Z2SS   UP     DB          
      7.14773250E-07    3      1000023         4        -3             # W2SS+  -->  Z2SS   CH     SB          
      8.93173819E-06    3      1000023       -15        16             # W2SS+  -->  Z2SS   TAU+   NUT         
      2.52074063E-01    2      1000023        24                       # W2SS+  -->  Z2SS   W+                 
      3.45215796E-07    3      1000025         2        -1             # W2SS+  -->  Z3SS   UP     DB          
      3.45215796E-07    3      1000025         4        -3             # W2SS+  -->  Z3SS   CH     SB          
      1.14999693E-07    3      1000025       -11        12             # W2SS+  -->  Z3SS   E+     NUE         
      1.14999693E-07    3      1000025       -13        14             # W2SS+  -->  Z3SS   MU+    NUM         
      1.15016782E-07    3      1000025       -15        16             # W2SS+  -->  Z3SS   TAU+   NUT         
      2.25023223E-16    3      1000035       -11        12             # W2SS+  -->  Z4SS   E+     NUE         
      2.25023223E-16    3      1000035       -13        14             # W2SS+  -->  Z4SS   MU+    NUM         
      1.18082138E-02    2      1000012       -11                       # W2SS+  -->  NUEL   E+                 
      1.18082101E-02    2      1000014       -13                       # W2SS+  -->  NUML   MU+                
      1.03284404E-01    2      1000016       -15                       # W2SS+  -->  NUTL   TAU+               
      2.80271601E-02    2     -1000011        12                       # W2SS+  -->  EL+    NUE                
      2.80271471E-02    2     -1000013        14                       # W2SS+  -->  MUL+   NUM                
      6.06012940E-02    2     -1000015        16                       # W2SS+  -->  TAU1+  NUT                
      5.99493310E-02    2     -2000015        16                       # W2SS+  -->  TAU2+  NUT                
      2.10734516E-01    2      1000024        23                       # W2SS+  -->  W1SS+  Z0                 
      6.85313296E-07    3      1000024         1        -1             # W2SS+  -->  W1SS+  DN     DB          
      6.85304940E-07    3      1000024         3        -3             # W2SS+  -->  W1SS+  ST     SB          
      1.65654581E-06    3      1000024         2        -2             # W2SS+  -->  W1SS+  UP     UB          
      1.65654581E-06    3      1000024         4        -4             # W2SS+  -->  W1SS+  CH     CB          
      1.57998323E-01    2      1000024        25                       # W2SS+  -->  W1SS+  HL0                
#         PDG         Width
DECAY        25  4.29031905E-03   # HL0   decays
#          BR          NDA       ID1       ID2       ID3       ID4
      5.00406827E-09    2           11       -11                       # HL0    -->  E-     E+                 
      2.11279665E-04    2           13       -13                       # HL0    -->  MU-    MU+                
      6.04213998E-02    2           15       -15                       # HL0    -->  TAU-   TAU+               
      6.28380440E-06    2            1        -1                       # HL0    -->  DN     DB                 
      2.53897160E-03    2            3        -3                       # HL0    -->  ST     SB                 
      8.36267948E-01    2            5        -5                       # HL0    -->  BT     BB                 
      1.77000356E-06    2            2        -2                       # HL0    -->  UP     UB                 
      3.34918983E-02    2            4        -4                       # HL0    -->  CH     CB                 
      1.50399085E-03    2           22        22                       # HL0    -->  GM     GM                 
      3.44561189E-02    2           21        21                       # HL0    -->  GL     GL                 
      1.63462001E-03    3           24        11       -12             # HL0    -->  W+     E-     ANUE        
      1.63462001E-03    3           24        13       -14             # HL0    -->  W+     MU-    ANUM        
      1.63462001E-03    3           24        15       -16             # HL0    -->  W+     TAU-   ANUT        
      4.90385992E-03    3           24        -2         1             # HL0    -->  W+     UB     DN          
      4.90385992E-03    3           24        -4         3             # HL0    -->  W+     CB     ST          
      1.63462001E-03    3          -24       -11        12             # HL0    -->  W-     E+     NUE         
      1.63462001E-03    3          -24       -13        14             # HL0    -->  W-     MU+    NUM         
      1.63462001E-03    3          -24       -15        16             # HL0    -->  W-     TAU+   NUT         
      4.90385992E-03    3          -24         2        -1             # HL0    -->  W-     UP     DB          
      4.90385992E-03    3          -24         4        -3             # HL0    -->  W-     CH     SB          
      1.14723269E-04    3           23        12       -12             # HL0    -->  Z0     NUE    ANUE        
      1.14723269E-04    3           23        14       -14             # HL0    -->  Z0     NUM    ANUM        
      1.14723269E-04    3           23        16       -16             # HL0    -->  Z0     NUT    ANUT        
      5.77390711E-05    3           23        11       -11             # HL0    -->  Z0     E-     E+          
      5.77390711E-05    3           23        13       -13             # HL0    -->  Z0     MU-    MU+         
      5.77390711E-05    3           23        15       -15             # HL0    -->  Z0     TAU-   TAU+        
      1.97809160E-04    3           23         2        -2             # HL0    -->  Z0     UP     UB          
      1.97809160E-04    3           23         4        -4             # HL0    -->  Z0     CH     CB          
      2.54826911E-04    3           23         1        -1             # HL0    -->  Z0     DN     DB          
      2.54826911E-04    3           23         3        -3             # HL0    -->  Z0     ST     SB          
      2.54826911E-04    3           23         5        -5             # HL0    -->  Z0     BT     BB          
#         PDG         Width
DECAY        35  9.14097309E+00   # HH0   decays
#          BR          NDA       ID1       ID2       ID3       ID4
      1.02683941E-08    2           11       -11                       # HH0    -->  E-     E+                 
      4.33549867E-04    2           13       -13                       # HH0    -->  MU-    MU+                
      1.24155663E-01    2           15       -15                       # HH0    -->  TAU-   TAU+               
      1.27041094E-05    2            1        -1                       # HH0    -->  DN     DB                 
      5.13310265E-03    2            3        -3                       # HH0    -->  ST     SB                 
      8.66639197E-01    2            5        -5                       # HH0    -->  BT     BB                 
      1.80370270E-12    2            2        -2                       # HH0    -->  UP     UB                 
      2.90377482E-08    2            4        -4                       # HH0    -->  CH     CB                 
      4.91097865E-07    2            6        -6                       # HH0    -->  TP     TB                 
      1.20819394E-07    2           22        22                       # HH0    -->  GM     GM                 
      3.02402241E-05    2           21        21                       # HH0    -->  GL     GL                 
      2.86646195E-06    2           24       -24                       # HH0    -->  W+     W-                 
      1.34490733E-06    2           23        23                       # HH0    -->  Z0     Z0                 
      9.23199521E-04    2      1000022   1000022                       # HH0    -->  Z1SS   Z1SS               
      7.69052538E-04    2      1000022   1000023                       # HH0    -->  Z1SS   Z2SS               
      7.22132172E-05    2           25        25                       # HH0    -->  HL0    HL0                
      1.82631169E-03    2      1000015  -1000015                       # HH0    -->  TAU1-  TAU1+              
#         PDG         Width
DECAY        36  9.11215878E+00   # HA0   decays
#          BR          NDA       ID1       ID2       ID3       ID4
      1.02359667E-08    2           11       -11                       # HA0    -->  E-     E+                 
      4.32180881E-04    2           13       -13                       # HA0    -->  MU-    MU+                
      1.23776607E-01    2           15       -15                       # HA0    -->  TAU-   TAU+               
      1.26649020E-05    2            1        -1                       # HA0    -->  DN     DB                 
      5.11726178E-03    2            3        -3                       # HA0    -->  ST     SB                 
      8.64342332E-01    2            5        -5                       # HA0    -->  BT     BB                 
      1.58295436E-12    2            2        -2                       # HA0    -->  UP     UB                 
      2.55061643E-08    2            4        -4                       # HA0    -->  CH     CB                 
      7.02736145E-08    2           22        22                       # HA0    -->  GM     GM                 
      4.34963258E-05    2           21        21                       # HA0    -->  GL     GL                 
      1.62054435E-03    2      1000022   1000022                       # HA0    -->  Z1SS   Z1SS               
      4.65261191E-03    2      1000022   1000023                       # HA0    -->  Z1SS   Z2SS               
      2.06694472E-06    2           25        23                       # HA0    -->  HL0    Z0                 
#         PDG         Width
DECAY        37  5.61344242E+00   # H+    decays
#          BR          NDA       ID1       ID2       ID3       ID4
      1.72287731E-08    2           12       -11                       # H+     -->  NUE    E+                 
      7.27429695E-04    2           14       -13                       # H+     -->  NUM    MU+                
      2.08336681E-01    2           16       -15                       # H+     -->  NUT    TAU+               
      1.94001132E-05    2            2        -1                       # H+     -->  UP     DB                 
      7.83843454E-03    2            4        -3                       # H+     -->  CH     SB                 
      7.72976398E-01    2            6        -5                       # H+     -->  TP     BB                 
      1.00975148E-02    2      1000024   1000022                       # H+     -->  W1SS+  Z1SS               
      4.16771400E-06    2           25        24                       # H+     -->  HL0    W+                 
