#  ISAJET SUSY parameters in SUSY Les Houches Accord 2 format
#  Created by ISALHA 2.0 Last revision: C. Balazs 21 Apr 2009
Block SPINFO   # Program information
     1   ISASUGRA from ISAJET          # Spectrum Calculator
     2   7.80   29-OCT-2009 12:50:36   # Version number
Block MODSEL   # Model selection
     1     1   # Minimal supergravity (mSUGRA) model               
Block SMINPUTS   # Standard Model inputs
     1     1.27837662E+02   # alpha_em^(-1)
     2     1.16570000E-05   # G_Fermi
     3     1.17200002E-01   # alpha_s(M_Z)
     4     9.11699982E+01   # m_{Z}(pole)
     5     4.19999981E+00   # m_{b}(m_{b})
     6     1.72500000E+02   # m_{top}(pole)
     7     1.77699995E+00   # m_{tau}(pole)
Block MINPAR   # SUSY breaking input parameters
     1     8.40000000E+02   # m_0
     2     1.30000000E+02   # m_{1/2}
     3     4.00000000E+01   # tan(beta)
     4     1.00000000E+00   # sign(mu)
     5    -5.00000000E+02   # A_0
Block EXTPAR   # Non-universal SUSY breaking parameters
     0     2.83874940E+16   # Input scale
Block MASS   # Scalar and gaugino mass spectrum
#  PDG code   mass                 particle
        24     8.04229965E+01   #  W^+
        25     1.10055878E+02   #  h^0            
        35     5.95637329E+02   #  H^0            
        36     5.91730469E+02   #  A^0            
        37     6.01864624E+02   #  H^+            
   1000001     8.81080750E+02   #  dnl            
   1000002     8.77366577E+02   #  upl            
   1000003     8.81080811E+02   #  stl            
   1000004     8.77367615E+02   #  chl            
   1000005     6.38600098E+02   #  b1             
   1000006     5.04129120E+02   #  t1             
   1000011     8.43500793E+02   #  el-            
   1000012     8.39663025E+02   #  nuel           
   1000013     8.43500793E+02   #  mul-           
   1000014     8.39663025E+02   #  numl           
   1000015     6.87324524E+02   #  tau1           
   1000016     7.67729187E+02   #  nutl           
   1000021     3.80417236E+02   #  glss           
   1000022     5.17842369E+01   #  z1ss           
   1000023     9.69309006E+01   #  z2ss           
   1000024     9.74416504E+01   #  w1ss           
   1000025    -2.89577332E+02   #  z3ss           
   1000035     3.02191132E+02   #  z4ss           
   1000037     3.04109711E+02   #  w2ss           
   2000001     8.79937500E+02   #  dnr            
   2000002     8.78656799E+02   #  upr            
   2000003     8.79937500E+02   #  str            
   2000004     8.78657837E+02   #  chr            
   2000005     7.51172058E+02   #  b2             
   2000006     6.69241943E+02   #  t2             
   2000011     8.41445435E+02   #  er-            
   2000013     8.41445435E+02   #  mur-           
   2000015     7.74020264E+02   #  tau2           
Block ALPHA   # Effective Higgs mixing parameter
         -2.59127822E-02   # alpha
Block STOPMIX   # stop mixing matrix
  1  1     2.95434237E-01   # O_{11}
  1  2     9.55363095E-01   # O_{12}
  2  1    -9.55363095E-01   # O_{21}
  2  2     2.95434237E-01   # O_{22}
Block SBOTMIX   # sbottom mixing matrix
  1  1     9.82068896E-01   # O_{11}
  1  2     1.88522220E-01   # O_{12}
  2  1    -1.88522220E-01   # O_{21}
  2  2     9.82068896E-01   # O_{22}
Block STAUMIX   # stau mixing matrix
  1  1     1.74918443E-01   # O_{11}
  1  2     9.84582901E-01   # O_{12}
  2  1    -9.84582901E-01   # O_{21}
  2  2     1.74918443E-01   # O_{22}
Block NMIX   # neutralino mixing matrix
  1  1     9.81353343E-01   #
  1  2    -6.36417493E-02   #
  1  3     1.77575633E-01   #
  1  4    -3.69062386E-02   #
  2  1     1.16957650E-01   #
  2  2     9.45089757E-01   #
  2  3    -2.84930944E-01   #
  2  4     1.09272167E-01   #
  3  1    -8.84248465E-02   #
  3  2     1.35250807E-01   #
  3  3     6.84823453E-01   #
  3  4     7.10566700E-01   #
  4  1     1.24287501E-01   #
  4  2    -2.90623605E-01   #
  4  3    -6.46759748E-01   #
  4  4     6.94112778E-01   #
Block UMIX   # chargino U mixing matrix
  1  1    -9.11528945E-01   # U_{11}
  1  2     4.11235958E-01   # U_{12}
  2  1    -4.11235958E-01   # U_{21}
  2  2    -9.11528945E-01   # U_{22}
Block VMIX   # chargino V mixing matrix
  1  1    -9.87649918E-01   # V_{11}
  1  2     1.56676874E-01   # V_{12}
  2  1    -1.56676874E-01   # V_{21}
  2  2    -9.87649918E-01   # V_{22}
Block GAUGE Q=  5.54755676E+02   #
     1     3.57508212E-01   # g`
     2     6.52465045E-01   # g_2
     3     1.22031081E+00   # g_3
Block YU Q=  5.54755676E+02   #
  3  3     8.79213691E-01   # y_t
Block YD Q=  5.54755676E+02   #
  3  3     5.36775649E-01   # y_b
Block YE Q=  5.54755676E+02   #
  3  3     4.08992469E-01   # y_tau
Block HMIX Q=  5.54755676E+02   # Higgs mixing parameters
     1     2.77959778E+02   # mu(Q)
     2     4.00000000E+01   # tan(beta)(M_GUT)
     3     2.50639786E+02   # Higgs vev at Q
     4     3.50144938E+05   # m_A^2(Q)
Block MSOFT Q=  5.54755676E+02   # DRbar SUSY breaking parameters
     1     5.36555290E+01   # M_1(Q)          
     2     1.01674416E+02   # M_2(Q)          
     3     3.22909485E+02   # M_3(Q)          
    31     8.39957397E+02   # MeL(Q)          
    32     8.39957397E+02   # MmuL(Q)         
    33     7.69255981E+02   # MtauL(Q)        
    34     8.39599304E+02   # MeR(Q)          
    35     8.39599304E+02   # MmuR(Q)         
    36     6.89656616E+02   # MtauR(Q)        
    41     8.62668274E+02   # MqL1(Q)         
    42     8.62668274E+02   # MqL2(Q)         
    43     6.28286072E+02   # MqL3(Q)         
    44     8.63032715E+02   # MuR(Q)          
    45     8.63032715E+02   # McR(Q)          
    46     4.89830750E+02   # MtR(Q)          
    47     8.63190613E+02   # MdR(Q)          
    48     8.63190613E+02   # MsR(Q)          
    49     7.37591248E+02   # MbR(Q)          
Block AU Q=  5.54755676E+02   #
  1  1    -3.83080597E+02   # A_u
  2  2    -3.83080597E+02   # A_c
  3  3    -3.83080597E+02   # A_t
Block AD Q=  5.54755676E+02   #
  1  1    -6.06769836E+02   # A_d
  2  2    -6.06769836E+02   # A_s
  3  3    -6.06769836E+02   # A_b
Block AE Q=  5.54755676E+02   #
  1  1    -3.82352661E+02   # A_e
  2  2    -3.82352661E+02   # A_mu
  3  3    -3.82352661E+02   # A_tau
#  ISAJET decay tables in SUSY Les Houches accord format
#  Created by ISALHD. Last revision: C. Balazs, 2005 May 25
Block DCINFO                           # Program information
     1   ISASUGRA from ISAJET          # Spectrum Calculator
     2   7.80   29-OCT-2009 12:50:36   # Version number
#         PDG         Width
DECAY         6  1.14680779E+00   # TP    decays
#          BR          NDA       ID1       ID2       ID3       ID4
      3.33333343E-01    3            2        -1         5             # TP     -->  UP     DB     BT          
      3.33333343E-01    3            4        -3         5             # TP     -->  CH     SB     BT          
      1.11111112E-01    3          -11        12         5             # TP     -->  E+     NUE    BT          
      1.11111112E-01    3          -13        14         5             # TP     -->  MU+    NUM    BT          
      1.11111112E-01    3          -15        16         5             # TP     -->  TAU+   NUT    BT          
#         PDG         Width
DECAY   1000021  7.55311106E-04   # GLSS  decays
#          BR          NDA       ID1       ID2       ID3       ID4
      8.97487774E-02    3      1000024         1        -2             # GLSS   -->  W1SS+  DN     UB          
      8.97487774E-02    3     -1000024         2        -1             # GLSS   -->  W1SS-  UP     DB          
      8.97485092E-02    3      1000024         3        -4             # GLSS   -->  W1SS+  ST     CB          
      8.97485092E-02    3     -1000024         4        -3             # GLSS   -->  W1SS-  CH     SB          
      3.15120965E-02    3      1000024         5        -6             # GLSS   -->  W1SS+  BT     TB          
      3.15120965E-02    3     -1000024         6        -5             # GLSS   -->  W1SS-  TP     BB          
      5.40417786E-05    3      1000037         1        -2             # GLSS   -->  W2SS+  DN     UB          
      5.40417786E-05    3     -1000037         2        -1             # GLSS   -->  W2SS-  UP     DB          
      5.40416950E-05    3      1000037         3        -4             # GLSS   -->  W2SS+  ST     CB          
      5.40416950E-05    3     -1000037         4        -3             # GLSS   -->  W2SS-  CH     SB          
      4.68283804E-04    2      1000022        21                       # GLSS   -->  Z1SS   GL                 
      3.34095024E-02    3      1000022         2        -2             # GLSS   -->  Z1SS   UP     UB          
      1.17731495E-02    3      1000022         1        -1             # GLSS   -->  Z1SS   DN     DB          
      1.17731476E-02    3      1000022         3        -3             # GLSS   -->  Z1SS   ST     SB          
      3.34093347E-02    3      1000022         4        -4             # GLSS   -->  Z1SS   CH     CB          
      5.56225777E-02    3      1000022         5        -5             # GLSS   -->  Z1SS   BT     BB          
      5.79995010E-03    2      1000023        21                       # GLSS   -->  Z2SS   GL                 
      4.74050120E-02    3      1000023         2        -2             # GLSS   -->  Z2SS   UP     UB          
      4.22633328E-02    3      1000023         1        -1             # GLSS   -->  Z2SS   DN     DB          
      4.22633253E-02    3      1000023         3        -3             # GLSS   -->  Z2SS   ST     SB          
      4.74047735E-02    3      1000023         4        -4             # GLSS   -->  Z2SS   CH     CB          
      2.20675692E-01    3      1000023         5        -5             # GLSS   -->  Z2SS   BT     BB          
      1.23177683E-02    2      1000025        21                       # GLSS   -->  Z3SS   GL                 
      4.40160375E-06    3      1000025         2        -2             # GLSS   -->  Z3SS   UP     UB          
      5.64424317E-06    3      1000025         1        -1             # GLSS   -->  Z3SS   DN     DB          
      5.64424136E-06    3      1000025         3        -3             # GLSS   -->  Z3SS   ST     SB          
      4.40158055E-06    3      1000025         4        -4             # GLSS   -->  Z3SS   CH     CB          
      2.94552371E-03    3      1000025         5        -5             # GLSS   -->  Z3SS   BT     BB          
      8.46065581E-03    2      1000035        21                       # GLSS   -->  Z4SS   GL                 
      2.85435817E-05    3      1000035         2        -2             # GLSS   -->  Z4SS   UP     UB          
      3.50887021E-05    3      1000035         1        -1             # GLSS   -->  Z4SS   DN     DB          
      3.50886912E-05    3      1000035         3        -3             # GLSS   -->  Z4SS   ST     SB          
      2.85434271E-05    3      1000035         4        -4             # GLSS   -->  Z4SS   CH     CB          
      1.62573671E-03    3      1000035         5        -5             # GLSS   -->  Z4SS   BT     BB          
#         PDG         Width
DECAY   1000002  4.68374481E+01   # UPL   decays
#          BR          NDA       ID1       ID2       ID3       ID4
      1.05633156E-03    2      1000022         2                       # UPL    -->  Z1SS   UP                 
      7.18707591E-02    2      1000023         2                       # UPL    -->  Z2SS   UP                 
      8.87325965E-04    2      1000025         2                       # UPL    -->  Z3SS   UP                 
      4.39449027E-03    2      1000035         2                       # UPL    -->  Z4SS   UP                 
      7.68737435E-01    2      1000021         2                       # UPL    -->  GLSS   UP                 
      1.50056809E-01    2      1000024         1                       # UPL    -->  W1SS+  DN                 
      2.99684238E-03    2      1000037         1                       # UPL    -->  W2SS+  DN                 
#         PDG         Width
DECAY   1000001  4.69273109E+01   # DNL   decays
#          BR          NDA       ID1       ID2       ID3       ID4
      4.65108082E-03    2      1000022         1                       # DNL    -->  Z1SS   DN                 
      6.58039376E-02    2      1000023         1                       # DNL    -->  Z2SS   DN                 
      1.44230609E-03    2      1000025         1                       # DNL    -->  Z3SS   DN                 
      6.04339689E-03    2      1000035         1                       # DNL    -->  Z4SS   DN                 
      7.73178279E-01    2      1000021         1                       # DNL    -->  GLSS   DN                 
      1.28139764E-01    2     -1000024         2                       # DNL    -->  W1SS-  UP                 
      2.07412876E-02    2     -1000037         2                       # DNL    -->  W2SS-  UP                 
#         PDG         Width
DECAY   1000003  4.69272804E+01   # STL   decays
#          BR          NDA       ID1       ID2       ID3       ID4
      4.65108408E-03    2      1000022         3                       # STL    -->  Z1SS   ST                 
      6.58039898E-02    2      1000023         3                       # STL    -->  Z2SS   ST                 
      1.44230702E-03    2      1000025         3                       # STL    -->  Z3SS   ST                 
      6.04340062E-03    2      1000035         3                       # STL    -->  Z4SS   ST                 
      7.73178816E-01    2      1000021         3                       # STL    -->  GLSS   ST                 
      1.28139243E-01    2     -1000024         4                       # STL    -->  W1SS-  CH                 
      2.07411814E-02    2     -1000037         4                       # STL    -->  W2SS-  CH                 
#         PDG         Width
DECAY   1000004  4.68372574E+01   # CHL   decays
#          BR          NDA       ID1       ID2       ID3       ID4
      1.05633202E-03    2      1000022         4                       # CHL    -->  Z1SS   CH                 
      7.18707889E-02    2      1000023         4                       # CHL    -->  Z2SS   CH                 
      8.87325848E-04    2      1000025         4                       # CHL    -->  Z3SS   CH                 
      4.39448981E-03    2      1000035         4                       # CHL    -->  Z4SS   CH                 
      7.68736541E-01    2      1000021         4                       # CHL    -->  GLSS   CH                 
      1.50057599E-01    2      1000024         3                       # CHL    -->  W1SS+  ST                 
      2.99686030E-03    2      1000037         3                       # CHL    -->  W2SS+  ST                 
#         PDG         Width
DECAY   1000005  3.15748539E+01   # BT1   decays
#          BR          NDA       ID1       ID2       ID3       ID4
      1.27026197E-02    2      1000022         5                       # BT1    -->  Z1SS   BT                 
      8.46164450E-02    2      1000023         5                       # BT1    -->  Z2SS   BT                 
      3.27932313E-02    2      1000025         5                       # BT1    -->  Z3SS   BT                 
      2.92166434E-02    2      1000035         5                       # BT1    -->  Z4SS   BT                 
      5.44565916E-01    2      1000021         5                       # BT1    -->  GLSS   BT                 
      1.28342181E-01    2     -1000024         6                       # BT1    -->  W1SS-  TP                 
      1.55411199E-01    2     -1000037         6                       # BT1    -->  W2SS-  TP                 
      1.23517923E-02    2          -24   1000006                       # BT1    -->  W-     TP1                
#         PDG         Width
DECAY   1000006  6.36844254E+00   # TP1   decays
#          BR          NDA       ID1       ID2       ID3       ID4
      1.25918150E-01    2      1000022         6                       # TP1    -->  Z1SS   TP                 
      5.57994843E-02    2      1000023         6                       # TP1    -->  Z2SS   TP                 
      2.01560497E-01    2      1000025         6                       # TP1    -->  Z3SS   TP                 
      5.21067791E-02    2      1000035         6                       # TP1    -->  Z4SS   TP                 
      1.55473158E-01    2      1000024         5                       # TP1    -->  W1SS+  BT                 
      4.09141928E-01    2      1000037         5                       # TP1    -->  W2SS+  BT                 
#         PDG         Width
DECAY   2000002  3.80644608E+01   # UPR   decays
#          BR          NDA       ID1       ID2       ID3       ID4
      4.99050431E-02    2      1000022         2                       # UPR    -->  Z1SS   UP                 
      6.96526375E-04    2      1000023         2                       # UPR    -->  Z2SS   UP                 
      3.24186491E-04    2      1000025         2                       # UPR    -->  Z3SS   UP                 
      6.26655004E-04    2      1000035         2                       # UPR    -->  Z4SS   UP                 
      9.48447585E-01    2      1000021         2                       # UPR    -->  GLSS   UP                 
#         PDG         Width
DECAY   2000001  3.66891251E+01   # DNR   decays
#          BR          NDA       ID1       ID2       ID3       ID4
      1.29630771E-02    2      1000022         1                       # DNR    -->  Z1SS   DN                 
      1.80935414E-04    2      1000023         1                       # DNR    -->  Z2SS   DN                 
      8.42670270E-05    2      1000025         1                       # DNR    -->  Z3SS   DN                 
      1.62900440E-04    2      1000035         1                       # DNR    -->  Z4SS   DN                 
      9.86608863E-01    2      1000021         1                       # DNR    -->  GLSS   DN                 
#         PDG         Width
DECAY   2000003  3.66891251E+01   # STR   decays
#          BR          NDA       ID1       ID2       ID3       ID4
      1.29630771E-02    2      1000022         3                       # STR    -->  Z1SS   ST                 
      1.80935414E-04    2      1000023         3                       # STR    -->  Z2SS   ST                 
      8.42670270E-05    2      1000025         3                       # STR    -->  Z3SS   ST                 
      1.62900440E-04    2      1000035         3                       # STR    -->  Z4SS   ST                 
      9.86608863E-01    2      1000021         3                       # STR    -->  GLSS   ST                 
#         PDG         Width
DECAY   2000004  3.80642662E+01   # CHR   decays
#          BR          NDA       ID1       ID2       ID3       ID4
      4.99051176E-02    2      1000022         4                       # CHR    -->  Z1SS   CH                 
      6.96527422E-04    2      1000023         4                       # CHR    -->  Z2SS   CH                 
      3.24186840E-04    2      1000025         4                       # CHR    -->  Z3SS   CH                 
      6.26655528E-04    2      1000035         4                       # CHR    -->  Z4SS   CH                 
      9.48447526E-01    2      1000021         4                       # CHR    -->  GLSS   CH                 
#         PDG         Width
DECAY   2000005  3.32849197E+01   # BT2   decays
#          BR          NDA       ID1       ID2       ID3       ID4
      1.16217863E-02    2      1000022         5                       # BT2    -->  Z1SS   BT                 
      3.18166055E-03    2      1000023         5                       # BT2    -->  Z2SS   BT                 
      4.80265655E-02    2      1000025         5                       # BT2    -->  Z3SS   BT                 
      4.54753637E-02    2      1000035         5                       # BT2    -->  Z4SS   BT                 
      7.86512256E-01    2      1000021         5                       # BT2    -->  GLSS   BT                 
      4.72682482E-03    2     -1000024         6                       # BT2    -->  W1SS-  TP                 
      9.38977972E-02    2     -1000037         6                       # BT2    -->  W2SS-  TP                 
      3.58538958E-03    2          -24   1000006                       # BT2    -->  W-     TP1                
      1.63342884E-05    2          -24   2000006                       # BT2    -->  W-     TP2                
      6.15152123E-04    2           23   1000005                       # BT2    -->  Z0     BT1                
      2.34099221E-03    2           25   1000005                       # BT2    -->  HL0    BT1                
#         PDG         Width
DECAY   2000006  2.64782906E+01   # TP2   decays
#          BR          NDA       ID1       ID2       ID3       ID4
      3.85789096E-01    2      1000021         6                       # TP2    -->  GLSS   TP                 
      1.79744408E-01    2      1000024         5                       # TP2    -->  W1SS+  BT                 
      1.09590523E-01    2      1000037         5                       # TP2    -->  W2SS+  BT                 
      1.38204079E-02    2           23   1000006                       # TP2    -->  Z0     TP1                
      1.88030954E-02    2           25   1000006                       # TP2    -->  HL0    TP1                
      3.37585318E-03    2      1000022         6                       # TP2    -->  Z1SS   TP                 
      6.72695264E-02    2      1000023         6                       # TP2    -->  Z2SS   TP                 
      8.29376429E-02    2      1000025         6                       # TP2    -->  Z3SS   TP                 
      1.38669610E-01    2      1000035         6                       # TP2    -->  Z4SS   TP                 
#         PDG         Width
DECAY   1000011  1.11269073E+01   # EL-   decays
#          BR          NDA       ID1       ID2       ID3       ID4
      7.16746375E-02    2      1000022        11                       # EL-    -->  Z1SS   E-                 
      3.16576838E-01    2      1000023        11                       # EL-    -->  Z2SS   E-                 
      1.86442072E-03    2      1000025        11                       # EL-    -->  Z3SS   E-                 
      1.19821951E-02    2      1000035        11                       # EL-    -->  Z4SS   E-                 
      5.16207933E-01    2     -1000024        12                       # EL-    -->  W1SS-  NUE                
      8.16939622E-02    2     -1000037        12                       # EL-    -->  W2SS-  NUE                
#         PDG         Width
DECAY   1000013  1.11269073E+01   # MUL-  decays
#          BR          NDA       ID1       ID2       ID3       ID4
      7.16746375E-02    2      1000022        13                       # MUL-   -->  Z1SS   MU-                
      3.16576838E-01    2      1000023        13                       # MUL-   -->  Z2SS   MU-                
      1.86442072E-03    2      1000025        13                       # MUL-   -->  Z3SS   MU-                
      1.19821951E-02    2      1000035        13                       # MUL-   -->  Z4SS   MU-                
      5.16207933E-01    2     -1000024        14                       # MUL-   -->  W1SS-  NUM                
      8.16939622E-02    2     -1000037        14                       # MUL-   -->  W2SS-  NUM                
#         PDG         Width
DECAY   1000015  7.01077509E+00   # TAU1- decays
#          BR          NDA       ID1       ID2       ID3       ID4
      4.86720592E-01    2      1000022        15                       # TAU1-  -->  Z1SS   TAU-               
      7.49161243E-02    2      1000023        15                       # TAU1-  -->  Z2SS   TAU-               
      9.60327685E-02    2      1000025        15                       # TAU1-  -->  Z3SS   TAU-               
      7.55399987E-02    2      1000035        15                       # TAU1-  -->  Z4SS   TAU-               
      1.36399731E-01    2     -1000024        16                       # TAU1-  -->  W1SS-  NUT                
      1.30390763E-01    2     -1000037        16                       # TAU1-  -->  W2SS-  NUT                
#         PDG         Width
DECAY   1000012  1.12245083E+01   # NUEL  decays
#          BR          NDA       ID1       ID2       ID3       ID4
      1.13630496E-01    2      1000022        12                       # NUEL   -->  Z1SS   NUE                
      2.37825587E-01    2      1000023        12                       # NUEL   -->  Z2SS   NUE                
      8.26218724E-03    2      1000025        12                       # NUEL   -->  Z3SS   NUE                
      3.07392459E-02    2      1000035        12                       # NUEL   -->  Z4SS   NUE                
      5.97872972E-01    2      1000024        11                       # NUEL   -->  W1SS+  E-                 
      1.16695566E-02    2      1000037        11                       # NUEL   -->  W2SS+  E-                 
#         PDG         Width
DECAY   1000014  1.12245083E+01   # NUML  decays
#          BR          NDA       ID1       ID2       ID3       ID4
      1.13630496E-01    2      1000022        14                       # NUML   -->  Z1SS   NUM                
      2.37825587E-01    2      1000023        14                       # NUML   -->  Z2SS   NUM                
      8.26218724E-03    2      1000025        14                       # NUML   -->  Z3SS   NUM                
      3.07392459E-02    2      1000035        14                       # NUML   -->  Z4SS   NUM                
      5.97872972E-01    2      1000024        13                       # NUML   -->  W1SS+  MU-                
      1.16695566E-02    2      1000037        13                       # NUML   -->  W2SS+  MU-                
#         PDG         Width
DECAY   1000016  1.21268091E+01   # NUTL  decays
#          BR          NDA       ID1       ID2       ID3       ID4
      9.60213542E-02    2      1000022        16                       # NUTL   -->  Z1SS   NUT                
      2.00206399E-01    2      1000023        16                       # NUTL   -->  Z2SS   NUT                
      6.62684394E-03    2      1000025        16                       # NUTL   -->  Z3SS   NUT                
      2.45180205E-02    2      1000035        16                       # NUTL   -->  Z4SS   NUT                
      5.37830889E-01    2      1000024        15                       # NUTL   -->  W1SS+  TAU-               
      1.34708032E-01    2      1000037        15                       # NUTL   -->  W2SS+  TAU-               
      9.84325743E-06    3      1000015        16       -15             # NUTL   -->  TAU1-  NUT    TAU+        
      9.84325743E-06    3      1000015        12       -11             # NUTL   -->  TAU1-  NUE    E+          
      9.84325743E-06    3      1000015        14       -13             # NUTL   -->  TAU1-  NUM    MU+         
      2.95297723E-05    3      1000015         2        -1             # NUTL   -->  TAU1-  UP     DB          
      2.95297723E-05    3      1000015         4        -3             # NUTL   -->  TAU1-  CH     SB          
#         PDG         Width
DECAY   2000011  4.22369528E+00   # ER-   decays
#          BR          NDA       ID1       ID2       ID3       ID4
      9.68471825E-01    2      1000022        11                       # ER-    -->  Z1SS   E-                 
      1.34954089E-02    2      1000023        11                       # ER-    -->  Z2SS   E-                 
      6.15729857E-03    2      1000025        11                       # ER-    -->  Z3SS   E-                 
      1.18753528E-02    2      1000035        11                       # ER-    -->  Z4SS   E-                 
#         PDG         Width
DECAY   2000013  4.22369528E+00   # MUR-  decays
#          BR          NDA       ID1       ID2       ID3       ID4
      9.68471825E-01    2      1000022        13                       # MUR-   -->  Z1SS   MU-                
      1.34954089E-02    2      1000023        13                       # MUR-   -->  Z2SS   MU-                
      6.15729857E-03    2      1000025        13                       # MUR-   -->  Z3SS   MU-                
      1.18753528E-02    2      1000035        13                       # MUR-   -->  Z4SS   MU-                
#         PDG         Width
DECAY   2000015  1.17214165E+01   # TAU2- decays
#          BR          NDA       ID1       ID2       ID3       ID4
      6.80926964E-02    2      1000022        15                       # TAU2-  -->  Z1SS   TAU-               
      2.62672007E-01    2      1000023        15                       # TAU2-  -->  Z2SS   TAU-               
      8.61522704E-02    2      1000025        15                       # TAU2-  -->  Z3SS   TAU-               
      9.05622691E-02    2      1000035        15                       # TAU2-  -->  Z4SS   TAU-               
      3.90947044E-01    2     -1000024        16                       # TAU2-  -->  W1SS-  NUT                
      1.01573721E-01    2     -1000037        16                       # TAU2-  -->  W2SS-  NUT                
#         PDG         Width
DECAY   1000023  7.19779223E-07   # Z2SS  decays
#          BR          NDA       ID1       ID2       ID3       ID4
      5.32311480E-03    2      1000022        22                       # Z2SS   -->  Z1SS   GM                 
      1.23763733E-01    3      1000022         2        -2             # Z2SS   -->  Z1SS   UP     UB          
      1.63716391E-01    3      1000022         1        -1             # Z2SS   -->  Z1SS   DN     DB          
      1.63716391E-01    3      1000022         3        -3             # Z2SS   -->  Z1SS   ST     SB          
      1.23763710E-01    3      1000022         4        -4             # Z2SS   -->  Z1SS   CH     CB          
      1.69421986E-01    3      1000022         5        -5             # Z2SS   -->  Z1SS   BT     BB          
      2.73548681E-02    3      1000022        11       -11             # Z2SS   -->  Z1SS   E-     E+          
      2.73548681E-02    3      1000022        13       -13             # Z2SS   -->  Z1SS   MU-    MU+         
      2.84640472E-02    3      1000022        15       -15             # Z2SS   -->  Z1SS   TAU-   TAU+        
      5.64480796E-02    3      1000022        12       -12             # Z2SS   -->  Z1SS   NUE    ANUE        
      5.64480796E-02    3      1000022        14       -14             # Z2SS   -->  Z1SS   NUM    ANUM        
      5.42247109E-02    3      1000022        16       -16             # Z2SS   -->  Z1SS   NUT    ANUT        
#         PDG         Width
DECAY   1000025  1.50752294E+00   # Z3SS  decays
#          BR          NDA       ID1       ID2       ID3       ID4
      5.52655699E-08    2      1000022        22                       # Z3SS   -->  Z1SS   GM                 
      3.02408694E-07    2      1000023        22                       # Z3SS   -->  Z2SS   GM                 
      3.19683015E-01    2      1000024       -24                       # Z3SS   -->  W1SS+  W-                 
      3.19683015E-01    2     -1000024        24                       # Z3SS   -->  W1SS-  W+                 
      9.13301632E-02    2      1000022        23                       # Z3SS   -->  Z1SS   Z0                 
      2.04236463E-01    2      1000023        23                       # Z3SS   -->  Z2SS   Z0                 
      4.81601203E-09    3      1000022         2        -2             # Z3SS   -->  Z1SS   UP     UB          
      3.01175573E-09    3      1000022         1        -1             # Z3SS   -->  Z1SS   DN     DB          
      3.01175507E-09    3      1000022         3        -3             # Z3SS   -->  Z1SS   ST     SB          
      4.81598761E-09    3      1000022         4        -4             # Z3SS   -->  Z1SS   CH     CB          
      5.51053336E-06    3      1000022         5        -5             # Z3SS   -->  Z1SS   BT     BB          
      1.03377991E-08    3      1000022        11       -11             # Z3SS   -->  Z1SS   E-     E+          
      1.03377991E-08    3      1000022        13       -13             # Z3SS   -->  Z1SS   MU-    MU+         
      2.68468625E-06    3      1000022        15       -15             # Z3SS   -->  Z1SS   TAU-   TAU+        
      1.01142597E-08    3      1000022        12       -12             # Z3SS   -->  Z1SS   NUE    ANUE        
      1.01142597E-08    3      1000022        14       -14             # Z3SS   -->  Z1SS   NUM    ANUM        
      1.48269468E-08    3      1000022        16       -16             # Z3SS   -->  Z1SS   NUT    ANUT        
      1.31109363E-08    3      1000023         2        -2             # Z3SS   -->  Z2SS   UP     UB          
      1.89912654E-08    3      1000023         1        -1             # Z3SS   -->  Z2SS   DN     DB          
      1.89912619E-08    3      1000023         3        -3             # Z3SS   -->  Z2SS   ST     SB          
      1.31108697E-08    3      1000023         4        -4             # Z3SS   -->  Z2SS   CH     CB          
      1.00571742E-05    3      1000023         5        -5             # Z3SS   -->  Z2SS   BT     BB          
      3.04144065E-09    3      1000023        11       -11             # Z3SS   -->  Z2SS   E-     E+          
      3.04144065E-09    3      1000023        13       -13             # Z3SS   -->  Z2SS   MU-    MU+         
      1.36732740E-06    3      1000023        15       -15             # Z3SS   -->  Z2SS   TAU-   TAU+        
      1.04168114E-08    3      1000023        12       -12             # Z3SS   -->  Z2SS   NUE    ANUE        
      1.04168114E-08    3      1000023        14       -14             # Z3SS   -->  Z2SS   NUM    ANUM        
      1.53254938E-08    3      1000023        16       -16             # Z3SS   -->  Z2SS   NUT    ANUT        
      3.14697027E-02    2      1000022        25                       # Z3SS   -->  Z1SS   HL0                
      3.35777961E-02    2      1000023        25                       # Z3SS   -->  Z2SS   HL0                
#         PDG         Width
DECAY   1000035  1.66172516E+00   # Z4SS  decays
#          BR          NDA       ID1       ID2       ID3       ID4
      4.41142980E-08    2      1000022        22                       # Z4SS   -->  Z1SS   GM                 
      1.25601204E-07    2      1000023        22                       # Z4SS   -->  Z2SS   GM                 
      1.57166702E-09    2      1000025        22                       # Z4SS   -->  Z3SS   GM                 
      3.41784000E-01    2      1000024       -24                       # Z4SS   -->  W1SS+  W-                 
      3.41784000E-01    2     -1000024        24                       # Z4SS   -->  W1SS-  W+                 
      4.23784405E-02    2      1000022        23                       # Z4SS   -->  Z1SS   Z0                 
      5.35909198E-02    2      1000023        23                       # Z4SS   -->  Z2SS   Z0                 
      2.11571720E-08    3      1000022         2        -2             # Z4SS   -->  Z1SS   UP     UB          
      2.41921327E-08    3      1000022         1        -1             # Z4SS   -->  Z1SS   DN     DB          
      2.41921256E-08    3      1000022         3        -3             # Z4SS   -->  Z1SS   ST     SB          
      2.11570672E-08    3      1000022         4        -4             # Z4SS   -->  Z1SS   CH     CB          
      4.79454229E-06    3      1000022         5        -5             # Z4SS   -->  Z1SS   BT     BB          
      5.27287938E-08    3      1000022        11       -11             # Z4SS   -->  Z1SS   E-     E+          
      5.27287938E-08    3      1000022        13       -13             # Z4SS   -->  Z1SS   MU-    MU+         
      2.59395847E-06    3      1000022        15       -15             # Z4SS   -->  Z1SS   TAU-   TAU+        
      7.60096270E-08    3      1000022        12       -12             # Z4SS   -->  Z1SS   NUE    ANUE        
      7.60096270E-08    3      1000022        14       -14             # Z4SS   -->  Z1SS   NUM    ANUM        
      1.11277892E-07    3      1000022        16       -16             # Z4SS   -->  Z1SS   NUT    ANUT        
      1.78067154E-07    3      1000023         2        -2             # Z4SS   -->  Z2SS   UP     UB          
      2.18486846E-07    3      1000023         1        -1             # Z4SS   -->  Z2SS   DN     DB          
      2.18486790E-07    3      1000023         3        -3             # Z4SS   -->  Z2SS   ST     SB          
      1.78066244E-07    3      1000023         4        -4             # Z4SS   -->  Z2SS   CH     CB          
      1.03033854E-05    3      1000023         5        -5             # Z4SS   -->  Z2SS   BT     BB          
      5.29995035E-08    3      1000023        11       -11             # Z4SS   -->  Z2SS   E-     E+          
      5.29995035E-08    3      1000023        13       -13             # Z4SS   -->  Z2SS   MU-    MU+         
      1.28337649E-06    3      1000023        15       -15             # Z4SS   -->  Z2SS   TAU-   TAU+        
      1.06610514E-07    3      1000023        12       -12             # Z4SS   -->  Z2SS   NUE    ANUE        
      1.06610514E-07    3      1000023        14       -14             # Z4SS   -->  Z2SS   NUM    ANUM        
      1.56617844E-07    3      1000023        16       -16             # Z4SS   -->  Z2SS   NUT    ANUT        
      2.02393000E-08    3      1000025         2        -2             # Z4SS   -->  Z3SS   UP     UB          
      2.61484878E-08    3      1000025         1        -1             # Z4SS   -->  Z3SS   DN     DB          
      2.61484878E-08    3      1000025         3        -3             # Z4SS   -->  Z3SS   ST     SB          
      2.02393000E-08    3      1000025         4        -4             # Z4SS   -->  Z3SS   CH     CB          
      2.97492475E-09    3      1000025         5        -5             # Z4SS   -->  Z3SS   BT     BB          
      5.92962612E-09    3      1000025        11       -11             # Z4SS   -->  Z3SS   E-     E+          
      5.92962612E-09    3      1000025        13       -13             # Z4SS   -->  Z3SS   MU-    MU+         
      4.73950701E-09    3      1000025        15       -15             # Z4SS   -->  Z3SS   TAU-   TAU+        
      1.17725589E-08    3      1000025        12       -12             # Z4SS   -->  Z3SS   NUE    ANUE        
      1.17725589E-08    3      1000025        14       -14             # Z4SS   -->  Z3SS   NUM    ANUM        
      1.17686207E-08    3      1000025        16       -16             # Z4SS   -->  Z3SS   NUT    ANUT        
      6.72560334E-02    2      1000022        25                       # Z4SS   -->  Z1SS   HL0                
      1.53185815E-01    2      1000023        25                       # Z4SS   -->  Z2SS   HL0                
#         PDG         Width
DECAY   1000024  5.48843855E-06   # W1SS+ decays
#          BR          NDA       ID1       ID2       ID3       ID4
      3.36903661E-01    3      1000022         2        -1             # W1SS+  -->  Z1SS   UP     DB          
      3.36903661E-01    3      1000022         4        -3             # W1SS+  -->  Z1SS   CH     SB          
      1.08652867E-01    3      1000022       -11        12             # W1SS+  -->  Z1SS   E+     NUE         
      1.08652867E-01    3      1000022       -13        14             # W1SS+  -->  Z1SS   MU+    NUM         
      1.08886905E-01    3      1000022       -15        16             # W1SS+  -->  Z1SS   TAU+   NUT         
      3.21236149E-09    3      1000023       -11        12             # W1SS+  -->  Z2SS   E+     NUE         
      3.21236149E-09    3      1000023       -13        14             # W1SS+  -->  Z2SS   MU+    NUM         
#         PDG         Width
DECAY   1000037  1.48689079E+00   # W2SS+ decays
#          BR          NDA       ID1       ID2       ID3       ID4
      4.13629913E-08    3      1000022         2        -1             # W2SS+  -->  Z1SS   UP     DB          
      4.13629664E-08    3      1000022         4        -3             # W2SS+  -->  Z1SS   CH     SB          
      8.34827816E-08    3      1000022       -11        12             # W2SS+  -->  Z1SS   E+     NUE         
      8.34827816E-08    3      1000022       -13        14             # W2SS+  -->  Z1SS   MU+    NUM         
      2.63028119E-06    3      1000022       -15        16             # W2SS+  -->  Z1SS   TAU+   NUT         
      8.70241299E-02    2      1000022        24                       # W2SS+  -->  Z1SS   W+                 
      2.75254877E-07    3      1000023         2        -1             # W2SS+  -->  Z2SS   UP     DB          
      2.75254735E-07    3      1000023         4        -3             # W2SS+  -->  Z2SS   CH     SB          
      1.32103395E-07    3      1000023       -11        12             # W2SS+  -->  Z2SS   E+     NUE         
      1.32103395E-07    3      1000023       -13        14             # W2SS+  -->  Z2SS   MU+    NUM         
      2.85898363E-06    3      1000023       -15        16             # W2SS+  -->  Z2SS   TAU+   NUT         
      3.72600555E-01    2      1000023        24                       # W2SS+  -->  Z2SS   W+                 
      1.68811027E-07    3      1000025         2        -1             # W2SS+  -->  Z3SS   UP     DB          
      1.68811027E-07    3      1000025         4        -3             # W2SS+  -->  Z3SS   CH     SB          
      5.62504887E-08    3      1000025       -11        12             # W2SS+  -->  Z3SS   E+     NUE         
      5.62504887E-08    3      1000025       -13        14             # W2SS+  -->  Z3SS   MU+    NUM         
      5.66023317E-08    3      1000025       -15        16             # W2SS+  -->  Z3SS   TAU+   NUT         
      8.48418991E-12    3      1000035         2        -1             # W2SS+  -->  Z4SS   UP     DB          
      2.82785340E-12    3      1000035       -11        12             # W2SS+  -->  Z4SS   E+     NUE         
      2.82785340E-12    3      1000035       -13        14             # W2SS+  -->  Z4SS   MU+    NUM         
      2.84341734E-12    3      1000035       -15        16             # W2SS+  -->  Z4SS   TAU+   NUT         
      3.08182061E-01    2      1000024        23                       # W2SS+  -->  W1SS+  Z0                 
      1.07088368E-07    3      1000024         1        -1             # W2SS+  -->  W1SS+  DN     DB          
      1.07087821E-07    3      1000024         3        -3             # W2SS+  -->  W1SS+  ST     SB          
      6.17223918E-07    3      1000024         2        -2             # W2SS+  -->  W1SS+  UP     UB          
      6.17223748E-07    3      1000024         4        -4             # W2SS+  -->  W1SS+  CH     CB          
      2.47792912E-07    3      1000024        12       -12             # W2SS+  -->  W1SS+  NUE    ANUE        
      2.47792912E-07    3      1000024        14       -14             # W2SS+  -->  W1SS+  NUM    ANUM        
      6.04371110E-07    3      1000024        16       -16             # W2SS+  -->  W1SS+  NUT    ANUT        
      4.30585914E-08    3      1000024        11       -11             # W2SS+  -->  W1SS+  E-     E+          
      4.30585914E-08    3      1000024        13       -13             # W2SS+  -->  W1SS+  MU-    MU+         
      6.33570849E-08    3      1000024        15       -15             # W2SS+  -->  W1SS+  TAU-   TAU+        
      2.32183442E-01    2      1000024        25                       # W2SS+  -->  W1SS+  HL0                
#         PDG         Width
DECAY        25  4.03969828E-03   # HL0   decays
#          BR          NDA       ID1       ID2       ID3       ID4
      4.97598940E-09    2           11       -11                       # HL0    -->  E-     E+                 
      2.10094091E-04    2           13       -13                       # HL0    -->  MU-    MU+                
      6.00803941E-02    2           15       -15                       # HL0    -->  TAU-   TAU+               
      6.24954964E-06    2            1        -1                       # HL0    -->  DN     DB                 
      2.52513099E-03    2            3        -3                       # HL0    -->  ST     SB                 
      8.32952678E-01    2            5        -5                       # HL0    -->  BT     BB                 
      1.86042575E-06    2            2        -2                       # HL0    -->  UP     UB                 
      3.52603570E-02    2            4        -4                       # HL0    -->  CH     CB                 
      1.56688620E-03    2           22        22                       # HL0    -->  GM     GM                 
      3.44857760E-02    2           21        21                       # HL0    -->  GL     GL                 
      1.44506234E-03    3           24        11       -12             # HL0    -->  W+     E-     ANUE        
      1.44506234E-03    3           24        13       -14             # HL0    -->  W+     MU-    ANUM        
      1.44506234E-03    3           24        15       -16             # HL0    -->  W+     TAU-   ANUT        
      4.33518691E-03    3           24        -2         1             # HL0    -->  W+     UB     DN          
      4.33518691E-03    3           24        -4         3             # HL0    -->  W+     CB     ST          
      1.44506234E-03    3          -24       -11        12             # HL0    -->  W-     E+     NUE         
      1.44506234E-03    3          -24       -13        14             # HL0    -->  W-     MU+    NUM         
      1.44506234E-03    3          -24       -15        16             # HL0    -->  W-     TAU+   NUT         
      4.33518691E-03    3          -24         2        -1             # HL0    -->  W-     UP     DB          
      4.33518691E-03    3          -24         4        -3             # HL0    -->  W-     CH     SB          
      9.17490979E-05    3           23        12       -12             # HL0    -->  Z0     NUE    ANUE        
      9.17490979E-05    3           23        14       -14             # HL0    -->  Z0     NUM    ANUM        
      9.17490979E-05    3           23        16       -16             # HL0    -->  Z0     NUT    ANUT        
      4.61763957E-05    3           23        11       -11             # HL0    -->  Z0     E-     E+          
      4.61763957E-05    3           23        13       -13             # HL0    -->  Z0     MU-    MU+         
      4.61763957E-05    3           23        15       -15             # HL0    -->  Z0     TAU-   TAU+        
      1.58196432E-04    3           23         2        -2             # HL0    -->  Z0     UP     UB          
      1.58196432E-04    3           23         4        -4             # HL0    -->  Z0     CH     CB          
      2.03795978E-04    3           23         1        -1             # HL0    -->  Z0     DN     DB          
      2.03795978E-04    3           23         3        -3             # HL0    -->  Z0     ST     SB          
      2.03795978E-04    3           23         5        -5             # HL0    -->  Z0     BT     BB          
      5.55765908E-03    2      1000022   1000022                       # HL0    -->  Z1SS   Z1SS               
#         PDG         Width
DECAY        35  1.79401817E+01   # HH0   decays
#          BR          NDA       ID1       ID2       ID3       ID4
      9.02708752E-09    2           11       -11                       # HH0    -->  E-     E+                 
      3.81139864E-04    2           13       -13                       # HH0    -->  MU-    MU+                
      1.09158494E-01    2           15       -15                       # HH0    -->  TAU-   TAU+               
      1.11090376E-05    2            1        -1                       # HH0    -->  DN     DB                 
      4.48861346E-03    2            3        -3                       # HH0    -->  ST     SB                 
      6.35404229E-01    2            5        -5                       # HH0    -->  BT     BB                 
      1.49239930E-12    2            2        -2                       # HH0    -->  UP     UB                 
      2.23988170E-08    2            4        -4                       # HH0    -->  CH     CB                 
      7.14912429E-04    2            6        -6                       # HH0    -->  TP     TB                 
      5.94039271E-08    2           22        22                       # HH0    -->  GM     GM                 
      1.26368659E-05    2           21        21                       # HH0    -->  GL     GL                 
      2.89562058E-06    2           24       -24                       # HH0    -->  W+     W-                 
      1.44081093E-06    2           23        23                       # HH0    -->  Z0     Z0                 
      3.02577368E-03    2      1000022   1000022                       # HH0    -->  Z1SS   Z1SS               
      1.34112285E-02    2      1000022   1000023                       # HH0    -->  Z1SS   Z2SS               
      1.35264331E-02    2      1000022   1000025                       # HH0    -->  Z1SS   Z3SS               
      6.57281280E-03    2      1000022   1000035                       # HH0    -->  Z1SS   Z4SS               
      1.45789655E-02    2      1000023   1000023                       # HH0    -->  Z2SS   Z2SS               
      2.90018618E-02    2      1000023   1000025                       # HH0    -->  Z2SS   Z3SS               
      1.09829986E-02    2      1000023   1000035                       # HH0    -->  Z2SS   Z4SS               
      5.95362944E-05    2      1000025   1000025                       # HH0    -->  Z3SS   Z3SS               
      2.15094327E-03    2      1000025   1000035                       # HH0    -->  Z3SS   Z4SS               
      3.81752886E-02    2      1000024  -1000024                       # HH0    -->  W1SS+  W1SS-              
      5.91692366E-02    2      1000024  -1000037                       # HH0    -->  W1SS+  W2SS-              
      5.91692366E-02    2     -1000024   1000037                       # HH0    -->  W1SS-  W2SS+              
      2.48503227E-07    2           25        25                       # HH0    -->  HL0    HL0                
#         PDG         Width
DECAY        36  1.77051201E+01   # HA0   decays
#          BR          NDA       ID1       ID2       ID3       ID4
      9.08736464E-09    2           11       -11                       # HA0    -->  E-     E+                 
      3.83684877E-04    2           13       -13                       # HA0    -->  MU-    MU+                
      1.09891258E-01    2           15       -15                       # HA0    -->  TAU-   TAU+               
      1.11838945E-05    2            1        -1                       # HA0    -->  DN     DB                 
      4.51885955E-03    2            3        -3                       # HA0    -->  ST     SB                 
      6.39773190E-01    2            5        -5                       # HA0    -->  BT     BB                 
      1.39784701E-12    2            2        -2                       # HA0    -->  UP     UB                 
      2.09971009E-08    2            4        -4                       # HA0    -->  CH     CB                 
      9.68034670E-04    2            6        -6                       # HA0    -->  TP     TB                 
      4.73257131E-08    2           22        22                       # HA0    -->  GM     GM                 
      2.55145969E-05    2           21        21                       # HA0    -->  GL     GL                 
      3.20747169E-03    2      1000022   1000022                       # HA0    -->  Z1SS   Z1SS               
      1.47512816E-02    2      1000022   1000023                       # HA0    -->  Z1SS   Z2SS               
      9.57562774E-03    2      1000022   1000025                       # HA0    -->  Z1SS   Z3SS               
      9.48307384E-03    2      1000022   1000035                       # HA0    -->  Z1SS   Z4SS               
      1.70556959E-02    2      1000023   1000023                       # HA0    -->  Z2SS   Z2SS               
      1.64979436E-02    2      1000023   1000025                       # HA0    -->  Z2SS   Z3SS               
      1.98712461E-02    2      1000023   1000035                       # HA0    -->  Z2SS   Z4SS               
      8.67276511E-04    2      1000025   1000025                       # HA0    -->  Z3SS   Z3SS               
      4.45712246E-02    2      1000024  -1000024                       # HA0    -->  W1SS+  W1SS-              
      5.42723238E-02    2      1000024  -1000037                       # HA0    -->  W1SS+  W2SS-              
      5.42723238E-02    2     -1000024   1000037                       # HA0    -->  W1SS-  W2SS+              
      2.69978750E-06    2           25        23                       # HA0    -->  HL0    Z0                 
#         PDG         Width
DECAY        37  1.53480053E+01   # H+    decays
#          BR          NDA       ID1       ID2       ID3       ID4
      1.06625180E-08    2           12       -11                       # H+     -->  NUE    E+                 
      4.50190710E-04    2           14       -13                       # H+     -->  NUM    MU+                
      1.28939286E-01    2           16       -15                       # H+     -->  NUT    TAU+               
      1.20063132E-05    2            2        -1                       # H+     -->  UP     DB                 
      4.85113030E-03    2            4        -3                       # H+     -->  CH     SB                 
      5.78963995E-01    2            6        -5                       # H+     -->  TP     BB                 
      2.77699418E-02    2      1000024   1000022                       # H+     -->  W1SS+  Z1SS               
      3.38036480E-04    2      1000024   1000023                       # H+     -->  W1SS+  Z2SS               
      7.58573711E-02    2      1000024   1000025                       # H+     -->  W1SS+  Z3SS               
      7.25787580E-02    2      1000024   1000035                       # H+     -->  W1SS+  Z4SS               
      9.81093477E-03    2      1000037   1000022                       # H+     -->  W2SS+  Z1SS               
      9.89559740E-02    2      1000037   1000023                       # H+     -->  W2SS+  Z2SS               
      1.46912516E-03    2      1000037   1000025                       # H+     -->  W2SS+  Z3SS               
      3.31279784E-06    2           25        24                       # H+     -->  HL0    W+                 
