#  ISAJET SUSY parameters in SUSY Les Houches Accord 2 format
#  Created by ISALHA 2.0 Last revision: C. Balazs 21 Apr 2009
Block SPINFO   # Program information
     1   ISASUGRA from ISAJET          # Spectrum Calculator
     2   7.80   29-OCT-2009 12:50:36   # Version number
Block MODSEL   # Model selection
     1     1   # Minimal supergravity (mSUGRA) model               
Block SMINPUTS   # Standard Model inputs
     1     1.27835556E+02   # alpha_em^(-1)
     2     1.16570000E-05   # G_Fermi
     3     1.17200002E-01   # alpha_s(M_Z)
     4     9.11699982E+01   # m_{Z}(pole)
     5     4.19999981E+00   # m_{b}(m_{b})
     6     1.72500000E+02   # m_{top}(pole)
     7     1.77699995E+00   # m_{tau}(pole)
Block MINPAR   # SUSY breaking input parameters
     1     4.00000000E+02   # m_0
     2     1.90000000E+02   # m_{1/2}
     3     4.00000000E+01   # tan(beta)
     4     1.00000000E+00   # sign(mu)
     5     0.00000000E+00   # A_0
Block EXTPAR   # Non-universal SUSY breaking parameters
     0     2.57453697E+16   # Input scale
Block MASS   # Scalar and gaugino mass spectrum
#  PDG code   mass                 particle
        24     8.04229965E+01   #  W^+
        25     1.08267334E+02   #  h^0            
        35     3.48286926E+02   #  H^0            
        36     3.46012451E+02   #  A^0            
        37     3.58521362E+02   #  H^+            
   1000001     5.88361938E+02   #  dnl            
   1000002     5.82778320E+02   #  upl            
   1000003     5.88362000E+02   #  stl            
   1000004     5.82779968E+02   #  chl            
   1000005     4.75447784E+02   #  b1             
   1000006     4.00286713E+02   #  t1             
   1000011     4.21488922E+02   #  el-            
   1000012     4.13519226E+02   #  nuel           
   1000013     4.21488922E+02   #  mul-           
   1000014     4.13519226E+02   #  numl           
   1000015     3.26179291E+02   #  tau1           
   1000016     3.81155090E+02   #  nutl           
   1000021     4.94218689E+02   #  glss           
   1000022     7.34049454E+01   #  z1ss           
   1000023     1.32329422E+02   #  z2ss           
   1000024     1.32324112E+02   #  w1ss           
   1000025    -2.60565643E+02   #  z3ss           
   1000035     2.83059937E+02   #  z4ss           
   1000037     2.83635223E+02   #  w2ss           
   2000001     5.76433105E+02   #  dnr            
   2000002     5.75686340E+02   #  upr            
   2000003     5.76433167E+02   #  str            
   2000004     5.75687927E+02   #  chr            
   2000005     5.33606506E+02   #  b2             
   2000006     5.36807434E+02   #  t2             
   2000011     4.07946533E+02   #  er-            
   2000013     4.07946564E+02   #  mur-           
   2000015     3.99054626E+02   #  tau2           
Block ALPHA   # Effective Higgs mixing parameter
         -2.72146482E-02   # alpha
Block STOPMIX   # stop mixing matrix
  1  1     5.00219345E-01   # O_{11}
  1  2     8.65898728E-01   # O_{12}
  2  1    -8.65898728E-01   # O_{21}
  2  2     5.00219345E-01   # O_{22}
Block SBOTMIX   # sbottom mixing matrix
  1  1     8.82629395E-01   # O_{11}
  1  2     4.70069528E-01   # O_{12}
  2  1    -4.70069528E-01   # O_{21}
  2  2     8.82629395E-01   # O_{22}
Block STAUMIX   # stau mixing matrix
  1  1     3.80744427E-01   # O_{11}
  1  2     9.24680293E-01   # O_{12}
  2  1    -9.24680293E-01   # O_{21}
  2  2     3.80744427E-01   # O_{22}
Block NMIX   # neutralino mixing matrix
  1  1    -9.72211719E-01   #
  1  2     7.55400211E-02   #
  1  3    -2.11415485E-01   #
  1  4     6.63448051E-02   #
  2  1     1.60542980E-01   #
  2  2     8.99734080E-01   #
  2  3    -3.55166823E-01   #
  2  4     1.96369484E-01   #
  3  1    -9.00649726E-02   #
  3  2     1.30849987E-01   #
  3  3     6.84271038E-01   #
  3  4     7.11716533E-01   #
  4  1    -1.44632801E-01   #
  4  2     4.09451485E-01   #
  4  3     6.00777924E-01   #
  4  4    -6.71190977E-01   #
Block UMIX   # chargino U mixing matrix
  1  1    -8.52504671E-01   # U_{11}
  1  2     5.22719622E-01   # U_{12}
  2  1    -5.22719622E-01   # U_{21}
  2  2    -8.52504671E-01   # U_{22}
Block VMIX   # chargino V mixing matrix
  1  1    -9.57569242E-01   # V_{11}
  1  2     2.88203299E-01   # V_{12}
  2  1    -2.88203299E-01   # V_{21}
  2  2    -9.57569242E-01   # V_{22}
Block GAUGE Q=  4.30173889E+02   #
     1     3.57525826E-01   # g`
     2     6.52381241E-01   # g_2
     3     1.21927583E+00   # g_3
Block YU Q=  4.30173889E+02   #
  3  3     8.83632064E-01   # y_t
Block YD Q=  4.30173889E+02   #
  3  3     5.16361952E-01   # y_b
Block YE Q=  4.30173889E+02   #
  3  3     4.17278826E-01   # y_tau
Block HMIX Q=  4.30173889E+02   # Higgs mixing parameters
     1     2.50323669E+02   # mu(Q)
     2     4.00000000E+01   # tan(beta)(M_GUT)
     3     2.50220291E+02   # Higgs vev at Q
     4     1.19724617E+05   # m_A^2(Q)
Block MSOFT Q=  4.30173889E+02   # DRbar SUSY breaking parameters
     1     7.69962540E+01   # M_1(Q)          
     2     1.45898239E+02   # M_2(Q)          
     3     4.51111115E+02   # M_3(Q)          
    31     4.17875854E+02   # MeL(Q)          
    32     4.17875854E+02   # MmuL(Q)         
    33     3.86261414E+02   # MtauL(Q)        
    34     4.05259094E+02   # MeR(Q)          
    35     4.05259094E+02   # MmuR(Q)         
    36     3.36128601E+02   # MtauR(Q)        
    41     5.61875366E+02   # MqL1(Q)         
    42     5.61875366E+02   # MqL2(Q)         
    43     4.65938782E+02   # MqL3(Q)         
    44     5.53279053E+02   # MuR(Q)          
    45     5.53279053E+02   # McR(Q)          
    46     3.97154266E+02   # MtR(Q)          
    47     5.52294739E+02   # MdR(Q)          
    48     5.52294739E+02   # MsR(Q)          
    49     5.03187500E+02   # MbR(Q)          
Block AU Q=  4.30173889E+02   #
  1  1    -3.50547180E+02   # A_u
  2  2    -3.50547180E+02   # A_c
  3  3    -3.50547180E+02   # A_t
Block AD Q=  4.30173889E+02   #
  1  1    -4.66447601E+02   # A_d
  2  2    -4.66447601E+02   # A_s
  3  3    -4.66447601E+02   # A_b
Block AE Q=  4.30173889E+02   #
  1  1    -6.66726913E+01   # A_e
  2  2    -6.66726913E+01   # A_mu
  3  3    -6.66726913E+01   # A_tau
#  ISAJET decay tables in SUSY Les Houches accord format
#  Created by ISALHD. Last revision: C. Balazs, 2005 May 25
Block DCINFO                           # Program information
     1   ISASUGRA from ISAJET          # Spectrum Calculator
     2   7.80   29-OCT-2009 12:50:36   # Version number
#         PDG         Width
DECAY         6  1.14680779E+00   # TP    decays
#          BR          NDA       ID1       ID2       ID3       ID4
      3.33333343E-01    3            2        -1         5             # TP     -->  UP     DB     BT          
      3.33333343E-01    3            4        -3         5             # TP     -->  CH     SB     BT          
      1.11111112E-01    3          -11        12         5             # TP     -->  E+     NUE    BT          
      1.11111112E-01    3          -13        14         5             # TP     -->  MU+    NUM    BT          
      1.11111112E-01    3          -15        16         5             # TP     -->  TAU+   NUT    BT          
#         PDG         Width
DECAY   1000021  6.99588805E-02   # GLSS  decays
#          BR          NDA       ID1       ID2       ID3       ID4
      3.14506292E-02    3      1000024         1        -2             # GLSS   -->  W1SS+  DN     UB          
      3.14506292E-02    3     -1000024         2        -1             # GLSS   -->  W1SS-  UP     DB          
      3.14502791E-02    3      1000024         3        -4             # GLSS   -->  W1SS+  ST     CB          
      3.14502791E-02    3     -1000024         4        -3             # GLSS   -->  W1SS-  CH     SB          
      3.89189459E-03    3      1000024         5        -6             # GLSS   -->  W1SS+  BT     TB          
      3.89189459E-03    3     -1000024         6        -5             # GLSS   -->  W1SS-  TP     BB          
      1.47601415E-03    3      1000037         1        -2             # GLSS   -->  W2SS+  DN     UB          
      1.47601415E-03    3     -1000037         2        -1             # GLSS   -->  W2SS-  UP     DB          
      1.47600309E-03    3      1000037         3        -4             # GLSS   -->  W2SS+  ST     CB          
      1.47600309E-03    3     -1000037         4        -3             # GLSS   -->  W2SS-  CH     SB          
      9.89679596E-04    3      1000037         5        -6             # GLSS   -->  W2SS+  BT     TB          
      9.89679596E-04    3     -1000037         6        -5             # GLSS   -->  W2SS-  TP     BB          
      6.51221344E-05    2      1000022        21                       # GLSS   -->  Z1SS   GL                 
      1.34762311E-02    3      1000022         2        -2             # GLSS   -->  Z1SS   UP     UB          
      4.73009422E-03    3      1000022         1        -1             # GLSS   -->  Z1SS   DN     DB          
      4.73009190E-03    3      1000022         3        -3             # GLSS   -->  Z1SS   ST     SB          
      1.34759825E-02    3      1000022         4        -4             # GLSS   -->  Z1SS   CH     CB          
      1.97551167E-03    3      1000022         5        -5             # GLSS   -->  Z1SS   BT     BB          
      1.55911280E-03    3      1000022         6        -6             # GLSS   -->  Z1SS   TP     TB          
      4.16009483E-04    2      1000023        21                       # GLSS   -->  Z2SS   GL                 
      1.73145477E-02    3      1000023         2        -2             # GLSS   -->  Z2SS   UP     UB          
      1.40846819E-02    3      1000023         1        -1             # GLSS   -->  Z2SS   DN     DB          
      1.40846707E-02    3      1000023         3        -3             # GLSS   -->  Z2SS   ST     SB          
      1.73142198E-02    3      1000023         4        -4             # GLSS   -->  Z2SS   CH     CB          
      2.15170672E-03    3      1000023         5        -5             # GLSS   -->  Z2SS   BT     BB          
      4.09697022E-05    3      1000023         6        -6             # GLSS   -->  Z2SS   TP     TB          
      2.83992267E-03    2      1000025        21                       # GLSS   -->  Z3SS   GL                 
      4.97926303E-05    3      1000025         2        -2             # GLSS   -->  Z3SS   UP     UB          
      5.90280142E-05    3      1000025         1        -1             # GLSS   -->  Z3SS   DN     DB          
      5.90279706E-05    3      1000025         3        -3             # GLSS   -->  Z3SS   ST     SB          
      4.97914407E-05    3      1000025         4        -4             # GLSS   -->  Z3SS   CH     CB          
      7.84232840E-03    3      1000025         5        -5             # GLSS   -->  Z3SS   BT     BB          
      2.58943671E-03    2      1000035        21                       # GLSS   -->  Z4SS   GL                 
      7.33610126E-04    3      1000035         2        -2             # GLSS   -->  Z4SS   UP     UB          
      8.27386102E-04    3      1000035         1        -1             # GLSS   -->  Z4SS   DN     DB          
      8.27385287E-04    3      1000035         3        -3             # GLSS   -->  Z4SS   ST     SB          
      7.33593537E-04    3      1000035         4        -4             # GLSS   -->  Z4SS   CH     CB          
      8.10495950E-03    3      1000035         5        -5             # GLSS   -->  Z4SS   BT     BB          
      3.64197910E-01    2     -1000005         5                       # GLSS   -->  BB1    BT                 
      3.64197910E-01    2      1000005        -5                       # GLSS   -->  BT1    BB                 
#         PDG         Width
DECAY   1000002  9.43253613E+00   # UPL   decays
#          BR          NDA       ID1       ID2       ID3       ID4
      2.65025464E-03    2      1000022         2                       # UPL    -->  Z1SS   UP                 
      2.01964960E-01    2      1000023         2                       # UPL    -->  Z2SS   UP                 
      2.17688968E-03    2      1000025         2                       # UPL    -->  Z3SS   UP                 
      2.22672392E-02    2      1000035         2                       # UPL    -->  Z4SS   UP                 
      3.16756666E-01    2      1000021         2                       # UPL    -->  GLSS   UP                 
      4.29024041E-01    2      1000024         1                       # UPL    -->  W1SS+  DN                 
      2.51599513E-02    2      1000037         1                       # UPL    -->  W2SS+  DN                 
#         PDG         Width
DECAY   1000001  9.51234245E+00   # DNL   decays
#          BR          NDA       ID1       ID2       ID3       ID4
      1.62342861E-02    2      1000022         1                       # DNL    -->  Z1SS   DN                 
      1.77762687E-01    2      1000023         1                       # DNL    -->  Z2SS   DN                 
      3.65294912E-03    2      1000025         1                       # DNL    -->  Z3SS   DN                 
      2.92266514E-02    2      1000035         1                       # DNL    -->  Z4SS   DN                 
      3.48170489E-01    2      1000021         1                       # DNL    -->  GLSS   DN                 
      3.41120958E-01    2     -1000024         2                       # DNL    -->  W1SS-  UP                 
      8.38319808E-02    2     -1000037         2                       # DNL    -->  W2SS-  UP                 
#         PDG         Width
DECAY   1000003  9.51229382E+00   # STL   decays
#          BR          NDA       ID1       ID2       ID3       ID4
      1.62343718E-02    2      1000022         3                       # STL    -->  Z1SS   ST                 
      1.77763626E-01    2      1000023         3                       # STL    -->  Z2SS   ST                 
      3.65296868E-03    2      1000025         3                       # STL    -->  Z3SS   ST                 
      2.92268042E-02    2      1000035         3                       # STL    -->  Z4SS   ST                 
      3.48172545E-01    2      1000021         3                       # STL    -->  GLSS   ST                 
      3.41118753E-01    2     -1000024         4                       # STL    -->  W1SS-  CH                 
      8.38309303E-02    2     -1000037         4                       # STL    -->  W2SS-  CH                 
#         PDG         Width
DECAY   1000004  9.43222046E+00   # CHL   decays
#          BR          NDA       ID1       ID2       ID3       ID4
      2.65032216E-03    2      1000022         4                       # CHL    -->  Z1SS   CH                 
      2.01970011E-01    2      1000023         4                       # CHL    -->  Z2SS   CH                 
      2.17693811E-03    2      1000025         4                       # CHL    -->  Z3SS   CH                 
      2.22677160E-02    2      1000035         4                       # CHL    -->  Z4SS   CH                 
      3.16734225E-01    2      1000021         4                       # CHL    -->  GLSS   CH                 
      4.29039866E-01    2      1000024         3                       # CHL    -->  W1SS+  ST                 
      2.51609534E-02    2      1000037         3                       # CHL    -->  W2SS+  ST                 
#         PDG         Width
DECAY   1000005  5.93536425E+00   # BT1   decays
#          BR          NDA       ID1       ID2       ID3       ID4
      8.17331448E-02    2      1000022         5                       # BT1    -->  Z1SS   BT                 
      2.91503429E-01    2      1000023         5                       # BT1    -->  Z2SS   BT                 
      8.25674683E-02    2      1000025         5                       # BT1    -->  Z3SS   BT                 
      4.68026660E-02    2      1000035         5                       # BT1    -->  Z4SS   BT                 
      3.46797615E-01    2     -1000024         6                       # BT1    -->  W1SS-  TP                 
      1.50595680E-01    2     -1000037         6                       # BT1    -->  W2SS-  TP                 
#         PDG         Width
DECAY   1000006  3.64027238E+00   # TP1   decays
#          BR          NDA       ID1       ID2       ID3       ID4
      1.24287918E-01    2      1000022         6                       # TP1    -->  Z1SS   TP                 
      1.20942213E-01    2      1000023         6                       # TP1    -->  Z2SS   TP                 
      5.17116249E-01    2      1000024         5                       # TP1    -->  W1SS+  BT                 
      2.37653628E-01    2      1000037         5                       # TP1    -->  W2SS+  BT                 
#         PDG         Width
DECAY   2000002  3.83485556E+00   # UPR   decays
#          BR          NDA       ID1       ID2       ID3       ID4
      3.10410917E-01    2      1000022         2                       # UPR    -->  Z1SS   UP                 
      7.84666277E-03    2      1000023         2                       # UPR    -->  Z2SS   UP                 
      1.74040208E-03    2      1000025         2                       # UPR    -->  Z3SS   UP                 
      4.08131257E-03    2      1000035         2                       # UPR    -->  Z4SS   UP                 
      6.75920725E-01    2      1000021         2                       # UPR    -->  GLSS   UP                 
#         PDG         Width
DECAY   2000001  2.94399023E+00   # DNR   decays
#          BR          NDA       ID1       ID2       ID3       ID4
      1.01225473E-01    2      1000022         1                       # DNR    -->  Z1SS   DN                 
      2.55932892E-03    2      1000023         1                       # DNR    -->  Z2SS   DN                 
      5.68256422E-04    2      1000025         1                       # DNR    -->  Z3SS   DN                 
      1.33300666E-03    2      1000035         1                       # DNR    -->  Z4SS   DN                 
      8.94313872E-01    2      1000021         1                       # DNR    -->  GLSS   DN                 
#         PDG         Width
DECAY   2000003  2.94399261E+00   # STR   decays
#          BR          NDA       ID1       ID2       ID3       ID4
      1.01225398E-01    2      1000022         3                       # STR    -->  Z1SS   ST                 
      2.55932729E-03    2      1000023         3                       # STR    -->  Z2SS   ST                 
      5.68256190E-04    2      1000025         3                       # STR    -->  Z3SS   ST                 
      1.33300573E-03    2      1000035         3                       # STR    -->  Z4SS   ST                 
      8.94313991E-01    2      1000021         3                       # STR    -->  GLSS   ST                 
#         PDG         Width
DECAY   2000004  3.83452010E+00   # CHR   decays
#          BR          NDA       ID1       ID2       ID3       ID4
      3.10435474E-01    2      1000022         4                       # CHR    -->  Z1SS   CH                 
      7.84727931E-03    2      1000023         4                       # CHR    -->  Z2SS   CH                 
      1.74053351E-03    2      1000025         4                       # CHR    -->  Z3SS   CH                 
      4.08161758E-03    2      1000035         4                       # CHR    -->  Z4SS   CH                 
      6.75895154E-01    2      1000021         4                       # CHR    -->  GLSS   CH                 
#         PDG         Width
DECAY   2000005  5.32774115E+00   # BT2   decays
#          BR          NDA       ID1       ID2       ID3       ID4
      1.99515037E-02    2      1000022         5                       # BT2    -->  Z1SS   BT                 
      2.24864800E-02    2      1000023         5                       # BT2    -->  Z2SS   BT                 
      1.72916621E-01    2      1000025         5                       # BT2    -->  Z3SS   BT                 
      1.70674294E-01    2      1000035         5                       # BT2    -->  Z4SS   BT                 
      1.18381009E-01    2      1000021         5                       # BT2    -->  GLSS   BT                 
      1.84400715E-02    2     -1000024         6                       # BT2    -->  W1SS-  TP                 
      4.34105843E-01    2     -1000037         6                       # BT2    -->  W2SS-  TP                 
      4.30441834E-02    2          -24   1000006                       # BT2    -->  W-     TP1                
#         PDG         Width
DECAY   2000006  9.58870506E+00   # TP2   decays
#          BR          NDA       ID1       ID2       ID3       ID4
      2.20695898E-01    2      1000024         5                       # TP2    -->  W1SS+  BT                 
      2.83898622E-01    2      1000037         5                       # TP2    -->  W2SS+  BT                 
      3.54980938E-02    2           23   1000006                       # TP2    -->  Z0     TP1                
      1.75892189E-02    2           25   1000006                       # TP2    -->  HL0    TP1                
      1.38472188E-02    2      1000022         6                       # TP2    -->  Z1SS   TP                 
      7.08509535E-02    2      1000023         6                       # TP2    -->  Z2SS   TP                 
      9.19483751E-02    2      1000025         6                       # TP2    -->  Z3SS   TP                 
      2.65671641E-01    2      1000035         6                       # TP2    -->  Z4SS   TP                 
#         PDG         Width
DECAY   1000011  4.20684290E+00   # EL-   decays
#          BR          NDA       ID1       ID2       ID3       ID4
      8.34740549E-02    2      1000022        11                       # EL-    -->  Z1SS   E-                 
      3.34499985E-01    2      1000023        11                       # EL-    -->  Z2SS   E-                 
      1.06529798E-03    2      1000025        11                       # EL-    -->  Z3SS   E-                 
      1.38385836E-02    2      1000035        11                       # EL-    -->  Z4SS   E-                 
      4.98124719E-01    2     -1000024        12                       # EL-    -->  W1SS-  NUE                
      6.89974427E-02    2     -1000037        12                       # EL-    -->  W2SS-  NUE                
#         PDG         Width
DECAY   1000013  4.20684290E+00   # MUL-  decays
#          BR          NDA       ID1       ID2       ID3       ID4
      8.34740475E-02    2      1000022        13                       # MUL-   -->  Z1SS   MU-                
      3.34499896E-01    2      1000023        13                       # MUL-   -->  Z2SS   MU-                
      1.06529787E-03    2      1000025        13                       # MUL-   -->  Z3SS   MU-                
      1.38385789E-02    2      1000035        13                       # MUL-   -->  Z4SS   MU-                
      4.98124719E-01    2     -1000024        14                       # MUL-   -->  W1SS-  NUM                
      6.89974427E-02    2     -1000037        14                       # MUL-   -->  W2SS-  NUM                
#         PDG         Width
DECAY   1000015  2.69206953E+00   # TAU1- decays
#          BR          NDA       ID1       ID2       ID3       ID4
      5.17843664E-01    2      1000022        15                       # TAU1-  -->  Z1SS   TAU-               
      1.62824884E-01    2      1000023        15                       # TAU1-  -->  Z2SS   TAU-               
      2.14726850E-02    2      1000025        15                       # TAU1-  -->  Z3SS   TAU-               
      4.54188883E-03    2      1000035        15                       # TAU1-  -->  Z4SS   TAU-               
      2.87558228E-01    2     -1000024        16                       # TAU1-  -->  W1SS-  NUT                
      5.75868832E-03    2     -1000037        16                       # TAU1-  -->  W2SS-  NUT                
#         PDG         Width
DECAY   1000012  4.32185078E+00   # NUEL  decays
#          BR          NDA       ID1       ID2       ID3       ID4
      1.40516683E-01    2      1000022        12                       # NUEL   -->  Z1SS   NUE                
      2.13683933E-01    2      1000023        12                       # NUEL   -->  Z2SS   NUE                
      4.76259459E-03    2      1000025        12                       # NUEL   -->  Z3SS   NUE                
      2.71935351E-02    2      1000035        12                       # NUEL   -->  Z4SS   NUE                
      5.95082402E-01    2      1000024        11                       # NUEL   -->  W1SS+  E-                 
      1.87608488E-02    2      1000037        11                       # NUEL   -->  W2SS+  E-                 
#         PDG         Width
DECAY   1000014  4.32185030E+00   # NUML  decays
#          BR          NDA       ID1       ID2       ID3       ID4
      1.40516698E-01    2      1000022        14                       # NUML   -->  Z1SS   NUM                
      2.13683963E-01    2      1000023        14                       # NUML   -->  Z2SS   NUM                
      4.76259505E-03    2      1000025        14                       # NUML   -->  Z3SS   NUM                
      2.71935388E-02    2      1000035        14                       # NUML   -->  Z4SS   NUM                
      5.95082402E-01    2      1000024        13                       # NUML   -->  W1SS+  MU-                
      1.87608451E-02    2      1000037        13                       # NUML   -->  W2SS+  MU-                
#         PDG         Width
DECAY   1000016  4.26151943E+00   # NUTL  decays
#          BR          NDA       ID1       ID2       ID3       ID4
      1.29843950E-01    2      1000022        16                       # NUTL   -->  Z1SS   NUT                
      1.91761151E-01    2      1000023        16                       # NUTL   -->  Z2SS   NUT                
      3.47450678E-03    2      1000025        16                       # NUTL   -->  Z3SS   NUT                
      1.81039963E-02    2      1000035        16                       # NUTL   -->  Z4SS   NUT                
      5.98484039E-01    2      1000024        15                       # NUTL   -->  W1SS+  TAU-               
      5.82833067E-02    2      1000037        15                       # NUTL   -->  W2SS+  TAU-               
      5.45788907E-06    3      1000015        16       -15             # NUTL   -->  TAU1-  NUT    TAU+        
      5.45788907E-06    3      1000015        12       -11             # NUTL   -->  TAU1-  NUE    E+          
      5.45788907E-06    3      1000015        14       -13             # NUTL   -->  TAU1-  NUM    MU+         
      1.63736677E-05    3      1000015         2        -1             # NUTL   -->  TAU1-  UP     DB          
      1.63736677E-05    3      1000015         4        -3             # NUTL   -->  TAU1-  CH     SB          
#         PDG         Width
DECAY   2000011  1.89665377E+00   # ER-   decays
#          BR          NDA       ID1       ID2       ID3       ID4
      9.68161047E-01    2      1000022        11                       # ER-    -->  Z1SS   E-                 
      2.25749724E-02    2      1000023        11                       # ER-    -->  Z2SS   E-                 
      3.11038294E-03    2      1000025        11                       # ER-    -->  Z3SS   E-                 
      6.15361799E-03    2      1000035        11                       # ER-    -->  Z4SS   E-                 
#         PDG         Width
DECAY   2000013  1.89665365E+00   # MUR-  decays
#          BR          NDA       ID1       ID2       ID3       ID4
      9.68161047E-01    2      1000022        13                       # MUR-   -->  Z1SS   MU-                
      2.25749724E-02    2      1000023        13                       # MUR-   -->  Z2SS   MU-                
      3.11038340E-03    2      1000025        13                       # MUR-   -->  Z3SS   MU-                
      6.15361799E-03    2      1000035        13                       # MUR-   -->  Z4SS   MU-                
#         PDG         Width
DECAY   2000015  3.53588867E+00   # TAU2- decays
#          BR          NDA       ID1       ID2       ID3       ID4
      1.32837191E-01    2      1000022        15                       # TAU2-  -->  Z1SS   TAU-               
      2.84847766E-01    2      1000023        15                       # TAU2-  -->  Z2SS   TAU-               
      7.34427497E-02    2      1000025        15                       # TAU2-  -->  Z3SS   TAU-               
      6.93117976E-02    2      1000035        15                       # TAU2-  -->  Z4SS   TAU-               
      3.28110814E-01    2     -1000024        16                       # TAU2-  -->  W1SS-  NUT                
      1.11449726E-01    2     -1000037        16                       # TAU2-  -->  W2SS-  NUT                
#         PDG         Width
DECAY   1000023  6.34487424E-06   # Z2SS  decays
#          BR          NDA       ID1       ID2       ID3       ID4
      2.14099092E-03    2      1000022        22                       # Z2SS   -->  Z1SS   GM                 
      1.28208995E-01    3      1000022         2        -2             # Z2SS   -->  Z1SS   UP     UB          
      1.71727046E-01    3      1000022         1        -1             # Z2SS   -->  Z1SS   DN     DB          
      1.71727046E-01    3      1000022         3        -3             # Z2SS   -->  Z1SS   ST     SB          
      1.28208935E-01    3      1000022         4        -4             # Z2SS   -->  Z1SS   CH     CB          
      2.10913166E-01    3      1000022         5        -5             # Z2SS   -->  Z1SS   BT     BB          
      1.64599158E-02    3      1000022        11       -11             # Z2SS   -->  Z1SS   E-     E+          
      1.64599176E-02    3      1000022        13       -13             # Z2SS   -->  Z1SS   MU-    MU+         
      4.08258922E-02    3      1000022        15       -15             # Z2SS   -->  Z1SS   TAU-   TAU+        
      3.93479913E-02    3      1000022        12       -12             # Z2SS   -->  Z1SS   NUE    ANUE        
      3.93479913E-02    3      1000022        14       -14             # Z2SS   -->  Z1SS   NUM    ANUM        
      3.46321799E-02    3      1000022        16       -16             # Z2SS   -->  Z1SS   NUT    ANUT        
#         PDG         Width
DECAY   1000025  7.86971569E-01   # Z3SS  decays
#          BR          NDA       ID1       ID2       ID3       ID4
      2.26979950E-07    2      1000022        22                       # Z3SS   -->  Z1SS   GM                 
      3.96283582E-07    2      1000023        22                       # Z3SS   -->  Z2SS   GM                 
      3.18948358E-01    2      1000024       -24                       # Z3SS   -->  W1SS+  W-                 
      3.18948358E-01    2     -1000024        24                       # Z3SS   -->  W1SS-  W+                 
      1.56788737E-01    2      1000022        23                       # Z3SS   -->  Z1SS   Z0                 
      1.66302025E-01    2      1000023        23                       # Z3SS   -->  Z2SS   Z0                 
      2.07960511E-08    3      1000022         2        -2             # Z3SS   -->  Z1SS   UP     UB          
      1.24731052E-08    3      1000022         1        -1             # Z3SS   -->  Z1SS   DN     DB          
      1.24730999E-08    3      1000022         3        -3             # Z3SS   -->  Z1SS   ST     SB          
      2.07957935E-08    3      1000022         4        -4             # Z3SS   -->  Z1SS   CH     CB          
      3.33300741E-05    3      1000022         5        -5             # Z3SS   -->  Z1SS   BT     BB          
      1.90765050E-07    3      1000022        11       -11             # Z3SS   -->  Z1SS   E-     E+          
      1.90764993E-07    3      1000022        13       -13             # Z3SS   -->  Z1SS   MU-    MU+         
      5.45231051E-05    3      1000022        15       -15             # Z3SS   -->  Z1SS   TAU-   TAU+        
      1.73868060E-07    3      1000022        12       -12             # Z3SS   -->  Z1SS   NUE    ANUE        
      1.73868060E-07    3      1000022        14       -14             # Z3SS   -->  Z1SS   NUM    ANUM        
      2.68299658E-07    3      1000022        16       -16             # Z3SS   -->  Z1SS   NUT    ANUT        
      2.29614994E-08    3      1000023         2        -2             # Z3SS   -->  Z2SS   UP     UB          
      3.18496127E-08    3      1000023         1        -1             # Z3SS   -->  Z2SS   DN     DB          
      3.18495985E-08    3      1000023         3        -3             # Z3SS   -->  Z2SS   ST     SB          
      2.29612009E-08    3      1000023         4        -4             # Z3SS   -->  Z2SS   CH     CB          
      1.75591285E-05    3      1000023         5        -5             # Z3SS   -->  Z2SS   BT     BB          
      2.25976500E-08    3      1000023        11       -11             # Z3SS   -->  Z2SS   E-     E+          
      2.25976482E-08    3      1000023        13       -13             # Z3SS   -->  Z2SS   MU-    MU+         
      9.05719116E-06    3      1000023        15       -15             # Z3SS   -->  Z2SS   TAU-   TAU+        
      7.86417758E-08    3      1000023        12       -12             # Z3SS   -->  Z2SS   NUE    ANUE        
      7.86417758E-08    3      1000023        14       -14             # Z3SS   -->  Z2SS   NUM    ANUM        
      1.24518422E-07    3      1000023        16       -16             # Z3SS   -->  Z2SS   NUT    ANUT        
      3.22389565E-02    2      1000022        25                       # Z3SS   -->  Z1SS   HL0                
      6.65713428E-03    2      1000023        25                       # Z3SS   -->  Z2SS   HL0                
#         PDG         Width
DECAY   1000035  1.10634661E+00   # Z4SS  decays
#          BR          NDA       ID1       ID2       ID3       ID4
      1.01847782E-07    2      1000022        22                       # Z4SS   -->  Z1SS   GM                 
      5.95804508E-08    2      1000023        22                       # Z4SS   -->  Z2SS   GM                 
      9.18802723E-09    2      1000025        22                       # Z4SS   -->  Z3SS   GM                 
      3.62541795E-01    2      1000024       -24                       # Z4SS   -->  W1SS+  W-                 
      3.62541795E-01    2     -1000024        24                       # Z4SS   -->  W1SS-  W+                 
      4.18425463E-02    2      1000022        23                       # Z4SS   -->  Z1SS   Z0                 
      2.74840184E-02    2      1000023        23                       # Z4SS   -->  Z2SS   Z0                 
      1.56098764E-07    3      1000022         2        -2             # Z4SS   -->  Z1SS   UP     UB          
      2.49356987E-07    3      1000022         1        -1             # Z4SS   -->  Z1SS   DN     DB          
      2.49356873E-07    3      1000022         3        -3             # Z4SS   -->  Z1SS   ST     SB          
      1.56096803E-07    3      1000022         4        -4             # Z4SS   -->  Z1SS   CH     CB          
      2.06113309E-05    3      1000022         5        -5             # Z4SS   -->  Z1SS   BT     BB          
      1.84007888E-06    3      1000022        11       -11             # Z4SS   -->  Z1SS   E-     E+          
      1.84007843E-06    3      1000022        13       -13             # Z4SS   -->  Z1SS   MU-    MU+         
      4.61123054E-05    3      1000022        15       -15             # Z4SS   -->  Z1SS   TAU-   TAU+        
      3.16146952E-06    3      1000022        12       -12             # Z4SS   -->  Z1SS   NUE    ANUE        
      3.16146952E-06    3      1000022        14       -14             # Z4SS   -->  Z1SS   NUM    ANUM        
      4.90742468E-06    3      1000022        16       -16             # Z4SS   -->  Z1SS   NUT    ANUT        
      9.99050258E-07    3      1000023         2        -2             # Z4SS   -->  Z2SS   UP     UB          
      1.08568008E-06    3      1000023         1        -1             # Z4SS   -->  Z2SS   DN     DB          
      1.08567951E-06    3      1000023         3        -3             # Z4SS   -->  Z2SS   ST     SB          
      9.99037297E-07    3      1000023         4        -4             # Z4SS   -->  Z2SS   CH     CB          
      1.57728809E-05    3      1000023         5        -5             # Z4SS   -->  Z2SS   BT     BB          
      1.40927364E-06    3      1000023        11       -11             # Z4SS   -->  Z2SS   E-     E+          
      1.40927364E-06    3      1000023        13       -13             # Z4SS   -->  Z2SS   MU-    MU+         
      8.57007399E-06    3      1000023        15       -15             # Z4SS   -->  Z2SS   TAU-   TAU+        
      2.29864781E-06    3      1000023        12       -12             # Z4SS   -->  Z2SS   NUE    ANUE        
      2.29864781E-06    3      1000023        14       -14             # Z4SS   -->  Z2SS   NUM    ANUM        
      3.67706389E-06    3      1000023        16       -16             # Z4SS   -->  Z2SS   NUT    ANUT        
      4.77026845E-07    3      1000025         2        -2             # Z4SS   -->  Z3SS   UP     UB          
      6.19357138E-07    3      1000025         1        -1             # Z4SS   -->  Z3SS   DN     DB          
      6.19357138E-07    3      1000025         3        -3             # Z4SS   -->  Z3SS   ST     SB          
      4.77026845E-07    3      1000025         4        -4             # Z4SS   -->  Z3SS   CH     CB          
      3.75656185E-07    3      1000025         5        -5             # Z4SS   -->  Z3SS   BT     BB          
      1.40821996E-07    3      1000025        11       -11             # Z4SS   -->  Z3SS   E-     E+          
      1.40821996E-07    3      1000025        13       -13             # Z4SS   -->  Z3SS   MU-    MU+         
      1.53978135E-07    3      1000025        15       -15             # Z4SS   -->  Z3SS   TAU-   TAU+        
      2.74917113E-07    3      1000025        12       -12             # Z4SS   -->  Z3SS   NUE    ANUE        
      2.74917113E-07    3      1000025        14       -14             # Z4SS   -->  Z3SS   NUM    ANUM        
      2.73633560E-07    3      1000025        16       -16             # Z4SS   -->  Z3SS   NUT    ANUT        
      8.69589448E-02    2      1000022        25                       # Z4SS   -->  Z1SS   HL0                
      1.18504755E-01    2      1000023        25                       # Z4SS   -->  Z2SS   HL0                
#         PDG         Width
DECAY   1000024  4.28638050E-05   # W1SS+ decays
#          BR          NDA       ID1       ID2       ID3       ID4
      3.39938641E-01    3      1000022         2        -1             # W1SS+  -->  Z1SS   UP     DB          
      3.39938641E-01    3      1000022         4        -3             # W1SS+  -->  Z1SS   CH     SB          
      1.05332576E-01    3      1000022       -11        12             # W1SS+  -->  Z1SS   E+     NUE         
      1.05332576E-01    3      1000022       -13        14             # W1SS+  -->  Z1SS   MU+    NUM         
      1.09457605E-01    3      1000022       -15        16             # W1SS+  -->  Z1SS   TAU+   NUT         
#         PDG         Width
DECAY   1000037  9.54643250E-01   # W2SS+ decays
#          BR          NDA       ID1       ID2       ID3       ID4
      3.69206759E-07    3      1000022         2        -1             # W2SS+  -->  Z1SS   UP     DB          
      3.69206163E-07    3      1000022         4        -3             # W2SS+  -->  Z1SS   CH     SB          
      3.44014074E-06    3      1000022       -11        12             # W2SS+  -->  Z1SS   E+     NUE         
      3.44014074E-06    3      1000022       -13        14             # W2SS+  -->  Z1SS   MU+    NUM         
      5.06713550E-05    3      1000022       -15        16             # W2SS+  -->  Z1SS   TAU+   NUT         
      9.53205600E-02    2      1000022        24                       # W2SS+  -->  Z1SS   W+                 
      1.08575910E-06    3      1000023         2        -1             # W2SS+  -->  Z2SS   UP     DB          
      1.08575694E-06    3      1000023         4        -3             # W2SS+  -->  Z2SS   CH     SB          
      2.44474745E-06    3      1000023       -11        12             # W2SS+  -->  Z2SS   E+     NUE         
      2.44474745E-06    3      1000023       -13        14             # W2SS+  -->  Z2SS   MU+    NUM         
      1.84694836E-05    3      1000023       -15        16             # W2SS+  -->  Z2SS   TAU+   NUT         
      4.27920133E-01    2      1000023        24                       # W2SS+  -->  Z2SS   W+                 
      2.35867810E-06    3      1000025         2        -1             # W2SS+  -->  Z3SS   UP     DB          
      2.35867810E-06    3      1000025         4        -3             # W2SS+  -->  Z3SS   CH     SB          
      7.85073837E-07    3      1000025       -11        12             # W2SS+  -->  Z3SS   E+     NUE         
      7.85073837E-07    3      1000025       -13        14             # W2SS+  -->  Z3SS   MU+    NUM         
      8.31630075E-07    3      1000025       -15        16             # W2SS+  -->  Z3SS   TAU+   NUT         
      1.39842404E-14    3      1000035       -11        12             # W2SS+  -->  Z4SS   E+     NUE         
      1.39842404E-14    3      1000035       -13        14             # W2SS+  -->  Z4SS   MU+    NUM         
      3.01795781E-01    2      1000024        23                       # W2SS+  -->  W1SS+  Z0                 
      9.89895170E-07    3      1000024         1        -1             # W2SS+  -->  W1SS+  DN     DB          
      9.89882324E-07    3      1000024         3        -3             # W2SS+  -->  W1SS+  ST     SB          
      2.46925720E-06    3      1000024         2        -2             # W2SS+  -->  W1SS+  UP     UB          
      2.46925606E-06    3      1000024         4        -4             # W2SS+  -->  W1SS+  CH     CB          
      4.36359414E-06    3      1000024        12       -12             # W2SS+  -->  W1SS+  NUE    ANUE        
      4.36359414E-06    3      1000024        14       -14             # W2SS+  -->  W1SS+  NUM    ANUM        
      2.31400409E-05    3      1000024        16       -16             # W2SS+  -->  W1SS+  NUT    ANUT        
      1.86174975E-06    3      1000024        11       -11             # W2SS+  -->  W1SS+  E-     E+          
      1.86174975E-06    3      1000024        13       -13             # W2SS+  -->  W1SS+  MU-    MU+         
      3.00230954E-06    3      1000024        15       -15             # W2SS+  -->  W1SS+  TAU-   TAU+        
      1.74826905E-01    2      1000024        25                       # W2SS+  -->  W1SS+  HL0                
#         PDG         Width
DECAY        25  4.30018920E-03   # HL0   decays
#          BR          NDA       ID1       ID2       ID3       ID4
      5.07215336E-09    2           11       -11                       # HL0    -->  E-     E+                 
      2.14154250E-04    2           13       -13                       # HL0    -->  MU-    MU+                
      6.12382963E-02    2           15       -15                       # HL0    -->  TAU-   TAU+               
      6.37192170E-06    2            1        -1                       # HL0    -->  DN     DB                 
      2.57457537E-03    2            3        -3                       # HL0    -->  ST     SB                 
      8.51231098E-01    2            5        -5                       # HL0    -->  BT     BB                 
      1.71963620E-06    2            2        -2                       # HL0    -->  UP     UB                 
      3.26747298E-02    2            4        -4                       # HL0    -->  CH     CB                 
      1.36513880E-03    2           22        22                       # HL0    -->  GM     GM                 
      3.17030102E-02    2           21        21                       # HL0    -->  GL     GL                 
      1.01133739E-03    3           24        11       -12             # HL0    -->  W+     E-     ANUE        
      1.01133739E-03    3           24        13       -14             # HL0    -->  W+     MU-    ANUM        
      1.01133739E-03    3           24        15       -16             # HL0    -->  W+     TAU-   ANUT        
      3.03401216E-03    3           24        -2         1             # HL0    -->  W+     UB     DN          
      3.03401216E-03    3           24        -4         3             # HL0    -->  W+     CB     ST          
      1.01133739E-03    3          -24       -11        12             # HL0    -->  W-     E+     NUE         
      1.01133739E-03    3          -24       -13        14             # HL0    -->  W-     MU+    NUM         
      1.01133739E-03    3          -24       -15        16             # HL0    -->  W-     TAU+   NUT         
      3.03401216E-03    3          -24         2        -1             # HL0    -->  W-     UP     DB          
      3.03401216E-03    3          -24         4        -3             # HL0    -->  W-     CH     SB          
      5.38267741E-05    3           23        12       -12             # HL0    -->  Z0     NUE    ANUE        
      5.38267741E-05    3           23        14       -14             # HL0    -->  Z0     NUM    ANUM        
      5.38267741E-05    3           23        16       -16             # HL0    -->  Z0     NUT    ANUT        
      2.70904748E-05    3           23        11       -11             # HL0    -->  Z0     E-     E+          
      2.70904748E-05    3           23        13       -13             # HL0    -->  Z0     MU-    MU+         
      2.70904748E-05    3           23        15       -15             # HL0    -->  Z0     TAU-   TAU+        
      9.28096633E-05    3           23         2        -2             # HL0    -->  Z0     UP     UB          
      9.28096633E-05    3           23         4        -4             # HL0    -->  Z0     CH     CB          
      1.19561708E-04    3           23         1        -1             # HL0    -->  Z0     DN     DB          
      1.19561708E-04    3           23         3        -3             # HL0    -->  Z0     ST     SB          
      1.19561708E-04    3           23         5        -5             # HL0    -->  Z0     BT     BB          
#         PDG         Width
DECAY        35  9.65254116E+00   # HH0   decays
#          BR          NDA       ID1       ID2       ID3       ID4
      9.80975212E-09    2           11       -11                       # HH0    -->  E-     E+                 
      4.14185197E-04    2           13       -13                       # HH0    -->  MU-    MU+                
      1.18610531E-01    2           15       -15                       # HH0    -->  TAU-   TAU+               
      1.21355724E-05    2            1        -1                       # HH0    -->  DN     DB                 
      4.90338448E-03    2            3        -3                       # HH0    -->  ST     SB                 
      8.29725742E-01    2            5        -5                       # HH0    -->  BT     BB                 
      1.79831735E-12    2            2        -2                       # HH0    -->  UP     UB                 
      2.89173361E-08    2            4        -4                       # HH0    -->  CH     CB                 
      9.42947645E-06    2            6        -6                       # HH0    -->  TP     TB                 
      1.65145394E-07    2           22        22                       # HH0    -->  GM     GM                 
      3.32907221E-05    2           21        21                       # HH0    -->  GL     GL                 
      5.10978498E-06    2           24       -24                       # HH0    -->  W+     W-                 
      2.40096688E-06    2           23        23                       # HH0    -->  Z0     Z0                 
      3.69913410E-03    2      1000022   1000022                       # HH0    -->  Z1SS   Z1SS               
      1.15541006E-02    2      1000022   1000023                       # HH0    -->  Z1SS   Z2SS               
      3.95606505E-03    2      1000022   1000025                       # HH0    -->  Z1SS   Z3SS               
      6.71941414E-03    2      1000023   1000023                       # HH0    -->  Z2SS   Z2SS               
      2.03390606E-02    2      1000024  -1000024                       # HH0    -->  W1SS+  W1SS-              
      1.57737977E-05    2           25        25                       # HH0    -->  HL0    HL0                
#         PDG         Width
DECAY        36  1.00156450E+01   # HA0   decays
#          BR          NDA       ID1       ID2       ID3       ID4
      9.39346201E-09    2           11       -11                       # HA0    -->  E-     E+                 
      3.96608841E-04    2           13       -13                       # HA0    -->  MU-    MU+                
      1.13588892E-01    2           15       -15                       # HA0    -->  TAU-   TAU+               
      1.16213696E-05    2            1        -1                       # HA0    -->  DN     DB                 
      4.69562225E-03    2            3        -3                       # HA0    -->  ST     SB                 
      7.94910073E-01    2            5        -5                       # HA0    -->  BT     BB                 
      1.45252593E-12    2            2        -2                       # HA0    -->  UP     UB                 
      2.33777406E-08    2            4        -4                       # HA0    -->  CH     CB                 
      3.25832400E-04    2            6        -6                       # HA0    -->  TP     TB                 
      8.22197066E-08    2           22        22                       # HA0    -->  GM     GM                 
      4.45177793E-05    2           21        21                       # HA0    -->  GL     GL                 
      4.44473699E-03    2      1000022   1000022                       # HA0    -->  Z1SS   Z1SS               
      1.72253251E-02    2      1000022   1000023                       # HA0    -->  Z1SS   Z2SS               
      2.96152342E-04    2      1000022   1000025                       # HA0    -->  Z1SS   Z3SS               
      1.59862097E-02    2      1000023   1000023                       # HA0    -->  Z2SS   Z2SS               
      4.80707102E-02    2      1000024  -1000024                       # HA0    -->  W1SS+  W1SS-              
      3.65351912E-06    2           25        23                       # HA0    -->  HL0    Z0                 
#         PDG         Width
DECAY        37  5.90784502E+00   # H+    decays
#          BR          NDA       ID1       ID2       ID3       ID4
      1.65005645E-08    2           12       -11                       # H+     -->  NUE    E+                 
      6.96683477E-04    2           14       -13                       # H+     -->  NUM    MU+                
      1.99531078E-01    2           16       -15                       # H+     -->  NUT    TAU+               
      1.85801291E-05    2            2        -1                       # H+     -->  UP     DB                 
      7.50713097E-03    2            4        -3                       # H+     -->  CH     SB                 
      7.49226809E-01    2            6        -5                       # H+     -->  TP     BB                 
      4.16585431E-02    2      1000024   1000022                       # H+     -->  W1SS+  Z1SS               
      9.79392673E-04    2      1000024   1000023                       # H+     -->  W1SS+  Z2SS               
      3.74167867E-04    2      1000037   1000022                       # H+     -->  W2SS+  Z1SS               
      7.61996853E-06    2           25        24                       # H+     -->  HL0    W+                 
