  65
  401    871.3146    0.77855E-25
  402    867.3695    0.76619E-25
  403    871.3147    0.77856E-25
  404    867.3706    0.76619E-25
  405    719.8144    0.98794E-25
  406    638.5937    0.14212E-24
  407    871.3146    0.77855E-25
  408    867.3695    0.76619E-25
  409    871.3147    0.77856E-25
  410    867.3706    0.76619E-25
  411    719.8144    0.98794E-25
  412    638.5937    0.14212E-24
  413    841.0184    0.14896E-23
  414    842.9633    0.37143E-24
  415    841.0184    0.14896E-23
  416    842.9645    0.37143E-24
  417    789.2180    0.70325E-25
  418    803.1089    0.49944E-25
  419    841.0184    0.14896E-23
  420    842.9633    0.37143E-24
  421    841.0184    0.14896E-23
  422    842.9645    0.37143E-24
  423    789.2180    0.70325E-25
  424    803.1089    0.49944E-25
  425    410.2049    0.41651E-24
  426    401.4610    0.43401E-24
  427    410.2050    0.41651E-24
  428    401.4610    0.43401E-24
  429    192.5297    0.52415E-23
  430    358.0679    0.32821E-24
  431    410.2049    0.41651E-24
  432    401.4610    0.43401E-24
  433    410.2050    0.41651E-24
  434    401.4610    0.43401E-24
  435    192.5297    0.52415E-23
  436    358.0679    0.32821E-24
  437    351.2078    0.56724E-24
  438      0.0000    0.10000E+31
  439    351.2078    0.56724E-24
  440      0.0000    0.10000E+31
  441    392.1848    0.28767E-24
  442      0.0000    0.10000E+31
  443    351.2078    0.56724E-24
  444      0.0000    0.10000E+31
  445    351.2078    0.56724E-24
  446      0.0000    0.10000E+31
  447    392.1848    0.28767E-24
  448      0.0000    0.10000E+31
  449    891.7811    0.10873E-24
  450    152.5767    0.10000E+31
  451    286.3866    0.38409E-23
  452   -470.0949    0.22620E-24
  453    485.9081    0.20988E-24
  454    286.7209    0.40811E-23
  455    486.0893    0.22227E-24
  456    286.7209    0.40811E-23
  457    486.0893    0.22227E-24
  203    113.1119    0.15659E-21
  204    390.9805    0.41313E-25
  205    388.4622    0.41553E-25
  206    400.6136    0.61503E-25
  207    400.6136    0.61503E-25
  458      0.0000    0.10000E+31
    6    172.5000    0.57395E-24
   12    172.5000    0.57395E-24
   6
   401  0.16856534E-01     0   450     1     0     0     0
   401  0.30746102E+00     0   451     1     0     0     0
   401  0.13423675E-02     0   452     1     0     0     0
   401  0.19615756E-01     0   453     1     0     0     0
   401  0.60268688E+00     0   456     2     0     0     0
   401  0.52037399E-01     0   457     2     0     0     0
   6
   402  0.10290437E-01     0   450     2     0     0     0
   402  0.31320021E+00     0   451     2     0     0     0
   402  0.78055734E-03     0   452     2     0     0     0
   402  0.15163311E-01     0   453     2     0     0     0
   402  0.64043248E+00     0   454     1     0     0     0
   402  0.20133048E-01     0   455     1     0     0     0
   6
   403  0.16856603E-01     0   450     3     0     0     0
   403  0.30746230E+00     0   451     3     0     0     0
   403  0.13423732E-02     0   452     3     0     0     0
   403  0.19615840E-01     0   453     3     0     0     0
   403  0.60268581E+00     0   456     4     0     0     0
   403  0.52037094E-01     0   457     4     0     0     0
   6
   404  0.10290401E-01     0   450     4     0     0     0
   404  0.31319892E+00     0   451     4     0     0     0
   404  0.78055257E-03     0   452     4     0     0     0
   404  0.15163212E-01     0   453     4     0     0     0
   404  0.64043379E+00     0   454     3     0     0     0
   404  0.20133127E-01     0   455     3     0     0     0
   7
   405  0.75404055E-01     0   450     5     0     0     0
   405  0.27057874E+00     0   451     5     0     0     0
   405  0.10607592E+00     0   452     5     0     0     0
   405  0.60347952E-01     0   453     5     0     0     0
   405  0.40175092E+00     0   456     6     0     0     0
   405  0.85718267E-01     0   457     6     0     0     0
   405  0.12411388E-03     0   199   406     0     0     0
   4
   406  0.19259608E+00     0   450     6     0     0     0
   406  0.14540935E+00     0   451     6     0     0     0
   406  0.43037450E+00     0   454     5     0     0     0
   406  0.23162009E+00     0   455     5     0     0     0
   6
   407  0.16856534E-01     0   450     7     0     0     0
   407  0.30746102E+00     0   451     7     0     0     0
   407  0.13423675E-02     0   452     7     0     0     0
   407  0.19615756E-01     0   453     7     0     0     0
   407  0.60268688E+00     0   454     8     0     0     0
   407  0.52037399E-01     0   455     8     0     0     0
   6
   408  0.10290437E-01     0   450     8     0     0     0
   408  0.31320021E+00     0   451     8     0     0     0
   408  0.78055734E-03     0   452     8     0     0     0
   408  0.15163311E-01     0   453     8     0     0     0
   408  0.64043248E+00     0   456     7     0     0     0
   408  0.20133048E-01     0   457     7     0     0     0
   6
   409  0.16856603E-01     0   450     9     0     0     0
   409  0.30746230E+00     0   451     9     0     0     0
   409  0.13423732E-02     0   452     9     0     0     0
   409  0.19615840E-01     0   453     9     0     0     0
   409  0.60268581E+00     0   454    10     0     0     0
   409  0.52037094E-01     0   455    10     0     0     0
   6
   410  0.10290401E-01     0   450    10     0     0     0
   410  0.31319892E+00     0   451    10     0     0     0
   410  0.78055257E-03     0   452    10     0     0     0
   410  0.15163212E-01     0   453    10     0     0     0
   410  0.64043379E+00     0   456     9     0     0     0
   410  0.20133127E-01     0   457     9     0     0     0
   7
   411  0.75404055E-01     0   450    11     0     0     0
   411  0.27057874E+00     0   451    11     0     0     0
   411  0.10607592E+00     0   452    11     0     0     0
   411  0.60347952E-01     0   453    11     0     0     0
   411  0.40175092E+00     0   454    12     0     0     0
   411  0.85718267E-01     0   455    12     0     0     0
   411  0.12411388E-03     0   198   412     0     0     0
   4
   412  0.19259608E+00     0   450    12     0     0     0
   412  0.14540935E+00     0   451    12     0     0     0
   412  0.43037450E+00     0   456    11     0     0     0
   412  0.23162009E+00     0   457    11     0     0     0
   4
   413  0.99242646E+00     0   450     1     0     0     0
   413  0.24221744E-02     0   451     1     0     0     0
   413  0.11983364E-02     0   452     1     0     0     0
   413  0.39530671E-02     0   453     1     0     0     0
   4
   414  0.99240273E+00     0   450     2     0     0     0
   414  0.24242855E-02     0   451     2     0     0     0
   414  0.12029548E-02     0   452     2     0     0     0
   414  0.39700065E-02     0   453     2     0     0     0
   4
   415  0.99242646E+00     0   450     3     0     0     0
   415  0.24221744E-02     0   451     3     0     0     0
   415  0.11983364E-02     0   452     3     0     0     0
   415  0.39530671E-02     0   453     3     0     0     0
   4
   416  0.99240279E+00     0   450     4     0     0     0
   416  0.24242841E-02     0   451     4     0     0     0
   416  0.12029514E-02     0   452     4     0     0     0
   416  0.39699934E-02     0   453     4     0     0     0
   7
   417  0.94438158E-02     0   450     5     0     0     0
   417  0.66133589E-01     0   451     5     0     0     0
   417  0.12678400E+00     0   452     5     0     0     0
   417  0.14157063E+00     0   453     5     0     0     0
   417  0.91089234E-01     0   456     6     0     0     0
   417  0.45767272E+00     0   457     6     0     0     0
   417  0.10730604E+00     0   199   406     0     0     0
   9
   418  0.21508323E+00     0   454     5     0     0     0
   418  0.25457177E+00     0   455     5     0     0     0
   418  0.70467345E-01     0   200   406     0     0     0
   418  0.26646923E-01     0   203   406     0     0     0
   418  0.12855725E-02     0   198   405     0     0     0
   418  0.25049264E-01     0   450     6     0     0     0
   418  0.81177458E-01     0   451     6     0     0     0
   418  0.92066132E-01     0   452     6     0     0     0
   418  0.23365235E+00     0   453     6     0     0     0
   4
   419  0.99242646E+00     0   450     7     0     0     0
   419  0.24221744E-02     0   451     7     0     0     0
   419  0.11983364E-02     0   452     7     0     0     0
   419  0.39530671E-02     0   453     7     0     0     0
   4
   420  0.99240273E+00     0   450     8     0     0     0
   420  0.24242855E-02     0   451     8     0     0     0
   420  0.12029548E-02     0   452     8     0     0     0
   420  0.39700065E-02     0   453     8     0     0     0
   4
   421  0.99242646E+00     0   450     9     0     0     0
   421  0.24221744E-02     0   451     9     0     0     0
   421  0.11983364E-02     0   452     9     0     0     0
   421  0.39530671E-02     0   453     9     0     0     0
   4
   422  0.99240279E+00     0   450    10     0     0     0
   422  0.24242841E-02     0   451    10     0     0     0
   422  0.12029514E-02     0   452    10     0     0     0
   422  0.39699934E-02     0   453    10     0     0     0
   7
   423  0.94438158E-02     0   450    11     0     0     0
   423  0.66133589E-01     0   451    11     0     0     0
   423  0.12678400E+00     0   452    11     0     0     0
   423  0.14157063E+00     0   453    11     0     0     0
   423  0.91089234E-01     0   454    12     0     0     0
   423  0.45767272E+00     0   455    12     0     0     0
   423  0.10730604E+00     0   198   412     0     0     0
   9
   424  0.21508323E+00     0   456    11     0     0     0
   424  0.25457177E+00     0   457    11     0     0     0
   424  0.70467345E-01     0   200   412     0     0     0
   424  0.26646923E-01     0   203   412     0     0     0
   424  0.12855725E-02     0   199   411     0     0     0
   424  0.25049264E-01     0   450    12     0     0     0
   424  0.81177458E-01     0   451    12     0     0     0
   424  0.92066132E-01     0   452    12     0     0     0
   424  0.23365235E+00     0   453    12     0     0     0
   3
   425  0.22316913E+00     0   450   121     0     0     0
   425  0.27749026E+00     0   451   121     0     0     0
   425  0.49934059E+00     0   456   122     0     0     0
   3
   426  0.26247787E+00     0   450   122     0     0     0
   426  0.22953632E+00     0   451   122     0     0     0
   426  0.50798583E+00     0   454   121     0     0     0
   3
   427  0.22316904E+00     0   450   123     0     0     0
   427  0.27749020E+00     0   451   123     0     0     0
   427  0.49934074E+00     0   456   124     0     0     0
   3
   428  0.26247796E+00     0   450   124     0     0     0
   428  0.22953638E+00     0   451   124     0     0     0
   428  0.50798565E+00     0   454   123     0     0     0
   1
   429  0.10000000E+01     0   450   125     0     0     0
   4
   430  0.16200496E+00     0   450   126     0     0     0
   430  0.83327986E-01     0   451   126     0     0     0
   430  0.19807000E+00     0   454   125     0     0     0
   430  0.55659711E+00     0   198   429     0     0     0
   3
   431  0.22316913E+00     0   450   127     0     0     0
   431  0.27749026E+00     0   451   127     0     0     0
   431  0.49934059E+00     0   454   128     0     0     0
   3
   432  0.26247787E+00     0   450   128     0     0     0
   432  0.22953632E+00     0   451   128     0     0     0
   432  0.50798583E+00     0   456   127     0     0     0
   3
   433  0.22316904E+00     0   450   129     0     0     0
   433  0.27749020E+00     0   451   129     0     0     0
   433  0.49934074E+00     0   454   130     0     0     0
   3
   434  0.26247796E+00     0   450   130     0     0     0
   434  0.22953638E+00     0   451   130     0     0     0
   434  0.50798565E+00     0   456   129     0     0     0
   1
   435  0.10000000E+01     0   450   131     0     0     0
   4
   436  0.16200496E+00     0   450   132     0     0     0
   436  0.83327986E-01     0   451   132     0     0     0
   436  0.19807000E+00     0   456   131     0     0     0
   436  0.55659711E+00     0   199   435     0     0     0
   2
   437  0.99950200E+00     0   450   121     0     0     0
   437  0.49798173E-03     0   451   121     0     0     0
   0
   2
   439  0.99950200E+00     0   450   123     0     0     0
   439  0.49798115E-03     0   451   123     0     0     0
   0
   5
   441  0.19971350E+00     0   450   125     0     0     0
   441  0.10874850E+00     0   451   125     0     0     0
   441  0.17025621E+00     0   456   126     0     0     0
   441  0.34812748E+00     0   200   429     0     0     0
   441  0.17315432E+00     0   203   429     0     0     0
   0
   2
   443  0.99950200E+00     0   450   127     0     0     0
   443  0.49798173E-03     0   451   127     0     0     0
   0
   2
   445  0.99950200E+00     0   450   129     0     0     0
   445  0.49798115E-03     0   451   129     0     0     0
   0
   5
   447  0.19971350E+00     0   450   131     0     0     0
   447  0.10874850E+00     0   451   131     0     0     0
   447  0.17025621E+00     0   454   132     0     0     0
   447  0.34812748E+00     0   200   435     0     0     0
   447  0.17315432E+00     0   203   435     0     0     0
   0
  32
   449  0.88559091E-03     0   454     5    12     0     0
   449  0.88559091E-03     0   456     6    11     0     0
   449  0.47938779E-03     0   455     5    12     0     0
   449  0.47938779E-03     0   457     6    11     0     0
   449  0.17273596E-03     0   450     6    12     0     0
   449  0.47238264E-03     0   451     6    12     0     0
   449  0.61899344E-04     0   452    13     0     0     0
   449  0.86177613E-04     0   452     6    12     0     0
   449  0.46524940E-04     0   453    13     0     0     0
   449  0.53409365E-03     0   453     6    12     0     0
   449  0.50045648E-02     0   408     2     0     0     0
   449  0.50045648E-02     0   402     8     0     0     0
   449  0.35335065E-02     0   407     1     0     0     0
   449  0.35335065E-02     0   401     7     0     0     0
   449  0.19462330E-01     0   420     2     0     0     0
   449  0.19462330E-01     0   414     8     0     0     0
   449  0.20996803E-01     0   419     1     0     0     0
   449  0.20996803E-01     0   413     7     0     0     0
   449  0.35333245E-02     0   409     3     0     0     0
   449  0.35333245E-02     0   403     9     0     0     0
   449  0.20996654E-01     0   421     3     0     0     0
   449  0.20996654E-01     0   415     9     0     0     0
   449  0.49966746E-02     0   410     4     0     0     0
   449  0.49966746E-02     0   404    10     0     0     0
   449  0.19454360E-01     0   422     4     0     0     0
   449  0.19454360E-01     0   416    10     0     0     0
   449  0.20165989E+00     0   411     5     0     0     0
   449  0.20165989E+00     0   405    11     0     0     0
   449  0.84747523E-01     0   423     5     0     0     0
   449  0.84747523E-01     0   417    11     0     0     0
   449  0.11356246E+00     0   412     6     0     0     0
   449  0.11356246E+00     0   406    12     0     0     0
   0
  11
   451  0.99381646E-02     0   450   200     0     0     0
   451  0.12586213E-04     0   450     5    11     0     0
   451  0.19042031E-04     0   450   121   127     0     0
   451  0.19042014E-04     0   450   123   129     0     0
   451  0.16813463E-04     0   450   125   131     0     0
   451  0.21429758E-04     0   450   122   128     0     0
   451  0.21429758E-04     0   450   124   130     0     0
   451  0.44327251E-04     0   450   126   132     0     0
   451  0.47137503E-01     0   450   203     0     0     0
   451  0.47138482E+00     0   429   131     0     0     0
   451  0.47138482E+00     0   435   125     0     0     0
  27
   452  0.19701412E+00     0   454   199     0     0     0
   452  0.19701412E+00     0   456   198     0     0     0
   452  0.79358809E-01     0   450   200     0     0     0
   452  0.16152284E+00     0   451   200     0     0     0
   452  0.18622792E-03     0   450     5    11     0     0
   452  0.44292909E-04     0   450   125   131     0     0
   452  0.33570548E-04     0   451     5    11     0     0
   452  0.17573334E-01     0   450   203     0     0     0
   452  0.68141120E-02     0   451   203     0     0     0
   452  0.35603571E-04     0   425   127     0     0     0
   452  0.35603571E-04     0   431   121     0     0     0
   452  0.35603458E-04     0   427   129     0     0     0
   452  0.35603458E-04     0   433   123     0     0     0
   452  0.18901455E-03     0   437   127     0     0     0
   452  0.18901455E-03     0   443   121     0     0     0
   452  0.18901449E-03     0   439   129     0     0     0
   452  0.18901449E-03     0   445   123     0     0     0
   452  0.14519024E+00     0   429   131     0     0     0
   452  0.14519024E+00     0   435   125     0     0     0
   452  0.23562944E-01     0   441   131     0     0     0
   452  0.23562944E-01     0   447   125     0     0     0
   452  0.23081688E-03     0   426   128     0     0     0
   452  0.23081688E-03     0   432   122     0     0     0
   452  0.23081688E-03     0   428   130     0     0     0
   452  0.23081688E-03     0   434   124     0     0     0
   452  0.55523502E-03     0   430   132     0     0     0
   452  0.55523502E-03     0   436   126     0     0     0
  27
   453  0.22332481E+00     0   454   199     0     0     0
   453  0.22332481E+00     0   456   198     0     0     0
   453  0.20050516E-01     0   450   200     0     0     0
   453  0.13331853E-01     0   451   200     0     0     0
   453  0.18469004E-03     0   450     5    11     0     0
   453  0.44583136E-04     0   450   125   131     0     0
   453  0.34059940E-04     0   451     5    11     0     0
   453  0.67113474E-01     0   450   203     0     0     0
   453  0.15005782E+00     0   451   203     0     0     0
   453  0.15757720E-02     0   425   127     0     0     0
   453  0.15757720E-02     0   431   121     0     0     0
   453  0.15757683E-02     0   427   129     0     0     0
   453  0.15757683E-02     0   433   123     0     0     0
   453  0.74419513E-03     0   437   127     0     0     0
   453  0.74419513E-03     0   443   121     0     0     0
   453  0.74419490E-03     0   439   129     0     0     0
   453  0.74419490E-03     0   445   123     0     0     0
   453  0.98240986E-01     0   429   131     0     0     0
   453  0.98240986E-01     0   435   125     0     0     0
   453  0.32739893E-01     0   441   131     0     0     0
   453  0.32739893E-01     0   447   125     0     0     0
   453  0.38412828E-02     0   426   128     0     0     0
   453  0.38412828E-02     0   432   122     0     0     0
   453  0.38412828E-02     0   428   130     0     0     0
   453  0.38412828E-02     0   434   124     0     0     0
   453  0.79633100E-02     0   430   132     0     0     0
   453  0.79633100E-02     0   436   126     0     0     0
   5
   454  0.43200434E-04     0   450   127   122     0     0
   454  0.43200420E-04     0   450   129   124     0     0
   454  0.64946667E-04     0   450   131   126     0     0
   454  0.61045870E-01     0   450   198     0     0     0
   454  0.93880278E+00     0   435   126     0     0     0
  13
   455  0.32327109E-04     0   450   131   126     0     0
   455  0.80072179E-01     0   450   198     0     0     0
   455  0.12101149E-04     0   451   131   126     0     0
   455  0.23222421E+00     0   451   198     0     0     0
   455  0.35150752E-02     0   426   127     0     0     0
   455  0.35150733E-02     0   428   129     0     0     0
   455  0.93357235E-01     0   430   131     0     0     0
   455  0.72380439E-02     0   431   122     0     0     0
   455  0.72380332E-02     0   433   124     0     0     0
   455  0.15826148E+00     0   435   126     0     0     0
   455  0.34123290E-01     0   447   126     0     0     0
   455  0.20731241E+00     0   454   200     0     0     0
   455  0.17309858E+00     0   454   203     0     0     0
   5
   456  0.43200434E-04     0   450   121   128     0     0
   456  0.43200420E-04     0   450   123   130     0     0
   456  0.64946667E-04     0   450   125   132     0     0
   456  0.61045870E-01     0   450   199     0     0     0
   456  0.93880278E+00     0   429   132     0     0     0
  13
   457  0.32327109E-04     0   450   125   132     0     0
   457  0.80072179E-01     0   450   199     0     0     0
   457  0.12101149E-04     0   451   125   132     0     0
   457  0.23222421E+00     0   451   199     0     0     0
   457  0.35150752E-02     0   432   121     0     0     0
   457  0.35150733E-02     0   434   123     0     0     0
   457  0.93357235E-01     0   436   125     0     0     0
   457  0.72380439E-02     0   425   128     0     0     0
   457  0.72380332E-02     0   427   130     0     0     0
   457  0.15826148E+00     0   429   132     0     0     0
   457  0.34123290E-01     0   441   132     0     0     0
   457  0.20731241E+00     0   456   200     0     0     0
   457  0.17309858E+00     0   456   203     0     0     0
  28
   203  0.20825161E-03     0   123   129     0     0     0
   203  0.59558459E-01     0   125   131     0     0     0
   203  0.25019445E-02     0     3     9     0     0     0
   203  0.82211316E+00     0     5    11     0     0     0
   203  0.34667138E-01     0     4    10     0     0     0
   203  0.16518418E-02     0    59    59     0     0     0
   203  0.36833443E-01     0    13    13     0     0     0
   203  0.22138522E-02     0   198   121   128     0     0
   203  0.22138522E-02     0   198   123   130     0     0
   203  0.22138522E-02     0   198   125   132     0     0
   203  0.66415574E-02     0   198     8     1     0     0
   203  0.66415574E-02     0   198    10     3     0     0
   203  0.22138522E-02     0   199   127   122     0     0
   203  0.22138522E-02     0   199   129   124     0     0
   203  0.22138522E-02     0   199   131   126     0     0
   203  0.66415574E-02     0   199     2     7     0     0
   203  0.66415574E-02     0   199     4     9     0     0
   203  0.17893623E-03     0   200   122   128     0     0
   203  0.17893623E-03     0   200   124   130     0     0
   203  0.17893623E-03     0   200   126   132     0     0
   203  0.90056805E-04     0   200   121   127     0     0
   203  0.90056805E-04     0   200   123   129     0     0
   203  0.90056805E-04     0   200   125   131     0     0
   203  0.30852697E-03     0   200     2     8     0     0
   203  0.30852697E-03     0   200     4    10     0     0
   203  0.39745879E-03     0   200     1     7     0     0
   203  0.39745879E-03     0   200     3     9     0     0
   203  0.39745879E-03     0   200     5    11     0     0
  10
   204  0.44017803E-03     0   123   129     0     0     0
   204  0.12605818E+00     0   125   131     0     0     0
   204  0.12881954E-04     0     1     7     0     0     0
   204  0.52049607E-02     0     3     9     0     0     0
   204  0.86769480E+00     0     5    11     0     0     0
   204  0.84406725E-04     0     6    12     0     0     0
   204  0.19242218E-04     0    13    13     0     0     0
   204  0.18736544E-03     0   450   450     0     0     0
   204  0.43209588E-04     0   203   203     0     0     0
   204  0.25480427E-03     0   429   435     0     0     0
   8
   205  0.43990454E-03     0   123   129     0     0     0
   205  0.12599014E+00     0   125   131     0     0     0
   205  0.12874783E-04     0     1     7     0     0     0
   205  0.52020648E-02     0     3     9     0     0     0
   205  0.86750251E+00     0     5    11     0     0     0
   205  0.33028508E-03     0     6    12     0     0     0
   205  0.34629229E-04     0    13    13     0     0     0
   205  0.48755776E-03     0   450   450     0     0     0
   5
   206  0.67146809E-03     0   124   129     0     0     0
   206  0.19231123E+00     0   126   131     0     0     0
   206  0.17907649E-04     0     2     7     0     0     0
   206  0.72354418E-02     0     4     9     0     0     0
   206  0.79976404E+00     0     6    11     0     0     0
   5
   207  0.67146809E-03     0   130   123     0     0     0
   207  0.19231123E+00     0   132   125     0     0     0
   207  0.17907649E-04     0     8     1     0     0     0
   207  0.72354418E-02     0    10     3     0     0     0
   207  0.79976404E+00     0    12     5     0     0     0
   0
   5
     6  0.33333334E+00   100     2     7     5     0     0
     6  0.33333334E+00   100     4     9     5     0     0
     6  0.11111111E+00   100   122   127     5     0     0
     6  0.11111111E+00   100   124   129     5     0     0
     6  0.11111111E+00   100   126   131     5     0     0
   5
    12  0.33333334E+00   100     8     1    11     0     0
    12  0.33333334E+00   100    10     3    11     0     0
    12  0.11111111E+00   100   128   121    11     0     0
    12  0.11111111E+00   100   130   123    11     0     0
    12  0.11111111E+00   100   132   125    11     0     0
     50.00000000     -0.02076835
      0.99321783     -0.02139070      0.10818287     -0.03684006
      0.05367721      0.95365942     -0.25050828      0.15779082
      0.04854413     -0.06957347     -0.70067728     -0.70841706
      0.09099737     -0.29195130     -0.65923727      0.68694246
     -0.97450393      0.22437043     -0.22437043     -0.97450393
     -0.93465298      0.35556123     -0.35556123     -0.93465298
     -1.03964746     -0.77949226     -1.15811503
   -653.08831787   -814.54089355    -93.23345184
    464.63854980
    T
