#  ISAJET SUSY parameters in Les Houches accord format
#  Created by ISALHA3. Last revision by C. Balazs on 2005 Jan. 10
Block SPINFO   # Program information
     1   ISASUGRA from ISAJET          # Spectrum Calculator
     2   7.79   16-DEC-2008 15:42:00   # Version number
Block MODSEL   # Model selection
     1     1   # Minimal supergravity (mSUGRA,CMSSM) model         
Block SMINPUTS   # Standard Model inputs
     1     1.27843819E+02   # alpha_em^(-1)
     2     1.16570000E-05   # G_Fermi
     3     1.17200002E-01   # alpha_s(M_Z)
     4     9.11699982E+01   # m_{Z}(pole)
     5     4.19999981E+00   # m_{b}(m_{b})
     6     1.72500000E+02   # m_{top}(pole)
     7     1.77699995E+00   # m_{tau}(pole)
Block MINPAR   # SUSY breaking input parameters
     1     2.00000000E+02   # m_0
     2     2.50000000E+02   # m_{1/2}
     3     3.00000000E+00   # tan(beta)
     4     1.00000000E+00   # sign(mu)
     5     0.00000000E+00   # A_0
#  
#  M_{GUT} =   0.22762068E+17
Block MASS   # Scalar and gaugino mass spectrum
#  PDG code   mass                 particle
        24     8.04229965E+01   #  W^+
        25     9.73434296E+01   #  h^0            
        35     4.95790833E+02   #  H^0            
        36     4.89373627E+02   #  A^0            
        37     4.98863007E+02   #  H^+            
   1000001     5.95825073E+02   #  dnl            
   1000002     5.91189941E+02   #  upl            
   1000003     5.95825134E+02   #  stl            
   1000004     5.91191589E+02   #  chl            
   1000005     5.41966187E+02   #  b1             
   1000006     4.05691864E+02   #  t1             
   1000011     2.65369598E+02   #  el-            
   1000012     2.54550064E+02   #  nuel           
   1000013     2.65369598E+02   #  mul-           
   1000014     2.54550064E+02   #  numl           
   1000015     2.23060349E+02   #  tau1           
   1000016     2.53825455E+02   #  nutl           
   1000021     6.13256653E+02   #  glss           
   1000022     9.55837250E+01   #  z1ss           
   1000023     1.76653168E+02   #  z2ss           
   1000024     1.75565842E+02   #  w1ss           
   1000025    -3.86348419E+02   #  z3ss           
   1000035     4.13475861E+02   #  z4ss           
   1000037     4.09208801E+02   #  w2ss           
   2000001     5.74642639E+02   #  dnr            
   2000002     5.75246216E+02   #  upr            
   2000003     5.74642639E+02   #  str            
   2000004     5.75247925E+02   #  chr            
   2000005     5.73874695E+02   #  b2             
   2000006     6.03401855E+02   #  t2             
   2000011     2.23305283E+02   #  er-            
   2000013     2.23305298E+02   #  mur-           
   2000015     2.65186981E+02   #  tau2           
#  Higgs mixing
Block ALPHA   # Effective Higgs mixing parameter
         -3.42435181E-01   # alpha
Block STOPMIX   # stop mixing matrix
  1  1     5.32971144E-01   # O_{11}
  1  2    -8.46133411E-01   # O_{12}
  2  1     8.46133411E-01   # O_{21}
  2  2     5.32971144E-01   # O_{22}
Block SBOTMIX   # sbottom mixing matrix
  1  1     9.91171658E-01   # O_{11}
  1  2    -1.32584661E-01   # O_{12}
  2  1     1.32584661E-01   # O_{21}
  2  2     9.91171658E-01   # O_{22}
Block STAUMIX   # stau mixing matrix
  1  1     1.11849450E-01   # O_{11}
  1  2    -9.93725181E-01   # O_{12}
  2  1     9.93725181E-01   # O_{21}
  2  2     1.11849450E-01   # O_{22}
Block NMIX   # neutralino mixing matrix
  1  1     9.82924700E-01   #
  1  2    -9.00375918E-02   #
  1  3     1.41213417E-01   #
  1  4    -7.62321725E-02   #
  2  1    -1.34963512E-01   #
  2  2    -9.44865823E-01   #
  2  3     2.45285138E-01   #
  2  4    -1.69848561E-01   #
  3  1    -4.00884748E-02   #
  3  2     5.99605851E-02   #
  3  3     7.00534046E-01   #
  3  4     7.09964573E-01   #
  4  1    -1.18478455E-01   #
  4  2     3.09073657E-01   #
  4  3     6.55092418E-01   #
  4  4    -6.79183841E-01   #
Block UMIX   # chargino U mixing matrix
  1  1    -9.28754449E-01   # U_{11}
  1  2     3.70695531E-01   # U_{12}
  2  1    -3.70695531E-01   # U_{21}
  2  2    -9.28754449E-01   # U_{22}
Block VMIX   # chargino V mixing matrix
  1  1    -9.65779483E-01   # V_{11}
  1  2     2.59364575E-01   # V_{12}
  2  1    -2.59364575E-01   # V_{21}
  2  2    -9.65779483E-01   # V_{22}
Block GAUGE Q=  4.71283417E+02   #
     1     3.57490957E-01   # g`
     2     6.52501941E-01   # g_2
     3     1.22098911E+00   # g_3
Block YU Q=  4.71283417E+02   #
  3  3     9.23276365E-01   # y_t
Block YD Q=  4.71283417E+02   #
  3  3     4.41614166E-02   # y_b
Block YE Q=  4.71283417E+02   #
  3  3     3.17966603E-02   # y_tau
Block HMIX Q=  4.71283417E+02   # Higgs mixing parameters
     1     3.84385132E+02   # mu(Q)
     2     3.00000000E+00   # tan(beta)(M_{GUT})
     3     2.50198486E+02   # Higgs vev at Q
     4     2.39486547E+05   # m_A^2(Q)
Block MSOFT Q=  4.71283417E+02   # DRbar SUSY breaking parameters
     1     1.01862648E+02   # M_1(Q)          
     2     1.92154114E+02   # M_2(Q)          
     3     5.79392456E+02   # M_3(Q)          
    31     2.60915833E+02   # MeL(Q)          
    32     2.60915833E+02   # MmuL(Q)         
    33     2.60216919E+02   # MtauL(Q)        
    34     2.19951279E+02   # MeR(Q)          
    35     2.19951279E+02   # MmuR(Q)         
    36     2.19621475E+02   # MtauR(Q)        
    41     5.63985840E+02   # MqL1(Q)         
    42     5.63985840E+02   # MqL2(Q)         
    43     5.14929504E+02   # MqL3(Q)         
    44     5.47379028E+02   # MuR(Q)          
    45     5.47379028E+02   # McR(Q)          
    46     4.31336853E+02   # MtR(Q)          
    47     5.45382263E+02   # MdR(Q)          
    48     5.45382263E+02   # MsR(Q)          
    49     5.48944397E+02   # MbR(Q)          
Block AU Q=  4.71283417E+02   #
  1  1    -4.43594879E+02   # A_u
  2  2    -4.43594879E+02   # A_c
  3  3    -4.43594879E+02   # A_t
Block AD Q=  4.71283417E+02   #
  1  1    -7.05417664E+02   # A_d
  2  2    -7.05417664E+02   # A_s
  3  3    -7.05417664E+02   # A_b
Block AE Q=  4.71283417E+02   #
  1  1    -1.57505142E+02   # A_e
  2  2    -1.57505142E+02   # A_mu
  3  3    -1.57505142E+02   # A_tau
#  ISAJET decay tables in SUSY Les Houches accord format
#  Created by ISALHD. Last revision: C. Balazs, 2005 May 25
Block DCINFO                           # Program information
     1   ISASUGRA from ISAJET          # Spectrum Calculator
     2   7.79   16-DEC-2008 15:42:00   # Version number
#         PDG         Width
DECAY         6  1.14680767E+00   # TP    decays
#          BR          NDA       ID1       ID2       ID3       ID4
      3.33333343E-01    3            2        -1         5             # TP     -->  UP     DB     BT          
      3.33333343E-01    3            4        -3         5             # TP     -->  CH     SB     BT          
      1.11111112E-01    3          -11        12         5             # TP     -->  E+     NUE    BT          
      1.11111112E-01    3          -13        14         5             # TP     -->  MU+    NUM    BT          
      1.11111112E-01    3          -15        16         5             # TP     -->  TAU+   NUT    BT          
#         PDG         Width
DECAY   1000021  2.66265678E+00   # GLSS  decays
#          BR          NDA       ID1       ID2       ID3       ID4
      2.62887159E-04    3      1000024         5        -6             # GLSS   -->  W1SS+  BT     TB          
      2.62887159E-04    3     -1000024         6        -5             # GLSS   -->  W1SS-  TP     BB          
      1.00443697E-06    3      1000037         5        -6             # GLSS   -->  W2SS+  BT     TB          
      1.00443697E-06    3     -1000037         6        -5             # GLSS   -->  W2SS-  TP     BB          
      5.44110890E-07    2      1000022        21                       # GLSS   -->  Z1SS   GL                 
      2.39926849E-05    3      1000022         6        -6             # GLSS   -->  Z1SS   TP     TB          
      7.41155361E-07    2      1000023        21                       # GLSS   -->  Z2SS   GL                 
      4.82629657E-05    3      1000023         6        -6             # GLSS   -->  Z2SS   TP     TB          
      3.96602954E-05    2      1000025        21                       # GLSS   -->  Z3SS   GL                 
      2.10189046E-05    2      1000035        21                       # GLSS   -->  Z4SS   GL                 
      1.39436014E-02    2     -1000002         2                       # GLSS   -->  UBL    UP                 
      1.39436014E-02    2      1000002        -2                       # GLSS   -->  UPL    UB                 
      8.76817573E-03    2     -1000001         1                       # GLSS   -->  DBL    DN                 
      8.76817573E-03    2      1000001        -1                       # GLSS   -->  DNL    DB                 
      4.02838290E-02    2     -2000002         2                       # GLSS   -->  UBR    UP                 
      4.02838290E-02    2      2000002        -2                       # GLSS   -->  UPR    UB                 
      4.15311307E-02    2     -2000001         1                       # GLSS   -->  DBR    DN                 
      4.15311307E-02    2      2000001        -1                       # GLSS   -->  DNR    DB                 
      8.76756385E-03    2     -1000003         3                       # GLSS   -->  SBL    ST                 
      8.76756385E-03    2      1000003        -3                       # GLSS   -->  STL    SB                 
      4.15306129E-02    2     -2000003         3                       # GLSS   -->  SBR    ST                 
      4.15306129E-02    2      2000003        -3                       # GLSS   -->  STR    SB                 
      1.39163826E-02    2     -1000004         4                       # GLSS   -->  CBL    CH                 
      1.39163826E-02    2      1000004        -4                       # GLSS   -->  CHL    CB                 
      4.02564965E-02    2     -2000004         4                       # GLSS   -->  CBR    CH                 
      4.02564965E-02    2      2000004        -4                       # GLSS   -->  CHR    CB                 
      1.30976886E-01    2     -1000005         5                       # GLSS   -->  BB1    BT                 
      1.30976886E-01    2      1000005        -5                       # GLSS   -->  BT1    BB                 
      4.42923792E-02    2     -2000005         5                       # GLSS   -->  BB2    BT                 
      4.42923792E-02    2      2000005        -5                       # GLSS   -->  BT2    BB                 
      1.15401953E-01    2     -1000006         6                       # GLSS   -->  TB1    TP                 
      1.15401953E-01    2      1000006        -6                       # GLSS   -->  TP1    TB                 
#         PDG         Width
DECAY   1000002  5.96572828E+00   # UPL   decays
#          BR          NDA       ID1       ID2       ID3       ID4
      3.20737693E-03    2      1000022         2                       # UPL    -->  Z1SS   UP                 
      3.25249583E-01    2      1000023         2                       # UPL    -->  Z2SS   UP                 
      3.79060337E-04    2      1000025         2                       # UPL    -->  Z3SS   UP                 
      8.98938440E-03    2      1000035         2                       # UPL    -->  Z4SS   UP                 
      6.46947503E-01    2      1000024         1                       # UPL    -->  W1SS+  DN                 
      1.52271241E-02    2      1000037         1                       # UPL    -->  W2SS+  DN                 
#         PDG         Width
DECAY   1000001  5.81821823E+00   # DNL   decays
#          BR          NDA       ID1       ID2       ID3       ID4
      2.98535749E-02    2      1000022         1                       # DNL    -->  Z1SS   DN                 
      3.03619802E-01    2      1000023         1                       # DNL    -->  Z2SS   DN                 
      6.55856915E-04    2      1000025         1                       # DNL    -->  Z3SS   DN                 
      1.26763070E-02    2      1000035         1                       # DNL    -->  Z4SS   DN                 
      6.20127797E-01    2     -1000024         2                       # DNL    -->  W1SS-  UP                 
      3.30667049E-02    2     -1000037         2                       # DNL    -->  W2SS-  UP                 
#         PDG         Width
DECAY   1000003  5.81816721E+00   # STL   decays
#          BR          NDA       ID1       ID2       ID3       ID4
      2.98538394E-02    2      1000022         3                       # STL    -->  Z1SS   ST                 
      3.03622484E-01    2      1000023         3                       # STL    -->  Z2SS   ST                 
      6.55862852E-04    2      1000025         3                       # STL    -->  Z3SS   ST                 
      1.26764234E-02    2      1000035         3                       # STL    -->  Z4SS   ST                 
      6.20125592E-01    2     -1000024         4                       # STL    -->  W1SS-  CH                 
      3.30657884E-02    2     -1000037         4                       # STL    -->  W2SS-  CH                 
#         PDG         Width
DECAY   1000004  5.96572590E+00   # CHL   decays
#          BR          NDA       ID1       ID2       ID3       ID4
      3.20735294E-03    2      1000022         4                       # CHL    -->  Z1SS   CH                 
      3.25246871E-01    2      1000023         4                       # CHL    -->  Z2SS   CH                 
      3.79052624E-04    2      1000025         4                       # CHL    -->  Z3SS   CH                 
      8.98914970E-03    2      1000035         4                       # CHL    -->  Z4SS   CH                 
      6.46950245E-01    2      1000024         3                       # CHL    -->  W1SS+  ST                 
      1.52273290E-02    2      1000037         3                       # CHL    -->  W2SS+  ST                 
#         PDG         Width
DECAY   1000005  5.26481676E+00   # BT1   decays
#          BR          NDA       ID1       ID2       ID3       ID4
      3.10391821E-02    2      1000022         5                       # BT1    -->  Z1SS   BT                 
      2.89874583E-01    2      1000023         5                       # BT1    -->  Z2SS   BT                 
      7.79657625E-04    2      1000025         5                       # BT1    -->  Z3SS   BT                 
      8.05817172E-03    2      1000035         5                       # BT1    -->  Z4SS   BT                 
      4.27345067E-01    2     -1000024         6                       # BT1    -->  W1SS-  TP                 
      2.42903396E-01    2          -24   1000006                       # BT1    -->  W-     TP1                
#         PDG         Width
DECAY   1000006  2.26736236E+00   # TP1   decays
#          BR          NDA       ID1       ID2       ID3       ID4
      1.92252457E-01    2      1000022         6                       # TP1    -->  Z1SS   TP                 
      1.35549366E-01    2      1000023         6                       # TP1    -->  Z2SS   TP                 
      6.72198176E-01    2      1000024         5                       # TP1    -->  W1SS+  BT                 
#         PDG         Width
DECAY   2000002  1.21225679E+00   # UPR   decays
#          BR          NDA       ID1       ID2       ID3       ID4
      9.79934871E-01    2      1000022         2                       # UPR    -->  Z1SS   UP                 
      1.60277262E-02    2      1000023         2                       # UPR    -->  Z2SS   UP                 
      5.19442139E-04    2      1000025         2                       # UPR    -->  Z3SS   UP                 
      3.51791549E-03    2      1000035         2                       # UPR    -->  Z4SS   UP                 
#         PDG         Width
DECAY   2000001  3.02703351E-01   # DNR   decays
#          BR          NDA       ID1       ID2       ID3       ID4
      9.79956686E-01    2      1000022         1                       # DNR    -->  Z1SS   DN                 
      1.60229821E-02    2      1000023         1                       # DNR    -->  Z2SS   DN                 
      5.17722743E-04    2      1000025         1                       # DNR    -->  Z3SS   DN                 
      3.50262295E-03    2      1000035         1                       # DNR    -->  Z4SS   DN                 
#         PDG         Width
DECAY   2000003  3.02703351E-01   # STR   decays
#          BR          NDA       ID1       ID2       ID3       ID4
      9.79956686E-01    2      1000022         3                       # STR    -->  Z1SS   ST                 
      1.60229821E-02    2      1000023         3                       # STR    -->  Z2SS   ST                 
      5.17722743E-04    2      1000025         3                       # STR    -->  Z3SS   ST                 
      3.50262295E-03    2      1000035         3                       # STR    -->  Z4SS   ST                 
#         PDG         Width
DECAY   2000004  1.21224666E+00   # CHR   decays
#          BR          NDA       ID1       ID2       ID3       ID4
      9.79935050E-01    2      1000022         4                       # CHR    -->  Z1SS   CH                 
      1.60277151E-02    2      1000023         4                       # CHR    -->  Z2SS   CH                 
      5.19434107E-04    2      1000025         4                       # CHR    -->  Z3SS   CH                 
      3.51783470E-03    2      1000035         4                       # CHR    -->  Z4SS   CH                 
#         PDG         Width
DECAY   2000005  4.08393860E-01   # BT2   decays
#          BR          NDA       ID1       ID2       ID3       ID4
      7.08146870E-01    2      1000022         5                       # BT2    -->  Z1SS   BT                 
      5.97269200E-02    2      1000023         5                       # BT2    -->  Z2SS   BT                 
      1.12225683E-02    2      1000025         5                       # BT2    -->  Z3SS   BT                 
      1.97145101E-02    2      1000035         5                       # BT2    -->  Z4SS   BT                 
      7.49419704E-02    2     -1000024         6                       # BT2    -->  W1SS-  TP                 
      1.26247153E-01    2          -24   1000006                       # BT2    -->  W-     TP1                
#         PDG         Width
DECAY   2000006  7.45100737E+00   # TP2   decays
#          BR          NDA       ID1       ID2       ID3       ID4
      2.22212002E-01    2      1000024         5                       # TP2    -->  W1SS+  BT                 
      1.76879168E-01    2      1000037         5                       # TP2    -->  W2SS+  BT                 
      2.24474743E-01    2           23   1000006                       # TP2    -->  Z0     TP1                
      6.67874217E-02    2           25   1000006                       # TP2    -->  HL0    TP1                
      2.21848190E-02    2      1000022         6                       # TP2    -->  Z1SS   TP                 
      1.01340219E-01    2      1000023         6                       # TP2    -->  Z2SS   TP                 
      4.17890474E-02    2      1000025         6                       # TP2    -->  Z3SS   TP                 
      1.44332543E-01    2      1000035         6                       # TP2    -->  Z4SS   TP                 
#         PDG         Width
DECAY   1000011  1.14046276E+00   # EL-   decays
#          BR          NDA       ID1       ID2       ID3       ID4
      1.50345638E-01    2      1000022        11                       # EL-    -->  Z1SS   E-                 
      3.15399706E-01    2      1000023        11                       # EL-    -->  Z2SS   E-                 
      5.34254670E-01    2     -1000024        12                       # EL-    -->  W1SS-  NUE                
      5.19482686E-11    3      1000015        11       -15             # EL-    -->  TAU1-  E-     TAU+        
      2.29038732E-11    3     -1000015        11        15             # EL-    -->  TAU1+  E-     TAU-        
#         PDG         Width
DECAY   1000013  1.14046240E+00   # MUL-  decays
#          BR          NDA       ID1       ID2       ID3       ID4
      1.50345623E-01    2      1000022        13                       # MUL-   -->  Z1SS   MU-                
      3.15399468E-01    2      1000023        13                       # MUL-   -->  Z2SS   MU-                
      5.34254849E-01    2     -1000024        14                       # MUL-   -->  W1SS-  NUM                
      5.19482860E-11    3      1000015        13       -15             # MUL-   -->  TAU1-  MU-    TAU+        
      2.29038802E-11    3     -1000015        13        15             # MUL-   -->  TAU1+  MU-    TAU-        
#         PDG         Width
DECAY   1000015  7.33464062E-01   # TAU1- decays
#          BR          NDA       ID1       ID2       ID3       ID4
      9.87420142E-01    2      1000022        15                       # TAU1-  -->  Z1SS   TAU-               
      7.04755075E-03    2      1000023        15                       # TAU1-  -->  Z2SS   TAU-               
      5.53226797E-03    2     -1000024        16                       # TAU1-  -->  W1SS-  NUT                
#         PDG         Width
DECAY   1000012  1.08180785E+00   # NUEL  decays
#          BR          NDA       ID1       ID2       ID3       ID4
      2.90321410E-01    2      1000022        12                       # NUEL   -->  Z1SS   NUE                
      2.01776624E-01    2      1000023        12                       # NUEL   -->  Z2SS   NUE                
      5.07901967E-01    2      1000024        11                       # NUEL   -->  W1SS+  E-                 
      2.91904105E-11    3      1000015        12       -15             # NUEL   -->  TAU1-  NUE    TAU+        
      1.35057460E-11    3     -1000015        12        15             # NUEL   -->  TAU1+  NUE    TAU-        
      1.77769258E-13    3     -1000015        11        16             # NUEL   -->  TAU1+  E-     NUT         
#         PDG         Width
DECAY   1000014  1.08180737E+00   # NUML  decays
#          BR          NDA       ID1       ID2       ID3       ID4
      2.90321559E-01    2      1000022        14                       # NUML   -->  Z1SS   NUM                
      2.01776728E-01    2      1000023        14                       # NUML   -->  Z2SS   NUM                
      5.07901728E-01    2      1000024        13                       # NUML   -->  W1SS+  MU-                
      2.91904279E-11    3      1000015        14       -15             # NUML   -->  TAU1-  NUM    TAU+        
      1.35057529E-11    3     -1000015        14        15             # NUML   -->  TAU1+  NUM    TAU-        
      1.77772456E-13    3     -1000015        13        16             # NUML   -->  TAU1+  MU-    NUT         
#         PDG         Width
DECAY   1000016  1.06978357E+00   # NUTL  decays
#          BR          NDA       ID1       ID2       ID3       ID4
      2.92199671E-01    2      1000022        16                       # NUTL   -->  Z1SS   NUT                
      2.01307878E-01    2      1000023        16                       # NUTL   -->  Z2SS   NUT                
      5.06491721E-01    2      1000024        15                       # NUTL   -->  W1SS+  TAU-               
      2.63377688E-11    3     -1000015        16        15             # NUTL   -->  TAU1+  NUT    TAU-        
      8.38304359E-08    3      1000015        16       -15             # NUTL   -->  TAU1-  NUT    TAU+        
      8.38182856E-08    3      1000015        12       -11             # NUTL   -->  TAU1-  NUE    E+          
      8.38182856E-08    3      1000015        14       -13             # NUTL   -->  TAU1-  NUM    MU+         
      2.51454850E-07    3      1000015         2        -1             # NUTL   -->  TAU1-  UP     DB          
      2.51454850E-07    3      1000015         4        -3             # NUTL   -->  TAU1-  CH     SB          
#         PDG         Width
DECAY   2000011  7.34961987E-01   # ER-   decays
#          BR          NDA       ID1       ID2       ID3       ID4
      9.96058643E-01    2      1000022        11                       # ER-    -->  Z1SS   E-                 
      3.94132361E-03    2      1000023        11                       # ER-    -->  Z2SS   E-                 
      7.94849593E-35    3      1000015        12       -16             # ER-    -->  TAU1-  NUE    ANUT        
#         PDG         Width
DECAY   2000013  7.34961629E-01   # MUR-  decays
#          BR          NDA       ID1       ID2       ID3       ID4
      9.96058643E-01    2      1000022        13                       # MUR-   -->  Z1SS   MU-                
      3.94131476E-03    2      1000023        13                       # MUR-   -->  Z2SS   MU-                
      3.44723028E-30    3      1000015        14       -16             # MUR-   -->  TAU1-  NUM    ANUT        
#         PDG         Width
DECAY   2000015  1.12994051E+00   # TAU2- decays
#          BR          NDA       ID1       ID2       ID3       ID4
      1.59207806E-01    2      1000022        15                       # TAU2-  -->  Z1SS   TAU-               
      3.12180787E-01    2      1000023        15                       # TAU2-  -->  Z2SS   TAU-               
      5.28611422E-01    2     -1000024        16                       # TAU2-  -->  W1SS-  NUT                
#         PDG         Width
DECAY   1000023  1.10527662E-05   # Z2SS  decays
#          BR          NDA       ID1       ID2       ID3       ID4
      2.49188364E-04    2      1000022        22                       # Z2SS   -->  Z1SS   GM                 
      2.08773628E-07    3     -1000024         2        -1             # Z2SS   -->  W1SS-  UP     DB          
      6.95912092E-08    3     -1000024        12       -11             # Z2SS   -->  W1SS-  NUE    E+          
      6.95912092E-08    3     -1000024        14       -13             # Z2SS   -->  W1SS-  NUM    MU+         
      2.08773628E-07    3      1000024         1        -2             # Z2SS   -->  W1SS+  DN     UB          
      6.95912092E-08    3      1000024        11       -12             # Z2SS   -->  W1SS+  E-     ANUE        
      6.95912092E-08    3      1000024        13       -14             # Z2SS   -->  W1SS+  MU-    ANUM        
      1.05327152E-01    3      1000022         2        -2             # Z2SS   -->  Z1SS   UP     UB          
      1.50413245E-01    3      1000022         1        -1             # Z2SS   -->  Z1SS   DN     DB          
      1.50413245E-01    3      1000022         3        -3             # Z2SS   -->  Z1SS   ST     SB          
      1.05327077E-01    3      1000022         4        -4             # Z2SS   -->  Z1SS   CH     CB          
      1.61183581E-01    3      1000022         5        -5             # Z2SS   -->  Z1SS   BT     BB          
      5.23326360E-02    3      1000022        11       -11             # Z2SS   -->  Z1SS   E-     E+          
      5.23326285E-02    3      1000022        13       -13             # Z2SS   -->  Z1SS   MU-    MU+         
      6.20053820E-02    3      1000022        15       -15             # Z2SS   -->  Z1SS   TAU-   TAU+        
      5.29681891E-02    3      1000022        12       -12             # Z2SS   -->  Z1SS   NUE    ANUE        
      5.29681891E-02    3      1000022        14       -14             # Z2SS   -->  Z1SS   NUM    ANUM        
      5.44788279E-02    3      1000022        16       -16             # Z2SS   -->  Z1SS   NUT    ANUT        
#         PDG         Width
DECAY   1000025  2.61293244E+00   # Z3SS  decays
#          BR          NDA       ID1       ID2       ID3       ID4
      2.48175212E-07    2      1000022        22                       # Z3SS   -->  Z1SS   GM                 
      2.31569516E-07    2      1000023        22                       # Z3SS   -->  Z2SS   GM                 
      3.06668907E-01    2      1000024       -24                       # Z3SS   -->  W1SS+  W-                 
      3.06668907E-01    2     -1000024        24                       # Z3SS   -->  W1SS-  W+                 
      1.27049953E-01    2      1000022        23                       # Z3SS   -->  Z1SS   Z0                 
      2.33501479E-01    2      1000023        23                       # Z3SS   -->  Z2SS   Z0                 
      1.46250665E-08    3      1000022         2        -2             # Z3SS   -->  Z1SS   UP     UB          
      9.46928047E-09    3      1000022         1        -1             # Z3SS   -->  Z1SS   DN     DB          
      9.46927514E-09    3      1000022         3        -3             # Z3SS   -->  Z1SS   ST     SB          
      1.46248338E-08    3      1000022         4        -4             # Z3SS   -->  Z1SS   CH     CB          
      1.81066710E-07    3      1000022         5        -5             # Z3SS   -->  Z1SS   BT     BB          
      1.22208803E-08    3      1000022        15       -15             # Z3SS   -->  Z1SS   TAU-   TAU+        
      2.27514718E-08    3      1000023         2        -2             # Z3SS   -->  Z2SS   UP     UB          
      3.19977111E-08    3      1000023         1        -1             # Z3SS   -->  Z2SS   DN     DB          
      3.19976934E-08    3      1000023         3        -3             # Z3SS   -->  Z2SS   ST     SB          
      2.27511183E-08    3      1000023         4        -4             # Z3SS   -->  Z2SS   CH     CB          
      2.25333224E-07    3      1000023         5        -5             # Z3SS   -->  Z2SS   BT     BB          
      5.03900965E-09    3      1000023        15       -15             # Z3SS   -->  Z2SS   TAU-   TAU+        
      1.08604189E-02    2      1000022        25                       # Z3SS   -->  Z1SS   HL0                
      7.83422403E-03    2      1000023        25                       # Z3SS   -->  Z2SS   HL0                
      1.24897648E-04    2      1000011       -11                       # Z3SS   -->  EL-    E+                 
      1.24897648E-04    2     -1000011        11                       # Z3SS   -->  EL+    E-                 
      1.24897619E-04    2      1000013       -13                       # Z3SS   -->  MUL-   MU+                
      1.24897619E-04    2     -1000013        13                       # Z3SS   -->  MUL+   MU-                
      2.67986936E-04    2      2000011       -11                       # Z3SS   -->  ER-    E+                 
      2.67986936E-04    2     -2000011        11                       # Z3SS   -->  ER+    E-                 
      2.67986878E-04    2      2000013       -13                       # Z3SS   -->  MUR-   MU+                
      2.67986878E-04    2     -2000013        13                       # Z3SS   -->  MUR+   MU-                
      4.84670018E-04    2      1000015       -15                       # Z3SS   -->  TAU1-  TAU+               
      4.84670018E-04    2     -1000015        15                       # Z3SS   -->  TAU1+  TAU-               
      4.21227451E-04    2      2000015       -15                       # Z3SS   -->  TAU2-  TAU+               
      4.21227451E-04    2     -2000015        15                       # Z3SS   -->  TAU2+  TAU-               
      6.70007546E-04    2      1000012       -12                       # Z3SS   -->  NUEL   ANUE               
      6.70007546E-04    2     -1000012        12                       # Z3SS   -->  ANUEL  NUE                
      6.70007546E-04    2      1000014       -14                       # Z3SS   -->  NUML   ANUM               
      6.70007546E-04    2     -1000014        14                       # Z3SS   -->  ANUML  NUM                
      6.75864110E-04    2      1000016       -16                       # Z3SS   -->  NUTL   ANUT               
      6.75864110E-04    2     -1000016        16                       # Z3SS   -->  ANUTL  NUT                
#         PDG         Width
DECAY   1000035  3.24203825E+00   # Z4SS  decays
#          BR          NDA       ID1       ID2       ID3       ID4
      6.81152073E-07    2      1000022        22                       # Z4SS   -->  Z1SS   GM                 
      3.36091915E-07    2      1000023        22                       # Z4SS   -->  Z2SS   GM                 
      5.43862333E-09    2      1000025        22                       # Z4SS   -->  Z3SS   GM                 
      2.95182884E-01    2      1000024       -24                       # Z4SS   -->  W1SS+  W-                 
      2.95182884E-01    2     -1000024        24                       # Z4SS   -->  W1SS-  W+                 
      2.18728369E-10    3     -1000037         2        -1             # Z4SS   -->  W2SS-  UP     DB          
      7.29094632E-11    3     -1000037        12       -11             # Z4SS   -->  W2SS-  NUE    E+          
      7.29094632E-11    3     -1000037        14       -13             # Z4SS   -->  W2SS-  NUM    MU+         
      2.18728383E-10    3      1000037         1        -2             # Z4SS   -->  W2SS+  DN     UB          
      7.29094632E-11    3      1000037        11       -12             # Z4SS   -->  W2SS+  E-     ANUE        
      7.29094632E-11    3      1000037        13       -14             # Z4SS   -->  W2SS+  MU-    ANUM        
      2.18728383E-10    3     -1000037         4        -3             # Z4SS   -->  W2SS-  CH     SB          
      7.29094632E-11    3     -1000037        16       -15             # Z4SS   -->  W2SS-  NUT    TAU+        
      2.18728383E-10    3      1000037         3        -4             # Z4SS   -->  W2SS+  ST     CB          
      7.29094632E-11    3      1000037        15       -16             # Z4SS   -->  W2SS+  TAU-   ANUT        
      1.07456846E-02    2      1000022        23                       # Z4SS   -->  Z1SS   Z0                 
      9.30951349E-03    2      1000023        23                       # Z4SS   -->  Z2SS   Z0                 
      3.31252664E-07    3      1000022         2        -2             # Z4SS   -->  Z1SS   UP     UB          
      5.06707920E-07    3      1000022         1        -1             # Z4SS   -->  Z1SS   DN     DB          
      5.06707636E-07    3      1000022         3        -3             # Z4SS   -->  Z1SS   ST     SB          
      3.31247406E-07    3      1000022         4        -4             # Z4SS   -->  Z1SS   CH     CB          
      9.49677599E-07    3      1000022         5        -5             # Z4SS   -->  Z1SS   BT     BB          
      1.06541345E-08    3      1000022        15       -15             # Z4SS   -->  Z1SS   TAU-   TAU+        
      2.40148756E-06    3      1000023         2        -2             # Z4SS   -->  Z2SS   UP     UB          
      2.74110243E-06    3      1000023         1        -1             # Z4SS   -->  Z2SS   DN     DB          
      2.74110107E-06    3      1000023         3        -3             # Z4SS   -->  Z2SS   ST     SB          
      2.40145027E-06    3      1000023         4        -4             # Z4SS   -->  Z2SS   CH     CB          
      4.83560370E-06    3      1000023         5        -5             # Z4SS   -->  Z2SS   BT     BB          
      4.37252679E-09    3      1000023        15       -15             # Z4SS   -->  Z2SS   TAU-   TAU+        
      4.84482825E-07    3      1000025         2        -2             # Z4SS   -->  Z3SS   UP     UB          
      6.26696192E-07    3      1000025         1        -1             # Z4SS   -->  Z3SS   DN     DB          
      6.26696192E-07    3      1000025         3        -3             # Z4SS   -->  Z3SS   ST     SB          
      4.84482825E-07    3      1000025         4        -4             # Z4SS   -->  Z3SS   CH     CB          
      4.28488931E-07    3      1000025         5        -5             # Z4SS   -->  Z3SS   BT     BB          
      1.41918648E-07    3      1000025        11       -11             # Z4SS   -->  Z3SS   E-     E+          
      1.41918648E-07    3      1000025        13       -13             # Z4SS   -->  Z3SS   MU-    MU+         
      1.33391367E-07    3      1000025        15       -15             # Z4SS   -->  Z3SS   TAU-   TAU+        
      2.82373463E-07    3      1000025        12       -12             # Z4SS   -->  Z3SS   NUE    ANUE        
      2.82373463E-07    3      1000025        14       -14             # Z4SS   -->  Z3SS   NUM    ANUM        
      2.82373463E-07    3      1000025        16       -16             # Z4SS   -->  Z3SS   NUT    ANUT        
      8.57223272E-02    2      1000022        25                       # Z4SS   -->  Z1SS   HL0                
      1.69194862E-01    2      1000023        25                       # Z4SS   -->  Z2SS   HL0                
      5.52488398E-03    2      1000011       -11                       # Z4SS   -->  EL-    E+                 
      5.52488398E-03    2     -1000011        11                       # Z4SS   -->  EL+    E-                 
      5.52488258E-03    2      1000013       -13                       # Z4SS   -->  MUL-   MU+                
      5.52488258E-03    2     -1000013        13                       # Z4SS   -->  MUL+   MU-                
      2.28426256E-03    2      2000011       -11                       # Z4SS   -->  ER-    E+                 
      2.28426256E-03    2     -2000011        11                       # Z4SS   -->  ER+    E-                 
      2.28426210E-03    2      2000013       -13                       # Z4SS   -->  MUR-   MU+                
      2.28426210E-03    2     -2000013        13                       # Z4SS   -->  MUR+   MU-                
      2.12191045E-03    2      1000015       -15                       # Z4SS   -->  TAU1-  TAU+               
      2.12191045E-03    2     -1000015        15                       # Z4SS   -->  TAU1+  TAU-               
      5.99766662E-03    2      2000015       -15                       # Z4SS   -->  TAU2-  TAU+               
      5.99766662E-03    2     -2000015        15                       # Z4SS   -->  TAU2+  TAU-               
      1.44936517E-02    2      1000012       -12                       # Z4SS   -->  NUEL   ANUE               
      1.44936517E-02    2     -1000012        12                       # Z4SS   -->  ANUEL  NUE                
      1.44936517E-02    2      1000014       -14                       # Z4SS   -->  NUML   ANUM               
      1.44936517E-02    2     -1000014        14                       # Z4SS   -->  ANUML  NUM                
      1.45944059E-02    2      1000016       -16                       # Z4SS   -->  NUTL   ANUT               
      1.45944059E-02    2     -1000016        16                       # Z4SS   -->  ANUTL  NUT                
#         PDG         Width
DECAY   1000024  4.73609776E-04   # W1SS+ decays
#          BR          NDA       ID1       ID2       ID3       ID4
      3.32664251E-01    3      1000022         2        -1             # W1SS+  -->  Z1SS   UP     DB          
      3.32664251E-01    3      1000022         4        -3             # W1SS+  -->  Z1SS   CH     SB          
      1.11497894E-01    3      1000022       -11        12             # W1SS+  -->  Z1SS   E+     NUE         
      1.11497894E-01    3      1000022       -13        14             # W1SS+  -->  Z1SS   MU+    NUM         
      1.11675732E-01    3      1000022       -15        16             # W1SS+  -->  Z1SS   TAU+   NUT         
#         PDG         Width
DECAY   1000037  3.20360160E+00   # W2SS+ decays
#          BR          NDA       ID1       ID2       ID3       ID4
      5.37605274E-07    3      1000022         2        -1             # W2SS+  -->  Z1SS   UP     DB          
      5.37604308E-07    3      1000022         4        -3             # W2SS+  -->  Z1SS   CH     SB          
      4.40546399E-09    3      1000022       -15        16             # W2SS+  -->  Z1SS   TAU+   NUT         
      4.85515073E-02    2      1000022        24                       # W2SS+  -->  Z1SS   W+                 
      2.20614584E-06    3      1000023         2        -1             # W2SS+  -->  Z2SS   UP     DB          
      2.20613470E-06    3      1000023         4        -3             # W2SS+  -->  Z2SS   CH     SB          
      1.14987859E-08    3      1000023       -15        16             # W2SS+  -->  Z2SS   TAU+   NUT         
      3.37704539E-01    2      1000023        24                       # W2SS+  -->  Z2SS   W+                 
      7.34444313E-07    3      1000025         2        -1             # W2SS+  -->  Z3SS   UP     DB          
      7.34444313E-07    3      1000025         4        -3             # W2SS+  -->  Z3SS   CH     SB          
      2.44711003E-07    3      1000025       -11        12             # W2SS+  -->  Z3SS   E+     NUE         
      2.44711003E-07    3      1000025       -13        14             # W2SS+  -->  Z3SS   MU+    NUM         
      2.44711003E-07    3      1000025       -15        16             # W2SS+  -->  Z3SS   TAU+   NUT         
      1.35934455E-02    2      1000012       -11                       # W2SS+  -->  NUEL   E+                 
      1.35934446E-02    2      1000014       -13                       # W2SS+  -->  NUML   MU+                
      1.40544344E-02    2      1000016       -15                       # W2SS+  -->  NUTL   TAU+               
      2.48080585E-02    2     -1000011        12                       # W2SS+  -->  EL+    NUE                
      2.48080585E-02    2     -1000013        14                       # W2SS+  -->  MUL+   NUM                
      5.01789327E-06    2     -1000015        16                       # W2SS+  -->  TAU1+  NUT                
      2.52386108E-02    2     -2000015        16                       # W2SS+  -->  TAU2+  NUT                
      2.83641547E-01    2      1000024        23                       # W2SS+  -->  W1SS+  Z0                 
      2.60251750E-06    3      1000024         1        -1             # W2SS+  -->  W1SS+  DN     DB          
      2.60247702E-06    3      1000024         3        -3             # W2SS+  -->  W1SS+  ST     SB          
      4.70659234E-06    3      1000024         2        -2             # W2SS+  -->  W1SS+  UP     UB          
      4.70658915E-06    3      1000024         4        -4             # W2SS+  -->  W1SS+  CH     CB          
      2.13979006E-01    2      1000024        25                       # W2SS+  -->  W1SS+  HL0                
#         PDG         Width
DECAY        25  3.65322293E-03   # HL0   decays
#          BR          NDA       ID1       ID2       ID3       ID4
      5.10549869E-09    2           11       -11                       # HL0    -->  E-     E+                 
      2.15561857E-04    2           13       -13                       # HL0    -->  MU-    MU+                
      6.16172478E-02    2           15       -15                       # HL0    -->  TAU-   TAU+               
      6.42442910E-06    2            1        -1                       # HL0    -->  DN     DB                 
      2.59578973E-03    2            3        -3                       # HL0    -->  ST     SB                 
      8.71184349E-01    2            5        -5                       # HL0    -->  BT     BB                 
      1.79733718E-06    2            2        -2                       # HL0    -->  UP     UB                 
      3.47227566E-02    2            4        -4                       # HL0    -->  CH     CB                 
      1.13278965E-03    2           22        22                       # HL0    -->  GM     GM                 
      2.64746286E-02    2           21        21                       # HL0    -->  GL     GL                 
      1.13814589E-04    3           24        11       -12             # HL0    -->  W+     E-     ANUE        
      1.13814589E-04    3           24        13       -14             # HL0    -->  W+     MU-    ANUM        
      1.13814589E-04    3           24        15       -16             # HL0    -->  W+     TAU-   ANUT        
      3.41443782E-04    3           24        -2         1             # HL0    -->  W+     UB     DN          
      3.41443782E-04    3           24        -4         3             # HL0    -->  W+     CB     ST          
      1.13814589E-04    3          -24       -11        12             # HL0    -->  W-     E+     NUE         
      1.13814589E-04    3          -24       -13        14             # HL0    -->  W-     MU+    NUM         
      1.13814589E-04    3          -24       -15        16             # HL0    -->  W-     TAU+   NUT         
      3.41443782E-04    3          -24         2        -1             # HL0    -->  W-     UP     DB          
      3.41443782E-04    3          -24         4        -3             # HL0    -->  W-     CH     SB          
#         PDG         Width
DECAY        35  1.88026404E+00   # HH0   decays
#          BR          NDA       ID1       ID2       ID3       ID4
      3.97575056E-10    2           11       -11                       # HH0    -->  E-     E+                 
      1.67863309E-05    2           13       -13                       # HH0    -->  MU-    MU+                
      4.80749318E-03    2           15       -15                       # HH0    -->  TAU-   TAU+               
      4.90112996E-07    2            1        -1                       # HH0    -->  DN     DB                 
      1.98030437E-04    2            3        -3                       # HH0    -->  ST     SB                 
      3.02997865E-02    2            5        -5                       # HH0    -->  BT     BB                 
      2.21425522E-09    2            2        -2                       # HH0    -->  UP     UB                 
      3.40100887E-05    2            4        -4                       # HH0    -->  CH     CB                 
      7.80544341E-01    2            6        -6                       # HH0    -->  TP     TB                 
      1.31401957E-05    2           22        22                       # HH0    -->  GM     GM                 
      1.45181175E-03    2           21        21                       # HH0    -->  GL     GL                 
      7.70719210E-03    2           24       -24                       # HH0    -->  W+     W-                 
      3.78317642E-03    2           23        23                       # HH0    -->  Z0     Z0                 
      7.99230952E-03    2      1000022   1000022                       # HH0    -->  Z1SS   Z1SS               
      2.63939872E-02    2      1000022   1000023                       # HH0    -->  Z1SS   Z2SS               
      4.30142693E-02    2      1000022   1000025                       # HH0    -->  Z1SS   Z3SS               
      1.75952334E-02    2      1000023   1000023                       # HH0    -->  Z2SS   Z2SS               
      5.13262376E-02    2      1000024  -1000024                       # HH0    -->  W1SS+  W1SS-              
      2.21693721E-02    2           25        25                       # HH0    -->  HL0    HL0                
      8.79436499E-04    2      2000011  -2000011                       # HH0    -->  ER-    ER+                
      8.79388303E-04    2      2000013  -2000013                       # HH0    -->  MUR-   MUR+               
      8.90899333E-04    2      1000015  -1000015                       # HH0    -->  TAU1-  TAU1+              
      1.31020579E-06    2      1000015  -2000015                       # HH0    -->  TAU1-  TAU2+              
      1.31020579E-06    2      2000015  -1000015                       # HH0    -->  TAU2-  TAU1+              
#         PDG         Width
DECAY        36  3.32115507E+00   # HA0   decays
#          BR          NDA       ID1       ID2       ID3       ID4
      2.25365338E-10    2           11       -11                       # HA0    -->  E-     E+                 
      9.51533002E-06    2           13       -13                       # HA0    -->  MU-    MU+                
      2.72526476E-03    2           15       -15                       # HA0    -->  TAU-   TAU+               
      2.77855122E-07    2            1        -1                       # HA0    -->  DN     DB                 
      1.12267538E-04    2            3        -3                       # HA0    -->  ST     SB                 
      1.71810295E-02    2            5        -5                       # HA0    -->  BT     BB                 
      1.09758791E-09    2            2        -2                       # HA0    -->  UP     UB                 
      1.68866918E-05    2            4        -4                       # HA0    -->  CH     CB                 
      7.11013913E-01    2            6        -6                       # HA0    -->  TP     TB                 
      1.27448902E-06    2           22        22                       # HA0    -->  GM     GM                 
      7.00346078E-04    2           21        21                       # HA0    -->  GL     GL                 
      1.13348328E-02    2      1000022   1000022                       # HA0    -->  Z1SS   Z1SS               
      5.00366539E-02    2      1000022   1000023                       # HA0    -->  Z1SS   Z2SS               
      1.82874413E-04    2      1000022   1000025                       # HA0    -->  Z1SS   Z3SS               
      5.33774458E-02    2      1000023   1000023                       # HA0    -->  Z2SS   Z2SS               
      1.49396136E-01    2      1000024  -1000024                       # HA0    -->  W1SS+  W1SS-              
      3.91055923E-03    2           25        23                       # HA0    -->  HL0    Z0                 
      4.11107536E-13    2      1000011  -2000011                       # HA0    -->  EL-    ER+                
      4.11107536E-13    2      2000011  -1000011                       # HA0    -->  ER-    EL+                
      1.73574879E-08    2      1000013  -2000013                       # HA0    -->  MUL-   MUR+               
      1.73574879E-08    2      2000013  -1000013                       # HA0    -->  MUR-   MUL+               
      3.31722191E-07    2      1000015  -2000015                       # HA0    -->  TAU1-  TAU2+              
      3.31722191E-07    2      2000015  -1000015                       # HA0    -->  TAU2-  TAU1+              
#         PDG         Width
DECAY        37  2.36576700E+00   # H+    decays
#          BR          NDA       ID1       ID2       ID3       ID4
      3.22511379E-10    2           12       -11                       # H+     -->  NUE    E+                 
      1.36170102E-05    2           14       -13                       # H+     -->  NUM    MU+                
      3.90002178E-03    2           16       -15                       # H+     -->  NUT    TAU+               
      3.64591926E-07    2            2        -1                       # H+     -->  UP     DB                 
      1.68748040E-04    2            4        -3                       # H+     -->  CH     SB                 
      9.11756098E-01    2            6        -5                       # H+     -->  TP     BB                 
      7.66262636E-02    2      1000024   1000022                       # H+     -->  W1SS+  Z1SS               
      1.53035007E-03    2      1000024   1000023                       # H+     -->  W1SS+  Z2SS               
      5.94855100E-03    2           25        24                       # H+     -->  HL0    W+                 
      5.59778819E-05    2     -1000015   1000016                       # H+     -->  TAU1+  NUTL               
