#
#                              ======================
#                              | THE SUSYHIT OUTPUT |
#                              ======================
#
#
#              ------------------------------------------------------
#              |     This is the output of the SUSY-HIT package     |
#              |  created by A.Djouadi, M.Muehlleitner and M.Spira. |
#              |  In case of problems with SUSY-HIT email to        |
#              |           margarete.muehlleitner@cern.ch           |
#              |           michael.spira@psi.ch                     |
#              |           abdelhak.djouadi@cern.ch                 |
#              ------------------------------------------------------
#
#              ------------------------------------------------------
#              |  SUSY Les Houches Accord - MSSM Spectrum + Decays  |
#              |              based on the decay programs           |
#              |                                                    |
#              |                     SDECAY 1.3b                    |
#              |                                                    |
#              |  Authors: M.Muhlleitner, A.Djouadi and Y.Mambrini  |
#              |  Ref.:    Comput.Phys.Commun.168(2005)46           |
#              |           [hep-ph/0311167]                         |
#              |                                                    |
#              |                     HDECAY 3.4                     |
#              |                                                    |
#              |  By: A.Djouadi,J.Kalinowski,M.Muhlleitner,M.Spira  |
#              |  Ref.:    Comput.Phys.Commun.108(1998)56           |
#              |           [hep-ph/9704448]                         |
#              |                                                    |
#              |                                                    |
#              |  If not stated otherwise all DRbar couplings and   |
#              |  soft SUSY breaking masses are given at the scale  |
#              |  Q=  0.50019049E+04
#              |                                                    |
#              ------------------------------------------------------
#
#
BLOCK DCINFO  # Decay Program information
     1   SDECAY/HDECAY # decay calculator
     2   1.3b  /3.4    # version number
#
BLOCK SPINFO  # Spectrum calculator information
     1   SuSpect     # RGE +Spectrum calculator            
     2   2.41        # version number                      
#
BLOCK MODSEL  # Model selection
     1     0   # #general MSSM low scale                           
#
BLOCK SMINPUTS  # Standard Model inputs
         1     1.27934000E+02   # alpha_em^-1(M_Z)^MSbar
         2     1.16639000E-05   # G_F [GeV^-2]
         3     1.17200000E-01   # alpha_S(M_Z)^MSbar
         4     9.11870000E+01   # M_Z pole mass
         5     4.25000000E+00   # mb(mb)^MSbar
         6     1.72500000E+02   # mt pole mass
         7     1.77710000E+00   # mtau pole mass
#
BLOCK MINPAR  # Input parameters - minimal models
#
BLOCK EXTPAR  # Input parameters - non-minimal models
         0     5.00190490E+03   # EWSB                
         1     4.00200000E+02   # M_1                 
         2     5.00000000E+03   # M_2                 
         3     5.00000000E+03   # M_3                 
        11     0.00000000E+00   # A_t                 
        12     0.00000000E+00   # A_b                 
        13     0.00000000E+00   # A_tau               
        14     0.00000000E+00   # A_u                 
        15     0.00000000E+00   # A_d                 
        16     0.00000000E+00   # A_e                 
        23     1.00000000E+03   # mu(EWSB)            
        25     1.05000000E+00   # tanbeta(in)         
        26     1.00000000E+03   # MA_pole             
        31     5.00000000E+03   # M_eL                
        32     5.00000000E+03   # M_muL               
        33     5.00000000E+03   # M_tauL              
        34     5.00000000E+03   # M_eR                
        35     5.00000000E+03   # M_muR               
        36     5.00000000E+03   # M_tauR              
        41     2.22000000E+02   # M_q1L               
        42     2.22000000E+02   # M_q2L               
        43     5.00000000E+03   # M_q3L               
        44     2.22000000E+02   # M_uR                
        45     2.22000000E+02   # M_cR                
        46     5.00000000E+03   # M_tR                
        47     2.22000000E+02   # M_dR                
        48     2.22000000E+02   # M_sR                
        49     5.00000000E+03   # M_bR                
#
BLOCK MASS  # Mass Spectrum
# PDG code           mass       particle
        24     8.05864904E+01   # W+
        25     7.13572865E+01   # h
        35     1.00939306E+03   # H
        36     1.00000000E+03   # A
        37     1.00330674E+03   # H+
         5     4.87877839E+00   # b-quark pole mass calculated from mb(mb)_Msbar
   1000001     4.49747620E+02   # ~d_L
   2000001     4.49936215E+02   # ~d_R
   1000002     4.50171472E+02   # ~u_L
   2000002     4.50076517E+02   # ~u_R
   1000003     4.49747620E+02   # ~s_L
   2000003     4.49936215E+02   # ~s_R
   1000004     4.50171472E+02   # ~c_L
   2000004     4.50076517E+02   # ~c_R
   1000005     5.04736229E+03   # ~b_1
   2000005     5.04781021E+03   # ~b_2
   1000006     4.90986924E+03   # ~t_1
   2000006     5.04722208E+03   # ~t_2
   1000011     4.99998817E+03   # ~e_L
   2000011     4.99998829E+03   # ~e_R
   1000012     5.00002353E+03   # ~nu_eL
   1000013     4.99998817E+03   # ~mu_L
   2000013     4.99998829E+03   # ~mu_R
   1000014     5.00002353E+03   # ~nu_muL
   1000015     4.99982348E+03   # ~tau_1
   2000015     5.00015359E+03   # ~tau_2
   1000016     5.00002353E+03   # ~nu_tauL
   1000021     5.16013133E+03   # ~g
   1000022     3.79923735E+02   # ~chi_10
   1000023    -1.01781870E+03   # ~chi_20
   1000025     1.01943934E+03   # ~chi_30
   1000035     4.96310079E+03   # ~chi_40
   1000024     1.01627453E+03   # ~chi_1+
   1000037     4.96310062E+03   # ~chi_2+
#
BLOCK NMIX  # Neutralino Mixing Matrix
  1  1     9.97521428E-01   # N_11
  1  2    -1.19749461E-03   # N_12
  1  3     4.90835603E-02   # N_13
  1  4    -5.04020828E-02   # N_14
  2  1     9.31722407E-04   # N_21
  2  2    -3.79393524E-04   # N_22
  2  3     7.07131234E-01   # N_23
  2  4     7.07081612E-01   # N_24
  3  1     7.03569051E-02   # N_31
  3  2     1.97389372E-02   # N_32
  3  3    -7.05232691E-01   # N_33
  3  4     7.05200065E-01   # N_34
  4  1     1.93928442E-04   # N_41
  4  2    -9.99804379E-01   # N_42
  4  3    -1.42503898E-02   # N_43
  4  4     1.37146767E-02   # N_44
#
BLOCK UMIX  # Chargino Mixing Matrix U
  1  1    -2.01509497E-02   # U_11
  1  2     9.99796949E-01   # U_12
  2  1     9.99796949E-01   # U_21
  2  2     2.01509497E-02   # U_22
#
BLOCK VMIX  # Chargino Mixing Matrix V
  1  1    -1.93932261E-02   # V_11
  1  2     9.99811934E-01   # V_12
  2  1     9.99811934E-01   # V_21
  2  2     1.93932261E-02   # V_22
#
BLOCK STOPMIX  # Stop Mixing Matrix
  1  1     1.07062352E-01   # cos(theta_t)
  1  2     9.94252308E-01   # sin(theta_t)
  2  1    -9.94252308E-01   # -sin(theta_t)
  2  2     1.07062352E-01   # cos(theta_t)
#
BLOCK SBOTMIX  # Sbottom Mixing Matrix
  1  1     7.19493717E-01   # cos(theta_b)
  1  2     6.94498950E-01   # sin(theta_b)
  2  1    -6.94498950E-01   # -sin(theta_b)
  2  2     7.19493717E-01   # cos(theta_b)
#
BLOCK STAUMIX  # Stau Mixing Matrix
  1  1     7.07236188E-01   # cos(theta_tau)
  1  2     7.06977351E-01   # sin(theta_tau)
  2  1    -7.06977351E-01   # -sin(theta_tau)
  2  2     7.07236188E-01   # cos(theta_tau)
#
BLOCK ALPHA  # Higgs mixing
          -8.21942601E-01   # Mixing angle in the neutral Higgs boson sector
#
BLOCK HMIX Q=  5.00190490E+03  # DRbar Higgs Parameters
         1     1.00000000E+03   # mu(Q)               
         2     9.43557873E-01   # tanbeta(Q)          
         3     2.44974157E+02   # vev(Q)              
         4     1.10477576E+06   # MA^2(Q)             
#
BLOCK GAUGE Q=  5.00190490E+03  # The gauge couplings
     1     3.66655790E-01   # gprime(Q) DRbar
     2     6.37247918E-01   # g(Q) DRbar
     3     1.02057831E+00   # g3(Q) DRbar
#
BLOCK AU Q=  5.00190490E+03  # The trilinear couplings
  1  1     0.00000000E+00   # A_u(Q) DRbar
  2  2     0.00000000E+00   # A_c(Q) DRbar
  3  3     0.00000000E+00   # A_t(Q) DRbar
#
BLOCK AD Q=  5.00190490E+03  # The trilinear couplings
  1  1     0.00000000E+00   # A_d(Q) DRbar
  2  2     0.00000000E+00   # A_s(Q) DRbar
  3  3     0.00000000E+00   # A_b(Q) DRbar
#
BLOCK AE Q=  5.00190490E+03  # The trilinear couplings
  1  1     0.00000000E+00   # A_e(Q) DRbar
  2  2     0.00000000E+00   # A_mu(Q) DRbar
  3  3     0.00000000E+00   # A_tau(Q) DRbar
#
BLOCK Yu Q=  5.00190490E+03  # The Yukawa couplings
  1  1     0.00000000E+00   # y_u(Q) DRbar
  2  2     0.00000000E+00   # y_c(Q) DRbar
  3  3     1.17068052E+00   # y_t(Q) DRbar
#
BLOCK Yd Q=  5.00190490E+03  # The Yukawa couplings
  1  1     0.00000000E+00   # y_d(Q) DRbar
  2  2     0.00000000E+00   # y_s(Q) DRbar
  3  3     1.87053240E-02   # y_b(Q) DRbar
#
BLOCK Ye Q=  5.00190490E+03  # The Yukawa couplings
  1  1     0.00000000E+00   # y_e(Q) DRbar
  2  2     0.00000000E+00   # y_mu(Q) DRbar
  3  3     1.38834597E-02   # y_tau(Q) DRbar
#
BLOCK MSOFT Q=  5.00190490E+03  # The soft SUSY breaking masses at the scale Q
         1     4.00200000E+02   # M_1                 
         2     5.00000000E+03   # M_2                 
         3     5.00000000E+03   # M_3                 
        14     0.00000000E+00   # A_u                 
        15     0.00000000E+00   # A_d                 
        16     0.00000000E+00   # A_e                 
        21    -7.04931157E+05   # M^2_Hd              
        22     6.77925685E+05   # M^2_Hu              
        31     5.00000000E+03   # M_eL                
        32     5.00000000E+03   # M_muL               
        33     5.00000000E+03   # M_tauL              
        34     5.00000000E+03   # M_eR                
        35     5.00000000E+03   # M_muR               
        36     5.00000000E+03   # M_tauR              
        41     2.22000000E+02   # M_q1L               
        42     2.22000000E+02   # M_q2L               
        43     5.00000000E+03   # M_q3L               
        44     2.22000000E+02   # M_uR                
        45     2.22000000E+02   # M_cR                
        46     5.00000000E+03   # M_tR                
        47     2.22000000E+02   # M_dR                
        48     2.22000000E+02   # M_sR                
        49     5.00000000E+03   # M_bR                
#
#
#
#                             =================
#                             |The decay table|
#                             =================
#
# - The QCD corrections to the decays gluino -> squark  + quark
#                                     squark -> gaugino + quark_prime
#                                     squark -> squark_prime + Higgs
#                                     squark -> gluino  + quark
#   are included.
#
# - The multi-body decays for the inos, stops and sbottoms are included.
#
# - The loop induced decays for the gluino, neutralinos and stops
#   are included.
#
# - The SUSY decays of the top quark are included.
#
#
#         PDG            Width
DECAY         6     1.40143595E+00   # top decays
#          BR         NDA      ID1       ID2
     1.00000000E+00    2           5        24   # BR(t ->  b    W+)
#
#         PDG            Width
DECAY   1000021     8.67071995E+02   # gluino decays
#          BR         NDA      ID1       ID2
     6.24240346E-02    2     1000001        -1   # BR(~g -> ~d_L  db)
     6.24240346E-02    2    -1000001         1   # BR(~g -> ~d_L* d )
     6.24232329E-02    2     2000001        -1   # BR(~g -> ~d_R  db)
     6.24232329E-02    2    -2000001         1   # BR(~g -> ~d_R* d )
     6.24222324E-02    2     1000002        -2   # BR(~g -> ~u_L  ub)
     6.24222324E-02    2    -1000002         2   # BR(~g -> ~u_L* u )
     6.24226363E-02    2     2000002        -2   # BR(~g -> ~u_R  ub)
     6.24226363E-02    2    -2000002         2   # BR(~g -> ~u_R* u )
     6.24240346E-02    2     1000003        -3   # BR(~g -> ~s_L  sb)
     6.24240346E-02    2    -1000003         3   # BR(~g -> ~s_L* s )
     6.24232329E-02    2     2000003        -3   # BR(~g -> ~s_R  sb)
     6.24232329E-02    2    -2000003         3   # BR(~g -> ~s_R* s )
     6.24222324E-02    2     1000004        -4   # BR(~g -> ~c_L  cb)
     6.24222324E-02    2    -1000004         4   # BR(~g -> ~c_L* c )
     6.24226363E-02    2     2000004        -4   # BR(~g -> ~c_R  cb)
     6.24226363E-02    2    -2000004         4   # BR(~g -> ~c_R* c )
     1.24625309E-04    2     1000005        -5   # BR(~g -> ~b_1  bb)
     1.24625309E-04    2    -1000005         5   # BR(~g -> ~b_1* b )
     1.33202536E-04    2     2000005        -5   # BR(~g -> ~b_2  bb)
     1.33202536E-04    2    -2000005         5   # BR(~g -> ~b_2* b )
     3.57899769E-04    2     1000006        -6   # BR(~g -> ~t_1  tb)
     3.57899769E-04    2    -1000006         6   # BR(~g -> ~t_1* t )
#
#         PDG            Width
DECAY   1000006     2.48726823E+02   # stop1 decays
#          BR         NDA      ID1       ID2
     4.67812600E-02    2     1000022         6   # BR(~t_1 -> ~chi_10 t )
     2.41456067E-01    2     1000023         6   # BR(~t_1 -> ~chi_20 t )
     2.37840801E-01    2     1000025         6   # BR(~t_1 -> ~chi_30 t )
     4.73921872E-01    2     1000024         5   # BR(~t_1 -> ~chi_1+ b )
#
#         PDG            Width
DECAY   2000006     1.26288092E+02   # stop2 decays
#          BR         NDA      ID1       ID2
     6.53404849E-03    2     1000022         6   # BR(~t_2 -> ~chi_10 t )
     4.86555122E-01    2     1000023         6   # BR(~t_2 -> ~chi_20 t )
     4.88971644E-01    2     1000025         6   # BR(~t_2 -> ~chi_30 t )
     1.67186654E-02    2     1000024         5   # BR(~t_2 -> ~chi_1+ b )
     3.82812270E-04    2     1000037         5   # BR(~t_2 -> ~chi_2+ b )
     7.79517919E-04    2     1000006        25   # BR(~t_2 -> ~t_1    h )
     5.81893383E-05    2     1000006        23   # BR(~t_2 -> ~t_1    Z )
#
#         PDG            Width
DECAY   1000005     6.40692724E+01   # sbottom1 decays
#          BR         NDA      ID1       ID2
     2.80687442E-02    2     1000022         5   # BR(~b_1 -> ~chi_10 b )
     2.53577187E-04    2     1000023         5   # BR(~b_1 -> ~chi_20 b )
     1.79533355E-04    2     1000025         5   # BR(~b_1 -> ~chi_30 b )
     1.93140420E-04    2     1000035         5   # BR(~b_1 -> ~chi_40 b )
     9.71506046E-01    2    -1000024         6   # BR(~b_1 -> ~chi_1- t )
     2.01041154E-04    2     1000006       -24   # BR(~b_1 -> ~t_1    W-)
#
#         PDG            Width
DECAY   2000005     6.28616496E+01   # sbottom2 decays
#          BR         NDA      ID1       ID2
     2.82161545E-02    2     1000022         5   # BR(~b_2 -> ~chi_10 b )
     2.42836968E-04    2     1000023         5   # BR(~b_2 -> ~chi_20 b )
     5.37116126E-04    2     1000025         5   # BR(~b_2 -> ~chi_30 b )
     1.94343653E-04    2     1000035         5   # BR(~b_2 -> ~chi_40 b )
     9.71005617E-01    2    -1000024         6   # BR(~b_2 -> ~chi_1- t )
     1.96068143E-04    2     1000006       -24   # BR(~b_2 -> ~t_1    W-)
#
#         PDG            Width
DECAY   1000002     7.21817809E-03   # sup_L decays
#          BR         NDA      ID1       ID2
     1.00000000E+00    2     1000022         2   # BR(~u_L -> ~chi_10 u)
#
#         PDG            Width
DECAY   2000002     1.16708062E-01   # sup_R decays
#          BR         NDA      ID1       ID2
     1.00000000E+00    2     1000022         2   # BR(~u_R -> ~chi_10 u)
#
#         PDG            Width
DECAY   1000001     7.33282491E-03   # sdown_L decays
#          BR         NDA      ID1       ID2
     1.00000000E+00    2     1000022         1   # BR(~d_L -> ~chi_10 d)
#
#         PDG            Width
DECAY   2000001     2.90875995E-02   # sdown_R decays
#          BR         NDA      ID1       ID2
     1.00000000E+00    2     1000022         1   # BR(~d_R -> ~chi_10 d)
#
#         PDG            Width
DECAY   1000004     7.21817809E-03   # scharm_L decays
#          BR         NDA      ID1       ID2
     1.00000000E+00    2     1000022         4   # BR(~c_L -> ~chi_10 c)
#
#         PDG            Width
DECAY   2000004     1.16708062E-01   # scharm_R decays
#          BR         NDA      ID1       ID2
     1.00000000E+00    2     1000022         4   # BR(~c_R -> ~chi_10 c)
#
#         PDG            Width
DECAY   1000003     7.33282491E-03   # sstrange_L decays
#          BR         NDA      ID1       ID2
     1.00000000E+00    2     1000022         3   # BR(~s_L -> ~chi_10 s)
#
#         PDG            Width
DECAY   2000003     2.90875995E-02   # sstrange_R decays
#          BR         NDA      ID1       ID2
     1.00000000E+00    2     1000022         3   # BR(~s_R -> ~chi_10 s)
#
#         PDG            Width
DECAY   1000011     6.64462657E+00   # selectron_L decays
#          BR         NDA      ID1       ID2
     9.85635787E-01    2     1000022        11   # BR(~e_L -> ~chi_10 e-)
     6.85751514E-08    2     1000023        11   # BR(~e_L -> ~chi_20 e-)
     1.01256737E-02    2     1000025        11   # BR(~e_L -> ~chi_30 e-)
     6.56472068E-04    2     1000035        11   # BR(~e_L -> ~chi_40 e-)
     2.26876928E-03    2    -1000024        12   # BR(~e_L -> ~chi_1- nu_e)
     1.31322978E-03    2    -1000037        12   # BR(~e_L -> ~chi_2- nu_e)
#
#         PDG            Width
DECAY   2000011     2.64280196E+01   # selectron_R decays
#          BR         NDA      ID1       ID2
     9.95397523E-01    2     1000022        11   # BR(~e_R -> ~chi_10 e-)
     8.07225262E-07    2     1000023        11   # BR(~e_R -> ~chi_20 e-)
     4.60166967E-03    2     1000025        11   # BR(~e_R -> ~chi_30 e-)
     8.22498551E-12    2     1000035        11   # BR(~e_R -> ~chi_40 e-)
#
#         PDG            Width
DECAY   1000013     6.64462657E+00   # smuon_L decays
#          BR         NDA      ID1       ID2
     9.85635787E-01    2     1000022        13   # BR(~mu_L -> ~chi_10 mu-)
     6.85751514E-08    2     1000023        13   # BR(~mu_L -> ~chi_20 mu-)
     1.01256737E-02    2     1000025        13   # BR(~mu_L -> ~chi_30 mu-)
     6.56472068E-04    2     1000035        13   # BR(~mu_L -> ~chi_40 mu-)
     2.26876928E-03    2    -1000024        14   # BR(~mu_L -> ~chi_1- nu_mu)
     1.31322978E-03    2    -1000037        14   # BR(~mu_L -> ~chi_2- nu_mu)
#
#         PDG            Width
DECAY   2000013     2.64280196E+01   # smuon_R decays
#          BR         NDA      ID1       ID2
     9.95397523E-01    2     1000022        13   # BR(~mu_R -> ~chi_10 mu-)
     8.07225262E-07    2     1000023        13   # BR(~mu_R -> ~chi_20 mu-)
     4.60166967E-03    2     1000025        13   # BR(~mu_R -> ~chi_30 mu-)
     8.22498551E-12    2     1000035        13   # BR(~mu_R -> ~chi_40 mu-)
#
#         PDG            Width
DECAY   1000015     1.65848864E+01   # stau_1 decays
#          BR         NDA      ID1       ID2
     9.91368357E-01    2     1000022        15   # BR(~tau_1 -> ~chi_10  tau-)
     5.54193314E-04    2     1000023        15   # BR(~tau_1 -> ~chi_20  tau-)
     5.71874507E-03    2     1000025        15   # BR(~tau_1 -> ~chi_30  tau-)
     1.30124765E-04    2     1000035        15   # BR(~tau_1 -> ~chi_40  tau-)
     1.96797100E-03    2    -1000024        16   # BR(~tau_1 -> ~chi_1-  nu_tau)
     2.60608352E-04    2    -1000037        16   # BR(~tau_1 -> ~chi_2-  nu_tau)
#
#         PDG            Width
DECAY   2000015     1.65405913E+01   # stau_2 decays
#          BR         NDA      ID1       ID2
     9.92341634E-01    2     1000022        15   # BR(~tau_2 -> ~chi_10  tau-)
     5.10801637E-04    2     1000023        15   # BR(~tau_2 -> ~chi_20  tau-)
     6.74533046E-03    2     1000025        15   # BR(~tau_2 -> ~chi_30  tau-)
     1.32956625E-04    2     1000035        15   # BR(~tau_2 -> ~chi_40  tau-)
     3.01443889E-06    2    -1000024        16   # BR(~tau_2 -> ~chi_1-  nu_tau)
     2.66262790E-04    2    -1000037        16   # BR(~tau_2 -> ~chi_2-  nu_tau)
#
#         PDG            Width
DECAY   1000012     6.63919152E+00   # snu_eL decays
#          BR         NDA      ID1       ID2
     9.94716842E-01    2     1000022        12   # BR(~nu_eL -> ~chi_10 nu_e)
     2.34268710E-06    2     1000023        12   # BR(~nu_eL -> ~chi_20 nu_e)
     1.20232141E-03    2     1000025        12   # BR(~nu_eL -> ~chi_30 nu_e)
     6.58554319E-04    2     1000035        12   # BR(~nu_eL -> ~chi_40 nu_e)
     2.10309261E-03    2     1000024        11   # BR(~nu_eL -> ~chi_1+ e-)
     1.31684668E-03    2     1000037        11   # BR(~nu_eL -> ~chi_2+ e-)
#
#         PDG            Width
DECAY   1000014     6.63919152E+00   # snu_muL decays
#          BR         NDA      ID1       ID2
     9.94716842E-01    2     1000022        14   # BR(~nu_muL -> ~chi_10 nu_mu)
     2.34268710E-06    2     1000023        14   # BR(~nu_muL -> ~chi_20 nu_mu)
     1.20232141E-03    2     1000025        14   # BR(~nu_muL -> ~chi_30 nu_mu)
     6.58554319E-04    2     1000035        14   # BR(~nu_muL -> ~chi_40 nu_mu)
     2.10309261E-03    2     1000024        13   # BR(~nu_muL -> ~chi_1+ mu-)
     1.31684668E-03    2     1000037        13   # BR(~nu_muL -> ~chi_2+ mu-)
#
#         PDG            Width
DECAY   1000016     6.65679167E+00   # snu_tauL decays
#          BR         NDA      ID1       ID2
     9.92086873E-01    2     1000022        16   # BR(~nu_tauL -> ~chi_10 nu_tau)
     2.33649318E-06    2     1000023        16   # BR(~nu_tauL -> ~chi_20 nu_tau)
     1.19914255E-03    2     1000025        16   # BR(~nu_tauL -> ~chi_30 nu_tau)
     6.56813142E-04    2     1000035        16   # BR(~nu_tauL -> ~chi_40 nu_tau)
     4.74294774E-03    2     1000024        15   # BR(~nu_tauL -> ~chi_1+ tau-)
     1.31188715E-03    2     1000037        15   # BR(~nu_tauL -> ~chi_2+ tau-)
#
#         PDG            Width
DECAY   1000024     1.02354370E+00   # chargino1+ decays
#          BR         NDA      ID1       ID2
     3.20656494E-03    2     1000002        -1   # BR(~chi_1+ -> ~u_L     db)
     3.46502204E-03    2    -1000001         2   # BR(~chi_1+ -> ~d_L*    u )
     3.20656494E-03    2     1000004        -3   # BR(~chi_1+ -> ~c_L     sb)
     3.46502204E-03    2    -1000003         4   # BR(~chi_1+ -> ~s_L*    c )
     9.86656826E-01    2     1000022        24   # BR(~chi_1+ -> ~chi_10  W+)
#
#         PDG            Width
DECAY   1000037     3.05095160E+02   # chargino2+ decays
#          BR         NDA      ID1       ID2
     1.88303354E-01    2     1000002        -1   # BR(~chi_2+ -> ~u_L     db)
     1.88302464E-01    2    -1000001         2   # BR(~chi_2+ -> ~d_L*    u )
     1.88303354E-01    2     1000004        -3   # BR(~chi_2+ -> ~c_L     sb)
     1.88302464E-01    2    -1000003         4   # BR(~chi_2+ -> ~s_L*    c )
     1.15610576E-06    2     1000006        -5   # BR(~chi_2+ -> ~t_1     bb)
     4.45176396E-02    2     1000024        23   # BR(~chi_2+ -> ~chi_1+  Z )
     1.23408357E-04    2     1000022        24   # BR(~chi_2+ -> ~chi_10  W+)
     4.28269835E-02    2     1000023        24   # BR(~chi_2+ -> ~chi_20  W+)
     4.27173088E-02    2     1000025        24   # BR(~chi_2+ -> ~chi_30  W+)
     4.55656693E-02    2     1000024        25   # BR(~chi_2+ -> ~chi_1+  h )
     1.77602124E-02    2     1000024        35   # BR(~chi_2+ -> ~chi_1+  H )
     1.77597986E-02    2     1000024        36   # BR(~chi_2+ -> ~chi_1+  A )
     8.88087387E-05    2     1000022        37   # BR(~chi_2+ -> ~chi_10  H+)
     1.77491614E-02    2     1000023        37   # BR(~chi_2+ -> ~chi_20  H+)
     1.76782175E-02    2     1000025        37   # BR(~chi_2+ -> ~chi_30  H+)
#
#         PDG            Width
DECAY   1000022     0.00000000E+00   # neutralino1 decays
#
#         PDG            Width
DECAY   1000023     1.04969365E+00   # neutralino2 decays
#          BR         NDA      ID1       ID2
     9.99694672E-01    2     1000022        23   # BR(~chi_20 -> ~chi_10   Z )
     2.88806712E-04    2     1000022        25   # BR(~chi_20 -> ~chi_10   h )
     1.82699765E-07    2     1000002        -2   # BR(~chi_20 -> ~u_L      ub)
     1.82699765E-07    2    -1000002         2   # BR(~chi_20 -> ~u_L*     u )
     2.31784850E-06    2     2000002        -2   # BR(~chi_20 -> ~u_R      ub)
     2.31784850E-06    2    -2000002         2   # BR(~chi_20 -> ~u_R*     u )
     1.41389354E-06    2     1000001        -1   # BR(~chi_20 -> ~d_L      db)
     1.41389354E-06    2    -1000001         1   # BR(~chi_20 -> ~d_L*     d )
     5.79618350E-07    2     2000001        -1   # BR(~chi_20 -> ~d_R      db)
     5.79618350E-07    2    -2000001         1   # BR(~chi_20 -> ~d_R*     d )
     1.82699765E-07    2     1000004        -4   # BR(~chi_20 -> ~c_L      cb)
     1.82699765E-07    2    -1000004         4   # BR(~chi_20 -> ~c_L*     c )
     2.31784850E-06    2     2000004        -4   # BR(~chi_20 -> ~c_R      cb)
     2.31784850E-06    2    -2000004         4   # BR(~chi_20 -> ~c_R*     c )
     1.41389354E-06    2     1000003        -3   # BR(~chi_20 -> ~s_L      sb)
     1.41389354E-06    2    -1000003         3   # BR(~chi_20 -> ~s_L*     s )
     5.79618350E-07    2     2000003        -3   # BR(~chi_20 -> ~s_R      sb)
     5.79618350E-07    2    -2000003         3   # BR(~chi_20 -> ~s_R*     s )
#
#         PDG            Width
DECAY   1000025     1.16531654E+00   # neutralino3 decays
#          BR         NDA      ID1       ID2
     1.65506006E-04    2     1000022        23   # BR(~chi_30 -> ~chi_10   Z )
     9.27734768E-01    2     1000022        25   # BR(~chi_30 -> ~chi_10   h )
     4.52521011E-03    2     1000002        -2   # BR(~chi_30 -> ~u_L      ub)
     4.52521011E-03    2    -1000002         2   # BR(~chi_30 -> ~u_L*     u )
     1.19392093E-02    2     2000002        -2   # BR(~chi_30 -> ~u_R      ub)
     1.19392093E-02    2    -2000002         2   # BR(~chi_30 -> ~u_R*     u )
     1.59932189E-04    2     1000001        -1   # BR(~chi_30 -> ~d_L      db)
     1.59932189E-04    2    -1000001         1   # BR(~chi_30 -> ~d_L*     d )
     2.98560380E-03    2     2000001        -1   # BR(~chi_30 -> ~d_R      db)
     2.98560380E-03    2    -2000001         1   # BR(~chi_30 -> ~d_R*     d )
     4.52521011E-03    2     1000004        -4   # BR(~chi_30 -> ~c_L      cb)
     4.52521011E-03    2    -1000004         4   # BR(~chi_30 -> ~c_L*     c )
     1.19392093E-02    2     2000004        -4   # BR(~chi_30 -> ~c_R      cb)
     1.19392093E-02    2    -2000004         4   # BR(~chi_30 -> ~c_R*     c )
     1.59932189E-04    2     1000003        -3   # BR(~chi_30 -> ~s_L      sb)
     1.59932189E-04    2    -1000003         3   # BR(~chi_30 -> ~s_L*     s )
     2.98560380E-03    2     2000003        -3   # BR(~chi_30 -> ~s_R      sb)
     2.98560380E-03    2    -2000003         3   # BR(~chi_30 -> ~s_R*     s )
#
#         PDG            Width
DECAY   1000035     3.05095356E+02   # neutralino4 decays
#          BR         NDA      ID1       ID2
     8.58433868E-09    2     1000022        23   # BR(~chi_40 -> ~chi_10   Z )
     4.45108082E-02    2     1000023        23   # BR(~chi_40 -> ~chi_20   Z )
     1.62941682E-05    2     1000025        23   # BR(~chi_40 -> ~chi_30   Z )
     4.28177706E-02    2     1000024       -24   # BR(~chi_40 -> ~chi_1+   W-)
     4.28177706E-02    2    -1000024        24   # BR(~chi_40 -> ~chi_1-   W+)
     1.31215181E-04    2     1000022        25   # BR(~chi_40 -> ~chi_10   h )
     3.81666468E-07    2     1000022        35   # BR(~chi_40 -> ~chi_10   H )
     8.84543295E-05    2     1000022        36   # BR(~chi_40 -> ~chi_10   A )
     2.65539470E-05    2     1000023        25   # BR(~chi_40 -> ~chi_20   h )
     1.76832921E-02    2     1000023        35   # BR(~chi_40 -> ~chi_20   H )
     3.56572752E-05    2     1000023        36   # BR(~chi_40 -> ~chi_20   A )
     4.54322903E-02    2     1000025        25   # BR(~chi_40 -> ~chi_30   h )
     5.61426464E-05    2     1000025        35   # BR(~chi_40 -> ~chi_30   H )
     1.76327960E-02    2     1000025        36   # BR(~chi_40 -> ~chi_30   A )
     1.77697363E-02    2     1000024       -37   # BR(~chi_40 -> ~chi_1+   H-)
     1.77697363E-02    2    -1000024        37   # BR(~chi_40 -> ~chi_1-   H+)
     9.13809923E-02    2     1000002        -2   # BR(~chi_40 -> ~u_L      ub)
     9.13809923E-02    2    -1000002         2   # BR(~chi_40 -> ~u_L*     u )
     2.02358145E-09    2     2000002        -2   # BR(~chi_40 -> ~u_R      ub)
     2.02358145E-09    2    -2000002         2   # BR(~chi_40 -> ~u_R*     u )
     9.13963194E-02    2     1000001        -1   # BR(~chi_40 -> ~d_L      db)
     9.13963194E-02    2    -1000001         1   # BR(~chi_40 -> ~d_L*     d )
     5.05898529E-10    2     2000001        -1   # BR(~chi_40 -> ~d_R      db)
     5.05898529E-10    2    -2000001         1   # BR(~chi_40 -> ~d_R*     d )
     9.13809923E-02    2     1000004        -4   # BR(~chi_40 -> ~c_L      cb)
     9.13809923E-02    2    -1000004         4   # BR(~chi_40 -> ~c_L*     c )
     2.02358145E-09    2     2000004        -4   # BR(~chi_40 -> ~c_R      cb)
     2.02358145E-09    2    -2000004         4   # BR(~chi_40 -> ~c_R*     c )
     9.13963194E-02    2     1000003        -3   # BR(~chi_40 -> ~s_L      sb)
     9.13963194E-02    2    -1000003         3   # BR(~chi_40 -> ~s_L*     s )
     5.05898529E-10    2     2000003        -3   # BR(~chi_40 -> ~s_R      sb)
     5.05898529E-10    2    -2000003         3   # BR(~chi_40 -> ~s_R*     s )
#
#         PDG            Width
DECAY        25     1.88488428E-03   # h decays
#          BR         NDA      ID1       ID2
     8.60872434E-01    2           5        -5   # BR(h -> b       bb     )
     7.92845504E-02    2         -15        15   # BR(h -> tau+    tau-   )
     2.81310053E-04    2         -13        13   # BR(h -> mu+     mu-    )
     6.68826168E-04    2           3        -3   # BR(h -> s       sb     )
     2.82976702E-02    2           4        -4   # BR(h -> c       cb     )
     2.95967584E-02    2          21        21   # BR(h -> g       g      )
     6.99011098E-04    2          22        22   # BR(h -> gam     gam    )
     2.31251355E-04    2          24       -24   # BR(h -> W+      W-     )
     6.81879987E-05    2          23        23   # BR(h -> Z       Z      )
#
#         PDG            Width
DECAY        35     4.86134990E+01   # H decays
#          BR         NDA      ID1       ID2
     2.46377332E-04    2           5        -5   # BR(H -> b       bb     )
     3.77057570E-05    2         -15        15   # BR(H -> tau+    tau-   )
     1.33290731E-07    2         -13        13   # BR(H -> mu+     mu-    )
     1.85101129E-07    2           3        -3   # BR(H -> s       sb     )
     1.10884465E-05    2           4        -4   # BR(H -> c       cb     )
     9.94638837E-01    2           6        -6   # BR(H -> t       tb     )
     1.42272994E-03    2          21        21   # BR(H -> g       g      )
     4.41790405E-06    2          22        22   # BR(H -> gam     gam    )
     1.68200337E-06    2          23        22   # BR(H -> Z       gam    )
     3.77056345E-04    2          24       -24   # BR(H -> W+      W-     )
     1.86518259E-04    2          23        23   # BR(H -> Z       Z      )
     1.39961608E-03    2          25        25   # BR(H -> h       h      )
     1.01653896E-18    2          36        36   # BR(H -> A       A      )
     1.61477420E-09    2          23        36   # BR(H -> Z       A      )
     4.49639817E-10    2          24       -37   # BR(H -> W+      H-     )
     4.49639817E-10    2         -24        37   # BR(H -> W-      H+     )
     1.73534699E-07    2     1000022   1000022   # BR(H -> ~chi_10 ~chi_10)
     3.13028606E-04    2     1000002  -1000002   # BR(H -> ~u_L    ~u_L*  )
     5.32798431E-05    2     2000002  -2000002   # BR(H -> ~u_R    ~u_R*  )
     3.13028606E-04    2     1000004  -1000004   # BR(H -> ~c_L    ~c_L*  )
     5.32798431E-05    2     2000004  -2000004   # BR(H -> ~c_R    ~c_R*  )
     4.57093701E-04    2     1000001  -1000001   # BR(H -> ~d_L    ~d_L*  )
     1.33360773E-05    2     2000001  -2000001   # BR(H -> ~d_R    ~d_R*  )
     4.57093701E-04    2     1000003  -1000003   # BR(H -> ~s_L    ~s_L*  )
     1.33360773E-05    2     2000003  -2000003   # BR(H -> ~s_R    ~s_R*  )
#
#         PDG            Width
DECAY        36     5.20079119E+01   # A decays
#          BR         NDA      ID1       ID2
     2.38990273E-04    2           5        -5   # BR(A -> b       bb     )
     3.54819586E-05    2         -15        15   # BR(A -> tau+    tau-   )
     1.25428016E-07    2         -13        13   # BR(A -> mu+     mu-    )
     1.87737180E-07    2           3        -3   # BR(A -> s       sb     )
     1.02308411E-05    2           4        -4   # BR(A -> c       cb     )
     9.97510574E-01    2           6        -6   # BR(A -> t       tb     )
     1.70717965E-03    2          21        21   # BR(A -> g       g      )
     5.53894210E-06    2          22        22   # BR(A -> gam     gam    )
     2.07305726E-06    2          23        22   # BR(A -> Z       gam    )
     3.41838227E-04    2          23        25   # BR(A -> Z       h      )
     1.47779390E-04    2     1000022   1000022   # BR(A -> ~chi_10 ~chi_10)
#
#         PDG            Width
DECAY        37     5.05683322E+01   # H+ decays
#          BR         NDA      ID1       ID2
     3.95560430E-07    2           4        -5   # BR(H+ -> c       bb     )
     3.66127306E-05    2         -15        16   # BR(H+ -> tau+    nu_tau )
     1.29425267E-07    2         -13        14   # BR(H+ -> mu+     nu_mu  )
     2.42826507E-09    2           2        -5   # BR(H+ -> u       bb     )
     8.83949986E-09    2           2        -3   # BR(H+ -> u       sb     )
     1.02692093E-05    2           4        -3   # BR(H+ -> c       sb     )
     9.98153033E-01    2           6        -5   # BR(H+ -> t       bb     )
     3.57142760E-04    2          24        25   # BR(H+ -> W+      h      )
     1.02506079E-11    2          24        36   # BR(H+ -> W+      A      )
     7.21202874E-04    2     1000002  -1000001   # BR(H+ -> ~u_L    ~d_L*  )
     7.21202874E-04    2     1000004  -1000003   # BR(H+ -> ~c_L    ~s_L*  )
