#  ISAJET SUSY parameters in SUSY Les Houches Accord 2 format
#  Created by ISALHA 2.0 Last revision: C. Balazs 21 Apr 2009
Block SPINFO   # Program information
     1   ISASUGRA from ISAJET          # Spectrum Calculator
     2   7.80   29-OCT-2009 12:50:36   # Version number
Block MODSEL   # Model selection
     1    13   # Non-universal supergravity model                  
Block SMINPUTS   # Standard Model inputs
     1     1.27836243E+02   # alpha_em^(-1)
     2     1.16570000E-05   # G_Fermi
     3     1.17200002E-01   # alpha_s(M_Z)
     4     9.11699982E+01   # m_{Z}(pole)
     5     4.19999981E+00   # m_{b}(m_{b})
     6     1.72500000E+02   # m_{top}(pole)
     7     1.77699995E+00   # m_{tau}(pole)
Block MINPAR   # SUSY breaking input parameters
     1     5.00000000E+03   # m_0
     2     5.00000000E+03   # m_{1/2}
     3     1.04999995E+00   # tan(beta)
     4     1.00000000E+00   # sign(mu)
     5     0.00000000E+00   # A_0
Block EXTPAR   # Non-universal SUSY breaking parameters
     0     1.00000000E+04   # Input scale
    21    -1.21530960E+07   # Down type Higgs mass squared
    22    -1.21524730E+07   #  Up  type Higgs mass squared
     1     0.00000000E+00   #  U(1)_Y gaugino (Bino) mass
     2     5.00000000E+03   # SU(2)_L gaugino (Wino) mass
     3     5.00000000E+02   # SU(3)_C gaugino (gluino) mass
    34     5.00000000E+03   # Right scalar electron mass
    31     5.00000000E+03   # Left 1st gen. slepton mass
    47     5.00000000E+02   # Right scalar down mass
    44     5.00000000E+02   # Right scalar  up  mass
    41     5.00000000E+02   # Left 1st gen. squark mass
    36     5.00000000E+03   # Right scalar tau mass
    33     5.00000000E+03   # Left 3rd gen. slepton mass
    49     5.00000000E+03   # Right scalar bottom mass
    46     5.00000000E+03   # Right scalar top mass
    43     5.00000000E+03   # Left 3rd gen. squark mass
Block MASS   # Scalar and gaugino mass spectrum
#  PDG code   mass                 particle
        24     8.04229965E+01   #  W^+
        25     5.00000000e+03   #  h^0            
        35     5.00000000e+03   #  H^0            
        36     5.00000000e+03   #  A^0            
        37     5.00000000e+03   #  H^+            
   1000001     5.00000000e+02   #  dnl            
   1000002     5.00000000e+02   #  upl            
   1000003     5.00000000e+02   #  stl            
   1000004     5.00000000e+02   #  chl            
   1000005     5.00000000e+03   #  b1             
   1000006     5.00000000e+03   #  t1             
   1000011     5.00000000e+03   #  el-            
   1000012     5.00000000e+03   #  nuel           
   1000013     5.00000000e+03   #  mul-           
   1000014     5.00000000e+03   #  numl           
   1000015     5.00000000e+03   #  tau1           
   1000016     5.00000000e+03   #  nutl           
   1000021     1.00000000e+03   #  glss           
   1000022     0.00000000e+00   #  z1ss           
   1000023     5.00000000e+03   #  z2ss           
   1000024     5.00000000e+03   #  w1ss           
   1000025     5.00000000e+03   #  z3ss           
   1000035     5.00000000e+03   #  z4ss           
   1000037     5.00000000e+03   #  w2ss           
   2000001     5.00000000e+02   #  dnr            
   2000002     5.00000000e+02   #  upr            
   2000003     5.00000000e+02   #  str            
   2000004     5.00000000e+02   #  chr            
   2000005     5.00000000e+03   #  b2             
   2000006     5.00000000e+03   #  t2             
   2000011     5.00000000e+03   #  er-            
   2000013     5.00000000e+03   #  mur-           
   2000015     5.00000000e+03   #  tau2           
Block ALPHA   # Effective Higgs mixing parameter
         -7.61225343E-01   # alpha
Block STOPMIX   # stop mixing matrix
  1  1     4.11578804E-01   # O_{11}
  1  2     9.11374152E-01   # O_{12}
  2  1    -9.11374152E-01   # O_{21}
  2  2     4.11578804E-01   # O_{22}
Block SBOTMIX   # sbottom mixing matrix
  1  1     7.21292436E-01   # O_{11}
  1  2     6.92630649E-01   # O_{12}
  2  1    -6.92630649E-01   # O_{21}
  2  2     7.21292436E-01   # O_{22}
Block STAUMIX   # stau mixing matrix
  1  1     1.15967337E-02   # O_{11}
  1  2     9.99932766E-01   # O_{12}
  2  1    -9.99932766E-01   # O_{21}
  2  2     1.15967337E-02   # O_{22}
Block NMIX   # neutralino mixing matrix
  1  1     9.99965727E-01   #
  1  2     6.19883998E-04   #
  1  3     5.98469656E-03   #
  1  4    -5.69890067E-03   #
  2  1    -3.05461744E-03   #
  2  2    -8.99356544E-01   #
  2  3     3.09205741E-01   #
  2  4    -3.09095919E-01   #
  3  1    -2.02044539E-04   #
  3  2     8.11236241E-05   #
  3  3     7.07098126E-01   #
  3  4     7.07115471E-01   #
  4  1    -7.70109193E-03   #
  4  2     4.37215477E-01   #
  4  3     6.35899603E-01   #
  4  4    -6.35936439E-01   #
Block UMIX   # chargino U mixing matrix
  1  1    -8.51988018E-01   # U_{11}
  1  2     5.23561239E-01   # U_{12}
  2  1    -5.23561239E-01   # U_{21}
  2  2    -8.51988018E-01   # U_{22}
Block VMIX   # chargino V mixing matrix
  1  1    -8.51987004E-01   # V_{11}
  1  2     5.23562908E-01   # V_{12}
  2  1    -5.23562908E-01   # V_{21}
  2  2    -8.51987004E-01   # V_{22}
Block GAUGE Q=  4.95367969E+03   #
     1     3.57524991E-01   # g`
     2     6.52378619E-01   # g_2
     3     1.21928000E+00   # g_3
Block YU Q=  4.95367969E+03   #
  3  3     1.11666286E+00   # y_t
Block YD Q=  4.95367969E+03   #
  3  3     1.78913847E-02   # y_b
Block YE Q=  4.95367969E+03   #
  3  3     1.46171292E-02   # y_tau
Block HMIX Q=  4.95367969E+03   # Higgs mixing parameters
     1     5.00000000E+03   # mu(Q)
     2     1.04999995E+00   # tan(beta)(M_GUT)
     3     2.52928284E+02   # Higgs vev at Q
     4     2.50000000E+07   # m_A^2(Q)
Block MSOFT Q=  4.95367969E+03   # DRbar SUSY breaking parameters
     1    -2.49941841E-01   # M_1(Q)          
     2     4.97828369E+03   # M_2(Q)          
     3     5.71167542E+02   # M_3(Q)          
    31     5.02573047E+03   # MeL(Q)          
    32     5.02573047E+03   # MmuL(Q)         
    33     5.02622510E+03   # MtauL(Q)        
    34     4.99976221E+03   # MeR(Q)          
    35     4.99976221E+03   # MmuR(Q)         
    36     4.99974414E+03   # MtauR(Q)        
    41     1.03033508E+03   # MqL1(Q)         
    42     1.03033508E+03   # MqL2(Q)         
    43     4.98691504E+03   # MqL3(Q)         
    44     4.90182617E+02   # MuR(Q)          
    45     4.90182617E+02   # McR(Q)          
    46     4.92066553E+03   # MtR(Q)          
    47     4.83325043E+02   # MdR(Q)          
    48     4.83325043E+02   # MsR(Q)          
    49     4.99957080E+03   # MbR(Q)          
Block AU Q=  4.95367969E+03   #
  1  1    -7.30358887E+01   # A_u
  2  2    -7.30358887E+01   # A_c
  3  3    -7.30358887E+01   # A_t
Block AD Q=  4.95367969E+03   #
  1  1    -7.64760590E+01   # A_d
  2  2    -7.64760590E+01   # A_s
  3  3    -7.64760590E+01   # A_b
Block AE Q=  4.95367969E+03   #
  1  1    -5.29883537E+01   # A_e
  2  2    -5.29883537E+01   # A_mu
  3  3    -5.29883537E+01   # A_tau
#  ISAJET decay tables in SUSY Les Houches accord format
#  Created by ISALHD. Last revision: C. Balazs, 2005 May 25
Block DCINFO                           # Program information
     1   ISASUGRA from ISAJET          # Spectrum Calculator
     2   7.80   29-OCT-2009 12:50:36   # Version number
#         PDG         Width
DECAY         6  1.14680767E+00   # TP    decays
#          BR          NDA       ID1       ID2       ID3       ID4
      3.33333343E-01    3            2        -1         5             # TP     -->  UP     DB     BT          
      3.33333343E-01    3            4        -3         5             # TP     -->  CH     SB     BT          
      1.11111112E-01    3          -11        12         5             # TP     -->  E+     NUE    BT          
      1.11111112E-01    3          -13        14         5             # TP     -->  MU+    NUM    BT          
      1.11111112E-01    3          -15        16         5             # TP     -->  TAU+   NUT    BT          
#         PDG         Width
DECAY   1000021  1.03621834E+02   # GLSS  decays
#          BR          NDA       ID1       ID2       ID3       ID4
      5.85436690E-12    2      1000022        21                       # GLSS   -->  Z1SS   GL                 
      6.87584922E-09    3      1000022         5        -5             # GLSS   -->  Z1SS   BT     BB          
      1.32063898E-08    3      1000022         6        -6             # GLSS   -->  Z1SS   TP     TB          
      6.25234246E-02    2     -1000002         2                       # GLSS   -->  UBL    UP                 
      6.25234246E-02    2      1000002        -2                       # GLSS   -->  UPL    UB                 
      6.24715574E-02    2     -1000001         1                       # GLSS   -->  DBL    DN                 
      6.24715574E-02    2      1000001        -1                       # GLSS   -->  DNL    DB                 
      6.25105426E-02    2     -2000002         2                       # GLSS   -->  UBR    UP                 
      6.25105426E-02    2      2000002        -2                       # GLSS   -->  UPR    UB                 
      6.24948740E-02    2     -2000001         1                       # GLSS   -->  DBR    DN                 
      6.24948740E-02    2      2000001        -1                       # GLSS   -->  DNR    DB                 
      6.24715462E-02    2     -1000003         3                       # GLSS   -->  SBL    ST                 
      6.24715462E-02    2      1000003        -3                       # GLSS   -->  STL    SB                 
      6.24948703E-02    2     -2000003         3                       # GLSS   -->  SBR    ST                 
      6.24948703E-02    2      2000003        -3                       # GLSS   -->  STR    SB                 
      6.25230148E-02    2     -1000004         4                       # GLSS   -->  CBL    CH                 
      6.25230148E-02    2      1000004        -4                       # GLSS   -->  CHL    CB                 
      6.25101402E-02    2     -2000004         4                       # GLSS   -->  CBR    CH                 
      6.25101402E-02    2      2000004        -4                       # GLSS   -->  CHR    CB                 
#         PDG         Width
DECAY   1000002  7.05076978E-02   # UPL   decays
#          BR          NDA       ID1       ID2       ID3       ID4
      1.00000000E+00    2      1000022         2                       # UPL    -->  Z1SS   UP                 
#         PDG         Width
DECAY   1000001  7.07707256E-02   # DNL   decays
#          BR          NDA       ID1       ID2       ID3       ID4
      1.00000000E+00    2      1000022         1                       # DNL    -->  Z1SS   DN                 
#         PDG         Width
DECAY   1000003  7.07707331E-02   # STL   decays
#          BR          NDA       ID1       ID2       ID3       ID4
      1.00000000E+00    2      1000022         3                       # STL    -->  Z1SS   ST                 
#         PDG         Width
DECAY   1000004  7.05069304E-02   # CHL   decays
#          BR          NDA       ID1       ID2       ID3       ID4
      1.00000000E+00    2      1000022         4                       # CHL    -->  Z1SS   CH                 
#         PDG         Width
DECAY   1000005  2.44660980E+02   # BT1   decays
#          BR          NDA       ID1       ID2       ID3       ID4
      7.25519191E-03    2      1000022         5                       # BT1    -->  Z1SS   BT                 
      2.22272429E-05    2      1000023         5                       # BT1    -->  Z2SS   BT                 
      9.92722571E-01    2      1000021         5                       # BT1    -->  GLSS   BT                 
#         PDG         Width
DECAY   1000006  2.48612961E+02   # TP1   decays
#          BR          NDA       ID1       ID2       ID3       ID4
      9.75544035E-01    2      1000021         6                       # TP1    -->  GLSS   TP                 
      2.44396646E-02    2      1000022         6                       # TP1    -->  Z1SS   TP                 
      1.62604138E-05    2      1000024         5                       # TP1    -->  W1SS+  BT                 
#         PDG         Width
DECAY   2000002  1.13004911E+00   # UPR   decays
#          BR          NDA       ID1       ID2       ID3       ID4
      1.00000000E+00    2      1000022         2                       # UPR    -->  Z1SS   UP                 
#         PDG         Width
DECAY   2000001  2.82565385E-01   # DNR   decays
#          BR          NDA       ID1       ID2       ID3       ID4
      1.00000000E+00    2      1000022         1                       # DNR    -->  Z1SS   DN                 
#         PDG         Width
DECAY   2000003  2.82565415E-01   # STR   decays
#          BR          NDA       ID1       ID2       ID3       ID4
      1.00000000E+00    2      1000022         3                       # STR    -->  Z1SS   ST                 
#         PDG         Width
DECAY   2000004  1.13003671E+00   # CHR   decays
#          BR          NDA       ID1       ID2       ID3       ID4
      1.00000000E+00    2      1000022         4                       # CHR    -->  Z1SS   CH                 
#         PDG         Width
DECAY   2000005  2.44581329E+02   # BT2   decays
#          BR          NDA       ID1       ID2       ID3       ID4
      7.18731480E-03    2      1000022         5                       # BT2    -->  Z1SS   BT                 
      2.10697963E-05    2      1000023         5                       # BT2    -->  Z2SS   BT                 
      9.92791653E-01    2      1000021         5                       # BT2    -->  GLSS   BT                 
#         PDG         Width
DECAY   2000006  2.48448151E+02   # TP2   decays
#          BR          NDA       ID1       ID2       ID3       ID4
      9.74563181E-01    2      1000021         6                       # TP2    -->  GLSS   TP                 
      4.80419221E-05    2      1000024         5                       # TP2    -->  W1SS+  BT                 
      1.60212535E-03    2           23   1000006                       # TP2    -->  Z0     TP1                
      8.27363698E-12    2           25   1000006                       # TP2    -->  HL0    TP1                
      2.37866789E-02    2      1000022         6                       # TP2    -->  Z1SS   TP                 
#         PDG         Width
DECAY   1000011  6.38626623E+00   # EL-   decays
#          BR          NDA       ID1       ID2       ID3       ID4
      9.94956851E-01    2      1000022        11                       # EL-    -->  Z1SS   E-                 
      1.68973906E-03    2      1000023        11                       # EL-    -->  Z2SS   E-                 
      3.38365209E-19    2      1000025        11                       # EL-    -->  Z3SS   E-                 
      3.35341808E-03    2     -1000024        12                       # EL-    -->  W1SS-  NUE                
#         PDG         Width
DECAY   1000013  6.38626623E+00   # MUL-  decays
#          BR          NDA       ID1       ID2       ID3       ID4
      9.94956851E-01    2      1000022        13                       # MUL-   -->  Z1SS   MU-                
      1.68973766E-03    2      1000023        13                       # MUL-   -->  Z2SS   MU-                
      3.35341808E-03    2     -1000024        14                       # MUL-   -->  W1SS-  NUM                
#         PDG         Width
DECAY   1000015  1.59130335E+01   # TAU1- decays
#          BR          NDA       ID1       ID2       ID3       ID4
      9.98966992E-01    2      1000022        15                       # TAU1-  -->  Z1SS   TAU-               
      3.45881010E-04    2      1000023        15                       # TAU1-  -->  Z2SS   TAU-               
      6.87136839E-04    2     -1000024        16                       # TAU1-  -->  W1SS-  NUT                
#         PDG         Width
DECAY   1000012  6.39258051E+00   # NUEL  decays
#          BR          NDA       ID1       ID2       ID3       ID4
      9.94995892E-01    2      1000022        12                       # NUEL   -->  Z1SS   NUE                
      1.65389513E-03    2      1000023        12                       # NUEL   -->  Z2SS   NUE                
      3.35021457E-03    2      1000024        11                       # NUEL   -->  W1SS+  E-                 
      1.91097630E-19    3     -1000015        11        16             # NUEL   -->  TAU1+  E-     NUT         
#         PDG         Width
DECAY   1000014  6.39258051E+00   # NUML  decays
#          BR          NDA       ID1       ID2       ID3       ID4
      9.94995892E-01    2      1000022        14                       # NUML   -->  Z1SS   NUM                
      1.65389513E-03    2      1000023        14                       # NUML   -->  Z2SS   NUM                
      3.35021154E-03    2      1000024        13                       # NUML   -->  W1SS+  MU-                
      1.91097941E-19    3     -1000015        13        16             # NUML   -->  TAU1+  MU-    NUT         
#         PDG         Width
DECAY   1000016  6.39256477E+00   # NUTL  decays
#          BR          NDA       ID1       ID2       ID3       ID4
      9.94998336E-01    2      1000022        16                       # NUTL   -->  Z1SS   NUT                
      1.65389921E-03    2      1000023        16                       # NUTL   -->  Z2SS   NUT                
      3.34778032E-03    2      1000024        15                       # NUTL   -->  W1SS+  TAU-               
#         PDG         Width
DECAY   2000011  2.54293709E+01   # ER-   decays
#          BR          NDA       ID1       ID2       ID3       ID4
      9.99999940E-01    2      1000022        11                       # ER-    -->  Z1SS   E-                 
      4.07590441E-08    2      1000023        11                       # ER-    -->  Z2SS   E-                 
      5.74187060E-19    2      1000025        11                       # ER-    -->  Z3SS   E-                 
      2.46338005E-23    3      1000015        12       -16             # ER-    -->  TAU1-  NUE    ANUT        
#         PDG         Width
DECAY   2000013  2.54293709E+01   # MUR-  decays
#          BR          NDA       ID1       ID2       ID3       ID4
      9.99999940E-01    2      1000022        13                       # MUR-   -->  Z1SS   MU-                
      4.07590086E-08    2      1000023        13                       # MUR-   -->  Z2SS   MU-                
      5.20075884E-20    3      1000015        14       -16             # MUR-   -->  TAU1-  NUM    ANUT        
#         PDG         Width
DECAY   2000015  1.59025841E+01   # TAU2- decays
#          BR          NDA       ID1       ID2       ID3       ID4
      9.99009609E-01    2      1000022        15                       # TAU2-  -->  Z1SS   TAU-               
      3.31790972E-04    2      1000023        15                       # TAU2-  -->  Z2SS   TAU-               
      6.58595178E-04    2     -1000024        16                       # TAU2-  -->  W1SS-  NUT                
#         PDG         Width
DECAY   1000023  1.23618752E+02   # Z2SS  decays
#          BR          NDA       ID1       ID2       ID3       ID4
      4.84194594E-11    2      1000022        22                       # Z2SS   -->  Z1SS   GM                 
      7.48394496E-06    2      1000022        23                       # Z2SS   -->  Z1SS   Z0                 
      4.13394446E-06    3      1000022         5        -5             # Z2SS   -->  Z1SS   BT     BB          
      1.23788404E-05    3      1000022        11       -11             # Z2SS   -->  Z1SS   E-     E+          
      1.23788404E-05    3      1000022        13       -13             # Z2SS   -->  Z1SS   MU-    MU+         
      1.24273747E-05    3      1000022        15       -15             # Z2SS   -->  Z1SS   TAU-   TAU+        
      1.21463572E-05    3      1000022        12       -12             # Z2SS   -->  Z1SS   NUE    ANUE        
      1.21463572E-05    3      1000022        14       -14             # Z2SS   -->  Z1SS   NUM    ANUM        
      1.21463572E-05    3      1000022        16       -16             # Z2SS   -->  Z1SS   NUT    ANUT        
      1.30170751E-02    2      1000022        25                       # Z2SS   -->  Z1SS   HL0                
      1.23765483E-01    2      1000002        -2                       # Z2SS   -->  UPL    UB                 
      1.23765483E-01    2     -1000002         2                       # Z2SS   -->  UBL    UP                 
      1.22952305E-01    2      1000001        -1                       # Z2SS   -->  DNL    DB                 
      1.22952305E-01    2     -1000001         1                       # Z2SS   -->  DBL    DN                 
      1.22952305E-01    2      1000003        -3                       # Z2SS   -->  STL    SB                 
      1.22952305E-01    2     -1000003         3                       # Z2SS   -->  SBL    ST                 
      1.23765461E-01    2      1000004        -4                       # Z2SS   -->  CHL    CB                 
      1.23765461E-01    2     -1000004         4                       # Z2SS   -->  CBL    CH                 
      5.31821297E-06    2      2000002        -2                       # Z2SS   -->  UPR    UB                 
      5.31821297E-06    2     -2000002         2                       # Z2SS   -->  UBR    UP                 
      1.32954278E-06    2      2000001        -1                       # Z2SS   -->  DNR    DB                 
      1.32954278E-06    2     -2000001         1                       # Z2SS   -->  DBR    DN                 
      1.32954278E-06    2      2000003        -3                       # Z2SS   -->  STR    SB                 
      1.32954278E-06    2     -2000003         3                       # Z2SS   -->  SBR    ST                 
      5.31821252E-06    2      2000004        -4                       # Z2SS   -->  CHR    CB                 
      5.31821252E-06    2     -2000004         4                       # Z2SS   -->  CBR    CH                 
#         PDG         Width
DECAY   1000025  3.24259758E+00   # Z3SS  decays
#          BR          NDA       ID1       ID2       ID3       ID4
      8.06834669E-06    2      1000022        22                       # Z3SS   -->  Z1SS   GM                 
      1.40177827E-13    2      1000023        22                       # Z3SS   -->  Z2SS   GM                 
      8.90311436E-04    3     -1000024         2        -1             # Z3SS   -->  W1SS-  UP     DB          
      2.96770479E-04    3     -1000024        12       -11             # Z3SS   -->  W1SS-  NUE    E+          
      2.96770479E-04    3     -1000024        14       -13             # Z3SS   -->  W1SS-  NUM    MU+         
      8.90311436E-04    3      1000024         1        -2             # Z3SS   -->  W1SS+  DN     UB          
      2.96770479E-04    3      1000024        11       -12             # Z3SS   -->  W1SS+  E-     ANUE        
      2.96770479E-04    3      1000024        13       -14             # Z3SS   -->  W1SS+  MU-    ANUM        
      8.90311436E-04    3     -1000024         4        -3             # Z3SS   -->  W1SS-  CH     SB          
      2.96770479E-04    3     -1000024        16       -15             # Z3SS   -->  W1SS-  NUT    TAU+        
      8.90311436E-04    3      1000024         3        -4             # Z3SS   -->  W1SS+  ST     CB          
      2.96770479E-04    3      1000024        15       -16             # Z3SS   -->  W1SS+  TAU-   ANUT        
      9.92991328E-01    2      1000022        23                       # Z3SS   -->  Z1SS   Z0                 
      3.45996136E-06    3      1000022         5        -5             # Z3SS   -->  Z1SS   BT     BB          
      3.02936870E-10    3      1000022        11       -11             # Z3SS   -->  Z1SS   E-     E+          
      3.02936870E-10    3      1000022        13       -13             # Z3SS   -->  Z1SS   MU-    MU+         
      2.20664401E-06    3      1000022        15       -15             # Z3SS   -->  Z1SS   TAU-   TAU+        
      1.26986692E-04    3      1000023         2        -2             # Z3SS   -->  Z2SS   UP     UB          
      1.63750170E-04    3      1000023         1        -1             # Z3SS   -->  Z2SS   DN     DB          
      1.63750170E-04    3      1000023         3        -3             # Z3SS   -->  Z2SS   ST     SB          
      1.26986692E-04    3      1000023         4        -4             # Z3SS   -->  Z2SS   CH     CB          
      1.61194112E-04    3      1000023         5        -5             # Z3SS   -->  Z2SS   BT     BB          
      3.71465649E-05    3      1000023        11       -11             # Z3SS   -->  Z2SS   E-     E+          
      3.71465649E-05    3      1000023        13       -13             # Z3SS   -->  Z2SS   MU-    MU+         
      3.69877562E-05    3      1000023        15       -15             # Z3SS   -->  Z2SS   TAU-   TAU+        
      7.39101379E-05    3      1000023        12       -12             # Z3SS   -->  Z2SS   NUE    ANUE        
      7.39101379E-05    3      1000023        14       -14             # Z3SS   -->  Z2SS   NUM    ANUM        
      7.39101379E-05    3      1000023        16       -16             # Z3SS   -->  Z2SS   NUT    ANUT        
      5.73173922E-04    2      1000022        25                       # Z3SS   -->  Z1SS   HL0                
      1.35729039E-10    2      1000023        25                       # Z3SS   -->  Z2SS   HL0                
      2.34041991E-07    2      1000002        -2                       # Z3SS   -->  UPL    UB                 
      2.34041991E-07    2     -1000002         2                       # Z3SS   -->  UBL    UP                 
      5.29661179E-07    2      1000001        -1                       # Z3SS   -->  DNL    DB                 
      5.29661179E-07    2     -1000001         1                       # Z3SS   -->  DBL    DN                 
      5.29661179E-07    2      1000003        -3                       # Z3SS   -->  STL    SB                 
      5.29661179E-07    2     -1000003         3                       # Z3SS   -->  SBL    ST                 
      2.34041948E-07    2      1000004        -4                       # Z3SS   -->  CHL    CB                 
      2.34041948E-07    2     -1000004         4                       # Z3SS   -->  CBL    CH                 
      2.38159259E-07    2      2000002        -2                       # Z3SS   -->  UPR    UB                 
      2.38159259E-07    2     -2000002         2                       # Z3SS   -->  UBR    UP                 
      5.95393566E-08    2      2000001        -1                       # Z3SS   -->  DNR    DB                 
      5.95393566E-08    2     -2000001         1                       # Z3SS   -->  DBR    DN                 
      5.95393566E-08    2      2000003        -3                       # Z3SS   -->  STR    SB                 
      5.95393566E-08    2     -2000003         3                       # Z3SS   -->  SBR    ST                 
      2.38159203E-07    2      2000004        -4                       # Z3SS   -->  CHR    CB                 
      2.38159203E-07    2     -2000004         4                       # Z3SS   -->  CBR    CH                 
      2.16127703E-17    2      1000012       -12                       # Z3SS   -->  NUEL   ANUE               
      2.16127703E-17    2     -1000012        12                       # Z3SS   -->  ANUEL  NUE                
      2.16127703E-17    2      1000014       -14                       # Z3SS   -->  NUML   ANUM               
      2.16127703E-17    2     -1000014        14                       # Z3SS   -->  ANUML  NUM                
      2.16127703E-17    2      1000016       -16                       # Z3SS   -->  NUTL   ANUT               
      2.16127703E-17    2     -1000016        16                       # Z3SS   -->  ANUTL  NUT                
#         PDG         Width
DECAY   1000035  1.30548660E+02   # Z4SS  decays
#          BR          NDA       ID1       ID2       ID3       ID4
      2.23767202E-07    2      1000022        22                       # Z4SS   -->  Z1SS   GM                 
      1.64791225E-09    2      1000023        22                       # Z4SS   -->  Z2SS   GM                 
      2.92871533E-10    2      1000025        22                       # Z4SS   -->  Z3SS   GM                 
      1.27985543E-02    2      1000024       -24                       # Z4SS   -->  W1SS+  W-                 
      1.27985543E-02    2     -1000024        24                       # Z4SS   -->  W1SS-  W+                 
      7.59424847E-06    2      1000022        23                       # Z4SS   -->  Z1SS   Z0                 
      1.42510759E-13    2      1000023        23                       # Z4SS   -->  Z2SS   Z0                 
      1.58801785E-21    3      1000023         5        -5             # Z4SS   -->  Z2SS   BT     BB          
      2.50604449E-22    3      1000023        15       -15             # Z4SS   -->  Z2SS   TAU-   TAU+        
      3.28684428E-06    3      1000025         2        -2             # Z4SS   -->  Z3SS   UP     UB          
      4.23840766E-06    3      1000025         1        -1             # Z4SS   -->  Z3SS   DN     DB          
      4.23840766E-06    3      1000025         3        -3             # Z4SS   -->  Z3SS   ST     SB          
      3.28684428E-06    3      1000025         4        -4             # Z4SS   -->  Z3SS   CH     CB          
      4.17892079E-06    3      1000025         5        -5             # Z4SS   -->  Z3SS   BT     BB          
      9.61480623E-07    3      1000025        11       -11             # Z4SS   -->  Z3SS   E-     E+          
      9.61480623E-07    3      1000025        13       -13             # Z4SS   -->  Z3SS   MU-    MU+         
      9.58827854E-07    3      1000025        15       -15             # Z4SS   -->  Z3SS   TAU-   TAU+        
      1.91304389E-06    3      1000025        12       -12             # Z4SS   -->  Z3SS   NUE    ANUE        
      1.91304389E-06    3      1000025        14       -14             # Z4SS   -->  Z3SS   NUM    ANUM        
      1.91304389E-06    3      1000025        16       -16             # Z4SS   -->  Z3SS   NUT    ANUT        
      1.19951768E-02    2      1000022        25                       # Z4SS   -->  Z1SS   HL0                
      2.19353180E-09    2      1000022        35                       # Z4SS   -->  Z1SS   HH0                
      1.19465731E-05    2      1000022        36                       # Z4SS   -->  Z1SS   HA0                
      1.02039699E-07    2      1000023        25                       # Z4SS   -->  Z2SS   HL0                
      3.86076978E-12    2      1000025        25                       # Z4SS   -->  Z3SS   HL0                
      1.19818449E-01    2      1000002        -2                       # Z4SS   -->  UPL    UB                 
      1.19818449E-01    2     -1000002         2                       # Z4SS   -->  UBL    UP                 
      1.20583504E-01    2      1000001        -1                       # Z4SS   -->  DNL    DB                 
      1.20583504E-01    2     -1000001         1                       # Z4SS   -->  DBL    DN                 
      1.20583504E-01    2      1000003        -3                       # Z4SS   -->  STL    SB                 
      1.20583504E-01    2     -1000003         3                       # Z4SS   -->  SBL    ST                 
      1.19818434E-01    2      1000004        -4                       # Z4SS   -->  CHL    CB                 
      1.19818434E-01    2     -1000004         4                       # Z4SS   -->  CBL    CH                 
      4.90671982E-06    2      2000002        -2                       # Z4SS   -->  UPR    UB                 
      4.90671982E-06    2     -2000002         2                       # Z4SS   -->  UBR    UP                 
      1.22667097E-06    2      2000001        -1                       # Z4SS   -->  DNR    DB                 
      1.22667097E-06    2     -2000001         1                       # Z4SS   -->  DBR    DN                 
      1.22667097E-06    2      2000003        -3                       # Z4SS   -->  STR    SB                 
      1.22667097E-06    2     -2000003         3                       # Z4SS   -->  SBR    ST                 
      4.90671937E-06    2      2000004        -4                       # Z4SS   -->  CHR    CB                 
      4.90671937E-06    2     -2000004         4                       # Z4SS   -->  CBR    CH                 
      5.82739231E-05    2      1000005        -5                       # Z4SS   -->  BT1    BB                 
      5.82739231E-05    2     -1000005         5                       # Z4SS   -->  BB1    BT                 
      6.27741028E-05    2      2000005        -5                       # Z4SS   -->  BT2    BB                 
      6.27741028E-05    2     -2000005         5                       # Z4SS   -->  BB2    BT                 
      4.00722529E-05    2      1000011       -11                       # Z4SS   -->  EL-    E+                 
      4.00722529E-05    2     -1000011        11                       # Z4SS   -->  EL+    E-                 
      4.00722201E-05    2      1000013       -13                       # Z4SS   -->  MUL-   MU+                
      4.00722201E-05    2     -1000013        13                       # Z4SS   -->  MUL+   MU-                
      3.71617692E-09    2      2000011       -11                       # Z4SS   -->  ER-    E+                 
      3.71617692E-09    2     -2000011        11                       # Z4SS   -->  ER+    E-                 
      3.71617381E-09    2      2000013       -13                       # Z4SS   -->  MUR-   MU+                
      3.71617381E-09    2     -2000013        13                       # Z4SS   -->  MUR+   MU-                
      1.95583179E-05    2      1000015       -15                       # Z4SS   -->  TAU1-  TAU+               
      1.95583179E-05    2     -1000015        15                       # Z4SS   -->  TAU1+  TAU-               
      2.04720454E-05    2      2000015       -15                       # Z4SS   -->  TAU2-  TAU+               
      2.04720454E-05    2     -2000015        15                       # Z4SS   -->  TAU2+  TAU-               
      4.08787164E-05    2      1000012       -12                       # Z4SS   -->  NUEL   ANUE               
      4.08787164E-05    2     -1000012        12                       # Z4SS   -->  ANUEL  NUE                
      4.08787164E-05    2      1000014       -14                       # Z4SS   -->  NUML   ANUM               
      4.08787164E-05    2     -1000014        14                       # Z4SS   -->  ANUML  NUM                
      4.08787164E-05    2      1000016       -16                       # Z4SS   -->  NUTL   ANUT               
      4.08787164E-05    2     -1000016        16                       # Z4SS   -->  ANUTL  NUT                
#         PDG         Width
DECAY   1000024  1.23318459E+02   # W1SS+ decays
#          BR          NDA       ID1       ID2       ID3       ID4
      2.45048777E-05    3      1000022       -11        12             # W1SS+  -->  Z1SS   E+     NUE         
      2.45048777E-05    3      1000022       -13        14             # W1SS+  -->  Z1SS   MU+    NUM         
      2.45535139E-05    3      1000022       -15        16             # W1SS+  -->  Z1SS   TAU+   NUT         
      1.30824987E-02    2      1000022        24                       # W1SS+  -->  Z1SS   W+                 
      2.46809363E-01    2      1000002        -1                       # W1SS+  -->  UPL    DB                 
      2.46609420E-01    2     -1000001         2                       # W1SS+  -->  DBL    UP                 
      2.46809319E-01    2      1000004        -3                       # W1SS+  -->  CHL    SB                 
      2.46615827E-01    2     -1000003         4                       # W1SS+  -->  SBL    CH                 
#         PDG         Width
DECAY   1000037  1.30634995E+02   # W2SS+ decays
#          BR          NDA       ID1       ID2       ID3       ID4
      1.19599989E-02    2      1000022        24                       # W2SS+  -->  Z1SS   W+                 
      4.07421339E-06    2      1000022        37                       # W2SS+  -->  Z1SS   H+                 
      2.71162399E-18    3      1000023       -15        16             # W2SS+  -->  Z2SS   TAU+   NUT         
      1.28536699E-02    2      1000023        24                       # W2SS+  -->  Z2SS   W+                 
      2.53640246E-05    3      1000025         2        -1             # W2SS+  -->  Z3SS   UP     DB          
      2.53640246E-05    3      1000025         4        -3             # W2SS+  -->  Z3SS   CH     SB          
      8.45467457E-06    3      1000025       -11        12             # W2SS+  -->  Z3SS   E+     NUE         
      8.45467457E-06    3      1000025       -13        14             # W2SS+  -->  Z3SS   MU+    NUM         
      8.45467457E-06    3      1000025       -15        16             # W2SS+  -->  Z3SS   TAU+   NUT         
      2.40725487E-01    2      1000002        -1                       # W2SS+  -->  UPL    DB                 
      2.40908518E-01    2     -1000001         2                       # W2SS+  -->  DBL    UP                 
      2.40725473E-01    2      1000004        -3                       # W2SS+  -->  CHL    SB                 
      2.40914345E-01    2     -1000003         4                       # W2SS+  -->  SBL    CH                 
      1.32126908E-04    2      1000006        -5                       # W2SS+  -->  TP1    BB                 
      3.31213378E-05    2      2000006        -5                       # W2SS+  -->  TP2    BB                 
      8.07113101E-05    2      1000012       -11                       # W2SS+  -->  NUEL   E+                 
      8.07112374E-05    2      1000014       -13                       # W2SS+  -->  NUML   MU+                
      8.06518874E-05    2      1000016       -15                       # W2SS+  -->  NUTL   TAU+               
      8.07133838E-05    2     -1000011        12                       # W2SS+  -->  EL+    NUE                
      8.07133838E-05    2     -1000013        14                       # W2SS+  -->  MUL+   NUM                
      3.94348172E-05    2     -1000015        16                       # W2SS+  -->  TAU1+  NUT                
      4.12468689E-05    2     -2000015        16                       # W2SS+  -->  TAU2+  NUT                
      1.11829601E-02    2      1000024        23                       # W2SS+  -->  W1SS+  Z0                 
      2.00770356E-09    2      1000024        25                       # W2SS+  -->  W1SS+  HL0                
#         PDG         Width
DECAY        25  2.66789319E-03   # HL0   decays
#          BR          NDA       ID1       ID2       ID3       ID4
      4.93795982E-09    2           11       -11                       # HL0    -->  E-     E+                 
      2.08487254E-04    2           13       -13                       # HL0    -->  MU-    MU+                
      5.95262796E-02    2           15       -15                       # HL0    -->  TAU-   TAU+               
      6.23677897E-06    2            1        -1                       # HL0    -->  DN     DB                 
      2.51996657E-03    2            3        -3                       # HL0    -->  ST     SB                 
      8.72676313E-01    2            5        -5                       # HL0    -->  BT     BB                 
      1.99387000E-06    2            2        -2                       # HL0    -->  UP     UB                 
      3.99496704E-02    2            4        -4                       # HL0    -->  CH     CB                 
      7.08827691E-04    2           22        22                       # HL0    -->  GM     GM                 
      1.86398514E-02    2           21        21                       # HL0    -->  GL     GL                 
      5.76234749E-03    2      1000022   1000022                       # HL0    -->  Z1SS   Z1SS               
#         PDG         Width
DECAY        35  1.86495682E+02   # HH0   decays
#          BR          NDA       ID1       ID2       ID3       ID4
      5.05535501E-12    2           11       -11                       # HH0    -->  E-     E+                 
      2.13446199E-07    2           13       -13                       # HH0    -->  MU-    MU+                
      6.11342184E-05    2           15       -15                       # HH0    -->  TAU-   TAU+               
      6.12194295E-09    2            1        -1                       # HH0    -->  DN     DB                 
      2.47357593E-06    2            3        -3                       # HH0    -->  ST     SB                 
      5.11725841E-04    2            5        -5                       # HH0    -->  BT     BB                 
      1.61289992E-09    2            2        -2                       # HH0    -->  UP     UB                 
      1.90545288E-05    2            4        -4                       # HH0    -->  CH     CB                 
      9.99051332E-01    2            6        -6                       # HH0    -->  TP     TB                 
      9.43204725E-07    2           22        22                       # HH0    -->  GM     GM                 
      1.06275525E-04    2           21        21                       # HH0    -->  GL     GL                 
      1.00115067E-05    2           24       -24                       # HH0    -->  W+     W-                 
      5.13653913E-06    2           23        23                       # HH0    -->  Z0     Z0                 
      1.26515056E-08    2      1000022   1000022                       # HH0    -->  Z1SS   Z1SS               
      2.19122374E-08    2      1000022   1000023                       # HH0    -->  Z1SS   Z2SS               
      6.19426010E-06    2      1000022   1000025                       # HH0    -->  Z1SS   Z3SS               
      3.64010521E-05    2           25        25                       # HH0    -->  HL0    HL0                
      3.43972533E-05    2      1000002  -1000002                       # HH0    -->  UPL    UBL                
      6.89981516E-06    2      2000002  -2000002                       # HH0    -->  UPR    UBR                
      3.43561478E-05    2      1000004  -1000004                       # HH0    -->  CHL    CBL                
      6.88141154E-06    2      2000004  -2000004                       # HH0    -->  CHR    CBR                
      5.15266220E-05    2      1000001  -1000001                       # HH0    -->  DNL    DBL                
      1.72493969E-06    2      2000001  -2000001                       # HH0    -->  DNR    DBR                
      5.15278261E-05    2      1000003  -1000003                       # HH0    -->  STL    SBL                
      1.72471994E-06    2      2000003  -2000003                       # HH0    -->  STR    SBR                
#         PDG         Width
DECAY        36  1.85877991E+02   # HA0   decays
#          BR          NDA       ID1       ID2       ID3       ID4
      5.03980668E-12    2           11       -11                       # HA0    -->  E-     E+                 
      2.12789715E-07    2           13       -13                       # HA0    -->  MU-    MU+                
      6.09462222E-05    2           15       -15                       # HA0    -->  TAU-   TAU+               
      6.10337603E-09    2            1        -1                       # HA0    -->  DN     DB                 
      2.46607169E-06    2            3        -3                       # HA0    -->  ST     SB                 
      5.10525482E-04    2            5        -5                       # HA0    -->  BT     BB                 
      1.60663816E-09    2            2        -2                       # HA0    -->  UP     UB                 
      1.89936563E-05    2            4        -4                       # HA0    -->  CH     CB                 
      9.99168992E-01    2            6        -6                       # HA0    -->  TP     TB                 
      9.46586113E-07    2           22        22                       # HA0    -->  GM     GM                 
      1.08037835E-04    2           21        21                       # HA0    -->  GL     GL                 
      5.35021582E-06    2      1000022   1000022                       # HA0    -->  Z1SS   Z1SS               
      1.77461989E-05    2      1000022   1000023                       # HA0    -->  Z1SS   Z2SS               
      9.96991730E-06    2           25        23                       # HA0    -->  HL0    Z0                 
      8.06863576E-10    2      1000002  -2000002                       # HA0    -->  UPL    UBR                
      8.06863576E-10    2      2000002  -1000002                       # HA0    -->  UPR    UBL                
      4.68912222E-05    2      1000004  -2000004                       # HA0    -->  CHL    CBR                
      4.68912222E-05    2      2000004  -1000004                       # HA0    -->  CHR    CBL                
      2.52166332E-09    2      1000001  -2000001                       # HA0    -->  DNL    DBR                
      2.52166332E-09    2      2000001  -1000001                       # HA0    -->  DNR    DBL                
      1.01887974E-06    2      1000003  -2000003                       # HA0    -->  STL    SBR                
      1.01887974E-06    2      2000003  -1000003                       # HA0    -->  STR    SBL                
#         PDG         Width
DECAY        37  1.73677078E+02   # H+    decays
#          BR          NDA       ID1       ID2       ID3       ID4
      5.42998806E-12    2           12       -11                       # H+     -->  NUE    E+                 
      2.29263890E-07    2           14       -13                       # H+     -->  NUM    MU+                
      6.56646735E-05    2           16       -15                       # H+     -->  NUT    TAU+               
      7.72385178E-09    2            2        -1                       # H+     -->  UP     DB                 
      2.14853881E-05    2            4        -3                       # H+     -->  CH     SB                 
      9.99679148E-01    2            6        -5                       # H+     -->  TP     BB                 
      3.79329758E-05    2      1000024   1000022                       # H+     -->  W1SS+  Z1SS               
      1.07469441E-05    2           25        24                       # H+     -->  HL0    W+                 
      9.13489421E-05    2      1000002  -1000001                       # H+     -->  UPL    DBL                
      5.36326006E-09    2      2000002  -2000001                       # H+     -->  UPR    DBR                
      9.12986870E-05    2      1000004  -1000003                       # H+     -->  CHL    SBL                
      2.16702824E-06    2      2000004  -2000003                       # H+     -->  CHR    SBR                
