  65
  401    602.5777    0.82459E-24
  402    597.8857    0.88352E-24
  403    602.5777    0.82464E-24
  404    597.8872    0.88353E-24
  405   2000.1373    0.68817E-26
  406   2004.0999    0.50496E-26
  407    602.5777    0.82459E-24
  408    597.8857    0.88352E-24
  409    602.5777    0.82464E-24
  410    597.8872    0.88353E-24
  411   2000.1373    0.68817E-26
  412   2004.0999    0.50496E-26
  413    600.4725    0.20576E-23
  414    599.0540    0.51576E-24
  415    600.4725    0.20576E-23
  416    599.0555    0.51577E-24
  417   2000.7828    0.49502E-26
  418   2004.4734    0.49972E-26
  419    600.4725    0.20576E-23
  420    599.0540    0.51576E-24
  421    600.4725    0.20576E-23
  422    599.0555    0.51577E-24
  423   2000.7828    0.49502E-26
  424   2004.4734    0.49972E-26
  425    303.2582    0.22004E-23
  426    293.8247    0.22134E-23
  427    303.2582    0.22004E-23
  428    293.8247    0.22134E-23
  429    302.7048    0.54021E-24
  430   1999.0830    0.26576E-25
  431    303.2582    0.22004E-23
  432    293.8247    0.22134E-23
  433    303.2582    0.22004E-23
  434    293.8247    0.22134E-23
  435    302.7048    0.54021E-24
  436   1999.0830    0.26576E-25
  437    302.8226    0.53984E-24
  438      0.0000    0.10000E+31
  439    302.8226    0.53984E-24
  440      0.0000    0.10000E+31
  441   2000.5107    0.26612E-25
  442      0.0000    0.10000E+31
  443    302.8226    0.53984E-24
  444      0.0000    0.10000E+31
  445    302.8226    0.53984E-24
  446      0.0000    0.10000E+31
  447   2000.5107    0.26612E-25
  448      0.0000    0.10000E+31
  449    610.0000    0.51163E-23
  450     99.9804    0.10000E+31
  451    499.8473    0.19393E-24
  452   -901.7328    0.90062E-25
  453    913.6010    0.80817E-25
  454    499.7893    0.19387E-24
  455    913.0601    0.80717E-25
  456    499.7893    0.19387E-24
  457    913.0601    0.80717E-25
  203    105.4010    0.17896E-21
  204   1007.8069    0.20130E-24
  205   1000.0000    0.19228E-24
  206   1002.1512    0.23537E-24
  207   1002.1512    0.23537E-24
  458      0.0000    0.10000E+31
    6    172.5000    0.57395E-24
   12    172.5000    0.57395E-24
   3
   401  0.10696244E+00     0   450     1     0     0     0
   401  0.29843721E+00     0   451     1     0     0     0
   401  0.59460038E+00     0   456     2     0     0     0
   3
   402  0.10025585E+00     0   450     2     0     0     0
   402  0.29877797E+00     0   451     2     0     0     0
   402  0.60096622E+00     0   454     1     0     0     0
   3
   403  0.10696900E+00     0   450     3     0     0     0
   403  0.29845551E+00     0   451     3     0     0     0
   403  0.59457546E+00     0   456     4     0     0     0
   3
   404  0.10025614E+00     0   450     4     0     0     0
   404  0.29875541E+00     0   451     4     0     0     0
   404  0.60098845E+00     0   454     3     0     0     0
   7
   405  0.11729543E-01     0   450     5     0     0     0
   405  0.30494097E-04     0   451     5     0     0     0
   405  0.52668428E-03     0   452     5     0     0     0
   405  0.51420328E-03     0   453     5     0     0     0
   405  0.98616982E+00     0   449     5     0     0     0
   405  0.56159763E-04     0   456     6     0     0     0
   405  0.97314554E-03     0   457     6     0     0     0
   7
   406  0.71250111E+00     0   449     6     0     0     0
   406  0.34009088E-01     0   450     6     0     0     0
   406  0.17145488E-02     0   451     6     0     0     0
   406  0.63035570E-01     0   452     6     0     0     0
   406  0.60908247E-01     0   453     6     0     0     0
   406  0.34968292E-02     0   454     5     0     0     0
   406  0.12433466E+00     0   455     5     0     0     0
   3
   407  0.10696244E+00     0   450     7     0     0     0
   407  0.29843721E+00     0   451     7     0     0     0
   407  0.59460038E+00     0   454     8     0     0     0
   3
   408  0.10025585E+00     0   450     8     0     0     0
   408  0.29877797E+00     0   451     8     0     0     0
   408  0.60096622E+00     0   456     7     0     0     0
   3
   409  0.10696900E+00     0   450     9     0     0     0
   409  0.29845551E+00     0   451     9     0     0     0
   409  0.59457546E+00     0   454    10     0     0     0
   3
   410  0.10025614E+00     0   450    10     0     0     0
   410  0.29875541E+00     0   451    10     0     0     0
   410  0.60098845E+00     0   456     9     0     0     0
   7
   411  0.11729543E-01     0   450    11     0     0     0
   411  0.30494097E-04     0   451    11     0     0     0
   411  0.52668428E-03     0   452    11     0     0     0
   411  0.51420328E-03     0   453    11     0     0     0
   411  0.98616982E+00     0   449    11     0     0     0
   411  0.56159763E-04     0   454    12     0     0     0
   411  0.97314554E-03     0   455    12     0     0     0
   7
   412  0.71250111E+00     0   449    12     0     0     0
   412  0.34009088E-01     0   450    12     0     0     0
   412  0.17145488E-02     0   451    12     0     0     0
   412  0.63035570E-01     0   452    12     0     0     0
   412  0.60908247E-01     0   453    12     0     0     0
   412  0.34968292E-02     0   456    11     0     0     0
   412  0.12433466E+00     0   457    11     0     0     0
   2
   413  0.99997932E+00     0   450     1     0     0     0
   413  0.20651238E-04     0   451     1     0     0     0
   2
   414  0.99997979E+00     0   450     2     0     0     0
   414  0.20217163E-04     0   451     2     0     0     0
   2
   415  0.99997932E+00     0   450     3     0     0     0
   415  0.20651238E-04     0   451     3     0     0     0
   2
   416  0.99997979E+00     0   450     4     0     0     0
   416  0.20215621E-04     0   451     4     0     0     0
   7
   417  0.22461722E-02     0   450     5     0     0     0
   417  0.53770460E-01     0   451     5     0     0     0
   417  0.42095975E-03     0   452     5     0     0     0
   417  0.16096144E-02     0   453     5     0     0     0
   417  0.70968235E+00     0   449     5     0     0     0
   417  0.10681216E+00     0   456     6     0     0     0
   417  0.12545833E+00     0   457     6     0     0     0
   7
   418  0.70529509E+00     0   449     6     0     0     0
   418  0.11049857E+00     0   454     5     0     0     0
   418  0.23163310E-02     0   455     5     0     0     0
   418  0.20390600E-02     0   450     6     0     0     0
   418  0.54856818E-01     0   451     6     0     0     0
   418  0.62505484E-01     0   452     6     0     0     0
   418  0.62488697E-01     0   453     6     0     0     0
   2
   419  0.99997932E+00     0   450     7     0     0     0
   419  0.20651238E-04     0   451     7     0     0     0
   2
   420  0.99997979E+00     0   450     8     0     0     0
   420  0.20217163E-04     0   451     8     0     0     0
   2
   421  0.99997932E+00     0   450     9     0     0     0
   421  0.20651238E-04     0   451     9     0     0     0
   2
   422  0.99997979E+00     0   450    10     0     0     0
   422  0.20215621E-04     0   451    10     0     0     0
   7
   423  0.22461722E-02     0   450    11     0     0     0
   423  0.53770460E-01     0   451    11     0     0     0
   423  0.42095975E-03     0   452    11     0     0     0
   423  0.16096144E-02     0   453    11     0     0     0
   423  0.70968235E+00     0   449    11     0     0     0
   423  0.10681216E+00     0   454    12     0     0     0
   423  0.12545833E+00     0   455    12     0     0     0
   7
   424  0.70529509E+00     0   449    12     0     0     0
   424  0.11049857E+00     0   456    11     0     0     0
   424  0.23163310E-02     0   457    11     0     0     0
   424  0.20390600E-02     0   450    12     0     0     0
   424  0.54856818E-01     0   451    12     0     0     0
   424  0.62505484E-01     0   452    12     0     0     0
   424  0.62488697E-01     0   453    12     0     0     0
   1
   425  0.10000000E+01     0   450   121     0     0     0
   1
   426  0.10000000E+01     0   450   122     0     0     0
   1
   427  0.10000000E+01     0   450   123     0     0     0
   1
   428  0.10000000E+01     0   450   124     0     0     0
   1
   429  0.10000000E+01     0   450   125     0     0     0
   7
   430  0.10396243E+00     0   450   126     0     0     0
   430  0.28518674E+00     0   451   126     0     0     0
   430  0.37745020E-03     0   452   126     0     0     0
   430  0.80179041E-02     0   453   126     0     0     0
   430  0.58552897E+00     0   454   125     0     0     0
   430  0.10030894E-01     0   455   125     0     0     0
   430  0.68956255E-02     0   206   429     0     0     0
   1
   431  0.10000000E+01     0   450   127     0     0     0
   1
   432  0.10000000E+01     0   450   128     0     0     0
   1
   433  0.10000000E+01     0   450   129     0     0     0
   1
   434  0.10000000E+01     0   450   130     0     0     0
   1
   435  0.10000000E+01     0   450   131     0     0     0
   7
   436  0.10396243E+00     0   450   132     0     0     0
   436  0.28518674E+00     0   451   132     0     0     0
   436  0.37745020E-03     0   452   132     0     0     0
   436  0.80179041E-02     0   453   132     0     0     0
   436  0.58552897E+00     0   456   131     0     0     0
   436  0.10030894E-01     0   457   131     0     0     0
   436  0.68956255E-02     0   207   435     0     0     0
   1
   437  0.10000000E+01     0   450   121     0     0     0
   0
   1
   439  0.10000000E+01     0   450   123     0     0     0
   0
   8
   441  0.99934913E-01     0   450   125     0     0     0
   441  0.29519531E+00     0   451   125     0     0     0
   441  0.92344382E-03     0   452   125     0     0     0
   441  0.52189385E-02     0   453   125     0     0     0
   441  0.57508093E+00     0   456   126     0     0     0
   441  0.16751301E-01     0   457   126     0     0     0
   441  0.34579660E-02     0   205   429     0     0     0
   441  0.34371929E-02     0   204   429     0     0     0
   0
   1
   443  0.10000000E+01     0   450   127     0     0     0
   0
   1
   445  0.10000000E+01     0   450   129     0     0     0
   0
   8
   447  0.99934913E-01     0   450   131     0     0     0
   447  0.29519531E+00     0   451   131     0     0     0
   447  0.92344382E-03     0   452   131     0     0     0
   447  0.52189385E-02     0   453   131     0     0     0
   447  0.57508093E+00     0   454   132     0     0     0
   447  0.16751301E-01     0   455   132     0     0     0
   447  0.34579660E-02     0   205   435     0     0     0
   447  0.34371929E-02     0   204   435     0     0     0
   0
  17
   449  0.20809683E-04     0   450     5    11     0     0
   449  0.88934287E-01     0   408     2     0     0     0
   449  0.88934287E-01     0   402     8     0     0     0
   449  0.33644635E-01     0   407     1     0     0     0
   449  0.33644635E-01     0   401     7     0     0     0
   449  0.72748713E-01     0   420     2     0     0     0
   449  0.72748713E-01     0   414     8     0     0     0
   449  0.55244498E-01     0   419     1     0     0     0
   449  0.55244498E-01     0   413     7     0     0     0
   449  0.33632718E-01     0   409     3     0     0     0
   449  0.33632718E-01     0   403     9     0     0     0
   449  0.55232663E-01     0   421     3     0     0     0
   449  0.55232663E-01     0   415     9     0     0     0
   449  0.88369019E-01     0   410     4     0     0     0
   449  0.88369019E-01     0   404    10     0     0     0
   449  0.72183050E-01     0   422     4     0     0     0
   449  0.72183050E-01     0   416    10     0     0     0
   0
  16
   451  0.30652143E-03     0   450   200     0     0     0
   451  0.40110676E-02     0   450   203     0     0     0
   451  0.12206569E+00     0   425   127     0     0     0
   451  0.12206569E+00     0   431   121     0     0     0
   451  0.12206566E+00     0   427   129     0     0     0
   451  0.12206566E+00     0   433   123     0     0     0
   451  0.30979878E-04     0   437   127     0     0     0
   451  0.30979878E-04     0   443   121     0     0     0
   451  0.30979863E-04     0   439   129     0     0     0
   451  0.30979863E-04     0   445   123     0     0     0
   451  0.49850034E-04     0   429   131     0     0     0
   451  0.49850034E-04     0   435   125     0     0     0
   451  0.12679903E+00     0   426   128     0     0     0
   451  0.12679903E+00     0   432   122     0     0     0
   451  0.12679903E+00     0   428   130     0     0     0
   451  0.12679903E+00     0   434   124     0     0     0
  36
   452  0.30412453E+00     0   454   199     0     0     0
   452  0.30412453E+00     0   456   198     0     0     0
   452  0.72095186E-01     0   450   200     0     0     0
   452  0.28941223E+00     0   451   200     0     0     0
   452  0.15947293E-01     0   450   203     0     0     0
   452  0.81783850E-02     0   451   203     0     0     0
   452  0.15531038E-03     0   402     8     0     0     0
   452  0.15531038E-03     0   408     2     0     0     0
   452  0.26813010E-03     0   401     7     0     0     0
   452  0.26813010E-03     0   407     1     0     0     0
   452  0.26813007E-03     0   403     9     0     0     0
   452  0.26813007E-03     0   409     3     0     0     0
   452  0.15530817E-03     0   404    10     0     0     0
   452  0.15530817E-03     0   410     4     0     0     0
   452  0.67392088E-04     0   414     8     0     0     0
   452  0.67392088E-04     0   420     2     0     0     0
   452  0.16722041E-04     0   413     7     0     0     0
   452  0.16722041E-04     0   419     1     0     0     0
   452  0.16722039E-04     0   415     9     0     0     0
   452  0.16722039E-04     0   421     3     0     0     0
   452  0.67391127E-04     0   416    10     0     0     0
   452  0.67391127E-04     0   422     4     0     0     0
   452  0.58147070E-04     0   425   127     0     0     0
   452  0.58147070E-04     0   431   121     0     0     0
   452  0.58147070E-04     0   427   129     0     0     0
   452  0.58147070E-04     0   433   123     0     0     0
   452  0.12748086E-03     0   437   127     0     0     0
   452  0.12748086E-03     0   443   121     0     0     0
   452  0.12748085E-03     0   439   129     0     0     0
   452  0.12748085E-03     0   445   123     0     0     0
   452  0.94599288E-03     0   429   131     0     0     0
   452  0.94599288E-03     0   435   125     0     0     0
   452  0.36327387E-03     0   426   128     0     0     0
   452  0.36327387E-03     0   432   122     0     0     0
   452  0.36327387E-03     0   428   130     0     0     0
   452  0.36327387E-03     0   434   124     0     0     0
  36
   453  0.28412488E+00     0   454   199     0     0     0
   453  0.28412488E+00     0   456   198     0     0     0
   453  0.15006929E-01     0   450   200     0     0     0
   453  0.86609721E-02     0   451   200     0     0     0
   453  0.60565278E-01     0   450   203     0     0     0
   453  0.24561432E+00     0   451   203     0     0     0
   453  0.59578121E-02     0   402     8     0     0     0
   453  0.59578121E-02     0   408     2     0     0     0
   453  0.71066460E-02     0   401     7     0     0     0
   453  0.71066460E-02     0   407     1     0     0     0
   453  0.71066446E-02     0   403     9     0     0     0
   453  0.71066446E-02     0   409     3     0     0     0
   453  0.59577320E-02     0   404    10     0     0     0
   453  0.59577320E-02     0   410     4     0     0     0
   453  0.26225799E-03     0   414     8     0     0     0
   453  0.26225799E-03     0   420     2     0     0     0
   453  0.65096407E-04     0   413     7     0     0     0
   453  0.65096407E-04     0   419     1     0     0     0
   453  0.65096399E-04     0   415     9     0     0     0
   453  0.65096399E-04     0   421     3     0     0     0
   453  0.26225450E-03     0   416    10     0     0     0
   453  0.26225450E-03     0   422     4     0     0     0
   453  0.38515376E-02     0   425   127     0     0     0
   453  0.38515376E-02     0   431   121     0     0     0
   453  0.38515376E-02     0   427   129     0     0     0
   453  0.38515376E-02     0   433   123     0     0     0
   453  0.47959664E-03     0   437   127     0     0     0
   453  0.47959664E-03     0   443   121     0     0     0
   453  0.47959661E-03     0   439   129     0     0     0
   453  0.47959661E-03     0   445   123     0     0     0
   453  0.11948695E-02     0   429   131     0     0     0
   453  0.11948695E-02     0   435   125     0     0     0
   453  0.71553607E-02     0   426   128     0     0     0
   453  0.71553607E-02     0   432   122     0     0     0
   453  0.71553607E-02     0   428   130     0     0     0
   453  0.71553607E-02     0   434   124     0     0     0
   8
   454  0.13793984E-04     0   450     2     7     0     0
   454  0.13793872E-04     0   450     4     9     0     0
   454  0.43897340E-02     0   450   198     0     0     0
   454  0.26011246E+00     0   426   127     0     0     0
   454  0.26011246E+00     0   428   129     0     0     0
   454  0.23765931E+00     0   431   122     0     0     0
   454  0.23765931E+00     0   433   124     0     0     0
   454  0.39077382E-04     0   435   126     0     0     0
  13
   455  0.73417887E-01     0   450   198     0     0     0
   455  0.28757426E+00     0   451   198     0     0     0
   455  0.90897502E-02     0   402     7     0     0     0
   455  0.17682428E-01     0   407     2     0     0     0
   455  0.90896785E-02     0   404     9     0     0     0
   455  0.18108018E-01     0   409     4     0     0     0
   455  0.74623250E-02     0   426   127     0     0     0
   455  0.74623246E-02     0   428   129     0     0     0
   455  0.14642922E-01     0   431   122     0     0     0
   455  0.14642922E-01     0   433   124     0     0     0
   455  0.14377485E-02     0   435   126     0     0     0
   455  0.28251645E+00     0   454   200     0     0     0
   455  0.25687328E+00     0   454   203     0     0     0
   8
   456  0.13793984E-04     0   450     8     1     0     0
   456  0.13793872E-04     0   450    10     3     0     0
   456  0.43897340E-02     0   450   199     0     0     0
   456  0.26011246E+00     0   432   121     0     0     0
   456  0.26011246E+00     0   434   123     0     0     0
   456  0.23765931E+00     0   425   128     0     0     0
   456  0.23765931E+00     0   427   130     0     0     0
   456  0.39077382E-04     0   429   132     0     0     0
  13
   457  0.73417887E-01     0   450   199     0     0     0
   457  0.28757426E+00     0   451   199     0     0     0
   457  0.90897502E-02     0   408     1     0     0     0
   457  0.17682428E-01     0   401     8     0     0     0
   457  0.90896785E-02     0   410     3     0     0     0
   457  0.18108018E-01     0   403    10     0     0     0
   457  0.74623250E-02     0   432   121     0     0     0
   457  0.74623246E-02     0   434   123     0     0     0
   457  0.14642922E-01     0   425   128     0     0     0
   457  0.14642922E-01     0   427   130     0     0     0
   457  0.14377485E-02     0   429   132     0     0     0
   457  0.28251645E+00     0   456   200     0     0     0
   457  0.25687328E+00     0   456   203     0     0     0
  28
   203  0.21323287E-03     0   123   129     0     0     0
   203  0.60969397E-01     0   125   131     0     0     0
   203  0.25645567E-02     0     3     9     0     0     0
   203  0.85113555E+00     0     5    11     0     0     0
   203  0.37278730E-01     0     4    10     0     0     0
   203  0.14668180E-02     0    59    59     0     0     0
   203  0.33234693E-01     0    13    13     0     0     0
   203  0.70845761E-03     0   198   121   128     0     0
   203  0.70845761E-03     0   198   123   130     0     0
   203  0.70845761E-03     0   198   125   132     0     0
   203  0.21253729E-02     0   198     8     1     0     0
   203  0.21253729E-02     0   198    10     3     0     0
   203  0.70845761E-03     0   199   127   122     0     0
   203  0.70845761E-03     0   199   129   124     0     0
   203  0.70845761E-03     0   199   131   126     0     0
   203  0.21253729E-02     0   199     2     7     0     0
   203  0.21253729E-02     0   199     4     9     0     0
   203  0.26319911E-04     0   200   122   128     0     0
   203  0.26319911E-04     0   200   124   130     0     0
   203  0.26319911E-04     0   200   126   132     0     0
   203  0.13246547E-04     0   200   121   127     0     0
   203  0.13246547E-04     0   200   123   129     0     0
   203  0.13246547E-04     0   200   125   131     0     0
   203  0.45381545E-04     0   200     2     8     0     0
   203  0.45381545E-04     0   200     4    10     0     0
   203  0.58462607E-04     0   200     1     7     0     0
   203  0.58462607E-04     0   200     3     9     0     0
   203  0.58462607E-04     0   200     5    11     0     0
  22
   204  0.35301600E-04     0   123   129     0     0     0
   204  0.10110731E-01     0   125   131     0     0     0
   204  0.41383484E-03     0     3     9     0     0     0
   204  0.10203812E+00     0     5    11     0     0     0
   204  0.18736966E-04     0     4    10     0     0     0
   204  0.85504764E+00     0     6    12     0     0     0
   204  0.50074857E-03     0    13    13     0     0     0
   204  0.20670528E-02     0   198   199     0     0     0
   204  0.10495017E-02     0   200   200     0     0     0
   204  0.14635902E-02     0   450   450     0     0     0
   204  0.67607579E-02     0   450   451     0     0     0
   204  0.71252715E-02     0   450   452     0     0     0
   204  0.61802573E-04     0   451   451     0     0     0
   204  0.13111753E-03     0   454   456     0     0     0
   204  0.90810824E-02     0   203   203     0     0     0
   204  0.36200287E-03     0   425   431     0     0     0
   204  0.27150140E-03     0   437   443     0     0     0
   204  0.36197313E-03     0   427   433     0     0     0
   204  0.27147561E-03     0   439   445     0     0     0
   204  0.26422305E-03     0   429   435     0     0     0
   204  0.12817585E-02     0   426   432     0     0     0
   204  0.12817585E-02     0   428   434     0     0     0
  12
   205  0.33536904E-04     0   123   129     0     0     0
   205  0.96054226E-02     0   125   131     0     0     0
   205  0.39317290E-03     0     3     9     0     0     0
   205  0.97036913E-01     0     5    11     0     0     0
   205  0.17141536E-04     0     4    10     0     0     0
   205  0.86854899E+00     0     6    12     0     0     0
   205  0.50724560E-03     0    13    13     0     0     0
   205  0.20656772E-02     0   450   450     0     0     0
   205  0.14834546E-01     0   450   451     0     0     0
   205  0.14726628E-02     0   451   451     0     0     0
   205  0.35713403E-02     0   454   456     0     0     0
   205  0.19133873E-02     0   203   200     0     0     0
   8
   206  0.41140993E-04     0   124   129     0     0     0
   206  0.11783338E-01     0   126   131     0     0     0
   206  0.46264776E-03     0     4     9     0     0     0
   206  0.95629036E+00     0     6    11     0     0     0
   206  0.25626417E-01     0   454   450     0     0     0
   206  0.23406243E-02     0   203   198     0     0     0
   206  0.17277475E-02     0   431   426     0     0     0
   206  0.17276972E-02     0   433   428     0     0     0
   8
   207  0.41140993E-04     0   130   123     0     0     0
   207  0.11783338E-01     0   132   125     0     0     0
   207  0.46264776E-03     0    10     3     0     0     0
   207  0.95629036E+00     0    12     5     0     0     0
   207  0.25626417E-01     0   456   450     0     0     0
   207  0.23406243E-02     0   203   199     0     0     0
   207  0.17277475E-02     0   425   432     0     0     0
   207  0.17276972E-02     0   427   434     0     0     0
   0
   5
     6  0.33333334E+00   100     2     7     5     0     0
     6  0.33333334E+00   100     4     9     5     0     0
     6  0.11111111E+00   100   122   127     5     0     0
     6  0.11111111E+00   100   124   129     5     0     0
     6  0.11111111E+00   100   126   131     5     0     0
   5
    12  0.33333334E+00   100     8     1    11     0     0
    12  0.33333334E+00   100    10     3    11     0     0
    12  0.11111111E+00   100   128   121    11     0     0
    12  0.11111111E+00   100   130   123    11     0     0
    12  0.11111111E+00   100   132   125    11     0     0
      4.00000000     -0.24957018
      0.99857700     -0.00571857      0.05002762     -0.01757631
     -0.01436844     -0.98518616      0.13952114     -0.09866863
      0.02271846     -0.02935877     -0.70548588     -0.70775115
     -0.04606305      0.16885935      0.69305170     -0.69931686
     -0.99009979      0.14036526     -0.14036526     -0.99009979
     -0.98017836      0.19811712     -0.19811712     -0.98017836
      1.57071936     -1.57079589     -1.57079637
    225.00000000   3600.00000000   3600.00000000
    900.00000000
    T
