#  ISAJET SUSY parameters in Les Houches accord format
#  Created by ISALHA3. Last revision by C. Balazs on 2005 Jan. 10
Block SPINFO   # Program information
     1   ISASUGRA from ISAJET          # Spectrum Calculator
     2   7.79   16-DEC-2008 15:42:00   # Version number
Block MODSEL   # Model selection
     1     1   # Minimal supergravity (mSUGRA,CMSSM) model         
Block SMINPUTS   # Standard Model inputs
     1     1.27837059E+02   # alpha_em^(-1)
     2     1.16570000E-05   # G_Fermi
     3     1.17200002E-01   # alpha_s(M_Z)
     4     9.11699982E+01   # m_{Z}(pole)
     5     4.19999981E+00   # m_{b}(m_{b})
     6     1.72500000E+02   # m_{top}(pole)
     7     1.77699995E+00   # m_{tau}(pole)
Block MINPAR   # SUSY breaking input parameters
     1     4.40000000E+02   # m_0
     2     1.30000000E+02   # m_{1/2}
     3     3.00000000E+00   # tan(beta)
     4     1.00000000E+00   # sign(mu)
     5     0.00000000E+00   # A_0
#  
#  M_{GUT} =   0.28564275E+17
Block MASS   # Scalar and gaugino mass spectrum
#  PDG code   mass                 particle
        24     8.04229965E+01   #  W^+
        25     9.20262222E+01   #  h^0            
        35     5.70832336E+02   #  H^0            
        36     5.64398621E+02   #  A^0            
        37     5.73559631E+02   #  H^+            
   1000001     5.30393127E+02   #  dnl            
   1000002     5.25456360E+02   #  upl            
   1000003     5.30393127E+02   #  stl            
   1000004     5.25458130E+02   #  chl            
   1000005     4.46204468E+02   #  b1             
   1000006     3.22146088E+02   #  t1             
   1000011     4.49075378E+02   #  el-            
   1000012     4.43152313E+02   #  nuel           
   1000013     4.49075378E+02   #  mul-           
   1000014     4.43152313E+02   #  numl           
   1000015     4.42560333E+02   #  tau1           
   1000016     4.42977692E+02   #  nutl           
   1000021     3.60313690E+02   #  glss           
   1000022     4.51477776E+01   #  z1ss           
   1000023     8.50131760E+01   #  z2ss           
   1000024     8.26450806E+01   #  w1ss           
   1000025    -3.01305756E+02   #  z3ss           
   1000035     3.27664337E+02   #  z4ss           
   1000037     3.23562225E+02   #  w2ss           
   2000001     5.24544556E+02   #  dnr            
   2000002     5.23403259E+02   #  upr            
   2000003     5.24544617E+02   #  str            
   2000004     5.23405029E+02   #  chr            
   2000005     5.22408630E+02   #  b2             
   2000006     4.90697540E+02   #  t2             
   2000011     4.43660156E+02   #  er-            
   2000013     4.43660156E+02   #  mur-           
   2000015     4.49448395E+02   #  tau2           
#  Higgs mixing
Block ALPHA   # Effective Higgs mixing parameter
         -3.36263925E-01   # alpha
Block STOPMIX   # stop mixing matrix
  1  1     4.12124008E-01   # O_{11}
  1  2    -9.11127746E-01   # O_{12}
  2  1     9.11127746E-01   # O_{21}
  2  2     4.12124008E-01   # O_{22}
Block SBOTMIX   # sbottom mixing matrix
  1  1     9.99108315E-01   # O_{11}
  1  2    -4.22211215E-02   # O_{12}
  2  1     4.22211215E-02   # O_{21}
  2  2     9.99108315E-01   # O_{22}
Block STAUMIX   # stau mixing matrix
  1  1     2.98159987E-01   # O_{11}
  1  2    -9.54515934E-01   # O_{12}
  2  1     9.54515934E-01   # O_{21}
  2  2     2.98159987E-01   # O_{22}
Block NMIX   # neutralino mixing matrix
  1  1     9.53622699E-01   #
  1  2    -2.06835076E-01   #
  1  3     1.98155791E-01   #
  1  4    -9.25050676E-02   #
  2  1    -2.62822419E-01   #
  2  2    -9.25914943E-01   #
  2  3     2.35366121E-01   #
  2  4    -1.34939522E-01   #
  3  1     5.58809079E-02   #
  3  2    -8.83872956E-02   #
  3  3    -6.93812191E-01   #
  3  4    -7.12523520E-01   #
  4  1     1.35666385E-01   #
  4  2    -3.03460777E-01   #
  4  3    -6.51123464E-01   #
  4  4     6.82308197E-01   #
Block UMIX   # chargino U mixing matrix
  1  1    -9.21555221E-01   # U_{11}
  1  2     3.88247252E-01   # U_{12}
  2  1    -3.88247252E-01   # U_{21}
  2  2    -9.21555221E-01   # U_{22}
Block VMIX   # chargino V mixing matrix
  1  1    -9.74029958E-01   # V_{11}
  1  2     2.26419285E-01   # V_{12}
  2  1    -2.26419285E-01   # V_{21}
  2  2    -9.74029958E-01   # V_{22}
Block GAUGE Q=  3.64015625E+02   #
     1     3.57525855E-01   # g`
     2     6.52364433E-01   # g_2
     3     1.21911490E+00   # g_3
Block YU Q=  3.64015625E+02   #
  3  3     9.37043011E-01   # y_t
Block YD Q=  3.64015625E+02   #
  3  3     4.53119315E-02   # y_b
Block YE Q=  3.64015625E+02   #
  3  3     3.17087397E-02   # y_tau
Block HMIX Q=  3.64015625E+02   # Higgs mixing parameters
     1     2.97423950E+02   # mu(Q)
     2     3.00000000E+00   # tan(beta)(M_{GUT})
     3     2.50151428E+02   # Higgs vev at Q
     4     3.18545812E+05   # m_A^2(Q)
Block MSOFT Q=  3.64015625E+02   # DRbar SUSY breaking parameters
     1     5.22273865E+01   # M_1(Q)          
     2     9.93971481E+01   # M_2(Q)          
     3     3.19048248E+02   # M_3(Q)          
    31     4.46164307E+02   # MeL(Q)          
    32     4.46164307E+02   # MmuL(Q)         
    33     4.45993286E+02   # MtauL(Q)        
    34     4.41624298E+02   # MeR(Q)          
    35     4.41624298E+02   # MmuR(Q)         
    36     4.41229645E+02   # MtauR(Q)        
    41     5.11975677E+02   # MqL1(Q)         
    42     5.11975677E+02   # MqL2(Q)         
    43     4.27948181E+02   # MqL3(Q)         
    44     5.08666290E+02   # MuR(Q)          
    45     5.08666290E+02   # McR(Q)          
    46     3.09634186E+02   # MtR(Q)          
    47     5.08301636E+02   # MdR(Q)          
    48     5.08301636E+02   # MsR(Q)          
    49     5.10264801E+02   # MbR(Q)          
Block AU Q=  3.64015625E+02   #
  1  1    -2.36623230E+02   # A_u
  2  2    -2.36623230E+02   # A_c
  3  3    -2.36623230E+02   # A_t
Block AD Q=  3.64015625E+02   #
  1  1    -3.82102173E+02   # A_d
  2  2    -3.82102173E+02   # A_s
  3  3    -3.82102173E+02   # A_b
Block AE Q=  3.64015625E+02   #
  1  1    -8.32173615E+01   # A_e
  2  2    -8.32173615E+01   # A_mu
  3  3    -8.32173615E+01   # A_tau
#  ISAJET decay tables in SUSY Les Houches accord format
#  Created by ISALHD. Last revision: C. Balazs, 2005 May 25
Block DCINFO                           # Program information
     1   ISASUGRA from ISAJET          # Spectrum Calculator
     2   7.79   16-DEC-2008 15:42:00   # Version number
#         PDG         Width
DECAY         6  1.14680767E+00   # TP    decays
#          BR          NDA       ID1       ID2       ID3       ID4
      3.33333343E-01    3            2        -1         5             # TP     -->  UP     DB     BT          
      3.33333343E-01    3            4        -3         5             # TP     -->  CH     SB     BT          
      1.11111112E-01    3          -11        12         5             # TP     -->  E+     NUE    BT          
      1.11111112E-01    3          -13        14         5             # TP     -->  MU+    NUM    BT          
      1.11111112E-01    3          -15        16         5             # TP     -->  TAU+   NUT    BT          
#         PDG         Width
DECAY   1000021  5.09408629E-03   # GLSS  decays
#          BR          NDA       ID1       ID2       ID3       ID4
      1.14562199E-01    3      1000024         1        -2             # GLSS   -->  W1SS+  DN     UB          
      1.14562199E-01    3     -1000024         2        -1             # GLSS   -->  W1SS-  UP     DB          
      1.14561133E-01    3      1000024         3        -4             # GLSS   -->  W1SS+  ST     CB          
      1.14561133E-01    3     -1000024         4        -3             # GLSS   -->  W1SS-  CH     SB          
      1.82042867E-02    3      1000024         5        -6             # GLSS   -->  W1SS+  BT     TB          
      1.82042867E-02    3     -1000024         6        -5             # GLSS   -->  W1SS-  TP     BB          
      4.53706434E-06    3      1000037         1        -2             # GLSS   -->  W2SS+  DN     UB          
      4.53706434E-06    3     -1000037         2        -1             # GLSS   -->  W2SS-  UP     DB          
      4.53702842E-06    3      1000037         3        -4             # GLSS   -->  W2SS+  ST     CB          
      4.53702842E-06    3     -1000037         4        -3             # GLSS   -->  W2SS-  CH     SB          
      1.62856060E-03    2      1000022        21                       # GLSS   -->  Z1SS   GL                 
      3.78200337E-02    3      1000022         2        -2             # GLSS   -->  Z1SS   UP     UB          
      1.98422521E-02    3      1000022         1        -1             # GLSS   -->  Z1SS   DN     DB          
      1.98422484E-02    3      1000022         3        -3             # GLSS   -->  Z1SS   ST     SB          
      3.78193781E-02    3      1000022         4        -4             # GLSS   -->  Z1SS   CH     CB          
      3.63528915E-02    3      1000022         5        -5             # GLSS   -->  Z1SS   BT     BB          
      4.37926268E-03    2      1000023        21                       # GLSS   -->  Z2SS   GL                 
      6.33923113E-02    3      1000023         2        -2             # GLSS   -->  Z2SS   UP     UB          
      4.77592051E-02    3      1000023         1        -1             # GLSS   -->  Z2SS   DN     DB          
      4.77592051E-02    3      1000023         3        -3             # GLSS   -->  Z2SS   ST     SB          
      6.33911937E-02    3      1000023         4        -4             # GLSS   -->  Z2SS   CH     CB          
      1.23156928E-01    3      1000023         5        -5             # GLSS   -->  Z2SS   BT     BB          
      1.76454103E-03    2      1000025        21                       # GLSS   -->  Z3SS   GL                 
      5.76468096E-07    3      1000025         2        -2             # GLSS   -->  Z3SS   UP     UB          
      7.04041327E-07    3      1000025         1        -1             # GLSS   -->  Z3SS   DN     DB          
      7.04041213E-07    3      1000025         3        -3             # GLSS   -->  Z3SS   ST     SB          
      5.76455136E-07    3      1000025         4        -4             # GLSS   -->  Z3SS   CH     CB          
      6.19954290E-06    3      1000025         5        -5             # GLSS   -->  Z3SS   BT     BB          
      3.98704142E-04    2      1000035        21                       # GLSS   -->  Z4SS   GL                 
      1.23334746E-06    3      1000035         2        -2             # GLSS   -->  Z4SS   UP     UB          
      1.45412434E-06    3      1000035         1        -1             # GLSS   -->  Z4SS   DN     DB          
      1.45412434E-06    3      1000035         3        -3             # GLSS   -->  Z4SS   ST     SB          
      1.23331824E-06    3      1000035         4        -4             # GLSS   -->  Z4SS   CH     CB          
      5.76446928E-06    3      1000035         5        -5             # GLSS   -->  Z4SS   BT     BB          
#         PDG         Width
DECAY   1000002  1.58385649E+01   # UPL   decays
#          BR          NDA       ID1       ID2       ID3       ID4
      1.41995726E-04    2      1000022         2                       # UPL    -->  Z1SS   UP                 
      1.25652388E-01    2      1000023         2                       # UPL    -->  Z2SS   UP                 
      3.84220009E-04    2      1000025         2                       # UPL    -->  Z3SS   UP                 
      4.04860033E-03    2      1000035         2                       # UPL    -->  Z4SS   UP                 
      6.12225294E-01    2      1000021         2                       # UPL    -->  GLSS   UP                 
      2.52028912E-01    2      1000024         1                       # UPL    -->  W1SS+  DN                 
      5.51855005E-03    2      1000037         1                       # UPL    -->  W2SS+  DN                 
#         PDG         Width
DECAY   1000001  1.60327969E+01   # DNL   decays
#          BR          NDA       ID1       ID2       ID3       ID4
      1.99791435E-02    2      1000022         1                       # DNL    -->  Z1SS   DN                 
      1.01847388E-01    2      1000023         1                       # DNL    -->  Z2SS   DN                 
      6.21324347E-04    2      1000025         1                       # DNL    -->  Z3SS   DN                 
      5.73926559E-03    2      1000035         1                       # DNL    -->  Z4SS   DN                 
      6.30087197E-01    2      1000021         1                       # DNL    -->  GLSS   DN                 
      2.25177184E-01    2     -1000024         2                       # DNL    -->  W1SS-  UP                 
      1.65484417E-02    2     -1000037         2                       # DNL    -->  W2SS-  UP                 
#         PDG         Width
DECAY   1000003  1.60327377E+01   # STL   decays
#          BR          NDA       ID1       ID2       ID3       ID4
      1.99792180E-02    2      1000022         3                       # STL    -->  Z1SS   ST                 
      1.01847760E-01    2      1000023         3                       # STL    -->  Z2SS   ST                 
      6.21326617E-04    2      1000025         3                       # STL    -->  Z3SS   ST                 
      5.73928701E-03    2      1000035         3                       # STL    -->  Z4SS   ST                 
      6.30089521E-01    2      1000021         3                       # STL    -->  GLSS   ST                 
      2.25174949E-01    2     -1000024         4                       # STL    -->  W1SS-  CH                 
      1.65479593E-02    2     -1000037         4                       # STL    -->  W2SS-  CH                 
#         PDG         Width
DECAY   1000004  1.58382463E+01   # CHL   decays
#          BR          NDA       ID1       ID2       ID3       ID4
      1.41997167E-04    2      1000022         4                       # CHL    -->  Z1SS   CH                 
      1.25653639E-01    2      1000023         4                       # CHL    -->  Z2SS   CH                 
      3.84220330E-04    2      1000025         4                       # CHL    -->  Z3SS   CH                 
      4.04858775E-03    2      1000035         4                       # CHL    -->  Z4SS   CH                 
      6.12217963E-01    2      1000021         4                       # CHL    -->  GLSS   CH                 
      2.52034932E-01    2      1000024         3                       # CHL    -->  W1SS+  ST                 
      5.51872468E-03    2      1000037         3                       # CHL    -->  W2SS+  ST                 
#         PDG         Width
DECAY   1000005  7.85217047E+00   # BT1   decays
#          BR          NDA       ID1       ID2       ID3       ID4
      3.44576091E-02    2      1000022         5                       # BT1    -->  Z1SS   BT                 
      1.71243608E-01    2      1000023         5                       # BT1    -->  Z2SS   BT                 
      9.51971335E-04    2      1000025         5                       # BT1    -->  Z3SS   BT                 
      5.64130303E-03    2      1000035         5                       # BT1    -->  Z4SS   BT                 
      4.61613625E-01    2      1000021         5                       # BT1    -->  GLSS   BT                 
      2.66610414E-01    2     -1000024         6                       # BT1    -->  W1SS-  TP                 
      5.94814681E-02    2          -24   1000006                       # BT1    -->  W-     TP1                
#         PDG         Width
DECAY   1000006  1.68808436E+00   # TP1   decays
#          BR          NDA       ID1       ID2       ID3       ID4
      1.83494464E-01    2      1000022         6                       # TP1    -->  Z1SS   TP                 
      1.38121903E-01    2      1000023         6                       # TP1    -->  Z2SS   TP                 
      6.78383648E-01    2      1000024         5                       # TP1    -->  W1SS+  BT                 
#         PDG         Width
DECAY   2000002  1.06758909E+01   # UPR   decays
#          BR          NDA       ID1       ID2       ID3       ID4
      9.92921442E-02    2      1000022         2                       # UPR    -->  Z1SS   UP                 
      7.25689856E-03    2      1000023         2                       # UPR    -->  Z2SS   UP                 
      1.54710098E-04    2      1000025         2                       # UPR    -->  Z3SS   UP                 
      7.54275359E-04    2      1000035         2                       # UPR    -->  Z4SS   UP                 
      8.92542005E-01    2      1000021         2                       # UPR    -->  GLSS   UP                 
#         PDG         Width
DECAY   2000001  9.90954685E+00   # DNR   decays
#          BR          NDA       ID1       ID2       ID3       ID4
      2.68027578E-02    2      1000022         1                       # DNR    -->  Z1SS   DN                 
      1.95924891E-03    2      1000023         1                       # DNR    -->  Z2SS   DN                 
      4.19396019E-05    2      1000025         1                       # DNR    -->  Z3SS   DN                 
      2.04736905E-04    2      1000035         1                       # DNR    -->  Z4SS   DN                 
      9.70991313E-01    2      1000021         1                       # DNR    -->  GLSS   DN                 
#         PDG         Width
DECAY   2000003  9.90955162E+00   # STR   decays
#          BR          NDA       ID1       ID2       ID3       ID4
      2.68027484E-02    2      1000022         3                       # STR    -->  Z1SS   ST                 
      1.95924821E-03    2      1000023         3                       # STR    -->  Z2SS   ST                 
      4.19395947E-05    2      1000025         3                       # STR    -->  Z3SS   ST                 
      2.04736891E-04    2      1000035         3                       # STR    -->  Z4SS   ST                 
      9.70991313E-01    2      1000021         3                       # STR    -->  GLSS   ST                 
#         PDG         Width
DECAY   2000004  1.06755657E+01   # CHR   decays
#          BR          NDA       ID1       ID2       ID3       ID4
      9.92941782E-02    2      1000022         4                       # CHR    -->  Z1SS   CH                 
      7.25704478E-03    2      1000023         4                       # CHR    -->  Z2SS   CH                 
      1.54711757E-04    2      1000025         4                       # CHR    -->  Z3SS   CH                 
      7.54280249E-04    2      1000035         4                       # CHR    -->  Z4SS   CH                 
      8.92539799E-01    2      1000021         4                       # CHR    -->  GLSS   CH                 
#         PDG         Width
DECAY   2000005  9.73482323E+00   # BT2   decays
#          BR          NDA       ID1       ID2       ID3       ID4
      2.69882325E-02    2      1000022         5                       # BT2    -->  Z1SS   BT                 
      2.06013932E-03    2      1000023         5                       # BT2    -->  Z2SS   BT                 
      5.91812306E-04    2      1000025         5                       # BT2    -->  Z3SS   BT                 
      7.58826151E-04    2      1000035         5                       # BT2    -->  Z4SS   BT                 
      9.67762411E-01    2      1000021         5                       # BT2    -->  GLSS   BT                 
      9.42704792E-05    2     -1000024         6                       # BT2    -->  W1SS-  TP                 
      1.22391607E-03    2     -1000037         6                       # BT2    -->  W2SS-  TP                 
      5.20460133E-04    2          -24   1000006                       # BT2    -->  W-     TP1                
#         PDG         Width
DECAY   2000006  5.26618958E+00   # TP2   decays
#          BR          NDA       ID1       ID2       ID3       ID4
      4.21649337E-01    2      1000024         5                       # TP2    -->  W1SS+  BT                 
      1.53438017E-01    2      1000037         5                       # TP2    -->  W2SS+  BT                 
      1.12171903E-01    2           23   1000006                       # TP2    -->  Z0     TP1                
      9.33220834E-02    2           25   1000006                       # TP2    -->  HL0    TP1                
      4.52025048E-03    2      1000022         6                       # TP2    -->  Z1SS   TP                 
      1.76630110E-01    2      1000023         6                       # TP2    -->  Z2SS   TP                 
      3.82683426E-02    2      1000025         6                       # TP2    -->  Z3SS   TP                 
#         PDG         Width
DECAY   1000011  5.35199594E+00   # EL-   decays
#          BR          NDA       ID1       ID2       ID3       ID4
      3.48434485E-02    2      1000022        11                       # EL-    -->  Z1SS   E-                 
      3.76168400E-01    2      1000023        11                       # EL-    -->  Z2SS   E-                 
      3.55166936E-04    2      1000025        11                       # EL-    -->  Z3SS   E-                 
      4.04651556E-03    2      1000035        11                       # EL-    -->  Z4SS   E-                 
      5.59964955E-01    2     -1000024        12                       # EL-    -->  W1SS-  NUE                
      2.46215537E-02    2     -1000037        12                       # EL-    -->  W2SS-  NUE                
#         PDG         Width
DECAY   1000013  5.35199594E+00   # MUL-  decays
#          BR          NDA       ID1       ID2       ID3       ID4
      3.48434448E-02    2      1000022        13                       # MUL-   -->  Z1SS   MU-                
      3.76168400E-01    2      1000023        13                       # MUL-   -->  Z2SS   MU-                
      3.55166791E-04    2      1000025        13                       # MUL-   -->  Z3SS   MU-                
      4.04651370E-03    2      1000035        13                       # MUL-   -->  Z4SS   MU-                
      5.59964955E-01    2     -1000024        14                       # MUL-   -->  W1SS-  NUM                
      2.46215537E-02    2     -1000037        14                       # MUL-   -->  W2SS-  NUM                
#         PDG         Width
DECAY   1000015  2.48517013E+00   # TAU1- decays
#          BR          NDA       ID1       ID2       ID3       ID4
      7.45952487E-01    2      1000022        15                       # TAU1-  -->  Z1SS   TAU-               
      1.29169181E-01    2      1000023        15                       # TAU1-  -->  Z2SS   TAU-               
      5.98080340E-04    2      1000025        15                       # TAU1-  -->  Z3SS   TAU-               
      2.61811027E-03    2      1000035        15                       # TAU1-  -->  Z4SS   TAU-               
      1.19966500E-01    2     -1000024        16                       # TAU1-  -->  W1SS-  NUT                
      1.69570895E-03    2     -1000037        16                       # TAU1-  -->  W2SS-  NUT                
#         PDG         Width
DECAY   1000012  5.43463087E+00   # NUEL  decays
#          BR          NDA       ID1       ID2       ID3       ID4
      1.79608643E-01    2      1000022        12                       # NUEL   -->  Z1SS   NUE                
      1.94465518E-01    2      1000023        12                       # NUEL   -->  Z2SS   NUE                
      1.40776159E-03    2      1000025        12                       # NUEL   -->  Z3SS   NUE                
      1.00786351E-02    2      1000035        12                       # NUEL   -->  Z4SS   NUE                
      6.06767654E-01    2      1000024        11                       # NUEL   -->  W1SS+  E-                 
      7.67180417E-03    2      1000037        11                       # NUEL   -->  W2SS+  E-                 
#         PDG         Width
DECAY   1000014  5.43462992E+00   # NUML  decays
#          BR          NDA       ID1       ID2       ID3       ID4
      1.79608658E-01    2      1000022        14                       # NUML   -->  Z1SS   NUM                
      1.94465533E-01    2      1000023        14                       # NUML   -->  Z2SS   NUM                
      1.40776171E-03    2      1000025        14                       # NUML   -->  Z3SS   NUM                
      1.00786360E-02    2      1000035        14                       # NUML   -->  Z4SS   NUM                
      6.06767595E-01    2      1000024        13                       # NUML   -->  W1SS+  MU-                
      7.67180044E-03    2      1000037        13                       # NUML   -->  W2SS+  MU-                
#         PDG         Width
DECAY   1000016  5.43488836E+00   # NUTL  decays
#          BR          NDA       ID1       ID2       ID3       ID4
      1.79526404E-01    2      1000022        16                       # NUTL   -->  Z1SS   NUT                
      1.94367945E-01    2      1000023        16                       # NUTL   -->  Z2SS   NUT                
      1.40523294E-03    2      1000025        16                       # NUTL   -->  Z3SS   NUT                
      1.00550335E-02    2      1000035        16                       # NUTL   -->  Z4SS   NUT                
      6.06643021E-01    2      1000024        15                       # NUTL   -->  W1SS+  TAU-               
      8.00235756E-03    2      1000037        15                       # NUTL   -->  W2SS+  TAU-               
      5.79949496E-17    3      1000015        12       -11             # NUTL   -->  TAU1-  NUE    E+          
      5.79949496E-17    3      1000015        14       -13             # NUTL   -->  TAU1-  NUM    MU+         
      1.73984855E-16    3      1000015         2        -1             # NUTL   -->  TAU1-  UP     DB          
#         PDG         Width
DECAY   2000011  2.16510081E+00   # ER-   decays
#          BR          NDA       ID1       ID2       ID3       ID4
      9.28287685E-01    2      1000022        11                       # ER-    -->  Z1SS   E-                 
      6.68041259E-02    2      1000023        11                       # ER-    -->  Z2SS   E-                 
      9.44736821E-04    2      1000025        11                       # ER-    -->  Z3SS   E-                 
      3.96344392E-03    2      1000035        11                       # ER-    -->  Z4SS   E-                 
#         PDG         Width
DECAY   2000013  2.16510081E+00   # MUR-  decays
#          BR          NDA       ID1       ID2       ID3       ID4
      9.28287685E-01    2      1000022        13                       # MUR-   -->  Z1SS   MU-                
      6.68041185E-02    2      1000023        13                       # MUR-   -->  Z2SS   MU-                
      9.44736414E-04    2      1000025        13                       # MUR-   -->  Z3SS   MU-                
      3.96344159E-03    2      1000035        13                       # MUR-   -->  Z4SS   MU-                
#         PDG         Width
DECAY   2000015  5.03470087E+00   # TAU2- decays
#          BR          NDA       ID1       ID2       ID3       ID4
      6.76371530E-02    2      1000022        15                       # TAU2-  -->  Z1SS   TAU-               
      3.64678264E-01    2      1000023        15                       # TAU2-  -->  Z2SS   TAU-               
      1.01648481E-03    2      1000025        15                       # TAU2-  -->  Z3SS   TAU-               
      5.12036122E-03    2      1000035        15                       # TAU2-  -->  Z4SS   TAU-               
      5.35806894E-01    2     -1000024        16                       # TAU2-  -->  W1SS-  NUT                
      2.57407892E-02    2     -1000037        16                       # TAU2-  -->  W2SS-  NUT                
#         PDG         Width
DECAY   1000023  1.97266786E-07   # Z2SS  decays
#          BR          NDA       ID1       ID2       ID3       ID4
      8.14091880E-04    2      1000022        22                       # Z2SS   -->  Z1SS   GM                 
      5.29590121E-04    3     -1000024         2        -1             # Z2SS   -->  W1SS-  UP     DB          
      1.76530040E-04    3     -1000024        12       -11             # Z2SS   -->  W1SS-  NUE    E+          
      1.76530040E-04    3     -1000024        14       -13             # Z2SS   -->  W1SS-  NUM    MU+         
      5.29590121E-04    3      1000024         1        -2             # Z2SS   -->  W1SS+  DN     UB          
      1.76530040E-04    3      1000024        11       -12             # Z2SS   -->  W1SS+  E-     ANUE        
      1.76530040E-04    3      1000024        13       -14             # Z2SS   -->  W1SS+  MU-    ANUM        
      1.22003190E-01    3      1000022         2        -2             # Z2SS   -->  Z1SS   UP     UB          
      2.25755632E-01    3      1000022         1        -1             # Z2SS   -->  Z1SS   DN     DB          
      2.25755632E-01    3      1000022         3        -3             # Z2SS   -->  Z1SS   ST     SB          
      1.22003131E-01    3      1000022         4        -4             # Z2SS   -->  Z1SS   CH     CB          
      2.31242105E-01    3      1000022         5        -5             # Z2SS   -->  Z1SS   BT     BB          
      6.66159019E-03    3      1000022        11       -11             # Z2SS   -->  Z1SS   E-     E+          
      6.66159019E-03    3      1000022        13       -13             # Z2SS   -->  Z1SS   MU-    MU+         
      7.62364361E-03    3      1000022        15       -15             # Z2SS   -->  Z1SS   TAU-   TAU+        
      1.65803637E-02    3      1000022        12       -12             # Z2SS   -->  Z1SS   NUE    ANUE        
      1.65803637E-02    3      1000022        14       -14             # Z2SS   -->  Z1SS   NUM    ANUM        
      1.65533517E-02    3      1000022        16       -16             # Z2SS   -->  Z1SS   NUT    ANUT        
#         PDG         Width
DECAY   1000025  2.04495072E+00   # Z3SS  decays
#          BR          NDA       ID1       ID2       ID3       ID4
      4.71034554E-07    2      1000022        22                       # Z3SS   -->  Z1SS   GM                 
      1.29762910E-07    2      1000023        22                       # Z3SS   -->  Z2SS   GM                 
      3.13043475E-01    2      1000024       -24                       # Z3SS   -->  W1SS+  W-                 
      3.13043475E-01    2     -1000024        24                       # Z3SS   -->  W1SS-  W+                 
      1.52779207E-01    2      1000022        23                       # Z3SS   -->  Z1SS   Z0                 
      1.86407283E-01    2      1000023        23                       # Z3SS   -->  Z2SS   Z0                 
      1.70889241E-08    3      1000022         2        -2             # Z3SS   -->  Z1SS   UP     UB          
      2.85682997E-08    3      1000022         1        -1             # Z3SS   -->  Z1SS   DN     DB          
      2.85682997E-08    3      1000022         3        -3             # Z3SS   -->  Z1SS   ST     SB          
      1.70886469E-08    3      1000022         4        -4             # Z3SS   -->  Z1SS   CH     CB          
      1.61312713E-07    3      1000022         5        -5             # Z3SS   -->  Z1SS   BT     BB          
      7.05963217E-08    3      1000022        11       -11             # Z3SS   -->  Z1SS   E-     E+          
      7.05963217E-08    3      1000022        13       -13             # Z3SS   -->  Z1SS   MU-    MU+         
      1.50940849E-07    3      1000022        15       -15             # Z3SS   -->  Z1SS   TAU-   TAU+        
      1.20687801E-07    3      1000022        12       -12             # Z3SS   -->  Z1SS   NUE    ANUE        
      1.20687801E-07    3      1000022        14       -14             # Z3SS   -->  Z1SS   NUM    ANUM        
      1.20939887E-07    3      1000022        16       -16             # Z3SS   -->  Z1SS   NUT    ANUT        
      6.98233507E-08    3      1000023         2        -2             # Z3SS   -->  Z2SS   UP     UB          
      8.53804849E-08    3      1000023         1        -1             # Z3SS   -->  Z2SS   DN     DB          
      8.53804849E-08    3      1000023         3        -3             # Z3SS   -->  Z2SS   ST     SB          
      6.98221783E-08    3      1000023         4        -4             # Z3SS   -->  Z2SS   CH     CB          
      4.13251456E-07    3      1000023         5        -5             # Z3SS   -->  Z2SS   BT     BB          
      3.68847175E-08    3      1000023        11       -11             # Z3SS   -->  Z2SS   E-     E+          
      3.68847175E-08    3      1000023        13       -13             # Z3SS   -->  Z2SS   MU-    MU+         
      8.95266723E-08    3      1000023        15       -15             # Z3SS   -->  Z2SS   TAU-   TAU+        
      8.28124413E-08    3      1000023        12       -12             # Z3SS   -->  Z2SS   NUE    ANUE        
      8.28124413E-08    3      1000023        14       -14             # Z3SS   -->  Z2SS   NUM    ANUM        
      8.29912139E-08    3      1000023        16       -16             # Z3SS   -->  Z2SS   NUT    ANUT        
      2.01407224E-02    2      1000022        25                       # Z3SS   -->  Z1SS   HL0                
      1.45832440E-02    2      1000023        25                       # Z3SS   -->  Z2SS   HL0                
#         PDG         Width
DECAY   1000035  2.17061162E+00   # Z4SS  decays
#          BR          NDA       ID1       ID2       ID3       ID4
      8.95359335E-07    2      1000022        22                       # Z4SS   -->  Z1SS   GM                 
      9.10365770E-07    2      1000023        22                       # Z4SS   -->  Z2SS   GM                 
      6.39731246E-09    2      1000025        22                       # Z4SS   -->  Z3SS   GM                 
      3.52174550E-01    2      1000024       -24                       # Z4SS   -->  W1SS+  W-                 
      3.52174550E-01    2     -1000024        24                       # Z4SS   -->  W1SS-  W+                 
      2.64926386E-10    3     -1000037         2        -1             # Z4SS   -->  W2SS-  UP     DB          
      8.83087978E-11    3     -1000037        12       -11             # Z4SS   -->  W2SS-  NUE    E+          
      8.83087978E-11    3     -1000037        14       -13             # Z4SS   -->  W2SS-  NUM    MU+         
      2.64926414E-10    3      1000037         1        -2             # Z4SS   -->  W2SS+  DN     UB          
      8.83087978E-11    3      1000037        11       -12             # Z4SS   -->  W2SS+  E-     ANUE        
      8.83087978E-11    3      1000037        13       -14             # Z4SS   -->  W2SS+  MU-    ANUM        
      2.64926414E-10    3     -1000037         4        -3             # Z4SS   -->  W2SS-  CH     SB          
      8.83087978E-11    3     -1000037        16       -15             # Z4SS   -->  W2SS-  NUT    TAU+        
      2.64926414E-10    3      1000037         3        -4             # Z4SS   -->  W2SS+  ST     CB          
      8.83087978E-11    3      1000037        15       -16             # Z4SS   -->  W2SS+  TAU-   ANUT        
      2.28468701E-02    2      1000022        23                       # Z4SS   -->  Z1SS   Z0                 
      1.78909879E-02    2      1000023        23                       # Z4SS   -->  Z2SS   Z0                 
      2.44936757E-07    3      1000022         2        -2             # Z4SS   -->  Z1SS   UP     UB          
      7.49543290E-07    3      1000022         1        -1             # Z4SS   -->  Z1SS   DN     DB          
      7.49543290E-07    3      1000022         3        -3             # Z4SS   -->  Z1SS   ST     SB          
      2.44932806E-07    3      1000022         4        -4             # Z4SS   -->  Z1SS   CH     CB          
      1.85439205E-06    3      1000022         5        -5             # Z4SS   -->  Z1SS   BT     BB          
      1.13956298E-06    3      1000022        11       -11             # Z4SS   -->  Z1SS   E-     E+          
      1.13956298E-06    3      1000022        13       -13             # Z4SS   -->  Z1SS   MU-    MU+         
      1.23335292E-06    3      1000022        15       -15             # Z4SS   -->  Z1SS   TAU-   TAU+        
      2.98034161E-06    3      1000022        12       -12             # Z4SS   -->  Z1SS   NUE    ANUE        
      2.98034161E-06    3      1000022        14       -14             # Z4SS   -->  Z1SS   NUM    ANUM        
      2.98675081E-06    3      1000022        16       -16             # Z4SS   -->  Z1SS   NUT    ANUT        
      2.90274920E-06    3      1000023         2        -2             # Z4SS   -->  Z2SS   UP     UB          
      3.11124154E-06    3      1000023         1        -1             # Z4SS   -->  Z2SS   DN     DB          
      3.11124154E-06    3      1000023         3        -3             # Z4SS   -->  Z2SS   ST     SB          
      2.90270100E-06    3      1000023         4        -4             # Z4SS   -->  Z2SS   CH     CB          
      7.80647224E-06    3      1000023         5        -5             # Z4SS   -->  Z2SS   BT     BB          
      1.83026930E-06    3      1000023        11       -11             # Z4SS   -->  Z2SS   E-     E+          
      1.83026930E-06    3      1000023        13       -13             # Z4SS   -->  Z2SS   MU-    MU+         
      1.89284481E-06    3      1000023        15       -15             # Z4SS   -->  Z2SS   TAU-   TAU+        
      2.77209710E-06    3      1000023        12       -12             # Z4SS   -->  Z2SS   NUE    ANUE        
      2.77209710E-06    3      1000023        14       -14             # Z4SS   -->  Z2SS   NUM    ANUM        
      2.77818799E-06    3      1000023        16       -16             # Z4SS   -->  Z2SS   NUT    ANUT        
      6.06120409E-07    3      1000025         2        -2             # Z4SS   -->  Z3SS   UP     UB          
      7.85402165E-07    3      1000025         1        -1             # Z4SS   -->  Z3SS   DN     DB          
      7.85402165E-07    3      1000025         3        -3             # Z4SS   -->  Z3SS   ST     SB          
      6.06120409E-07    3      1000025         4        -4             # Z4SS   -->  Z3SS   CH     CB          
      5.25819985E-07    3      1000025         5        -5             # Z4SS   -->  Z3SS   BT     BB          
      1.78213739E-07    3      1000025        11       -11             # Z4SS   -->  Z3SS   E-     E+          
      1.78213739E-07    3      1000025        13       -13             # Z4SS   -->  Z3SS   MU-    MU+         
      1.67045499E-07    3      1000025        15       -15             # Z4SS   -->  Z3SS   TAU-   TAU+        
      3.51363752E-07    3      1000025        12       -12             # Z4SS   -->  Z3SS   NUE    ANUE        
      3.51363752E-07    3      1000025        14       -14             # Z4SS   -->  Z3SS   NUM    ANUM        
      3.51360285E-07    3      1000025        16       -16             # Z4SS   -->  Z3SS   NUT    ANUT        
      1.12839766E-01    2      1000022        25                       # Z4SS   -->  Z1SS   HL0                
      1.42016530E-01    2      1000023        25                       # Z4SS   -->  Z2SS   HL0                
#         PDG         Width
DECAY   1000024  1.15891244E-05   # W1SS+ decays
#          BR          NDA       ID1       ID2       ID3       ID4
      3.33391309E-01    3      1000022         2        -1             # W1SS+  -->  Z1SS   UP     DB          
      3.33391309E-01    3      1000022         4        -3             # W1SS+  -->  Z1SS   CH     SB          
      1.11070745E-01    3      1000022       -11        12             # W1SS+  -->  Z1SS   E+     NUE         
      1.11070745E-01    3      1000022       -13        14             # W1SS+  -->  Z1SS   MU+    NUM         
      1.11075923E-01    3      1000022       -15        16             # W1SS+  -->  Z1SS   TAU+   NUT         
#         PDG         Width
DECAY   1000037  2.14939117E+00   # W2SS+ decays
#          BR          NDA       ID1       ID2       ID3       ID4
      7.85603504E-07    3      1000022         2        -1             # W2SS+  -->  Z1SS   UP     DB          
      7.85603618E-07    3      1000022         4        -3             # W2SS+  -->  Z1SS   CH     SB          
      1.49525044E-06    3      1000022       -11        12             # W2SS+  -->  Z1SS   E+     NUE         
      1.49525044E-06    3      1000022       -13        14             # W2SS+  -->  Z1SS   MU+    NUM         
      1.61846435E-06    3      1000022       -15        16             # W2SS+  -->  Z1SS   TAU+   NUT         
      2.46955324E-02    2      1000022        24                       # W2SS+  -->  Z1SS   W+                 
      3.13586588E-06    3      1000023         2        -1             # W2SS+  -->  Z2SS   UP     DB          
      3.13585338E-06    3      1000023         4        -3             # W2SS+  -->  Z2SS   CH     SB          
      3.37601750E-06    3      1000023       -11        12             # W2SS+  -->  Z2SS   E+     NUE         
      3.37601750E-06    3      1000023       -13        14             # W2SS+  -->  Z2SS   MU+    NUM         
      3.41993564E-06    3      1000023       -15        16             # W2SS+  -->  Z2SS   TAU+   NUT         
      4.16143954E-01    2      1000023        24                       # W2SS+  -->  Z2SS   W+                 
      9.47940975E-07    3      1000025         2        -1             # W2SS+  -->  Z3SS   UP     DB          
      9.47940975E-07    3      1000025         4        -3             # W2SS+  -->  Z3SS   CH     SB          
      3.15651818E-07    3      1000025       -11        12             # W2SS+  -->  Z3SS   E+     NUE         
      3.15651818E-07    3      1000025       -13        14             # W2SS+  -->  Z3SS   MU+    NUM         
      3.15694194E-07    3      1000025       -15        16             # W2SS+  -->  Z3SS   TAU+   NUT         
      3.23910743E-01    2      1000024        23                       # W2SS+  -->  W1SS+  Z0                 
      2.76062610E-06    3      1000024         1        -1             # W2SS+  -->  W1SS+  DN     DB          
      2.76058040E-06    3      1000024         3        -3             # W2SS+  -->  W1SS+  ST     SB          
      6.93771563E-06    3      1000024         2        -2             # W2SS+  -->  W1SS+  UP     UB          
      6.93771563E-06    3      1000024         4        -4             # W2SS+  -->  W1SS+  CH     CB          
      5.49508513E-06    3      1000024        12       -12             # W2SS+  -->  W1SS+  NUE    ANUE        
      5.49508513E-06    3      1000024        14       -14             # W2SS+  -->  W1SS+  NUM    ANUM        
      5.96169957E-06    3      1000024        16       -16             # W2SS+  -->  W1SS+  NUT    ANUT        
      2.24814153E-06    3      1000024        11       -11             # W2SS+  -->  W1SS+  E-     E+          
      2.24814153E-06    3      1000024        13       -13             # W2SS+  -->  W1SS+  MU-    MU+         
      2.25311783E-06    3      1000024        15       -15             # W2SS+  -->  W1SS+  TAU-   TAU+        
      2.35181138E-01    2      1000024        25                       # W2SS+  -->  W1SS+  HL0                
#         PDG         Width
DECAY        25  3.42283072E-03   # HL0   decays
#          BR          NDA       ID1       ID2       ID3       ID4
      4.97449371E-09    2           11       -11                       # HL0    -->  E-     E+                 
      2.10030455E-04    2           13       -13                       # HL0    -->  MU-    MU+                
      6.00218810E-02    2           15       -15                       # HL0    -->  TAU-   TAU+               
      6.26517885E-06    2            1        -1                       # HL0    -->  DN     DB                 
      2.53144396E-03    2            3        -3                       # HL0    -->  ST     SB                 
      8.56274009E-01    2            5        -5                       # HL0    -->  BT     BB                 
      1.82308042E-06    2            2        -2                       # HL0    -->  UP     UB                 
      3.55337933E-02    2            4        -4                       # HL0    -->  CH     CB                 
      1.08610222E-03    2           22        22                       # HL0    -->  GM     GM                 
      2.36870702E-02    2           21        21                       # HL0    -->  GL     GL                 
      2.02602241E-05    3           24        11       -12             # HL0    -->  W+     E-     ANUE        
      2.02602241E-05    3           24        13       -14             # HL0    -->  W+     MU-    ANUM        
      2.02602241E-05    3           24        15       -16             # HL0    -->  W+     TAU-   ANUT        
      6.07806687E-05    3           24        -2         1             # HL0    -->  W+     UB     DN          
      6.07806687E-05    3           24        -4         3             # HL0    -->  W+     CB     ST          
      2.02602241E-05    3          -24       -11        12             # HL0    -->  W-     E+     NUE         
      2.02602241E-05    3          -24       -13        14             # HL0    -->  W-     MU+    NUM         
      2.02602241E-05    3          -24       -15        16             # HL0    -->  W-     TAU+   NUT         
      6.07806687E-05    3          -24         2        -1             # HL0    -->  W-     UP     DB          
      6.07806687E-05    3          -24         4        -3             # HL0    -->  W-     CH     SB          
      2.02829503E-02    2      1000022   1000022                       # HL0    -->  Z1SS   Z1SS               
#         PDG         Width
DECAY        35  6.30022049E+00   # HH0   decays
#          BR          NDA       ID1       ID2       ID3       ID4
      1.37209633E-10    2           11       -11                       # HH0    -->  E-     E+                 
      5.79323751E-06    2           13       -13                       # HH0    -->  MU-    MU+                
      1.65917573E-03    2           15       -15                       # HH0    -->  TAU-   TAU+               
      1.68921261E-07    2            1        -1                       # HH0    -->  DN     DB                 
      6.82527389E-05    2            3        -3                       # HH0    -->  ST     SB                 
      1.05423816E-02    2            5        -5                       # HH0    -->  BT     BB                 
      7.33733685E-10    2            2        -2                       # HH0    -->  UP     UB                 
      1.10710316E-05    2            4        -4                       # HH0    -->  CH     CB                 
      3.33042502E-01    2            6        -6                       # HH0    -->  TP     TB                 
      4.75895058E-06    2           22        22                       # HH0    -->  GM     GM                 
      4.85971861E-04    2           21        21                       # HH0    -->  GL     GL                 
      1.79650495E-03    2           24       -24                       # HH0    -->  W+     W-                 
      8.91467324E-04    2           23        23                       # HH0    -->  Z0     Z0                 
      9.61397681E-03    2      1000022   1000022                       # HH0    -->  Z1SS   Z1SS               
      2.23342963E-02    2      1000022   1000023                       # HH0    -->  Z1SS   Z2SS               
      8.63966718E-02    2      1000022   1000025                       # HH0    -->  Z1SS   Z3SS               
      7.32148252E-03    2      1000022   1000035                       # HH0    -->  Z1SS   Z4SS               
      1.27898371E-02    2      1000023   1000023                       # HH0    -->  Z2SS   Z2SS               
      1.01209044E-01    2      1000023   1000025                       # HH0    -->  Z2SS   Z3SS               
      6.40787277E-03    2      1000023   1000035                       # HH0    -->  Z2SS   Z4SS               
      5.55318929E-02    2      1000024  -1000024                       # HH0    -->  W1SS+  W1SS-              
      1.72178954E-01    2      1000024  -1000037                       # HH0    -->  W1SS+  W2SS-              
      1.72178954E-01    2     -1000024   1000037                       # HH0    -->  W1SS-  W2SS+              
      5.52899577E-03    2           25        25                       # HH0    -->  HL0    HL0                
#         PDG         Width
DECAY        36  6.81296635E+00   # HA0   decays
#          BR          NDA       ID1       ID2       ID3       ID4
      1.26702579E-10    2           11       -11                       # HA0    -->  E-     E+                 
      5.34961100E-06    2           13       -13                       # HA0    -->  MU-    MU+                
      1.53218023E-03    2           15       -15                       # HA0    -->  TAU-   TAU+               
      1.56002272E-07    2            1        -1                       # HA0    -->  DN     DB                 
      6.30328141E-05    2            3        -3                       # HA0    -->  ST     SB                 
      9.73756146E-03    2            5        -5                       # HA0    -->  BT     BB                 
      6.16242779E-10    2            2        -2                       # HA0    -->  UP     UB                 
      9.31155319E-06    2            4        -4                       # HA0    -->  CH     CB                 
      4.21874195E-01    2            6        -6                       # HA0    -->  TP     TB                 
      1.90451965E-06    2           22        22                       # HA0    -->  GM     GM                 
      4.13054309E-04    2           21        21                       # HA0    -->  GL     GL                 
      1.73593983E-02    2      1000022   1000022                       # HA0    -->  Z1SS   Z1SS               
      4.46631573E-02    2      1000022   1000023                       # HA0    -->  Z1SS   Z2SS               
      1.29050994E-02    2      1000022   1000025                       # HA0    -->  Z1SS   Z3SS               
      4.71952744E-02    2      1000022   1000035                       # HA0    -->  Z1SS   Z4SS               
      2.87263058E-02    2      1000023   1000023                       # HA0    -->  Z2SS   Z2SS               
      1.17323380E-02    2      1000023   1000025                       # HA0    -->  Z2SS   Z3SS               
      5.31128459E-02    2      1000023   1000035                       # HA0    -->  Z2SS   Z4SS               
      1.20301194E-01    2      1000024  -1000024                       # HA0    -->  W1SS+  W1SS-              
      1.14408486E-01    2      1000024  -1000037                       # HA0    -->  W1SS+  W2SS-              
      1.14408486E-01    2     -1000024   1000037                       # HA0    -->  W1SS-  W2SS+              
      1.55065651E-03    2           25        23                       # HA0    -->  HL0    Z0                 
#         PDG         Width
DECAY        37  6.62627268E+00   # H+    decays
#          BR          NDA       ID1       ID2       ID3       ID4
      1.32386907E-10    2           12       -11                       # H+     -->  NUE    E+                 
      5.58961392E-06    2           14       -13                       # H+     -->  NUM    MU+                
      1.60092046E-03    2           16       -15                       # H+     -->  NUT    TAU+               
      1.49660465E-07    2            2        -1                       # H+     -->  UP     DB                 
      6.91114765E-05    2            4        -3                       # H+     -->  CH     SB                 
      3.93163383E-01    2            6        -5                       # H+     -->  TP     BB                 
      4.68970612E-02    2      1000024   1000022                       # H+     -->  W1SS+  Z1SS               
      3.71608674E-03    2      1000024   1000023                       # H+     -->  W1SS+  Z2SS               
      1.72891900E-01    2      1000024   1000025                       # H+     -->  W1SS+  Z3SS               
      1.54786646E-01    2      1000024   1000035                       # H+     -->  W1SS+  Z4SS               
      6.95549464E-03    2      1000037   1000022                       # H+     -->  W2SS+  Z1SS               
      2.18221635E-01    2      1000037   1000023                       # H+     -->  W2SS+  Z2SS               
      1.69200264E-03    2           25        24                       # H+     -->  HL0    W+                 
