#  ISAJET SUSY parameters in Les Houches accord format
#  Created by ISALHA3. Last revision by C. Balazs on 2005 Jan. 10
Block SPINFO   # Program information
     1   ISASUGRA from ISAJET          # Spectrum Calculator
     2   7.79   16-DEC-2008 15:42:00   # Version number
Block MODSEL   # Model selection
     1     1   # Minimal supergravity (mSUGRA,CMSSM) model         
Block SMINPUTS   # Standard Model inputs
     1     1.27848709E+02   # alpha_em^(-1)
     2     1.16570000E-05   # G_Fermi
     3     1.17200002E-01   # alpha_s(M_Z)
     4     9.11699982E+01   # m_{Z}(pole)
     5     4.19999981E+00   # m_{b}(m_{b})
     6     1.72500000E+02   # m_{top}(pole)
     7     1.77699995E+00   # m_{tau}(pole)
Block MINPAR   # SUSY breaking input parameters
     1     5.20000000E+02   # m_0
     2     1.00000000E+02   # m_{1/2}
     3     3.00000000E+00   # tan(beta)
     4     1.00000000E+00   # sign(mu)
     5     0.00000000E+00   # A_0
#  
#  M_{GUT} =   0.29220280E+17
Block MASS   # Scalar and gaugino mass spectrum
#  PDG code   mass                 particle
        24     8.04229965E+01   #  W^+
        25     9.11854630E+01   #  h^0            
        35     6.43992371E+02   #  H^0            
        36     6.37381165E+02   #  A^0            
        37     6.46402039E+02   #  H^+            
   1000001     5.64722473E+02   #  dnl            
   1000002     5.60078064E+02   #  upl            
   1000003     5.64722473E+02   #  stl            
   1000004     5.60079773E+02   #  chl            
   1000005     4.61247833E+02   #  b1             
   1000006     3.28706848E+02   #  t1             
   1000011     5.24180847E+02   #  el-            
   1000012     5.19174561E+02   #  nuel           
   1000013     5.24180847E+02   #  mul-           
   1000014     5.19174561E+02   #  numl           
   1000015     5.20519958E+02   #  tau1           
   1000016     5.18947754E+02   #  nutl           
   1000021     2.93196289E+02   #  glss           
   1000022     3.34864006E+01   #  z1ss           
   1000023     6.44053574E+01   #  z2ss           
   1000024     6.20343399E+01   #  w1ss           
   1000025    -3.11293823E+02   #  z3ss           
   1000035     3.34323486E+02   #  z4ss           
   1000037     3.30786499E+02   #  w2ss           
   2000001     5.61991333E+02   #  dnr            
   2000002     5.60619324E+02   #  upr            
   2000003     5.61991394E+02   #  str            
   2000004     5.60620972E+02   #  chr            
   2000005     5.59787659E+02   #  b2             
   2000006     4.93785858E+02   #  t2             
   2000011     5.21988403E+02   #  er-            
   2000013     5.21988403E+02   #  mur-           
   2000015     5.24711487E+02   #  tau2           
#  Higgs mixing
Block ALPHA   # Effective Higgs mixing parameter
         -3.33058149E-01   # alpha
Block STOPMIX   # stop mixing matrix
  1  1     3.22797686E-01   # O_{11}
  1  2    -9.46467996E-01   # O_{12}
  2  1     9.46467996E-01   # O_{21}
  2  2     3.22797686E-01   # O_{22}
Block SBOTMIX   # sbottom mixing matrix
  1  1     9.99543071E-01   # O_{11}
  1  2    -3.02260090E-02   # O_{12}
  2  1     3.02260090E-02   # O_{21}
  2  2     9.99543071E-01   # O_{22}
Block STAUMIX   # stau mixing matrix
  1  1     4.53405708E-01   # O_{11}
  1  2    -8.91304255E-01   # O_{12}
  2  1     8.91304255E-01   # O_{21}
  2  2     4.53405708E-01   # O_{22}
Block NMIX   # neutralino mixing matrix
  1  1    -9.44929242E-01   #
  1  2     2.47379199E-01   #
  1  3    -1.96640342E-01   #
  1  4     8.51165429E-02   #
  2  1    -2.95756906E-01   #
  2  2    -9.25596833E-01   #
  2  3     2.09853560E-01   #
  2  4    -1.08442724E-01   #
  3  1     5.61301745E-02   #
  3  2    -9.16875526E-02   #
  3  3    -6.93453074E-01   #
  3  4    -7.12436795E-01   #
  4  1    -1.28397703E-01   #
  4  2     2.71417379E-01   #
  4  3     6.60619020E-01   #
  4  4    -6.88062131E-01   #
Block UMIX   # chargino U mixing matrix
  1  1    -9.33891833E-01   # U_{11}
  1  2     3.57555717E-01   # U_{12}
  2  1    -3.57555717E-01   # U_{21}
  2  2    -9.33891833E-01   # U_{22}
Block VMIX   # chargino V mixing matrix
  1  1    -9.82110143E-01   # V_{11}
  1  2     1.88307360E-01   # V_{12}
  2  1    -1.88307360E-01   # V_{21}
  2  2    -9.82110143E-01   # V_{22}
Block GAUGE Q=  3.68107849E+02   #
     1     3.57489854E-01   # g`
     2     6.52454555E-01   # g_2
     3     1.22100914E+00   # g_3
Block YU Q=  3.68107849E+02   #
  3  3     9.41676795E-01   # y_t
Block YD Q=  3.68107849E+02   #
  3  3     4.54035178E-02   # y_b
Block YE Q=  3.68107849E+02   #
  3  3     3.17085460E-02   # y_tau
Block HMIX Q=  3.68107849E+02   # Higgs mixing parameters
     1     3.06967865E+02   # mu(Q)
     2     3.00000000E+00   # tan(beta)(M_{GUT})
     3     2.50229095E+02   # Higgs vev at Q
     4     4.06254750E+05   # m_A^2(Q)
Block MSOFT Q=  3.68107849E+02   # DRbar SUSY breaking parameters
     1     4.02032394E+01   # M_1(Q)          
     2     7.65182419E+01   # M_2(Q)          
     3     2.51350052E+02   # M_3(Q)          
    31     5.21373352E+02   # MeL(Q)          
    32     5.21373352E+02   # MmuL(Q)         
    33     5.21150940E+02   # MtauL(Q)        
    34     5.20137451E+02   # MeR(Q)          
    35     5.20137451E+02   # MmuR(Q)         
    36     5.19671021E+02   # MtauR(Q)        
    41     5.49923889E+02   # MqL1(Q)         
    42     5.49923889E+02   # MqL2(Q)         
    43     4.46765656E+02   # MqL3(Q)         
    44     5.49309937E+02   # MuR(Q)          
    45     5.49309937E+02   # McR(Q)          
    46     3.03298584E+02   # MtR(Q)          
    47     5.49276306E+02   # MdR(Q)          
    48     5.49276306E+02   # MsR(Q)          
    49     5.50168884E+02   # MbR(Q)          
Block AU Q=  3.68107849E+02   #
  1  1    -1.81736221E+02   # A_u
  2  2    -1.81736221E+02   # A_c
  3  3    -1.81736221E+02   # A_t
Block AD Q=  3.68107849E+02   #
  1  1    -2.94795074E+02   # A_d
  2  2    -2.94795074E+02   # A_s
  3  3    -2.94795074E+02   # A_b
Block AE Q=  3.68107849E+02   #
  1  1    -6.39966965E+01   # A_e
  2  2    -6.39966965E+01   # A_mu
  3  3    -6.39966965E+01   # A_tau
#  ISAJET decay tables in SUSY Les Houches accord format
#  Created by ISALHD. Last revision: C. Balazs, 2005 May 25
Block DCINFO                           # Program information
     1   ISASUGRA from ISAJET          # Spectrum Calculator
     2   7.79   16-DEC-2008 15:42:00   # Version number
#         PDG         Width
DECAY         6  1.14680767E+00   # TP    decays
#          BR          NDA       ID1       ID2       ID3       ID4
      3.33333343E-01    3            2        -1         5             # TP     -->  UP     DB     BT          
      3.33333343E-01    3            4        -3         5             # TP     -->  CH     SB     BT          
      1.11111112E-01    3          -11        12         5             # TP     -->  E+     NUE    BT          
      1.11111112E-01    3          -13        14         5             # TP     -->  MU+    NUM    BT          
      1.11111112E-01    3          -15        16         5             # TP     -->  TAU+   NUT    BT          
#         PDG         Width
DECAY   1000021  1.18529191E-03   # GLSS  decays
#          BR          NDA       ID1       ID2       ID3       ID4
      1.19064845E-01    3      1000024         1        -2             # GLSS   -->  W1SS+  DN     UB          
      1.19064845E-01    3     -1000024         2        -1             # GLSS   -->  W1SS-  UP     DB          
      1.19063973E-01    3      1000024         3        -4             # GLSS   -->  W1SS+  ST     CB          
      1.19063973E-01    3     -1000024         4        -3             # GLSS   -->  W1SS-  CH     SB          
      4.05094214E-03    3      1000024         5        -6             # GLSS   -->  W1SS+  BT     TB          
      4.05094214E-03    3     -1000024         6        -5             # GLSS   -->  W1SS-  TP     BB          
      2.56765843E-03    2      1000022        21                       # GLSS   -->  Z1SS   GL                 
      3.63107063E-02    3      1000022         2        -2             # GLSS   -->  Z1SS   UP     UB          
      2.16815677E-02    3      1000022         1        -1             # GLSS   -->  Z1SS   DN     DB          
      2.16815639E-02    3      1000022         3        -3             # GLSS   -->  Z1SS   ST     SB          
      3.63102257E-02    3      1000022         4        -4             # GLSS   -->  Z1SS   CH     CB          
      4.16577198E-02    3      1000022         5        -5             # GLSS   -->  Z1SS   BT     BB          
      5.45475027E-03    2      1000023        21                       # GLSS   -->  Z2SS   GL                 
      6.52908385E-02    3      1000023         2        -2             # GLSS   -->  Z2SS   UP     UB          
      4.81750891E-02    3      1000023         1        -1             # GLSS   -->  Z2SS   DN     DB          
      4.81750891E-02    3      1000023         3        -3             # GLSS   -->  Z2SS   ST     SB          
      6.52899295E-02    3      1000023         4        -4             # GLSS   -->  Z2SS   CH     CB          
      1.23045340E-01    3      1000023         5        -5             # GLSS   -->  Z2SS   BT     BB          
#         PDG         Width
DECAY   1000002  2.60633526E+01   # UPL   decays
#          BR          NDA       ID1       ID2       ID3       ID4
      4.95276414E-04    2      1000022         2                       # UPL    -->  Z1SS   UP                 
      8.45525116E-02    2      1000023         2                       # UPL    -->  Z2SS   UP                 
      2.86273804E-04    2      1000025         2                       # UPL    -->  Z3SS   UP                 
      2.30306620E-03    2      1000035         2                       # UPL    -->  Z4SS   UP                 
      7.39403605E-01    2      1000021         2                       # UPL    -->  GLSS   UP                 
      1.70239046E-01    2      1000024         1                       # UPL    -->  W1SS+  DN                 
      2.72019650E-03    2      1000037         1                       # UPL    -->  W2SS+  DN                 
#         PDG         Width
DECAY   1000001  2.62386894E+01   # DNL   decays
#          BR          NDA       ID1       ID2       ID3       ID4
      1.59063693E-02    2      1000022         1                       # DNL    -->  Z1SS   DN                 
      6.70162961E-02    2      1000023         1                       # DNL    -->  Z2SS   DN                 
      4.56513779E-04    2      1000025         1                       # DNL    -->  Z3SS   DN                 
      3.32475151E-03    2      1000035         1                       # DNL    -->  Z4SS   DN                 
      7.49065161E-01    2      1000021         1                       # DNL    -->  GLSS   DN                 
      1.54235125E-01    2     -1000024         2                       # DNL    -->  W1SS-  UP                 
      9.99576692E-03    2     -1000037         2                       # DNL    -->  W2SS-  UP                 
#         PDG         Width
DECAY   1000003  2.62386341E+01   # STL   decays
#          BR          NDA       ID1       ID2       ID3       ID4
      1.59064028E-02    2      1000022         3                       # STL    -->  Z1SS   ST                 
      6.70164376E-02    2      1000023         3                       # STL    -->  Z2SS   ST                 
      4.56514739E-04    2      1000025         3                       # STL    -->  Z3SS   ST                 
      3.32475849E-03    2      1000035         3                       # STL    -->  Z4SS   ST                 
      7.49066710E-01    2      1000021         3                       # STL    -->  GLSS   ST                 
      1.54233649E-01    2     -1000024         4                       # STL    -->  W1SS-  CH                 
      9.99552291E-03    2     -1000037         4                       # STL    -->  W2SS-  CH                 
#         PDG         Width
DECAY   1000004  2.60630627E+01   # CHL   decays
#          BR          NDA       ID1       ID2       ID3       ID4
      4.95277578E-04    2      1000022         4                       # CHL    -->  Z1SS   CH                 
      8.45527127E-02    2      1000023         4                       # CHL    -->  Z2SS   CH                 
      2.86272494E-04    2      1000025         4                       # CHL    -->  Z3SS   CH                 
      2.30305013E-03    2      1000035         4                       # CHL    -->  Z4SS   CH                 
      7.39400923E-01    2      1000021         4                       # CHL    -->  GLSS   CH                 
      1.70241490E-01    2      1000024         3                       # CHL    -->  W1SS+  ST                 
      2.72025261E-03    2      1000037         3                       # CHL    -->  W2SS+  ST                 
#         PDG         Width
DECAY   1000005  1.55547276E+01   # BT1   decays
#          BR          NDA       ID1       ID2       ID3       ID4
      2.19823923E-02    2      1000022         5                       # BT1    -->  Z1SS   BT                 
      9.11768228E-02    2      1000023         5                       # BT1    -->  Z2SS   BT                 
      5.30012127E-04    2      1000025         5                       # BT1    -->  Z3SS   BT                 
      2.56122323E-03    2      1000035         5                       # BT1    -->  Z4SS   BT                 
      7.02964187E-01    2      1000021         5                       # BT1    -->  GLSS   BT                 
      1.55596390E-01    2     -1000024         6                       # BT1    -->  W1SS-  TP                 
      2.51889434E-02    2          -24   1000006                       # BT1    -->  W-     TP1                
#         PDG         Width
DECAY   1000006  1.40134430E+00   # TP1   decays
#          BR          NDA       ID1       ID2       ID3       ID4
      2.49446139E-01    2      1000022         6                       # TP1    -->  Z1SS   TP                 
      1.48672774E-01    2      1000023         6                       # TP1    -->  Z2SS   TP                 
      6.01881146E-01    2      1000024         5                       # TP1    -->  W1SS+  BT                 
#         PDG         Width
DECAY   2000002  2.05580902E+01   # UPR   decays
#          BR          NDA       ID1       ID2       ID3       ID4
      5.46506904E-02    2      1000022         2                       # UPR    -->  Z1SS   UP                 
      5.25087211E-03    2      1000023         2                       # UPR    -->  Z2SS   UP                 
      9.29184389E-05    2      1000025         2                       # UPR    -->  Z3SS   UP                 
      4.21975739E-04    2      1000035         2                       # UPR    -->  Z4SS   UP                 
      9.39583600E-01    2      1000021         2                       # UPR    -->  GLSS   UP                 
#         PDG         Width
DECAY   2000001  1.97406006E+01   # DNR   decays
#          BR          NDA       ID1       ID2       ID3       ID4
      1.42637845E-02    2      1000022         1                       # DNR    -->  Z1SS   DN                 
      1.37060427E-03    2      1000023         1                       # DNR    -->  Z2SS   DN                 
      2.43563409E-05    2      1000025         1                       # DNR    -->  Z3SS   DN                 
      1.10725116E-04    2      1000035         1                       # DNR    -->  Z4SS   DN                 
      9.84230578E-01    2      1000021         1                       # DNR    -->  GLSS   DN                 
#         PDG         Width
DECAY   2000003  1.97406063E+01   # STR   decays
#          BR          NDA       ID1       ID2       ID3       ID4
      1.42637827E-02    2      1000022         3                       # STR    -->  Z1SS   ST                 
      1.37060392E-03    2      1000023         3                       # STR    -->  Z2SS   ST                 
      2.43563409E-05    2      1000025         3                       # STR    -->  Z3SS   ST                 
      1.10725123E-04    2      1000035         3                       # STR    -->  Z4SS   ST                 
      9.84230578E-01    2      1000021         3                       # STR    -->  GLSS   ST                 
#         PDG         Width
DECAY   2000004  2.05577927E+01   # CHR   decays
#          BR          NDA       ID1       ID2       ID3       ID4
      5.46510071E-02    2      1000022         4                       # CHR    -->  Z1SS   CH                 
      5.25090192E-03    2      1000023         4                       # CHR    -->  Z2SS   CH                 
      9.29182861E-05    2      1000025         4                       # CHR    -->  Z3SS   CH                 
      4.21974022E-04    2      1000035         4                       # CHR    -->  Z4SS   CH                 
      9.39583182E-01    2      1000021         4                       # CHR    -->  GLSS   CH                 
#         PDG         Width
DECAY   2000005  1.95663166E+01   # BT2   decays
#          BR          NDA       ID1       ID2       ID3       ID4
      1.42741818E-02    2      1000022         5                       # BT2    -->  Z1SS   BT                 
      1.39484531E-03    2      1000023         5                       # BT2    -->  Z2SS   BT                 
      3.28954076E-04    2      1000025         5                       # BT2    -->  Z3SS   BT                 
      4.06617502E-04    2      1000035         5                       # BT2    -->  Z4SS   BT                 
      9.82633531E-01    2      1000021         5                       # BT2    -->  GLSS   BT                 
      1.36744629E-05    2     -1000024         6                       # BT2    -->  W1SS-  TP                 
      6.76013296E-04    2     -1000037         6                       # BT2    -->  W2SS-  TP                 
      1.27140025E-04    2          -24   1000006                       # BT2    -->  W-     TP1                
      4.82092901E-06    2           23   1000005                       # BT2    -->  Z0     BT1                
      1.40186123E-04    2           25   1000005                       # BT2    -->  HL0    BT1                
#         PDG         Width
DECAY   2000006  8.45231819E+00   # TP2   decays
#          BR          NDA       ID1       ID2       ID3       ID4
      3.39002073E-01    2      1000021         6                       # TP2    -->  GLSS   TP                 
      3.38210762E-01    2      1000024         5                       # TP2    -->  W1SS+  BT                 
      6.06873669E-02    2      1000037         5                       # TP2    -->  W2SS+  BT                 
      4.30506356E-02    2           23   1000006                       # TP2    -->  Z0     TP1                
      5.73912375E-02    2           25   1000006                       # TP2    -->  HL0    TP1                
      7.35224166E-04    2      1000022         6                       # TP2    -->  Z1SS   TP                 
      1.37796491E-01    2      1000023         6                       # TP2    -->  Z2SS   TP                 
      2.31261812E-02    2      1000025         6                       # TP2    -->  Z3SS   TP                 
#         PDG         Width
DECAY   1000011  6.67689848E+00   # EL-   decays
#          BR          NDA       ID1       ID2       ID3       ID4
      2.42449101E-02    2      1000022        11                       # EL-    -->  Z1SS   E-                 
      3.79563093E-01    2      1000023        11                       # EL-    -->  Z2SS   E-                 
      5.12504485E-04    2      1000025        11                       # EL-    -->  Z3SS   E-                 
      4.69100242E-03    2      1000035        11                       # EL-    -->  Z4SS   E-                 
      5.60390115E-01    2     -1000024        12                       # EL-    -->  W1SS-  NUE                
      3.05983424E-02    2     -1000037        12                       # EL-    -->  W2SS-  NUE                
#         PDG         Width
DECAY   1000013  6.67689848E+00   # MUL-  decays
#          BR          NDA       ID1       ID2       ID3       ID4
      2.42449082E-02    2      1000022        13                       # MUL-   -->  Z1SS   MU-                
      3.79563093E-01    2      1000023        13                       # MUL-   -->  Z2SS   MU-                
      5.12504310E-04    2      1000025        13                       # MUL-   -->  Z3SS   MU-                
      4.69100196E-03    2      1000035        13                       # MUL-   -->  Z4SS   MU-                
      5.60390115E-01    2     -1000024        14                       # MUL-   -->  W1SS-  NUM                
      3.05983424E-02    2     -1000037        14                       # MUL-   -->  W2SS-  NUM                
#         PDG         Width
DECAY   1000015  3.48585677E+00   # TAU1- decays
#          BR          NDA       ID1       ID2       ID3       ID4
      5.49243629E-01    2      1000022        15                       # TAU1-  -->  Z1SS   TAU-               
      2.05320701E-01    2      1000023        15                       # TAU1-  -->  Z2SS   TAU-               
      3.44228378E-04    2      1000025        15                       # TAU1-  -->  Z3SS   TAU-               
      2.90656392E-03    2      1000035        15                       # TAU1-  -->  Z4SS   TAU-               
      2.35650972E-01    2     -1000024        16                       # TAU1-  -->  W1SS-  NUT                
      6.53391518E-03    2     -1000037        16                       # TAU1-  -->  W2SS-  NUT                
#         PDG         Width
DECAY   1000012  6.75956821E+00   # NUEL  decays
#          BR          NDA       ID1       ID2       ID3       ID4
      1.88483313E-01    2      1000022        12                       # NUEL   -->  Z1SS   NUE                
      1.82487547E-01    2      1000023        12                       # NUEL   -->  Z2SS   NUE                
      1.99144497E-03    2      1000025        12                       # NUEL   -->  Z3SS   NUE                
      1.29545489E-02    2      1000035        12                       # NUEL   -->  Z4SS   NUE                
      6.05991781E-01    2      1000024        11                       # NUEL   -->  W1SS+  E-                 
      8.09137244E-03    2      1000037        11                       # NUEL   -->  W2SS+  E-                 
#         PDG         Width
DECAY   1000014  6.75956726E+00   # NUML  decays
#          BR          NDA       ID1       ID2       ID3       ID4
      1.88483328E-01    2      1000022        14                       # NUML   -->  Z1SS   NUM                
      1.82487562E-01    2      1000023        14                       # NUML   -->  Z2SS   NUM                
      1.99144520E-03    2      1000025        14                       # NUML   -->  Z3SS   NUM                
      1.29545508E-02    2      1000035        14                       # NUML   -->  Z4SS   NUM                
      6.05991721E-01    2      1000024        13                       # NUML   -->  W1SS+  MU-                
      8.09137244E-03    2      1000037        13                       # NUML   -->  W2SS+  MU-                
#         PDG         Width
DECAY   1000016  6.76086950E+00   # NUTL  decays
#          BR          NDA       ID1       ID2       ID3       ID4
      1.88363329E-01    2      1000022        16                       # NUTL   -->  Z1SS   NUT                
      1.82367727E-01    2      1000023        16                       # NUTL   -->  Z2SS   NUT                
      1.98823889E-03    2      1000025        16                       # NUTL   -->  Z3SS   NUT                
      1.29303653E-02    2      1000035        16                       # NUTL   -->  Z4SS   NUT                
      6.05758846E-01    2      1000024        15                       # NUTL   -->  W1SS+  TAU-               
      8.59149918E-03    2      1000037        15                       # NUTL   -->  W2SS+  TAU-               
#         PDG         Width
DECAY   2000011  2.59504461E+00   # ER-   decays
#          BR          NDA       ID1       ID2       ID3       ID4
      9.06006694E-01    2      1000022        11                       # ER-    -->  Z1SS   E-                 
      8.67880210E-02    2      1000023        11                       # ER-    -->  Z2SS   E-                 
      1.33830518E-03    2      1000025        11                       # ER-    -->  Z3SS   E-                 
      5.86700020E-03    2      1000035        11                       # ER-    -->  Z4SS   E-                 
#         PDG         Width
DECAY   2000013  2.59504461E+00   # MUR-  decays
#          BR          NDA       ID1       ID2       ID3       ID4
      9.06006694E-01    2      1000022        13                       # MUR-   -->  Z1SS   MU-                
      8.67880061E-02    2      1000023        13                       # MUR-   -->  Z2SS   MU-                
      1.33830507E-03    2      1000025        13                       # MUR-   -->  Z3SS   MU-                
      5.86699881E-03    2      1000035        13                       # MUR-   -->  Z4SS   MU-                
#         PDG         Width
DECAY   2000015  5.79227686E+00   # TAU2- decays
#          BR          NDA       ID1       ID2       ID3       ID4
      1.02919571E-01    2      1000022        15                       # TAU2-  -->  Z1SS   TAU-               
      3.52621347E-01    2      1000023        15                       # TAU2-  -->  Z2SS   TAU-               
      1.73184706E-03    2      1000025        15                       # TAU2-  -->  Z3SS   TAU-               
      6.91050524E-03    2      1000035        15                       # TAU2-  -->  Z4SS   TAU-               
      5.03873527E-01    2     -1000024        16                       # TAU2-  -->  W1SS-  NUT                
      3.19431424E-02    2     -1000037        16                       # TAU2-  -->  W2SS-  NUT                
#         PDG         Width
DECAY   1000023  4.48204780E-08   # Z2SS  decays
#          BR          NDA       ID1       ID2       ID3       ID4
      1.20780920E-03    2      1000022        22                       # Z2SS   -->  Z1SS   GM                 
      2.31168163E-03    3     -1000024         2        -1             # Z2SS   -->  W1SS-  UP     DB          
      7.70560582E-04    3     -1000024        12       -11             # Z2SS   -->  W1SS-  NUE    E+          
      7.70560582E-04    3     -1000024        14       -13             # Z2SS   -->  W1SS-  NUM    MU+         
      2.31168163E-03    3      1000024         1        -2             # Z2SS   -->  W1SS+  DN     UB          
      7.70560582E-04    3      1000024        11       -12             # Z2SS   -->  W1SS+  E-     ANUE        
      7.70560582E-04    3      1000024        13       -14             # Z2SS   -->  W1SS+  MU-    ANUM        
      1.13466166E-01    3      1000022         2        -2             # Z2SS   -->  Z1SS   UP     UB          
      2.25389212E-01    3      1000022         1        -1             # Z2SS   -->  Z1SS   DN     DB          
      2.25389212E-01    3      1000022         3        -3             # Z2SS   -->  Z1SS   ST     SB          
      1.13466151E-01    3      1000022         4        -4             # Z2SS   -->  Z1SS   CH     CB          
      2.13442147E-01    3      1000022         5        -5             # Z2SS   -->  Z1SS   BT     BB          
      1.05942702E-02    3      1000022        11       -11             # Z2SS   -->  Z1SS   E-     E+          
      1.05942702E-02    3      1000022        13       -13             # Z2SS   -->  Z1SS   MU-    MU+         
      1.10529149E-02    3      1000022        15       -15             # Z2SS   -->  Z1SS   TAU-   TAU+        
      2.25734133E-02    3      1000022        12       -12             # Z2SS   -->  Z1SS   NUE    ANUE        
      2.25734133E-02    3      1000022        14       -14             # Z2SS   -->  Z1SS   NUM    ANUM        
      2.25454345E-02    3      1000022        16       -16             # Z2SS   -->  Z1SS   NUT    ANUT        
#         PDG         Width
DECAY   1000025  2.17086101E+00   # Z3SS  decays
#          BR          NDA       ID1       ID2       ID3       ID4
      5.64827246E-07    2      1000022        22                       # Z3SS   -->  Z1SS   GM                 
      7.98448809E-08    2      1000023        22                       # Z3SS   -->  Z2SS   GM                 
      3.11900467E-01    2      1000024       -24                       # Z3SS   -->  W1SS+  W-                 
      3.11900467E-01    2     -1000024        24                       # Z3SS   -->  W1SS-  W+                 
      1.59089237E-01    2      1000022        23                       # Z3SS   -->  Z1SS   Z0                 
      1.73551455E-01    2      1000023        23                       # Z3SS   -->  Z2SS   Z0                 
      1.65049237E-08    3      1000022         2        -2             # Z3SS   -->  Z1SS   UP     UB          
      3.55542618E-08    3      1000022         1        -1             # Z3SS   -->  Z1SS   DN     DB          
      3.55542618E-08    3      1000022         3        -3             # Z3SS   -->  Z1SS   ST     SB          
      1.65046981E-08    3      1000022         4        -4             # Z3SS   -->  Z1SS   CH     CB          
      1.93431745E-07    3      1000022         5        -5             # Z3SS   -->  Z1SS   BT     BB          
      3.99072313E-08    3      1000022        11       -11             # Z3SS   -->  Z1SS   E-     E+          
      3.99072313E-08    3      1000022        13       -13             # Z3SS   -->  Z1SS   MU-    MU+         
      8.51624051E-08    3      1000022        15       -15             # Z3SS   -->  Z1SS   TAU-   TAU+        
      8.26476523E-08    3      1000022        12       -12             # Z3SS   -->  Z1SS   NUE    ANUE        
      8.26476523E-08    3      1000022        14       -14             # Z3SS   -->  Z1SS   NUM    ANUM        
      8.28233624E-08    3      1000022        16       -16             # Z3SS   -->  Z1SS   NUT    ANUT        
      8.89145326E-08    3      1000023         2        -2             # Z3SS   -->  Z2SS   UP     UB          
      1.04868860E-07    3      1000023         1        -1             # Z3SS   -->  Z2SS   DN     DB          
      1.04868860E-07    3      1000023         3        -3             # Z3SS   -->  Z2SS   ST     SB          
      8.89132608E-08    3      1000023         4        -4             # Z3SS   -->  Z2SS   CH     CB          
      5.31679575E-07    3      1000023         5        -5             # Z3SS   -->  Z2SS   BT     BB          
      3.04034344E-08    3      1000023        11       -11             # Z3SS   -->  Z2SS   E-     E+          
      3.04034344E-08    3      1000023        13       -13             # Z3SS   -->  Z2SS   MU-    MU+         
      6.93906941E-08    3      1000023        15       -15             # Z3SS   -->  Z2SS   TAU-   TAU+        
      5.81429944E-08    3      1000023        12       -12             # Z3SS   -->  Z2SS   NUE    ANUE        
      5.81429944E-08    3      1000023        14       -14             # Z3SS   -->  Z2SS   NUM    ANUM        
      5.82688031E-08    3      1000023        16       -16             # Z3SS   -->  Z2SS   NUT    ANUT        
      2.50460487E-02    2      1000022        25                       # Z3SS   -->  Z1SS   HL0                
      1.85097549E-02    2      1000023        25                       # Z3SS   -->  Z2SS   HL0                
#         PDG         Width
DECAY   1000035  2.25341702E+00   # Z4SS  decays
#          BR          NDA       ID1       ID2       ID3       ID4
      9.01784517E-07    2      1000022        22                       # Z4SS   -->  Z1SS   GM                 
      1.00528382E-06    2      1000023        22                       # Z4SS   -->  Z2SS   GM                 
      3.17822435E-09    2      1000025        22                       # Z4SS   -->  Z3SS   GM                 
      3.46834898E-01    2      1000024       -24                       # Z4SS   -->  W1SS+  W-                 
      3.46834898E-01    2     -1000024        24                       # Z4SS   -->  W1SS-  W+                 
      1.17520244E-10    3     -1000037         2        -1             # Z4SS   -->  W2SS-  UP     DB          
      3.91734110E-11    3     -1000037        12       -11             # Z4SS   -->  W2SS-  NUE    E+          
      3.91734110E-11    3     -1000037        14       -13             # Z4SS   -->  W2SS-  NUM    MU+         
      1.17520244E-10    3      1000037         1        -2             # Z4SS   -->  W2SS+  DN     UB          
      3.91734110E-11    3      1000037        11       -12             # Z4SS   -->  W2SS+  E-     ANUE        
      3.91734110E-11    3      1000037        13       -14             # Z4SS   -->  W2SS+  MU-    ANUM        
      1.17520244E-10    3     -1000037         4        -3             # Z4SS   -->  W2SS-  CH     SB          
      3.91734110E-11    3     -1000037        16       -15             # Z4SS   -->  W2SS-  NUT    TAU+        
      1.17520244E-10    3      1000037         3        -4             # Z4SS   -->  W2SS+  ST     CB          
      3.91734110E-11    3      1000037        15       -16             # Z4SS   -->  W2SS+  TAU-   ANUT        
      2.76885759E-02    2      1000022        23                       # Z4SS   -->  Z1SS   Z0                 
      2.13344712E-02    2      1000023        23                       # Z4SS   -->  Z2SS   Z0                 
      1.81876928E-07    3      1000022         2        -2             # Z4SS   -->  Z1SS   UP     UB          
      5.99705402E-07    3      1000022         1        -1             # Z4SS   -->  Z1SS   DN     DB          
      5.99705402E-07    3      1000022         3        -3             # Z4SS   -->  Z1SS   ST     SB          
      1.81874370E-07    3      1000022         4        -4             # Z4SS   -->  Z1SS   CH     CB          
      1.71631461E-06    3      1000022         5        -5             # Z4SS   -->  Z1SS   BT     BB          
      4.55567942E-07    3      1000022        11       -11             # Z4SS   -->  Z1SS   E-     E+          
      4.55567942E-07    3      1000022        13       -13             # Z4SS   -->  Z1SS   MU-    MU+         
      5.08261394E-07    3      1000022        15       -15             # Z4SS   -->  Z1SS   TAU-   TAU+        
      1.31747288E-06    3      1000022        12       -12             # Z4SS   -->  Z1SS   NUE    ANUE        
      1.31747288E-06    3      1000022        14       -14             # Z4SS   -->  Z1SS   NUM    ANUM        
      1.32031278E-06    3      1000022        16       -16             # Z4SS   -->  Z1SS   NUT    ANUT        
      2.15531736E-06    3      1000023         2        -2             # Z4SS   -->  Z2SS   UP     UB          
      2.30489491E-06    3      1000023         1        -1             # Z4SS   -->  Z2SS   DN     DB          
      2.30489491E-06    3      1000023         3        -3             # Z4SS   -->  Z2SS   ST     SB          
      2.15528576E-06    3      1000023         4        -4             # Z4SS   -->  Z2SS   CH     CB          
      6.64050731E-06    3      1000023         5        -5             # Z4SS   -->  Z2SS   BT     BB          
      8.32844023E-07    3      1000023        11       -11             # Z4SS   -->  Z2SS   E-     E+          
      8.32844023E-07    3      1000023        13       -13             # Z4SS   -->  Z2SS   MU-    MU+         
      8.79901336E-07    3      1000023        15       -15             # Z4SS   -->  Z2SS   TAU-   TAU+        
      1.19151332E-06    3      1000023        12       -12             # Z4SS   -->  Z2SS   NUE    ANUE        
      1.19151332E-06    3      1000023        14       -14             # Z4SS   -->  Z2SS   NUM    ANUM        
      1.19410220E-06    3      1000023        16       -16             # Z4SS   -->  Z2SS   NUT    ANUT        
      3.05806878E-07    3      1000025         2        -2             # Z4SS   -->  Z3SS   UP     UB          
      3.95842534E-07    3      1000025         1        -1             # Z4SS   -->  Z3SS   DN     DB          
      3.95842534E-07    3      1000025         3        -3             # Z4SS   -->  Z3SS   ST     SB          
      3.05806878E-07    3      1000025         4        -4             # Z4SS   -->  Z3SS   CH     CB          
      2.33600545E-07    3      1000025         5        -5             # Z4SS   -->  Z3SS   BT     BB          
      8.97526604E-08    3      1000025        11       -11             # Z4SS   -->  Z3SS   E-     E+          
      8.97526604E-08    3      1000025        13       -13             # Z4SS   -->  Z3SS   MU-    MU+         
      8.25738979E-08    3      1000025        15       -15             # Z4SS   -->  Z3SS   TAU-   TAU+        
      1.77688733E-07    3      1000025        12       -12             # Z4SS   -->  Z3SS   NUE    ANUE        
      1.77688733E-07    3      1000025        14       -14             # Z4SS   -->  Z3SS   NUM    ANUM        
      1.77687866E-07    3      1000025        16       -16             # Z4SS   -->  Z3SS   NUT    ANUT        
      1.22483909E-01    2      1000022        25                       # Z4SS   -->  Z1SS   HL0                
      1.34788528E-01    2      1000023        25                       # Z4SS   -->  Z2SS   HL0                
#         PDG         Width
DECAY   1000024  3.68303040E-06   # W1SS+ decays
#          BR          NDA       ID1       ID2       ID3       ID4
      3.33501607E-01    3      1000022         2        -1             # W1SS+  -->  Z1SS   UP     DB          
      3.33501577E-01    3      1000022         4        -3             # W1SS+  -->  Z1SS   CH     SB          
      1.10997863E-01    3      1000022       -11        12             # W1SS+  -->  Z1SS   E+     NUE         
      1.10997863E-01    3      1000022       -13        14             # W1SS+  -->  Z1SS   MU+    NUM         
      1.11001067E-01    3      1000022       -15        16             # W1SS+  -->  Z1SS   TAU+   NUT         
#         PDG         Width
DECAY   1000037  2.21215630E+00   # W2SS+ decays
#          BR          NDA       ID1       ID2       ID3       ID4
      7.01223939E-07    3      1000022         2        -1             # W2SS+  -->  Z1SS   UP     DB          
      7.01223939E-07    3      1000022         4        -3             # W2SS+  -->  Z1SS   CH     SB          
      5.41416227E-07    3      1000022       -11        12             # W2SS+  -->  Z1SS   E+     NUE         
      5.41416227E-07    3      1000022       -13        14             # W2SS+  -->  Z1SS   MU+    NUM         
      6.12183499E-07    3      1000022       -15        16             # W2SS+  -->  Z1SS   TAU+   NUT         
      1.87455621E-02    2      1000022        24                       # W2SS+  -->  Z1SS   W+                 
      2.68239182E-06    3      1000023         2        -1             # W2SS+  -->  Z2SS   UP     DB          
      2.68238364E-06    3      1000023         4        -3             # W2SS+  -->  Z2SS   CH     SB          
      1.81562734E-06    3      1000023       -11        12             # W2SS+  -->  Z2SS   E+     NUE         
      1.81562734E-06    3      1000023       -13        14             # W2SS+  -->  Z2SS   MU+    NUM         
      1.84939154E-06    3      1000023       -15        16             # W2SS+  -->  Z2SS   TAU+   NUT         
      4.13460404E-01    2      1000023        24                       # W2SS+  -->  Z2SS   W+                 
      4.87604439E-07    3      1000025         2        -1             # W2SS+  -->  Z3SS   UP     DB          
      4.87604439E-07    3      1000025         4        -3             # W2SS+  -->  Z3SS   CH     SB          
      1.62420676E-07    3      1000025       -11        12             # W2SS+  -->  Z3SS   E+     NUE         
      1.62420676E-07    3      1000025       -13        14             # W2SS+  -->  Z3SS   MU+    NUM         
      1.62434347E-07    3      1000025       -15        16             # W2SS+  -->  Z3SS   TAU+   NUT         
      3.21113169E-01    2      1000024        23                       # W2SS+  -->  W1SS+  Z0                 
      1.91070740E-06    3      1000024         1        -1             # W2SS+  -->  W1SS+  DN     DB          
      1.91067920E-06    3      1000024         3        -3             # W2SS+  -->  W1SS+  ST     SB          
      5.98698171E-06    3      1000024         2        -2             # W2SS+  -->  W1SS+  UP     UB          
      5.98698171E-06    3      1000024         4        -4             # W2SS+  -->  W1SS+  CH     CB          
      2.86985392E-06    3      1000024        12       -12             # W2SS+  -->  W1SS+  NUE    ANUE        
      2.86985392E-06    3      1000024        14       -14             # W2SS+  -->  W1SS+  NUM    ANUM        
      2.97179849E-06    3      1000024        16       -16             # W2SS+  -->  W1SS+  NUT    ANUT        
      9.23436573E-07    3      1000024        11       -11             # W2SS+  -->  W1SS+  E-     E+          
      9.23436573E-07    3      1000024        13       -13             # W2SS+  -->  W1SS+  MU-    MU+         
      9.25455538E-07    3      1000024        15       -15             # W2SS+  -->  W1SS+  TAU-   TAU+        
      2.46638179E-01    2      1000024        25                       # W2SS+  -->  W1SS+  HL0                
#         PDG         Width
DECAY        25  6.22220710E-03   # HL0   decays
#          BR          NDA       ID1       ID2       ID3       ID4
      2.66192779E-09    2           11       -11                       # HL0    -->  E-     E+                 
      1.12390509E-04    2           13       -13                       # HL0    -->  MU-    MU+                
      3.21172960E-02    2           15       -15                       # HL0    -->  TAU-   TAU+               
      3.35308732E-06    2            1        -1                       # HL0    -->  DN     DB                 
      1.35481416E-03    2            3        -3                       # HL0    -->  ST     SB                 
      4.58857536E-01    2            5        -5                       # HL0    -->  BT     BB                 
      9.96077233E-07    2            2        -2                       # HL0    -->  UP     UB                 
      1.94428954E-02    2            4        -4                       # HL0    -->  CH     CB                 
      6.14631863E-04    2           22        22                       # HL0    -->  GM     GM                 
      1.25255045E-02    2           21        21                       # HL0    -->  GL     GL                 
      7.77993228E-06    3           24        11       -12             # HL0    -->  W+     E-     ANUE        
      7.77993228E-06    3           24        13       -14             # HL0    -->  W+     MU-    ANUM        
      7.77993228E-06    3           24        15       -16             # HL0    -->  W+     TAU-   ANUT        
      2.33397950E-05    3           24        -2         1             # HL0    -->  W+     UB     DN          
      2.33397950E-05    3           24        -4         3             # HL0    -->  W+     CB     ST          
      7.77993228E-06    3          -24       -11        12             # HL0    -->  W-     E+     NUE         
      7.77993228E-06    3          -24       -13        14             # HL0    -->  W-     MU+    NUM         
      7.77993228E-06    3          -24       -15        16             # HL0    -->  W-     TAU+   NUT         
      2.33397950E-05    3          -24         2        -1             # HL0    -->  W-     UP     DB          
      2.33397950E-05    3          -24         4        -3             # HL0    -->  W-     CH     SB          
      4.74830538E-01    2      1000022   1000022                       # HL0    -->  Z1SS   Z1SS               
#         PDG         Width
DECAY        35  8.00558567E+00   # HH0   decays
#          BR          NDA       ID1       ID2       ID3       ID4
      1.22092100E-10    2           11       -11                       # HH0    -->  E-     E+                 
      5.15494821E-06    2           13       -13                       # HH0    -->  MU-    MU+                
      1.47638901E-03    2           15       -15                       # HH0    -->  TAU-   TAU+               
      1.50143521E-07    2            1        -1                       # HH0    -->  DN     DB                 
      6.06655776E-05    2            3        -3                       # HH0    -->  ST     SB                 
      9.32807848E-03    2            5        -5                       # HH0    -->  BT     BB                 
      6.38829489E-10    2            2        -2                       # HH0    -->  UP     UB                 
      9.49542391E-06    2            4        -4                       # HH0    -->  CH     CB                 
      3.31723422E-01    2            6        -6                       # HH0    -->  TP     TB                 
      3.73172179E-06    2           22        22                       # HH0    -->  GM     GM                 
      4.03988932E-04    2           21        21                       # HH0    -->  GL     GL                 
      1.26408972E-03    2           24       -24                       # HH0    -->  W+     W-                 
      6.31804171E-04    2           23        23                       # HH0    -->  Z0     Z0                 
      9.77878273E-03    2      1000022   1000022                       # HH0    -->  Z1SS   Z1SS               
      1.96728315E-02    2      1000022   1000023                       # HH0    -->  Z1SS   Z2SS               
      9.19481292E-02    2      1000022   1000025                       # HH0    -->  Z1SS   Z3SS               
      1.05298255E-02    2      1000022   1000035                       # HH0    -->  Z1SS   Z4SS               
      9.83782858E-03    2      1000023   1000023                       # HH0    -->  Z2SS   Z2SS               
      9.37616974E-02    2      1000023   1000025                       # HH0    -->  Z2SS   Z3SS               
      9.23261605E-03    2      1000023   1000035                       # HH0    -->  Z2SS   Z4SS               
      1.34099653E-04    2      1000025   1000025                       # HH0    -->  Z3SS   Z3SS               
      4.81677055E-02    2      1000024  -1000024                       # HH0    -->  W1SS+  W1SS-              
      1.79023385E-01    2      1000024  -1000037                       # HH0    -->  W1SS+  W2SS-              
      1.79023385E-01    2     -1000024   1000037                       # HH0    -->  W1SS-  W2SS+              
      3.98267852E-03    2           25        25                       # HH0    -->  HL0    HL0                
#         PDG         Width
DECAY        36  8.36559868E+00   # HA0   decays
#          BR          NDA       ID1       ID2       ID3       ID4
      1.16530049E-10    2           11       -11                       # HA0    -->  E-     E+                 
      4.92010895E-06    2           13       -13                       # HA0    -->  MU-    MU+                
      1.40917278E-03    2           15       -15                       # HA0    -->  TAU-   TAU+               
      1.43316967E-07    2            1        -1                       # HA0    -->  DN     DB                 
      5.79073094E-05    2            3        -3                       # HA0    -->  ST     SB                 
      8.90498888E-03    2            5        -5                       # HA0    -->  BT     BB                 
      5.66132974E-10    2            2        -2                       # HA0    -->  UP     UB                 
      8.42568352E-06    2            4        -4                       # HA0    -->  CH     CB                 
      3.97391945E-01    2            6        -6                       # HA0    -->  TP     TB                 
      2.17505044E-06    2           22        22                       # HA0    -->  GM     GM                 
      3.77444725E-04    2           21        21                       # HA0    -->  GL     GL                 
      1.70874316E-02    2      1000022   1000022                       # HA0    -->  Z1SS   Z1SS               
      3.68972458E-02    2      1000022   1000023                       # HA0    -->  Z1SS   Z2SS               
      1.60291269E-02    2      1000022   1000025                       # HA0    -->  Z1SS   Z3SS               
      5.92042208E-02    2      1000022   1000035                       # HA0    -->  Z1SS   Z4SS               
      1.99206583E-02    2      1000023   1000023                       # HA0    -->  Z2SS   Z2SS               
      1.41659975E-02    2      1000023   1000025                       # HA0    -->  Z2SS   Z3SS               
      5.92604168E-02    2      1000023   1000035                       # HA0    -->  Z2SS   Z4SS               
      3.86032829E-04    2      1000025   1000025                       # HA0    -->  Z3SS   Z3SS               
      9.50818956E-02    2      1000024  -1000024                       # HA0    -->  W1SS+  W1SS-              
      1.36330962E-01    2      1000024  -1000037                       # HA0    -->  W1SS+  W2SS-              
      1.36330962E-01    2     -1000024   1000037                       # HA0    -->  W1SS-  W2SS+              
      1.14789978E-03    2           25        23                       # HA0    -->  HL0    Z0                 
#         PDG         Width
DECAY        37  8.25128841E+00   # H+    decays
#          BR          NDA       ID1       ID2       ID3       ID4
      1.19816518E-10    2           12       -11                       # H+     -->  NUE    E+                 
      5.05886965E-06    2           14       -13                       # H+     -->  NUM    MU+                
      1.44891581E-03    2           16       -15                       # H+     -->  NUT    TAU+               
      1.35449909E-07    2            2        -1                       # H+     -->  UP     DB                 
      6.24306849E-05    2            4        -3                       # H+     -->  CH     SB                 
      3.65934402E-01    2            6        -5                       # H+     -->  TP     BB                 
      3.79602201E-02    2      1000024   1000022                       # H+     -->  W1SS+  Z1SS               
      3.69169284E-03    2      1000024   1000023                       # H+     -->  W1SS+  Z2SS               
      1.79795414E-01    2      1000024   1000025                       # H+     -->  W1SS+  Z3SS               
      1.67204335E-01    2      1000024   1000035                       # H+     -->  W1SS+  Z4SS               
      5.17840590E-03    2      1000037   1000022                       # H+     -->  W2SS+  Z1SS               
      2.35057592E-01    2      1000037   1000023                       # H+     -->  W2SS+  Z2SS               
      2.44148192E-03    2      1000037   1000025                       # H+     -->  W2SS+  Z3SS               
      1.21992570E-03    2           25        24                       # H+     -->  HL0    W+                 
