#  ISAJET SUSY parameters in Les Houches accord format
#  Created by ISALHA3. Last revision by C. Balazs on 2005 Jan. 10
Block SPINFO   # Program information
     1   ISASUGRA from ISAJET          # Spectrum Calculator
     2   7.79   16-DEC-2008 15:42:00   # Version number
Block MODSEL   # Model selection
     1     1   # Minimal supergravity (mSUGRA,CMSSM) model         
Block SMINPUTS   # Standard Model inputs
     1     1.27839363E+02   # alpha_em^(-1)
     2     1.16570000E-05   # G_Fermi
     3     1.17200002E-01   # alpha_s(M_Z)
     4     9.11699982E+01   # m_{Z}(pole)
     5     4.19999981E+00   # m_{b}(m_{b})
     6     1.72500000E+02   # m_{top}(pole)
     7     1.77699995E+00   # m_{tau}(pole)
Block MINPAR   # SUSY breaking input parameters
     1     4.40000000E+02   # m_0
     2     1.75000000E+02   # m_{1/2}
     3     3.00000000E+00   # tan(beta)
     4     1.00000000E+00   # sign(mu)
     5     0.00000000E+00   # A_0
#  
#  M_{GUT} =   0.26084266E+17
Block MASS   # Scalar and gaugino mass spectrum
#  PDG code   mass                 particle
        24     8.04229965E+01   #  W^+
        25     9.45337830E+01   #  h^0            
        35     6.05638245E+02   #  H^0            
        36     5.99116333E+02   #  A^0            
        37     6.08195618E+02   #  H^+            
   1000001     5.91794128E+02   #  dnl            
   1000002     5.87367859E+02   #  upl            
   1000003     5.91794189E+02   #  stl            
   1000004     5.87369507E+02   #  chl            
   1000005     5.08688965E+02   #  b1             
   1000006     3.70584045E+02   #  t1             
   1000011     4.56080688E+02   #  el-            
   1000012     4.50179993E+02   #  nuel           
   1000013     4.56080719E+02   #  mul-           
   1000014     4.50179993E+02   #  numl           
   1000015     4.44856934E+02   #  tau1           
   1000016     4.50000549E+02   #  nutl           
   1000021     4.62618500E+02   #  glss           
   1000022     6.48766785E+01   #  z1ss           
   1000023     1.20690399E+02   #  z2ss           
   1000024     1.19223488E+02   #  w1ss           
   1000025    -3.46419830E+02   #  z3ss           
   1000035     3.71950623E+02   #  z4ss           
   1000037     3.67920990E+02   #  w2ss           
   2000001     5.82273682E+02   #  dnr            
   2000002     5.81676514E+02   #  upr            
   2000003     5.82273682E+02   #  str            
   2000004     5.81678162E+02   #  chr            
   2000005     5.80074951E+02   #  b2             
   2000006     5.54134644E+02   #  t2             
   2000011     4.45771515E+02   #  er-            
   2000013     4.45771515E+02   #  mur-           
   2000015     4.56325012E+02   #  tau2           
#  Higgs mixing
Block ALPHA   # Effective Higgs mixing parameter
         -3.34991395E-01   # alpha
Block STOPMIX   # stop mixing matrix
  1  1     4.31261271E-01   # O_{11}
  1  2    -9.02227104E-01   # O_{12}
  2  1     9.02227104E-01   # O_{21}
  2  2     4.31261271E-01   # O_{22}
Block SBOTMIX   # sbottom mixing matrix
  1  1     9.98865306E-01   # O_{11}
  1  2    -4.76244576E-02   # O_{12}
  2  1     4.76244576E-02   # O_{21}
  2  2     9.98865306E-01   # O_{22}
Block STAUMIX   # stau mixing matrix
  1  1     2.01768383E-01   # O_{11}
  1  2    -9.79433239E-01   # O_{12}
  2  1     9.79433239E-01   # O_{21}
  2  2     2.01768383E-01   # O_{22}
Block NMIX   # neutralino mixing matrix
  1  1     9.74507093E-01   #
  1  2    -1.34347990E-01   #
  1  3     1.61024958E-01   #
  1  4    -7.97349811E-02   #
  2  1    -1.80787936E-01   #
  2  2    -9.44034159E-01   #
  2  3     2.34519362E-01   #
  2  4    -1.45312950E-01   #
  3  1     4.70724590E-02   #
  3  2    -7.29160234E-02   #
  3  3    -6.97792232E-01   #
  3  4    -7.11022794E-01   #
  4  1     1.24241658E-01   #
  4  2    -2.92289883E-01   #
  4  3    -6.57387018E-01   #
  4  4     6.83354378E-01   #
Block UMIX   # chargino U mixing matrix
  1  1    -9.31585014E-01   # U_{11}
  1  2     3.63523483E-01   # U_{12}
  2  1    -3.63523483E-01   # U_{21}
  2  2    -9.31585014E-01   # U_{22}
Block VMIX   # chargino V mixing matrix
  1  1    -9.73513067E-01   # V_{11}
  1  2     2.28631362E-01   # V_{12}
  2  1    -2.28631362E-01   # V_{21}
  2  2    -9.73513067E-01   # V_{22}
Block GAUGE Q=  4.22606659E+02   #
     1     3.57522756E-01   # g`
     2     6.52357936E-01   # g_2
     3     1.21895730E+00   # g_3
Block YU Q=  4.22606659E+02   #
  3  3     9.29963291E-01   # y_t
Block YD Q=  4.22606659E+02   #
  3  3     4.47502322E-02   # y_b
Block YE Q=  4.22606659E+02   #
  3  3     3.17254923E-02   # y_tau
Block HMIX Q=  4.22606659E+02   # Higgs mixing parameters
     1     3.43351837E+02   # mu(Q)
     2     3.00000000E+00   # tan(beta)(M_{GUT})
     3     2.50237274E+02   # Higgs vev at Q
     4     3.58940375E+05   # m_A^2(Q)
Block MSOFT Q=  4.22606659E+02   # DRbar SUSY breaking parameters
     1     7.08768997E+01   # M_1(Q)          
     2     1.34259689E+02   # M_2(Q)          
     3     4.17874451E+02   # M_3(Q)          
    31     4.53075104E+02   # MeL(Q)          
    32     4.53075104E+02   # MmuL(Q)         
    33     4.52899323E+02   # MtauL(Q)        
    34     4.43745331E+02   # MeR(Q)          
    35     4.43745331E+02   # MmuR(Q)         
    36     4.43347290E+02   # MtauR(Q)        
    41     5.68086121E+02   # MqL1(Q)         
    42     5.68086121E+02   # MqL2(Q)         
    43     4.85855194E+02   # MqL3(Q)         
    44     5.61200134E+02   # MuR(Q)          
    45     5.61200134E+02   # McR(Q)          
    46     3.67591797E+02   # MtR(Q)          
    47     5.60430786E+02   # MdR(Q)          
    48     5.60430786E+02   # MsR(Q)          
    49     5.63410217E+02   # MbR(Q)          
Block AU Q=  4.22606659E+02   #
  1  1    -3.13241455E+02   # A_u
  2  2    -3.13241455E+02   # A_c
  3  3    -3.13241455E+02   # A_t
Block AD Q=  4.22606659E+02   #
  1  1    -5.02795074E+02   # A_d
  2  2    -5.02795074E+02   # A_s
  3  3    -5.02795074E+02   # A_b
Block AE Q=  4.22606659E+02   #
  1  1    -1.11044518E+02   # A_e
  2  2    -1.11044518E+02   # A_mu
  3  3    -1.11044518E+02   # A_tau
#  ISAJET decay tables in SUSY Les Houches accord format
#  Created by ISALHD. Last revision: C. Balazs, 2005 May 25
Block DCINFO                           # Program information
     1   ISASUGRA from ISAJET          # Spectrum Calculator
     2   7.79   16-DEC-2008 15:42:00   # Version number
#         PDG         Width
DECAY         6  1.14680767E+00   # TP    decays
#          BR          NDA       ID1       ID2       ID3       ID4
      3.33333343E-01    3            2        -1         5             # TP     -->  UP     DB     BT          
      3.33333343E-01    3            4        -3         5             # TP     -->  CH     SB     BT          
      1.11111112E-01    3          -11        12         5             # TP     -->  E+     NUE    BT          
      1.11111112E-01    3          -13        14         5             # TP     -->  MU+    NUM    BT          
      1.11111112E-01    3          -15        16         5             # TP     -->  TAU+   NUT    BT          
#         PDG         Width
DECAY   1000021  1.42952083E-02   # GLSS  decays
#          BR          NDA       ID1       ID2       ID3       ID4
      1.03863224E-01    3      1000024         1        -2             # GLSS   -->  W1SS+  DN     UB          
      1.03863224E-01    3     -1000024         2        -1             # GLSS   -->  W1SS-  UP     DB          
      1.03862286E-01    3      1000024         3        -4             # GLSS   -->  W1SS+  ST     CB          
      1.03862286E-01    3     -1000024         4        -3             # GLSS   -->  W1SS-  CH     SB          
      5.05225807E-02    3      1000024         5        -6             # GLSS   -->  W1SS+  BT     TB          
      5.05225807E-02    3     -1000024         6        -5             # GLSS   -->  W1SS-  TP     BB          
      1.20871409E-04    3      1000037         1        -2             # GLSS   -->  W2SS+  DN     UB          
      1.20871409E-04    3     -1000037         2        -1             # GLSS   -->  W2SS-  UP     DB          
      1.20870362E-04    3      1000037         3        -4             # GLSS   -->  W2SS+  ST     CB          
      1.20870362E-04    3     -1000037         4        -3             # GLSS   -->  W2SS-  CH     SB          
      6.88241853E-04    2      1000022        21                       # GLSS   -->  Z1SS   GL                 
      3.83712910E-02    3      1000022         2        -2             # GLSS   -->  Z1SS   UP     UB          
      1.61361825E-02    3      1000022         1        -1             # GLSS   -->  Z1SS   DN     DB          
      1.61361787E-02    3      1000022         3        -3             # GLSS   -->  Z1SS   ST     SB          
      3.83706503E-02    3      1000022         4        -4             # GLSS   -->  Z1SS   CH     CB          
      2.74912119E-02    3      1000022         5        -5             # GLSS   -->  Z1SS   BT     BB          
      3.69692571E-03    3      1000022         6        -6             # GLSS   -->  Z1SS   TP     TB          
      3.56212864E-03    2      1000023        21                       # GLSS   -->  Z2SS   GL                 
      5.64548075E-02    3      1000023         2        -2             # GLSS   -->  Z2SS   UP     UB          
      4.62890044E-02    3      1000023         1        -1             # GLSS   -->  Z2SS   DN     DB          
      4.62889746E-02    3      1000023         3        -3             # GLSS   -->  Z2SS   ST     SB          
      5.64538613E-02    3      1000023         4        -4             # GLSS   -->  Z2SS   CH     CB          
      1.26973853E-01    3      1000023         5        -5             # GLSS   -->  Z2SS   BT     BB          
      3.35331238E-03    2      1000025        21                       # GLSS   -->  Z3SS   GL                 
      3.20579306E-06    3      1000025         2        -2             # GLSS   -->  Z3SS   UP     UB          
      3.88883882E-06    3      1000025         1        -1             # GLSS   -->  Z3SS   DN     DB          
      3.88883609E-06    3      1000025         3        -3             # GLSS   -->  Z3SS   ST     SB          
      3.20571917E-06    3      1000025         4        -4             # GLSS   -->  Z3SS   CH     CB          
      5.24985880E-05    3      1000025         5        -5             # GLSS   -->  Z3SS   BT     BB          
      2.20688875E-03    2      1000035        21                       # GLSS   -->  Z4SS   GL                 
      4.78296424E-05    3      1000035         2        -2             # GLSS   -->  Z4SS   UP     UB          
      5.59982545E-05    3      1000035         1        -1             # GLSS   -->  Z4SS   DN     DB          
      5.59982109E-05    3      1000035         3        -3             # GLSS   -->  Z4SS   ST     SB          
      4.78285328E-05    3      1000035         4        -4             # GLSS   -->  Z4SS   CH     CB          
      2.72480742E-04    3      1000035         5        -5             # GLSS   -->  Z4SS   BT     BB          
#         PDG         Width
DECAY   1000002  1.21420021E+01   # UPL   decays
#          BR          NDA       ID1       ID2       ID3       ID4
      3.87962238E-04    2      1000022         2                       # UPL    -->  Z1SS   UP                 
      1.78357139E-01    2      1000023         2                       # UPL    -->  Z2SS   UP                 
      3.57971468E-04    2      1000025         2                       # UPL    -->  Z3SS   UP                 
      5.30744297E-03    2      1000035         2                       # UPL    -->  Z4SS   UP                 
      4.52915251E-01    2      1000021         2                       # UPL    -->  GLSS   UP                 
      3.54814261E-01    2      1000024         1                       # UPL    -->  W1SS+  DN                 
      7.85997324E-03    2      1000037         1                       # UPL    -->  W2SS+  DN                 
#         PDG         Width
DECAY   1000001  1.22710924E+01   # DNL   decays
#          BR          NDA       ID1       ID2       ID3       ID4
      1.93983894E-02    2      1000022         1                       # DNL    -->  Z1SS   DN                 
      1.54722780E-01    2      1000023         1                       # DNL    -->  Z2SS   DN                 
      5.83204033E-04    2      1000025         1                       # DNL    -->  Z3SS   DN                 
      7.37449480E-03    2      1000035         1                       # DNL    -->  Z4SS   DN                 
      4.73398894E-01    2      1000021         1                       # DNL    -->  GLSS   DN                 
      3.24329257E-01    2     -1000024         2                       # DNL    -->  W1SS-  UP                 
      2.01929845E-02    2     -1000037         2                       # DNL    -->  W2SS-  UP                 
#         PDG         Width
DECAY   1000003  1.22710466E+01   # STL   decays
#          BR          NDA       ID1       ID2       ID3       ID4
      1.93984658E-02    2      1000022         3                       # STL    -->  Z1SS   ST                 
      1.54723391E-01    2      1000023         3                       # STL    -->  Z2SS   ST                 
      5.83206478E-04    2      1000025         3                       # STL    -->  Z3SS   ST                 
      7.37452554E-03    2      1000035         3                       # STL    -->  Z4SS   ST                 
      4.73401040E-01    2      1000021         3                       # STL    -->  GLSS   ST                 
      3.24326843E-01    2     -1000024         4                       # STL    -->  W1SS-  CH                 
      2.01925095E-02    2     -1000037         4                       # STL    -->  W2SS-  CH                 
#         PDG         Width
DECAY   1000004  1.21417093E+01   # CHL   decays
#          BR          NDA       ID1       ID2       ID3       ID4
      3.87968583E-04    2      1000022         4                       # CHL    -->  Z1SS   CH                 
      1.78359956E-01    2      1000023         4                       # CHL    -->  Z2SS   CH                 
      3.57974350E-04    2      1000025         4                       # CHL    -->  Z3SS   CH                 
      5.30746905E-03    2      1000035         4                       # CHL    -->  Z4SS   CH                 
      4.52902436E-01    2      1000021         4                       # CHL    -->  GLSS   CH                 
      3.54824007E-01    2      1000024         3                       # CHL    -->  W1SS+  ST                 
      7.86024146E-03    2      1000037         3                       # CHL    -->  W2SS+  ST                 
#         PDG         Width
DECAY   1000005  6.20298624E+00   # BT1   decays
#          BR          NDA       ID1       ID2       ID3       ID4
      3.31244618E-02    2      1000022         5                       # BT1    -->  Z1SS   BT                 
      2.55140841E-01    2      1000023         5                       # BT1    -->  Z2SS   BT                 
      1.03875552E-03    2      1000025         5                       # BT1    -->  Z3SS   BT                 
      7.63549283E-03    2      1000035         5                       # BT1    -->  Z4SS   BT                 
      1.62352636E-01    2      1000021         5                       # BT1    -->  GLSS   BT                 
      4.00197834E-01    2     -1000024         6                       # BT1    -->  W1SS-  TP                 
      1.40509978E-01    2          -24   1000006                       # BT1    -->  W-     TP1                
#         PDG         Width
DECAY   1000006  1.98402071E+00   # TP1   decays
#          BR          NDA       ID1       ID2       ID3       ID4
      2.11123407E-01    2      1000022         6                       # TP1    -->  Z1SS   TP                 
      1.49533778E-01    2      1000023         6                       # TP1    -->  Z2SS   TP                 
      6.39342785E-01    2      1000024         5                       # TP1    -->  W1SS+  BT                 
#         PDG         Width
DECAY   2000002  6.37258863E+00   # UPR   decays
#          BR          NDA       ID1       ID2       ID3       ID4
      1.91108108E-01    2      1000022         2                       # UPR    -->  Z1SS   UP                 
      6.17587473E-03    2      1000023         2                       # UPR    -->  Z2SS   UP                 
      1.90396808E-04    2      1000025         2                       # UPR    -->  Z3SS   UP                 
      1.11288833E-03    2      1000035         2                       # UPR    -->  Z4SS   UP                 
      8.01412761E-01    2      1000021         2                       # UPR    -->  GLSS   UP                 
#         PDG         Width
DECAY   2000001  5.46461535E+00   # DNR   decays
#          BR          NDA       ID1       ID2       ID3       ID4
      5.57754971E-02    2      1000022         1                       # DNR    -->  Z1SS   DN                 
      1.80268765E-03    2      1000023         1                       # DNR    -->  Z2SS   DN                 
      5.56903251E-05    2      1000025         1                       # DNR    -->  Z3SS   DN                 
      3.25704983E-04    2      1000035         1                       # DNR    -->  Z4SS   DN                 
      9.42040443E-01    2      1000021         1                       # DNR    -->  GLSS   DN                 
#         PDG         Width
DECAY   2000003  5.46461535E+00   # STR   decays
#          BR          NDA       ID1       ID2       ID3       ID4
      5.57754971E-02    2      1000022         3                       # STR    -->  Z1SS   ST                 
      1.80268765E-03    2      1000023         3                       # STR    -->  Z2SS   ST                 
      5.56903251E-05    2      1000025         3                       # STR    -->  Z3SS   ST                 
      3.25704983E-04    2      1000035         3                       # STR    -->  Z4SS   ST                 
      9.42040443E-01    2      1000021         3                       # STR    -->  GLSS   ST                 
#         PDG         Width
DECAY   2000004  6.37228394E+00   # CHR   decays
#          BR          NDA       ID1       ID2       ID3       ID4
      1.91115692E-01    2      1000022         4                       # CHR    -->  Z1SS   CH                 
      6.17611827E-03    2      1000023         4                       # CHR    -->  Z2SS   CH                 
      1.90402701E-04    2      1000025         4                       # CHR    -->  Z3SS   CH                 
      1.11291907E-03    2      1000035         4                       # CHR    -->  Z4SS   CH                 
      8.01404893E-01    2      1000021         4                       # CHR    -->  GLSS   CH                 
#         PDG         Width
DECAY   2000005  5.32702971E+00   # BT2   decays
#          BR          NDA       ID1       ID2       ID3       ID4
      5.66097870E-02    2      1000022         5                       # BT2    -->  Z1SS   BT                 
      2.06587673E-03    2      1000023         5                       # BT2    -->  Z2SS   BT                 
      1.07403041E-03    2      1000025         5                       # BT2    -->  Z3SS   BT                 
      1.41122530E-03    2      1000035         5                       # BT2    -->  Z4SS   BT                 
      9.33816075E-01    2      1000021         5                       # BT2    -->  GLSS   BT                 
      3.53784504E-04    2     -1000024         6                       # BT2    -->  W1SS-  TP                 
      3.04487208E-03    2     -1000037         6                       # BT2    -->  W2SS-  TP                 
      1.62435684E-03    2          -24   1000006                       # BT2    -->  W-     TP1                
#         PDG         Width
DECAY   2000006  7.00332737E+00   # TP2   decays
#          BR          NDA       ID1       ID2       ID3       ID4
      3.31009060E-01    2      1000024         5                       # TP2    -->  W1SS+  BT                 
      1.34286001E-01    2      1000037         5                       # TP2    -->  W2SS+  BT                 
      1.31963313E-01    2           23   1000006                       # TP2    -->  Z0     TP1                
      8.97785351E-02    2           25   1000006                       # TP2    -->  HL0    TP1                
      9.40624904E-03    2      1000022         6                       # TP2    -->  Z1SS   TP                 
      1.43841043E-01    2      1000023         6                       # TP2    -->  Z2SS   TP                 
      4.80655059E-02    2      1000025         6                       # TP2    -->  Z3SS   TP                 
      1.11650273E-01    2      1000035         6                       # TP2    -->  Z4SS   TP                 
#         PDG         Width
DECAY   1000011  5.07008171E+00   # EL-   decays
#          BR          NDA       ID1       ID2       ID3       ID4
      5.85245751E-02    2      1000022        11                       # EL-    -->  Z1SS   E-                 
      3.56517464E-01    2      1000023        11                       # EL-    -->  Z2SS   E-                 
      1.49994259E-04    2      1000025        11                       # EL-    -->  Z3SS   E-                 
      2.13098177E-03    2      1000035        11                       # EL-    -->  Z4SS   E-                 
      5.70471227E-01    2     -1000024        12                       # EL-    -->  W1SS-  NUE                
      1.22057190E-02    2     -1000037        12                       # EL-    -->  W2SS-  NUE                
#         PDG         Width
DECAY   1000013  5.07008219E+00   # MUL-  decays
#          BR          NDA       ID1       ID2       ID3       ID4
      5.85245714E-02    2      1000022        13                       # MUL-   -->  Z1SS   MU-                
      3.56517464E-01    2      1000023        13                       # MUL-   -->  Z2SS   MU-                
      1.49994245E-04    2      1000025        13                       # MUL-   -->  Z3SS   MU-                
      2.13098130E-03    2      1000035        13                       # MUL-   -->  Z4SS   MU-                
      5.70471287E-01    2     -1000024        14                       # MUL-   -->  W1SS-  NUM                
      1.22057255E-02    2     -1000037        14                       # MUL-   -->  W2SS-  NUM                
#         PDG         Width
DECAY   1000015  2.27400160E+00   # TAU1- decays
#          BR          NDA       ID1       ID2       ID3       ID4
      8.76045823E-01    2      1000022        15                       # TAU1-  -->  Z1SS   TAU-               
      6.23016730E-02    2      1000023        15                       # TAU1-  -->  Z2SS   TAU-               
      3.93970578E-04    2      1000025        15                       # TAU1-  -->  Z3SS   TAU-               
      1.15482882E-03    2      1000035        15                       # TAU1-  -->  Z4SS   TAU-               
      5.99732772E-02    2     -1000024        16                       # TAU1-  -->  W1SS-  NUT                
      1.30440225E-04    2     -1000037        16                       # TAU1-  -->  W2SS-  NUT                
#         PDG         Width
DECAY   1000012  5.13555670E+00   # NUEL  decays
#          BR          NDA       ID1       ID2       ID3       ID4
      1.58809379E-01    2      1000022        12                       # NUEL   -->  Z1SS   NUE                
      2.26776436E-01    2      1000023        12                       # NUEL   -->  Z2SS   NUE                
      5.98985702E-04    2      1000025        12                       # NUEL   -->  Z3SS   NUE                
      4.83148079E-03    2      1000035        12                       # NUEL   -->  Z4SS   NUE                
      6.04730248E-01    2      1000024        11                       # NUEL   -->  W1SS+  E-                 
      4.25351877E-03    2      1000037        11                       # NUEL   -->  W2SS+  E-                 
#         PDG         Width
DECAY   1000014  5.13555670E+00   # NUML  decays
#          BR          NDA       ID1       ID2       ID3       ID4
      1.58809379E-01    2      1000022        14                       # NUML   -->  Z1SS   NUM                
      2.26776436E-01    2      1000023        14                       # NUML   -->  Z2SS   NUM                
      5.98985702E-04    2      1000025        14                       # NUML   -->  Z3SS   NUM                
      4.83148079E-03    2      1000035        14                       # NUML   -->  Z4SS   NUM                
      6.04730189E-01    2      1000024        13                       # NUML   -->  W1SS+  MU-                
      4.25351458E-03    2      1000037        13                       # NUML   -->  W2SS+  MU-                
#         PDG         Width
DECAY   1000016  5.13454390E+00   # NUTL  decays
#          BR          NDA       ID1       ID2       ID3       ID4
      1.58772007E-01    2      1000022        16                       # NUTL   -->  Z1SS   NUT                
      2.26702720E-01    2      1000023        16                       # NUTL   -->  Z2SS   NUT                
      5.97478647E-04    2      1000025        16                       # NUTL   -->  Z3SS   NUT                
      4.81394399E-03    2      1000035        16                       # NUTL   -->  Z4SS   NUT                
      6.04670167E-01    2      1000024        15                       # NUTL   -->  W1SS+  TAU-               
      4.44366224E-03    2      1000037        15                       # NUTL   -->  W2SS+  TAU-               
      8.09449816E-12    3      1000015        16       -15             # NUTL   -->  TAU1-  NUT    TAU+        
      8.09449816E-12    3      1000015        12       -11             # NUTL   -->  TAU1-  NUE    E+          
      8.09449816E-12    3      1000015        14       -13             # NUTL   -->  TAU1-  NUM    MU+         
      2.42834936E-11    3      1000015         2        -1             # NUTL   -->  TAU1-  UP     DB          
      2.42834936E-11    3      1000015         4        -3             # NUTL   -->  TAU1-  CH     SB          
#         PDG         Width
DECAY   2000011  2.13059258E+00   # ER-   decays
#          BR          NDA       ID1       ID2       ID3       ID4
      9.68244851E-01    2      1000022        11                       # ER-    -->  Z1SS   E-                 
      2.98693161E-02    2      1000023        11                       # ER-    -->  Z2SS   E-                 
      3.69918387E-04    2      1000025        11                       # ER-    -->  Z3SS   E-                 
      1.51588419E-03    2      1000035        11                       # ER-    -->  Z4SS   E-                 
#         PDG         Width
DECAY   2000013  2.13059235E+00   # MUR-  decays
#          BR          NDA       ID1       ID2       ID3       ID4
      9.68244851E-01    2      1000022        13                       # MUR-   -->  Z1SS   MU-                
      2.98693161E-02    2      1000023        13                       # MUR-   -->  Z2SS   MU-                
      3.69918154E-04    2      1000025        13                       # MUR-   -->  Z3SS   MU-                
      1.51588256E-03    2      1000035        13                       # MUR-   -->  Z4SS   MU-                
#         PDG         Width
DECAY   2000015  4.92610168E+00   # TAU2- decays
#          BR          NDA       ID1       ID2       ID3       ID4
      7.41621554E-02    2      1000022        15                       # TAU2-  -->  Z1SS   TAU-               
      3.50931048E-01    2      1000023        15                       # TAU2-  -->  Z2SS   TAU-               
      4.50491207E-04    2      1000025        15                       # TAU2-  -->  Z3SS   TAU-               
      2.55556591E-03    2      1000035        15                       # TAU2-  -->  Z4SS   TAU-               
      5.59153855E-01    2     -1000024        16                       # TAU2-  -->  W1SS-  NUT                
      1.27468631E-02    2     -1000037        16                       # TAU2-  -->  W2SS-  NUT                
#         PDG         Width
DECAY   1000023  7.65799712E-07   # Z2SS  decays
#          BR          NDA       ID1       ID2       ID3       ID4
      3.37008911E-04    2      1000022        22                       # Z2SS   -->  Z1SS   GM                 
      1.32824725E-05    3     -1000024         2        -1             # Z2SS   -->  W1SS-  UP     DB          
      4.42749069E-06    3     -1000024        12       -11             # Z2SS   -->  W1SS-  NUE    E+          
      4.42749069E-06    3     -1000024        14       -13             # Z2SS   -->  W1SS-  NUM    MU+         
      1.32824725E-05    3      1000024         1        -2             # Z2SS   -->  W1SS+  DN     UB          
      4.42749069E-06    3      1000024        11       -12             # Z2SS   -->  W1SS+  E-     ANUE        
      4.42749069E-06    3      1000024        13       -14             # Z2SS   -->  W1SS+  MU-    ANUM        
      1.35675624E-01    3      1000022         2        -2             # Z2SS   -->  Z1SS   UP     UB          
      2.17888147E-01    3      1000022         1        -1             # Z2SS   -->  Z1SS   DN     DB          
      2.17888132E-01    3      1000022         3        -3             # Z2SS   -->  Z1SS   ST     SB          
      1.35675520E-01    3      1000022         4        -4             # Z2SS   -->  Z1SS   CH     CB          
      2.34749511E-01    3      1000022         5        -5             # Z2SS   -->  Z1SS   BT     BB          
      5.51036978E-03    3      1000022        11       -11             # Z2SS   -->  Z1SS   E-     E+          
      5.51036885E-03    3      1000022        13       -13             # Z2SS   -->  Z1SS   MU-    MU+         
      7.06662657E-03    3      1000022        15       -15             # Z2SS   -->  Z1SS   TAU-   TAU+        
      1.32274749E-02    3      1000022        12       -12             # Z2SS   -->  Z1SS   NUE    ANUE        
      1.32274749E-02    3      1000022        14       -14             # Z2SS   -->  Z1SS   NUM    ANUM        
      1.31994477E-02    3      1000022        16       -16             # Z2SS   -->  Z1SS   NUT    ANUT        
#         PDG         Width
DECAY   1000025  2.43625450E+00   # Z3SS  decays
#          BR          NDA       ID1       ID2       ID3       ID4
      3.88450957E-07    2      1000022        22                       # Z3SS   -->  Z1SS   GM                 
      1.81280129E-07    2      1000023        22                       # Z3SS   -->  Z2SS   GM                 
      3.10829282E-01    2      1000024       -24                       # Z3SS   -->  W1SS+  W-                 
      3.10829282E-01    2     -1000024        24                       # Z3SS   -->  W1SS-  W+                 
      1.31023273E-01    2      1000022        23                       # Z3SS   -->  Z1SS   Z0                 
      2.19769001E-01    2      1000023        23                       # Z3SS   -->  Z2SS   Z0                 
      1.26742812E-08    3      1000022         2        -2             # Z3SS   -->  Z1SS   UP     UB          
      1.31156224E-08    3      1000022         1        -1             # Z3SS   -->  Z1SS   DN     DB          
      1.31156161E-08    3      1000022         3        -3             # Z3SS   -->  Z1SS   ST     SB          
      1.26741062E-08    3      1000022         4        -4             # Z3SS   -->  Z1SS   CH     CB          
      1.10451744E-07    3      1000022         5        -5             # Z3SS   -->  Z1SS   BT     BB          
      9.78721957E-08    3      1000022        11       -11             # Z3SS   -->  Z1SS   E-     E+          
      9.78721957E-08    3      1000022        13       -13             # Z3SS   -->  Z1SS   MU-    MU+         
      2.56585423E-07    3      1000022        15       -15             # Z3SS   -->  Z1SS   TAU-   TAU+        
      1.19360863E-07    3      1000022        12       -12             # Z3SS   -->  Z1SS   NUE    ANUE        
      1.19360863E-07    3      1000022        14       -14             # Z3SS   -->  Z1SS   NUM    ANUM        
      1.19649215E-07    3      1000022        16       -16             # Z3SS   -->  Z1SS   NUT    ANUT        
      3.75975198E-08    3      1000023         2        -2             # Z3SS   -->  Z2SS   UP     UB          
      5.03436510E-08    3      1000023         1        -1             # Z3SS   -->  Z2SS   DN     DB          
      5.03436226E-08    3      1000023         3        -3             # Z3SS   -->  Z2SS   ST     SB          
      3.75969869E-08    3      1000023         4        -4             # Z3SS   -->  Z2SS   CH     CB          
      2.90337994E-07    3      1000023         5        -5             # Z3SS   -->  Z2SS   BT     BB          
      3.25228733E-08    3      1000023        11       -11             # Z3SS   -->  Z2SS   E-     E+          
      3.25228626E-08    3      1000023        13       -13             # Z3SS   -->  Z2SS   MU-    MU+         
      1.01614937E-07    3      1000023        15       -15             # Z3SS   -->  Z2SS   TAU-   TAU+        
      9.71526575E-08    3      1000023        12       -12             # Z3SS   -->  Z2SS   NUE    ANUE        
      9.71526575E-08    3      1000023        14       -14             # Z3SS   -->  Z2SS   NUM    ANUM        
      9.74012835E-08    3      1000023        16       -16             # Z3SS   -->  Z2SS   NUT    ANUT        
      1.47989588E-02    2      1000022        25                       # Z3SS   -->  Z1SS   HL0                
      1.27477609E-02    2      1000023        25                       # Z3SS   -->  Z2SS   HL0                
#         PDG         Width
DECAY   1000035  2.58131266E+00   # Z4SS  decays
#          BR          NDA       ID1       ID2       ID3       ID4
      1.05994229E-06    2      1000022        22                       # Z4SS   -->  Z1SS   GM                 
      7.31830653E-07    2      1000023        22                       # Z4SS   -->  Z2SS   GM                 
      4.81255569E-09    2      1000025        22                       # Z4SS   -->  Z3SS   GM                 
      3.44965339E-01    2      1000024       -24                       # Z4SS   -->  W1SS+  W-                 
      3.44965339E-01    2     -1000024        24                       # Z4SS   -->  W1SS-  W+                 
      2.02998285E-10    3     -1000037         2        -1             # Z4SS   -->  W2SS-  UP     DB          
      6.76660949E-11    3     -1000037        12       -11             # Z4SS   -->  W2SS-  NUE    E+          
      6.76660949E-11    3     -1000037        14       -13             # Z4SS   -->  W2SS-  NUM    MU+         
      2.02998285E-10    3      1000037         1        -2             # Z4SS   -->  W2SS+  DN     UB          
      6.76660949E-11    3      1000037        11       -12             # Z4SS   -->  W2SS+  E-     ANUE        
      6.76660949E-11    3      1000037        13       -14             # Z4SS   -->  W2SS+  MU-    ANUM        
      2.02998285E-10    3     -1000037         4        -3             # Z4SS   -->  W2SS-  CH     SB          
      6.76660949E-11    3     -1000037        16       -15             # Z4SS   -->  W2SS-  NUT    TAU+        
      2.02998285E-10    3      1000037         3        -4             # Z4SS   -->  W2SS+  ST     CB          
      6.76660949E-11    3      1000037        15       -16             # Z4SS   -->  W2SS+  TAU-   ANUT        
      1.66087989E-02    2      1000022        23                       # Z4SS   -->  Z1SS   Z0                 
      1.58345606E-02    2      1000023        23                       # Z4SS   -->  Z2SS   Z0                 
      2.21130861E-07    3      1000022         2        -2             # Z4SS   -->  Z1SS   UP     UB          
      4.65803367E-07    3      1000022         1        -1             # Z4SS   -->  Z1SS   DN     DB          
      4.65803168E-07    3      1000022         3        -3             # Z4SS   -->  Z1SS   ST     SB          
      2.21127834E-07    3      1000022         4        -4             # Z4SS   -->  Z1SS   CH     CB          
      1.05902689E-06    3      1000022         5        -5             # Z4SS   -->  Z1SS   BT     BB          
      2.06859727E-06    3      1000022        11       -11             # Z4SS   -->  Z1SS   E-     E+          
      2.06859704E-06    3      1000022        13       -13             # Z4SS   -->  Z1SS   MU-    MU+         
      2.25017516E-06    3      1000022        15       -15             # Z4SS   -->  Z1SS   TAU-   TAU+        
      3.99330429E-06    3      1000022        12       -12             # Z4SS   -->  Z1SS   NUE    ANUE        
      3.99330429E-06    3      1000022        14       -14             # Z4SS   -->  Z1SS   NUM    ANUM        
      4.00330828E-06    3      1000022        16       -16             # Z4SS   -->  Z1SS   NUT    ANUT        
      2.27569649E-06    3      1000023         2        -2             # Z4SS   -->  Z2SS   UP     UB          
      2.59653325E-06    3      1000023         1        -1             # Z4SS   -->  Z2SS   DN     DB          
      2.59653211E-06    3      1000023         3        -3             # Z4SS   -->  Z2SS   ST     SB          
      2.27566466E-06    3      1000023         4        -4             # Z4SS   -->  Z2SS   CH     CB          
      5.93321283E-06    3      1000023         5        -5             # Z4SS   -->  Z2SS   BT     BB          
      2.48774654E-06    3      1000023        11       -11             # Z4SS   -->  Z2SS   E-     E+          
      2.48774518E-06    3      1000023        13       -13             # Z4SS   -->  Z2SS   MU-    MU+         
      2.56187036E-06    3      1000023        15       -15             # Z4SS   -->  Z2SS   TAU-   TAU+        
      4.52555560E-06    3      1000023        12       -12             # Z4SS   -->  Z2SS   NUE    ANUE        
      4.52555560E-06    3      1000023        14       -14             # Z4SS   -->  Z2SS   NUM    ANUM        
      4.53739722E-06    3      1000023        16       -16             # Z4SS   -->  Z2SS   NUT    ANUT        
      4.47760101E-07    3      1000025         2        -2             # Z4SS   -->  Z3SS   UP     UB          
      5.79214543E-07    3      1000025         1        -1             # Z4SS   -->  Z3SS   DN     DB          
      5.79214543E-07    3      1000025         3        -3             # Z4SS   -->  Z3SS   ST     SB          
      4.47760101E-07    3      1000025         4        -4             # Z4SS   -->  Z3SS   CH     CB          
      3.77183397E-07    3      1000025         5        -5             # Z4SS   -->  Z3SS   BT     BB          
      1.31573358E-07    3      1000025        11       -11             # Z4SS   -->  Z3SS   E-     E+          
      1.31573358E-07    3      1000025        13       -13             # Z4SS   -->  Z3SS   MU-    MU+         
      1.22858282E-07    3      1000025        15       -15             # Z4SS   -->  Z3SS   TAU-   TAU+        
      2.59299185E-07    3      1000025        12       -12             # Z4SS   -->  Z3SS   NUE    ANUE        
      2.59299185E-07    3      1000025        14       -14             # Z4SS   -->  Z3SS   NUM    ANUM        
      2.59295490E-07    3      1000025        16       -16             # Z4SS   -->  Z3SS   NUT    ANUT        
      1.01216637E-01    2      1000022        25                       # Z4SS   -->  Z1SS   HL0                
      1.76346362E-01    2      1000023        25                       # Z4SS   -->  Z2SS   HL0                
#         PDG         Width
DECAY   1000024  4.04836246E-05   # W1SS+ decays
#          BR          NDA       ID1       ID2       ID3       ID4
      3.33885729E-01    3      1000022         2        -1             # W1SS+  -->  Z1SS   UP     DB          
      3.33885729E-01    3      1000022         4        -3             # W1SS+  -->  Z1SS   CH     SB          
      1.10741094E-01    3      1000022       -11        12             # W1SS+  -->  Z1SS   E+     NUE         
      1.10741094E-01    3      1000022       -13        14             # W1SS+  -->  Z1SS   MU+    NUM         
      1.10746332E-01    3      1000022       -15        16             # W1SS+  -->  Z1SS   TAU+   NUT         
#         PDG         Width
DECAY   1000037  2.57341170E+00   # W2SS+ decays
#          BR          NDA       ID1       ID2       ID3       ID4
      4.78962249E-07    3      1000022         2        -1             # W2SS+  -->  Z1SS   UP     DB          
      4.78961795E-07    3      1000022         4        -3             # W2SS+  -->  Z1SS   CH     SB          
      2.72716102E-06    3      1000022       -11        12             # W2SS+  -->  Z1SS   E+     NUE         
      2.72716056E-06    3      1000022       -13        14             # W2SS+  -->  Z1SS   MU+    NUM         
      2.94297843E-06    3      1000022       -15        16             # W2SS+  -->  Z1SS   TAU+   NUT         
      4.22706865E-02    2      1000022        24                       # W2SS+  -->  Z1SS   W+                 
      2.32356774E-06    3      1000023         2        -1             # W2SS+  -->  Z2SS   UP     DB          
      2.32355910E-06    3      1000023         4        -3             # W2SS+  -->  Z2SS   CH     SB          
      4.22549419E-06    3      1000023       -11        12             # W2SS+  -->  Z2SS   E+     NUE         
      4.22549283E-06    3      1000023       -13        14             # W2SS+  -->  Z2SS   MU+    NUM         
      4.28334488E-06    3      1000023       -15        16             # W2SS+  -->  Z2SS   TAU+   NUT         
      3.90989095E-01    2      1000023        24                       # W2SS+  -->  Z2SS   W+                 
      6.76903881E-07    3      1000025         2        -1             # W2SS+  -->  Z3SS   UP     DB          
      6.76903881E-07    3      1000025         4        -3             # W2SS+  -->  Z3SS   CH     SB          
      2.25426732E-07    3      1000025       -11        12             # W2SS+  -->  Z3SS   E+     NUE         
      2.25426732E-07    3      1000025       -13        14             # W2SS+  -->  Z3SS   MU+    NUM         
      2.25466323E-07    3      1000025       -15        16             # W2SS+  -->  Z3SS   TAU+   NUT         
      3.22170973E-01    2      1000024        23                       # W2SS+  -->  W1SS+  Z0                 
      2.25503868E-06    3      1000024         1        -1             # W2SS+  -->  W1SS+  DN     DB          
      2.25500685E-06    3      1000024         3        -3             # W2SS+  -->  W1SS+  ST     SB          
      5.02594457E-06    3      1000024         2        -2             # W2SS+  -->  W1SS+  UP     UB          
      5.02594230E-06    3      1000024         4        -4             # W2SS+  -->  W1SS+  CH     CB          
      7.23950234E-06    3      1000024        12       -12             # W2SS+  -->  W1SS+  NUE    ANUE        
      7.23949961E-06    3      1000024        14       -14             # W2SS+  -->  W1SS+  NUM    ANUM        
      8.54008431E-06    3      1000024        16       -16             # W2SS+  -->  W1SS+  NUT    ANUT        
      3.40617748E-06    3      1000024        11       -11             # W2SS+  -->  W1SS+  E-     E+          
      3.40617748E-06    3      1000024        13       -13             # W2SS+  -->  W1SS+  MU-    MU+         
      3.41520308E-06    3      1000024        15       -15             # W2SS+  -->  W1SS+  TAU-   TAU+        
      2.44492650E-01    2      1000024        25                       # W2SS+  -->  W1SS+  HL0                
#         PDG         Width
DECAY        25  3.41525208E-03   # HL0   decays
#          BR          NDA       ID1       ID2       ID3       ID4
      5.08414866E-09    2           11       -11                       # HL0    -->  E-     E+                 
      2.14660336E-04    2           13       -13                       # HL0    -->  MU-    MU+                
      6.13521673E-02    2           15       -15                       # HL0    -->  TAU-   TAU+               
      6.40053440E-06    2            1        -1                       # HL0    -->  DN     DB                 
      2.58613471E-03    2            3        -3                       # HL0    -->  ST     SB                 
      8.71504366E-01    2            5        -5                       # HL0    -->  BT     BB                 
      1.87777175E-06    2            2        -2                       # HL0    -->  UP     UB                 
      3.64444703E-02    2            4        -4                       # HL0    -->  CH     CB                 
      1.13387243E-03    2           22        22                       # HL0    -->  GM     GM                 
      2.58283578E-02    2           21        21                       # HL0    -->  GL     GL                 
      5.15392276E-05    3           24        11       -12             # HL0    -->  W+     E-     ANUE        
      5.15392276E-05    3           24        13       -14             # HL0    -->  W+     MU-    ANUM        
      5.15392276E-05    3           24        15       -16             # HL0    -->  W+     TAU-   ANUT        
      1.54617694E-04    3           24        -2         1             # HL0    -->  W+     UB     DN          
      1.54617694E-04    3           24        -4         3             # HL0    -->  W+     CB     ST          
      5.15392276E-05    3          -24       -11        12             # HL0    -->  W-     E+     NUE         
      5.15392276E-05    3          -24       -13        14             # HL0    -->  W-     MU+    NUM         
      5.15392276E-05    3          -24       -15        16             # HL0    -->  W-     TAU+   NUT         
      1.54617694E-04    3          -24         2        -1             # HL0    -->  W-     UP     DB          
      1.54617694E-04    3          -24         4        -3             # HL0    -->  W-     CH     SB          
#         PDG         Width
DECAY        35  6.18325186E+00   # HH0   decays
#          BR          NDA       ID1       ID2       ID3       ID4
      1.48461438E-10    2           11       -11                       # HH0    -->  E-     E+                 
      6.26830843E-06    2           13       -13                       # HH0    -->  MU-    MU+                
      1.79524731E-03    2           15       -15                       # HH0    -->  TAU-   TAU+               
      1.82673659E-07    2            1        -1                       # HH0    -->  DN     DB                 
      7.38094022E-05    2            3        -3                       # HH0    -->  ST     SB                 
      1.12402895E-02    2            5        -5                       # HH0    -->  BT     BB                 
      7.87002019E-10    2            2        -2                       # HH0    -->  UP     UB                 
      1.17873087E-05    2            4        -4                       # HH0    -->  CH     CB                 
      3.84244949E-01    2            6        -6                       # HH0    -->  TP     TB                 
      5.61476145E-06    2           22        22                       # HH0    -->  GM     GM                 
      5.09720063E-04    2           21        21                       # HH0    -->  GL     GL                 
      1.84390368E-03    2           24       -24                       # HH0    -->  W+     W-                 
      9.18422418E-04    2           23        23                       # HH0    -->  Z0     Z0                 
      5.46388887E-03    2      1000022   1000022                       # HH0    -->  Z1SS   Z1SS               
      1.75602529E-02    2      1000022   1000023                       # HH0    -->  Z1SS   Z2SS               
      7.20494315E-02    2      1000022   1000025                       # HH0    -->  Z1SS   Z3SS               
      5.71816415E-03    2      1000022   1000035                       # HH0    -->  Z1SS   Z4SS               
      1.36953685E-02    2      1000023   1000023                       # HH0    -->  Z2SS   Z2SS               
      1.13875657E-01    2      1000023   1000025                       # HH0    -->  Z2SS   Z3SS               
      5.46250772E-03    2      1000023   1000035                       # HH0    -->  Z2SS   Z4SS               
      4.47077788E-02    2      1000024  -1000024                       # HH0    -->  W1SS+  W1SS-              
      1.57658696E-01    2      1000024  -1000037                       # HH0    -->  W1SS+  W2SS-              
      1.57658696E-01    2     -1000024   1000037                       # HH0    -->  W1SS-  W2SS+              
      5.49935317E-03    2           25        25                       # HH0    -->  HL0    HL0                
#         PDG         Width
DECAY        36  6.68873835E+00   # HA0   decays
#          BR          NDA       ID1       ID2       ID3       ID4
      1.36994360E-10    2           11       -11                       # HA0    -->  E-     E+                 
      5.78414847E-06    2           13       -13                       # HA0    -->  MU-    MU+                
      1.65663986E-03    2           15       -15                       # HA0    -->  TAU-   TAU+               
      1.68580826E-07    2            1        -1                       # HA0    -->  DN     DB                 
      6.81151869E-05    2            3        -3                       # HA0    -->  ST     SB                 
      1.03744920E-02    2            5        -5                       # HA0    -->  BT     BB                 
      6.65930755E-10    2            2        -2                       # HA0    -->  UP     UB                 
      9.98749692E-06    2            4        -4                       # HA0    -->  CH     CB                 
      4.62376088E-01    2            6        -6                       # HA0    -->  TP     TB                 
      1.23396592E-06    2           22        22                       # HA0    -->  GM     GM                 
      4.36521193E-04    2           21        21                       # HA0    -->  GL     GL                 
      1.04663512E-02    2      1000022   1000022                       # HA0    -->  Z1SS   Z1SS               
      3.85727882E-02    2      1000022   1000023                       # HA0    -->  Z1SS   Z2SS               
      9.69566964E-03    2      1000022   1000025                       # HA0    -->  Z1SS   Z3SS               
      4.05824780E-02    2      1000022   1000035                       # HA0    -->  Z1SS   Z4SS               
      3.54816578E-02    2      1000023   1000023                       # HA0    -->  Z2SS   Z2SS               
      1.00726234E-02    2      1000023   1000025                       # HA0    -->  Z2SS   Z3SS               
      6.02247715E-02    2      1000023   1000035                       # HA0    -->  Z2SS   Z4SS               
      1.12398274E-01    2      1000024  -1000024                       # HA0    -->  W1SS+  W1SS-              
      1.02989718E-01    2      1000024  -1000037                       # HA0    -->  W1SS+  W2SS-              
      1.02989718E-01    2     -1000024   1000037                       # HA0    -->  W1SS-  W2SS+              
      1.59692997E-03    2           25        23                       # HA0    -->  HL0    Z0                 
#         PDG         Width
DECAY        37  6.39552450E+00   # H+    decays
#          BR          NDA       ID1       ID2       ID3       ID4
      1.45446363E-10    2           12       -11                       # H+     -->  NUE    E+                 
      6.14100782E-06    2           14       -13                       # H+     -->  NUM    MU+                
      1.75884878E-03    2           16       -15                       # H+     -->  NUT    TAU+               
      1.64423895E-07    2            2        -1                       # H+     -->  UP     DB                 
      7.58580063E-05    2            4        -3                       # H+     -->  CH     SB                 
      4.38413829E-01    2            6        -5                       # H+     -->  TP     BB                 
      4.38046791E-02    2      1000024   1000022                       # H+     -->  W1SS+  Z1SS               
      1.60682097E-03    2      1000024   1000023                       # H+     -->  W1SS+  Z2SS               
      1.63388997E-01    2      1000024   1000025                       # H+     -->  W1SS+  Z3SS               
      1.43391773E-01    2      1000024   1000035                       # H+     -->  W1SS+  Z4SS               
      1.55996326E-02    2      1000037   1000022                       # H+     -->  W2SS+  Z1SS               
      1.90191880E-01    2      1000037   1000023                       # H+     -->  W2SS+  Z2SS               
      1.76140049E-03    2           25        24                       # H+     -->  HL0    W+                 
