#  ISAJET SUSY parameters in Les Houches accord format
#  Created by ISALHA3. Last revision by C. Balazs on 2005 Jan. 10
Block SPINFO   # Program information
     1   ISASUGRA from ISAJET          # Spectrum Calculator
     2   7.79   16-DEC-2008 15:42:00   # Version number
Block MODSEL   # Model selection
     1     1   # Minimal supergravity (mSUGRA,CMSSM) model         
Block SMINPUTS   # Standard Model inputs
     1     1.27837311E+02   # alpha_em^(-1)
     2     1.16570000E-05   # G_Fermi
     3     1.17200002E-01   # alpha_s(M_Z)
     4     9.11699982E+01   # m_{Z}(pole)
     5     4.19999981E+00   # m_{b}(m_{b})
     6     1.72500000E+02   # m_{top}(pole)
     7     1.77699995E+00   # m_{tau}(pole)
Block MINPAR   # SUSY breaking input parameters
     1     4.40000000E+02   # m_0
     2     1.45000000E+02   # m_{1/2}
     3     3.00000000E+00   # tan(beta)
     4     1.00000000E+00   # sign(mu)
     5     0.00000000E+00   # A_0
#  
#  M_{GUT} =   0.27923000E+17
Block MASS   # Scalar and gaugino mass spectrum
#  PDG code   mass                 particle
        24     8.04229965E+01   #  W^+
        25     9.29045181E+01   #  h^0            
        35     5.81631348E+02   #  H^0            
        36     5.75172119E+02   #  A^0            
        37     5.84304138E+02   #  H^+            
   1000001     5.49867920E+02   #  dnl            
   1000002     5.45107422E+02   #  upl            
   1000003     5.49867981E+02   #  stl            
   1000004     5.45109131E+02   #  chl            
   1000005     4.66282684E+02   #  b1             
   1000006     3.37320312E+02   #  t1             
   1000011     4.51200134E+02   #  el-            
   1000012     4.45285095E+02   #  nuel           
   1000013     4.51200134E+02   #  mul-           
   1000014     4.45285095E+02   #  numl           
   1000015     4.43269196E+02   #  tau1           
   1000016     4.45110260E+02   #  nutl           
   1000021     3.95093933E+02   #  glss           
   1000022     5.17421112E+01   #  z1ss           
   1000023     9.67557907E+01   #  z2ss           
   1000024     9.47519455E+01   #  w1ss           
   1000025    -3.15682037E+02   #  z3ss           
   1000035     3.41841156E+02   #  z4ss           
   1000037     3.37739532E+02   #  w2ss           
   2000001     5.42914734E+02   #  dnr            
   2000002     5.41950989E+02   #  upr            
   2000003     5.42914795E+02   #  str            
   2000004     5.41952698E+02   #  chr            
   2000005     5.40690369E+02   #  b2             
   2000006     5.11302582E+02   #  t2             
   2000011     4.44296387E+02   #  er-            
   2000013     4.44296417E+02   #  mur-           
   2000015     4.51518982E+02   #  tau2           
#  Higgs mixing
Block ALPHA   # Effective Higgs mixing parameter
         -3.35858375E-01   # alpha
Block STOPMIX   # stop mixing matrix
  1  1     4.20540065E-01   # O_{11}
  1  2    -9.07273948E-01   # O_{12}
  2  1     9.07273948E-01   # O_{21}
  2  2     4.20540065E-01   # O_{22}
Block SBOTMIX   # sbottom mixing matrix
  1  1     9.99027789E-01   # O_{11}
  1  2    -4.40845676E-02   # O_{12}
  2  1     4.40845676E-02   # O_{21}
  2  2     9.99027789E-01   # O_{22}
Block STAUMIX   # stau mixing matrix
  1  1     2.58561581E-01   # O_{11}
  1  2    -9.65994775E-01   # O_{12}
  2  1     9.65994775E-01   # O_{21}
  2  2     2.58561581E-01   # O_{22}
Block NMIX   # neutralino mixing matrix
  1  1     9.62755382E-01   #
  1  2    -1.77459940E-01   #
  1  3     1.84067026E-01   #
  1  4    -8.79175439E-02   #
  2  1    -2.30091557E-01   #
  2  2    -9.33539748E-01   #
  2  3     2.36684218E-01   #
  2  4    -1.39792606E-01   #
  3  1     5.26883639E-02   #
  3  2    -8.26673880E-02   #
  3  3    -6.95343494E-01   #
  3  4    -7.11960077E-01   #
  4  1     1.31848395E-01   #
  4  2    -3.00295860E-01   #
  4  3    -6.53143942E-01   #
  4  4     6.82525694E-01   #
Block UMIX   # chargino U mixing matrix
  1  1    -9.24930632E-01   # U_{11}
  1  2     3.80135953E-01   # U_{12}
  2  1    -3.80135953E-01   # U_{21}
  2  2    -9.24930632E-01   # U_{22}
Block VMIX   # chargino V mixing matrix
  1  1    -9.73606229E-01   # V_{11}
  1  2     2.28234321E-01   # V_{12}
  2  1    -2.28234321E-01   # V_{21}
  2  2    -9.73606229E-01   # V_{22}
Block GAUGE Q=  3.82962891E+02   #
     1     3.57523352E-01   # g`
     2     6.52376831E-01   # g_2
     3     1.21915841E+00   # g_3
Block YU Q=  3.82962891E+02   #
  3  3     9.34337616E-01   # y_t
Block YD Q=  3.82962891E+02   #
  3  3     4.51044776E-02   # y_b
Block YE Q=  3.82962891E+02   #
  3  3     3.17177549E-02   # y_tau
Block HMIX Q=  3.82962891E+02   # Higgs mixing parameters
     1     3.12107361E+02   # mu(Q)
     2     3.00000000E+00   # tan(beta)(M_{GUT})
     3     2.50178986E+02   # Higgs vev at Q
     4     3.30822969E+05   # m_A^2(Q)
Block MSOFT Q=  3.82962891E+02   # DRbar SUSY breaking parameters
     1     5.83979111E+01   # M_1(Q)          
     2     1.10983513E+02   # M_2(Q)          
     3     3.52691162E+02   # M_3(Q)          
    31     4.48260986E+02   # MeL(Q)          
    32     4.48260986E+02   # MmuL(Q)         
    33     4.48089722E+02   # MtauL(Q)        
    34     4.42263611E+02   # MeR(Q)          
    35     4.42263611E+02   # MmuR(Q)         
    36     4.41868317E+02   # MtauR(Q)        
    41     5.29685852E+02   # MqL1(Q)         
    42     5.29685852E+02   # MqL2(Q)         
    43     4.46450592E+02   # MqL3(Q)         
    44     5.25297791E+02   # MuR(Q)          
    45     5.25297791E+02   # McR(Q)          
    46     3.28503479E+02   # MtR(Q)          
    47     5.24804138E+02   # MdR(Q)          
    48     5.24804138E+02   # MsR(Q)          
    49     5.27080261E+02   # MbR(Q)          
Block AU Q=  3.82962891E+02   #
  1  1    -2.62394104E+02   # A_u
  2  2    -2.62394104E+02   # A_c
  3  3    -2.62394104E+02   # A_t
Block AD Q=  3.82962891E+02   #
  1  1    -4.22823090E+02   # A_d
  2  2    -4.22823090E+02   # A_s
  3  3    -4.22823090E+02   # A_b
Block AE Q=  3.82962891E+02   #
  1  1    -9.25537262E+01   # A_e
  2  2    -9.25537262E+01   # A_mu
  3  3    -9.25537262E+01   # A_tau
#  ISAJET decay tables in SUSY Les Houches accord format
#  Created by ISALHD. Last revision: C. Balazs, 2005 May 25
Block DCINFO                           # Program information
     1   ISASUGRA from ISAJET          # Spectrum Calculator
     2   7.79   16-DEC-2008 15:42:00   # Version number
#         PDG         Width
DECAY         6  1.14680767E+00   # TP    decays
#          BR          NDA       ID1       ID2       ID3       ID4
      3.33333343E-01    3            2        -1         5             # TP     -->  UP     DB     BT          
      3.33333343E-01    3            4        -3         5             # TP     -->  CH     SB     BT          
      1.11111112E-01    3          -11        12         5             # TP     -->  E+     NUE    BT          
      1.11111112E-01    3          -13        14         5             # TP     -->  MU+    NUM    BT          
      1.11111112E-01    3          -15        16         5             # TP     -->  TAU+   NUT    BT          
#         PDG         Width
DECAY   1000021  7.48255150E-03   # GLSS  decays
#          BR          NDA       ID1       ID2       ID3       ID4
      1.11354403E-01    3      1000024         1        -2             # GLSS   -->  W1SS+  DN     UB          
      1.11354403E-01    3     -1000024         2        -1             # GLSS   -->  W1SS-  UP     DB          
      1.11353353E-01    3      1000024         3        -4             # GLSS   -->  W1SS+  ST     CB          
      1.11353353E-01    3     -1000024         4        -3             # GLSS   -->  W1SS-  CH     SB          
      2.82103568E-02    3      1000024         5        -6             # GLSS   -->  W1SS+  BT     TB          
      2.82103568E-02    3     -1000024         6        -5             # GLSS   -->  W1SS-  TP     BB          
      2.47535772E-05    3      1000037         1        -2             # GLSS   -->  W2SS+  DN     UB          
      2.47535772E-05    3     -1000037         2        -1             # GLSS   -->  W2SS-  UP     DB          
      2.47533644E-05    3      1000037         3        -4             # GLSS   -->  W2SS+  ST     CB          
      2.47533644E-05    3     -1000037         4        -3             # GLSS   -->  W2SS-  CH     SB          
      1.21154706E-03    2      1000022        21                       # GLSS   -->  Z1SS   GL                 
      3.82616110E-02    3      1000022         2        -2             # GLSS   -->  Z1SS   UP     UB          
      1.83806345E-02    3      1000022         1        -1             # GLSS   -->  Z1SS   DN     DB          
      1.83806233E-02    3      1000022         3        -3             # GLSS   -->  Z1SS   ST     SB          
      3.82609665E-02    3      1000022         4        -4             # GLSS   -->  Z1SS   CH     CB          
      3.26632634E-02    3      1000022         5        -5             # GLSS   -->  Z1SS   BT     BB          
      4.08965209E-03    2      1000023        21                       # GLSS   -->  Z2SS   GL                 
      6.12480529E-02    3      1000023         2        -2             # GLSS   -->  Z2SS   UP     UB          
      4.77592833E-02    3      1000023         1        -1             # GLSS   -->  Z2SS   DN     DB          
      4.77592573E-02    3      1000023         3        -3             # GLSS   -->  Z2SS   ST     SB          
      6.12470023E-02    3      1000023         4        -4             # GLSS   -->  Z2SS   CH     CB          
      1.25104144E-01    3      1000023         5        -5             # GLSS   -->  Z2SS   BT     BB          
      2.55485415E-03    2      1000025        21                       # GLSS   -->  Z3SS   GL                 
      1.37610800E-06    3      1000025         2        -2             # GLSS   -->  Z3SS   UP     UB          
      1.67795690E-06    3      1000025         1        -1             # GLSS   -->  Z3SS   DN     DB          
      1.67795554E-06    3      1000025         3        -3             # GLSS   -->  Z3SS   ST     SB          
      1.37607685E-06    3      1000025         4        -4             # GLSS   -->  Z3SS   CH     CB          
      1.73557364E-05    3      1000025         5        -5             # GLSS   -->  Z3SS   BT     BB          
      1.04014133E-03    2      1000035        21                       # GLSS   -->  Z4SS   GL                 
      8.39419590E-06    3      1000035         2        -2             # GLSS   -->  Z4SS   UP     UB          
      9.87287967E-06    3      1000035         1        -1             # GLSS   -->  Z4SS   DN     DB          
      9.87287058E-06    3      1000035         3        -3             # GLSS   -->  Z4SS   ST     SB          
      8.39399945E-06    3      1000035         4        -4             # GLSS   -->  Z4SS   CH     CB          
      4.37381059E-05    3      1000035         5        -5             # GLSS   -->  Z4SS   BT     BB          
#         PDG         Width
DECAY   1000002  1.43429270E+01   # UPL   decays
#          BR          NDA       ID1       ID2       ID3       ID4
      1.82030064E-07    2      1000022         2                       # UPL    -->  Z1SS   UP                 
      1.42849222E-01    2      1000023         2                       # UPL    -->  Z2SS   UP                 
      3.76723910E-04    2      1000025         2                       # UPL    -->  Z3SS   UP                 
      4.49071079E-03    2      1000035         2                       # UPL    -->  Z4SS   UP                 
      5.60720325E-01    2      1000021         2                       # UPL    -->  GLSS   UP                 
      2.85236180E-01    2      1000024         1                       # UPL    -->  W1SS+  DN                 
      6.32664934E-03    2      1000037         1                       # UPL    -->  W2SS+  DN                 
#         PDG         Width
DECAY   1000001  1.45172920E+01   # DNL   decays
#          BR          NDA       ID1       ID2       ID3       ID4
      1.96101964E-02    2      1000022         1                       # DNL    -->  Z1SS   DN                 
      1.18958913E-01    2      1000023         1                       # DNL    -->  Z2SS   DN                 
      6.10732648E-04    2      1000025         1                       # DNL    -->  Z3SS   DN                 
      6.31735800E-03    2      1000035         1                       # DNL    -->  Z4SS   DN                 
      5.79800665E-01    2      1000021         1                       # DNL    -->  GLSS   DN                 
      2.56833225E-01    2     -1000024         2                       # DNL    -->  W1SS-  UP                 
      1.78689361E-02    2     -1000037         2                       # DNL    -->  W2SS-  UP                 
#         PDG         Width
DECAY   1000003  1.45172415E+01   # STL   decays
#          BR          NDA       ID1       ID2       ID3       ID4
      1.96102653E-02    2      1000022         3                       # STL    -->  Z1SS   ST                 
      1.18959337E-01    2      1000023         3                       # STL    -->  Z2SS   ST                 
      6.10734918E-04    2      1000025         3                       # STL    -->  Z3SS   ST                 
      6.31738221E-03    2      1000035         3                       # STL    -->  Z4SS   ST                 
      5.79802930E-01    2      1000021         3                       # STL    -->  GLSS   ST                 
      2.56830871E-01    2     -1000024         4                       # STL    -->  W1SS-  CH                 
      1.78684462E-02    2     -1000037         4                       # STL    -->  W2SS-  CH                 
#         PDG         Width
DECAY   1000004  1.43426199E+01   # CHL   decays
#          BR          NDA       ID1       ID2       ID3       ID4
      1.82032295E-07    2      1000022         4                       # CHL    -->  Z1SS   CH                 
      1.42850950E-01    2      1000023         4                       # CHL    -->  Z2SS   CH                 
      3.76725162E-04    2      1000025         4                       # CHL    -->  Z3SS   CH                 
      4.49070893E-03    2      1000035         4                       # CHL    -->  Z4SS   CH                 
      5.60711205E-01    2      1000021         4                       # CHL    -->  GLSS   CH                 
      2.85243362E-01    2      1000024         3                       # CHL    -->  W1SS+  ST                 
      6.32685469E-03    2      1000037         3                       # CHL    -->  W2SS+  ST                 
#         PDG         Width
DECAY   1000005  7.01422834E+00   # BT1   decays
#          BR          NDA       ID1       ID2       ID3       ID4
      3.45561281E-02    2      1000022         5                       # BT1    -->  Z1SS   BT                 
      2.03688547E-01    2      1000023         5                       # BT1    -->  Z2SS   BT                 
      1.00806600E-03    2      1000025         5                       # BT1    -->  Z3SS   BT                 
      6.49023568E-03    2      1000035         5                       # BT1    -->  Z4SS   BT                 
      3.53261918E-01    2      1000021         5                       # BT1    -->  GLSS   BT                 
      3.16385090E-01    2     -1000024         6                       # BT1    -->  W1SS-  TP                 
      8.46100152E-02    2          -24   1000006                       # BT1    -->  W-     TP1                
#         PDG         Width
DECAY   1000006  1.79106092E+00   # TP1   decays
#          BR          NDA       ID1       ID2       ID3       ID4
      1.92097023E-01    2      1000022         6                       # TP1    -->  Z1SS   TP                 
      1.41860768E-01    2      1000023         6                       # TP1    -->  Z2SS   TP                 
      6.66042268E-01    2      1000024         5                       # TP1    -->  W1SS+  BT                 
#         PDG         Width
DECAY   2000002  8.98027611E+00   # UPR   decays
#          BR          NDA       ID1       ID2       ID3       ID4
      1.24155179E-01    2      1000022         2                       # UPR    -->  Z1SS   UP                 
      6.76942756E-03    2      1000023         2                       # UPR    -->  Z2SS   UP                 
      1.65321326E-04    2      1000025         2                       # UPR    -->  Z3SS   UP                 
      8.59871099E-04    2      1000035         2                       # UPR    -->  Z4SS   UP                 
      8.68050158E-01    2      1000021         2                       # UPR    -->  GLSS   UP                 
#         PDG         Width
DECAY   2000001  8.16742611E+00   # DNR   decays
#          BR          NDA       ID1       ID2       ID3       ID4
      3.41908000E-02    2      1000022         1                       # DNR    -->  Z1SS   DN                 
      1.86453026E-03    2      1000023         1                       # DNR    -->  Z2SS   DN                 
      4.56904854E-05    2      1000025         1                       # DNR    -->  Z3SS   DN                 
      2.37893619E-04    2      1000035         1                       # DNR    -->  Z4SS   DN                 
      9.63661075E-01    2      1000021         1                       # DNR    -->  GLSS   DN                 
#         PDG         Width
DECAY   2000003  8.16743088E+00   # STR   decays
#          BR          NDA       ID1       ID2       ID3       ID4
      3.41907851E-02    2      1000022         3                       # STR    -->  Z1SS   ST                 
      1.86452945E-03    2      1000023         3                       # STR    -->  Z2SS   ST                 
      4.56904709E-05    2      1000025         3                       # STR    -->  Z3SS   ST                 
      2.37893590E-04    2      1000035         3                       # STR    -->  Z4SS   ST                 
      9.63661134E-01    2      1000021         3                       # STR    -->  GLSS   ST                 
#         PDG         Width
DECAY   2000004  8.97995663E+00   # CHR   decays
#          BR          NDA       ID1       ID2       ID3       ID4
      1.24158427E-01    2      1000022         4                       # CHR    -->  Z1SS   CH                 
      6.76960265E-03    2      1000023         4                       # CHR    -->  Z2SS   CH                 
      1.65324120E-04    2      1000025         4                       # CHR    -->  Z3SS   CH                 
      8.59882217E-04    2      1000035         4                       # CHR    -->  Z4SS   CH                 
      8.68046761E-01    2      1000021         4                       # CHR    -->  GLSS   CH                 
#         PDG         Width
DECAY   2000005  7.99732399E+00   # BT2   decays
#          BR          NDA       ID1       ID2       ID3       ID4
      3.45383622E-02    2      1000022         5                       # BT2    -->  Z1SS   BT                 
      2.00205948E-03    2      1000023         5                       # BT2    -->  Z2SS   BT                 
      7.17318500E-04    2      1000025         5                       # BT2    -->  Z3SS   BT                 
      9.27757996E-04    2      1000035         5                       # BT2    -->  Z4SS   BT                 
      9.59233105E-01    2      1000021         5                       # BT2    -->  GLSS   BT                 
      1.48770327E-04    2     -1000024         6                       # BT2    -->  W1SS-  TP                 
      1.66183384E-03    2     -1000037         6                       # BT2    -->  W2SS-  TP                 
      7.70795974E-04    2          -24   1000006                       # BT2    -->  W-     TP1                
#         PDG         Width
DECAY   2000006  5.57588911E+00   # TP2   decays
#          BR          NDA       ID1       ID2       ID3       ID4
      4.01790708E-01    2      1000024         5                       # TP2    -->  W1SS+  BT                 
      1.54057264E-01    2      1000037         5                       # TP2    -->  W2SS+  BT                 
      1.25842482E-01    2           23   1000006                       # TP2    -->  Z0     TP1                
      9.63394567E-02    2           25   1000006                       # TP2    -->  HL0    TP1                
      6.61581010E-03    2      1000022         6                       # TP2    -->  Z1SS   TP                 
      1.70946255E-01    2      1000023         6                       # TP2    -->  Z2SS   TP                 
      4.44080345E-02    2      1000025         6                       # TP2    -->  Z3SS   TP                 
#         PDG         Width
DECAY   1000011  5.26576614E+00   # EL-   decays
#          BR          NDA       ID1       ID2       ID3       ID4
      4.34453227E-02    2      1000022        11                       # EL-    -->  Z1SS   E-                 
      3.68845344E-01    2      1000023        11                       # EL-    -->  Z2SS   E-                 
      2.71134573E-04    2      1000025        11                       # EL-    -->  Z3SS   E-                 
      3.39752086E-03    2      1000035        11                       # EL-    -->  Z4SS   E-                 
      5.63888192E-01    2     -1000024        12                       # EL-    -->  W1SS-  NUE                
      2.01524794E-02    2     -1000037        12                       # EL-    -->  W2SS-  NUE                
#         PDG         Width
DECAY   1000013  5.26576614E+00   # MUL-  decays
#          BR          NDA       ID1       ID2       ID3       ID4
      4.34453264E-02    2      1000022        13                       # MUL-   -->  Z1SS   MU-                
      3.68845314E-01    2      1000023        13                       # MUL-   -->  Z2SS   MU-                
      2.71134486E-04    2      1000025        13                       # MUL-   -->  Z3SS   MU-                
      3.39751947E-03    2      1000035        13                       # MUL-   -->  Z4SS   MU-                
      5.63888252E-01    2     -1000024        14                       # MUL-   -->  W1SS-  NUM                
      2.01524813E-02    2     -1000037        14                       # MUL-   -->  W2SS-  NUM                
#         PDG         Width
DECAY   1000015  2.39476395E+00   # TAU1- decays
#          BR          NDA       ID1       ID2       ID3       ID4
      8.02192092E-01    2      1000022        15                       # TAU1-  -->  Z1SS   TAU-               
      1.00357875E-01    2      1000023        15                       # TAU1-  -->  Z2SS   TAU-               
      5.57068095E-04    2      1000025        15                       # TAU1-  -->  Z3SS   TAU-               
      2.12289393E-03    2      1000035        15                       # TAU1-  -->  Z4SS   TAU-               
      9.39683840E-02    2     -1000024        16                       # TAU1-  -->  W1SS-  NUT                
      8.01706978E-04    2     -1000037        16                       # TAU1-  -->  W2SS-  NUT                
#         PDG         Width
DECAY   1000012  5.34292507E+00   # NUEL  decays
#          BR          NDA       ID1       ID2       ID3       ID4
      1.70460373E-01    2      1000022        12                       # NUEL   -->  Z1SS   NUE                
      2.07439139E-01    2      1000023        12                       # NUEL   -->  Z2SS   NUE                
      1.08146318E-03    2      1000025        12                       # NUEL   -->  Z3SS   NUE                
      8.22019018E-03    2      1000035        12                       # NUEL   -->  Z4SS   NUE                
      6.06206417E-01    2      1000024        11                       # NUEL   -->  W1SS+  E-                 
      6.59244042E-03    2      1000037        11                       # NUEL   -->  W2SS+  E-                 
#         PDG         Width
DECAY   1000014  5.34292459E+00   # NUML  decays
#          BR          NDA       ID1       ID2       ID3       ID4
      1.70460388E-01    2      1000022        14                       # NUML   -->  Z1SS   NUM                
      2.07439154E-01    2      1000023        14                       # NUML   -->  Z2SS   NUM                
      1.08146330E-03    2      1000025        14                       # NUML   -->  Z3SS   NUM                
      8.22019111E-03    2      1000035        14                       # NUML   -->  Z4SS   NUM                
      6.06206357E-01    2      1000024        13                       # NUML   -->  W1SS+  MU-                
      6.59243716E-03    2      1000037        13                       # NUML   -->  W2SS+  MU-                
#         PDG         Width
DECAY   1000016  5.34277678E+00   # NUTL  decays
#          BR          NDA       ID1       ID2       ID3       ID4
      1.70394495E-01    2      1000022        16                       # NUTL   -->  Z1SS   NUT                
      2.07347289E-01    2      1000023        16                       # NUTL   -->  Z2SS   NUT                
      1.07935257E-03    2      1000025        16                       # NUTL   -->  Z3SS   NUT                
      8.19866825E-03    2      1000035        16                       # NUTL   -->  Z4SS   NUT                
      6.06103301E-01    2      1000024        15                       # NUTL   -->  W1SS+  TAU-               
      6.87693572E-03    2      1000037        15                       # NUTL   -->  W2SS+  TAU-               
      7.57525146E-14    3      1000015        16       -15             # NUTL   -->  TAU1-  NUT    TAU+        
      7.57525146E-14    3      1000015        12       -11             # NUTL   -->  TAU1-  NUE    E+          
      7.57525146E-14    3      1000015        14       -13             # NUTL   -->  TAU1-  NUM    MU+         
      2.27257557E-13    3      1000015         2        -1             # NUTL   -->  TAU1-  UP     DB          
      2.27257557E-13    3      1000015         4        -3             # NUTL   -->  TAU1-  CH     SB          
#         PDG         Width
DECAY   2000011  2.15481853E+00   # ER-   decays
#          BR          NDA       ID1       ID2       ID3       ID4
      9.45870757E-01    2      1000022        11                       # ER-    -->  Z1SS   E-                 
      5.03802672E-02    2      1000023        11                       # ER-    -->  Z2SS   E-                 
      7.13806541E-04    2      1000025        11                       # ER-    -->  Z3SS   E-                 
      3.03518190E-03    2      1000035        11                       # ER-    -->  Z4SS   E-                 
#         PDG         Width
DECAY   2000013  2.15481853E+00   # MUR-  decays
#          BR          NDA       ID1       ID2       ID3       ID4
      9.45870757E-01    2      1000022        13                       # MUR-   -->  Z1SS   MU-                
      5.03802709E-02    2      1000023        13                       # MUR-   -->  Z2SS   MU-                
      7.13806541E-04    2      1000025        13                       # MUR-   -->  Z3SS   MU-                
      3.03518167E-03    2      1000035        13                       # MUR-   -->  Z4SS   MU-                
#         PDG         Width
DECAY   2000015  5.02749634E+00   # TAU2- decays
#          BR          NDA       ID1       ID2       ID3       ID4
      6.83860481E-02    2      1000022        15                       # TAU2-  -->  Z1SS   TAU-               
      3.59957367E-01    2      1000023        15                       # TAU2-  -->  Z2SS   TAU-               
      7.81440991E-04    2      1000025        15                       # TAU2-  -->  Z3SS   TAU-               
      4.19808645E-03    2      1000035        15                       # TAU2-  -->  Z4SS   TAU-               
      5.45600057E-01    2     -1000024        16                       # TAU2-  -->  W1SS-  NUT                
      2.10769437E-02    2     -1000037        16                       # TAU2-  -->  W2SS-  NUT                
#         PDG         Width
DECAY   1000023  3.20934902E-07   # Z2SS  decays
#          BR          NDA       ID1       ID2       ID3       ID4
      6.04079629E-04    2      1000022        22                       # Z2SS   -->  Z1SS   GM                 
      1.45402781E-04    3     -1000024         2        -1             # Z2SS   -->  W1SS-  UP     DB          
      4.84675911E-05    3     -1000024        12       -11             # Z2SS   -->  W1SS-  NUE    E+          
      4.84675911E-05    3     -1000024        14       -13             # Z2SS   -->  W1SS-  NUM    MU+         
      1.45402781E-04    3      1000024         1        -2             # Z2SS   -->  W1SS+  DN     UB          
      4.84675911E-05    3      1000024        11       -12             # Z2SS   -->  W1SS+  E-     ANUE        
      4.84675911E-05    3      1000024        13       -14             # Z2SS   -->  W1SS+  MU-    ANUM        
      1.27335489E-01    3      1000022         2        -2             # Z2SS   -->  Z1SS   UP     UB          
      2.23075435E-01    3      1000022         1        -1             # Z2SS   -->  Z1SS   DN     DB          
      2.23075420E-01    3      1000022         3        -3             # Z2SS   -->  Z1SS   ST     SB          
      1.27335414E-01    3      1000022         4        -4             # Z2SS   -->  Z1SS   CH     CB          
      2.34028652E-01    3      1000022         5        -5             # Z2SS   -->  Z1SS   BT     BB          
      5.85892145E-03    3      1000022        11       -11             # Z2SS   -->  Z1SS   E-     E+          
      5.85892424E-03    3      1000022        13       -13             # Z2SS   -->  Z1SS   MU-    MU+         
      7.03508593E-03    3      1000022        15       -15             # Z2SS   -->  Z1SS   TAU-   TAU+        
      1.51117193E-02    3      1000022        12       -12             # Z2SS   -->  Z1SS   NUE    ANUE        
      1.51117193E-02    3      1000022        14       -14             # Z2SS   -->  Z1SS   NUM    ANUM        
      1.50844287E-02    3      1000022        16       -16             # Z2SS   -->  Z1SS   NUT    ANUT        
#         PDG         Width
DECAY   1000025  2.16879416E+00   # Z3SS  decays
#          BR          NDA       ID1       ID2       ID3       ID4
      4.39803500E-07    2      1000022        22                       # Z3SS   -->  Z1SS   GM                 
      1.51717629E-07    2      1000023        22                       # Z3SS   -->  Z2SS   GM                 
      3.12253922E-01    2      1000024       -24                       # Z3SS   -->  W1SS+  W-                 
      3.12253922E-01    2     -1000024        24                       # Z3SS   -->  W1SS-  W+                 
      1.43947601E-01    2      1000022        23                       # Z3SS   -->  Z1SS   Z0                 
      1.99621379E-01    2      1000023        23                       # Z3SS   -->  Z2SS   Z0                 
      1.53046944E-08    3      1000022         2        -2             # Z3SS   -->  Z1SS   UP     UB          
      2.14688445E-08    3      1000022         1        -1             # Z3SS   -->  Z1SS   DN     DB          
      2.14688356E-08    3      1000022         3        -3             # Z3SS   -->  Z1SS   ST     SB          
      1.53044599E-08    3      1000022         4        -4             # Z3SS   -->  Z1SS   CH     CB          
      1.37136098E-07    3      1000022         5        -5             # Z3SS   -->  Z1SS   BT     BB          
      7.78259803E-08    3      1000022        11       -11             # Z3SS   -->  Z1SS   E-     E+          
      7.78259519E-08    3      1000022        13       -13             # Z3SS   -->  Z1SS   MU-    MU+         
      1.78340557E-07    3      1000022        15       -15             # Z3SS   -->  Z1SS   TAU-   TAU+        
      1.17091247E-07    3      1000022        12       -12             # Z3SS   -->  Z1SS   NUE    ANUE        
      1.17091247E-07    3      1000022        14       -14             # Z3SS   -->  Z1SS   NUM    ANUM        
      1.17344420E-07    3      1000022        16       -16             # Z3SS   -->  Z1SS   NUT    ANUT        
      5.62846942E-08    3      1000023         2        -2             # Z3SS   -->  Z2SS   UP     UB          
      7.13676584E-08    3      1000023         1        -1             # Z3SS   -->  Z2SS   DN     DB          
      7.13676229E-08    3      1000023         3        -3             # Z3SS   -->  Z2SS   ST     SB          
      5.62838238E-08    3      1000023         4        -4             # Z3SS   -->  Z2SS   CH     CB          
      3.64375609E-07    3      1000023         5        -5             # Z3SS   -->  Z2SS   BT     BB          
      3.43963045E-08    3      1000023        11       -11             # Z3SS   -->  Z2SS   E-     E+          
      3.43963045E-08    3      1000023        13       -13             # Z3SS   -->  Z2SS   MU-    MU+         
      9.12292677E-08    3      1000023        15       -15             # Z3SS   -->  Z2SS   TAU-   TAU+        
      8.65862191E-08    3      1000023        12       -12             # Z3SS   -->  Z2SS   NUE    ANUE        
      8.65862191E-08    3      1000023        14       -14             # Z3SS   -->  Z2SS   NUM    ANUM        
      8.67810996E-08    3      1000023        16       -16             # Z3SS   -->  Z2SS   NUT    ANUT        
      1.79046914E-02    2      1000022        25                       # Z3SS   -->  Z1SS   HL0                
      1.40159819E-02    2      1000023        25                       # Z3SS   -->  Z2SS   HL0                
#         PDG         Width
DECAY   1000035  2.30220628E+00   # Z4SS  decays
#          BR          NDA       ID1       ID2       ID3       ID4
      9.57630732E-07    2      1000022        22                       # Z4SS   -->  Z1SS   GM                 
      8.34801824E-07    2      1000023        22                       # Z4SS   -->  Z2SS   GM                 
      5.89324367E-09    2      1000025        22                       # Z4SS   -->  Z3SS   GM                 
      3.49784344E-01    2      1000024       -24                       # Z4SS   -->  W1SS+  W-                 
      3.49784344E-01    2     -1000024        24                       # Z4SS   -->  W1SS-  W+                 
      2.49039039E-10    3     -1000037         2        -1             # Z4SS   -->  W2SS-  UP     DB          
      8.30130131E-11    3     -1000037        12       -11             # Z4SS   -->  W2SS-  NUE    E+          
      8.30130131E-11    3     -1000037        14       -13             # Z4SS   -->  W2SS-  NUM    MU+         
      2.49039012E-10    3      1000037         1        -2             # Z4SS   -->  W2SS+  DN     UB          
      8.30130131E-11    3      1000037        11       -12             # Z4SS   -->  W2SS+  E-     ANUE        
      8.30130131E-11    3      1000037        13       -14             # Z4SS   -->  W2SS+  MU-    ANUM        
      2.49039012E-10    3     -1000037         4        -3             # Z4SS   -->  W2SS-  CH     SB          
      8.30130131E-11    3     -1000037        16       -15             # Z4SS   -->  W2SS-  NUT    TAU+        
      2.49039012E-10    3      1000037         3        -4             # Z4SS   -->  W2SS+  ST     CB          
      8.30130131E-11    3      1000037        15       -16             # Z4SS   -->  W2SS+  TAU-   ANUT        
      2.02514026E-02    2      1000022        23                       # Z4SS   -->  Z1SS   Z0                 
      1.72959380E-02    2      1000023        23                       # Z4SS   -->  Z2SS   Z0                 
      2.33662803E-07    3      1000022         2        -2             # Z4SS   -->  Z1SS   UP     UB          
      6.31973251E-07    3      1000022         1        -1             # Z4SS   -->  Z1SS   DN     DB          
      6.31972966E-07    3      1000022         3        -3             # Z4SS   -->  Z1SS   ST     SB          
      2.33659222E-07    3      1000022         4        -4             # Z4SS   -->  Z1SS   CH     CB          
      1.51171594E-06    3      1000022         5        -5             # Z4SS   -->  Z1SS   BT     BB          
      1.39208487E-06    3      1000022        11       -11             # Z4SS   -->  Z1SS   E-     E+          
      1.39208453E-06    3      1000022        13       -13             # Z4SS   -->  Z1SS   MU-    MU+         
      1.50882170E-06    3      1000022        15       -15             # Z4SS   -->  Z1SS   TAU-   TAU+        
      3.24253278E-06    3      1000022        12       -12             # Z4SS   -->  Z1SS   NUE    ANUE        
      3.24253278E-06    3      1000022        14       -14             # Z4SS   -->  Z1SS   NUM    ANUM        
      3.24975963E-06    3      1000022        16       -16             # Z4SS   -->  Z1SS   NUT    ANUT        
      2.69698467E-06    3      1000023         2        -2             # Z4SS   -->  Z2SS   UP     UB          
      2.96591611E-06    3      1000023         1        -1             # Z4SS   -->  Z2SS   DN     DB          
      2.96591406E-06    3      1000023         3        -3             # Z4SS   -->  Z2SS   ST     SB          
      2.69694237E-06    3      1000023         4        -4             # Z4SS   -->  Z2SS   CH     CB          
      7.18531192E-06    3      1000023         5        -5             # Z4SS   -->  Z2SS   BT     BB          
      2.01076091E-06    3      1000023        11       -11             # Z4SS   -->  Z2SS   E-     E+          
      2.01076091E-06    3      1000023        13       -13             # Z4SS   -->  Z2SS   MU-    MU+         
      2.07606331E-06    3      1000023        15       -15             # Z4SS   -->  Z2SS   TAU-   TAU+        
      3.28531246E-06    3      1000023        12       -12             # Z4SS   -->  Z2SS   NUE    ANUE        
      3.28531246E-06    3      1000023        14       -14             # Z4SS   -->  Z2SS   NUM    ANUM        
      3.29284330E-06    3      1000023        16       -16             # Z4SS   -->  Z2SS   NUT    ANUT        
      5.55843656E-07    3      1000025         2        -2             # Z4SS   -->  Z3SS   UP     UB          
      7.19787010E-07    3      1000025         1        -1             # Z4SS   -->  Z3SS   DN     DB          
      7.19787010E-07    3      1000025         3        -3             # Z4SS   -->  Z3SS   ST     SB          
      5.55843656E-07    3      1000025         4        -4             # Z4SS   -->  Z3SS   CH     CB          
      4.78687809E-07    3      1000025         5        -5             # Z4SS   -->  Z3SS   BT     BB          
      1.63383604E-07    3      1000025        11       -11             # Z4SS   -->  Z3SS   E-     E+          
      1.63383604E-07    3      1000025        13       -13             # Z4SS   -->  Z3SS   MU-    MU+         
      1.52999959E-07    3      1000025        15       -15             # Z4SS   -->  Z3SS   TAU-   TAU+        
      3.22131541E-07    3      1000025        12       -12             # Z4SS   -->  Z3SS   NUE    ANUE        
      3.22131541E-07    3      1000025        14       -14             # Z4SS   -->  Z3SS   NUM    ANUM        
      3.22128102E-07    3      1000025        16       -16             # Z4SS   -->  Z3SS   NUT    ANUT        
      1.07948460E-01    2      1000022        25                       # Z4SS   -->  Z1SS   HL0                
      1.54877469E-01    2      1000023        25                       # Z4SS   -->  Z2SS   HL0                
#         PDG         Width
DECAY   1000024  1.82343847E-05   # W1SS+ decays
#          BR          NDA       ID1       ID2       ID3       ID4
      3.33520919E-01    3      1000022         2        -1             # W1SS+  -->  Z1SS   UP     DB          
      3.33520919E-01    3      1000022         4        -3             # W1SS+  -->  Z1SS   CH     SB          
      1.10984318E-01    3      1000022       -11        12             # W1SS+  -->  Z1SS   E+     NUE         
      1.10984318E-01    3      1000022       -13        14             # W1SS+  -->  Z1SS   MU+    NUM         
      1.10989518E-01    3      1000022       -15        16             # W1SS+  -->  Z1SS   TAU+   NUT         
#         PDG         Width
DECAY   1000037  2.28548765E+00   # W2SS+ decays
#          BR          NDA       ID1       ID2       ID3       ID4
      6.51385960E-07    3      1000022         2        -1             # W2SS+  -->  Z1SS   UP     DB          
      6.51385562E-07    3      1000022         4        -3             # W2SS+  -->  Z1SS   CH     SB          
      1.84134672E-06    3      1000022       -11        12             # W2SS+  -->  Z1SS   E+     NUE         
      1.84134672E-06    3      1000022       -13        14             # W2SS+  -->  Z1SS   MU+    NUM         
      1.98849079E-06    3      1000022       -15        16             # W2SS+  -->  Z1SS   TAU+   NUT         
      3.12661231E-02    2      1000022        24                       # W2SS+  -->  Z1SS   W+                 
      2.85326814E-06    3      1000023         2        -1             # W2SS+  -->  Z2SS   UP     DB          
      2.85325677E-06    3      1000023         4        -3             # W2SS+  -->  Z2SS   CH     SB          
      3.57935050E-06    3      1000023       -11        12             # W2SS+  -->  Z2SS   E+     NUE         
      3.57935050E-06    3      1000023       -13        14             # W2SS+  -->  Z2SS   MU+    NUM         
      3.62667970E-06    3      1000023       -15        16             # W2SS+  -->  Z2SS   TAU+   NUT         
      4.06923622E-01    2      1000023        24                       # W2SS+  -->  Z2SS   W+                 
      8.56583029E-07    3      1000025         2        -1             # W2SS+  -->  Z3SS   UP     DB          
      8.56583029E-07    3      1000025         4        -3             # W2SS+  -->  Z3SS   CH     SB          
      2.85248433E-07    3      1000025       -11        12             # W2SS+  -->  Z3SS   E+     NUE         
      2.85248433E-07    3      1000025       -13        14             # W2SS+  -->  Z3SS   MU+    NUM         
      2.85289701E-07    3      1000025       -15        16             # W2SS+  -->  Z3SS   TAU+   NUT         
      3.23445588E-01    2      1000024        23                       # W2SS+  -->  W1SS+  Z0                 
      2.60256661E-06    3      1000024         1        -1             # W2SS+  -->  W1SS+  DN     DB          
      2.60252637E-06    3      1000024         3        -3             # W2SS+  -->  W1SS+  ST     SB          
      6.23953201E-06    3      1000024         2        -2             # W2SS+  -->  W1SS+  UP     UB          
      6.23952837E-06    3      1000024         4        -4             # W2SS+  -->  W1SS+  CH     CB          
      5.96051450E-06    3      1000024        12       -12             # W2SS+  -->  W1SS+  NUE    ANUE        
      5.96051450E-06    3      1000024        14       -14             # W2SS+  -->  W1SS+  NUM    ANUM        
      6.61234117E-06    3      1000024        16       -16             # W2SS+  -->  W1SS+  NUT    ANUT        
      2.57138618E-06    3      1000024        11       -11             # W2SS+  -->  W1SS+  E-     E+          
      2.57138618E-06    3      1000024        13       -13             # W2SS+  -->  W1SS+  MU-    MU+         
      2.57733359E-06    3      1000024        15       -15             # W2SS+  -->  W1SS+  TAU-   TAU+        
      2.38294661E-01    2      1000024        25                       # W2SS+  -->  W1SS+  HL0                
#         PDG         Width
DECAY        25  3.37575469E-03   # HL0   decays
#          BR          NDA       ID1       ID2       ID3       ID4
      5.08019182E-09    2           11       -11                       # HL0    -->  E-     E+                 
      2.14493237E-04    2           13       -13                       # HL0    -->  MU-    MU+                
      6.12998158E-02    2           15       -15                       # HL0    -->  TAU-   TAU+               
      6.39732798E-06    2            1        -1                       # HL0    -->  DN     DB                 
      2.58483901E-03    2            3        -3                       # HL0    -->  ST     SB                 
      8.73180628E-01    2            5        -5                       # HL0    -->  BT     BB                 
      1.86639011E-06    2            2        -2                       # HL0    -->  UP     UB                 
      3.63232642E-02    2            4        -4                       # HL0    -->  CH     CB                 
      1.11165689E-03    2           22        22                       # HL0    -->  GM     GM                 
      2.47533582E-02    2           21        21                       # HL0    -->  GL     GL                 
      2.90934513E-05    3           24        11       -12             # HL0    -->  W+     E-     ANUE        
      2.90934513E-05    3           24        13       -14             # HL0    -->  W+     MU-    ANUM        
      2.90934513E-05    3           24        15       -16             # HL0    -->  W+     TAU-   ANUT        
      8.72803503E-05    3           24        -2         1             # HL0    -->  W+     UB     DN          
      8.72803503E-05    3           24        -4         3             # HL0    -->  W+     CB     ST          
      2.90934513E-05    3          -24       -11        12             # HL0    -->  W-     E+     NUE         
      2.90934513E-05    3          -24       -13        14             # HL0    -->  W-     MU+    NUM         
      2.90934513E-05    3          -24       -15        16             # HL0    -->  W-     TAU+   NUT         
      8.72803503E-05    3          -24         2        -1             # HL0    -->  W-     UP     DB          
      8.72803503E-05    3          -24         4        -3             # HL0    -->  W-     CH     SB          
#         PDG         Width
DECAY        35  6.27192497E+00   # HH0   decays
#          BR          NDA       ID1       ID2       ID3       ID4
      1.40475881E-10    2           11       -11                       # HH0    -->  E-     E+                 
      5.93114419E-06    2           13       -13                       # HH0    -->  MU-    MU+                
      1.69867580E-03    2           15       -15                       # HH0    -->  TAU-   TAU+               
      1.72912337E-07    2            1        -1                       # HH0    -->  DN     DB                 
      6.98653312E-05    2            3        -3                       # HH0    -->  ST     SB                 
      1.07420357E-02    2            5        -5                       # HH0    -->  BT     BB                 
      7.49115270E-10    2            2        -2                       # HH0    -->  UP     UB                 
      1.12766320E-05    2            4        -4                       # HH0    -->  CH     CB                 
      3.48539650E-01    2            6        -6                       # HH0    -->  TP     TB                 
      5.07954428E-06    2           22        22                       # HH0    -->  GM     GM                 
      4.93071915E-04    2           21        21                       # HH0    -->  GL     GL                 
      1.81168539E-03    2           24       -24                       # HH0    -->  W+     W-                 
      9.00109997E-04    2           23        23                       # HH0    -->  Z0     Z0                 
      7.78884068E-03    2      1000022   1000022                       # HH0    -->  Z1SS   Z1SS               
      2.06367858E-02    2      1000022   1000023                       # HH0    -->  Z1SS   Z2SS               
      8.05988982E-02    2      1000022   1000025                       # HH0    -->  Z1SS   Z3SS               
      6.70350995E-03    2      1000022   1000035                       # HH0    -->  Z1SS   Z4SS               
      1.34196654E-02    2      1000023   1000023                       # HH0    -->  Z2SS   Z2SS               
      1.07068241E-01    2      1000023   1000025                       # HH0    -->  Z2SS   Z3SS               
      6.26899814E-03    2      1000023   1000035                       # HH0    -->  Z2SS   Z4SS               
      5.16692325E-02    2      1000024  -1000024                       # HH0    -->  W1SS+  W1SS-              
      1.68029860E-01    2      1000024  -1000037                       # HH0    -->  W1SS+  W2SS-              
      1.68029860E-01    2     -1000024   1000037                       # HH0    -->  W1SS-  W2SS+              
      5.50851785E-03    2           25        25                       # HH0    -->  HL0    HL0                
#         PDG         Width
DECAY        36  6.77954006E+00   # HA0   decays
#          BR          NDA       ID1       ID2       ID3       ID4
      1.29757746E-10    2           11       -11                       # HA0    -->  E-     E+                 
      5.47860554E-06    2           13       -13                       # HA0    -->  MU-    MU+                
      1.56912685E-03    2           15       -15                       # HA0    -->  TAU-   TAU+               
      1.59735862E-07    2            1        -1                       # HA0    -->  DN     DB                 
      6.45413747E-05    2            3        -3                       # HA0    -->  ST     SB                 
      9.92488023E-03    2            5        -5                       # HA0    -->  BT     BB                 
      6.30991148E-10    2            2        -2                       # HA0    -->  UP     UB                 
      9.51183301E-06    2            4        -4                       # HA0    -->  CH     CB                 
      4.34099317E-01    2            6        -6                       # HA0    -->  TP     TB                 
      1.63387278E-06    2           22        22                       # HA0    -->  GM     GM                 
      4.19869612E-04    2           21        21                       # HA0    -->  GL     GL                 
      1.43739218E-02    2      1000022   1000022                       # HA0    -->  Z1SS   Z1SS               
      4.26617749E-02    2      1000022   1000023                       # HA0    -->  Z1SS   Z2SS               
      1.16908494E-02    2      1000022   1000025                       # HA0    -->  Z1SS   Z3SS               
      4.44488302E-02    2      1000022   1000035                       # HA0    -->  Z1SS   Z4SS               
      3.16419639E-02    2      1000023   1000023                       # HA0    -->  Z2SS   Z2SS               
      1.15001015E-02    2      1000023   1000025                       # HA0    -->  Z2SS   Z3SS               
      5.63793518E-02    2      1000023   1000035                       # HA0    -->  Z2SS   Z4SS               
      1.17750302E-01    2      1000024  -1000024                       # HA0    -->  W1SS+  W1SS-              
      1.10946164E-01    2      1000024  -1000037                       # HA0    -->  W1SS+  W2SS-              
      1.10946164E-01    2     -1000024   1000037                       # HA0    -->  W1SS-  W2SS+              
      1.56603404E-03    2           25        23                       # HA0    -->  HL0    Z0                 
#         PDG         Width
DECAY        37  6.55977535E+00   # H+    decays
#          BR          NDA       ID1       ID2       ID3       ID4
      1.36234080E-10    2           12       -11                       # H+     -->  NUE    E+                 
      5.75204785E-06    2           14       -13                       # H+     -->  NUM    MU+                
      1.64744433E-03    2           16       -15                       # H+     -->  NUT    TAU+               
      1.54009584E-07    2            2        -1                       # H+     -->  UP     DB                 
      7.10986933E-05    2            4        -3                       # H+     -->  CH     SB                 
      4.06620204E-01    2            6        -5                       # H+     -->  TP     BB                 
      4.60088365E-02    2      1000024   1000022                       # H+     -->  W1SS+  Z1SS               
      2.76359427E-03    2      1000024   1000023                       # H+     -->  W1SS+  Z2SS               
      1.70273349E-01    2      1000024   1000025                       # H+     -->  W1SS+  Z3SS               
      1.51630417E-01    2      1000024   1000035                       # H+     -->  W1SS+  Z4SS               
      1.00402338E-02    2      1000037   1000022                       # H+     -->  W2SS+  Z1SS               
      2.09224790E-01    2      1000037   1000023                       # H+     -->  W2SS+  Z2SS               
      1.71410153E-03    2           25        24                       # H+     -->  HL0    W+                 
