#  ISAJET SUSY parameters in SUSY Les Houches Accord 2 format
#  Created by ISALHA 2.0 Last revision: C. Balazs 21 Apr 2009
Block SPINFO   # Program information
     1   ISASUGRA from ISAJET          # Spectrum Calculator
     2   7.80   29-OCT-2009 12:50:36   # Version number
Block MODSEL   # Model selection
     1     1   # Minimal supergravity (mSUGRA) model               
Block SMINPUTS   # Standard Model inputs
     1     1.27837639E+02   # alpha_em^(-1)
     2     1.16570000E-05   # G_Fermi
     3     1.17200002E-01   # alpha_s(M_Z)
     4     9.11699982E+01   # m_{Z}(pole)
     5     4.19999981E+00   # m_{b}(m_{b})
     6     1.72500000E+02   # m_{top}(pole)
     7     1.77699995E+00   # m_{tau}(pole)
Block MINPAR   # SUSY breaking input parameters
     1     6.80000000E+02   # m_0
     2     3.40000000E+02   # m_{1/2}
     3     4.00000000E+01   # tan(beta)
     4     1.00000000E+00   # sign(mu)
     5     0.00000000E+00   # A_0
Block EXTPAR   # Non-universal SUSY breaking parameters
     0     2.13058102E+16   # Input scale
Block MASS   # Scalar and gaugino mass spectrum
#  PDG code   mass                 particle
        24     8.04229965E+01   #  W^+
        25     1.12836372E+02   #  h^0            
        35     6.03368469E+02   #  H^0            
        36     5.99415283E+02   #  A^0            
        37     6.09627686E+02   #  H^+            
   1000001     9.98308228E+02   #  dnl            
   1000002     9.95027771E+02   #  upl            
   1000003     9.98308228E+02   #  stl            
   1000004     9.95028687E+02   #  chl            
   1000005     8.23819031E+02   #  b1             
   1000006     6.93582397E+02   #  t1             
   1000011     7.17054260E+02   #  el-            
   1000012     7.12235291E+02   #  nuel           
   1000013     7.17054260E+02   #  mul-           
   1000014     7.12235291E+02   #  numl           
   1000015     5.65184448E+02   #  tau1           
   1000016     6.57907532E+02   #  nutl           
   1000021     8.41047302E+02   #  glss           
   1000022     1.38759583E+02   #  z1ss           
   1000023     2.59151794E+02   #  z2ss           
   1000024     2.59777435E+02   #  w1ss           
   1000025    -4.26170013E+02   #  z3ss           
   1000035     4.44027008E+02   #  z4ss           
   1000037     4.44134827E+02   #  w2ss           
   2000001     9.78916931E+02   #  dnr            
   2000002     9.79799438E+02   #  upr            
   2000003     9.78916931E+02   #  str            
   2000004     9.79800415E+02   #  chr            
   2000005     8.96226074E+02   #  b2             
   2000006     8.65615479E+02   #  t2             
   2000011     6.92066162E+02   #  er-            
   2000013     6.92066162E+02   #  mur-           
   2000015     6.68638550E+02   #  tau2           
Block ALPHA   # Effective Higgs mixing parameter
         -2.58219521E-02   # alpha
Block STOPMIX   # stop mixing matrix
  1  1     3.73002410E-01   # O_{11}
  1  2     9.27830398E-01   # O_{12}
  2  1    -9.27830398E-01   # O_{21}
  2  2     3.73002410E-01   # O_{22}
Block SBOTMIX   # sbottom mixing matrix
  1  1     9.36804950E-01   # O_{11}
  1  2     3.49852145E-01   # O_{12}
  2  1    -3.49852145E-01   # O_{21}
  2  2     9.36804950E-01   # O_{22}
Block STAUMIX   # stau mixing matrix
  1  1     2.55895436E-01   # O_{11}
  1  2     9.66704488E-01   # O_{12}
  2  1    -9.66704488E-01   # O_{21}
  2  2     2.55895436E-01   # O_{22}
Block NMIX   # neutralino mixing matrix
  1  1     9.91354585E-01   #
  1  2    -2.71545667E-02   #
  1  3     1.21243320E-01   #
  1  4    -4.21791226E-02   #
  2  1     6.68480098E-02   #
  2  2     9.43199635E-01   #
  2  3    -2.74565548E-01   #
  2  4     1.74698949E-01   #
  3  1     5.32726273E-02   #
  3  2    -7.60235265E-02   #
  3  3    -6.99216425E-01   #
  3  4    -7.08857417E-01   #
  4  1     9.95478481E-02   #
  4  2    -3.22269589E-01   #
  4  3    -6.48852885E-01   #
  4  4     6.82072163E-01   #
Block UMIX   # chargino U mixing matrix
  1  1    -9.20853972E-01   # U_{11}
  1  2     3.89907569E-01   # U_{12}
  2  1    -3.89907569E-01   # U_{21}
  2  2    -9.20853972E-01   # U_{22}
Block VMIX   # chargino V mixing matrix
  1  1    -9.68734324E-01   # V_{11}
  1  2     2.48100311E-01   # V_{12}
  2  1    -2.48100311E-01   # V_{21}
  2  2    -9.68734324E-01   # V_{22}
Block GAUGE Q=  7.36307556E+02   #
     1     3.57523620E-01   # g`
     2     6.52371526E-01   # g_2
     3     1.21931255E+00   # g_3
Block YU Q=  7.36307556E+02   #
  3  3     8.64553213E-01   # y_t
Block YD Q=  7.36307556E+02   #
  3  3     5.03698885E-01   # y_b
Block YE Q=  7.36307556E+02   #
  3  3     4.19133365E-01   # y_tau
Block HMIX Q=  7.36307556E+02   # Higgs mixing parameters
     1     4.18675720E+02   # mu(Q)
     2     4.00000000E+01   # tan(beta)(M_GUT)
     3     2.50720367E+02   # Higgs vev at Q
     4     3.59298688E+05   # m_A^2(Q)
Block MSOFT Q=  7.36307556E+02   # DRbar SUSY breaking parameters
     1     1.41429733E+02   # M_1(Q)          
     2     2.64299835E+02   # M_2(Q)          
     3     7.72265198E+02   # M_3(Q)          
    31     7.13313965E+02   # MeL(Q)          
    32     7.13313965E+02   # MmuL(Q)         
    33     6.59938477E+02   # MtauL(Q)        
    34     6.90018799E+02   # MeR(Q)          
    35     6.90018799E+02   # MmuR(Q)         
    36     5.73024536E+02   # MtauR(Q)        
    41     9.56654724E+02   # MqL1(Q)         
    42     9.56654724E+02   # MqL2(Q)         
    43     7.97189270E+02   # MqL3(Q)         
    44     9.40375366E+02   # MuR(Q)          
    45     9.40375366E+02   # McR(Q)          
    46     6.80075378E+02   # MtR(Q)          
    47     9.38454529E+02   # MdR(Q)          
    48     9.38454529E+02   # MsR(Q)          
    49     8.57088623E+02   # MbR(Q)          
Block AU Q=  7.36307556E+02   #
  1  1    -5.93560486E+02   # A_u
  2  2    -5.93560486E+02   # A_c
  3  3    -5.93560486E+02   # A_t
Block AD Q=  7.36307556E+02   #
  1  1    -7.82262695E+02   # A_d
  2  2    -7.82262695E+02   # A_s
  3  3    -7.82262695E+02   # A_b
Block AE Q=  7.36307556E+02   #
  1  1    -1.21135300E+02   # A_e
  2  2    -1.21135300E+02   # A_mu
  3  3    -1.21135300E+02   # A_tau
#  ISAJET decay tables in SUSY Les Houches accord format
#  Created by ISALHD. Last revision: C. Balazs, 2005 May 25
Block DCINFO                           # Program information
     1   ISASUGRA from ISAJET          # Spectrum Calculator
     2   7.80   29-OCT-2009 12:50:36   # Version number
#         PDG         Width
DECAY         6  1.14680779E+00   # TP    decays
#          BR          NDA       ID1       ID2       ID3       ID4
      3.33333343E-01    3            2        -1         5             # TP     -->  UP     DB     BT          
      3.33333343E-01    3            4        -3         5             # TP     -->  CH     SB     BT          
      1.11111112E-01    3          -11        12         5             # TP     -->  E+     NUE    BT          
      1.11111112E-01    3          -13        14         5             # TP     -->  MU+    NUM    BT          
      1.11111112E-01    3          -15        16         5             # TP     -->  TAU+   NUT    BT          
#         PDG         Width
DECAY   1000021  8.21994171E-02   # GLSS  decays
#          BR          NDA       ID1       ID2       ID3       ID4
      4.16690335E-02    3      1000024         1        -2             # GLSS   -->  W1SS+  DN     UB          
      4.16690335E-02    3     -1000024         2        -1             # GLSS   -->  W1SS-  UP     DB          
      4.16688956E-02    3      1000024         3        -4             # GLSS   -->  W1SS+  ST     CB          
      4.16688956E-02    3     -1000024         4        -3             # GLSS   -->  W1SS-  CH     SB          
      2.95709763E-02    3      1000024         5        -6             # GLSS   -->  W1SS+  BT     TB          
      2.95709763E-02    3     -1000024         6        -5             # GLSS   -->  W1SS-  TP     BB          
      1.73231564E-03    3      1000037         1        -2             # GLSS   -->  W2SS+  DN     UB          
      1.73231564E-03    3     -1000037         2        -1             # GLSS   -->  W2SS-  UP     DB          
      1.73231144E-03    3      1000037         3        -4             # GLSS   -->  W2SS+  ST     CB          
      1.73231144E-03    3     -1000037         4        -3             # GLSS   -->  W2SS-  CH     SB          
      7.14223683E-02    3      1000037         5        -6             # GLSS   -->  W2SS+  BT     TB          
      7.14223683E-02    3     -1000037         6        -5             # GLSS   -->  W2SS-  TP     BB          
      4.51334199E-06    2      1000022        21                       # GLSS   -->  Z1SS   GL                 
      1.92536972E-02    3      1000022         2        -2             # GLSS   -->  Z1SS   UP     UB          
      6.00302825E-03    3      1000022         1        -1             # GLSS   -->  Z1SS   DN     DB          
      6.00302825E-03    3      1000022         3        -3             # GLSS   -->  Z1SS   ST     SB          
      1.92535687E-02    3      1000022         4        -4             # GLSS   -->  Z1SS   CH     CB          
      5.90606499E-03    3      1000022         5        -5             # GLSS   -->  Z1SS   BT     BB          
      7.51272514E-02    3      1000022         6        -6             # GLSS   -->  Z1SS   TP     TB          
      4.15107090E-04    2      1000023        21                       # GLSS   -->  Z2SS   GL                 
      2.16383357E-02    3      1000023         2        -2             # GLSS   -->  Z2SS   UP     UB          
      2.00479906E-02    3      1000023         1        -1             # GLSS   -->  Z2SS   DN     DB          
      2.00479906E-02    3      1000023         3        -3             # GLSS   -->  Z2SS   ST     SB          
      2.16381960E-02    3      1000023         4        -4             # GLSS   -->  Z2SS   CH     CB          
      8.93763965E-04    3      1000023         5        -5             # GLSS   -->  Z2SS   BT     BB          
      2.12514140E-02    3      1000023         6        -6             # GLSS   -->  Z2SS   TP     TB          
      4.83560562E-03    2      1000025        21                       # GLSS   -->  Z3SS   GL                 
      2.62982012E-05    3      1000025         2        -2             # GLSS   -->  Z3SS   UP     UB          
      3.26089103E-05    3      1000025         1        -1             # GLSS   -->  Z3SS   DN     DB          
      3.26089103E-05    3      1000025         3        -3             # GLSS   -->  Z3SS   ST     SB          
      2.62979956E-05    3      1000025         4        -4             # GLSS   -->  Z3SS   CH     CB          
      1.23130120E-02    3      1000025         5        -5             # GLSS   -->  Z3SS   BT     BB          
      2.30670162E-02    3      1000025         6        -6             # GLSS   -->  Z3SS   TP     TB          
      5.31156128E-03    2      1000035        21                       # GLSS   -->  Z4SS   GL                 
      8.34641804E-04    3      1000035         2        -2             # GLSS   -->  Z4SS   UP     UB          
      9.71592148E-04    3      1000035         1        -1             # GLSS   -->  Z4SS   DN     DB          
      9.71592148E-04    3      1000035         3        -3             # GLSS   -->  Z4SS   ST     SB          
      8.34635983E-04    3      1000035         4        -4             # GLSS   -->  Z4SS   CH     CB          
      1.37792351E-02    3      1000035         5        -5             # GLSS   -->  Z4SS   BT     BB          
      1.86796356E-02    3      1000035         6        -6             # GLSS   -->  Z4SS   TP     TB          
      1.52603954E-01    2     -1000005         5                       # GLSS   -->  BB1    BT                 
      1.52603954E-01    2      1000005        -5                       # GLSS   -->  BT1    BB                 
#         PDG         Width
DECAY   1000002  1.58203869E+01   # UPL   decays
#          BR          NDA       ID1       ID2       ID3       ID4
      6.07368629E-03    2      1000022         2                       # UPL    -->  Z1SS   UP                 
      2.10005626E-01    2      1000023         2                       # UPL    -->  Z2SS   UP                 
      7.75096763E-04    2      1000025         2                       # UPL    -->  Z3SS   UP                 
      1.56959016E-02    2      1000035         2                       # UPL    -->  Z4SS   UP                 
      3.15079302E-01    2      1000021         2                       # UPL    -->  GLSS   UP                 
      4.31471258E-01    2      1000024         1                       # UPL    -->  W1SS+  DN                 
      2.08991263E-02    2      1000037         1                       # UPL    -->  W2SS+  DN                 
#         PDG         Width
DECAY   1000001  1.58591022E+01   # DNL   decays
#          BR          NDA       ID1       ID2       ID3       ID4
      1.11076264E-02    2      1000022         1                       # DNL    -->  Z1SS   DN                 
      1.99735731E-01    2      1000023         1                       # DNL    -->  Z2SS   DN                 
      1.30394730E-03    2      1000025         1                       # DNL    -->  Z3SS   DN                 
      1.97690371E-02    2      1000035         1                       # DNL    -->  Z4SS   DN                 
      3.25674832E-01    2      1000021         1                       # DNL    -->  GLSS   DN                 
      3.90578836E-01    2     -1000024         2                       # DNL    -->  W1SS-  UP                 
      5.18300459E-02    2     -1000037         2                       # DNL    -->  W2SS-  UP                 
#         PDG         Width
DECAY   1000003  1.58590708E+01   # STL   decays
#          BR          NDA       ID1       ID2       ID3       ID4
      1.11076487E-02    2      1000022         3                       # STL    -->  Z1SS   ST                 
      1.99736133E-01    2      1000023         3                       # STL    -->  Z2SS   ST                 
      1.30394986E-03    2      1000025         3                       # STL    -->  Z3SS   ST                 
      1.97690763E-02    2      1000035         3                       # STL    -->  Z4SS   ST                 
      3.25675458E-01    2      1000021         3                       # STL    -->  GLSS   ST                 
      3.90577912E-01    2     -1000024         4                       # STL    -->  W1SS-  CH                 
      5.18298484E-02    2     -1000037         4                       # STL    -->  W2SS-  CH                 
#         PDG         Width
DECAY   1000004  1.58202076E+01   # CHL   decays
#          BR          NDA       ID1       ID2       ID3       ID4
      6.07373752E-03    2      1000022         4                       # CHL    -->  Z1SS   CH                 
      2.10007384E-01    2      1000023         4                       # CHL    -->  Z2SS   CH                 
      7.75102642E-04    2      1000025         4                       # CHL    -->  Z3SS   CH                 
      1.56960189E-02    2      1000035         4                       # CHL    -->  Z4SS   CH                 
      3.15071642E-01    2      1000021         4                       # CHL    -->  GLSS   CH                 
      4.31476682E-01    2      1000024         3                       # CHL    -->  W1SS+  ST                 
      2.08994020E-02    2      1000037         3                       # CHL    -->  W2SS+  ST                 
#         PDG         Width
DECAY   1000005  1.47246561E+01   # BT1   decays
#          BR          NDA       ID1       ID2       ID3       ID4
      2.70672832E-02    2      1000022         5                       # BT1    -->  Z1SS   BT                 
      1.96589842E-01    2      1000023         5                       # BT1    -->  Z2SS   BT                 
      6.88128844E-02    2      1000025         5                       # BT1    -->  Z3SS   BT                 
      5.14386259E-02    2      1000035         5                       # BT1    -->  Z4SS   BT                 
      3.21067691E-01    2     -1000024         6                       # BT1    -->  W1SS-  TP                 
      2.98924565E-01    2     -1000037         6                       # BT1    -->  W2SS-  TP                 
      3.60990725E-02    2          -24   1000006                       # BT1    -->  W-     TP1                
#         PDG         Width
DECAY   1000006  8.83211613E+00   # TP1   decays
#          BR          NDA       ID1       ID2       ID3       ID4
      1.30493343E-01    2      1000022         6                       # TP1    -->  Z1SS   TP                 
      8.49375203E-02    2      1000023         6                       # TP1    -->  Z2SS   TP                 
      2.21336156E-01    2      1000025         6                       # TP1    -->  Z3SS   TP                 
      5.67744710E-02    2      1000035         6                       # TP1    -->  Z4SS   TP                 
      2.20703363E-01    2      1000024         5                       # TP1    -->  W1SS+  BT                 
      2.85755128E-01    2      1000037         5                       # TP1    -->  W2SS+  BT                 
#         PDG         Width
DECAY   2000002  6.29261589E+00   # UPR   decays
#          BR          NDA       ID1       ID2       ID3       ID4
      3.32186937E-01    2      1000022         2                       # UPR    -->  Z1SS   UP                 
      1.36051979E-03    2      1000023         2                       # UPR    -->  Z2SS   UP                 
      6.56707212E-04    2      1000025         2                       # UPR    -->  Z3SS   UP                 
      2.20248080E-03    2      1000035         2                       # UPR    -->  Z4SS   UP                 
      6.63593411E-01    2      1000021         2                       # UPR    -->  GLSS   UP                 
#         PDG         Width
DECAY   2000001  4.65902567E+00   # DNR   decays
#          BR          NDA       ID1       ID2       ID3       ID4
      1.12056054E-01    2      1000022         1                       # DNR    -->  Z1SS   DN                 
      4.58851107E-04    2      1000023         1                       # DNR    -->  Z2SS   DN                 
      2.21355804E-04    2      1000025         1                       # DNR    -->  Z3SS   DN                 
      7.42321252E-04    2      1000035         1                       # DNR    -->  Z4SS   DN                 
      8.86521459E-01    2      1000021         1                       # DNR    -->  GLSS   DN                 
#         PDG         Width
DECAY   2000003  4.65902567E+00   # STR   decays
#          BR          NDA       ID1       ID2       ID3       ID4
      1.12056054E-01    2      1000022         3                       # STR    -->  Z1SS   ST                 
      4.58851107E-04    2      1000023         3                       # STR    -->  Z2SS   ST                 
      2.21355804E-04    2      1000025         3                       # STR    -->  Z3SS   ST                 
      7.42321252E-04    2      1000035         3                       # STR    -->  Z4SS   ST                 
      8.86521459E-01    2      1000021         3                       # STR    -->  GLSS   ST                 
#         PDG         Width
DECAY   2000004  6.29242945E+00   # CHR   decays
#          BR          NDA       ID1       ID2       ID3       ID4
      3.32195818E-01    2      1000022         4                       # CHR    -->  Z1SS   CH                 
      1.36055599E-03    2      1000023         4                       # CHR    -->  Z2SS   CH                 
      6.56724093E-04    2      1000025         4                       # CHR    -->  Z3SS   CH                 
      2.20253761E-03    2      1000035         4                       # CHR    -->  Z4SS   CH                 
      6.63584411E-01    2      1000021         4                       # CHR    -->  GLSS   CH                 
#         PDG         Width
DECAY   2000005  8.43266296E+00   # BT2   decays
#          BR          NDA       ID1       ID2       ID3       ID4
      3.78809199E-02    2      1000022         5                       # BT2    -->  Z1SS   BT                 
      6.88331248E-03    2      1000023         5                       # BT2    -->  Z2SS   BT                 
      1.71521291E-01    2      1000025         5                       # BT2    -->  Z3SS   BT                 
      1.78727612E-01    2      1000035         5                       # BT2    -->  Z4SS   BT                 
      8.82157460E-02    2      1000021         5                       # BT2    -->  GLSS   BT                 
      9.14578233E-03    2     -1000024         6                       # BT2    -->  W1SS-  TP                 
      4.60598975E-01    2     -1000037         6                       # BT2    -->  W2SS-  TP                 
      4.70264144E-02    2          -24   1000006                       # BT2    -->  W-     TP1                
#         PDG         Width
DECAY   2000006  1.78000450E+01   # TP2   decays
#          BR          NDA       ID1       ID2       ID3       ID4
      2.31019735E-01    2      1000024         5                       # TP2    -->  W1SS+  BT                 
      2.09536225E-01    2      1000037         5                       # TP2    -->  W2SS+  BT                 
      4.00512628E-02    2           23   1000006                       # TP2    -->  Z0     TP1                
      3.31825092E-02    2           25   1000006                       # TP2    -->  HL0    TP1                
      1.14941839E-02    2      1000022         6                       # TP2    -->  Z1SS   TP                 
      9.54462141E-02    2      1000023         6                       # TP2    -->  Z2SS   TP                 
      1.37447089E-01    2      1000025         6                       # TP2    -->  Z3SS   TP                 
      2.41822645E-01    2      1000035         6                       # TP2    -->  Z4SS   TP                 
#         PDG         Width
DECAY   1000011  7.23714781E+00   # EL-   decays
#          BR          NDA       ID1       ID2       ID3       ID4
      1.03568263E-01    2      1000022        11                       # EL-    -->  Z1SS   E-                 
      3.02703291E-01    2      1000023        11                       # EL-    -->  Z2SS   E-                 
      3.81188060E-04    2      1000025        11                       # EL-    -->  Z3SS   E-                 
      1.13489358E-02    2      1000035        11                       # EL-    -->  Z4SS   E-                 
      5.33823788E-01    2     -1000024        12                       # EL-    -->  W1SS-  NUE                
      4.81744446E-02    2     -1000037        12                       # EL-    -->  W2SS-  NUE                
#         PDG         Width
DECAY   1000013  7.23714781E+00   # MUL-  decays
#          BR          NDA       ID1       ID2       ID3       ID4
      1.03568263E-01    2      1000022        13                       # MUL-   -->  Z1SS   MU-                
      3.02703291E-01    2      1000023        13                       # MUL-   -->  Z2SS   MU-                
      3.81188031E-04    2      1000025        13                       # MUL-   -->  Z3SS   MU-                
      1.13489358E-02    2      1000035        13                       # MUL-   -->  Z4SS   MU-                
      5.33823788E-01    2     -1000024        14                       # MUL-   -->  W1SS-  NUM                
      4.81744446E-02    2     -1000037        14                       # MUL-   -->  W2SS-  NUM                
#         PDG         Width
DECAY   1000015  3.91472602E+00   # TAU1- decays
#          BR          NDA       ID1       ID2       ID3       ID4
      6.28423393E-01    2      1000022        15                       # TAU1-  -->  Z1SS   TAU-               
      9.22159627E-02    2      1000023        15                       # TAU1-  -->  Z2SS   TAU-               
      4.29013856E-02    2      1000025        15                       # TAU1-  -->  Z3SS   TAU-               
      2.27864161E-02    2      1000035        15                       # TAU1-  -->  Z4SS   TAU-               
      1.73534080E-01    2     -1000024        16                       # TAU1-  -->  W1SS-  NUT                
      4.01387215E-02    2     -1000037        16                       # TAU1-  -->  W2SS-  NUT                
#         PDG         Width
DECAY   1000012  7.30244064E+00   # NUEL  decays
#          BR          NDA       ID1       ID2       ID3       ID4
      1.24332853E-01    2      1000022        12                       # NUEL   -->  Z1SS   NUE                
      2.53928035E-01    2      1000023        12                       # NUEL   -->  Z2SS   NUE                
      1.87621033E-03    2      1000025        12                       # NUEL   -->  Z3SS   NUE                
      2.18059309E-02    2      1000035        12                       # NUEL   -->  Z4SS   NUE                
      5.79179406E-01    2      1000024        11                       # NUEL   -->  W1SS+  E-                 
      1.88776106E-02    2      1000037        11                       # NUEL   -->  W2SS+  E-                 
#         PDG         Width
DECAY   1000014  7.30244064E+00   # NUML  decays
#          BR          NDA       ID1       ID2       ID3       ID4
      1.24332853E-01    2      1000022        14                       # NUML   -->  Z1SS   NUM                
      2.53928035E-01    2      1000023        14                       # NUML   -->  Z2SS   NUM                
      1.87621033E-03    2      1000025        14                       # NUML   -->  Z3SS   NUM                
      2.18059309E-02    2      1000035        14                       # NUML   -->  Z4SS   NUM                
      5.79179406E-01    2      1000024        13                       # NUML   -->  W1SS+  MU-                
      1.88776106E-02    2      1000037        13                       # NUML   -->  W2SS+  MU-                
#         PDG         Width
DECAY   1000016  7.23834658E+00   # NUTL  decays
#          BR          NDA       ID1       ID2       ID3       ID4
      1.14299044E-01    2      1000022        16                       # NUTL   -->  Z1SS   NUT                
      2.24379286E-01    2      1000023        16                       # NUTL   -->  Z2SS   NUT                
      1.42914185E-03    2      1000025        16                       # NUTL   -->  Z3SS   NUT                
      1.61204115E-02    2      1000035        16                       # NUTL   -->  Z4SS   NUT                
      5.45513749E-01    2      1000024        15                       # NUTL   -->  W1SS+  TAU-               
      9.45645571E-02    2      1000037        15                       # NUTL   -->  W2SS+  TAU-               
      3.69383860E-03    2           24   1000015                       # NUTL   -->  W+     TAU1-              
#         PDG         Width
DECAY   2000011  3.21443129E+00   # ER-   decays
#          BR          NDA       ID1       ID2       ID3       ID4
      9.91428494E-01    2      1000022        11                       # ER-    -->  Z1SS   E-                 
      3.61736934E-03    2      1000023        11                       # ER-    -->  Z2SS   E-                 
      1.19770877E-03    2      1000025        11                       # ER-    -->  Z3SS   E-                 
      3.75650427E-03    2      1000035        11                       # ER-    -->  Z4SS   E-                 
#         PDG         Width
DECAY   2000013  3.21443129E+00   # MUR-  decays
#          BR          NDA       ID1       ID2       ID3       ID4
      9.91428494E-01    2      1000022        13                       # MUR-   -->  Z1SS   MU-                
      3.61736934E-03    2      1000023        13                       # MUR-   -->  Z2SS   MU-                
      1.19770877E-03    2      1000025        13                       # MUR-   -->  Z3SS   MU-                
      3.75650427E-03    2      1000035        13                       # MUR-   -->  Z4SS   MU-                
#         PDG         Width
DECAY   2000015  6.69830132E+00   # TAU2- decays
#          BR          NDA       ID1       ID2       ID3       ID4
      1.18874535E-01    2      1000022        15                       # TAU2-  -->  Z1SS   TAU-               
      2.57014692E-01    2      1000023        15                       # TAU2-  -->  Z2SS   TAU-               
      6.54509142E-02    2      1000025        15                       # TAU2-  -->  Z3SS   TAU-               
      6.99154288E-02    2      1000035        15                       # TAU2-  -->  Z4SS   TAU-               
      4.13090408E-01    2     -1000024        16                       # TAU2-  -->  W1SS-  NUT                
      7.34596476E-02    2     -1000037        16                       # TAU2-  -->  W2SS-  NUT                
      2.19427911E-03    2           23   1000015                       # TAU2-  -->  Z0     TAU1-              
#         PDG         Width
DECAY   1000023  7.74166360E-03   # Z2SS  decays
#          BR          NDA       ID1       ID2       ID3       ID4
      3.34114679E-06    2      1000022        22                       # Z2SS   -->  Z1SS   GM                 
      2.33738676E-01    2      1000022        23                       # Z2SS   -->  Z1SS   Z0                 
      9.60786110E-07    3      1000022         2        -2             # Z2SS   -->  Z1SS   UP     UB          
      1.55113560E-06    3      1000022         1        -1             # Z2SS   -->  Z1SS   DN     DB          
      1.55113560E-06    3      1000022         3        -3             # Z2SS   -->  Z1SS   ST     SB          
      9.60782359E-07    3      1000022         4        -4             # Z2SS   -->  Z1SS   CH     CB          
      3.40618390E-05    3      1000022         5        -5             # Z2SS   -->  Z1SS   BT     BB          
      1.47483797E-05    3      1000022        11       -11             # Z2SS   -->  Z1SS   E-     E+          
      1.47483797E-05    3      1000022        13       -13             # Z2SS   -->  Z1SS   MU-    MU+         
      5.47171549E-05    3      1000022        15       -15             # Z2SS   -->  Z1SS   TAU-   TAU+        
      1.54160898E-05    3      1000022        12       -12             # Z2SS   -->  Z1SS   NUE    ANUE        
      1.54160898E-05    3      1000022        14       -14             # Z2SS   -->  Z1SS   NUM    ANUM        
      2.18295063E-05    3      1000022        16       -16             # Z2SS   -->  Z1SS   NUT    ANUT        
      7.66081989E-01    2      1000022        25                       # Z2SS   -->  Z1SS   HL0                
#         PDG         Width
DECAY   1000025  1.62543178E+00   # Z3SS  decays
#          BR          NDA       ID1       ID2       ID3       ID4
      3.94615789E-08    2      1000022        22                       # Z3SS   -->  Z1SS   GM                 
      4.26408064E-07    2      1000023        22                       # Z3SS   -->  Z2SS   GM                 
      2.98295617E-01    2      1000024       -24                       # Z3SS   -->  W1SS+  W-                 
      2.98295617E-01    2     -1000024        24                       # Z3SS   -->  W1SS-  W+                 
      1.30634174E-01    2      1000022        23                       # Z3SS   -->  Z1SS   Z0                 
      2.36595541E-01    2      1000023        23                       # Z3SS   -->  Z2SS   Z0                 
      4.24852153E-09    3      1000022         2        -2             # Z3SS   -->  Z1SS   UP     UB          
      1.62718139E-09    3      1000022         1        -1             # Z3SS   -->  Z1SS   DN     DB          
      1.62718139E-09    3      1000022         3        -3             # Z3SS   -->  Z1SS   ST     SB          
      4.24850333E-09    3      1000022         4        -4             # Z3SS   -->  Z1SS   CH     CB          
      1.57060895E-05    3      1000022         5        -5             # Z3SS   -->  Z1SS   BT     BB          
      3.72834990E-08    3      1000022        11       -11             # Z3SS   -->  Z1SS   E-     E+          
      3.72834990E-08    3      1000022        13       -13             # Z3SS   -->  Z1SS   MU-    MU+         
      3.11251279E-05    3      1000022        15       -15             # Z3SS   -->  Z1SS   TAU-   TAU+        
      2.56198760E-08    3      1000022        12       -12             # Z3SS   -->  Z1SS   NUE    ANUE        
      2.56198760E-08    3      1000022        14       -14             # Z3SS   -->  Z1SS   NUM    ANUM        
      3.86416801E-08    3      1000022        16       -16             # Z3SS   -->  Z1SS   NUT    ANUT        
      2.06252704E-09    3      1000023         2        -2             # Z3SS   -->  Z2SS   UP     UB          
      3.22951932E-09    3      1000023         1        -1             # Z3SS   -->  Z2SS   DN     DB          
      3.22951932E-09    3      1000023         3        -3             # Z3SS   -->  Z2SS   ST     SB          
      2.06251838E-09    3      1000023         4        -4             # Z3SS   -->  Z2SS   CH     CB          
      5.53103928E-06    3      1000023         5        -5             # Z3SS   -->  Z2SS   BT     BB          
      1.81111948E-09    3      1000023        11       -11             # Z3SS   -->  Z2SS   E-     E+          
      1.81111948E-09    3      1000023        13       -13             # Z3SS   -->  Z2SS   MU-    MU+         
      2.50660105E-06    3      1000023        15       -15             # Z3SS   -->  Z2SS   TAU-   TAU+        
      8.06779266E-09    3      1000023        12       -12             # Z3SS   -->  Z2SS   NUE    ANUE        
      8.06779266E-09    3      1000023        14       -14             # Z3SS   -->  Z2SS   NUM    ANUM        
      1.25247137E-08    3      1000023        16       -16             # Z3SS   -->  Z2SS   NUT    ANUT        
      2.73367129E-02    2      1000022        25                       # Z3SS   -->  Z1SS   HL0                
      8.78688972E-03    2      1000023        25                       # Z3SS   -->  Z2SS   HL0                
#         PDG         Width
DECAY   1000035  1.92527914E+00   # Z4SS  decays
#          BR          NDA       ID1       ID2       ID3       ID4
      3.78597562E-08    2      1000022        22                       # Z4SS   -->  Z1SS   GM                 
      7.57983898E-08    2      1000023        22                       # Z4SS   -->  Z2SS   GM                 
      2.49341081E-09    2      1000025        22                       # Z4SS   -->  Z3SS   GM                 
      3.29743266E-01    2      1000024       -24                       # Z4SS   -->  W1SS+  W-                 
      3.29743266E-01    2     -1000024        24                       # Z4SS   -->  W1SS-  W+                 
      2.97183748E-02    2      1000022        23                       # Z4SS   -->  Z1SS   Z0                 
      1.88557412E-02    2      1000023        23                       # Z4SS   -->  Z2SS   Z0                 
      5.55616992E-08    3      1000022         2        -2             # Z4SS   -->  Z1SS   UP     UB          
      5.50950432E-08    3      1000022         1        -1             # Z4SS   -->  Z1SS   DN     DB          
      5.50950432E-08    3      1000022         3        -3             # Z4SS   -->  Z1SS   ST     SB          
      5.55614648E-08    3      1000022         4        -4             # Z4SS   -->  Z1SS   CH     CB          
      1.22988395E-05    3      1000022         5        -5             # Z4SS   -->  Z1SS   BT     BB          
      5.90125012E-07    3      1000022        11       -11             # Z4SS   -->  Z1SS   E-     E+          
      5.90125012E-07    3      1000022        13       -13             # Z4SS   -->  Z1SS   MU-    MU+         
      2.85969145E-05    3      1000022        15       -15             # Z4SS   -->  Z1SS   TAU-   TAU+        
      7.84467261E-07    3      1000022        12       -12             # Z4SS   -->  Z1SS   NUE    ANUE        
      7.84467261E-07    3      1000022        14       -14             # Z4SS   -->  Z1SS   NUM    ANUM        
      1.17599620E-06    3      1000022        16       -16             # Z4SS   -->  Z1SS   NUT    ANUT        
      1.62332626E-07    3      1000023         2        -2             # Z4SS   -->  Z2SS   UP     UB          
      1.90386800E-07    3      1000023         1        -1             # Z4SS   -->  Z2SS   DN     DB          
      1.90386800E-07    3      1000023         3        -3             # Z4SS   -->  Z2SS   ST     SB          
      1.62331915E-07    3      1000023         4        -4             # Z4SS   -->  Z2SS   CH     CB          
      5.47203399E-06    3      1000023         5        -5             # Z4SS   -->  Z2SS   BT     BB          
      2.20285699E-07    3      1000023        11       -11             # Z4SS   -->  Z2SS   E-     E+          
      2.20285699E-07    3      1000023        13       -13             # Z4SS   -->  Z2SS   MU-    MU+         
      2.51358756E-06    3      1000023        15       -15             # Z4SS   -->  Z2SS   TAU-   TAU+        
      3.87531230E-07    3      1000023        12       -12             # Z4SS   -->  Z2SS   NUE    ANUE        
      3.87531230E-07    3      1000023        14       -14             # Z4SS   -->  Z2SS   NUM    ANUM        
      6.01698503E-07    3      1000023        16       -16             # Z4SS   -->  Z2SS   NUT    ANUT        
      1.00960968E-07    3      1000025         2        -2             # Z4SS   -->  Z3SS   UP     UB          
      1.30319691E-07    3      1000025         1        -1             # Z4SS   -->  Z3SS   DN     DB          
      1.30319691E-07    3      1000025         3        -3             # Z4SS   -->  Z3SS   ST     SB          
      1.00960968E-07    3      1000025         4        -4             # Z4SS   -->  Z3SS   CH     CB          
      5.36877174E-08    3      1000025         5        -5             # Z4SS   -->  Z3SS   BT     BB          
      2.95708826E-08    3      1000025        11       -11             # Z4SS   -->  Z3SS   E-     E+          
      2.95708826E-08    3      1000025        13       -13             # Z4SS   -->  Z3SS   MU-    MU+         
      2.74472196E-08    3      1000025        15       -15             # Z4SS   -->  Z3SS   TAU-   TAU+        
      5.86890501E-08    3      1000025        12       -12             # Z4SS   -->  Z3SS   NUE    ANUE        
      5.86890501E-08    3      1000025        14       -14             # Z4SS   -->  Z3SS   NUM    ANUM        
      5.86588094E-08    3      1000025        16       -16             # Z4SS   -->  Z3SS   NUT    ANUT        
      9.68789831E-02    2      1000022        25                       # Z4SS   -->  Z1SS   HL0                
      1.95003703E-01    2      1000023        25                       # Z4SS   -->  Z2SS   HL0                
#         PDG         Width
DECAY   1000024  9.49745812E-03   # W1SS+ decays
#          BR          NDA       ID1       ID2       ID3       ID4
      2.02056049E-06    3      1000022         2        -1             # W1SS+  -->  Z1SS   UP     DB          
      2.02055730E-06    3      1000022         4        -3             # W1SS+  -->  Z1SS   CH     SB          
      2.51478341E-05    3      1000022       -11        12             # W1SS+  -->  Z1SS   E+     NUE         
      2.51478341E-05    3      1000022       -13        14             # W1SS+  -->  Z1SS   MU+    NUM         
      6.29075221E-05    3      1000022       -15        16             # W1SS+  -->  Z1SS   TAU+   NUT         
      9.99882698E-01    2      1000022        24                       # W1SS+  -->  Z1SS   W+                 
      4.87771802E-12    3      1000023       -11        12             # W1SS+  -->  Z2SS   E+     NUE         
      4.87771802E-12    3      1000023       -13        14             # W1SS+  -->  Z2SS   MU+    NUM         
#         PDG         Width
DECAY   1000037  1.77023399E+00   # W2SS+ decays
#          BR          NDA       ID1       ID2       ID3       ID4
      8.72851444E-08    3      1000022         2        -1             # W2SS+  -->  Z1SS   UP     DB          
      8.72850592E-08    3      1000022         4        -3             # W2SS+  -->  Z1SS   CH     SB          
      1.07913854E-06    3      1000022       -11        12             # W2SS+  -->  Z1SS   E+     NUE         
      1.07913854E-06    3      1000022       -13        14             # W2SS+  -->  Z1SS   MU+    NUM         
      3.08371709E-05    3      1000022       -15        16             # W2SS+  -->  Z1SS   TAU+   NUT         
      1.16453312E-01    2      1000022        24                       # W2SS+  -->  Z1SS   W+                 
      1.52960894E-07    3      1000023         2        -1             # W2SS+  -->  Z2SS   UP     DB          
      1.52960808E-07    3      1000023         4        -3             # W2SS+  -->  Z2SS   CH     SB          
      2.85521281E-07    3      1000023       -11        12             # W2SS+  -->  Z2SS   E+     NUE         
      2.85521281E-07    3      1000023       -13        14             # W2SS+  -->  Z2SS   MU+    NUM         
      3.82913868E-06    3      1000023       -15        16             # W2SS+  -->  Z2SS   TAU+   NUT         
      3.47771198E-01    2      1000023        24                       # W2SS+  -->  Z2SS   W+                 
      4.00503239E-07    3      1000025         2        -1             # W2SS+  -->  Z3SS   UP     DB          
      4.00503239E-07    3      1000025         4        -3             # W2SS+  -->  Z3SS   CH     SB          
      1.33463161E-07    3      1000025       -11        12             # W2SS+  -->  Z3SS   E+     NUE         
      1.33463161E-07    3      1000025       -13        14             # W2SS+  -->  Z3SS   MU+    NUM         
      1.35939644E-07    3      1000025       -15        16             # W2SS+  -->  Z3SS   TAU+   NUT         
      2.94735040E-17    3      1000035       -11        12             # W2SS+  -->  Z4SS   E+     NUE         
      2.94735040E-17    3      1000035       -13        14             # W2SS+  -->  Z4SS   MU+    NUM         
      3.01453382E-01    2      1000024        23                       # W2SS+  -->  W1SS+  Z0                 
      1.63314624E-07    3      1000024         1        -1             # W2SS+  -->  W1SS+  DN     DB          
      1.63313970E-07    3      1000024         3        -3             # W2SS+  -->  W1SS+  ST     SB          
      3.58995749E-07    3      1000024         2        -2             # W2SS+  -->  W1SS+  UP     UB          
      3.58995749E-07    3      1000024         4        -4             # W2SS+  -->  W1SS+  CH     CB          
      6.10853931E-07    3      1000024        12       -12             # W2SS+  -->  W1SS+  NUE    ANUE        
      6.10853931E-07    3      1000024        14       -14             # W2SS+  -->  W1SS+  NUM    ANUM        
      2.58293903E-06    3      1000024        16       -16             # W2SS+  -->  W1SS+  NUT    ANUT        
      2.83866314E-07    3      1000024        11       -11             # W2SS+  -->  W1SS+  E-     E+          
      2.83866314E-07    3      1000024        13       -13             # W2SS+  -->  W1SS+  MU-    MU+         
      4.42392746E-07    3      1000024        15       -15             # W2SS+  -->  W1SS+  TAU-   TAU+        
      2.34277308E-01    2      1000024        25                       # W2SS+  -->  W1SS+  HL0                
#         PDG         Width
DECAY        25  4.14605904E-03   # HL0   decays
#          BR          NDA       ID1       ID2       ID3       ID4
      4.93604890E-09    2           11       -11                       # HL0    -->  E-     E+                 
      2.08407801E-04    2           13       -13                       # HL0    -->  MU-    MU+                
      5.96027002E-02    2           15       -15                       # HL0    -->  TAU-   TAU+               
      6.19703724E-06    2            1        -1                       # HL0    -->  DN     DB                 
      2.50391336E-03    2            3        -3                       # HL0    -->  ST     SB                 
      8.23044121E-01    2            5        -5                       # HL0    -->  BT     BB                 
      1.85780027E-06    2            2        -2                       # HL0    -->  UP     UB                 
      3.50753143E-02    2            4        -4                       # HL0    -->  CH     CB                 
      1.66488125E-03    2           22        22                       # HL0    -->  GM     GM                 
      3.65901478E-02    2           21        21                       # HL0    -->  GL     GL                 
      2.15573004E-03    3           24        11       -12             # HL0    -->  W+     E-     ANUE        
      2.15573004E-03    3           24        13       -14             # HL0    -->  W+     MU-    ANUM        
      2.15573004E-03    3           24        15       -16             # HL0    -->  W+     TAU-   ANUT        
      6.46718964E-03    3           24        -2         1             # HL0    -->  W+     UB     DN          
      6.46718964E-03    3           24        -4         3             # HL0    -->  W+     CB     ST          
      2.15573004E-03    3          -24       -11        12             # HL0    -->  W-     E+     NUE         
      2.15573004E-03    3          -24       -13        14             # HL0    -->  W-     MU+    NUM         
      2.15573004E-03    3          -24       -15        16             # HL0    -->  W-     TAU+   NUT         
      6.46718964E-03    3          -24         2        -1             # HL0    -->  W-     UP     DB          
      6.46718964E-03    3          -24         4        -3             # HL0    -->  W-     CH     SB          
      1.70925501E-04    3           23        12       -12             # HL0    -->  Z0     NUE    ANUE        
      1.70925501E-04    3           23        14       -14             # HL0    -->  Z0     NUM    ANUM        
      1.70925501E-04    3           23        16       -16             # HL0    -->  Z0     NUT    ANUT        
      8.60250948E-05    3           23        11       -11             # HL0    -->  Z0     E-     E+          
      8.60250948E-05    3           23        13       -13             # HL0    -->  Z0     MU-    MU+         
      8.60250948E-05    3           23        15       -15             # HL0    -->  Z0     TAU-   TAU+        
      2.94714671E-04    3           23         2        -2             # HL0    -->  Z0     UP     UB          
      2.94714671E-04    3           23         4        -4             # HL0    -->  Z0     CH     CB          
      3.79665114E-04    3           23         1        -1             # HL0    -->  Z0     DN     DB          
      3.79665114E-04    3           23         3        -3             # HL0    -->  Z0     ST     SB          
      3.79665114E-04    3           23         5        -5             # HL0    -->  Z0     BT     BB          
#         PDG         Width
DECAY        35  1.53338375E+01   # HH0   decays
#          BR          NDA       ID1       ID2       ID3       ID4
      1.06985860E-08    2           11       -11                       # HH0    -->  E-     E+                 
      4.51713509E-04    2           13       -13                       # HH0    -->  MU-    MU+                
      1.29370973E-01    2           15       -15                       # HH0    -->  TAU-   TAU+               
      1.31644774E-05    2            1        -1                       # HH0    -->  DN     DB                 
      5.31911477E-03    2            3        -3                       # HH0    -->  ST     SB                 
      8.42919469E-01    2            5        -5                       # HH0    -->  BT     BB                 
      1.75614731E-12    2            2        -2                       # HH0    -->  UP     UB                 
      2.63149680E-08    2            4        -4                       # HH0    -->  CH     CB                 
      8.53828038E-04    2            6        -6                       # HH0    -->  TP     TB                 
      1.09946548E-07    2           22        22                       # HH0    -->  GM     GM                 
      1.18496000E-05    2           21        21                       # HH0    -->  GL     GL                 
      2.86700038E-06    2           24       -24                       # HH0    -->  W+     W-                 
      1.42769125E-06    2           23        23                       # HH0    -->  Z0     Z0                 
      1.09483011E-03    2      1000022   1000022                       # HH0    -->  Z1SS   Z1SS               
      4.77972534E-03    2      1000022   1000023                       # HH0    -->  Z1SS   Z2SS               
      6.25301758E-03    2      1000022   1000025                       # HH0    -->  Z1SS   Z3SS               
      2.47244723E-04    2      1000022   1000035                       # HH0    -->  Z1SS   Z4SS               
      2.66168173E-03    2      1000023   1000023                       # HH0    -->  Z2SS   Z2SS               
      6.01574918E-03    2      1000024  -1000024                       # HH0    -->  W1SS+  W1SS-              
      3.29783916E-06    2           25        25                       # HH0    -->  HL0    HL0                
#         PDG         Width
DECAY        36  1.56575031E+01   # HA0   decays
#          BR          NDA       ID1       ID2       ID3       ID4
      1.04092202E-08    2           11       -11                       # HA0    -->  E-     E+                 
      4.39496012E-04    2           13       -13                       # HA0    -->  MU-    MU+                
      1.25876203E-01    2           15       -15                       # HA0    -->  TAU-   TAU+               
      1.28091906E-05    2            1        -1                       # HA0    -->  DN     DB                 
      5.17556118E-03    2            3        -3                       # HA0    -->  ST     SB                 
      8.20279539E-01    2            5        -5                       # HA0    -->  BT     BB                 
      1.60098866E-12    2            2        -2                       # HA0    -->  UP     UB                 
      2.40098164E-08    2            4        -4                       # HA0    -->  CH     CB                 
      1.11172860E-03    2            6        -6                       # HA0    -->  TP     TB                 
      7.22877118E-08    2           22        22                       # HA0    -->  GM     GM                 
      2.51014862E-05    2           21        21                       # HA0    -->  GL     GL                 
      1.39718945E-03    2      1000022   1000022                       # HA0    -->  Z1SS   Z1SS               
      8.27968027E-03    2      1000022   1000023                       # HA0    -->  Z1SS   Z2SS               
      7.50222302E-04    2      1000022   1000025                       # HA0    -->  Z1SS   Z3SS               
      2.69151898E-03    2      1000022   1000035                       # HA0    -->  Z1SS   Z4SS               
      1.03431307E-02    2      1000023   1000023                       # HA0    -->  Z2SS   Z2SS               
      2.36152150E-02    2      1000024  -1000024                       # HA0    -->  W1SS+  W1SS-              
      2.57449278E-06    2           25        23                       # HA0    -->  HL0    Z0                 
#         PDG         Width
DECAY        37  1.24463081E+01   # H+    decays
#          BR          NDA       ID1       ID2       ID3       ID4
      1.33179396E-08    2           12       -11                       # H+     -->  NUE    E+                 
      5.62307367E-04    2           14       -13                       # H+     -->  NUM    MU+                
      1.61050737E-01    2           16       -15                       # H+     -->  NUT    TAU+               
      1.49963971E-05    2            2        -1                       # H+     -->  UP     DB                 
      6.05927035E-03    2            4        -3                       # H+     -->  CH     SB                 
      8.13164771E-01    2            6        -5                       # H+     -->  TP     BB                 
      1.52638340E-02    2      1000024   1000022                       # H+     -->  W1SS+  Z1SS               
      4.16552903E-05    2      1000024   1000023                       # H+     -->  W1SS+  Z2SS               
      3.83895636E-03    2      1000037   1000022                       # H+     -->  W2SS+  Z1SS               
      3.44269824E-06    2           25        24                       # H+     -->  HL0    W+                 
