#  ISAJET SUSY parameters in SUSY Les Houches Accord 2 format
#  Created by ISALHA 2.0 Last revision: C. Balazs 21 Apr 2009
Block SPINFO   # Program information
     1   ISASUGRA from ISAJET          # Spectrum Calculator
     2   7.80   29-OCT-2009 12:50:36   # Version number
Block MODSEL   # Model selection
     1     1   # Minimal supergravity (mSUGRA) model               
Block SMINPUTS   # Standard Model inputs
     1     1.27836739E+02   # alpha_em^(-1)
     2     1.16570000E-05   # G_Fermi
     3     1.17200002E-01   # alpha_s(M_Z)
     4     9.11699982E+01   # m_{Z}(pole)
     5     4.19999981E+00   # m_{b}(m_{b})
     6     1.72500000E+02   # m_{top}(pole)
     7     1.77699995E+00   # m_{tau}(pole)
Block MINPAR   # SUSY breaking input parameters
     1     3.20000000E+02   # m_0
     2     1.30000000E+02   # m_{1/2}
     3     4.00000000E+01   # tan(beta)
     4     1.00000000E+00   # sign(mu)
     5     0.00000000E+00   # A_0
Block EXTPAR   # Non-universal SUSY breaking parameters
     0     2.91438871E+16   # Input scale
Block MASS   # Scalar and gaugino mass spectrum
#  PDG code   mass                 particle
        24     8.04229965E+01   #  W^+
        25     1.04848251E+02   #  h^0            
        35     2.59133209E+02   #  H^0            
        36     2.57436218E+02   #  A^0            
        37     2.72447113E+02   #  H^+            
   1000001     4.42766602E+02   #  dnl            
   1000002     4.35340027E+02   #  upl            
   1000003     4.42766663E+02   #  stl            
   1000004     4.35342194E+02   #  chl            
   1000005     3.49619507E+02   #  b1             
   1000006     2.97812469E+02   #  t1             
   1000011     3.34066864E+02   #  el-            
   1000012     3.24089142E+02   #  nuel           
   1000013     3.34066864E+02   #  mul-           
   1000014     3.24089142E+02   #  numl           
   1000015     2.59643158E+02   #  tau1           
   1000016     2.98138641E+02   #  nutl           
   1000021     3.52815948E+02   #  glss           
   1000022     4.68716164E+01   #  z1ss           
   1000023     8.21865311E+01   #  z2ss           
   1000024     8.10866852E+01   #  w1ss           
   1000025    -1.89651611E+02   #  z3ss           
   1000035     2.15280746E+02   #  z4ss           
   1000037     2.16693100E+02   #  w2ss           
   2000001     4.33864532E+02   #  dnr            
   2000002     4.32142029E+02   #  upr            
   2000003     4.33864594E+02   #  str            
   2000004     4.32144196E+02   #  chr            
   2000005     4.01948547E+02   #  b2             
   2000006     4.18561951E+02   #  t2             
   2000011     3.26079681E+02   #  er-            
   2000013     3.26079712E+02   #  mur-           
   2000015     3.18235992E+02   #  tau2           
Block ALPHA   # Effective Higgs mixing parameter
         -2.93429960E-02   # alpha
Block STOPMIX   # stop mixing matrix
  1  1     5.43360293E-01   # O_{11}
  1  2     8.39499593E-01   # O_{12}
  2  1    -8.39499593E-01   # O_{21}
  2  2     5.43360293E-01   # O_{22}
Block SBOTMIX   # sbottom mixing matrix
  1  1     8.66536021E-01   # O_{11}
  1  2     4.99114543E-01   # O_{12}
  2  1    -4.99114543E-01   # O_{21}
  2  2     8.66536021E-01   # O_{22}
Block STAUMIX   # stau mixing matrix
  1  1     4.22683716E-01   # O_{11}
  1  2     9.06277239E-01   # O_{12}
  2  1    -9.06277239E-01   # O_{21}
  2  2     4.22683716E-01   # O_{22}
Block NMIX   # neutralino mixing matrix
  1  1     9.29727018E-01   #
  1  2    -1.51169524E-01   #
  1  3     3.22470188E-01   #
  1  4    -9.36385840E-02   #
  2  1    -2.94841111E-01   #
  2  2    -8.47177088E-01   #
  2  3     3.95795256E-01   #
  2  4    -1.96737662E-01   #
  3  1    -1.26747951E-01   #
  3  2     1.86571300E-01   #
  3  3     6.60774767E-01   #
  3  4     7.15893149E-01   #
  4  1    -1.80585548E-01   #
  4  2     4.73951310E-01   #
  4  3     5.50214171E-01   #
  4  4    -6.63342535E-01   #
Block UMIX   # chargino U mixing matrix
  1  1    -7.78175473E-01   # U_{11}
  1  2     6.28046930E-01   # U_{12}
  2  1    -6.28046930E-01   # U_{21}
  2  2    -7.78175473E-01   # U_{22}
Block VMIX   # chargino V mixing matrix
  1  1    -9.51403618E-01   # V_{11}
  1  2     3.07946593E-01   # V_{12}
  2  1    -3.07946593E-01   # V_{21}
  2  2    -9.51403618E-01   # V_{22}
Block GAUGE Q=  3.16352051E+02   #
     1     3.57524931E-01   # g`
     2     6.52373612E-01   # g_2
     3     1.21924758E+00   # g_3
Block YU Q=  3.16352051E+02   #
  3  3     8.95896912E-01   # y_t
Block YD Q=  3.16352051E+02   #
  3  3     5.28922498E-01   # y_b
Block YE Q=  3.16352051E+02   #
  3  3     4.14234579E-01   # y_tau
Block HMIX Q=  3.16352051E+02   # Higgs mixing parameters
     1     1.75458450E+02   # mu(Q)
     2     4.00000000E+01   # tan(beta)(M_GUT)
     3     2.49958145E+02   # Higgs vev at Q
     4     6.62734062E+04   # m_A^2(Q)
Block MSOFT Q=  3.16352051E+02   # DRbar SUSY breaking parameters
     1     5.18734474E+01   # M_1(Q)          
     2     9.90947342E+01   # M_2(Q)          
     3     3.18473846E+02   # M_3(Q)          
    31     3.30146698E+02   # MeL(Q)          
    32     3.30146698E+02   # MmuL(Q)         
    33     3.04964478E+02   # MtauL(Q)        
    34     3.22897675E+02   # MeR(Q)          
    35     3.22897675E+02   # MmuR(Q)         
    36     2.68346710E+02   # MtauR(Q)        
    41     4.22303680E+02   # MqL1(Q)         
    42     4.22303680E+02   # MqL2(Q)         
    43     3.44210632E+02   # MqL3(Q)         
    44     4.17189117E+02   # MuR(Q)          
    45     4.17189117E+02   # McR(Q)          
    46     2.90748169E+02   # MtR(Q)          
    47     4.16627258E+02   # MdR(Q)          
    48     4.16627258E+02   # MsR(Q)          
    49     3.76489655E+02   # MbR(Q)          
Block AU Q=  3.16352051E+02   #
  1  1    -2.47367432E+02   # A_u
  2  2    -2.47367432E+02   # A_c
  3  3    -2.47367432E+02   # A_t
Block AD Q=  3.16352051E+02   #
  1  1    -3.30674316E+02   # A_d
  2  2    -3.30674316E+02   # A_s
  3  3    -3.30674316E+02   # A_b
Block AE Q=  3.16352051E+02   #
  1  1    -4.46560249E+01   # A_e
  2  2    -4.46560249E+01   # A_mu
  3  3    -4.46560249E+01   # A_tau
#  ISAJET decay tables in SUSY Les Houches accord format
#  Created by ISALHD. Last revision: C. Balazs, 2005 May 25
Block DCINFO                           # Program information
     1   ISASUGRA from ISAJET          # Spectrum Calculator
     2   7.80   29-OCT-2009 12:50:36   # Version number
#         PDG         Width
DECAY         6  1.14680779E+00   # TP    decays
#          BR          NDA       ID1       ID2       ID3       ID4
      3.33333343E-01    3            2        -1         5             # TP     -->  UP     DB     BT          
      3.33333343E-01    3            4        -3         5             # TP     -->  CH     SB     BT          
      1.11111112E-01    3          -11        12         5             # TP     -->  E+     NUE    BT          
      1.11111112E-01    3          -13        14         5             # TP     -->  MU+    NUM    BT          
      1.11111112E-01    3          -15        16         5             # TP     -->  TAU+   NUT    BT          
#         PDG         Width
DECAY   1000021  2.29065940E-02   # GLSS  decays
#          BR          NDA       ID1       ID2       ID3       ID4
      5.23770154E-02    3      1000024         1        -2             # GLSS   -->  W1SS+  DN     UB          
      5.23770154E-02    3     -1000024         2        -1             # GLSS   -->  W1SS-  UP     DB          
      5.23760282E-02    3      1000024         3        -4             # GLSS   -->  W1SS+  ST     CB          
      5.23760282E-02    3     -1000024         4        -3             # GLSS   -->  W1SS-  CH     SB          
      7.04770461E-02    3      1000024         5        -6             # GLSS   -->  W1SS+  BT     TB          
      7.04770461E-02    3     -1000024         6        -5             # GLSS   -->  W1SS-  TP     BB          
      2.17599585E-03    3      1000037         1        -2             # GLSS   -->  W2SS+  DN     UB          
      2.17599585E-03    3     -1000037         2        -1             # GLSS   -->  W2SS-  UP     DB          
      2.17597140E-03    3      1000037         3        -4             # GLSS   -->  W2SS+  ST     CB          
      2.17597140E-03    3     -1000037         4        -3             # GLSS   -->  W2SS-  CH     SB          
      9.33805422E-04    2      1000022        21                       # GLSS   -->  Z1SS   GL                 
      2.01145615E-02    3      1000022         2        -2             # GLSS   -->  Z1SS   UP     UB          
      8.77111871E-03    3      1000022         1        -1             # GLSS   -->  Z1SS   DN     DB          
      8.77111126E-03    3      1000022         3        -3             # GLSS   -->  Z1SS   ST     SB          
      2.01139450E-02    3      1000022         4        -4             # GLSS   -->  Z1SS   CH     CB          
      1.31684080E-01    3      1000022         5        -5             # GLSS   -->  Z1SS   BT     BB          
      3.26245814E-03    2      1000023        21                       # GLSS   -->  Z2SS   GL                 
      3.10604349E-02    3      1000023         2        -2             # GLSS   -->  Z2SS   UP     UB          
      2.09016334E-02    3      1000023         1        -1             # GLSS   -->  Z2SS   DN     DB          
      2.09016167E-02    3      1000023         3        -3             # GLSS   -->  Z2SS   ST     SB          
      3.10594849E-02    3      1000023         4        -4             # GLSS   -->  Z2SS   CH     CB          
      2.42446750E-01    3      1000023         5        -5             # GLSS   -->  Z2SS   BT     BB          
      6.26705447E-03    2      1000025        21                       # GLSS   -->  Z3SS   GL                 
      1.44622449E-04    3      1000025         2        -2             # GLSS   -->  Z3SS   UP     UB          
      1.65474325E-04    3      1000025         1        -1             # GLSS   -->  Z3SS   DN     DB          
      1.65474135E-04    3      1000025         3        -3             # GLSS   -->  Z3SS   ST     SB          
      1.44616919E-04    3      1000025         4        -4             # GLSS   -->  Z3SS   CH     CB          
      5.84271587E-02    3      1000025         5        -5             # GLSS   -->  Z3SS   BT     BB          
      2.60434044E-03    2      1000035        21                       # GLSS   -->  Z4SS   GL                 
      1.14698510E-03    3      1000035         2        -2             # GLSS   -->  Z4SS   UP     UB          
      1.24841998E-03    3      1000035         1        -1             # GLSS   -->  Z4SS   DN     DB          
      1.24841870E-03    3      1000035         3        -3             # GLSS   -->  Z4SS   ST     SB          
      1.14694261E-03    3      1000035         4        -4             # GLSS   -->  Z4SS   CH     CB          
      2.81053986E-02    3      1000035         5        -5             # GLSS   -->  Z4SS   BT     BB          
#         PDG         Width
DECAY   1000002  8.35027790E+00   # UPL   decays
#          BR          NDA       ID1       ID2       ID3       ID4
      7.87295867E-05    2      1000022         2                       # UPL    -->  Z1SS   UP                 
      1.65750310E-01    2      1000023         2                       # UPL    -->  Z2SS   UP                 
      3.84399109E-03    2      1000025         2                       # UPL    -->  Z3SS   UP                 
      2.43430659E-02    2      1000035         2                       # UPL    -->  Z4SS   UP                 
      4.12236899E-01    2      1000021         2                       # UPL    -->  GLSS   UP                 
      3.70194763E-01    2      1000024         1                       # UPL    -->  W1SS+  DN                 
      2.35522408E-02    2      1000037         1                       # UPL    -->  W2SS+  DN                 
#         PDG         Width
DECAY   1000001  8.52762794E+00   # DNL   decays
#          BR          NDA       ID1       ID2       ID3       ID4
      2.20870338E-02    2      1000022         1                       # DNL    -->  Z1SS   DN                 
      1.28181547E-01    2      1000023         1                       # DNL    -->  Z2SS   DN                 
      6.41332660E-03    2      1000025         1                       # DNL    -->  Z3SS   DN                 
      3.27611975E-02    2      1000035         1                       # DNL    -->  Z4SS   DN                 
      4.63608027E-01    2      1000021         1                       # DNL    -->  GLSS   DN                 
      2.47236460E-01    2     -1000024         2                       # DNL    -->  W1SS-  UP                 
      9.97124389E-02    2     -1000037         2                       # DNL    -->  W2SS-  UP                 
#         PDG         Width
DECAY   1000003  8.52756214E+00   # STL   decays
#          BR          NDA       ID1       ID2       ID3       ID4
      2.20872071E-02    2      1000022         3                       # STL    -->  Z1SS   ST                 
      1.28182575E-01    2      1000023         3                       # STL    -->  Z2SS   ST                 
      6.41337782E-03    2      1000025         3                       # STL    -->  Z3SS   ST                 
      3.27614546E-02    2      1000035         3                       # STL    -->  Z4SS   ST                 
      4.63611960E-01    2      1000021         3                       # STL    -->  GLSS   ST                 
      2.47233465E-01    2     -1000024         4                       # STL    -->  W1SS-  CH                 
      9.97100100E-02    2     -1000037         4                       # STL    -->  W2SS-  CH                 
#         PDG         Width
DECAY   1000004  8.34985638E+00   # CHL   decays
#          BR          NDA       ID1       ID2       ID3       ID4
      7.87324316E-05    2      1000022         4                       # CHL    -->  Z1SS   CH                 
      1.65756181E-01    2      1000023         4                       # CHL    -->  Z2SS   CH                 
      3.84411030E-03    2      1000025         4                       # CHL    -->  Z3SS   CH                 
      2.43437551E-02    2      1000035         4                       # CHL    -->  Z4SS   CH                 
      4.12207931E-01    2      1000021         4                       # CHL    -->  GLSS   CH                 
      3.70215595E-01    2      1000024         3                       # CHL    -->  W1SS+  ST                 
      2.35537030E-02    2      1000037         3                       # CHL    -->  W2SS+  ST                 
#         PDG         Width
DECAY   1000005  3.45556045E+00   # BT1   decays
#          BR          NDA       ID1       ID2       ID3       ID4
      1.87329367E-01    2      1000022         5                       # BT1    -->  Z1SS   BT                 
      3.60962689E-01    2      1000023         5                       # BT1    -->  Z2SS   BT                 
      9.56900120E-02    2      1000025         5                       # BT1    -->  Z3SS   BT                 
      4.68984358E-02    2      1000035         5                       # BT1    -->  Z4SS   BT                 
      3.09119552E-01    2     -1000024         6                       # BT1    -->  W1SS-  TP                 
#         PDG         Width
DECAY   1000006  2.74192524E+00   # TP1   decays
#          BR          NDA       ID1       ID2       ID3       ID4
      7.45070055E-02    2      1000022         6                       # TP1    -->  Z1SS   TP                 
      8.41292515E-02    2      1000023         6                       # TP1    -->  Z2SS   TP                 
      6.50923669E-01    2      1000024         5                       # TP1    -->  W1SS+  BT                 
      1.90440103E-01    2      1000037         5                       # TP1    -->  W2SS+  BT                 
#         PDG         Width
DECAY   2000002  4.15992880E+00   # UPR   decays
#          BR          NDA       ID1       ID2       ID3       ID4
      1.98238894E-01    2      1000022         2                       # UPR    -->  Z1SS   UP                 
      1.89641695E-02    2      1000023         2                       # UPR    -->  Z2SS   UP                 
      2.45931675E-03    2      1000025         2                       # UPR    -->  Z3SS   UP                 
      4.32869419E-03    2      1000035         2                       # UPR    -->  Z4SS   UP                 
      7.76008904E-01    2      1000021         2                       # UPR    -->  GLSS   UP                 
#         PDG         Width
DECAY   2000001  3.57697630E+00   # DNR   decays
#          BR          NDA       ID1       ID2       ID3       ID4
      5.78773096E-02    2      1000022         1                       # DNR    -->  Z1SS   DN                 
      5.53897722E-03    2      1000023         1                       # DNR    -->  Z2SS   DN                 
      7.20596872E-04    2      1000025         1                       # DNR    -->  Z3SS   DN                 
      1.27017486E-03    2      1000035         1                       # DNR    -->  Z4SS   DN                 
      9.34592962E-01    2      1000021         1                       # DNR    -->  GLSS   DN                 
#         PDG         Width
DECAY   2000003  3.57698035E+00   # STR   decays
#          BR          NDA       ID1       ID2       ID3       ID4
      5.78772537E-02    2      1000022         3                       # STR    -->  Z1SS   ST                 
      5.53897163E-03    2      1000023         3                       # STR    -->  Z2SS   ST                 
      7.20596232E-04    2      1000025         3                       # STR    -->  Z3SS   ST                 
      1.27017393E-03    2      1000035         3                       # STR    -->  Z4SS   ST                 
      9.34593022E-01    2      1000021         3                       # STR    -->  GLSS   ST                 
#         PDG         Width
DECAY   2000004  4.15949202E+00   # CHR   decays
#          BR          NDA       ID1       ID2       ID3       ID4
      1.98256761E-01    2      1000022         4                       # CHR    -->  Z1SS   CH                 
      1.89658701E-02    2      1000023         4                       # CHR    -->  Z2SS   CH                 
      2.45952513E-03    2      1000025         4                       # CHR    -->  Z3SS   CH                 
      4.32904856E-03    2      1000035         4                       # CHR    -->  Z4SS   CH                 
      7.75988817E-01    2      1000021         4                       # CHR    -->  GLSS   CH                 
#         PDG         Width
DECAY   2000005  4.11467505E+00   # BT2   decays
#          BR          NDA       ID1       ID2       ID3       ID4
      1.52436700E-02    2      1000022         5                       # BT2    -->  Z1SS   BT                 
      3.90225239E-02    2      1000023         5                       # BT2    -->  Z2SS   BT                 
      1.87055215E-01    2      1000025         5                       # BT2    -->  Z3SS   BT                 
      1.66442648E-01    2      1000035         5                       # BT2    -->  Z4SS   BT                 
      3.18040401E-01    2      1000021         5                       # BT2    -->  GLSS   BT                 
      2.53207162E-02    2     -1000024         6                       # BT2    -->  W1SS-  TP                 
      2.31454551E-01    2     -1000037         6                       # BT2    -->  W2SS-  TP                 
      1.74202155E-02    2          -24   1000006                       # BT2    -->  W-     TP1                
#         PDG         Width
DECAY   2000006  6.75861931E+00   # TP2   decays
#          BR          NDA       ID1       ID2       ID3       ID4
      2.44909927E-01    2      1000024         5                       # TP2    -->  W1SS+  BT                 
      3.44730437E-01    2      1000037         5                       # TP2    -->  W2SS+  BT                 
      2.46445797E-02    2           23   1000006                       # TP2    -->  Z0     TP1                
      1.03794504E-02    2           25   1000006                       # TP2    -->  HL0    TP1                
      9.52911749E-03    2      1000022         6                       # TP2    -->  Z1SS   TP                 
      6.31465763E-02    2      1000023         6                       # TP2    -->  Z2SS   TP                 
      6.51435331E-02    2      1000025         6                       # TP2    -->  Z3SS   TP                 
      2.37516344E-01    2      1000035         6                       # TP2    -->  Z4SS   TP                 
#         PDG         Width
DECAY   1000011  3.39594865E+00   # EL-   decays
#          BR          NDA       ID1       ID2       ID3       ID4
      5.15234545E-02    2      1000022        11                       # EL-    -->  Z1SS   E-                 
      3.72248888E-01    2      1000023        11                       # EL-    -->  Z2SS   E-                 
      2.59932689E-03    2      1000025        11                       # EL-    -->  Z3SS   E-                 
      1.98764447E-02    2      1000035        11                       # EL-    -->  Z4SS   E-                 
      4.44146574E-01    2     -1000024        12                       # EL-    -->  W1SS-  NUE                
      1.09605350E-01    2     -1000037        12                       # EL-    -->  W2SS-  NUE                
#         PDG         Width
DECAY   1000013  3.39594817E+00   # MUL-  decays
#          BR          NDA       ID1       ID2       ID3       ID4
      5.15234508E-02    2      1000022        13                       # MUL-   -->  Z1SS   MU-                
      3.72248828E-01    2      1000023        13                       # MUL-   -->  Z2SS   MU-                
      2.59932620E-03    2      1000025        13                       # MUL-   -->  Z3SS   MU-                
      1.98764335E-02    2      1000035        13                       # MUL-   -->  Z4SS   MU-                
      4.44146633E-01    2     -1000024        14                       # MUL-   -->  W1SS-  NUM                
      1.09605365E-01    2     -1000037        14                       # MUL-   -->  W2SS-  NUM                
#         PDG         Width
DECAY   1000015  2.58797503E+00   # TAU1- decays
#          BR          NDA       ID1       ID2       ID3       ID4
      4.39906150E-01    2      1000022        15                       # TAU1-  -->  Z1SS   TAU-               
      1.99980274E-01    2      1000023        15                       # TAU1-  -->  Z2SS   TAU-               
      2.39155088E-02    2      1000025        15                       # TAU1-  -->  Z3SS   TAU-               
      3.53030721E-03    2      1000035        15                       # TAU1-  -->  Z4SS   TAU-               
      3.30000550E-01    2     -1000024        16                       # TAU1-  -->  W1SS-  NUT                
      2.66723149E-03    2     -1000037        16                       # TAU1-  -->  W2SS-  NUT                
#         PDG         Width
DECAY   1000012  3.56193805E+00   # NUEL  decays
#          BR          NDA       ID1       ID2       ID3       ID4
      1.60977349E-01    2      1000022        12                       # NUEL   -->  Z1SS   NUE                
      1.57396927E-01    2      1000023        12                       # NUEL   -->  Z2SS   NUE                
      1.08726891E-02    2      1000025        12                       # NUEL   -->  Z3SS   NUE                
      3.92871350E-02    2      1000035        12                       # NUEL   -->  Z4SS   NUE                
      6.09256685E-01    2      1000024        11                       # NUEL   -->  W1SS+  E-                 
      2.22092811E-02    2      1000037        11                       # NUEL   -->  W2SS+  E-                 
#         PDG         Width
DECAY   1000014  3.56193757E+00   # NUML  decays
#          BR          NDA       ID1       ID2       ID3       ID4
      1.60977364E-01    2      1000022        14                       # NUML   -->  Z1SS   NUM                
      1.57396957E-01    2      1000023        14                       # NUML   -->  Z2SS   NUM                
      1.08726909E-02    2      1000025        14                       # NUML   -->  Z3SS   NUM                
      3.92871387E-02    2      1000035        14                       # NUML   -->  Z4SS   NUM                
      6.09256625E-01    2      1000024        13                       # NUML   -->  W1SS+  MU-                
      2.22092681E-02    2      1000037        13                       # NUML   -->  W2SS+  MU-                
#         PDG         Width
DECAY   1000016  3.63308930E+00   # NUTL  decays
#          BR          NDA       ID1       ID2       ID3       ID4
      1.44062638E-01    2      1000022        16                       # NUTL   -->  Z1SS   NUT                
      1.38435513E-01    2      1000023        16                       # NUTL   -->  Z2SS   NUT                
      8.03856738E-03    2      1000025        16                       # NUTL   -->  Z3SS   NUT                
      2.59964094E-02    2      1000035        16                       # NUTL   -->  Z4SS   NUT                
      6.30018890E-01    2      1000024        15                       # NUTL   -->  W1SS+  TAU-               
      5.34377731E-02    2      1000037        15                       # NUTL   -->  W2SS+  TAU-               
      1.12793134E-06    3      1000015        16       -15             # NUTL   -->  TAU1-  NUT    TAU+        
      1.12793134E-06    3      1000015        12       -11             # NUTL   -->  TAU1-  NUE    E+          
      1.12793134E-06    3      1000015        14       -13             # NUTL   -->  TAU1-  NUM    MU+         
      3.38379391E-06    3      1000015         2        -1             # NUTL   -->  TAU1-  UP     DB          
      3.38379391E-06    3      1000015         4        -3             # NUTL   -->  TAU1-  CH     SB          
#         PDG         Width
DECAY   2000011  1.53030837E+00   # ER-   decays
#          BR          NDA       ID1       ID2       ID3       ID4
      8.98503542E-01    2      1000022        11                       # ER-    -->  Z1SS   E-                 
      8.26248676E-02    2      1000023        11                       # ER-    -->  Z2SS   E-                 
      7.62403663E-03    2      1000025        11                       # ER-    -->  Z3SS   E-                 
      1.12475725E-02    2      1000035        11                       # ER-    -->  Z4SS   E-                 
#         PDG         Width
DECAY   2000013  1.53030813E+00   # MUR-  decays
#          BR          NDA       ID1       ID2       ID3       ID4
      8.98503542E-01    2      1000022        13                       # MUR-   -->  Z1SS   MU-                
      8.26248676E-02    2      1000023        13                       # MUR-   -->  Z2SS   MU-                
      7.62403663E-03    2      1000025        13                       # MUR-   -->  Z3SS   MU-                
      1.12475697E-02    2      1000035        13                       # MUR-   -->  Z4SS   MU-                
#         PDG         Width
DECAY   2000015  2.86478591E+00   # TAU2- decays
#          BR          NDA       ID1       ID2       ID3       ID4
      1.02826662E-01    2      1000022        15                       # TAU2-  -->  Z1SS   TAU-               
      3.23106021E-01    2      1000023        15                       # TAU2-  -->  Z2SS   TAU-               
      9.40985680E-02    2      1000025        15                       # TAU2-  -->  Z3SS   TAU-               
      8.19776133E-02    2      1000035        15                       # TAU2-  -->  Z4SS   TAU-               
      2.34584406E-01    2     -1000024        16                       # TAU2-  -->  W1SS-  NUT                
      1.63406745E-01    2     -1000037        16                       # TAU2-  -->  W2SS-  NUT                
#         PDG         Width
DECAY   1000023  1.17240677E-06   # Z2SS  decays
#          BR          NDA       ID1       ID2       ID3       ID4
      5.37106814E-03    2      1000022        22                       # Z2SS   -->  Z1SS   GM                 
      1.64398386E-06    3     -1000024         2        -1             # Z2SS   -->  W1SS-  UP     DB          
      5.47994659E-07    3     -1000024        12       -11             # Z2SS   -->  W1SS-  NUE    E+          
      5.47994659E-07    3     -1000024        14       -13             # Z2SS   -->  W1SS-  NUM    MU+         
      1.64398386E-06    3      1000024         1        -2             # Z2SS   -->  W1SS+  DN     UB          
      5.47994659E-07    3      1000024        11       -12             # Z2SS   -->  W1SS+  E-     ANUE        
      5.47994659E-07    3      1000024        13       -14             # Z2SS   -->  W1SS+  MU-    ANUM        
      1.20373502E-01    3      1000022         2        -2             # Z2SS   -->  Z1SS   UP     UB          
      1.70531213E-01    3      1000022         1        -1             # Z2SS   -->  Z1SS   DN     DB          
      1.70531213E-01    3      1000022         3        -3             # Z2SS   -->  Z1SS   ST     SB          
      1.20373435E-01    3      1000022         4        -4             # Z2SS   -->  Z1SS   CH     CB          
      2.25919038E-01    3      1000022         5        -5             # Z2SS   -->  Z1SS   BT     BB          
      1.36775021E-02    3      1000022        11       -11             # Z2SS   -->  Z1SS   E-     E+          
      1.36775048E-02    3      1000022        13       -13             # Z2SS   -->  Z1SS   MU-    MU+         
      5.09751663E-02    3      1000022        15       -15             # Z2SS   -->  Z1SS   TAU-   TAU+        
      3.76864336E-02    3      1000022        12       -12             # Z2SS   -->  Z1SS   NUE    ANUE        
      3.76864336E-02    3      1000022        14       -14             # Z2SS   -->  Z1SS   NUM    ANUM        
      3.31920013E-02    3      1000022        16       -16             # Z2SS   -->  Z1SS   NUT    ANUT        
#         PDG         Width
DECAY   1000025  4.20819968E-01   # Z3SS  decays
#          BR          NDA       ID1       ID2       ID3       ID4
      4.94612664E-07    2      1000022        22                       # Z3SS   -->  Z1SS   GM                 
      2.20618489E-07    2      1000023        22                       # Z3SS   -->  Z2SS   GM                 
      3.48413527E-01    2      1000024       -24                       # Z3SS   -->  W1SS+  W-                 
      3.48413527E-01    2     -1000024        24                       # Z3SS   -->  W1SS-  W+                 
      1.89363644E-01    2      1000022        23                       # Z3SS   -->  Z1SS   Z0                 
      7.93823898E-02    2      1000023        23                       # Z3SS   -->  Z2SS   Z0                 
      4.96495538E-08    3      1000022         2        -2             # Z3SS   -->  Z1SS   UP     UB          
      5.35587077E-08    3      1000022         1        -1             # Z3SS   -->  Z1SS   DN     DB          
      5.35586793E-08    3      1000022         3        -3             # Z3SS   -->  Z1SS   ST     SB          
      4.96484382E-08    3      1000022         4        -4             # Z3SS   -->  Z1SS   CH     CB          
      4.72505417E-05    3      1000022         5        -5             # Z3SS   -->  Z1SS   BT     BB          
      3.33165275E-07    3      1000022        11       -11             # Z3SS   -->  Z1SS   E-     E+          
      3.33165190E-07    3      1000022        13       -13             # Z3SS   -->  Z1SS   MU-    MU+         
      4.35866496E-05    3      1000022        15       -15             # Z3SS   -->  Z1SS   TAU-   TAU+        
      4.52401650E-07    3      1000022        12       -12             # Z3SS   -->  Z1SS   NUE    ANUE        
      4.52401650E-07    3      1000022        14       -14             # Z3SS   -->  Z1SS   NUM    ANUM        
      6.88703494E-07    3      1000022        16       -16             # Z3SS   -->  Z1SS   NUT    ANUT        
      9.40467615E-08    3      1000023         2        -2             # Z3SS   -->  Z2SS   UP     UB          
      1.09346814E-07    3      1000023         1        -1             # Z3SS   -->  Z2SS   DN     DB          
      1.09346736E-07    3      1000023         3        -3             # Z3SS   -->  Z2SS   ST     SB          
      9.40446299E-08    3      1000023         4        -4             # Z3SS   -->  Z2SS   CH     CB          
      2.49357345E-05    3      1000023         5        -5             # Z3SS   -->  Z2SS   BT     BB          
      8.05844067E-08    3      1000023        11       -11             # Z3SS   -->  Z2SS   E-     E+          
      8.05843925E-08    3      1000023        13       -13             # Z3SS   -->  Z2SS   MU-    MU+         
      1.15533749E-05    3      1000023        15       -15             # Z3SS   -->  Z2SS   TAU-   TAU+        
      1.78390593E-07    3      1000023        12       -12             # Z3SS   -->  Z2SS   NUE    ANUE        
      1.78390593E-07    3      1000023        14       -14             # Z3SS   -->  Z2SS   NUM    ANUM        
      2.76025219E-07    3      1000023        16       -16             # Z3SS   -->  Z2SS   NUT    ANUT        
      3.36178318E-02    2      1000022        25                       # Z3SS   -->  Z1SS   HL0                
      6.77335251E-04    2      1000023        25                       # Z3SS   -->  Z2SS   HL0                
#         PDG         Width
DECAY   1000035  7.62563765E-01   # Z4SS  decays
#          BR          NDA       ID1       ID2       ID3       ID4
      1.41453313E-07    2      1000022        22                       # Z4SS   -->  Z1SS   GM                 
      5.15457934E-08    2      1000023        22                       # Z4SS   -->  Z2SS   GM                 
      2.29367956E-08    2      1000025        22                       # Z4SS   -->  Z3SS   GM                 
      3.92342031E-01    2      1000024       -24                       # Z4SS   -->  W1SS+  W-                 
      3.92342031E-01    2     -1000024        24                       # Z4SS   -->  W1SS-  W+                 
      5.44996783E-02    2      1000022        23                       # Z4SS   -->  Z1SS   Z0                 
      2.49446146E-02    2      1000023        23                       # Z4SS   -->  Z2SS   Z0                 
      2.32901783E-07    3      1000022         2        -2             # Z4SS   -->  Z1SS   UP     UB          
      6.91029982E-07    3      1000022         1        -1             # Z4SS   -->  Z1SS   DN     DB          
      6.91029527E-07    3      1000022         3        -3             # Z4SS   -->  Z1SS   ST     SB          
      2.32896468E-07    3      1000022         4        -4             # Z4SS   -->  Z1SS   CH     CB          
      1.96122801E-05    3      1000022         5        -5             # Z4SS   -->  Z1SS   BT     BB          
      2.05924789E-06    3      1000022        11       -11             # Z4SS   -->  Z1SS   E-     E+          
      2.05924653E-06    3      1000022        13       -13             # Z4SS   -->  Z1SS   MU-    MU+         
      2.82579567E-05    3      1000022        15       -15             # Z4SS   -->  Z1SS   TAU-   TAU+        
      5.34473020E-06    3      1000022        12       -12             # Z4SS   -->  Z1SS   NUE    ANUE        
      5.34473020E-06    3      1000022        14       -14             # Z4SS   -->  Z1SS   NUM    ANUM        
      8.26904125E-06    3      1000022        16       -16             # Z4SS   -->  Z1SS   NUT    ANUT        
      2.43541558E-06    3      1000023         2        -2             # Z4SS   -->  Z2SS   UP     UB          
      2.29788839E-06    3      1000023         1        -1             # Z4SS   -->  Z2SS   DN     DB          
      2.29788748E-06    3      1000023         3        -3             # Z4SS   -->  Z2SS   ST     SB          
      2.43535987E-06    3      1000023         4        -4             # Z4SS   -->  Z2SS   CH     CB          
      1.99029128E-05    3      1000023         5        -5             # Z4SS   -->  Z2SS   BT     BB          
      2.71916656E-06    3      1000023        11       -11             # Z4SS   -->  Z2SS   E-     E+          
      2.71916656E-06    3      1000023        13       -13             # Z4SS   -->  Z2SS   MU-    MU+         
      1.00915031E-05    3      1000023        15       -15             # Z4SS   -->  Z2SS   TAU-   TAU+        
      3.32620084E-06    3      1000023        12       -12             # Z4SS   -->  Z2SS   NUE    ANUE        
      3.32620084E-06    3      1000023        14       -14             # Z4SS   -->  Z2SS   NUM    ANUM        
      5.24115330E-06    3      1000023        16       -16             # Z4SS   -->  Z2SS   NUT    ANUT        
      1.11725672E-06    3      1000025         2        -2             # Z4SS   -->  Z3SS   UP     UB          
      1.47150547E-06    3      1000025         1        -1             # Z4SS   -->  Z3SS   DN     DB          
      1.47150547E-06    3      1000025         3        -3             # Z4SS   -->  Z3SS   ST     SB          
      1.11725694E-06    3      1000025         4        -4             # Z4SS   -->  Z3SS   CH     CB          
      1.06961249E-06    3      1000025         5        -5             # Z4SS   -->  Z3SS   BT     BB          
      3.35121655E-07    3      1000025        11       -11             # Z4SS   -->  Z3SS   E-     E+          
      3.35121655E-07    3      1000025        13       -13             # Z4SS   -->  Z3SS   MU-    MU+         
      3.86891941E-07    3      1000025        15       -15             # Z4SS   -->  Z3SS   TAU-   TAU+        
      6.34133301E-07    3      1000025        12       -12             # Z4SS   -->  Z3SS   NUE    ANUE        
      6.34133301E-07    3      1000025        14       -14             # Z4SS   -->  Z3SS   NUM    ANUM        
      6.26657140E-07    3      1000025        16       -16             # Z4SS   -->  Z3SS   NUT    ANUT        
      7.71792829E-02    2      1000022        25                       # Z4SS   -->  Z1SS   HL0                
      5.85534237E-02    2      1000023        25                       # Z4SS   -->  Z2SS   HL0                
#         PDG         Width
DECAY   1000024  7.31178898E-06   # W1SS+ decays
#          BR          NDA       ID1       ID2       ID3       ID4
      3.35435301E-01    3      1000022         2        -1             # W1SS+  -->  Z1SS   UP     DB          
      3.35435301E-01    3      1000022         4        -3             # W1SS+  -->  Z1SS   CH     SB          
      1.07149348E-01    3      1000022       -11        12             # W1SS+  -->  Z1SS   E+     NUE         
      1.07149348E-01    3      1000022       -13        14             # W1SS+  -->  Z1SS   MU+    NUM         
      1.14830784E-01    3      1000022       -15        16             # W1SS+  -->  Z1SS   TAU+   NUT         
#         PDG         Width
DECAY   1000037  6.05331600E-01   # W2SS+ decays
#          BR          NDA       ID1       ID2       ID3       ID4
      1.07341589E-06    3      1000022         2        -1             # W2SS+  -->  Z1SS   UP     DB          
      1.07341509E-06    3      1000022         4        -3             # W2SS+  -->  Z1SS   CH     SB          
      4.16514831E-06    3      1000022       -11        12             # W2SS+  -->  Z1SS   E+     NUE         
      4.16514831E-06    3      1000022       -13        14             # W2SS+  -->  Z1SS   MU+    NUM         
      3.47746245E-05    3      1000022       -15        16             # W2SS+  -->  Z1SS   TAU+   NUT         
      5.85686564E-02    2      1000022        24                       # W2SS+  -->  Z1SS   W+                 
      2.93075345E-06    3      1000023         2        -1             # W2SS+  -->  Z2SS   UP     DB          
      2.93074322E-06    3      1000023         4        -3             # W2SS+  -->  Z2SS   CH     SB          
      6.09822882E-06    3      1000023       -11        12             # W2SS+  -->  Z2SS   E+     NUE         
      6.09822882E-06    3      1000023       -13        14             # W2SS+  -->  Z2SS   MU+    NUM         
      3.83972219E-05    3      1000023       -15        16             # W2SS+  -->  Z2SS   TAU+   NUT         
      5.27629435E-01    2      1000023        24                       # W2SS+  -->  Z2SS   W+                 
      7.58638407E-06    3      1000025         2        -1             # W2SS+  -->  Z3SS   UP     DB          
      7.58638407E-06    3      1000025         4        -3             # W2SS+  -->  Z3SS   CH     SB          
      2.52056657E-06    3      1000025       -11        12             # W2SS+  -->  Z3SS   E+     NUE         
      2.52056657E-06    3      1000025       -13        14             # W2SS+  -->  Z3SS   MU+    NUM         
      2.68322447E-06    3      1000025       -15        16             # W2SS+  -->  Z3SS   TAU+   NUT         
      5.75756717E-12    3      1000035         2        -1             # W2SS+  -->  Z4SS   UP     DB          
      1.95586104E-12    3      1000035       -11        12             # W2SS+  -->  Z4SS   E+     NUE         
      1.95586104E-12    3      1000035       -13        14             # W2SS+  -->  Z4SS   MU+    NUM         
      2.87982374E-01    2      1000024        23                       # W2SS+  -->  W1SS+  Z0                 
      2.56360022E-06    3      1000024         1        -1             # W2SS+  -->  W1SS+  DN     DB          
      2.56354087E-06    3      1000024         3        -3             # W2SS+  -->  W1SS+  ST     SB          
      6.59885472E-06    3      1000024         2        -2             # W2SS+  -->  W1SS+  UP     UB          
      6.59885018E-06    3      1000024         4        -4             # W2SS+  -->  W1SS+  CH     CB          
      8.67015478E-06    3      1000024        12       -12             # W2SS+  -->  W1SS+  NUE    ANUE        
      8.67015478E-06    3      1000024        14       -14             # W2SS+  -->  W1SS+  NUM    ANUM        
      3.87744622E-05    3      1000024        16       -16             # W2SS+  -->  W1SS+  NUT    ANUT        
      3.65906772E-06    3      1000024        11       -11             # W2SS+  -->  W1SS+  E-     E+          
      3.65906772E-06    3      1000024        13       -13             # W2SS+  -->  W1SS+  MU-    MU+         
      5.81682434E-06    3      1000024        15       -15             # W2SS+  -->  W1SS+  TAU-   TAU+        
      1.25607401E-01    2      1000024        25                       # W2SS+  -->  W1SS+  HL0                
#         PDG         Width
DECAY        25  5.13279764E-03   # HL0   decays
#          BR          NDA       ID1       ID2       ID3       ID4
      4.78382756E-09    2           11       -11                       # HL0    -->  E-     E+                 
      2.01980612E-04    2           13       -13                       # HL0    -->  MU-    MU+                
      5.77510186E-02    2           15       -15                       # HL0    -->  TAU-   TAU+               
      6.01267948E-06    2            1        -1                       # HL0    -->  DN     DB                 
      2.42942292E-03    2            3        -3                       # HL0    -->  ST     SB                 
      8.06884646E-01    2            5        -5                       # HL0    -->  BT     BB                 
      1.39571239E-06    2            2        -2                       # HL0    -->  UP     UB                 
      2.66523268E-02    2            4        -4                       # HL0    -->  CH     CB                 
      1.02379743E-03    2           22        22                       # HL0    -->  GM     GM                 
      2.46364176E-02    2           21        21                       # HL0    -->  GL     GL                 
      4.56895708E-04    3           24        11       -12             # HL0    -->  W+     E-     ANUE        
      4.56895708E-04    3           24        13       -14             # HL0    -->  W+     MU-    ANUM        
      4.56895708E-04    3           24        15       -16             # HL0    -->  W+     TAU-   ANUT        
      1.37068704E-03    3           24        -2         1             # HL0    -->  W+     UB     DN          
      1.37068704E-03    3           24        -4         3             # HL0    -->  W+     CB     ST          
      4.56895708E-04    3          -24       -11        12             # HL0    -->  W-     E+     NUE         
      4.56895708E-04    3          -24       -13        14             # HL0    -->  W-     MU+    NUM         
      4.56895708E-04    3          -24       -15        16             # HL0    -->  W-     TAU+   NUT         
      1.37068704E-03    3          -24         2        -1             # HL0    -->  W-     UP     DB          
      1.37068704E-03    3          -24         4        -3             # HL0    -->  W-     CH     SB          
      1.56153073E-05    3           23        12       -12             # HL0    -->  Z0     NUE    ANUE        
      1.56153073E-05    3           23        14       -14             # HL0    -->  Z0     NUM    ANUM        
      1.56153073E-05    3           23        16       -16             # HL0    -->  Z0     NUT    ANUT        
      7.85902739E-06    3           23        11       -11             # HL0    -->  Z0     E-     E+          
      7.85902739E-06    3           23        13       -13             # HL0    -->  Z0     MU-    MU+         
      7.85902739E-06    3           23        15       -15             # HL0    -->  Z0     TAU-   TAU+        
      2.69243628E-05    3           23         2        -2             # HL0    -->  Z0     UP     UB          
      2.69243628E-05    3           23         4        -4             # HL0    -->  Z0     CH     CB          
      3.46852103E-05    3           23         1        -1             # HL0    -->  Z0     DN     DB          
      3.46852103E-05    3           23         3        -3             # HL0    -->  Z0     ST     SB          
      3.46852103E-05    3           23         5        -5             # HL0    -->  Z0     BT     BB          
      7.19604343E-02    2      1000022   1000022                       # HL0    -->  Z1SS   Z1SS               
#         PDG         Width
DECAY        35  7.81287956E+00   # HH0   decays
#          BR          NDA       ID1       ID2       ID3       ID4
      9.01617270E-09    2           11       -11                       # HH0    -->  E-     E+                 
      3.80678684E-04    2           13       -13                       # HH0    -->  MU-    MU+                
      1.09001555E-01    2           15       -15                       # HH0    -->  TAU-   TAU+               
      1.11924883E-05    2            1        -1                       # HH0    -->  DN     DB                 
      4.52233106E-03    2            3        -3                       # HH0    -->  ST     SB                 
      7.95476556E-01    2            5        -5                       # HH0    -->  BT     BB                 
      1.92828392E-12    2            2        -2                       # HH0    -->  UP     UB                 
      3.22677458E-08    2            4        -4                       # HH0    -->  CH     CB                 
      1.03764869E-07    2           22        22                       # HH0    -->  GM     GM                 
      4.62165372E-05    2           21        21                       # HH0    -->  GL     GL                 
      7.80010578E-06    2           24       -24                       # HH0    -->  W+     W-                 
      3.44189630E-06    2           23        23                       # HH0    -->  Z0     Z0                 
      1.01318359E-02    2      1000022   1000022                       # HH0    -->  Z1SS   Z1SS               
      2.05290280E-02    2      1000022   1000023                       # HH0    -->  Z1SS   Z2SS               
      4.52242419E-03    2      1000022   1000025                       # HH0    -->  Z1SS   Z3SS               
      9.20355599E-03    2      1000023   1000023                       # HH0    -->  Z2SS   Z2SS               
      4.61556315E-02    2      1000024  -1000024                       # HH0    -->  W1SS+  W1SS-              
      7.56185909E-06    2           25        25                       # HH0    -->  HL0    HL0                
#         PDG         Width
DECAY        36  8.12127113E+00   # HA0   decays
#          BR          NDA       ID1       ID2       ID3       ID4
      8.61903349E-09    2           11       -11                       # HA0    -->  E-     E+                 
      3.63910978E-04    2           13       -13                       # HA0    -->  MU-    MU+                
      1.04219787E-01    2           15       -15                       # HA0    -->  TAU-   TAU+               
      1.07003434E-05    2            1        -1                       # HA0    -->  DN     DB                 
      4.32348112E-03    2            3        -3                       # HA0    -->  ST     SB                 
      7.61111140E-01    2            5        -5                       # HA0    -->  BT     BB                 
      1.33740913E-12    2            2        -2                       # HA0    -->  UP     UB                 
      2.24012098E-08    2            4        -4                       # HA0    -->  CH     CB                 
      7.60691279E-08    2           22        22                       # HA0    -->  GM     GM                 
      7.26843064E-05    2           21        21                       # HA0    -->  GL     GL                 
      1.14900880E-02    2      1000022   1000022                       # HA0    -->  Z1SS   Z1SS               
      2.66917460E-02    2      1000022   1000023                       # HA0    -->  Z1SS   Z2SS               
      8.00840382E-04    2      1000022   1000025                       # HA0    -->  Z1SS   Z3SS               
      1.54704591E-02    2      1000023   1000023                       # HA0    -->  Z2SS   Z2SS               
      7.54414871E-02    2      1000024  -1000024                       # HA0    -->  W1SS+  W1SS-              
      3.55229599E-06    2           25        23                       # HA0    -->  HL0    Z0                 
#         PDG         Width
DECAY        37  3.41250753E+00   # H+    decays
#          BR          NDA       ID1       ID2       ID3       ID4
      2.17080824E-08    2           12       -11                       # H+     -->  NUE    E+                 
      9.16554127E-04    2           14       -13                       # H+     -->  NUM    MU+                
      2.62492925E-01    2           16       -15                       # H+     -->  NUT    TAU+               
      2.44439507E-05    2            2        -1                       # H+     -->  UP     DB                 
      9.87614691E-03    2            4        -3                       # H+     -->  CH     SB                 
      6.20280683E-01    2            6        -5                       # H+     -->  TP     BB                 
      8.77389014E-02    2      1000024   1000022                       # H+     -->  W1SS+  Z1SS               
      8.69328436E-03    2      1000024   1000023                       # H+     -->  W1SS+  Z2SS               
      9.96240228E-03    2      1000024   1000025                       # H+     -->  W1SS+  Z3SS               
      4.40928915E-07    2      1000037   1000022                       # H+     -->  W2SS+  Z1SS               
      1.41970140E-05    2           25        24                       # H+     -->  HL0    W+                 
