  65
  401    445.8253    0.15596E-24
  402    439.5562    0.14919E-24
  403    445.8254    0.15596E-24
  404    439.5584    0.14919E-24
  405    409.0023    0.21628E-24
  406    294.6485    0.41436E-24
  407    445.8253    0.15596E-24
  408    439.5562    0.14919E-24
  409    445.8254    0.15596E-24
  410    439.5584    0.14919E-24
  411    409.0023    0.21628E-24
  412    294.6485    0.41436E-24
  413    428.2488    0.29366E-23
  414    427.9000    0.73484E-24
  415    428.2488    0.29366E-23
  416    427.9023    0.73485E-24
  417    428.0789    0.16116E-23
  418    484.2907    0.14153E-24
  419    428.2488    0.29366E-23
  420    427.9000    0.73484E-24
  421    428.2488    0.29366E-23
  422    427.9023    0.73485E-24
  423    428.0789    0.16116E-23
  424    484.2907    0.14153E-24
  425    158.2509    0.19139E-23
  426    139.9535    0.26822E-23
  427    158.2509    0.19139E-23
  428    139.9535    0.26822E-23
  429    112.6728    0.31161E-23
  430    138.9486    0.28089E-23
  431    158.2509    0.19139E-23
  432    139.9535    0.26822E-23
  433    158.2509    0.19139E-23
  434    139.9535    0.26822E-23
  435    112.6728    0.31161E-23
  436    138.9486    0.28089E-23
  437    112.9318    0.30489E-23
  438      0.0000    0.10000E+31
  439    112.9318    0.30489E-23
  440      0.0000    0.10000E+31
  441    158.0257    0.19353E-23
  442      0.0000    0.10000E+31
  443    112.9318    0.30489E-23
  444      0.0000    0.10000E+31
  445    112.9318    0.30489E-23
  446      0.0000    0.10000E+31
  447    158.0257    0.19353E-23
  448      0.0000    0.10000E+31
  449    474.4212    0.17724E-24
  450     67.8659    0.10000E+31
  451    124.2124    0.19379E-21
  452   -292.9445    0.38393E-24
  453    326.0087    0.23705E-24
  454    121.5344    0.20889E-20
  455    320.9291    0.23951E-24
  456    121.5344    0.20889E-20
  457    320.9291    0.23951E-24
  203     94.1999    0.16717E-21
  204    349.3644    0.15335E-23
  205    342.5280    0.70363E-24
  206    353.6651    0.45242E-24
  207    353.6651    0.45242E-24
  458      0.0000    0.10000E+31
    6    172.5000    0.57395E-24
   12    172.5000    0.57395E-24
   6
   401  0.48874710E-01     0   450     1     0     0     0
   401  0.28548917E+00     0   451     1     0     0     0
   401  0.11587087E-02     0   452     1     0     0     0
   401  0.14980521E-01     0   453     1     0     0     0
   401  0.60768151E+00     0   456     2     0     0     0
   401  0.41815374E-01     0   457     2     0     0     0
   6
   402  0.59577098E-04     0   450     2     0     0     0
   402  0.32378983E+00     0   451     2     0     0     0
   402  0.63969748E-03     0   452     2     0     0     0
   402  0.98982146E-02     0   453     2     0     0     0
   402  0.64850867E+00     0   454     1     0     0     0
   402  0.17104011E-01     0   455     1     0     0     0
   6
   403  0.48875503E-01     0   450     3     0     0     0
   403  0.28549379E+00     0   451     3     0     0     0
   403  0.11587277E-02     0   452     3     0     0     0
   403  0.14980770E-01     0   453     3     0     0     0
   403  0.60767841E+00     0   456     4     0     0     0
   403  0.41812759E-01     0   457     4     0     0     0
   6
   404  0.59576298E-04     0   450     4     0     0     0
   404  0.32378510E+00     0   451     4     0     0     0
   404  0.63967268E-03     0   452     4     0     0     0
   404  0.98975990E-02     0   453     4     0     0     0
   404  0.64851356E+00     0   454     3     0     0     0
   404  0.17104512E-01     0   455     3     0     0     0
   6
   405  0.65312892E-01     0   450     5     0     0     0
   405  0.33730119E+00     0   451     5     0     0     0
   405  0.11561213E-02     0   452     5     0     0     0
   405  0.10519794E-01     0   453     5     0     0     0
   405  0.39625338E+00     0   456     6     0     0     0
   405  0.18945661E+00     0   199   406     0     0     0
   2
   406  0.10374829E+00     0   450     6     0     0     0
   406  0.89625174E+00     0   454     5     0     0     0
   6
   407  0.48874710E-01     0   450     7     0     0     0
   407  0.28548917E+00     0   451     7     0     0     0
   407  0.11587087E-02     0   452     7     0     0     0
   407  0.14980521E-01     0   453     7     0     0     0
   407  0.60768151E+00     0   454     8     0     0     0
   407  0.41815374E-01     0   455     8     0     0     0
   6
   408  0.59577098E-04     0   450     8     0     0     0
   408  0.32378983E+00     0   451     8     0     0     0
   408  0.63969748E-03     0   452     8     0     0     0
   408  0.98982146E-02     0   453     8     0     0     0
   408  0.64850867E+00     0   456     7     0     0     0
   408  0.17104011E-01     0   457     7     0     0     0
   6
   409  0.48875503E-01     0   450     9     0     0     0
   409  0.28549379E+00     0   451     9     0     0     0
   409  0.11587277E-02     0   452     9     0     0     0
   409  0.14980770E-01     0   453     9     0     0     0
   409  0.60767841E+00     0   454    10     0     0     0
   409  0.41812759E-01     0   455    10     0     0     0
   6
   410  0.59576298E-04     0   450    10     0     0     0
   410  0.32378510E+00     0   451    10     0     0     0
   410  0.63967268E-03     0   452    10     0     0     0
   410  0.98975990E-02     0   453    10     0     0     0
   410  0.64851356E+00     0   456     9     0     0     0
   410  0.17104512E-01     0   457     9     0     0     0
   6
   411  0.65312892E-01     0   450    11     0     0     0
   411  0.33730119E+00     0   451    11     0     0     0
   411  0.11561213E-02     0   452    11     0     0     0
   411  0.10519794E-01     0   453    11     0     0     0
   411  0.39625338E+00     0   454    12     0     0     0
   411  0.18945661E+00     0   198   412     0     0     0
   2
   412  0.10374829E+00     0   450    12     0     0     0
   412  0.89625174E+00     0   456    11     0     0     0
   4
   413  0.94499290E+00     0   450     1     0     0     0
   413  0.50135396E-01     0   451     1     0     0     0
   413  0.87208435E-03     0   452     1     0     0     0
   413  0.39996197E-02     0   453     1     0     0     0
   4
   414  0.94502205E+00     0   450     2     0     0     0
   414  0.50126135E-01     0   451     2     0     0     0
   414  0.86968456E-03     0   452     2     0     0     0
   414  0.39821179E-02     0   453     2     0     0     0
   4
   415  0.94499290E+00     0   450     3     0     0     0
   415  0.50135396E-01     0   451     3     0     0     0
   415  0.87208464E-03     0   452     3     0     0     0
   415  0.39996216E-02     0   453     3     0     0     0
   4
   416  0.94502240E+00     0   450     4     0     0     0
   416  0.50126083E-01     0   451     4     0     0     0
   416  0.86965784E-03     0   452     4     0     0     0
   416  0.39818692E-02     0   453     4     0     0     0
   6
   417  0.49202022E+00     0   450     5     0     0     0
   417  0.14602304E+00     0   451     5     0     0     0
   417  0.11006000E-01     0   452     5     0     0     0
   417  0.22434073E-01     0   453     5     0     0     0
   417  0.15240277E+00     0   456     6     0     0     0
   417  0.17611390E+00     0   199   406     0     0     0
   7
   418  0.20120785E+00     0   454     5     0     0     0
   418  0.30324599E+00     0   455     5     0     0     0
   418  0.30213630E+00     0   200   406     0     0     0
   418  0.47198072E-01     0   203   406     0     0     0
   418  0.22105347E-01     0   450     6     0     0     0
   418  0.10119458E+00     0   451     6     0     0     0
   418  0.22911858E-01     0   452     6     0     0     0
   4
   419  0.94499290E+00     0   450     7     0     0     0
   419  0.50135396E-01     0   451     7     0     0     0
   419  0.87208435E-03     0   452     7     0     0     0
   419  0.39996197E-02     0   453     7     0     0     0
   4
   420  0.94502205E+00     0   450     8     0     0     0
   420  0.50126135E-01     0   451     8     0     0     0
   420  0.86968456E-03     0   452     8     0     0     0
   420  0.39821179E-02     0   453     8     0     0     0
   4
   421  0.94499290E+00     0   450     9     0     0     0
   421  0.50135396E-01     0   451     9     0     0     0
   421  0.87208464E-03     0   452     9     0     0     0
   421  0.39996216E-02     0   453     9     0     0     0
   4
   422  0.94502240E+00     0   450    10     0     0     0
   422  0.50126083E-01     0   451    10     0     0     0
   422  0.86965784E-03     0   452    10     0     0     0
   422  0.39818692E-02     0   453    10     0     0     0
   6
   423  0.49202022E+00     0   450    11     0     0     0
   423  0.14602304E+00     0   451    11     0     0     0
   423  0.11006000E-01     0   452    11     0     0     0
   423  0.22434073E-01     0   453    11     0     0     0
   423  0.15240277E+00     0   454    12     0     0     0
   423  0.17611390E+00     0   198   412     0     0     0
   7
   424  0.20120785E+00     0   456    11     0     0     0
   424  0.30324599E+00     0   457    11     0     0     0
   424  0.30213630E+00     0   200   412     0     0     0
   424  0.47198072E-01     0   203   412     0     0     0
   424  0.22105347E-01     0   450    12     0     0     0
   424  0.10119458E+00     0   451    12     0     0     0
   424  0.22911858E-01     0   452    12     0     0     0
   3
   425  0.17075092E+00     0   450   121     0     0     0
   425  0.30945745E+00     0   451   121     0     0     0
   425  0.51979160E+00     0   456   122     0     0     0
   3
   426  0.67059296E+00     0   450   122     0     0     0
   426  0.66251390E-01     0   451   122     0     0     0
   426  0.26315567E+00     0   454   121     0     0     0
   3
   427  0.17075092E+00     0   450   123     0     0     0
   427  0.30945632E+00     0   451   123     0     0     0
   427  0.51979280E+00     0   456   124     0     0     0
   3
   428  0.67059624E+00     0   450   124     0     0     0
   428  0.66251718E-01     0   451   124     0     0     0
   428  0.26315203E+00     0   454   123     0     0     0
   1
   429  0.10000000E+01     0   450   125     0     0     0
   3
   430  0.69100839E+00     0   450   126     0     0     0
   430  0.61661109E-01     0   451   126     0     0     0
   430  0.24733049E+00     0   454   125     0     0     0
   3
   431  0.17075092E+00     0   450   127     0     0     0
   431  0.30945745E+00     0   451   127     0     0     0
   431  0.51979160E+00     0   454   128     0     0     0
   3
   432  0.67059296E+00     0   450   128     0     0     0
   432  0.66251390E-01     0   451   128     0     0     0
   432  0.26315567E+00     0   456   127     0     0     0
   3
   433  0.17075092E+00     0   450   129     0     0     0
   433  0.30945632E+00     0   451   129     0     0     0
   433  0.51979280E+00     0   454   130     0     0     0
   3
   434  0.67059624E+00     0   450   130     0     0     0
   434  0.66251718E-01     0   451   130     0     0     0
   434  0.26315203E+00     0   456   129     0     0     0
   1
   435  0.10000000E+01     0   450   131     0     0     0
   3
   436  0.69100839E+00     0   450   132     0     0     0
   436  0.61661109E-01     0   451   132     0     0     0
   436  0.24733049E+00     0   456   131     0     0     0
   1
   437  0.10000000E+01     0   450   121     0     0     0
   0
   1
   439  0.10000000E+01     0   450   123     0     0     0
   0
   3
   441  0.19293268E+00     0   450   125     0     0     0
   441  0.30061516E+00     0   451   125     0     0     0
   441  0.50645214E+00     0   456   126     0     0     0
   0
   1
   443  0.10000000E+01     0   450   127     0     0     0
   0
   1
   445  0.10000000E+01     0   450   129     0     0     0
   0
   3
   447  0.19293268E+00     0   450   131     0     0     0
   447  0.30061516E+00     0   451   131     0     0     0
   447  0.50645214E+00     0   454   132     0     0     0
   0
  25
   449  0.47735819E-04     0   454     5    12     0     0
   449  0.47735819E-04     0   456     6    11     0     0
   449  0.19211744E-04     0   452    13     0     0     0
   449  0.31925809E-01     0   408     2     0     0     0
   449  0.31925809E-01     0   402     8     0     0     0
   449  0.21772355E-01     0   407     1     0     0     0
   449  0.21772355E-01     0   401     7     0     0     0
   449  0.55400748E-01     0   420     2     0     0     0
   449  0.55400748E-01     0   414     8     0     0     0
   449  0.54615330E-01     0   419     1     0     0     0
   449  0.54615330E-01     0   413     7     0     0     0
   449  0.21771815E-01     0   409     3     0     0     0
   449  0.21771815E-01     0   403     9     0     0     0
   449  0.54614805E-01     0   421     3     0     0     0
   449  0.54614805E-01     0   415     9     0     0     0
   449  0.31899679E-01     0   410     4     0     0     0
   449  0.31899679E-01     0   404    10     0     0     0
   449  0.55374514E-01     0   422     4     0     0     0
   449  0.55374514E-01     0   416    10     0     0     0
   449  0.10081389E+00     0   411     5     0     0     0
   449  0.10081389E+00     0   405    11     0     0     0
   449  0.57546586E-01     0   423     5     0     0     0
   449  0.57546586E-01     0   417    11     0     0     0
   449  0.14207133E-01     0   412     6     0     0     0
   449  0.14207133E-01     0   406    12     0     0     0
   0
  17
   451  0.64732209E-04     0   450     2     8     0     0
   451  0.11345950E-03     0   450     1     7     0     0
   451  0.11345949E-03     0   450     3     9     0     0
   451  0.64732107E-04     0   450     4    10     0     0
   451  0.11878384E-03     0   450     5    11     0     0
   451  0.29876857E-03     0   450   121   127     0     0
   451  0.29876799E-03     0   450   123   129     0     0
   451  0.31350026E-03     0   450   125   131     0     0
   451  0.16187836E-02     0   450   122   128     0     0
   451  0.16187836E-02     0   450   124   130     0     0
   451  0.17422443E-02     0   450   126   132     0     0
   451  0.15476634E+00     0   437   127     0     0     0
   451  0.15476634E+00     0   443   121     0     0     0
   451  0.15475902E+00     0   439   129     0     0     0
   451  0.15475902E+00     0   445   123     0     0     0
   451  0.18729165E+00     0   429   131     0     0     0
   451  0.18729165E+00     0   435   125     0     0     0
  24
   452  0.30509892E+00     0   454   199     0     0     0
   452  0.30509892E+00     0   456   198     0     0     0
   452  0.16083318E+00     0   450   200     0     0     0
   452  0.18269670E+00     0   451   200     0     0     0
   452  0.13786031E-01     0   450   203     0     0     0
   452  0.69608847E-02     0   451   203     0     0     0
   452  0.46347862E-03     0   425   127     0     0     0
   452  0.46347862E-03     0   431   121     0     0     0
   452  0.46347841E-03     0   427   129     0     0     0
   452  0.46347841E-03     0   433   123     0     0     0
   452  0.89860969E-03     0   437   127     0     0     0
   452  0.89860969E-03     0   443   121     0     0     0
   452  0.89860935E-03     0   439   129     0     0     0
   452  0.89860935E-03     0   445   123     0     0     0
   452  0.11391672E-02     0   429   131     0     0     0
   452  0.11391672E-02     0   435   125     0     0     0
   452  0.11860135E-02     0   441   131     0     0     0
   452  0.11860135E-02     0   447   125     0     0     0
   452  0.25638621E-02     0   426   128     0     0     0
   452  0.25638621E-02     0   432   122     0     0     0
   452  0.25638621E-02     0   428   130     0     0     0
   452  0.25638621E-02     0   434   124     0     0     0
   452  0.25856083E-02     0   430   132     0     0     0
   452  0.25856083E-02     0   436   126     0     0     0
  24
   453  0.25320548E+00     0   454   199     0     0     0
   453  0.25320548E+00     0   456   198     0     0     0
   453  0.12140029E-01     0   450   200     0     0     0
   453  0.77644596E-02     0   451   200     0     0     0
   453  0.76274283E-01     0   450   203     0     0     0
   453  0.97469583E-01     0   451   203     0     0     0
   453  0.12010991E-01     0   425   127     0     0     0
   453  0.12010991E-01     0   431   121     0     0     0
   453  0.12010986E-01     0   427   129     0     0     0
   453  0.12010986E-01     0   433   123     0     0     0
   453  0.48444602E-02     0   437   127     0     0     0
   453  0.48444602E-02     0   443   121     0     0     0
   453  0.48444588E-02     0   439   129     0     0     0
   453  0.48444588E-02     0   445   123     0     0     0
   453  0.43823426E-02     0   429   131     0     0     0
   453  0.43823426E-02     0   435   125     0     0     0
   453  0.12867118E-01     0   441   131     0     0     0
   453  0.12867118E-01     0   447   125     0     0     0
   453  0.32932237E-01     0   426   128     0     0     0
   453  0.32932237E-01     0   432   122     0     0     0
   453  0.32932237E-01     0   428   130     0     0     0
   453  0.32932237E-01     0   434   124     0     0     0
   453  0.33145521E-01     0   430   132     0     0     0
   453  0.33145517E-01     0   436   126     0     0     0
   6
   454  0.65296024E-01     0   450     2     7     0     0
   454  0.65296024E-01     0   450     4     9     0     0
   454  0.53002041E-01     0   450   127   122     0     0
   454  0.53002041E-01     0   450   129   124     0     0
   454  0.54972600E-01     0   450   131   126     0     0
   454  0.70843124E+00     0   435   126     0     0     0
  12
   455  0.21659693E-01     0   450   198     0     0     0
   455  0.30472547E+00     0   451   198     0     0     0
   455  0.30153641E-01     0   406    11     0     0     0
   455  0.30153980E-01     0   426   127     0     0     0
   455  0.30153980E-01     0   428   129     0     0     0
   455  0.30870652E-01     0   430   131     0     0     0
   455  0.57036500E-01     0   431   122     0     0     0
   455  0.57036489E-01     0   433   124     0     0     0
   455  0.15221887E-03     0   435   126     0     0     0
   455  0.57578016E-01     0   447   126     0     0     0
   455  0.23255552E+00     0   454   200     0     0     0
   455  0.14792383E+00     0   454   203     0     0     0
   6
   456  0.65296024E-01     0   450     8     1     0     0
   456  0.65296024E-01     0   450    10     3     0     0
   456  0.53002041E-01     0   450   121   128     0     0
   456  0.53002041E-01     0   450   123   130     0     0
   456  0.54972600E-01     0   450   125   132     0     0
   456  0.70843124E+00     0   429   132     0     0     0
  12
   457  0.21659693E-01     0   450   199     0     0     0
   457  0.30472547E+00     0   451   199     0     0     0
   457  0.30153641E-01     0   412     5     0     0     0
   457  0.30153980E-01     0   432   121     0     0     0
   457  0.30153980E-01     0   434   123     0     0     0
   457  0.30870652E-01     0   436   125     0     0     0
   457  0.57036500E-01     0   425   128     0     0     0
   457  0.57036489E-01     0   427   130     0     0     0
   457  0.15221887E-03     0   429   132     0     0     0
   457  0.57578016E-01     0   441   132     0     0     0
   457  0.23255552E+00     0   456   200     0     0     0
   457  0.14792383E+00     0   456   203     0     0     0
  17
   203  0.21674877E-03     0   123   129     0     0     0
   203  0.61948128E-01     0   125   131     0     0     0
   203  0.26114422E-02     0     3     9     0     0     0
   203  0.88046718E+00     0     5    11     0     0     0
   203  0.30876117E-01     0     4    10     0     0     0
   203  0.94265165E-03     0    59    59     0     0     0
   203  0.22220640E-01     0    13    13     0     0     0
   203  0.39837043E-04     0   198   121   128     0     0
   203  0.39837043E-04     0   198   123   130     0     0
   203  0.39837043E-04     0   198   125   132     0     0
   203  0.11951114E-03     0   198     8     1     0     0
   203  0.11951114E-03     0   198    10     3     0     0
   203  0.39837043E-04     0   199   127   122     0     0
   203  0.39837043E-04     0   199   129   124     0     0
   203  0.39837043E-04     0   199   131   126     0     0
   203  0.11951114E-03     0   199     2     7     0     0
   203  0.11951114E-03     0   199     4     9     0     0
  26
   204  0.51027237E-04     0   123   129     0     0     0
   204  0.14612723E-01     0   125   131     0     0     0
   204  0.60407328E-03     0     3     9     0     0     0
   204  0.10230295E+00     0     5    11     0     0     0
   204  0.12346641E-03     0     4    10     0     0     0
   204  0.56425508E-01     0     6    12     0     0     0
   204  0.28041888E-04     0    59    59     0     0     0
   204  0.37370070E-02     0    13    13     0     0     0
   204  0.40649842E-01     0   198   199     0     0     0
   204  0.19110152E-01     0   200   200     0     0     0
   204  0.58357824E-01     0   450   450     0     0     0
   204  0.12552239E+00     0   450   451     0     0     0
   204  0.55033222E-01     0   451   451     0     0     0
   204  0.23388310E+00     0   454   456     0     0     0
   204  0.12572667E+00     0   203   203     0     0     0
   204  0.74945414E-02     0   425   431     0     0     0
   204  0.10119557E-01     0   437   443     0     0     0
   204  0.74941930E-02     0   427   433     0     0     0
   204  0.10119019E-01     0   439   445     0     0     0
   204  0.10178268E-01     0   429   435     0     0     0
   204  0.73205428E-02     0   441   447     0     0     0
   204  0.16110735E-04     0   429   447     0     0     0
   204  0.16110735E-04     0   441   435     0     0     0
   204  0.36867939E-01     0   426   432     0     0     0
   204  0.36867939E-01     0   428   434     0     0     0
   204  0.37337787E-01     0   430   436     0     0     0
  13
   205  0.23645576E-04     0   123   129     0     0     0
   205  0.67720925E-02     0   125   131     0     0     0
   205  0.27998147E-03     0     3     9     0     0     0
   205  0.47436360E-01     0     5    11     0     0     0
   205  0.44113953E-04     0     4    10     0     0     0
   205  0.10885714E-02     0    13    13     0     0     0
   205  0.68885662E-01     0   450   450     0     0     0
   205  0.19668157E+00     0   450   451     0     0     0
   205  0.13664554E+00     0   451   451     0     0     0
   205  0.52760500E+00     0   454   456     0     0     0
   205  0.14516436E-01     0   203   200     0     0     0
   205  0.10519949E-04     0   429   447     0     0     0
   205  0.10519949E-04     0   441   435     0     0     0
  11
   206  0.15697962E-04     0   124   129     0     0     0
   206  0.44959108E-02     0   126   131     0     0     0
   206  0.19569084E-03     0     4     9     0     0     0
   206  0.81935817E+00     0     6    11     0     0     0
   206  0.12610246E+00     0   454   450     0     0     0
   206  0.78049456E-02     0   454   451     0     0     0
   206  0.11190063E-01     0   203   198     0     0     0
   206  0.10227284E-01     0   431   426     0     0     0
   206  0.10227107E-01     0   433   428     0     0     0
   206  0.40767316E-03     0   435   430     0     0     0
   206  0.99749966E-02     0   447   430     0     0     0
  11
   207  0.15697962E-04     0   130   123     0     0     0
   207  0.44959108E-02     0   132   125     0     0     0
   207  0.19569084E-03     0    10     3     0     0     0
   207  0.81935817E+00     0    12     5     0     0     0
   207  0.12610246E+00     0   456   450     0     0     0
   207  0.78049456E-02     0   456   451     0     0     0
   207  0.11190063E-01     0   203   199     0     0     0
   207  0.10227284E-01     0   425   432     0     0     0
   207  0.10227107E-01     0   427   434     0     0     0
   207  0.40767316E-03     0   429   436     0     0     0
   207  0.99749966E-02     0   441   436     0     0     0
   0
   5
     6  0.33333334E+00   100     2     7     5     0     0
     6  0.33333334E+00   100     4     9     5     0     0
     6  0.11111111E+00   100   122   127     5     0     0
     6  0.11111111E+00   100   124   129     5     0     0
     6  0.11111111E+00   100   126   131     5     0     0
   5
    12  0.33333334E+00   100     8     1    11     0     0
    12  0.33333334E+00   100    10     3    11     0     0
    12  0.11111111E+00   100   128   121    11     0     0
    12  0.11111111E+00   100   130   123    11     0     0
    12  0.11111111E+00   100   132   125    11     0     0
      3.00000000     -0.36328095
      0.95960629     -0.16359672      0.20226318     -0.10715207
     -0.23527184     -0.91182190      0.27920857     -0.18780418
     -0.05341228      0.08004964      0.69541669      0.71213388
     -0.14474171      0.36797941      0.63049805     -0.66791725
     -0.95208561      0.30583164     -0.30583164     -0.95208561
     -0.89299917      0.45005834     -0.45005834     -0.89299917
     -0.93809032     -0.23770176     -1.42852676
   -346.58493042   -554.84436035   -121.26214600
    290.29217529
    T
