#  ISAJET SUSY parameters in SUSY Les Houches Accord 2 format
#  Created by ISALHA 2.0 Last revision: C. Balazs 21 Apr 2009
Block SPINFO   # Program information
     1   ISASUGRA from ISAJET          # Spectrum Calculator
     2   7.80   29-OCT-2009 12:50:36   # Version number
Block MODSEL   # Model selection
     1     1   # Minimal supergravity (mSUGRA) model               
Block SMINPUTS   # Standard Model inputs
     1     1.27838417E+02   # alpha_em^(-1)
     2     1.16570000E-05   # G_Fermi
     3     1.17200002E-01   # alpha_s(M_Z)
     4     9.11699982E+01   # m_{Z}(pole)
     5     4.19999981E+00   # m_{b}(m_{b})
     6     1.72500000E+02   # m_{top}(pole)
     7     1.77699995E+00   # m_{tau}(pole)
Block MINPAR   # SUSY breaking input parameters
     1     3.20000000E+02   # m_0
     2     3.10000000E+02   # m_{1/2}
     3     4.00000000E+01   # tan(beta)
     4     1.00000000E+00   # sign(mu)
     5    -5.00000000E+02   # A_0
Block EXTPAR   # Non-universal SUSY breaking parameters
     0     2.12631590E+16   # Input scale
Block MASS   # Scalar and gaugino mass spectrum
#  PDG code   mass                 particle
        24     8.04229965E+01   #  W^+
        25     1.14362770E+02   #  h^0            
        35     4.42670258E+02   #  H^0            
        36     4.39934448E+02   #  A^0            
        37     4.51283386E+02   #  H^+            
   1000001     7.54537842E+02   #  dnl            
   1000002     7.50013550E+02   #  upl            
   1000003     7.54537903E+02   #  stl            
   1000004     7.50014771E+02   #  chl            
   1000005     6.01635681E+02   #  b1             
   1000006     4.71209900E+02   #  t1             
   1000011     3.84959167E+02   #  el-            
   1000012     3.75834137E+02   #  nuel           
   1000013     3.84959167E+02   #  mul-           
   1000014     3.75834137E+02   #  numl           
   1000015     1.84200241E+02   #  tau1           
   1000016     3.29438263E+02   #  nutl           
   1000021     7.51083984E+02   #  glss           
   1000022     1.25806427E+02   #  z1ss           
   1000023     2.39219330E+02   #  z2ss           
   1000024     2.39577805E+02   #  w1ss           
   1000025    -4.90265778E+02   #  z3ss           
   1000035     5.01954132E+02   #  z4ss           
   1000037     5.01771149E+02   #  w2ss           
   2000001     7.30288940E+02   #  dnr            
   2000002     7.30753540E+02   #  upr            
   2000003     7.30288940E+02   #  str            
   2000004     7.30754883E+02   #  chr            
   2000005     6.76053162E+02   #  b2             
   2000006     6.89804016E+02   #  t2             
   2000011     3.42500153E+02   #  er-            
   2000013     3.42500153E+02   #  mur-           
   2000015     3.62510406E+02   #  tau2           
Block ALPHA   # Effective Higgs mixing parameter
         -2.53180712E-02   # alpha
Block STOPMIX   # stop mixing matrix
  1  1     5.30699313E-01   # O_{11}
  1  2     8.47560167E-01   # O_{12}
  2  1    -8.47560167E-01   # O_{21}
  2  2     5.30699313E-01   # O_{22}
Block SBOTMIX   # sbottom mixing matrix
  1  1     8.03490341E-01   # O_{11}
  1  2     5.95317781E-01   # O_{12}
  2  1    -5.95317781E-01   # O_{21}
  2  2     8.03490341E-01   # O_{22}
Block STAUMIX   # stau mixing matrix
  1  1     4.10172135E-01   # O_{11}
  1  2     9.12008107E-01   # O_{12}
  2  1    -9.12008107E-01   # O_{21}
  2  2     4.10172135E-01   # O_{22}
Block NMIX   # neutralino mixing matrix
  1  1     9.94511724E-01   #
  1  2    -1.93345826E-02   #
  1  3     9.91337597E-02   #
  1  4    -2.73063034E-02   #
  2  1     4.20076996E-02   #
  2  2     9.72738385E-01   #
  2  3    -2.03149781E-01   #
  2  4     1.03662342E-01   #
  3  1    -4.89812717E-02   #
  3  2     7.29848966E-02   #
  3  3     7.00652301E-01   #
  3  4     7.08068073E-01   #
  4  1    -8.23598653E-02   #
  4  2     2.19270885E-01   #
  4  3     6.76748633E-01   #
  4  4    -6.97960079E-01   #
Block UMIX   # chargino U mixing matrix
  1  1    -9.57231343E-01   # U_{11}
  1  2     2.89323717E-01   # U_{12}
  2  1    -2.89323717E-01   # U_{21}
  2  2    -9.57231343E-01   # U_{22}
Block VMIX   # chargino V mixing matrix
  1  1    -9.88790929E-01   # V_{11}
  1  2     1.49306610E-01   # V_{12}
  2  1    -1.49306610E-01   # V_{21}
  2  2    -9.88790929E-01   # V_{22}
Block GAUGE Q=  5.50815308E+02   #
     1     3.57521594E-01   # g`
     2     6.52375519E-01   # g_2
     3     1.21926284E+00   # g_3
Block YU Q=  5.50815308E+02   #
  3  3     8.69164884E-01   # y_t
Block YD Q=  5.50815308E+02   #
  3  3     4.75659847E-01   # y_b
Block YE Q=  5.50815308E+02   #
  3  3     4.27626669E-01   # y_tau
Block HMIX Q=  5.50815308E+02   # Higgs mixing parameters
     1     4.86064331E+02   # mu(Q)
     2     4.00000000E+01   # tan(beta)(M_GUT)
     3     2.50431595E+02   # Higgs vev at Q
     4     1.93542312E+05   # m_A^2(Q)
Block MSOFT Q=  5.50815308E+02   # DRbar SUSY breaking parameters
     1     1.28185028E+02   # M_1(Q)          
     2     2.40982117E+02   # M_2(Q)          
     3     7.08919617E+02   # M_3(Q)          
    31     3.80678314E+02   # MeL(Q)          
    32     3.80678314E+02   # MmuL(Q)         
    33     3.35507263E+02   # MtauL(Q)        
    34     3.39349487E+02   # MeR(Q)          
    35     3.39349487E+02   # MmuR(Q)         
    36     2.23931717E+02   # MtauR(Q)        
    41     7.15670410E+02   # MqL1(Q)         
    42     7.15670410E+02   # MqL2(Q)         
    43     5.99106995E+02   # MqL3(Q)         
    44     6.95703918E+02   # MuR(Q)          
    45     6.95703918E+02   # McR(Q)          
    46     5.06416229E+02   # MtR(Q)          
    47     6.93863892E+02   # MdR(Q)          
    48     6.93863892E+02   # MsR(Q)          
    49     6.28376953E+02   # MbR(Q)          
Block AU Q=  5.50815308E+02   #
  1  1    -7.23070740E+02   # A_u
  2  2    -7.23070740E+02   # A_c
  3  3    -7.23070740E+02   # A_t
Block AD Q=  5.50815308E+02   #
  1  1    -1.07406177E+03   # A_d
  2  2    -1.07406177E+03   # A_s
  3  3    -1.07406177E+03   # A_b
Block AE Q=  5.50815308E+02   #
  1  1    -4.60974518E+02   # A_e
  2  2    -4.60974518E+02   # A_mu
  3  3    -4.60974518E+02   # A_tau
#  ISAJET decay tables in SUSY Les Houches accord format
#  Created by ISALHD. Last revision: C. Balazs, 2005 May 25
Block DCINFO                           # Program information
     1   ISASUGRA from ISAJET          # Spectrum Calculator
     2   7.80   29-OCT-2009 12:50:36   # Version number
#         PDG         Width
DECAY         6  1.14680779E+00   # TP    decays
#          BR          NDA       ID1       ID2       ID3       ID4
      3.33333343E-01    3            2        -1         5             # TP     -->  UP     DB     BT          
      3.33333343E-01    3            4        -3         5             # TP     -->  CH     SB     BT          
      1.11111112E-01    3          -11        12         5             # TP     -->  E+     NUE    BT          
      1.11111112E-01    3          -13        14         5             # TP     -->  MU+    NUM    BT          
      1.11111112E-01    3          -15        16         5             # TP     -->  TAU+   NUT    BT          
#         PDG         Width
DECAY   1000021  5.22413635E+00   # GLSS  decays
#          BR          NDA       ID1       ID2       ID3       ID4
      1.21371611E-03    3      1000024         1        -2             # GLSS   -->  W1SS+  DN     UB          
      1.21371611E-03    3     -1000024         2        -1             # GLSS   -->  W1SS-  UP     DB          
      1.21371390E-03    3      1000024         3        -4             # GLSS   -->  W1SS+  ST     CB          
      1.21371390E-03    3     -1000024         4        -3             # GLSS   -->  W1SS-  CH     SB          
      5.29240293E-04    3      1000024         5        -6             # GLSS   -->  W1SS+  BT     TB          
      5.29240293E-04    3     -1000024         6        -5             # GLSS   -->  W1SS-  TP     BB          
      2.02432893E-05    3      1000037         1        -2             # GLSS   -->  W2SS+  DN     UB          
      2.02432893E-05    3     -1000037         2        -1             # GLSS   -->  W2SS-  UP     DB          
      2.02432293E-05    3      1000037         3        -4             # GLSS   -->  W2SS+  ST     CB          
      2.02432293E-05    3     -1000037         4        -3             # GLSS   -->  W2SS-  CH     SB          
      1.64229696E-05    3      1000037         5        -6             # GLSS   -->  W2SS+  BT     TB          
      1.64229696E-05    3     -1000037         6        -5             # GLSS   -->  W2SS-  TP     BB          
      5.17934041E-07    2      1000022        21                       # GLSS   -->  Z1SS   GL                 
      8.16856700E-05    3      1000022         1        -1             # GLSS   -->  Z1SS   DN     DB          
      8.16855390E-05    3      1000022         3        -3             # GLSS   -->  Z1SS   ST     SB          
      1.01464873E-04    3      1000022         6        -6             # GLSS   -->  Z1SS   TP     TB          
      7.87394825E-08    2      1000023        21                       # GLSS   -->  Z2SS   GL                 
      1.85271131E-03    3      1000023         1        -1             # GLSS   -->  Z2SS   DN     DB          
      1.85270794E-03    3      1000023         3        -3             # GLSS   -->  Z2SS   ST     SB          
      2.51169520E-04    3      1000023         6        -6             # GLSS   -->  Z2SS   TP     TB          
      3.32060226E-05    2      1000025        21                       # GLSS   -->  Z3SS   GL                 
      1.07836713E-05    3      1000025         1        -1             # GLSS   -->  Z3SS   DN     DB          
      1.07836522E-05    3      1000025         3        -3             # GLSS   -->  Z3SS   ST     SB          
      1.66178779E-05    2      1000035        21                       # GLSS   -->  Z4SS   GL                 
      8.60748914E-05    3      1000035         1        -1             # GLSS   -->  Z4SS   DN     DB          
      8.60747023E-05    3      1000035         3        -3             # GLSS   -->  Z4SS   ST     SB          
      1.38358164E-05    2     -1000002         2                       # GLSS   -->  UBL    UP                 
      1.38358164E-05    2      1000002        -2                       # GLSS   -->  UPL    UB                 
      4.86373994E-03    2     -2000002         2                       # GLSS   -->  UBR    UP                 
      4.86373994E-03    2      2000002        -2                       # GLSS   -->  UPR    UB                 
      5.08539053E-03    2     -2000001         1                       # GLSS   -->  DBR    DN                 
      5.08539053E-03    2      2000001        -1                       # GLSS   -->  DNR    DB                 
      5.08517027E-03    2     -2000003         3                       # GLSS   -->  SBR    ST                 
      5.08517027E-03    2      2000003        -3                       # GLSS   -->  STR    SB                 
      4.85267816E-03    2     -2000004         4                       # GLSS   -->  CBR    CH                 
      4.85267816E-03    2      2000004        -4                       # GLSS   -->  CHR    CB                 
      2.11138308E-01    2     -1000005         5                       # GLSS   -->  BB1    BT                 
      2.11138308E-01    2      1000005        -5                       # GLSS   -->  BT1    BB                 
      6.54364750E-02    2     -2000005         5                       # GLSS   -->  BB2    BT                 
      6.54364750E-02    2      2000005        -5                       # GLSS   -->  BT2    BB                 
      1.98277980E-01    2     -1000006         6                       # GLSS   -->  TB1    TP                 
      1.98277980E-01    2      1000006        -6                       # GLSS   -->  TP1    TB                 
#         PDG         Width
DECAY   1000002  7.59288740E+00   # UPL   decays
#          BR          NDA       ID1       ID2       ID3       ID4
      1.04171932E-02    2      1000022         2                       # UPL    -->  Z1SS   UP                 
      3.22495729E-01    2      1000023         2                       # UPL    -->  Z2SS   UP                 
      5.58794593E-04    2      1000025         2                       # UPL    -->  Z3SS   UP                 
      5.28360344E-03    2      1000035         2                       # UPL    -->  Z4SS   UP                 
      6.55587614E-01    2      1000024         1                       # UPL    -->  W1SS+  DN                 
      5.65714110E-03    2      1000037         1                       # UPL    -->  W2SS+  DN                 
#         PDG         Width
DECAY   1000001  7.45185661E+00   # DNL   decays
#          BR          NDA       ID1       ID2       ID3       ID4
      1.63623486E-02    2      1000022         1                       # DNL    -->  Z1SS   DN                 
      3.21150988E-01    2      1000023         1                       # DNL    -->  Z2SS   DN                 
      9.55868047E-04    2      1000025         1                       # DNL    -->  Z3SS   DN                 
      7.27446051E-03    2      1000035         1                       # DNL    -->  Z4SS   DN                 
      5.34174440E-04    2      1000021         1                       # DNL    -->  GLSS   DN                 
      6.31523073E-01    2     -1000024         2                       # DNL    -->  W1SS-  UP                 
      2.21990943E-02    2     -1000037         2                       # DNL    -->  W2SS-  UP                 
#         PDG         Width
DECAY   1000003  7.45181656E+00   # STL   decays
#          BR          NDA       ID1       ID2       ID3       ID4
      1.63624380E-02    2      1000022         3                       # STL    -->  Z1SS   ST                 
      3.21152717E-01    2      1000023         3                       # STL    -->  Z2SS   ST                 
      9.55873460E-04    2      1000025         3                       # STL    -->  Z3SS   ST                 
      7.27450289E-03    2      1000035         3                       # STL    -->  Z4SS   ST                 
      5.34191320E-04    2      1000021         3                       # STL    -->  GLSS   ST                 
      6.31521523E-01    2     -1000024         4                       # STL    -->  W1SS-  CH                 
      2.21987609E-02    2     -1000037         4                       # STL    -->  W2SS-  CH                 
#         PDG         Width
DECAY   1000004  7.59288502E+00   # CHL   decays
#          BR          NDA       ID1       ID2       ID3       ID4
      1.04171438E-02    2      1000022         4                       # CHL    -->  Z1SS   CH                 
      3.22494030E-01    2      1000023         4                       # CHL    -->  Z2SS   CH                 
      5.58787317E-04    2      1000025         4                       # CHL    -->  Z3SS   CH                 
      5.28353034E-03    2      1000035         4                       # CHL    -->  Z4SS   CH                 
      6.55589283E-01    2      1000024         3                       # CHL    -->  W1SS+  ST                 
      5.65718208E-03    2      1000037         3                       # CHL    -->  W2SS+  ST                 
#         PDG         Width
DECAY   1000005  4.82088566E+00   # BT1   decays
#          BR          NDA       ID1       ID2       ID3       ID4
      6.67646304E-02    2      1000022         5                       # BT1    -->  Z1SS   BT                 
      3.10758650E-01    2      1000023         5                       # BT1    -->  Z2SS   BT                 
      2.84016561E-02    2      1000025         5                       # BT1    -->  Z3SS   BT                 
      1.64265875E-02    2      1000035         5                       # BT1    -->  Z4SS   BT                 
      4.28241372E-01    2     -1000024         6                       # BT1    -->  W1SS-  TP                 
      1.49407133E-01    2          -24   1000006                       # BT1    -->  W-     TP1                
#         PDG         Width
DECAY   1000006  1.82871687E+00   # TP1   decays
#          BR          NDA       ID1       ID2       ID3       ID4
      2.86375582E-01    2      1000022         6                       # TP1    -->  Z1SS   TP                 
      1.30322188E-01    2      1000023         6                       # TP1    -->  Z2SS   TP                 
      5.83302200E-01    2      1000024         5                       # TP1    -->  W1SS+  BT                 
#         PDG         Width
DECAY   2000002  1.54506361E+00   # UPR   decays
#          BR          NDA       ID1       ID2       ID3       ID4
      9.95697320E-01    2      1000022         2                       # UPR    -->  Z1SS   UP                 
      1.50397839E-03    2      1000023         2                       # UPR    -->  Z2SS   UP                 
      7.75618886E-04    2      1000025         2                       # UPR    -->  Z3SS   UP                 
      2.02310481E-03    2      1000035         2                       # UPR    -->  Z4SS   UP                 
#         PDG         Width
DECAY   2000001  3.85987848E-01   # DNR   decays
#          BR          NDA       ID1       ID2       ID3       ID4
      9.95703638E-01    2      1000022         1                       # DNR    -->  Z1SS   DN                 
      1.50364544E-03    2      1000023         1                       # DNR    -->  Z2SS   DN                 
      7.74068641E-04    2      1000025         1                       # DNR    -->  Z3SS   DN                 
      2.01867684E-03    2      1000035         1                       # DNR    -->  Z4SS   DN                 
#         PDG         Width
DECAY   2000003  3.85987848E-01   # STR   decays
#          BR          NDA       ID1       ID2       ID3       ID4
      9.95703638E-01    2      1000022         3                       # STR    -->  Z1SS   ST                 
      1.50364544E-03    2      1000023         3                       # STR    -->  Z2SS   ST                 
      7.74068641E-04    2      1000025         3                       # STR    -->  Z3SS   ST                 
      2.01867684E-03    2      1000035         3                       # STR    -->  Z4SS   ST                 
#         PDG         Width
DECAY   2000004  1.54505587E+00   # CHR   decays
#          BR          NDA       ID1       ID2       ID3       ID4
      9.95697260E-01    2      1000022         4                       # CHR    -->  Z1SS   CH                 
      1.50397723E-03    2      1000023         4                       # CHR    -->  Z2SS   CH                 
      7.75611319E-04    2      1000025         4                       # CHR    -->  Z3SS   CH                 
      2.02308269E-03    2      1000035         4                       # CHR    -->  Z4SS   CH                 
#         PDG         Width
DECAY   2000005  4.29876041E+00   # BT2   decays
#          BR          NDA       ID1       ID2       ID3       ID4
      3.39836553E-02    2      1000022         5                       # BT2    -->  Z1SS   BT                 
      9.24703032E-02    2      1000023         5                       # BT2    -->  Z2SS   BT                 
      8.72819871E-02    2      1000025         5                       # BT2    -->  Z3SS   BT                 
      9.39334854E-02    2      1000035         5                       # BT2    -->  Z4SS   BT                 
      1.28800154E-01    2     -1000024         6                       # BT2    -->  W1SS-  TP                 
      7.33534545E-02    2     -1000037         6                       # BT2    -->  W2SS-  TP                 
      4.90176976E-01    2          -24   1000006                       # BT2    -->  W-     TP1                
#         PDG         Width
DECAY   2000006  9.40398502E+00   # TP2   decays
#          BR          NDA       ID1       ID2       ID3       ID4
      2.71484196E-01    2      1000024         5                       # TP2    -->  W1SS+  BT                 
      1.43436432E-01    2      1000037         5                       # TP2    -->  W2SS+  BT                 
      2.62768298E-01    2           23   1000006                       # TP2    -->  Z0     TP1                
      7.33111054E-02    2           25   1000006                       # TP2    -->  HL0    TP1                
      9.88029409E-03    2           24   1000005                       # TP2    -->  W+     BT1                
      3.36110070E-02    2      1000022         6                       # TP2    -->  Z1SS   TP                 
      1.02159858E-01    2      1000023         6                       # TP2    -->  Z2SS   TP                 
      1.51318107E-02    2      1000025         6                       # TP2    -->  Z3SS   TP                 
      8.82170647E-02    2      1000035         6                       # TP2    -->  Z4SS   TP                 
#         PDG         Width
DECAY   1000011  2.07962322E+00   # EL-   decays
#          BR          NDA       ID1       ID2       ID3       ID4
      1.72824159E-01    2      1000022        11                       # EL-    -->  Z1SS   E-                 
      2.91155577E-01    2      1000023        11                       # EL-    -->  Z2SS   E-                 
      5.36020041E-01    2     -1000024        12                       # EL-    -->  W1SS-  NUE                
      1.02650731E-07    3      1000015        11       -15             # EL-    -->  TAU1-  E-     TAU+        
      8.55530402E-08    3     -1000015        11        15             # EL-    -->  TAU1+  E-     TAU-        
#         PDG         Width
DECAY   1000013  2.07962275E+00   # MUL-  decays
#          BR          NDA       ID1       ID2       ID3       ID4
      1.72824159E-01    2      1000022        13                       # MUL-   -->  Z1SS   MU-                
      2.91155517E-01    2      1000023        13                       # MUL-   -->  Z2SS   MU-                
      5.36020160E-01    2     -1000024        14                       # MUL-   -->  W1SS-  NUM                
      1.02650759E-07    3      1000015        13       -15             # MUL-   -->  TAU1-  MU-    TAU+        
      8.55530615E-08    3     -1000015        13        15             # MUL-   -->  TAU1+  MU-    TAU-        
#         PDG         Width
DECAY   1000015  2.41565883E-01   # TAU1- decays
#          BR          NDA       ID1       ID2       ID3       ID4
      1.00000000E+00    2      1000022        15                       # TAU1-  -->  Z1SS   TAU-               
#         PDG         Width
DECAY   1000012  1.99457479E+00   # NUEL  decays
#          BR          NDA       ID1       ID2       ID3       ID4
      2.00296849E-01    2      1000022        12                       # NUEL   -->  Z1SS   NUE                
      2.53117204E-01    2      1000023        12                       # NUEL   -->  Z2SS   NUE                
      5.46584368E-01    2      1000024        11                       # NUEL   -->  W1SS+  E-                 
      2.25129966E-07    3      1000015        12       -15             # NUEL   -->  TAU1-  NUE    TAU+        
      1.20644401E-07    3     -1000015        12        15             # NUEL   -->  TAU1+  NUE    TAU-        
      1.19698723E-06    3     -1000015        11        16             # NUEL   -->  TAU1+  E-     NUT         
#         PDG         Width
DECAY   1000014  1.99457431E+00   # NUML  decays
#          BR          NDA       ID1       ID2       ID3       ID4
      2.00296894E-01    2      1000022        14                       # NUML   -->  Z1SS   NUM                
      2.53117263E-01    2      1000023        14                       # NUML   -->  Z2SS   NUM                
      5.46584308E-01    2      1000024        13                       # NUML   -->  W1SS+  MU-                
      2.25130023E-07    3      1000015        14       -15             # NUML   -->  TAU1-  NUM    TAU+        
      1.20644430E-07    3     -1000015        14        15             # NUML   -->  TAU1+  NUM    TAU-        
      1.20258858E-06    3     -1000015        13        16             # NUML   -->  TAU1+  MU-    NUT         
#         PDG         Width
DECAY   1000016  1.93098247E+00   # NUTL  decays
#          BR          NDA       ID1       ID2       ID3       ID4
      1.67815551E-01    2      1000022        16                       # NUTL   -->  Z1SS   NUT                
      1.44722462E-01    2      1000023        16                       # NUTL   -->  Z2SS   NUT                
      3.21205378E-01    2      1000024        15                       # NUTL   -->  W1SS+  TAU-               
      3.66256148E-01    2           24   1000015                       # NUTL   -->  W+     TAU1-              
      5.19343700E-07    3     -1000015        16        15             # NUTL   -->  TAU1+  NUT    TAU-        
      3.55318654E-08    3      1000015        16       -15             # NUTL   -->  TAU1-  NUT    TAU+        
#         PDG         Width
DECAY   2000011  1.29021168E+00   # ER-   decays
#          BR          NDA       ID1       ID2       ID3       ID4
      9.99375045E-01    2      1000022        11                       # ER-    -->  Z1SS   E-                 
      6.24999753E-04    2      1000023        11                       # ER-    -->  Z2SS   E-                 
      4.72277373E-09    3      1000015        11       -15             # ER-    -->  TAU1-  E-     TAU+        
      2.02099812E-08    3     -1000015        11        15             # ER-    -->  TAU1+  E-     TAU-        
      1.76676165E-14    3      1000015        12       -16             # ER-    -->  TAU1-  NUE    ANUT        
#         PDG         Width
DECAY   2000013  1.29021120E+00   # MUR-  decays
#          BR          NDA       ID1       ID2       ID3       ID4
      9.99375045E-01    2      1000022        13                       # MUR-   -->  Z1SS   MU-                
      6.24999579E-04    2      1000023        13                       # MUR-   -->  Z2SS   MU-                
      4.72277550E-09    3      1000015        13       -15             # MUR-   -->  TAU1-  MU-    TAU+        
      2.02099883E-08    3     -1000015        13        15             # MUR-   -->  TAU1+  MU-    TAU-        
      7.48904327E-10    3      1000015        14       -16             # MUR-   -->  TAU1-  NUM    ANUT        
#         PDG         Width
DECAY   2000015  2.25141978E+00   # TAU2- decays
#          BR          NDA       ID1       ID2       ID3       ID4
      2.09857181E-01    2      1000022        15                       # TAU2-  -->  Z1SS   TAU-               
      1.56117797E-01    2      1000023        15                       # TAU2-  -->  Z2SS   TAU-               
      2.71634161E-01    2     -1000024        16                       # TAU2-  -->  W1SS-  NUT                
      2.42463440E-01    2           23   1000015                       # TAU2-  -->  Z0     TAU1-              
      1.19927377E-01    2           25   1000015                       # TAU2-  -->  HL0    TAU1-              
#         PDG         Width
DECAY   1000023  5.74453622E-02   # Z2SS  decays
#          BR          NDA       ID1       ID2       ID3       ID4
      3.77362966E-07    2      1000022        22                       # Z2SS   -->  Z1SS   GM                 
      1.10318279E-02    2      1000022        23                       # Z2SS   -->  Z1SS   Z0                 
      3.41868770E-07    3      1000022         2        -2             # Z2SS   -->  Z1SS   UP     UB          
      4.84137729E-07    3      1000022         1        -1             # Z2SS   -->  Z1SS   DN     DB          
      4.84137558E-07    3      1000022         3        -3             # Z2SS   -->  Z1SS   ST     SB          
      3.41866439E-07    3      1000022         4        -4             # Z2SS   -->  Z1SS   CH     CB          
      1.47039973E-05    3      1000022         5        -5             # Z2SS   -->  Z1SS   BT     BB          
      2.66372572E-05    3      1000022        11       -11             # Z2SS   -->  Z1SS   E-     E+          
      2.66372572E-05    3      1000022        13       -13             # Z2SS   -->  Z1SS   MU-    MU+         
      2.84736689E-05    3      1000022        15       -15             # Z2SS   -->  Z1SS   TAU-   TAU+        
      3.11478216E-05    3      1000022        12       -12             # Z2SS   -->  Z1SS   NUE    ANUE        
      3.11478216E-05    3      1000022        14       -14             # Z2SS   -->  Z1SS   NUM    ANUM        
      6.55939803E-05    3      1000022        16       -16             # Z2SS   -->  Z1SS   NUT    ANUT        
      4.94370878E-01    2      1000015       -15                       # Z2SS   -->  TAU1-  TAU+               
      4.94370878E-01    2     -1000015        15                       # Z2SS   -->  TAU1+  TAU-               
#         PDG         Width
DECAY   1000025  3.45420313E+00   # Z3SS  decays
#          BR          NDA       ID1       ID2       ID3       ID4
      4.96056657E-07    2      1000022        22                       # Z3SS   -->  Z1SS   GM                 
      2.43264093E-08    2      1000023        22                       # Z3SS   -->  Z2SS   GM                 
      2.35349730E-01    2      1000024       -24                       # Z3SS   -->  W1SS+  W-                 
      2.35349730E-01    2     -1000024        24                       # Z3SS   -->  W1SS-  W+                 
      6.77309930E-02    2      1000022        23                       # Z3SS   -->  Z1SS   Z0                 
      1.91621080E-01    2      1000023        23                       # Z3SS   -->  Z2SS   Z0                 
      2.23879226E-08    3      1000022         2        -2             # Z3SS   -->  Z1SS   UP     UB          
      7.84789300E-09    3      1000022         1        -1             # Z3SS   -->  Z1SS   DN     DB          
      7.84789034E-09    3      1000022         3        -3             # Z3SS   -->  Z1SS   ST     SB          
      2.23877041E-08    3      1000022         4        -4             # Z3SS   -->  Z1SS   CH     CB          
      1.27330059E-04    3      1000022         5        -5             # Z3SS   -->  Z1SS   BT     BB          
      2.35415246E-05    3      1000022        15       -15             # Z3SS   -->  Z1SS   TAU-   TAU+        
      2.65072799E-08    3      1000023         2        -2             # Z3SS   -->  Z2SS   UP     UB          
      4.07011349E-08    3      1000023         1        -1             # Z3SS   -->  Z2SS   DN     DB          
      4.07011136E-08    3      1000023         3        -3             # Z3SS   -->  Z2SS   ST     SB          
      2.65070437E-08    3      1000023         4        -4             # Z3SS   -->  Z2SS   CH     CB          
      7.95409142E-05    3      1000023         5        -5             # Z3SS   -->  Z2SS   BT     BB          
      9.51964012E-06    3      1000023        15       -15             # Z3SS   -->  Z2SS   TAU-   TAU+        
      2.00884026E-02    2      1000022        25                       # Z3SS   -->  Z1SS   HL0                
      1.84559859E-02    2      1000023        25                       # Z3SS   -->  Z2SS   HL0                
      9.31984832E-05    2      1000011       -11                       # Z3SS   -->  EL-    E+                 
      9.31984832E-05    2     -1000011        11                       # Z3SS   -->  EL+    E-                 
      9.31984396E-05    2      1000013       -13                       # Z3SS   -->  MUL-   MU+                
      9.31984396E-05    2     -1000013        13                       # Z3SS   -->  MUL+   MU-                
      2.26975550E-04    2      2000011       -11                       # Z3SS   -->  ER-    E+                 
      2.26975550E-04    2     -2000011        11                       # Z3SS   -->  ER+    E-                 
      2.26975477E-04    2      2000013       -13                       # Z3SS   -->  MUR-   MU+                
      2.26975477E-04    2     -2000013        13                       # Z3SS   -->  MUR+   MU-                
      8.33505616E-02    2      1000015       -15                       # Z3SS   -->  TAU1-  TAU+               
      8.33505616E-02    2     -1000015        15                       # Z3SS   -->  TAU1+  TAU-               
      2.96801776E-02    2      2000015       -15                       # Z3SS   -->  TAU2-  TAU+               
      2.96801776E-02    2     -2000015        15                       # Z3SS   -->  TAU2+  TAU-               
      5.06933720E-04    2      1000012       -12                       # Z3SS   -->  NUEL   ANUE               
      5.06933720E-04    2     -1000012        12                       # Z3SS   -->  ANUEL  NUE                
      5.06933720E-04    2      1000014       -14                       # Z3SS   -->  NUML   ANUM               
      5.06933720E-04    2     -1000014        14                       # Z3SS   -->  ANUML  NUM                
      8.96928541E-04    2      1000016       -16                       # Z3SS   -->  NUTL   ANUT               
      8.96928541E-04    2     -1000016        16                       # Z3SS   -->  ANUTL  NUT                
#         PDG         Width
DECAY   1000035  3.65000582E+00   # Z4SS  decays
#          BR          NDA       ID1       ID2       ID3       ID4
      8.82605207E-07    2      1000022        22                       # Z4SS   -->  Z1SS   GM                 
      8.88037732E-08    2      1000023        22                       # Z4SS   -->  Z2SS   GM                 
      1.33956943E-10    2      1000025        22                       # Z4SS   -->  Z3SS   GM                 
      2.39374042E-01    2      1000024       -24                       # Z4SS   -->  W1SS+  W-                 
      2.39374042E-01    2     -1000024        24                       # Z4SS   -->  W1SS-  W+                 
      2.27784347E-02    2      1000022        23                       # Z4SS   -->  Z1SS   Z0                 
      2.54455619E-02    2      1000023        23                       # Z4SS   -->  Z2SS   Z0                 
      1.73253568E-07    3      1000022         2        -2             # Z4SS   -->  Z1SS   UP     UB          
      1.20135127E-07    3      1000022         1        -1             # Z4SS   -->  Z1SS   DN     DB          
      1.20135084E-07    3      1000022         3        -3             # Z4SS   -->  Z1SS   ST     SB          
      1.73251991E-07    3      1000022         4        -4             # Z4SS   -->  Z1SS   CH     CB          
      1.26142157E-04    3      1000022         5        -5             # Z4SS   -->  Z1SS   BT     BB          
      2.37040804E-05    3      1000022        15       -15             # Z4SS   -->  Z1SS   TAU-   TAU+        
      7.88076875E-07    3      1000023         2        -2             # Z4SS   -->  Z2SS   UP     UB          
      9.73370902E-07    3      1000023         1        -1             # Z4SS   -->  Z2SS   DN     DB          
      9.73370334E-07    3      1000023         3        -3             # Z4SS   -->  Z2SS   ST     SB          
      7.88069883E-07    3      1000023         4        -4             # Z4SS   -->  Z2SS   CH     CB          
      8.23822193E-05    3      1000023         5        -5             # Z4SS   -->  Z2SS   BT     BB          
      9.35232219E-06    3      1000023        15       -15             # Z4SS   -->  Z2SS   TAU-   TAU+        
      6.92086255E-09    3      1000025         2        -2             # Z4SS   -->  Z3SS   UP     UB          
      8.93883811E-09    3      1000025         1        -1             # Z4SS   -->  Z3SS   DN     DB          
      8.93883811E-09    3      1000025         3        -3             # Z4SS   -->  Z3SS   ST     SB          
      6.92086255E-09    3      1000025         4        -4             # Z4SS   -->  Z3SS   CH     CB          
      5.33279865E-10    3      1000025         5        -5             # Z4SS   -->  Z3SS   BT     BB          
      2.02595052E-09    3      1000025        11       -11             # Z4SS   -->  Z3SS   E-     E+          
      2.02595052E-09    3      1000025        13       -13             # Z4SS   -->  Z3SS   MU-    MU+         
      1.52553137E-09    3      1000025        15       -15             # Z4SS   -->  Z3SS   TAU-   TAU+        
      4.03100442E-09    3      1000025        12       -12             # Z4SS   -->  Z3SS   NUE    ANUE        
      4.03100442E-09    3      1000025        14       -14             # Z4SS   -->  Z3SS   NUM    ANUM        
      4.03100442E-09    3      1000025        16       -16             # Z4SS   -->  Z3SS   NUT    ANUT        
      6.04621992E-02    2      1000022        25                       # Z4SS   -->  Z1SS   HL0                
      1.78987518E-01    2      1000023        25                       # Z4SS   -->  Z2SS   HL0                
      1.48632051E-03    2      1000011       -11                       # Z4SS   -->  EL-    E+                 
      1.48632051E-03    2     -1000011        11                       # Z4SS   -->  EL+    E-                 
      1.48632016E-03    2      1000013       -13                       # Z4SS   -->  MUL-   MU+                
      1.48632016E-03    2     -1000013        13                       # Z4SS   -->  MUL+   MU-                
      6.77543750E-04    2      2000011       -11                       # Z4SS   -->  ER-    E+                 
      6.77543750E-04    2     -2000011        11                       # Z4SS   -->  ER+    E-                 
      6.77543867E-04    2      2000013       -13                       # Z4SS   -->  MUR-   MU+                
      6.77543867E-04    2     -2000013        13                       # Z4SS   -->  MUR+   MU-                
      6.20682687E-02    2      1000015       -15                       # Z4SS   -->  TAU1-  TAU+               
      6.20682687E-02    2     -1000015        15                       # Z4SS   -->  TAU1+  TAU-               
      3.58853973E-02    2      2000015       -15                       # Z4SS   -->  TAU2-  TAU+               
      3.58853973E-02    2     -2000015        15                       # Z4SS   -->  TAU2+  TAU-               
      3.91037762E-03    2      1000012       -12                       # Z4SS   -->  NUEL   ANUE               
      3.91037762E-03    2     -1000012        12                       # Z4SS   -->  ANUEL  NUE                
      3.91037762E-03    2      1000014       -14                       # Z4SS   -->  NUML   ANUM               
      3.91037762E-03    2     -1000014        14                       # Z4SS   -->  ANUML  NUM                
      6.56358851E-03    2      1000016       -16                       # Z4SS   -->  NUTL   ANUT               
      6.56358851E-03    2     -1000016        16                       # Z4SS   -->  ANUTL  NUT                
#         PDG         Width
DECAY   1000024  5.71282879E-02   # W1SS+ decays
#          BR          NDA       ID1       ID2       ID3       ID4
      8.28732595E-07    3      1000022         2        -1             # W1SS+  -->  Z1SS   UP     DB          
      8.28729924E-07    3      1000022         4        -3             # W1SS+  -->  Z1SS   CH     SB          
      5.89342235E-05    3      1000022       -11        12             # W1SS+  -->  Z1SS   E+     NUE         
      5.89342235E-05    3      1000022       -13        14             # W1SS+  -->  Z1SS   MU+    NUM         
      9.43883279E-05    3      1000022       -15        16             # W1SS+  -->  Z1SS   TAU+   NUT         
      5.26463240E-02    2      1000022        24                       # W1SS+  -->  Z1SS   W+                 
      4.87428532E-14    3      1000023       -11        12             # W1SS+  -->  Z2SS   E+     NUE         
      4.87428532E-14    3      1000023       -13        14             # W1SS+  -->  Z2SS   MU+    NUM         
      9.47139800E-01    2     -1000015        16                       # W1SS+  -->  TAU1+  NUT                
#         PDG         Width
DECAY   1000037  3.65253139E+00   # W2SS+ decays
#          BR          NDA       ID1       ID2       ID3       ID4
      1.89123952E-07    3      1000022         2        -1             # W2SS+  -->  Z1SS   UP     DB          
      1.89123597E-07    3      1000022         4        -3             # W2SS+  -->  Z1SS   CH     SB          
      1.69798532E-05    3      1000022       -15        16             # W2SS+  -->  Z1SS   TAU+   NUT         
      7.31851012E-02    2      1000022        24                       # W2SS+  -->  Z1SS   W+                 
      8.74090119E-07    3      1000023         2        -1             # W2SS+  -->  Z2SS   UP     DB          
      8.74089380E-07    3      1000023         4        -3             # W2SS+  -->  Z2SS   CH     SB          
      1.31241468E-05    3      1000023       -15        16             # W2SS+  -->  Z2SS   TAU+   NUT         
      2.43219912E-01    2      1000023        24                       # W2SS+  -->  Z2SS   W+                 
      2.23463221E-08    3      1000025         2        -1             # W2SS+  -->  Z3SS   UP     DB          
      2.23463221E-08    3      1000025         4        -3             # W2SS+  -->  Z3SS   CH     SB          
      7.44648743E-09    3      1000025       -11        12             # W2SS+  -->  Z3SS   E+     NUE         
      7.44648743E-09    3      1000025       -13        14             # W2SS+  -->  Z3SS   MU+    NUM         
      7.44667705E-09    3      1000025       -15        16             # W2SS+  -->  Z3SS   TAU+   NUT         
      3.16644721E-02    2      1000006        -5                       # W2SS+  -->  TP1    BB                 
      2.48407270E-03    2      1000012       -11                       # W2SS+  -->  NUEL   E+                 
      2.48407177E-03    2      1000014       -13                       # W2SS+  -->  NUML   MU+                
      7.82276914E-02    2      1000016       -15                       # W2SS+  -->  NUTL   TAU+               
      8.19269847E-03    2     -1000011        12                       # W2SS+  -->  EL+    NUE                
      8.19269847E-03    2     -1000013        14                       # W2SS+  -->  MUL+   NUM                
      9.02875289E-02    2     -1000015        16                       # W2SS+  -->  TAU1+  NUT                
      3.60959321E-02    2     -2000015        16                       # W2SS+  -->  TAU2+  NUT                
      2.24255681E-01    2      1000024        23                       # W2SS+  -->  W1SS+  Z0                 
      5.99432894E-07    3      1000024         1        -1             # W2SS+  -->  W1SS+  DN     DB          
      5.99427551E-07    3      1000024         3        -3             # W2SS+  -->  W1SS+  ST     SB          
      2.04067737E-06    3      1000024         2        -2             # W2SS+  -->  W1SS+  UP     UB          
      2.04067669E-06    3      1000024         4        -4             # W2SS+  -->  W1SS+  CH     CB          
      2.01672643E-01    2      1000024        25                       # W2SS+  -->  W1SS+  HL0                
#         PDG         Width
DECAY        25  4.09884052E-03   # HL0   decays
#          BR          NDA       ID1       ID2       ID3       ID4
      4.86492713E-09    2           11       -11                       # HL0    -->  E-     E+                 
      2.05404955E-04    2           13       -13                       # HL0    -->  MU-    MU+                
      5.87462224E-02    2           15       -15                       # HL0    -->  TAU-   TAU+               
      6.10650613E-06    2            1        -1                       # HL0    -->  DN     DB                 
      2.46733427E-03    2            3        -3                       # HL0    -->  ST     SB                 
      8.09479296E-01    2            5        -5                       # HL0    -->  BT     BB                 
      1.90428523E-06    2            2        -2                       # HL0    -->  UP     UB                 
      3.58786955E-02    2            4        -4                       # HL0    -->  CH     CB                 
      1.76001899E-03    2           22        22                       # HL0    -->  GM     GM                 
      3.90745774E-02    2           21        21                       # HL0    -->  GL     GL                 
      2.71647237E-03    3           24        11       -12             # HL0    -->  W+     E-     ANUE        
      2.71647237E-03    3           24        13       -14             # HL0    -->  W+     MU-    ANUM        
      2.71647237E-03    3           24        15       -16             # HL0    -->  W+     TAU-   ANUT        
      8.14941712E-03    3           24        -2         1             # HL0    -->  W+     UB     DN          
      8.14941712E-03    3           24        -4         3             # HL0    -->  W+     CB     ST          
      2.71647237E-03    3          -24       -11        12             # HL0    -->  W-     E+     NUE         
      2.71647237E-03    3          -24       -13        14             # HL0    -->  W-     MU+    NUM         
      2.71647237E-03    3          -24       -15        16             # HL0    -->  W-     TAU+   NUT         
      8.14941712E-03    3          -24         2        -1             # HL0    -->  W-     UP     DB          
      8.14941712E-03    3          -24         4        -3             # HL0    -->  W-     CH     SB          
      2.38264314E-04    3           23        12       -12             # HL0    -->  Z0     NUE    ANUE        
      2.38264314E-04    3           23        14       -14             # HL0    -->  Z0     NUM    ANUM        
      2.38264314E-04    3           23        16       -16             # HL0    -->  Z0     NUT    ANUT        
      1.19916032E-04    3           23        11       -11             # HL0    -->  Z0     E-     E+          
      1.19916032E-04    3           23        13       -13             # HL0    -->  Z0     MU-    MU+         
      1.19916032E-04    3           23        15       -15             # HL0    -->  Z0     TAU-   TAU+        
      4.10822162E-04    3           23         2        -2             # HL0    -->  Z0     UP     UB          
      4.10822162E-04    3           23         4        -4             # HL0    -->  Z0     CH     CB          
      5.29240177E-04    3           23         1        -1             # HL0    -->  Z0     DN     DB          
      5.29240177E-04    3           23         3        -3             # HL0    -->  Z0     ST     SB          
      5.29240177E-04    3           23         5        -5             # HL0    -->  Z0     BT     BB          
#         PDG         Width
DECAY        35  1.16150799E+01   # HH0   decays
#          BR          NDA       ID1       ID2       ID3       ID4
      1.03624869E-08    2           11       -11                       # HH0    -->  E-     E+                 
      4.37522714E-04    2           13       -13                       # HH0    -->  MU-    MU+                
      1.25301138E-01    2           15       -15                       # HH0    -->  TAU-   TAU+               
      1.27884505E-05    2            1        -1                       # HH0    -->  DN     DB                 
      5.16718114E-03    2            3        -3                       # HH0    -->  ST     SB                 
      8.46831441E-01    2            5        -5                       # HH0    -->  BT     BB                 
      1.64002666E-12    2            2        -2                       # HH0    -->  UP     UB                 
      2.55584833E-08    2            4        -4                       # HH0    -->  CH     CB                 
      4.09269647E-04    2            6        -6                       # HH0    -->  TP     TB                 
      8.66430057E-08    2           22        22                       # HH0    -->  GM     GM                 
      1.80710886E-05    2           21        21                       # HH0    -->  GL     GL                 
      2.08453727E-07    2           24       -24                       # HH0    -->  W+     W-                 
      1.01191290E-07    2           23        23                       # HH0    -->  Z0     Z0                 
      5.54286409E-04    2      1000022   1000022                       # HH0    -->  Z1SS   Z1SS               
      1.20188482E-03    2      1000022   1000023                       # HH0    -->  Z1SS   Z2SS               
      1.75733949E-04    2           25        25                       # HH0    -->  HL0    HL0                
      1.98902208E-02    2      1000015  -1000015                       # HH0    -->  TAU1-  TAU1+              
#         PDG         Width
DECAY        36  1.13525457E+01   # HA0   decays
#          BR          NDA       ID1       ID2       ID3       ID4
      1.05367723E-08    2           11       -11                       # HA0    -->  E-     E+                 
      4.44881502E-04    2           13       -13                       # HA0    -->  MU-    MU+                
      1.27416745E-01    2           15       -15                       # HA0    -->  TAU-   TAU+               
      1.30043300E-05    2            1        -1                       # HA0    -->  DN     DB                 
      5.25440788E-03    2            3        -3                       # HA0    -->  ST     SB                 
      8.61348271E-01    2            5        -5                       # HA0    -->  BT     BB                 
      1.62537865E-12    2            2        -2                       # HA0    -->  UP     UB                 
      2.53507988E-08    2            4        -4                       # HA0    -->  CH     CB                 
      9.76057083E-04    2            6        -6                       # HA0    -->  TP     TB                 
      6.12365056E-08    2           22        22                       # HA0    -->  GM     GM                 
      3.10162868E-05    2           21        21                       # HA0    -->  GL     GL                 
      8.53457605E-04    2      1000022   1000022                       # HA0    -->  Z1SS   Z1SS               
      3.66187352E-03    2      1000022   1000023                       # HA0    -->  Z1SS   Z2SS               
      1.77860642E-07    2           25        23                       # HA0    -->  HL0    Z0                 
#         PDG         Width
DECAY        37  8.27261066E+00   # H+    decays
#          BR          NDA       ID1       ID2       ID3       ID4
      1.48326800E-08    2           12       -11                       # H+     -->  NUE    E+                 
      6.26262452E-04    2           14       -13                       # H+     -->  NUM    MU+                
      1.79365620E-01    2           16       -15                       # H+     -->  NUT    TAU+               
      1.67020426E-05    2            2        -1                       # H+     -->  UP     DB                 
      6.74837828E-03    2            4        -3                       # H+     -->  CH     SB                 
      8.06313813E-01    2            6        -5                       # H+     -->  TP     BB                 
      6.92900782E-03    2      1000024   1000022                       # H+     -->  W1SS+  Z1SS               
      2.74944000E-07    2           25        24                       # H+     -->  HL0    W+                 
