  65
  401   2484.8665    0.30431E-25
  402   2483.5825    0.30359E-25
  403   2484.7866    0.30432E-25
  404   2483.5032    0.30361E-25
  405   2121.2759    0.26530E-25
  406   1963.7360    0.35100E-25
  407   2484.8665    0.30431E-25
  408   2483.5825    0.30359E-25
  409   2484.7866    0.30432E-25
  410   2483.5032    0.30361E-25
  411   2121.2759    0.26530E-25
  412   1963.7360    0.35100E-25
  413   2366.0356    0.55113E-24
  414   2377.9800    0.13693E-24
  415   2365.8757    0.55117E-24
  416   2377.9705    0.13693E-24
  417   2206.5347    0.16093E-25
  418   2214.0835    0.15139E-25
  419   2366.0356    0.55113E-24
  420   2377.9800    0.13693E-24
  421   2365.8757    0.55117E-24
  422   2377.9705    0.13693E-24
  423   2206.5347    0.16093E-25
  424   2214.0835    0.15139E-25
  425    845.1839    0.17070E-23
  426    841.4019    0.17035E-23
  427    845.0151    0.17082E-23
  428    841.2324    0.17048E-23
  429    205.5507    0.19067E-12
  430    793.6912    0.80719E-26
  431    845.1839    0.17070E-23
  432    841.4019    0.17035E-23
  433    845.0151    0.17082E-23
  434    841.2324    0.17048E-23
  435    205.5507    0.19067E-12
  436    793.6912    0.80719E-26
  437    477.3735    0.15651E-22
  438      0.0000    0.10000E+31
  439    478.4539    0.25325E-20
  440      0.0000    0.10000E+31
  441    817.7610    0.45999E-26
  442      0.0000    0.10000E+31
  443    477.3735    0.15651E-22
  444      0.0000    0.10000E+31
  445    478.4539    0.25325E-20
  446      0.0000    0.10000E+31
  447    817.7610    0.45999E-26
  448      0.0000    0.10000E+31
  449   2740.0901    0.11524E-25
  450    552.3887    0.27720E-24
  451   1029.6085    0.18254E-24
  452  -1383.5818    0.54746E-25
  453   1392.4371    0.53799E-25
  454   1029.7628    0.18244E-24
  455   1392.5052    0.54212E-25
  456   1029.7628    0.18244E-24
  457   1392.5052    0.54212E-25
  203    122.1705    0.10988E-21
  204    565.5016    0.72322E-26
  205    566.6510    0.72191E-26
  206    577.6025    0.19009E-25
  207    577.6025    0.19009E-25
  458      0.0000    0.10000E+31
    6    173.3000    0.56017E-24
   12    173.3000    0.56017E-24
   6
   401  0.15084254E-01     0   450     1     0     0     0
   401  0.32190573E+00     0   451     1     0     0     0
   401  0.15316364E-03     0   452     1     0     0     0
   401  0.64025838E-02     0   453     1     0     0     0
   401  0.64112359E+00     0   456     2     0     0     0
   401  0.15330703E-01     0   457     2     0     0     0
   6
   402  0.14162174E-01     0   450     2     0     0     0
   402  0.32305604E+00     0   451     2     0     0     0
   402  0.91969618E-04     0   452     2     0     0     0
   402  0.53793220E-02     0   453     2     0     0     0
   402  0.64863461E+00     0   454     1     0     0     0
   402  0.86757774E-02     0   455     1     0     0     0
   6
   403  0.15084571E-01     0   450     3     0     0     0
   403  0.32190612E+00     0   451     3     0     0     0
   403  0.15315905E-03     0   452     3     0     0     0
   403  0.64023845E-02     0   453     3     0     0     0
   403  0.64112359E+00     0   456     4     0     0     0
   403  0.15330208E-01     0   457     4     0     0     0
   6
   404  0.14162456E-01     0   450     4     0     0     0
   404  0.32305598E+00     0   451     4     0     0     0
   404  0.91966722E-04     0   452     4     0     0     0
   404  0.53791464E-02     0   453     4     0     0     0
   404  0.64863497E+00     0   454     3     0     0     0
   404  0.86755054E-02     0   455     3     0     0     0
   7
   405  0.47217775E-01     0   450     5     0     0     0
   405  0.94792217E-01     0   451     5     0     0     0
   405  0.20802952E+00     0   452     5     0     0     0
   405  0.17796713E+00     0   453     5     0     0     0
   405  0.17842470E+00     0   456     6     0     0     0
   405  0.28490970E+00     0   457     6     0     0     0
   405  0.86589279E-02     0   199   406     0     0     0
   6
   406  0.18455149E+00     0   450     6     0     0     0
   406  0.47973450E-01     0   451     6     0     0     0
   406  0.20162782E+00     0   452     6     0     0     0
   406  0.13048197E+00     0   453     6     0     0     0
   406  0.10318258E+00     0   454     5     0     0     0
   406  0.33218271E+00     0   455     5     0     0     0
   6
   407  0.15084254E-01     0   450     7     0     0     0
   407  0.32190573E+00     0   451     7     0     0     0
   407  0.15316364E-03     0   452     7     0     0     0
   407  0.64025838E-02     0   453     7     0     0     0
   407  0.64112359E+00     0   454     8     0     0     0
   407  0.15330703E-01     0   455     8     0     0     0
   6
   408  0.14162174E-01     0   450     8     0     0     0
   408  0.32305604E+00     0   451     8     0     0     0
   408  0.91969618E-04     0   452     8     0     0     0
   408  0.53793220E-02     0   453     8     0     0     0
   408  0.64863461E+00     0   456     7     0     0     0
   408  0.86757774E-02     0   457     7     0     0     0
   6
   409  0.15084571E-01     0   450     9     0     0     0
   409  0.32190612E+00     0   451     9     0     0     0
   409  0.15315905E-03     0   452     9     0     0     0
   409  0.64023845E-02     0   453     9     0     0     0
   409  0.64112359E+00     0   454    10     0     0     0
   409  0.15330208E-01     0   455    10     0     0     0
   6
   410  0.14162456E-01     0   450    10     0     0     0
   410  0.32305598E+00     0   451    10     0     0     0
   410  0.91966722E-04     0   452    10     0     0     0
   410  0.53791464E-02     0   453    10     0     0     0
   410  0.64863497E+00     0   456     9     0     0     0
   410  0.86755054E-02     0   457     9     0     0     0
   7
   411  0.47217775E-01     0   450    11     0     0     0
   411  0.94792217E-01     0   451    11     0     0     0
   411  0.20802952E+00     0   452    11     0     0     0
   411  0.17796713E+00     0   453    11     0     0     0
   411  0.17842470E+00     0   454    12     0     0     0
   411  0.28490970E+00     0   455    12     0     0     0
   411  0.86589279E-02     0   198   412     0     0     0
   6
   412  0.18455149E+00     0   450    12     0     0     0
   412  0.47973450E-01     0   451    12     0     0     0
   412  0.20162782E+00     0   452    12     0     0     0
   412  0.13048197E+00     0   453    12     0     0     0
   412  0.10318258E+00     0   456    11     0     0     0
   412  0.33218271E+00     0   457    11     0     0     0
   4
   413  0.99914885E+00     0   450     1     0     0     0
   413  0.62868392E-04     0   451     1     0     0     0
   413  0.12015033E-03     0   452     1     0     0     0
   413  0.66809804E-03     0   453     1     0     0     0
   4
   414  0.99914122E+00     0   450     2     0     0     0
   414  0.63089676E-04     0   451     2     0     0     0
   414  0.12126378E-03     0   452     2     0     0     0
   414  0.67442679E-03     0   453     2     0     0     0
   4
   415  0.99914902E+00     0   450     3     0     0     0
   415  0.62865409E-04     0   451     3     0     0     0
   415  0.12013530E-03     0   452     3     0     0     0
   415  0.66801289E-03     0   453     3     0     0     0
   4
   416  0.99914122E+00     0   450     4     0     0     0
   416  0.63089465E-04     0   451     4     0     0     0
   416  0.12126278E-03     0   452     4     0     0     0
   416  0.67442120E-03     0   453     4     0     0     0
   7
   417  0.55695362E-02     0   450     5     0     0     0
   417  0.88627011E-01     0   451     5     0     0     0
   417  0.15089744E+00     0   452     5     0     0     0
   417  0.15969445E+00     0   453     5     0     0     0
   417  0.16055045E+00     0   456     6     0     0     0
   417  0.34126860E+00     0   457     6     0     0     0
   417  0.93392543E-01     0   199   406     0     0     0
   9
   418  0.22339138E+00     0   454     5     0     0     0
   418  0.28757605E+00     0   455     5     0     0     0
   418  0.52720640E-01     0   200   406     0     0     0
   418  0.54748327E-01     0   203   406     0     0     0
   418  0.21942204E-02     0   198   405     0     0     0
   418  0.12361509E-01     0   450     6     0     0     0
   418  0.10228047E+00     0   451     6     0     0     0
   418  0.11440527E+00     0   452     6     0     0     0
   418  0.15032212E+00     0   453     6     0     0     0
   4
   419  0.99914885E+00     0   450     7     0     0     0
   419  0.62868392E-04     0   451     7     0     0     0
   419  0.12015033E-03     0   452     7     0     0     0
   419  0.66809804E-03     0   453     7     0     0     0
   4
   420  0.99914122E+00     0   450     8     0     0     0
   420  0.63089676E-04     0   451     8     0     0     0
   420  0.12126378E-03     0   452     8     0     0     0
   420  0.67442679E-03     0   453     8     0     0     0
   4
   421  0.99914902E+00     0   450     9     0     0     0
   421  0.62865409E-04     0   451     9     0     0     0
   421  0.12013530E-03     0   452     9     0     0     0
   421  0.66801289E-03     0   453     9     0     0     0
   4
   422  0.99914122E+00     0   450    10     0     0     0
   422  0.63089465E-04     0   451    10     0     0     0
   422  0.12126278E-03     0   452    10     0     0     0
   422  0.67442120E-03     0   453    10     0     0     0
   7
   423  0.55695362E-02     0   450    11     0     0     0
   423  0.88627011E-01     0   451    11     0     0     0
   423  0.15089744E+00     0   452    11     0     0     0
   423  0.15969445E+00     0   453    11     0     0     0
   423  0.16055045E+00     0   454    12     0     0     0
   423  0.34126860E+00     0   455    12     0     0     0
   423  0.93392543E-01     0   198   412     0     0     0
   9
   424  0.22339138E+00     0   456    11     0     0     0
   424  0.28757605E+00     0   457    11     0     0     0
   424  0.52720640E-01     0   200   412     0     0     0
   424  0.54748327E-01     0   203   412     0     0     0
   424  0.21942204E-02     0   199   411     0     0     0
   424  0.12361509E-01     0   450    12     0     0     0
   424  0.10228047E+00     0   451    12     0     0     0
   424  0.11440527E+00     0   452    12     0     0     0
   424  0.15032212E+00     0   453    12     0     0     0
   4
   425  0.90388536E+00     0   450   121     0     0     0
   425  0.35195964E-04     0   429   121   131     0     0
   425  0.11269244E-03     0   435   121   125     0     0
   425  0.95966734E-01     0   121   130     0     0     0
   5
   426  0.90390450E+00     0   450   122     0     0     0
   426  0.29143372E-04     0   429   122   131     0     0
   426  0.99774363E-04     0   435   122   125     0     0
   426  0.62428764E-03     0   435   121   126     0     0
   426  0.95342286E-01     0   129   121     0     0     0
   4
   427  0.90383375E+00     0   450   123     0     0     0
   427  0.35162841E-04     0   429   123   131     0     0
   427  0.11263753E-03     0   435   123   125     0     0
   427  0.96018456E-01     0   121   128     0     0     0
   5
   428  0.90385175E+00     0   450   124     0     0     0
   428  0.29115477E-04     0   429   124   131     0     0
   428  0.99725723E-04     0   435   124   125     0     0
   428  0.62443467E-03     0   435   123   126     0     0
   428  0.95394939E-01     0   127   121     0     0     0
   3
   429  0.26535533E-01     0   125   130     0     0     0
   429  0.48669603E+00     0   125   124     0     0     0
   429  0.48676845E+00     0   123   126     0     0     0
   3
   430  0.33177799E-02     0   450   126     0     0     0
   430  0.16304335E+00     0   198   429     0     0     0
   430  0.83363891E+00     0   206   429     0     0     0
   4
   431  0.90388536E+00     0   450   127     0     0     0
   431  0.35195964E-04     0   435   127   125     0     0
   431  0.11269244E-03     0   429   127   131     0     0
   431  0.95966734E-01     0   127   124     0     0     0
   5
   432  0.90390450E+00     0   450   128     0     0     0
   432  0.29143372E-04     0   435   128   125     0     0
   432  0.99774363E-04     0   429   128   131     0     0
   432  0.62428764E-03     0   429   127   132     0     0
   432  0.95342286E-01     0   123   127     0     0     0
   4
   433  0.90383375E+00     0   450   129     0     0     0
   433  0.35162841E-04     0   435   129   125     0     0
   433  0.11263753E-03     0   429   129   131     0     0
   433  0.96018456E-01     0   127   122     0     0     0
   5
   434  0.90385175E+00     0   450   130     0     0     0
   434  0.29115477E-04     0   435   130   125     0     0
   434  0.99725723E-04     0   429   130   131     0     0
   434  0.62443467E-03     0   429   129   132     0     0
   434  0.95394939E-01     0   121   127     0     0     0
   3
   435  0.26535533E-01     0   131   124     0     0     0
   435  0.48669603E+00     0   131   130     0     0     0
   435  0.48676845E+00     0   129   132     0     0     0
   3
   436  0.33177799E-02     0   450   132     0     0     0
   436  0.16304335E+00     0   199   435     0     0     0
   436  0.83363891E+00     0   207   435     0     0     0
   4
   437  0.18178835E-02     0   429   121   131     0     0
   437  0.42293076E-02     0   435   121   125     0     0
   437  0.49697635E+00     0   123   122     0     0     0
   437  0.49697644E+00     0   121   124     0     0     0
   0
   3
   439  0.30156693E+00     0   429   123   131     0     0
   439  0.69841605E+00     0   435   123   125     0     0
   439  0.17002578E-04     0   429   124   132     0     0
   0
   5
   441  0.23866317E-02     0   450   125     0     0     0
   441  0.48528831E-01     0   200   429     0     0     0
   441  0.41427374E-01     0   203   429     0     0     0
   441  0.50036669E+00     0   205   429     0     0     0
   441  0.40729046E+00     0   204   429     0     0     0
   0
   4
   443  0.18178835E-02     0   435   127   125     0     0
   443  0.42293076E-02     0   429   127   131     0     0
   443  0.49697635E+00     0   129   128     0     0     0
   443  0.49697644E+00     0   127   130     0     0     0
   0
   3
   445  0.30156693E+00     0   435   129   125     0     0
   445  0.69841605E+00     0   429   129   131     0     0
   445  0.17002578E-04     0   435   130   126     0     0
   0
   5
   447  0.23866317E-02     0   450   131     0     0     0
   447  0.48528831E-01     0   200   435     0     0     0
   447  0.41427374E-01     0   203   435     0     0     0
   447  0.50036669E+00     0   205   435     0     0     0
   447  0.40729046E+00     0   204   435     0     0     0
   0
  24
   449  0.15942434E-01     0   408     2     0     0     0
   449  0.15942434E-01     0   402     8     0     0     0
   449  0.15790990E-01     0   407     1     0     0     0
   449  0.15790990E-01     0   401     7     0     0     0
   449  0.30499728E-01     0   420     2     0     0     0
   449  0.30499728E-01     0   414     8     0     0     0
   449  0.32393295E-01     0   419     1     0     0     0
   449  0.32393295E-01     0   413     7     0     0     0
   449  0.15800387E-01     0   409     3     0     0     0
   449  0.15800387E-01     0   403     9     0     0     0
   449  0.32418948E-01     0   421     3     0     0     0
   449  0.32418948E-01     0   415     9     0     0     0
   449  0.15951615E-01     0   410     4     0     0     0
   449  0.15951615E-01     0   404    10     0     0     0
   449  0.30501051E-01     0   422     4     0     0     0
   449  0.30501051E-01     0   416    10     0     0     0
   449  0.79768069E-01     0   411     5     0     0     0
   449  0.79768069E-01     0   405    11     0     0     0
   449  0.62370993E-01     0   423     5     0     0     0
   449  0.62370993E-01     0   417    11     0     0     0
   449  0.99152207E-01     0   412     6     0     0     0
   449  0.99152207E-01     0   406    12     0     0     0
   449  0.69410287E-01     0   424     6     0     0     0
   449  0.69410287E-01     0   418    12     0     0     0
   6
   450  0.37851349E-01     0   437   127     0     0     0
   450  0.37851349E-01     0   443   121     0     0     0
   450  0.36846031E-01     0   439   129     0     0     0
   450  0.36846031E-01     0   445   123     0     0     0
   450  0.42530262E+00     0   429   131     0     0     0
   450  0.42530262E+00     0   435   125     0     0     0
  21
   451  0.43896917E-03     0   450   200     0     0     0
   451  0.81180777E-04     0   450     5    11     0     0
   451  0.49875244E-02     0   450   203     0     0     0
   451  0.62884636E-01     0   425   127     0     0     0
   451  0.62884636E-01     0   431   121     0     0     0
   451  0.62988445E-01     0   427   129     0     0     0
   451  0.62988445E-01     0   433   123     0     0     0
   451  0.38241542E-04     0   437   127     0     0     0
   451  0.38241542E-04     0   443   121     0     0     0
   451  0.38146696E-04     0   439   129     0     0     0
   451  0.38146696E-04     0   445   123     0     0     0
   451  0.74894451E-01     0   429   131     0     0     0
   451  0.74894451E-01     0   435   125     0     0     0
   451  0.73162094E-01     0   441   131     0     0     0
   451  0.73162094E-01     0   447   125     0     0     0
   451  0.63896582E-01     0   426   128     0     0     0
   451  0.63896582E-01     0   432   122     0     0     0
   451  0.64000122E-01     0   428   130     0     0     0
   451  0.64000122E-01     0   434   124     0     0     0
   451  0.95343493E-01     0   430   132     0     0     0
   451  0.95343493E-01     0   436   126     0     0     0
  28
   452  0.15791771E+00     0   454   199     0     0     0
   452  0.15791771E+00     0   456   198     0     0     0
   452  0.62484492E-01     0   450   200     0     0     0
   452  0.15051658E+00     0   451   200     0     0     0
   452  0.16082234E-03     0   451     5    11     0     0
   452  0.17460959E-04     0   451   125   131     0     0
   452  0.10398484E-01     0   450   203     0     0     0
   452  0.43509984E-02     0   450   204     0     0     0
   452  0.36999688E-01     0   450   205     0     0     0
   452  0.27251448E-02     0   451   203     0     0     0
   452  0.19345160E-04     0   425   127     0     0     0
   452  0.19345160E-04     0   431   121     0     0     0
   452  0.19354358E-04     0   427   129     0     0     0
   452  0.19354358E-04     0   433   123     0     0     0
   452  0.56288292E-04     0   437   127     0     0     0
   452  0.56288292E-04     0   443   121     0     0     0
   452  0.56219378E-04     0   439   129     0     0     0
   452  0.56219378E-04     0   445   123     0     0     0
   452  0.14234261E+00     0   429   131     0     0     0
   452  0.14234261E+00     0   435   125     0     0     0
   452  0.65461345E-01     0   441   131     0     0     0
   452  0.65461345E-01     0   447   125     0     0     0
   452  0.95814612E-04     0   426   128     0     0     0
   452  0.95814612E-04     0   432   122     0     0     0
   452  0.95859898E-04     0   428   130     0     0     0
   452  0.95859898E-04     0   434   124     0     0     0
   452  0.10860750E-03     0   430   132     0     0     0
   452  0.10860750E-03     0   436   126     0     0     0
  28
   453  0.16208003E+00     0   454   199     0     0     0
   453  0.16208003E+00     0   456   198     0     0     0
   453  0.10559537E-01     0   450   200     0     0     0
   453  0.34639898E-02     0   451   200     0     0     0
   453  0.16885083E-03     0   451     5    11     0     0
   453  0.18343697E-04     0   451   125   131     0     0
   453  0.59225257E-01     0   450   203     0     0     0
   453  0.34641016E-01     0   450   204     0     0     0
   453  0.41673002E-02     0   450   205     0     0     0
   453  0.14363997E+00     0   451   203     0     0     0
   453  0.18821046E-02     0   425   127     0     0     0
   453  0.18821046E-02     0   431   121     0     0     0
   453  0.18829816E-02     0   427   129     0     0     0
   453  0.18829816E-02     0   433   123     0     0     0
   453  0.31479378E-03     0   437   127     0     0     0
   453  0.31479378E-03     0   443   121     0     0     0
   453  0.31441395E-03     0   439   129     0     0     0
   453  0.31441395E-03     0   445   123     0     0     0
   453  0.12520944E+00     0   429   131     0     0     0
   453  0.12520944E+00     0   435   125     0     0     0
   453  0.70423208E-01     0   441   131     0     0     0
   453  0.70423208E-01     0   447   125     0     0     0
   453  0.31779681E-02     0   426   128     0     0     0
   453  0.31779681E-02     0   432   122     0     0     0
   453  0.31794412E-02     0   428   130     0     0     0
   453  0.31794412E-02     0   434   124     0     0     0
   453  0.35935489E-02     0   430   132     0     0     0
   453  0.35935489E-02     0   436   126     0     0     0
   8
   454  0.53771385E-02     0   450   198     0     0     0
   454  0.13019116E+00     0   426   127     0     0     0
   454  0.13040192E+00     0   428   129     0     0     0
   454  0.19886588E+00     0   430   131     0     0     0
   454  0.12365932E+00     0   431   122     0     0     0
   454  0.12386325E+00     0   433   124     0     0     0
   454  0.14762898E+00     0   435   126     0     0     0
   454  0.14001243E+00     0   447   126     0     0     0
  13
   455  0.69377959E-01     0   450   198     0     0     0
   455  0.37382577E-01     0   450   206     0     0     0
   455  0.19417048E-04     0   451   131   126     0     0
   455  0.16415161E+00     0   451   198     0     0     0
   455  0.37241483E-02     0   426   127     0     0     0
   455  0.37258740E-02     0   428   129     0     0     0
   455  0.13740806E+00     0   430   131     0     0     0
   455  0.64880000E-02     0   431   122     0     0     0
   455  0.64910227E-02     0   433   124     0     0     0
   455  0.23710093E+00     0   435   126     0     0     0
   455  0.26224652E-01     0   447   126     0     0     0
   455  0.15965834E+00     0   454   200     0     0     0
   455  0.14824750E+00     0   454   203     0     0     0
   8
   456  0.53771385E-02     0   450   199     0     0     0
   456  0.13019116E+00     0   432   121     0     0     0
   456  0.13040192E+00     0   434   123     0     0     0
   456  0.19886588E+00     0   436   125     0     0     0
   456  0.12365932E+00     0   425   128     0     0     0
   456  0.12386325E+00     0   427   130     0     0     0
   456  0.14762898E+00     0   429   132     0     0     0
   456  0.14001243E+00     0   441   132     0     0     0
  13
   457  0.69377959E-01     0   450   199     0     0     0
   457  0.37382577E-01     0   450   207     0     0     0
   457  0.19417048E-04     0   451   125   132     0     0
   457  0.16415161E+00     0   451   199     0     0     0
   457  0.37241483E-02     0   432   121     0     0     0
   457  0.37258740E-02     0   434   123     0     0     0
   457  0.13740806E+00     0   436   125     0     0     0
   457  0.64880000E-02     0   425   128     0     0     0
   457  0.64910227E-02     0   427   130     0     0     0
   457  0.23710093E+00     0   429   132     0     0     0
   457  0.26224652E-01     0   441   132     0     0     0
   457  0.15965834E+00     0   456   200     0     0     0
   457  0.14824750E+00     0   456   203     0     0     0
  28
   203  0.16471521E-03     0   123   129     0     0     0
   203  0.47117297E-01     0   125   131     0     0     0
   203  0.19766139E-02     0     3     9     0     0     0
   203  0.77497208E+00     0     5    11     0     0     0
   203  0.34971606E-01     0     4    10     0     0     0
   203  0.16147640E-02     0    59    59     0     0     0
   203  0.31610083E-01     0    13    13     0     0     0
   203  0.54569426E-02     0   198   121   128     0     0
   203  0.54569426E-02     0   198   123   130     0     0
   203  0.54569426E-02     0   198   125   132     0     0
   203  0.16370829E-01     0   198     8     1     0     0
   203  0.16370829E-01     0   198    10     3     0     0
   203  0.54569426E-02     0   199   127   122     0     0
   203  0.54569426E-02     0   199   129   124     0     0
   203  0.54569426E-02     0   199   131   126     0     0
   203  0.16370829E-01     0   199     2     7     0     0
   203  0.16370829E-01     0   199     4     9     0     0
   203  0.63927739E-03     0   200   122   128     0     0
   203  0.63927739E-03     0   200   124   130     0     0
   203  0.63927739E-03     0   200   126   132     0     0
   203  0.32174189E-03     0   200   121   127     0     0
   203  0.32174189E-03     0   200   123   129     0     0
   203  0.32174189E-03     0   200   125   131     0     0
   203  0.11022604E-02     0   200     2     8     0     0
   203  0.11022604E-02     0   200     4    10     0     0
   203  0.14199830E-02     0   200     1     7     0     0
   203  0.14199830E-02     0   200     3     9     0     0
   203  0.14199830E-02     0   200     5    11     0     0
   6
   204  0.11857574E-03     0   123   129     0     0     0
   204  0.33959907E-01     0   125   131     0     0     0
   204  0.13971103E-02     0     3     9     0     0     0
   204  0.44631511E+00     0     5    11     0     0     0
   204  0.88324028E-04     0     6    12     0     0     0
   204  0.51812094E+00     0   429   435     0     0     0
   7
   205  0.11860505E-03     0   123   129     0     0     0
   205  0.33969641E-01     0   125   131     0     0     0
   205  0.13974294E-02     0     3     9     0     0     0
   205  0.44637257E+00     0     5    11     0     0     0
   205  0.12197285E-03     0     6    12     0     0     0
   205  0.14059062E-04     0    13    13     0     0     0
   205  0.51800585E+00     0   429   435     0     0     0
   4
   206  0.31833988E-03     0   124   129     0     0     0
   206  0.91175705E-01     0   126   131     0     0     0
   206  0.34303314E-02     0     4     9     0     0     0
   206  0.90507561E+00     0     6    11     0     0     0
   4
   207  0.31833988E-03     0   130   123     0     0     0
   207  0.91175705E-01     0   132   125     0     0     0
   207  0.34303314E-02     0    10     3     0     0     0
   207  0.90507561E+00     0    12     5     0     0     0
   0
   5
     6  0.33333334E+00   100     2     7     5     0     0
     6  0.33333334E+00   100     4     9     5     0     0
     6  0.11111111E+00   100   122   127     5     0     0
     6  0.11111111E+00   100   124   129     5     0     0
     6  0.11111111E+00   100   126   131     5     0     0
   5
    12  0.33333334E+00   100     8     1    11     0     0
    12  0.33333334E+00   100    10     3    11     0     0
    12  0.11111111E+00   100   128   121    11     0     0
    12  0.11111111E+00   100   130   123    11     0     0
    12  0.11111111E+00   100   132   125    11     0     0
     51.30130005     -0.02056948
      0.99913484     -0.00275006      0.03831758     -0.01594032
     -0.00924398     -0.98670244      0.12959172     -0.09766696
      0.01574250     -0.02290980     -0.70636809     -0.70729893
     -0.03737137      0.16089100      0.69482511     -0.69995403
     -0.99038512      0.13833770     -0.13833770     -0.99038512
     -0.98301160      0.18354331     -0.18354331     -0.98301160
     -1.26652300     -1.10221243     -1.34140730
  -2028.82995605  20360.90039063  -8544.63964844
   1381.82995605
    F
  0.00000000E+00  0.00000000E+00  0.00000000E+00  0.46912398E-01 -0.96169198E-29  0.00000000E+00  0.00000000E+00  0.00000000E+00 -0.55282898E-28 -0.46912398E-01  0.96169198E-29 -0.00000000E+00  0.00000000E+00  0.00000000E+00  0.00000000E+00  0.00000000E+00  0.00000000E+00  0.65826998E-06 -0.00000000E+00 -0.00000000E+00  0.55282898E-28 -0.00000000E+00 -0.00000000E+00 -0.65826998E-06  0.00000000E+00  0.00000000E+00  0.00000000E+00
 -0.78980202E-31  0.00000000E+00  0.00000000E+00  0.00000000E+00 -0.17292500E-29  0.00000000E+00  0.00000000E+00  0.00000000E+00 -0.63047700E-28  0.94044195E-09  0.51819300E-37  0.00000000E+00  0.42379049E-39  0.20590701E-07  0.00000000E+00  0.00000000E+00  0.00000000E+00  0.75072899E-06  0.00000000E+00  0.00000000E+00  0.00000000E+00  0.00000000E+00  0.00000000E+00  0.00000000E+00  0.00000000E+00  0.00000000E+00  0.00000000E+00
  0.00000000E+00  0.00000000E+00  0.00000000E+00  0.00000000E+00  0.00000000E+00  0.00000000E+00  0.00000000E+00  0.00000000E+00  0.00000000E+00  0.00000000E+00  0.00000000E+00  0.00000000E+00  0.00000000E+00  0.00000000E+00  0.00000000E+00  0.00000000E+00  0.00000000E+00  0.00000000E+00  0.00000000E+00  0.00000000E+00  0.00000000E+00  0.00000000E+00  0.00000000E+00  0.00000000E+00  0.00000000E+00  0.00000000E+00  0.00000000E+00
