#  ISAJET SUSY parameters in SUSY Les Houches Accord 2 format
#  Created by ISALHA 2.0 Last revision: C. Balazs 21 Apr 2009
Block SPINFO   # Program information
     1   ISASUGRA from ISAJET          # Spectrum Calculator
     2   7.80   29-OCT-2009 12:50:36   # Version number
Block MODSEL   # Model selection
     1     0   #   MsR(Q)          MbR(Q)                          
Block SMINPUTS   # Standard Model inputs
     1     1.27837601E+02   # alpha_em^(-1)
     2     1.16570000E-05   # G_Fermi
     3     1.17200002E-01   # alpha_s(M_Z)
     4     9.11699982E+01   # m_{Z}(pole)
     5     4.19999981E+00   # m_{b}(m_{b})
     6     1.72500000E+02   # m_{top}(pole)
     7     1.77699995E+00   # m_{tau}(pole)
Block MINPAR   # SUSY breaking input parameters
Block MASS   # Scalar and gaugino mass spectrum
#  PDG code   mass                 particle
        24     8.04229965E+01   #  W^+
        25     1.20300003E+02   #  h^0            
        35     2.51768652E+03   #  H^0            
        36     2.50000000E+03   #  A^0            
        37     2.51652856E+03   #  H^+            
   1000001     1.20117041E+03   #  dnl            
   1000002     1.19904285E+03   #  upl            
   1000003     1.20117041E+03   #  stl            
   1000004     1.19904358E+03   #  chl            
   1000005     1.20020801E+03   #  b1             
   1000006     1.20738745E+03   #  t1             
   1000011     2.50035645E+03   #  el-            
   1000012     2.49933496E+03   #  nuel           
   1000013     2.50035645E+03   #  mul-           
   1000014     2.49933496E+03   #  numl           
   1000015     2.50029565E+03   #  tau1           
   1000016     2.49933496E+03   #  nutl           
   1000021     9.00000000E+02   #  glss           
   1000022     4.99348389E+02   #  z1ss           
   1000023     2.42860034E+03   #  z2ss           
   1000024     2.42832593E+03   #  w1ss           
   1000025    -2.50038916E+03   #  z3ss           
   1000035     2.57244043E+03   #  z4ss           
   1000037     2.57219092E+03   #  w2ss           
   2000001     1.20021423E+03   #  dnr            
   2000002     1.19957141E+03   #  upr            
   2000003     1.20021423E+03   #  str            
   2000004     1.19957214E+03   #  chr            
   2000005     1.20118298E+03   #  b2             
   2000006     1.20795093E+03   #  t2             
   2000011     2.50030859E+03   #  er-            
   2000013     2.50030859E+03   #  mur-           
   2000015     2.50037036E+03   #  tau2           
Block ALPHA   # Effective Higgs mixing parameter
         -3.22598040E-01   # alpha
Block STOPMIX   # stop mixing matrix
  1  1     7.14088857E-01   # O_{11}
  1  2     7.00055063E-01   # O_{12}
  2  1    -7.00055063E-01   # O_{21}
  2  2     7.14088857E-01   # O_{22}
Block SBOTMIX   # sbottom mixing matrix
  1  1     5.52335052E-07   # O_{11}
  1  2    -1.00000000E+00   # O_{12}
  2  1     1.00000000E+00   # O_{21}
  2  2     5.52335052E-07   # O_{22}
Block STAUMIX   # stau mixing matrix
  1  1     2.81731172E-06   # O_{11}
  1  2    -1.00000000E+00   # O_{12}
  2  1     1.00000000E+00   # O_{21}
  2  2     2.81731172E-06   # O_{22}
Block NMIX   # neutralino mixing matrix
  1  1     9.99782503E-01   #
  1  2    -5.92538971E-04   #
  1  3     1.86497718E-02   #
  1  4    -9.32106376E-03   #
  2  1     1.44137088E-02   #
  2  2     7.08370090E-01   #
  2  3    -5.02602518E-01   #
  2  4     4.95373696E-01   #
  3  1    -6.59014285E-03   #
  3  2     7.19456375E-03   #
  3  3     7.06963241E-01   #
  3  4     7.07183182E-01   #
  4  1     1.35595864E-02   #
  4  2    -7.05804527E-01   #
  4  3    -4.97238696E-01   #
  4  4     5.04390895E-01   #
Block UMIX   # chargino U mixing matrix
  1  1    -7.02002406E-01   # U_{11}
  1  2     7.12174535E-01   # U_{12}
  2  1    -7.12174535E-01   # U_{21}
  2  2    -7.02002406E-01   # U_{22}
Block VMIX   # chargino V mixing matrix
  1  1    -7.12174356E-01   # V_{11}
  1  2     7.02002585E-01   # V_{12}
  2  1    -7.02002585E-01   # V_{21}
  2  2    -7.12174356E-01   # V_{22}
Block GAUGE Q=  0.00000000E+00   #
     1     0.00000000E+00   # g`
     2     0.00000000E+00   # g_2
     3     0.00000000E+00   # g_3
Block YU Q=  0.00000000E+00   #
  3  3     0.00000000E+00   # y_t
Block YD Q=  0.00000000E+00   #
  3  3     0.00000000E+00   # y_b
Block YE Q=  0.00000000E+00   #
  3  3     0.00000000E+00   # y_tau
Block HMIX Q=  0.00000000E+00   # Higgs mixing parameters
     1     0.00000000E+00   # mu(Q)
     2     0.00000000E+00   # tan(beta)(M_GUT)
     3     0.00000000E+00   # Higgs vev at Q
     4     6.25000000E+06   # m_A^2(Q)
Block MSOFT Q=  0.00000000E+00   # DRbar SUSY breaking parameters
     1     0.00000000E+00   # M_1(Q)          
     2     0.00000000E+00   # M_2(Q)          
     3     0.00000000E+00   # M_3(Q)          
    31     0.00000000E+00   # MeL(Q)          
    32     0.00000000E+00   # MmuL(Q)         
    33     0.00000000E+00   # MtauL(Q)        
    34     0.00000000E+00   # MeR(Q)          
    35     0.00000000E+00   # MmuR(Q)         
    36     0.00000000E+00   # MtauR(Q)        
    41     0.00000000E+00   # MqL1(Q)         
    42     0.00000000E+00   # MqL2(Q)         
    43     0.00000000E+00   # MqL3(Q)         
    44     0.00000000E+00   # MuR(Q)          
    45     0.00000000E+00   # McR(Q)          
    46     0.00000000E+00   # MtR(Q)          
    47     0.00000000E+00   # MdR(Q)          
    48     0.00000000E+00   # MsR(Q)          
    49     0.00000000E+00   # MbR(Q)          
Block AU Q=  0.00000000E+00   #
  1  1     0.00000000E+00   # A_u
  2  2     0.00000000E+00   # A_c
  3  3     0.00000000E+00   # A_t
Block AD Q=  0.00000000E+00   #
  1  1     0.00000000E+00   # A_d
  2  2     0.00000000E+00   # A_s
  3  3     0.00000000E+00   # A_b
Block AE Q=  0.00000000E+00   #
  1  1     0.00000000E+00   # A_e
  2  2     0.00000000E+00   # A_mu
  3  3     0.00000000E+00   # A_tau
#         PDG         Width
DECAY   1000021  4.43464960E-04   # GLSS  decays
#          BR          NDA       ID1       ID2       ID3       ID4
      1.02649428E-04    2      1000022        21                       # GLSS   -->  Z1SS   GL                 
      3.43887746E-01    3      1000022         2        -2             # GLSS   -->  Z1SS   UP     UB          
      1.00850515E-01    3      1000022         1        -1             # GLSS   -->  Z1SS   DN     DB          
      1.00850515E-01    3      1000022         3        -3             # GLSS   -->  Z1SS   ST     SB          
      3.43886405E-01    3      1000022         4        -4             # GLSS   -->  Z1SS   CH     CB          
      1.00656167E-01    3      1000022         5        -5             # GLSS   -->  Z1SS   BT     BB          
      9.34612565E-03    3      1000022         6        -6             # GLSS   -->  Z1SS   TP     TB          
      4.19901102E-04    2      1000039        21                       # GLSS   -->  GVSS   GL                 
#         PDG         Width
DECAY   1000002  1.38933229E+01   # UPL   decays
#          BR          NDA       ID1       ID2       ID3       ID4
      8.27322807E-03    2      1000022         2                       # UPL    -->  Z1SS   UP                 
      9.91726756E-01    2      1000021         2                       # UPL    -->  GLSS   UP                 
#         PDG         Width
DECAY   1000001  1.40435314E+01   # DNL   decays
#          BR          NDA       ID1       ID2       ID3       ID4
      8.31838790E-03    2      1000022         1                       # DNL    -->  Z1SS   DN                 
      9.91681635E-01    2      1000021         1                       # DNL    -->  GLSS   DN                 
#         PDG         Width
DECAY   1000003  1.40435314E+01   # STL   decays
#          BR          NDA       ID1       ID2       ID3       ID4
      8.31838790E-03    2      1000022         3                       # STL    -->  Z1SS   ST                 
      9.91681635E-01    2      1000021         3                       # STL    -->  GLSS   ST                 
#         PDG         Width
DECAY   1000004  1.38931913E+01   # CHL   decays
#          BR          NDA       ID1       ID2       ID3       ID4
      8.27328488E-03    2      1000022         4                       # CHL    -->  Z1SS   CH                 
      9.91726696E-01    2      1000021         4                       # CHL    -->  GLSS   CH                 
#         PDG         Width
DECAY   1000005  1.43206224E+01   # BT1   decays
#          BR          NDA       ID1       ID2       ID3       ID4
      3.23698148E-02    2      1000022         5                       # BT1    -->  Z1SS   BT                 
      9.67630148E-01    2      1000021         5                       # BT1    -->  GLSS   BT                 
#         PDG         Width
DECAY   1000006  1.79932613E+01   # TP1   decays
#          BR          NDA       ID1       ID2       ID3       ID4
      1.38330654E-08    2      1000022         4                       # TP1    -->  Z1SS   CH                 
      9.43726778E-01    2      1000021         6                       # TP1    -->  GLSS   TP                 
      5.62732480E-02    2      1000022         6                       # TP1    -->  Z1SS   TP                 
#         PDG         Width
DECAY   2000002  1.56677465E+01   # UPR   decays
#          BR          NDA       ID1       ID2       ID3       ID4
      1.18239082E-01    2      1000022         2                       # UPR    -->  Z1SS   UP                 
      8.81760895E-01    2      1000021         2                       # UPR    -->  GLSS   UP                 
#         PDG         Width
DECAY   2000001  1.43236036E+01   # DNR   decays
#          BR          NDA       ID1       ID2       ID3       ID4
      3.23655419E-02    2      1000022         1                       # DNR    -->  Z1SS   DN                 
      9.67634439E-01    2      1000021         1                       # DNR    -->  GLSS   DN                 
#         PDG         Width
DECAY   2000003  1.43236036E+01   # STR   decays
#          BR          NDA       ID1       ID2       ID3       ID4
      3.23655419E-02    2      1000022         3                       # STR    -->  Z1SS   ST                 
      9.67634439E-01    2      1000021         3                       # STR    -->  GLSS   ST                 
#         PDG         Width
DECAY   2000004  1.56676083E+01   # CHR   decays
#          BR          NDA       ID1       ID2       ID3       ID4
      1.18239835E-01    2      1000022         4                       # CHR    -->  Z1SS   CH                 
      8.81760180E-01    2      1000021         4                       # CHR    -->  GLSS   CH                 
#         PDG         Width
DECAY   2000005  1.40418987E+01   # BT2   decays
#          BR          NDA       ID1       ID2       ID3       ID4
      8.31933506E-03    2      1000022         5                       # BT2    -->  Z1SS   BT                 
      9.91680682E-01    2      1000021         5                       # BT2    -->  GLSS   BT                 
#         PDG         Width
DECAY   2000006  6.51391888E+00   # TP2   decays
#          BR          NDA       ID1       ID2       ID3       ID4
      3.82107856E-08    2      1000022         4                       # TP2    -->  Z1SS   CH                 
      8.68729770E-01    2      1000021         6                       # TP2    -->  GLSS   TP                 
      1.31270111E-01    2      1000022         6                       # TP2    -->  Z1SS   TP                 
#         PDG         Width
DECAY   1000011  2.97398496E+00   # EL-   decays
#          BR          NDA       ID1       ID2       ID3       ID4
      9.82930541E-01    2      1000022        11                       # EL-    -->  Z1SS   E-                 
      5.81134157E-03    2      1000023        11                       # EL-    -->  Z2SS   E-                 
      1.12478519E-02    2     -1000024        12                       # EL-    -->  W1SS-  NUE                
      1.03625034E-05    2           11   1000039                       # EL-    -->  E-     GVSS               
#         PDG         Width
DECAY   1000013  2.97398496E+00   # MUL-  decays
#          BR          NDA       ID1       ID2       ID3       ID4
      9.82930541E-01    2      1000022        13                       # MUL-   -->  Z1SS   MU-                
      5.81133505E-03    2      1000023        13                       # MUL-   -->  Z2SS   MU-                
      1.12478519E-02    2     -1000024        14                       # MUL-   -->  W1SS-  NUM                
      1.03625034E-05    2           13   1000039                       # MUL-   -->  MU-    GVSS               
#         PDG         Width
DECAY   1000015  1.17179670E+01   # TAU1- decays
#          BR          NDA       ID1       ID2       ID3       ID4
      9.99986231E-01    2      1000022        15                       # TAU1-  -->  Z1SS   TAU-               
      4.21355844E-06    2      1000023        15                       # TAU1-  -->  Z2SS   TAU-               
      6.91411151E-06    2     -1000024        16                       # TAU1-  -->  W1SS-  NUT                
      2.62964727E-06    2           15   1000039                       # TAU1-  -->  TAU-   GVSS               
#         PDG         Width
DECAY   1000012  2.98404694E+00   # NUEL  decays
#          BR          NDA       ID1       ID2       ID3       ID4
      9.83382225E-01    2      1000022        12                       # NUEL   -->  Z1SS   NUE                
      5.38614905E-03    2      1000023        12                       # NUEL   -->  Z2SS   NUE                
      1.12213083E-02    2      1000024        11                       # NUEL   -->  W1SS+  E-                 
      1.03064804E-05    2           12   1000039                       # NUEL   -->  NUE    GVSS               
#         PDG         Width
DECAY   1000014  2.98404694E+00   # NUML  decays
#          BR          NDA       ID1       ID2       ID3       ID4
      9.83382225E-01    2      1000022        14                       # NUML   -->  Z1SS   NUM                
      5.38614905E-03    2      1000023        14                       # NUML   -->  Z2SS   NUM                
      1.12212971E-02    2      1000024        13                       # NUML   -->  W1SS+  MU-                
      1.03064804E-05    2           14   1000039                       # NUML   -->  NUM    GVSS               
#         PDG         Width
DECAY   1000016  2.98403478E+00   # NUTL  decays
#          BR          NDA       ID1       ID2       ID3       ID4
      9.83386219E-01    2      1000022        16                       # NUTL   -->  Z1SS   NUT                
      5.38617093E-03    2      1000023        16                       # NUTL   -->  Z2SS   NUT                
      1.12173147E-02    2      1000024        15                       # NUTL   -->  W1SS+  TAU-               
      1.03065222E-05    2           16   1000039                       # NUTL   -->  NUT    GVSS               
#         PDG         Width
DECAY   2000011  1.17179203E+01   # ER-   decays
#          BR          NDA       ID1       ID2       ID3       ID4
      9.99996662E-01    2      1000022        11                       # ER-    -->  Z1SS   E-                 
      7.20707249E-07    2      1000023        11                       # ER-    -->  Z2SS   E-                 
      3.05777338E-40    3      1000015        12       -16             # ER-    -->  TAU1-  NUE    ANUT        
      2.62973072E-06    2           11   1000039                       # ER-    -->  E-     GVSS               
#         PDG         Width
DECAY   2000013  1.17179203E+01   # MUR-  decays
#          BR          NDA       ID1       ID2       ID3       ID4
      9.99996662E-01    2      1000022        13                       # MUR-   -->  Z1SS   MU-                
      7.20706510E-07    2      1000023        13                       # MUR-   -->  Z2SS   MU-                
      1.31006449E-35    3      1000015        14       -16             # MUR-   -->  TAU1-  NUM    ANUT        
      2.62973072E-06    2           13   1000039                       # MUR-   -->  MU-    GVSS               
#         PDG         Width
DECAY   2000015  2.97400331E+00   # TAU2- decays
#          BR          NDA       ID1       ID2       ID3       ID4
      9.82936502E-01    2      1000022        15                       # TAU2-  -->  Z1SS   TAU-               
      5.81148313E-03    2      1000023        15                       # TAU2-  -->  Z2SS   TAU-               
      1.12520037E-02    2     -1000024        16                       # TAU2-  -->  W1SS-  NUT                
#         PDG         Width
DECAY   1000022  9.67055946E-09   # Z1SS  decays
#          BR          NDA       ID1       ID2       ID3       ID4
      7.76693523E-01    2      1000039        22                       # Z1SS   -->  GVSS   GM                 
      1.77598726E-02    3      1000039        11       -11             # Z1SS   -->  GVSS   E-     E+          
      2.05543175E-01    2      1000039        23                       # Z1SS   -->  GVSS   Z0                 
      3.41589839E-06    2      1000039        25                       # Z1SS   -->  GVSS   HL0                
#         PDG         Width
DECAY   1000023  8.72871628E+01   # Z2SS  decays
#          BR          NDA       ID1       ID2       ID3       ID4
      1.00080115E-07    2      1000022        22                       # Z2SS   -->  Z1SS   GM                 
      1.07710913E-03    2      1000022        23                       # Z2SS   -->  Z1SS   Z0                 
      3.14818394E-08    3      1000022         5        -5             # Z2SS   -->  Z1SS   BT     BB          
      7.08595326E-06    3      1000022        11       -11             # Z2SS   -->  Z1SS   E-     E+          
      7.08595326E-06    3      1000022        13       -13             # Z2SS   -->  Z1SS   MU-    MU+         
      7.18969250E-06    3      1000022        15       -15             # Z2SS   -->  Z1SS   TAU-   TAU+        
      6.82482096E-06    3      1000022        12       -12             # Z2SS   -->  Z1SS   NUE    ANUE        
      6.82482096E-06    3      1000022        14       -14             # Z2SS   -->  Z1SS   NUM    ANUM        
      6.82482096E-06    3      1000022        16       -16             # Z2SS   -->  Z1SS   NUT    ANUT        
      1.03097390E-02    2      1000022        25                       # Z2SS   -->  Z1SS   HL0                
      5.07906862E-02    2      1000002        -2                       # Z2SS   -->  UPL    UB                 
      5.07906862E-02    2     -1000002         2                       # Z2SS   -->  UBL    UP                 
      4.99244146E-02    2      1000001        -1                       # Z2SS   -->  DNL    DB                 
      4.99244146E-02    2     -1000001         1                       # Z2SS   -->  DBL    DN                 
      4.99244146E-02    2      1000003        -3                       # Z2SS   -->  STL    SB                 
      4.99244146E-02    2     -1000003         3                       # Z2SS   -->  SBL    ST                 
      5.07906191E-02    2      1000004        -4                       # Z2SS   -->  CHL    CB                 
      5.07906191E-02    2     -1000004         4                       # Z2SS   -->  CBL    CH                 
      1.12031548E-05    2      2000002        -2                       # Z2SS   -->  UPR    UB                 
      1.12031548E-05    2     -2000002         2                       # Z2SS   -->  UBR    UP                 
      2.79885057E-06    2      2000001        -1                       # Z2SS   -->  DNR    DB                 
      2.79885057E-06    2     -2000001         1                       # Z2SS   -->  DBR    DN                 
      2.79885057E-06    2      2000003        -3                       # Z2SS   -->  STR    SB                 
      2.79885057E-06    2     -2000003         3                       # Z2SS   -->  SBR    ST                 
      1.12031403E-05    2      2000004        -4                       # Z2SS   -->  CHR    CB                 
      1.12031403E-05    2     -2000004         4                       # Z2SS   -->  CBR    CH                 
      2.99576350E-04    2      1000005        -5                       # Z2SS   -->  BT1    BB                 
      2.99576350E-04    2     -1000005         5                       # Z2SS   -->  BB1    BT                 
      5.02623133E-02    2      2000005        -5                       # Z2SS   -->  BT2    BB                 
      5.02623133E-02    2     -2000005         5                       # Z2SS   -->  BB2    BT                 
      2.01447651E-01    2      1000006        -6                       # Z2SS   -->  TP1    TB                 
      2.01447651E-01    2     -1000006         6                       # Z2SS   -->  TB1    TP                 
      4.08178754E-02    2      2000006        -6                       # Z2SS   -->  TP2    TB                 
      4.08178754E-02    2     -2000006         6                       # Z2SS   -->  TB2    TP                 
      3.82126686E-08    2      1000039        22                       # Z2SS   -->  GVSS   GM                 
      9.73977898E-10    3      1000039        11       -11             # Z2SS   -->  GVSS   E-     E+          
      1.74382876E-07    2      1000039        23                       # Z2SS   -->  GVSS   Z0                 
      1.45676724E-08    2      1000039        25                       # Z2SS   -->  GVSS   HL0                
#         PDG         Width
DECAY   1000025  6.60578613E+01   # Z3SS  decays
#          BR          NDA       ID1       ID2       ID3       ID4
      2.00572501E-08    2      1000022        22                       # Z3SS   -->  Z1SS   GM                 
      7.94746283E-11    2      1000023        22                       # Z3SS   -->  Z2SS   GM                 
      1.28514712E-05    3     -1000024         2        -1             # Z3SS   -->  W1SS-  UP     DB          
      4.28382373E-06    3     -1000024        12       -11             # Z3SS   -->  W1SS-  NUE    E+          
      4.28382373E-06    3     -1000024        14       -13             # Z3SS   -->  W1SS-  NUM    MU+         
      1.28514712E-05    3      1000024         1        -2             # Z3SS   -->  W1SS+  DN     UB          
      4.28382373E-06    3      1000024        11       -12             # Z3SS   -->  W1SS+  E-     ANUE        
      4.28382373E-06    3      1000024        13       -14             # Z3SS   -->  W1SS+  MU-    ANUM        
      1.28514712E-05    3     -1000024         4        -3             # Z3SS   -->  W1SS-  CH     SB          
      4.28382373E-06    3     -1000024        16       -15             # Z3SS   -->  W1SS-  NUT    TAU+        
      1.28514712E-05    3      1000024         3        -4             # Z3SS   -->  W1SS+  ST     CB          
      4.28382373E-06    3      1000024        15       -16             # Z3SS   -->  W1SS+  TAU-   ANUT        
      2.69605666E-02    2      1000022        23                       # Z3SS   -->  Z1SS   Z0                 
      9.70362137E-08    3      1000022         5        -5             # Z3SS   -->  Z1SS   BT     BB          
      1.30121878E-08    3      1000022        15       -15             # Z3SS   -->  Z1SS   TAU-   TAU+        
      2.84351358E-06    3      1000023         2        -2             # Z3SS   -->  Z2SS   UP     UB          
      3.66672953E-06    3      1000023         1        -1             # Z3SS   -->  Z2SS   DN     DB          
      3.66672953E-06    3      1000023         3        -3             # Z3SS   -->  Z2SS   ST     SB          
      2.84351358E-06    3      1000023         4        -4             # Z3SS   -->  Z2SS   CH     CB          
      3.54227996E-06    3      1000023         5        -5             # Z3SS   -->  Z2SS   BT     BB          
      8.31795774E-07    3      1000023        11       -11             # Z3SS   -->  Z2SS   E-     E+          
      8.31795774E-07    3      1000023        13       -13             # Z3SS   -->  Z2SS   MU-    MU+         
      8.26588575E-07    3      1000023        15       -15             # Z3SS   -->  Z2SS   TAU-   TAU+        
      1.65501183E-06    3      1000023        12       -12             # Z3SS   -->  Z2SS   NUE    ANUE        
      1.65501183E-06    3      1000023        14       -14             # Z3SS   -->  Z2SS   NUM    ANUM        
      1.65501183E-06    3      1000023        16       -16             # Z3SS   -->  Z2SS   NUT    ANUT        
      2.94171879E-03    2      1000022        25                       # Z3SS   -->  Z1SS   HL0                
      5.07995537E-06    2      1000002        -2                       # Z3SS   -->  UPL    UB                 
      5.07995537E-06    2     -1000002         2                       # Z3SS   -->  UBL    UP                 
      9.98268933E-06    2      1000001        -1                       # Z3SS   -->  DNL    DB                 
      9.98268933E-06    2     -1000001         1                       # Z3SS   -->  DBL    DN                 
      9.98268933E-06    2      1000003        -3                       # Z3SS   -->  STL    SB                 
      9.98268933E-06    2     -1000003         3                       # Z3SS   -->  SBL    ST                 
      5.07995128E-06    2      1000004        -4                       # Z3SS   -->  CHL    CB                 
      5.07995128E-06    2     -1000004         4                       # Z3SS   -->  CBL    CH                 
      3.30351963E-06    2      2000002        -2                       # Z3SS   -->  UPR    UB                 
      3.30351963E-06    2     -2000002         2                       # Z3SS   -->  UBR    UP                 
      8.25350696E-07    2      2000001        -1                       # Z3SS   -->  DNR    DB                 
      8.25350696E-07    2     -2000001         1                       # Z3SS   -->  DBR    DN                 
      8.25350696E-07    2      2000003        -3                       # Z3SS   -->  STR    SB                 
      8.25350696E-07    2     -2000003         3                       # Z3SS   -->  SBR    ST                 
      3.30351645E-06    2      2000004        -4                       # Z3SS   -->  CHR    CB                 
      3.30351645E-06    2     -2000004         4                       # Z3SS   -->  CBR    CH                 
      8.30302248E-04    2      1000005        -5                       # Z3SS   -->  BT1    BB                 
      8.30302248E-04    2     -1000005         5                       # Z3SS   -->  BB1    BT                 
      8.39326065E-04    2      2000005        -5                       # Z3SS   -->  BT2    BB                 
      8.39326065E-04    2     -2000005         5                       # Z3SS   -->  BB2    BT                 
      2.00429618E-01    2      1000006        -6                       # Z3SS   -->  TP1    TB                 
      2.00429618E-01    2     -1000006         6                       # Z3SS   -->  TB1    TP                 
      2.82860458E-01    2      2000006        -6                       # Z3SS   -->  TP2    TB                 
      2.82860458E-01    2     -2000006         6                       # Z3SS   -->  TB2    TP                 
      6.95276407E-16    2      1000011       -11                       # Z3SS   -->  EL-    E+                 
      6.95276407E-16    2     -1000011        11                       # Z3SS   -->  EL+    E-                 
      1.73705061E-14    2      2000011       -11                       # Z3SS   -->  ER-    E+                 
      1.73705061E-14    2     -2000011        11                       # Z3SS   -->  ER+    E-                 
      6.62530621E-12    2      1000012       -12                       # Z3SS   -->  NUEL   ANUE               
      6.62530621E-12    2     -1000012        12                       # Z3SS   -->  ANUEL  NUE                
      6.62530621E-12    2      1000014       -14                       # Z3SS   -->  NUML   ANUM               
      6.62530621E-12    2     -1000014        14                       # Z3SS   -->  ANUML  NUM                
      6.62530621E-12    2      1000016       -16                       # Z3SS   -->  NUTL   ANUT               
      6.62530621E-12    2     -1000016        16                       # Z3SS   -->  ANUTL  NUT                
      2.48950448E-12    2      1000039        22                       # Z3SS   -->  GVSS   GM                 
      6.35735971E-14    3      1000039        11       -11             # Z3SS   -->  GVSS   E-     E+          
      4.64745078E-08    2      1000039        23                       # Z3SS   -->  GVSS   Z0                 
      1.85069680E-07    2      1000039        25                       # Z3SS   -->  GVSS   HL0                
      1.75133402E-21    2      1000039        36                       # Z3SS   -->  GVSS   HA0                
#         PDG         Width
DECAY   1000035  9.26272583E+01   # Z4SS  decays
#          BR          NDA       ID1       ID2       ID3       ID4
      6.60215926E-09    2      1000022        22                       # Z4SS   -->  Z1SS   GM                 
      4.46870319E-10    2      1000023        22                       # Z4SS   -->  Z2SS   GM                 
      1.50240964E-09    2      1000025        22                       # Z4SS   -->  Z3SS   GM                 
      1.09277330E-02    2      1000024       -24                       # Z4SS   -->  W1SS+  W-                 
      1.09277330E-02    2     -1000024        24                       # Z4SS   -->  W1SS-  W+                 
      1.13045448E-03    2      1000022        23                       # Z4SS   -->  Z1SS   Z0                 
      2.87134871E-10    2      1000023        23                       # Z4SS   -->  Z2SS   Z0                 
      3.97125106E-08    3      1000022         5        -5             # Z4SS   -->  Z1SS   BT     BB          
      5.32527356E-09    3      1000022        15       -15             # Z4SS   -->  Z1SS   TAU-   TAU+        
      2.67471644E-16    3      1000023         5        -5             # Z4SS   -->  Z2SS   BT     BB          
      3.62440733E-17    3      1000023        15       -15             # Z4SS   -->  Z2SS   TAU-   TAU+        
      2.09264977E-06    3      1000025         2        -2             # Z4SS   -->  Z3SS   UP     UB          
      2.69848601E-06    3      1000025         1        -1             # Z4SS   -->  Z3SS   DN     DB          
      2.69848601E-06    3      1000025         3        -3             # Z4SS   -->  Z3SS   ST     SB          
      2.09264977E-06    3      1000025         4        -4             # Z4SS   -->  Z3SS   CH     CB          
      2.61004084E-06    3      1000025         5        -5             # Z4SS   -->  Z3SS   BT     BB          
      6.12150075E-07    3      1000025        11       -11             # Z4SS   -->  Z3SS   E-     E+          
      6.12150075E-07    3      1000025        13       -13             # Z4SS   -->  Z3SS   MU-    MU+         
      6.08620894E-07    3      1000025        15       -15             # Z4SS   -->  Z3SS   TAU-   TAU+        
      1.21798621E-06    3      1000025        12       -12             # Z4SS   -->  Z3SS   NUE    ANUE        
      1.21798621E-06    3      1000025        14       -14             # Z4SS   -->  Z3SS   NUM    ANUM        
      1.21798621E-06    3      1000025        16       -16             # Z4SS   -->  Z3SS   NUT    ANUT        
      9.19915829E-03    2      1000022        25                       # Z4SS   -->  Z1SS   HL0                
      1.39777356E-07    2      1000023        25                       # Z4SS   -->  Z2SS   HL0                
      5.31437136E-02    2      1000002        -2                       # Z4SS   -->  UPL    UB                 
      5.31437136E-02    2     -1000002         2                       # Z4SS   -->  UBL    UP                 
      5.37909791E-02    2      1000001        -1                       # Z4SS   -->  DNL    DB                 
      5.37909791E-02    2     -1000001         1                       # Z4SS   -->  DBL    DN                 
      5.37909791E-02    2      1000003        -3                       # Z4SS   -->  STL    SB                 
      5.37909791E-02    2     -1000003         3                       # Z4SS   -->  SBL    ST                 
      5.31436726E-02    2      1000004        -4                       # Z4SS   -->  CHL    CB                 
      5.31436726E-02    2     -1000004         4                       # Z4SS   -->  CBL    CH                 
      1.06030302E-05    2      2000002        -2                       # Z4SS   -->  UPR    UB                 
      1.06030302E-05    2     -2000002         2                       # Z4SS   -->  UBR    UP                 
      2.64917867E-06    2      2000001        -1                       # Z4SS   -->  DNR    DB                 
      2.64917867E-06    2     -2000001         1                       # Z4SS   -->  DBR    DN                 
      2.64917867E-06    2      2000003        -3                       # Z4SS   -->  STR    SB                 
      2.64917867E-06    2     -2000003         3                       # Z4SS   -->  SBR    ST                 
      1.06030202E-05    2      2000004        -4                       # Z4SS   -->  CHR    CB                 
      1.06030202E-05    2     -2000004         4                       # Z4SS   -->  CBR    CH                 
      3.13373486E-04    2      1000005        -5                       # Z4SS   -->  BT1    BB                 
      3.13373486E-04    2     -1000005         5                       # Z4SS   -->  BB1    BT                 
      5.40602766E-02    2      2000005        -5                       # Z4SS   -->  BT2    BB                 
      5.40602766E-02    2     -2000005         5                       # Z4SS   -->  BB2    BT                 
      5.29229045E-02    2      1000006        -6                       # Z4SS   -->  TP1    TB                 
      5.29229045E-02    2     -1000006         6                       # Z4SS   -->  TB1    TP                 
      1.62164703E-01    2      2000006        -6                       # Z4SS   -->  TP2    TB                 
      1.62164703E-01    2     -2000006         6                       # Z4SS   -->  TB2    TP                 
      8.70419753E-05    2      1000011       -11                       # Z4SS   -->  EL-    E+                 
      8.70419753E-05    2     -1000011        11                       # Z4SS   -->  EL+    E-                 
      8.70418880E-05    2      1000013       -13                       # Z4SS   -->  MUL-   MU+                
      8.70418880E-05    2     -1000013        13                       # Z4SS   -->  MUL+   MU-                
      3.97034547E-08    2      2000011       -11                       # Z4SS   -->  ER-    E+                 
      3.97034547E-08    2     -2000011        11                       # Z4SS   -->  ER+    E-                 
      3.97034157E-08    2      2000013       -13                       # Z4SS   -->  MUR-   MU+                
      3.97034157E-08    2     -2000013        13                       # Z4SS   -->  MUR+   MU-                
      2.43529286E-07    2      1000015       -15                       # Z4SS   -->  TAU1-  TAU+               
      2.43529286E-07    2     -1000015        15                       # Z4SS   -->  TAU1+  TAU-               
      8.69783398E-05    2      2000015       -15                       # Z4SS   -->  TAU2-  TAU+               
      8.69783398E-05    2     -2000015        15                       # Z4SS   -->  TAU2+  TAU-               
      9.33513147E-05    2      1000012       -12                       # Z4SS   -->  NUEL   ANUE               
      9.33513147E-05    2     -1000012        12                       # Z4SS   -->  ANUEL  NUE                
      9.33513147E-05    2      1000014       -14                       # Z4SS   -->  NUML   ANUM               
      9.33513147E-05    2     -1000014        14                       # Z4SS   -->  ANUML  NUM                
      9.33513147E-05    2      1000016       -16                       # Z4SS   -->  NUTL   ANUT               
      9.33513147E-05    2     -1000016        16                       # Z4SS   -->  ANUTL  NUT                
      4.12794918E-08    2      1000039        22                       # Z4SS   -->  GVSS   GM                 
      1.05608400E-09    3      1000039        11       -11             # Z4SS   -->  GVSS   E-     E+          
      2.26206012E-07    2      1000039        23                       # Z4SS   -->  GVSS   Z0                 
      1.95538181E-08    2      1000039        25                       # Z4SS   -->  GVSS   HL0                
      2.40606227E-13    2      1000039        35                       # Z4SS   -->  GVSS   HH0                
      1.77706116E-13    2      1000039        36                       # Z4SS   -->  GVSS   HA0                
#         PDG         Width
DECAY   1000024  8.74164352E+01   # W1SS+ decays
#          BR          NDA       ID1       ID2       ID3       ID4
      1.38067226E-05    3      1000022       -11        12             # W1SS+  -->  Z1SS   E+     NUE         
      1.38067226E-05    3      1000022       -13        14             # W1SS+  -->  Z1SS   MU+    NUM         
      1.39109607E-05    3      1000022       -15        16             # W1SS+  -->  Z1SS   TAU+   NUT         
      1.13812480E-02    2      1000022        24                       # W1SS+  -->  Z1SS   W+                 
      1.01737067E-01    2      1000002        -1                       # W1SS+  -->  UPL    DB                 
      9.86253321E-02    2     -1000001         2                       # W1SS+  -->  DBL    UP                 
      1.01736993E-01    2      1000004        -3                       # W1SS+  -->  CHL    SB                 
      9.88515243E-02    2     -1000003         4                       # W1SS+  -->  SBL    CH                 
      2.65458256E-01    2      1000006        -5                       # W1SS+  -->  TP1    BB                 
      5.39770396E-03    2      2000006        -5                       # W1SS+  -->  TP2    BB                 
      5.92831580E-04    2     -1000005         6                       # W1SS+  -->  BB1    TP                 
      3.16177517E-01    2     -2000005         6                       # W1SS+  -->  BB2    TP                 
#         PDG         Width
DECAY   1000037  9.27129974E+01   # W2SS+ decays
#          BR          NDA       ID1       ID2       ID3       ID4
      5.18275955E-09    3      1000022       -15        16             # W2SS+  -->  Z1SS   TAU+   NUT         
      1.02490466E-02    2      1000022        24                       # W2SS+  -->  Z1SS   W+                 
      7.92963514E-14    3      1000023       -15        16             # W2SS+  -->  Z2SS   TAU+   NUT         
      1.09857395E-02    2      1000023        24                       # W2SS+  -->  Z2SS   W+                 
      8.92474236E-06    3      1000025         2        -1             # W2SS+  -->  Z3SS   UP     DB          
      8.92474236E-06    3      1000025         4        -3             # W2SS+  -->  Z3SS   CH     SB          
      2.97491397E-06    3      1000025       -11        12             # W2SS+  -->  Z3SS   E+     NUE         
      2.97491397E-06    3      1000025       -13        14             # W2SS+  -->  Z3SS   MU+    NUM         
      2.97491397E-06    3      1000025       -15        16             # W2SS+  -->  Z3SS   TAU+   NUT         
      1.05769925E-01    2      1000002        -1                       # W2SS+  -->  UPL    DB                 
      1.08642727E-01    2     -1000001         2                       # W2SS+  -->  DBL    UP                 
      1.05769850E-01    2      1000004        -3                       # W2SS+  -->  CHL    SB                 
      1.08857229E-01    2     -1000003         4                       # W2SS+  -->  SBL    CH                 
      5.39272232E-03    2      1000006        -5                       # W2SS+  -->  TP1    BB                 
      2.86680371E-01    2      2000006        -5                       # W2SS+  -->  TP2    BB                 
      6.17170415E-04    2     -1000005         6                       # W2SS+  -->  BB1    TP                 
      2.46924236E-01    2     -2000005         6                       # W2SS+  -->  BB2    TP                 
      1.79492796E-04    2      1000012       -11                       # W2SS+  -->  NUEL   E+                 
      1.79492592E-04    2      1000014       -13                       # W2SS+  -->  NUML   MU+                
      1.79432827E-04    2      1000016       -15                       # W2SS+  -->  NUTL   TAU+               
      1.79660332E-04    2     -1000011        12                       # W2SS+  -->  EL+    NUE                
      1.79660332E-04    2     -1000013        14                       # W2SS+  -->  MUL+   NUM                
      4.12267582E-07    2     -1000015        16                       # W2SS+  -->  TAU1+  NUT                
      1.79591734E-04    2     -2000015        16                       # W2SS+  -->  TAU2+  NUT                
      9.00595635E-03    2      1000024        23                       # W2SS+  -->  W1SS+  Z0                 
      6.52793801E-07    2      1000024        25                       # W2SS+  -->  W1SS+  HL0                
#         PDG         Width
DECAY        25  4.47512930E-03   # HL0   decays
#          BR          NDA       ID1       ID2       ID3       ID4
      4.59154181E-09    2           11       -11                       # HL0    -->  E-     E+                 
      1.93862288E-04    2           13       -13                       # HL0    -->  MU-    MU+                
      5.54527119E-02    2           15       -15                       # HL0    -->  TAU-   TAU+               
      5.75898184E-06    2            1        -1                       # HL0    -->  DN     DB                 
      2.32691737E-03    2            3        -3                       # HL0    -->  ST     SB                 
      7.57956505E-01    2            5        -5                       # HL0    -->  BT     BB                 
      1.83231646E-06    2            2        -2                       # HL0    -->  UP     UB                 
      3.42561081E-02    2            4        -4                       # HL0    -->  CH     CB                 
      1.99405360E-03    2           22        22                       # HL0    -->  GM     GM                 
      4.07791063E-02    2           21        21                       # HL0    -->  GL     GL                 
      5.42795518E-03    3           24        11       -12             # HL0    -->  W+     E-     ANUE        
      5.42795518E-03    3           24        13       -14             # HL0    -->  W+     MU-    ANUM        
      5.42795518E-03    3           24        15       -16             # HL0    -->  W+     TAU-   ANUT        
      1.62838660E-02    3           24        -2         1             # HL0    -->  W+     UB     DN          
      1.62838660E-02    3           24        -4         3             # HL0    -->  W+     CB     ST          
      5.42795518E-03    3          -24       -11        12             # HL0    -->  W-     E+     NUE         
      5.42795518E-03    3          -24       -13        14             # HL0    -->  W-     MU+    NUM         
      5.42795518E-03    3          -24       -15        16             # HL0    -->  W-     TAU+   NUT         
      1.62838660E-02    3          -24         2        -1             # HL0    -->  W-     UP     DB          
      1.62838660E-02    3          -24         4        -3             # HL0    -->  W-     CH     SB          
      6.38104160E-04    3           23        12       -12             # HL0    -->  Z0     NUE    ANUE        
      6.38104160E-04    3           23        14       -14             # HL0    -->  Z0     NUM    ANUM        
      6.38104160E-04    3           23        16       -16             # HL0    -->  Z0     NUT    ANUT        
      3.21151427E-04    3           23        11       -11             # HL0    -->  Z0     E-     E+          
      3.21151427E-04    3           23        13       -13             # HL0    -->  Z0     MU-    MU+         
      3.21151427E-04    3           23        15       -15             # HL0    -->  Z0     TAU-   TAU+        
      1.10023748E-03    3           23         2        -2             # HL0    -->  Z0     UP     UB          
      1.10023748E-03    3           23         4        -4             # HL0    -->  Z0     CH     CB          
      1.41737692E-03    3           23         1        -1             # HL0    -->  Z0     DN     DB          
      1.41737692E-03    3           23         3        -3             # HL0    -->  Z0     ST     SB          
      1.41737692E-03    3           23         5        -5             # HL0    -->  Z0     BT     BB          
#         PDG         Width
DECAY        35  4.98755417E+01   # HH0   decays
#          BR          NDA       ID1       ID2       ID3       ID4
      7.71621100E-11    2           11       -11                       # HH0    -->  E-     E+                 
      3.25792325E-06    2           13       -13                       # HH0    -->  MU-    MU+                
      9.33116418E-04    2           15       -15                       # HH0    -->  TAU-   TAU+               
      9.38677047E-08    2            1        -1                       # HH0    -->  DN     DB                 
      3.79273042E-05    2            3        -3                       # HH0    -->  ST     SB                 
      8.43495410E-03    2            5        -5                       # HH0    -->  BT     BB                 
      3.72896214E-10    2            2        -2                       # HH0    -->  UP     UB                 
      4.73587397E-06    2            4        -4                       # HH0    -->  CH     CB                 
      2.44572535E-01    2            6        -6                       # HH0    -->  TP     TB                 
      5.21672746E-07    2           22        22                       # HH0    -->  GM     GM                 
      6.77268326E-05    2           21        21                       # HH0    -->  GL     GL                 
      7.43191849E-05    2           24       -24                       # HH0    -->  W+     W-                 
      3.80805832E-05    2           23        23                       # HH0    -->  Z0     Z0                 
      2.15905347E-05    2      1000022   1000022                       # HH0    -->  Z1SS   Z1SS               
      4.14168797E-02    2           25        25                       # HH0    -->  HL0    HL0                
      2.89023901E-05    2      1000002  -1000002                       # HH0    -->  UPL    UBL                
      5.77256560E-06    2      2000002  -2000002                       # HH0    -->  UPR    UBR                
      2.88820629E-05    2      1000004  -1000004                       # HH0    -->  CHL    CBL                
      5.76354569E-06    2      2000004  -2000004                       # HH0    -->  CHR    CBR                
      4.25377075E-05    2      1000001  -1000001                       # HH0    -->  DNL    DBL                
      1.43547913E-06    2      2000001  -2000001                       # HH0    -->  DNR    DBR                
      4.25424296E-05    2      1000003  -1000003                       # HH0    -->  STL    SBL                
      1.43460977E-06    2      2000003  -2000003                       # HH0    -->  STR    SBR                
      1.27380349E-06    2      1000005  -1000005                       # HH0    -->  BT1    BB1                
      4.34440954E-05    2      2000005  -2000005                       # HH0    -->  BT2    BB2                
      1.10656684E-02    2      1000005  -2000005                       # HH0    -->  BT1    BB2                
      1.10656684E-02    2      2000005  -1000005                       # HH0    -->  BT2    BB1                
      3.60663384E-01    2      1000006  -1000006                       # HH0    -->  TP1    TB1                
      3.21058899E-01    2      2000006  -2000006                       # HH0    -->  TP2    TB2                
      1.69328458E-04    2      1000006  -2000006                       # HH0    -->  TP1    TB2                
      1.69328458E-04    2      2000006  -1000006                       # HH0    -->  TP2    TB1                
#         PDG         Width
DECAY        36  4.50370636E+01   # HA0   decays
#          BR          NDA       ID1       ID2       ID3       ID4
      8.48996082E-11    2           11       -11                       # HA0    -->  E-     E+                 
      3.58461466E-06    2           13       -13                       # HA0    -->  MU-    MU+                
      1.02668756E-03    2           15       -15                       # HA0    -->  TAU-   TAU+               
      1.03285451E-07    2            1        -1                       # HA0    -->  DN     DB                 
      4.17325464E-05    2            3        -3                       # HA0    -->  ST     SB                 
      9.28835105E-03    2            5        -5                       # HA0    -->  BT     BB                 
      4.07999828E-10    2            2        -2                       # HA0    -->  UP     UB                 
      5.18564184E-06    2            4        -4                       # HA0    -->  CH     CB                 
      2.71668971E-01    2            6        -6                       # HA0    -->  TP     TB                 
      5.96510972E-07    2           22        22                       # HA0    -->  GM     GM                 
      7.79416587E-05    2           21        21                       # HA0    -->  GL     GL                 
      5.52287966E-05    2      1000022   1000022                       # HA0    -->  Z1SS   Z1SS               
      8.12496291E-05    2           25        23                       # HA0    -->  HL0    Z0                 
      4.79042028E-10    2      1000002  -2000002                       # HA0    -->  UPL    UBR                
      4.79042028E-10    2      2000002  -1000002                       # HA0    -->  UPR    UBL                
      2.78395401E-05    2      1000004  -2000004                       # HA0    -->  CHL    CBR                
      2.78395401E-05    2      2000004  -1000004                       # HA0    -->  CHR    CBL                
      1.47698032E-09    2      1000001  -2000001                       # HA0    -->  DNL    DBR                
      1.47698032E-09    2      2000001  -1000001                       # HA0    -->  DNR    DBL                
      5.96774782E-07    2      1000003  -2000003                       # HA0    -->  STL    SBR                
      5.96774782E-07    2      2000003  -1000003                       # HA0    -->  STR    SBL                
      1.14238784E-02    2      1000005  -2000005                       # HA0    -->  BT1    BB2                
      1.14238784E-02    2      2000005  -1000005                       # HA0    -->  BT2    BB1                
      3.47422868E-01    2      1000006  -2000006                       # HA0    -->  TP1    TB2                
      3.47422868E-01    2      2000006  -1000006                       # HA0    -->  TP2    TB1                
#         PDG         Width
DECAY        37  4.77241135E+01   # H+    decays
#          BR          NDA       ID1       ID2       ID3       ID4
      8.06491401E-11    2           12       -11                       # H+     -->  NUE    E+                 
      3.40515226E-06    2           14       -13                       # H+     -->  NUM    MU+                
      9.75286763E-04    2           16       -15                       # H+     -->  NUT    TAU+               
      9.11720619E-08    2            2        -1                       # H+     -->  UP     DB                 
      4.12493682E-05    2            4        -3                       # H+     -->  CH     SB                 
      2.45763913E-01    2            6        -5                       # H+     -->  TP     BB                 
      7.72660787E-05    2           25        24                       # H+     -->  HL0    W+                 
      7.35718277E-05    2      1000002  -1000001                       # H+     -->  UPL    DBL                
      3.00451375E-09    2      2000002  -2000001                       # H+     -->  UPR    DBR                
      7.35441063E-05    2      1000004  -1000003                       # H+     -->  CHL    SBL                
      1.21397215E-06    2      2000004  -2000003                       # H+     -->  CHR    SBR                
      1.18587343E-02    2      1000006  -1000005                       # H+     -->  TP1    BB1                
      3.63799483E-01    2      1000006  -2000005                       # H+     -->  TP1    BB2                
      1.05394693E-02    2      2000006  -1000005                       # H+     -->  TP2    BB1                
      3.66792738E-01    2      2000006  -2000005                       # H+     -->  TP2    BB2                
