#  ISAJET SUSY parameters in SUSY Les Houches Accord 2 format
#  Created by ISALHA 2.0 Last revision: C. Balazs 21 Apr 2009
Block SPINFO   # Program information
     1   ISASUGRA from ISAJET          # Spectrum Calculator
     2   7.80   29-OCT-2009 12:50:36   # Version number
Block MODSEL   # Model selection
     1     1   # Minimal supergravity (mSUGRA) model               
Block SMINPUTS   # Standard Model inputs
     1     1.27837135E+02   # alpha_em^(-1)
     2     1.16570000E-05   # G_Fermi
     3     1.17200002E-01   # alpha_s(M_Z)
     4     9.11699982E+01   # m_{Z}(pole)
     5     4.19999981E+00   # m_{b}(m_{b})
     6     1.72500000E+02   # m_{top}(pole)
     7     1.77699995E+00   # m_{tau}(pole)
Block MINPAR   # SUSY breaking input parameters
     1     3.46000000E+03   # m_0
     2     3.60000000E+02   # m_{1/2}
     3     1.00000000E+01   # tan(beta)
     4     1.00000000E+00   # sign(mu)
     5     0.00000000E+00   # A_0
Block EXTPAR   # Non-universal SUSY breaking parameters
     0     2.10141239E+16   # Input scale
Block MASS   # Scalar and gaugino mass spectrum
#  PDG code   mass                 particle
        24     8.04229965E+01   #  W^+
        25     1.17732750E+02   #  h^0            
        35     3.44695483E+03   #  H^0            
        36     3.42437183E+03   #  A^0            
        37     3.44793384E+03   #  H^+            
   1000001     3.50243091E+03   #  dnl            
   1000002     3.50151416E+03   #  upl            
   1000003     3.50243091E+03   #  stl            
   1000004     3.50151440E+03   #  chl            
   1000005     2.87269897E+03   #  b1             
   1000006     2.05887866E+03   #  t1             
   1000011     3.46161499E+03   #  el-            
   1000012     3.46198926E+03   #  nuel           
   1000013     3.46161499E+03   #  mul-           
   1000014     3.46198926E+03   #  numl           
   1000015     3.42759912E+03   #  tau1           
   1000016     3.44636963E+03   #  nutl           
   1000021     9.92241882E+02   #  glss           
   1000022     1.48709030E+02   #  z1ss           
   1000023     2.48091888E+02   #  z2ss           
   1000024     2.49855667E+02   #  w1ss           
   1000025    -3.05127441E+02   #  z3ss           
   1000035     3.69104645E+02   #  z4ss           
   1000037     3.63336700E+02   #  w2ss           
   2000001     3.51157275E+03   #  dnr            
   2000002     3.50994946E+03   #  upr            
   2000003     3.51157275E+03   #  str            
   2000004     3.50994971E+03   #  chr            
   2000005     3.47838379E+03   #  b2             
   2000006     2.88348755E+03   #  t2             
   2000011     3.45907202E+03   #  er-            
   2000013     3.45907202E+03   #  mur-           
   2000015     3.44541455E+03   #  tau2           
Block ALPHA   # Effective Higgs mixing parameter
         -9.98524502E-02   # alpha
Block STOPMIX   # stop mixing matrix
  1  1     1.80570371E-02   # O_{11}
  1  2     9.99836981E-01   # O_{12}
  2  1    -9.99836981E-01   # O_{21}
  2  2     1.80570371E-02   # O_{22}
Block SBOTMIX   # sbottom mixing matrix
  1  1     9.99990880E-01   # O_{11}
  1  2     4.26392769E-03   # O_{12}
  2  1    -4.26392769E-03   # O_{21}
  2  2     9.99990880E-01   # O_{22}
Block STAUMIX   # stau mixing matrix
  1  1     9.92413759E-02   # O_{11}
  1  2     9.95063365E-01   # O_{12}
  2  1    -9.95063365E-01   # O_{21}
  2  2     9.92413759E-02   # O_{22}
Block NMIX   # neutralino mixing matrix
  1  1     9.65204358E-01   #
  1  2    -7.49395788E-02   #
  1  3     2.17631966E-01   #
  1  4    -1.24100611E-01   #
  2  1     2.27603614E-01   #
  2  2     6.94718957E-01   #
  2  3    -5.14938295E-01   #
  2  4     4.47661191E-01   #
  3  1     5.94370812E-02   #
  3  2    -7.66409039E-02   #
  3  3    -6.95803106E-01   #
  3  4    -7.11654007E-01   #
  4  1     1.14212081E-01   #
  4  2    -7.11249053E-01   #
  4  3    -4.50924546E-01   #
  4  4     5.27017057E-01   #
Block UMIX   # chargino U mixing matrix
  1  1    -6.56317651E-01   # U_{11}
  1  2     7.54484653E-01   # U_{12}
  2  1    -7.54484653E-01   # U_{21}
  2  2    -6.56317651E-01   # U_{22}
Block VMIX   # chargino V mixing matrix
  1  1    -7.61457443E-01   # V_{11}
  1  2     6.48214936E-01   # V_{12}
  2  1    -6.48214936E-01   # V_{21}
  2  2    -7.61457443E-01   # V_{22}
Block GAUGE Q=  2.42616919E+03   #
     1     3.57523382E-01   # g`
     2     6.52378678E-01   # g_2
     3     1.21925902E+00   # g_3
Block YU Q=  2.42616919E+03   #
  3  3     8.44603539E-01   # y_t
Block YD Q=  2.42616919E+03   #
  3  3     1.28975093E-01   # y_b
Block YE Q=  2.42616919E+03   #
  3  3     1.02037460E-01   # y_tau
Block HMIX Q=  2.42616919E+03   # Higgs mixing parameters
     1     2.93221008E+02   # mu(Q)
     2     1.00000000E+01   # tan(beta)(M_GUT)
     3     2.51891739E+02   # Higgs vev at Q
     4     1.17263220E+07   # m_A^2(Q)
Block MSOFT Q=  2.42616919E+03   # DRbar SUSY breaking parameters
     1     1.55434113E+02   # M_1(Q)          
     2     2.84585144E+02   # M_2(Q)          
     3     8.24224243E+02   # M_3(Q)          
    31     3.45005591E+03   # MeL(Q)          
    32     3.45005591E+03   # MmuL(Q)         
    33     3.43485742E+03   # MtauL(Q)        
    34     3.45541528E+03   # MeR(Q)          
    35     3.45541528E+03   # MmuR(Q)         
    36     3.42498120E+03   # MtauR(Q)        
    41     3.44899829E+03   # MqL1(Q)         
    42     3.44899829E+03   # MqL2(Q)         
    43     2.83439648E+03   # MqL3(Q)         
    44     3.45712012E+03   # MuR(Q)          
    45     3.45712012E+03   # McR(Q)          
    46     2.07673730E+03   # MtR(Q)          
    47     3.45845337E+03   # MdR(Q)          
    48     3.45845337E+03   # MsR(Q)          
    49     3.43232275E+03   # MbR(Q)          
Block AU Q=  2.42616919E+03   #
  1  1    -5.83192444E+02   # A_u
  2  2    -5.83192444E+02   # A_c
  3  3    -5.83192444E+02   # A_t
Block AD Q=  2.42616919E+03   #
  1  1    -8.56014954E+02   # A_d
  2  2    -8.56014954E+02   # A_s
  3  3    -8.56014954E+02   # A_b
Block AE Q=  2.42616919E+03   #
  1  1    -2.08307022E+02   # A_e
  2  2    -2.08307022E+02   # A_mu
  3  3    -2.08307022E+02   # A_tau
#  ISAJET decay tables in SUSY Les Houches accord format
#  Created by ISALHD. Last revision: C. Balazs, 2005 May 25
Block DCINFO                           # Program information
     1   ISASUGRA from ISAJET          # Spectrum Calculator
     2   7.80   29-OCT-2009 12:50:36   # Version number
#         PDG         Width
DECAY         6  1.14680779E+00   # TP    decays
#          BR          NDA       ID1       ID2       ID3       ID4
      3.33333343E-01    3            2        -1         5             # TP     -->  UP     DB     BT          
      3.33333343E-01    3            4        -3         5             # TP     -->  CH     SB     BT          
      1.11111112E-01    3          -11        12         5             # TP     -->  E+     NUE    BT          
      1.11111112E-01    3          -13        14         5             # TP     -->  MU+    NUM    BT          
      1.11111112E-01    3          -15        16         5             # TP     -->  TAU+   NUT    BT          
#         PDG         Width
DECAY   1000021  8.96208629E-04   # GLSS  decays
#          BR          NDA       ID1       ID2       ID3       ID4
      1.66796930E-02    3      1000024         1        -2             # GLSS   -->  W1SS+  DN     UB          
      1.66796930E-02    3     -1000024         2        -1             # GLSS   -->  W1SS-  UP     DB          
      1.66796893E-02    3      1000024         3        -4             # GLSS   -->  W1SS+  ST     CB          
      1.66796893E-02    3     -1000024         4        -3             # GLSS   -->  W1SS-  CH     SB          
      8.25454965E-02    3      1000024         5        -6             # GLSS   -->  W1SS+  BT     TB          
      8.25454965E-02    3     -1000024         6        -5             # GLSS   -->  W1SS-  TP     BB          
      1.04738520E-02    3      1000037         1        -2             # GLSS   -->  W2SS+  DN     UB          
      1.04738520E-02    3     -1000037         2        -1             # GLSS   -->  W2SS-  UP     DB          
      1.04738502E-02    3      1000037         3        -4             # GLSS   -->  W2SS+  ST     CB          
      1.04738502E-02    3     -1000037         4        -3             # GLSS   -->  W2SS-  CH     SB          
      1.30263060E-01    3      1000037         5        -6             # GLSS   -->  W2SS+  BT     TB          
      1.30263060E-01    3     -1000037         6        -5             # GLSS   -->  W2SS-  TP     BB          
      3.94577131E-04    2      1000022        21                       # GLSS   -->  Z1SS   GL                 
      1.03804935E-02    3      1000022         2        -2             # GLSS   -->  Z1SS   UP     UB          
      3.83666321E-03    3      1000022         1        -1             # GLSS   -->  Z1SS   DN     DB          
      3.83666321E-03    3      1000022         3        -3             # GLSS   -->  Z1SS   ST     SB          
      1.03804916E-02    3      1000022         4        -4             # GLSS   -->  Z1SS   CH     CB          
      5.85285621E-03    3      1000022         5        -5             # GLSS   -->  Z1SS   BT     BB          
      4.33974303E-02    3      1000022         6        -6             # GLSS   -->  Z1SS   TP     TB          
      1.07979607E-02    2      1000023        21                       # GLSS   -->  Z2SS   GL                 
      9.48516745E-03    3      1000023         2        -2             # GLSS   -->  Z2SS   UP     UB          
      7.20466441E-03    3      1000023         1        -1             # GLSS   -->  Z2SS   DN     DB          
      7.20466441E-03    3      1000023         3        -3             # GLSS   -->  Z2SS   ST     SB          
      9.48516373E-03    3      1000023         4        -4             # GLSS   -->  Z2SS   CH     CB          
      1.75134186E-02    3      1000023         5        -5             # GLSS   -->  Z2SS   BT     BB          
      6.87092841E-02    3      1000023         6        -6             # GLSS   -->  Z2SS   TP     TB          
      2.30962597E-02    2      1000025        21                       # GLSS   -->  Z3SS   GL                 
      3.92326183E-05    3      1000025         2        -2             # GLSS   -->  Z3SS   UP     UB          
      5.13809428E-05    3      1000025         1        -1             # GLSS   -->  Z3SS   DN     DB          
      5.13809428E-05    3      1000025         3        -3             # GLSS   -->  Z3SS   ST     SB          
      3.92325965E-05    3      1000025         4        -4             # GLSS   -->  Z3SS   CH     CB          
      2.06935406E-03    3      1000025         5        -5             # GLSS   -->  Z3SS   BT     BB          
      9.92437676E-02    3      1000025         6        -6             # GLSS   -->  Z3SS   TP     TB          
      1.11664012E-02    2      1000035        21                       # GLSS   -->  Z4SS   GL                 
      4.99435700E-03    3      1000035         2        -2             # GLSS   -->  Z4SS   UP     UB          
      5.54949138E-03    3      1000035         1        -1             # GLSS   -->  Z4SS   DN     DB          
      5.54949138E-03    3      1000035         3        -3             # GLSS   -->  Z4SS   ST     SB          
      4.99435421E-03    3      1000035         4        -4             # GLSS   -->  Z4SS   CH     CB          
      1.34989750E-02    3      1000035         5        -5             # GLSS   -->  Z4SS   BT     BB          
      8.69456381E-02    3      1000035         6        -6             # GLSS   -->  Z4SS   TP     TB          
#         PDG         Width
DECAY   1000002  2.05180511E+02   # UPL   decays
#          BR          NDA       ID1       ID2       ID3       ID4
      7.43103563E-04    2      1000022         2                       # UPL    -->  Z1SS   UP                 
      3.85663621E-02    2      1000023         2                       # UPL    -->  Z2SS   UP                 
      3.05860711E-04    2      1000025         2                       # UPL    -->  Z3SS   UP                 
      3.34759504E-02    2      1000035         2                       # UPL    -->  Z4SS   UP                 
      7.85379231E-01    2      1000021         2                       # UPL    -->  GLSS   UP                 
      8.24554190E-02    2      1000024         1                       # UPL    -->  W1SS+  DN                 
      5.90740740E-02    2      1000037         1                       # UPL    -->  W2SS+  DN                 
#         PDG         Width
DECAY   1000001  2.05190170E+02   # DNL   decays
#          BR          NDA       ID1       ID2       ID3       ID4
      4.53807879E-03    2      1000022         1                       # DNL    -->  Z1SS   DN                 
      3.03325932E-02    2      1000023         1                       # DNL    -->  Z2SS   DN                 
      5.42154943E-04    2      1000025         1                       # DNL    -->  Z3SS   DN                 
      3.76662612E-02    2      1000035         1                       # DNL    -->  Z4SS   DN                 
      7.85601020E-01    2      1000021         1                       # DNL    -->  GLSS   DN                 
      6.12705424E-02    2     -1000024         2                       # DNL    -->  W1SS-  UP                 
      8.00493434E-02    2     -1000037         2                       # DNL    -->  W2SS-  UP                 
#         PDG         Width
DECAY   1000003  2.05190170E+02   # STL   decays
#          BR          NDA       ID1       ID2       ID3       ID4
      4.53807879E-03    2      1000022         3                       # STL    -->  Z1SS   ST                 
      3.03325932E-02    2      1000023         3                       # STL    -->  Z2SS   ST                 
      5.42154943E-04    2      1000025         3                       # STL    -->  Z3SS   ST                 
      3.76662612E-02    2      1000035         3                       # STL    -->  Z4SS   ST                 
      7.85601020E-01    2      1000021         3                       # STL    -->  GLSS   ST                 
      6.12705238E-02    2     -1000024         4                       # STL    -->  W1SS-  CH                 
      8.00493285E-02    2     -1000037         4                       # STL    -->  W2SS-  CH                 
#         PDG         Width
DECAY   1000004  2.05180496E+02   # CHL   decays
#          BR          NDA       ID1       ID2       ID3       ID4
      7.43103446E-04    2      1000022         4                       # CHL    -->  Z1SS   CH                 
      3.85663658E-02    2      1000023         4                       # CHL    -->  Z2SS   CH                 
      3.05860711E-04    2      1000025         4                       # CHL    -->  Z3SS   CH                 
      3.34759504E-02    2      1000035         4                       # CHL    -->  Z4SS   CH                 
      7.85379231E-01    2      1000021         4                       # CHL    -->  GLSS   CH                 
      8.24554339E-02    2      1000024         3                       # CHL    -->  W1SS+  ST                 
      5.90740815E-02    2      1000037         3                       # CHL    -->  W2SS+  ST                 
#         PDG         Width
DECAY   1000005  1.98650116E+02   # BT1   decays
#          BR          NDA       ID1       ID2       ID3       ID4
      4.09380160E-03    2      1000022         5                       # BT1    -->  Z1SS   BT                 
      2.69230921E-02    2      1000023         5                       # BT1    -->  Z2SS   BT                 
      2.82137073E-03    2      1000025         5                       # BT1    -->  Z3SS   BT                 
      3.25051583E-02    2      1000035         5                       # BT1    -->  Z4SS   BT                 
      6.21457219E-01    2      1000021         5                       # BT1    -->  GLSS   BT                 
      1.30717933E-01    2     -1000024         6                       # BT1    -->  W1SS-  TP                 
      1.78612217E-01    2     -1000037         6                       # BT1    -->  W2SS-  TP                 
      2.86915689E-03    2          -24   1000006                       # BT1    -->  W-     TP1                
#         PDG         Width
DECAY   1000006  1.25553108E+02   # TP1   decays
#          BR          NDA       ID1       ID2       ID3       ID4
      5.41521192E-01    2      1000021         6                       # TP1    -->  GLSS   TP                 
      3.70974429E-02    2      1000022         6                       # TP1    -->  Z1SS   TP                 
      4.60122004E-02    2      1000023         6                       # TP1    -->  Z2SS   TP                 
      1.07075654E-01    2      1000025         6                       # TP1    -->  Z3SS   TP                 
      5.61119542E-02    2      1000035         6                       # TP1    -->  Z4SS   TP                 
      9.38948542E-02    2      1000024         5                       # TP1    -->  W1SS+  BT                 
      1.18286729E-01    2      1000037         5                       # TP1    -->  W2SS+  BT                 
#         PDG         Width
DECAY   2000002  1.69533966E+02   # UPR   decays
#          BR          NDA       ID1       ID2       ID3       ID4
      4.34448645E-02    2      1000022         2                       # UPR    -->  Z1SS   UP                 
      2.40031607E-03    2      1000023         2                       # UPR    -->  Z2SS   UP                 
      1.62849450E-04    2      1000025         2                       # UPR    -->  Z3SS   UP                 
      5.97070786E-04    2      1000035         2                       # UPR    -->  Z4SS   UP                 
      9.53394890E-01    2      1000021         2                       # UPR    -->  GLSS   UP                 
#         PDG         Width
DECAY   2000001  1.63702942E+02   # DNR   decays
#          BR          NDA       ID1       ID2       ID3       ID4
      1.12533271E-02    2      1000022         1                       # DNR    -->  Z1SS   DN                 
      6.21746760E-04    2      1000023         1                       # DNR    -->  Z2SS   DN                 
      4.21826117E-05    2      1000025         1                       # DNR    -->  Z3SS   DN                 
      1.54659210E-04    2      1000035         1                       # DNR    -->  Z4SS   DN                 
      9.87928092E-01    2      1000021         1                       # DNR    -->  GLSS   DN                 
#         PDG         Width
DECAY   2000003  1.63702942E+02   # STR   decays
#          BR          NDA       ID1       ID2       ID3       ID4
      1.12533271E-02    2      1000022         3                       # STR    -->  Z1SS   ST                 
      6.21746760E-04    2      1000023         3                       # STR    -->  Z2SS   ST                 
      4.21826117E-05    2      1000025         3                       # STR    -->  Z3SS   ST                 
      1.54659210E-04    2      1000035         3                       # STR    -->  Z4SS   ST                 
      9.87928092E-01    2      1000021         3                       # STR    -->  GLSS   ST                 
#         PDG         Width
DECAY   2000004  1.69533920E+02   # CHR   decays
#          BR          NDA       ID1       ID2       ID3       ID4
      4.34448682E-02    2      1000022         4                       # CHR    -->  Z1SS   CH                 
      2.40031653E-03    2      1000023         4                       # CHR    -->  Z2SS   CH                 
      1.62849479E-04    2      1000025         4                       # CHR    -->  Z3SS   CH                 
      5.97070728E-04    2      1000035         4                       # CHR    -->  Z4SS   CH                 
      9.53394830E-01    2      1000021         4                       # CHR    -->  GLSS   CH                 
#         PDG         Width
DECAY   2000005  1.64167969E+02   # BT2   decays
#          BR          NDA       ID1       ID2       ID3       ID4
      1.14326328E-02    2      1000022         5                       # BT2    -->  Z1SS   BT                 
      2.48339586E-03    2      1000023         5                       # BT2    -->  Z2SS   BT                 
      3.56634799E-03    2      1000025         5                       # BT2    -->  Z3SS   BT                 
      1.69135747E-03    2      1000035         5                       # BT2    -->  Z4SS   BT                 
      9.73402619E-01    2      1000021         5                       # BT2    -->  GLSS   BT                 
      3.97993438E-03    2     -1000024         6                       # BT2    -->  W1SS-  TP                 
      3.24153225E-03    2     -1000037         6                       # BT2    -->  W2SS-  TP                 
      2.69778724E-07    2          -24   1000006                       # BT2    -->  W-     TP1                
      9.02541360E-05    2          -24   2000006                       # BT2    -->  W-     TP2                
      4.77009635E-05    2           23   1000005                       # BT2    -->  Z0     BT1                
      6.39585269E-05    2           25   1000005                       # BT2    -->  HL0    BT1                
#         PDG         Width
DECAY   2000006  1.98658218E+02   # TP2   decays
#          BR          NDA       ID1       ID2       ID3       ID4
      6.18016779E-01    2      1000021         6                       # TP2    -->  GLSS   TP                 
      6.98870793E-02    2      1000024         5                       # TP2    -->  W1SS+  BT                 
      5.45375980E-02    2      1000037         5                       # TP2    -->  W2SS+  BT                 
      1.49872666E-03    2           23   1000006                       # TP2    -->  Z0     TP1                
      3.07553937E-03    2           25   1000006                       # TP2    -->  HL0    TP1                
      3.35755292E-03    2      1000022         6                       # TP2    -->  Z1SS   TP                 
      6.93343729E-02    2      1000023         6                       # TP2    -->  Z2SS   TP                 
      9.69633535E-02    2      1000025         6                       # TP2    -->  Z3SS   TP                 
      8.33289772E-02    2      1000035         6                       # TP2    -->  Z4SS   TP                 
#         PDG         Width
DECAY   1000011  4.73703728E+01   # EL-   decays
#          BR          NDA       ID1       ID2       ID3       ID4
      6.36011809E-02    2      1000022        11                       # EL-    -->  Z1SS   E-                 
      2.04617336E-01    2      1000023        11                       # EL-    -->  Z2SS   E-                 
      5.85574133E-04    2      1000025        11                       # EL-    -->  Z3SS   E-                 
      1.26426905E-01    2      1000035        11                       # EL-    -->  Z4SS   E-                 
      2.62243748E-01    2     -1000024        12                       # EL-    -->  W1SS-  NUE                
      3.42525244E-01    2     -1000037        12                       # EL-    -->  W2SS-  NUE                
#         PDG         Width
DECAY   1000013  4.73703728E+01   # MUL-  decays
#          BR          NDA       ID1       ID2       ID3       ID4
      6.36011809E-02    2      1000022        13                       # MUL-   -->  Z1SS   MU-                
      2.04617336E-01    2      1000023        13                       # MUL-   -->  Z2SS   MU-                
      5.85574133E-04    2      1000025        13                       # MUL-   -->  Z3SS   MU-                
      1.26426905E-01    2      1000035        13                       # MUL-   -->  Z4SS   MU-                
      2.62243748E-01    2     -1000024        14                       # MUL-   -->  W1SS-  NUM                
      3.42525244E-01    2     -1000037        14                       # MUL-   -->  W2SS-  NUM                
#         PDG         Width
DECAY   1000015  1.91170082E+01   # TAU1- decays
#          BR          NDA       ID1       ID2       ID3       ID4
      8.45877051E-01    2      1000022        15                       # TAU1-  -->  Z1SS   TAU-               
      7.12974072E-02    2      1000023        15                       # TAU1-  -->  Z2SS   TAU-               
      1.91912055E-02    2      1000025        15                       # TAU1-  -->  Z3SS   TAU-               
      1.07538411E-02    2      1000035        15                       # TAU1-  -->  Z4SS   TAU-               
      5.15456535E-02    2     -1000024        16                       # TAU1-  -->  W1SS-  NUT                
      1.33472180E-03    2     -1000037        16                       # TAU1-  -->  W2SS-  NUT                
#         PDG         Width
DECAY   1000012  4.74079628E+01   # NUEL  decays
#          BR          NDA       ID1       ID2       ID3       ID4
      1.12258486E-01    2      1000022        12                       # NUEL   -->  Z1SS   NUE                
      9.87165123E-02    2      1000023        12                       # NUEL   -->  Z2SS   NUE                
      3.61595466E-03    2      1000025        12                       # NUEL   -->  Z3SS   NUE                
      1.79996416E-01    2      1000035        12                       # NUEL   -->  Z4SS   NUE                
      3.52753848E-01    2      1000024        11                       # NUEL   -->  W1SS+  E-                 
      2.52658784E-01    2      1000037        11                       # NUEL   -->  W2SS+  E-                 
#         PDG         Width
DECAY   1000014  4.74079628E+01   # NUML  decays
#          BR          NDA       ID1       ID2       ID3       ID4
      1.12258486E-01    2      1000022        14                       # NUML   -->  Z1SS   NUM                
      9.87165123E-02    2      1000023        14                       # NUML   -->  Z2SS   NUM                
      3.61595466E-03    2      1000025        14                       # NUML   -->  Z3SS   NUM                
      1.79996416E-01    2      1000035        14                       # NUML   -->  Z4SS   NUM                
      3.52753848E-01    2      1000024        13                       # NUML   -->  W1SS+  MU-                
      2.52658784E-01    2      1000037        13                       # NUML   -->  W2SS+  MU-                
#         PDG         Width
DECAY   1000016  4.79253426E+01   # NUTL  decays
#          BR          NDA       ID1       ID2       ID3       ID4
      1.10541880E-01    2      1000022        16                       # NUTL   -->  Z1SS   NUT                
      9.72011313E-02    2      1000023        16                       # NUTL   -->  Z2SS   NUT                
      3.56027368E-03    2      1000025        16                       # NUTL   -->  Z3SS   NUT                
      1.77212879E-01    2      1000035        16                       # NUTL   -->  Z4SS   NUT                
      3.56136292E-01    2      1000024        15                       # NUTL   -->  W1SS+  TAU-               
      2.55347610E-01    2      1000037        15                       # NUTL   -->  W2SS+  TAU-               
      1.41916187E-10    3      1000015        16       -15             # NUTL   -->  TAU1-  NUT    TAU+        
      1.41916187E-10    3      1000015        12       -11             # NUTL   -->  TAU1-  NUE    E+          
      1.41916187E-10    3      1000015        14       -13             # NUTL   -->  TAU1-  NUM    MU+         
      4.25748575E-10    3      1000015         2        -1             # NUTL   -->  TAU1-  UP     DB          
      4.25748575E-10    3      1000015         4        -3             # NUTL   -->  TAU1-  CH     SB          
#         PDG         Width
DECAY   2000011  1.75177078E+01   # ER-   decays
#          BR          NDA       ID1       ID2       ID3       ID4
      9.32208061E-01    2      1000022        11                       # ER-    -->  Z1SS   E-                 
      5.14943749E-02    2      1000023        11                       # ER-    -->  Z2SS   E-                 
      3.49309947E-03    2      1000025        11                       # ER-    -->  Z3SS   E-                 
      1.28043788E-02    2      1000035        11                       # ER-    -->  Z4SS   E-                 
#         PDG         Width
DECAY   2000013  1.75177078E+01   # MUR-  decays
#          BR          NDA       ID1       ID2       ID3       ID4
      9.32208061E-01    2      1000022        13                       # MUR-   -->  Z1SS   MU-                
      5.14943749E-02    2      1000023        13                       # MUR-   -->  Z2SS   MU-                
      3.49309947E-03    2      1000025        13                       # MUR-   -->  Z3SS   MU-                
      1.28043788E-02    2      1000035        13                       # MUR-   -->  Z4SS   MU-                
#         PDG         Width
DECAY   2000015  4.75852432E+01   # TAU2- decays
#          BR          NDA       ID1       ID2       ID3       ID4
      6.47075623E-02    2      1000022        15                       # TAU2-  -->  Z1SS   TAU-               
      2.01064318E-01    2      1000023        15                       # TAU2-  -->  Z2SS   TAU-               
      9.11281258E-03    2      1000025        15                       # TAU2-  -->  Z3SS   TAU-               
      1.31851032E-01    2      1000035        15                       # TAU2-  -->  Z4SS   TAU-               
      2.47861102E-01    2     -1000024        16                       # TAU2-  -->  W1SS-  NUT                
      3.45403165E-01    2     -1000037        16                       # TAU2-  -->  W2SS-  NUT                
#         PDG         Width
DECAY   1000023  4.16388083E-03   # Z2SS  decays
#          BR          NDA       ID1       ID2       ID3       ID4
      2.50522171E-05    2      1000022        22                       # Z2SS   -->  Z1SS   GM                 
      9.99918699E-01    2      1000022        23                       # Z2SS   -->  Z1SS   Z0                 
      4.00514688E-09    3      1000022         2        -2             # Z2SS   -->  Z1SS   UP     UB          
      5.74774051E-09    3      1000022         1        -1             # Z2SS   -->  Z1SS   DN     DB          
      5.74774051E-09    3      1000022         3        -3             # Z2SS   -->  Z1SS   ST     SB          
      4.00514599E-09    3      1000022         4        -4             # Z2SS   -->  Z1SS   CH     CB          
      4.64230252E-05    3      1000022         5        -5             # Z2SS   -->  Z1SS   BT     BB          
      1.51307926E-08    3      1000022        11       -11             # Z2SS   -->  Z1SS   E-     E+          
      1.51307926E-08    3      1000022        13       -13             # Z2SS   -->  Z1SS   MU-    MU+         
      9.83710834E-06    3      1000022        15       -15             # Z2SS   -->  Z1SS   TAU-   TAU+        
      8.55947757E-09    3      1000022        12       -12             # Z2SS   -->  Z1SS   NUE    ANUE        
      8.55947757E-09    3      1000022        14       -14             # Z2SS   -->  Z1SS   NUM    ANUM        
      8.71623840E-09    3      1000022        16       -16             # Z2SS   -->  Z1SS   NUT    ANUT        
#         PDG         Width
DECAY   1000025  1.42307848E-01   # Z3SS  decays
#          BR          NDA       ID1       ID2       ID3       ID4
      1.41385988E-06    2      1000022        22                       # Z3SS   -->  Z1SS   GM                 
      5.76698710E-07    2      1000023        22                       # Z3SS   -->  Z2SS   GM                 
      8.49188014E-04    3     -1000024         2        -1             # Z3SS   -->  W1SS-  UP     DB          
      2.83062691E-04    3     -1000024        12       -11             # Z3SS   -->  W1SS-  NUE    E+          
      2.83062691E-04    3     -1000024        14       -13             # Z3SS   -->  W1SS-  NUM    MU+         
      8.49188014E-04    3      1000024         1        -2             # Z3SS   -->  W1SS+  DN     UB          
      2.83062691E-04    3      1000024        11       -12             # Z3SS   -->  W1SS+  E-     ANUE        
      2.83062691E-04    3      1000024        13       -14             # Z3SS   -->  W1SS+  MU-    ANUM        
      8.49188014E-04    3     -1000024         4        -3             # Z3SS   -->  W1SS-  CH     SB          
      2.83062691E-04    3     -1000024        16       -15             # Z3SS   -->  W1SS-  NUT    TAU+        
      8.49188014E-04    3      1000024         3        -4             # Z3SS   -->  W1SS+  ST     CB          
      2.83062691E-04    3      1000024        15       -16             # Z3SS   -->  W1SS+  TAU-   ANUT        
      9.52487826E-01    2      1000022        23                       # Z3SS   -->  Z1SS   Z0                 
      1.69409087E-11    3      1000022         2        -2             # Z3SS   -->  Z1SS   UP     UB          
      9.35300708E-12    3      1000022         1        -1             # Z3SS   -->  Z1SS   DN     DB          
      9.35300708E-12    3      1000022         3        -3             # Z3SS   -->  Z1SS   ST     SB          
      1.69409053E-11    3      1000022         4        -4             # Z3SS   -->  Z1SS   CH     CB          
      9.49364032E-10    3      1000022         5        -5             # Z3SS   -->  Z1SS   BT     BB          
      3.13431919E-11    3      1000022        11       -11             # Z3SS   -->  Z1SS   E-     E+          
      3.13431919E-11    3      1000022        13       -13             # Z3SS   -->  Z1SS   MU-    MU+         
      6.95281666E-10    3      1000022        15       -15             # Z3SS   -->  Z1SS   TAU-   TAU+        
      2.62819801E-11    3      1000022        12       -12             # Z3SS   -->  Z1SS   NUE    ANUE        
      2.62819801E-11    3      1000022        14       -14             # Z3SS   -->  Z1SS   NUM    ANUM        
      2.67640146E-11    3      1000022        16       -16             # Z3SS   -->  Z1SS   NUT    ANUT        
      2.40800102E-04    3      1000023         2        -2             # Z3SS   -->  Z2SS   UP     UB          
      3.10463278E-04    3      1000023         1        -1             # Z3SS   -->  Z2SS   DN     DB          
      3.10463278E-04    3      1000023         3        -3             # Z3SS   -->  Z2SS   ST     SB          
      2.40800102E-04    3      1000023         4        -4             # Z3SS   -->  Z2SS   CH     CB          
      2.87732662E-04    3      1000023         5        -5             # Z3SS   -->  Z2SS   BT     BB          
      7.04323465E-05    3      1000023        11       -11             # Z3SS   -->  Z2SS   E-     E+          
      7.04323465E-05    3      1000023        13       -13             # Z3SS   -->  Z2SS   MU-    MU+         
      6.95308481E-05    3      1000023        15       -15             # Z3SS   -->  Z2SS   TAU-   TAU+        
      1.40154763E-04    3      1000023        12       -12             # Z3SS   -->  Z2SS   NUE    ANUE        
      1.40154763E-04    3      1000023        14       -14             # Z3SS   -->  Z2SS   NUM    ANUM        
      1.40154880E-04    3      1000023        16       -16             # Z3SS   -->  Z2SS   NUT    ANUT        
      4.03939262E-02    2      1000022        25                       # Z3SS   -->  Z1SS   HL0                
#         PDG         Width
DECAY   1000035  7.01343536E-01   # Z4SS  decays
#          BR          NDA       ID1       ID2       ID3       ID4
      2.25879546E-07    2      1000022        22                       # Z4SS   -->  Z1SS   GM                 
      1.19020137E-06    2      1000023        22                       # Z4SS   -->  Z2SS   GM                 
      9.56075041E-07    2      1000025        22                       # Z4SS   -->  Z3SS   GM                 
      4.51715171E-01    2      1000024       -24                       # Z4SS   -->  W1SS+  W-                 
      4.51715171E-01    2     -1000024        24                       # Z4SS   -->  W1SS-  W+                 
      8.55731930E-09    3     -1000037         2        -1             # Z4SS   -->  W2SS-  UP     DB          
      2.85243984E-09    3     -1000037        12       -11             # Z4SS   -->  W2SS-  NUE    E+          
      2.85243984E-09    3     -1000037        14       -13             # Z4SS   -->  W2SS-  NUM    MU+         
      8.55731930E-09    3      1000037         1        -2             # Z4SS   -->  W2SS+  DN     UB          
      2.85243984E-09    3      1000037        11       -12             # Z4SS   -->  W2SS+  E-     ANUE        
      2.85243984E-09    3      1000037        13       -14             # Z4SS   -->  W2SS+  MU-    ANUM        
      8.55731930E-09    3     -1000037         4        -3             # Z4SS   -->  W2SS-  CH     SB          
      2.85243984E-09    3     -1000037        16       -15             # Z4SS   -->  W2SS-  NUT    TAU+        
      8.55731930E-09    3      1000037         3        -4             # Z4SS   -->  W2SS+  ST     CB          
      2.85243984E-09    3      1000037        15       -16             # Z4SS   -->  W2SS+  TAU-   ANUT        
      1.73534453E-02    2      1000022        23                       # Z4SS   -->  Z1SS   Z0                 
      7.34810237E-05    2      1000023        23                       # Z4SS   -->  Z2SS   Z0                 
      3.43150813E-10    3      1000022         2        -2             # Z4SS   -->  Z1SS   UP     UB          
      1.39247613E-09    3      1000022         1        -1             # Z4SS   -->  Z1SS   DN     DB          
      1.39247613E-09    3      1000022         3        -3             # Z4SS   -->  Z1SS   ST     SB          
      3.43150730E-10    3      1000022         4        -4             # Z4SS   -->  Z1SS   CH     CB          
      3.01785041E-09    3      1000022         5        -5             # Z4SS   -->  Z1SS   BT     BB          
      1.49490553E-09    3      1000022        11       -11             # Z4SS   -->  Z1SS   E-     E+          
      1.49490553E-09    3      1000022        13       -13             # Z4SS   -->  Z1SS   MU-    MU+         
      1.69040615E-09    3      1000022        15       -15             # Z4SS   -->  Z1SS   TAU-   TAU+        
      3.12320370E-09    3      1000022        12       -12             # Z4SS   -->  Z1SS   NUE    ANUE        
      3.12320370E-09    3      1000022        14       -14             # Z4SS   -->  Z1SS   NUM    ANUM        
      3.18055182E-09    3      1000022        16       -16             # Z4SS   -->  Z1SS   NUT    ANUT        
      9.95287186E-10    3      1000023         2        -2             # Z4SS   -->  Z2SS   UP     UB          
      8.78851159E-10    3      1000023         1        -1             # Z4SS   -->  Z2SS   DN     DB          
      8.78851159E-10    3      1000023         3        -3             # Z4SS   -->  Z2SS   ST     SB          
      9.95286853E-10    3      1000023         4        -4             # Z4SS   -->  Z2SS   CH     CB          
      1.99864059E-09    3      1000023         5        -5             # Z4SS   -->  Z2SS   BT     BB          
      3.81024101E-10    3      1000023        11       -11             # Z4SS   -->  Z2SS   E-     E+          
      3.81024101E-10    3      1000023        13       -13             # Z4SS   -->  Z2SS   MU-    MU+         
      3.93532484E-10    3      1000023        15       -15             # Z4SS   -->  Z2SS   TAU-   TAU+        
      2.61041078E-10    3      1000023        12       -12             # Z4SS   -->  Z2SS   NUE    ANUE        
      2.61041078E-10    3      1000023        14       -14             # Z4SS   -->  Z2SS   NUM    ANUM        
      2.65844818E-10    3      1000023        16       -16             # Z4SS   -->  Z2SS   NUT    ANUT        
      1.00376048E-04    3      1000025         2        -2             # Z4SS   -->  Z3SS   UP     UB          
      1.29456923E-04    3      1000025         1        -1             # Z4SS   -->  Z3SS   DN     DB          
      1.29456923E-04    3      1000025         3        -3             # Z4SS   -->  Z3SS   ST     SB          
      1.00376048E-04    3      1000025         4        -4             # Z4SS   -->  Z3SS   CH     CB          
      1.22668585E-04    3      1000025         5        -5             # Z4SS   -->  Z3SS   BT     BB          
      2.93659486E-05    3      1000025        11       -11             # Z4SS   -->  Z3SS   E-     E+          
      2.93659486E-05    3      1000025        13       -13             # Z4SS   -->  Z3SS   MU-    MU+         
      2.90956723E-05    3      1000025        15       -15             # Z4SS   -->  Z3SS   TAU-   TAU+        
      5.84197296E-05    3      1000025        12       -12             # Z4SS   -->  Z3SS   NUE    ANUE        
      5.84197296E-05    3      1000025        14       -14             # Z4SS   -->  Z3SS   NUM    ANUM        
      5.84196678E-05    3      1000025        16       -16             # Z4SS   -->  Z3SS   NUT    ANUT        
      7.69493058E-02    2      1000022        25                       # Z4SS   -->  Z1SS   HL0                
      1.34572422E-03    2      1000023        25                       # Z4SS   -->  Z2SS   HL0                
#         PDG         Width
DECAY   1000024  2.98279449E-02   # W1SS+ decays
#          BR          NDA       ID1       ID2       ID3       ID4
      9.60875823E-10    3      1000022         2        -1             # W1SS+  -->  Z1SS   UP     DB          
      9.60875712E-10    3      1000022         4        -3             # W1SS+  -->  Z1SS   CH     SB          
      3.19114801E-09    3      1000022       -11        12             # W1SS+  -->  Z1SS   E+     NUE         
      3.19114801E-09    3      1000022       -13        14             # W1SS+  -->  Z1SS   MU+    NUM         
      3.63742259E-09    3      1000022       -15        16             # W1SS+  -->  Z1SS   TAU+   NUT         
      1.00000000E+00    2      1000022        24                       # W1SS+  -->  Z1SS   W+                 
      5.24550903E-10    3      1000023         2        -1             # W1SS+  -->  Z2SS   UP     DB          
      1.74850523E-10    3      1000023       -11        12             # W1SS+  -->  Z2SS   E+     NUE         
      1.74850523E-10    3      1000023       -13        14             # W1SS+  -->  Z2SS   MU+    NUM         
#         PDG         Width
DECAY   1000037  3.97773683E-01   # W2SS+ decays
#          BR          NDA       ID1       ID2       ID3       ID4
      2.29736674E-09    3      1000022         2        -1             # W2SS+  -->  Z1SS   UP     DB          
      2.29736652E-09    3      1000022         4        -3             # W2SS+  -->  Z1SS   CH     SB          
      6.06836092E-09    3      1000022       -11        12             # W2SS+  -->  Z1SS   E+     NUE         
      6.06836092E-09    3      1000022       -13        14             # W2SS+  -->  Z1SS   MU+    NUM         
      6.50147136E-09    3      1000022       -15        16             # W2SS+  -->  Z1SS   TAU+   NUT         
      9.13054794E-02    2      1000022        24                       # W2SS+  -->  Z1SS   W+                 
      8.86857809E-10    3      1000023         2        -1             # W2SS+  -->  Z2SS   UP     DB          
      8.86857809E-10    3      1000023         4        -3             # W2SS+  -->  Z2SS   CH     SB          
      3.79829307E-10    3      1000023       -11        12             # W2SS+  -->  Z2SS   E+     NUE         
      3.79829307E-10    3      1000023       -13        14             # W2SS+  -->  Z2SS   MU+    NUM         
      4.52872434E-10    3      1000023       -15        16             # W2SS+  -->  Z2SS   TAU+   NUT         
      5.97143710E-01    2      1000023        24                       # W2SS+  -->  Z2SS   W+                 
      4.32745786E-04    3      1000025         2        -1             # W2SS+  -->  Z3SS   UP     DB          
      4.32745786E-04    3      1000025         4        -3             # W2SS+  -->  Z3SS   CH     SB          
      1.44243211E-04    3      1000025       -11        12             # W2SS+  -->  Z3SS   E+     NUE         
      1.44243211E-04    3      1000025       -13        14             # W2SS+  -->  Z3SS   MU+    NUM         
      1.44245016E-04    3      1000025       -15        16             # W2SS+  -->  Z3SS   TAU+   NUT         
      3.10252637E-01    2      1000024        23                       # W2SS+  -->  W1SS+  Z0                 
      1.66456893E-09    3      1000024         1        -1             # W2SS+  -->  W1SS+  DN     DB          
      1.66456826E-09    3      1000024         3        -3             # W2SS+  -->  W1SS+  ST     SB          
      1.67356684E-09    3      1000024         2        -2             # W2SS+  -->  W1SS+  UP     UB          
      1.67356684E-09    3      1000024         4        -4             # W2SS+  -->  W1SS+  CH     CB          
      5.84852833E-10    3      1000024        12       -12             # W2SS+  -->  W1SS+  NUE    ANUE        
      5.84852833E-10    3      1000024        14       -14             # W2SS+  -->  W1SS+  NUM    ANUM        
      6.08612327E-10    3      1000024        16       -16             # W2SS+  -->  W1SS+  NUT    ANUT        
      5.80841486E-10    3      1000024        11       -11             # W2SS+  -->  W1SS+  E-     E+          
      5.80841486E-10    3      1000024        13       -13             # W2SS+  -->  W1SS+  MU-    MU+         
      5.91529437E-10    3      1000024        15       -15             # W2SS+  -->  W1SS+  TAU-   TAU+        
#         PDG         Width
DECAY        25  4.25330410E-03   # HL0   decays
#          BR          NDA       ID1       ID2       ID3       ID4
      4.72126915E-09    2           11       -11                       # HL0    -->  E-     E+                 
      1.99339542E-04    2           13       -13                       # HL0    -->  MU-    MU+                
      5.70161492E-02    2           15       -15                       # HL0    -->  TAU-   TAU+               
      5.92359947E-06    2            1        -1                       # HL0    -->  DN     DB                 
      2.39343126E-03    2            3        -3                       # HL0    -->  ST     SB                 
      7.82009661E-01    2            5        -5                       # HL0    -->  BT     BB                 
      1.88834281E-06    2            2        -2                       # HL0    -->  UP     UB                 
      3.54201570E-02    2            4        -4                       # HL0    -->  CH     CB                 
      1.94434205E-03    2           22        22                       # HL0    -->  GM     GM                 
      4.03263532E-02    2           21        21                       # HL0    -->  GL     GL                 
      4.12914529E-03    3           24        11       -12             # HL0    -->  W+     E-     ANUE        
      4.12914529E-03    3           24        13       -14             # HL0    -->  W+     MU-    ANUM        
      4.12914529E-03    3           24        15       -16             # HL0    -->  W+     TAU-   ANUT        
      1.23874359E-02    3           24        -2         1             # HL0    -->  W+     UB     DN          
      1.23874359E-02    3           24        -4         3             # HL0    -->  W+     CB     ST          
      4.12914529E-03    3          -24       -11        12             # HL0    -->  W-     E+     NUE         
      4.12914529E-03    3          -24       -13        14             # HL0    -->  W-     MU+    NUM         
      4.12914529E-03    3          -24       -15        16             # HL0    -->  W-     TAU+   NUT         
      1.23874359E-02    3          -24         2        -1             # HL0    -->  W-     UP     DB          
      1.23874359E-02    3          -24         4        -3             # HL0    -->  W-     CH     SB          
      4.34824819E-04    3           23        12       -12             # HL0    -->  Z0     NUE    ANUE        
      4.34824819E-04    3           23        14       -14             # HL0    -->  Z0     NUM    ANUM        
      4.34824819E-04    3           23        16       -16             # HL0    -->  Z0     NUT    ANUT        
      2.18842950E-04    3           23        11       -11             # HL0    -->  Z0     E-     E+          
      2.18842950E-04    3           23        13       -13             # HL0    -->  Z0     MU-    MU+         
      2.18842950E-04    3           23        15       -15             # HL0    -->  Z0     TAU-   TAU+        
      7.49737432E-04    3           23         2        -2             # HL0    -->  Z0     UP     UB          
      7.49737432E-04    3           23         4        -4             # HL0    -->  Z0     CH     CB          
      9.65846470E-04    3           23         1        -1             # HL0    -->  Z0     DN     DB          
      9.65846470E-04    3           23         3        -3             # HL0    -->  Z0     ST     SB          
      9.65846470E-04    3           23         5        -5             # HL0    -->  Z0     BT     BB          
#         PDG         Width
DECAY        35  5.24767532E+01   # HH0   decays
#          BR          NDA       ID1       ID2       ID3       ID4
      1.11620935E-09    2           11       -11                       # HH0    -->  E-     E+                 
      4.71283711E-05    2           13       -13                       # HH0    -->  MU-    MU+                
      1.34982662E-02    2           15       -15                       # HH0    -->  TAU-   TAU+               
      1.35497987E-06    2            1        -1                       # HH0    -->  DN     DB                 
      5.47480478E-04    2            3        -3                       # HH0    -->  ST     SB                 
      7.00250193E-02    2            5        -5                       # HH0    -->  BT     BB                 
      4.35160762E-11    2            2        -2                       # HH0    -->  UP     UB                 
      5.34526464E-07    2            4        -4                       # HH0    -->  CH     CB                 
      2.78700590E-02    2            6        -6                       # HH0    -->  TP     TB                 
      7.80289042E-08    2           22        22                       # HH0    -->  GM     GM                 
      4.82699079E-06    2           21        21                       # HH0    -->  GL     GL                 
      8.54693280E-06    2           24       -24                       # HH0    -->  W+     W-                 
      4.38295092E-06    2           23        23                       # HH0    -->  Z0     Z0                 
      8.35587550E-03    2      1000022   1000022                       # HH0    -->  Z1SS   Z1SS               
      4.32347097E-02    2      1000022   1000023                       # HH0    -->  Z1SS   Z2SS               
      5.28504476E-02    2      1000022   1000025                       # HH0    -->  Z1SS   Z3SS               
      1.78419263E-03    2      1000022   1000035                       # HH0    -->  Z1SS   Z4SS               
      3.80424596E-02    2      1000023   1000023                       # HH0    -->  Z2SS   Z2SS               
      4.01524901E-02    2      1000023   1000025                       # HH0    -->  Z2SS   Z3SS               
      4.89535974E-03    2      1000023   1000035                       # HH0    -->  Z2SS   Z4SS               
      3.66980163E-03    2      1000025   1000025                       # HH0    -->  Z3SS   Z3SS               
      1.08967468E-01    2      1000025   1000035                       # HH0    -->  Z3SS   Z4SS               
      4.84544449E-02    2      1000035   1000035                       # HH0    -->  Z4SS   Z4SS               
      1.50028050E-01    2      1000024  -1000024                       # HH0    -->  W1SS+  W1SS-              
      6.92092776E-02    2      1000037  -1000037                       # HH0    -->  W2SS+  W2SS-              
      1.59158081E-01    2      1000024  -1000037                       # HH0    -->  W1SS+  W2SS-              
      1.59158081E-01    2     -1000024   1000037                       # HH0    -->  W1SS-  W2SS+              
      3.15196594E-05    2           25        25                       # HH0    -->  HL0    HL0                
#         PDG         Width
DECAY        36  5.21225815E+01   # HA0   decays
#          BR          NDA       ID1       ID2       ID3       ID4
      1.11647225E-09    2           11       -11                       # HA0    -->  E-     E+                 
      4.71394742E-05    2           13       -13                       # HA0    -->  MU-    MU+                
      1.35014607E-02    2           15       -15                       # HA0    -->  TAU-   TAU+               
      1.35535822E-06    2            1        -1                       # HA0    -->  DN     DB                 
      5.47633215E-04    2            3        -3                       # HA0    -->  ST     SB                 
      7.00447857E-02    2            5        -5                       # HA0    -->  BT     BB                 
      4.33671328E-11    2            2        -2                       # HA0    -->  UP     UB                 
      5.33063428E-07    2            4        -4                       # HA0    -->  CH     CB                 
      2.79994980E-02    2            6        -6                       # HA0    -->  TP     TB                 
      3.60182753E-07    2           22        22                       # HA0    -->  GM     GM                 
      7.75390708E-06    2           21        21                       # HA0    -->  GL     GL                 
      1.05823632E-02    2      1000022   1000022                       # HA0    -->  Z1SS   Z1SS               
      5.99759445E-02    2      1000022   1000023                       # HA0    -->  Z1SS   Z2SS               
      3.31954062E-02    2      1000022   1000025                       # HA0    -->  Z1SS   Z3SS               
      4.32852656E-03    2      1000022   1000035                       # HA0    -->  Z1SS   Z4SS               
      5.50758168E-02    2      1000023   1000023                       # HA0    -->  Z2SS   Z2SS               
      2.28404086E-02    2      1000023   1000025                       # HA0    -->  Z2SS   Z3SS               
      5.75738819E-03    2      1000023   1000035                       # HA0    -->  Z2SS   Z4SS               
      2.51208269E-03    2      1000025   1000025                       # HA0    -->  Z3SS   Z3SS               
      7.48238415E-02    2      1000025   1000035                       # HA0    -->  Z3SS   Z4SS               
      8.12579915E-02    2      1000035   1000035                       # HA0    -->  Z4SS   Z4SS               
      2.06273943E-01    2      1000024  -1000024                       # HA0    -->  W1SS+  W1SS-              
      1.24784015E-01    2      1000037  -1000037                       # HA0    -->  W2SS+  W2SS-              
      1.03216581E-01    2      1000024  -1000037                       # HA0    -->  W1SS+  W2SS-              
      1.03216581E-01    2     -1000024   1000037                       # HA0    -->  W1SS-  W2SS+              
      8.52772155E-06    2           25        23                       # HA0    -->  HL0    Z0                 
#         PDG         Width
DECAY        37  5.20707436E+01   # H+    decays
#          BR          NDA       ID1       ID2       ID3       ID4
      1.12527354E-09    2           12       -11                       # H+     -->  NUE    E+                 
      4.75110755E-05    2           14       -13                       # H+     -->  NUM    MU+                
      1.36078941E-02    2           16       -15                       # H+     -->  NUT    TAU+               
      1.26713189E-06    2            2        -1                       # H+     -->  UP     DB                 
      5.12466882E-04    2            4        -3                       # H+     -->  CH     SB                 
      9.12215635E-02    2            6        -5                       # H+     -->  TP     BB                 
      8.15972686E-02    2      1000024   1000022                       # H+     -->  W1SS+  Z1SS               
      5.35134925E-03    2      1000024   1000023                       # H+     -->  W1SS+  Z2SS               
      1.25728235E-01    2      1000024   1000025                       # H+     -->  W1SS+  Z3SS               
      2.23218203E-01    2      1000024   1000035                       # H+     -->  W1SS+  Z4SS               
      1.35261833E-03    2      1000037   1000022                       # H+     -->  W2SS+  Z1SS               
      3.19578409E-01    2      1000037   1000023                       # H+     -->  W2SS+  Z2SS               
      1.36962220E-01    2      1000037   1000025                       # H+     -->  W2SS+  Z3SS               
      8.12401820E-04    2      1000037   1000035                       # H+     -->  W2SS+  Z4SS               
      8.60479304E-06    2           25        24                       # H+     -->  HL0    W+                 
