BLOCK AD 
      3 3 4.000000e+03 

BLOCK AE 
      3 3 4.000000e+03 

BLOCK ALPHA 
       -1.057566e-01 

BLOCK AU 
      3 3 -1.186000e+03 

BLOCK MASS 
       -2000016 0.000000e+00 
       -2000015 2.001402e+03 
       -2000014 0.000000e+00 
       -2000013 2.000473e+03 
       -2000012 0.000000e+00 
       -2000011 2.000473e+03 
       -2000006 7.415964e+02 
       -2000005 2.000155e+03 
       -2000004 1.999685e+03 
       -2000003 2.000158e+03 
       -2000002 1.999685e+03 
       -2000001 2.000158e+03 
       -1000037 2.003325e+03 
       -1000024 1.950353e+02 
       -1000016 1.998981e+03 
       -1000015 1.999617e+03 
       -1000014 1.998981e+03 
       -1000013 2.000546e+03 
       -1000012 1.998981e+03 
       -1000011 2.000546e+03 
       -1000006 4.394022e+02 
       -1000005 5.959186e+02 
       -1000004 1.999297e+03 
       -1000003 2.000861e+03 
       -1000002 1.999296e+03 
       -1000001 2.000861e+03 
       -37 6.027734e+02 
       -6 1.725000e+02 
      6 1.725000e+02 
      25 1.177052e+02 
      35 5.971802e+02 
      36 5.930000e+02 
      37 6.027734e+02 
      1000001 2.000861e+03 
      1000002 1.999296e+03 
      1000003 2.000861e+03 
      1000004 1.999297e+03 
      1000005 5.959186e+02 
      1000006 4.394022e+02 
      1000011 2.000546e+03 
      1000012 1.998981e+03 
      1000013 2.000546e+03 
      1000014 1.998981e+03 
      1000015 1.999617e+03 
      1000016 1.998981e+03 
      1000021 1.900000e+03 
      1000022 1.932212e+02 
      1000023 -1.975458e+02 
      1000024 1.950353e+02 
      1000025 2.000000e+03 
      1000035 2.004324e+03 
      1000037 2.003325e+03 
      1000039 0.000000e+00 
      2000001 2.000158e+03 
      2000002 1.999685e+03 
      2000003 2.000158e+03 
      2000004 1.999685e+03 
      2000005 2.000155e+03 
      2000006 7.415964e+02 
      2000011 2.000473e+03 
      2000012 0.000000e+00 
      2000013 2.000473e+03 
      2000014 0.000000e+00 
      2000015 2.001402e+03 
      2000016 0.000000e+00 

BLOCK MINPAR 
      3 1.000000e+01 
      4 1.960000e+02 

BLOCK NMIX 
      1 1 1.882938e-02 
      1 2 -3.425889e-02 
      1 3 7.106813e-01 
      1 4 -7.024271e-01 
      2 1 -1.280720e-02 
      2 2 2.330175e-02 
      2 3 7.034554e-01 
      2 4 7.102418e-01 
      3 1 -8.763565e-01 
      3 2 -4.816631e-01 
      3 3 -3.000000e-08 
      3 4 2.000000e-08 
      4 1 4.811245e-01 
      4 2 -8.753766e-01 
      4 3 -9.087860e-03 
      4 4 4.639650e-02 

BLOCK SBOTMIX 
      1 1 9.999952e-01 
      1 2 3.098325e-03 
      2 1 -3.098325e-03 
      2 2 9.999952e-01 

BLOCK STAUMIX 
      1 1 6.919628e-01 
      1 2 -7.219331e-01 
      2 1 7.219331e-01 
      2 2 6.919628e-01 

BLOCK STOPMIX 
      1 1 7.086435e-01 
      1 2 7.055667e-01 
      2 1 -7.055667e-01 
      2 2 7.086435e-01 

BLOCK UMIX 
      1 1 -1.127425e-02 
      1 2 9.999365e-01 
      2 1 -9.999365e-01 
      2 2 -1.127425e-02 

BLOCK VMIX 
      1 1 -5.759094e-02 
      1 2 9.983403e-01 
      2 1 -9.983403e-01 
      2 2 -5.759094e-02 

DECAY -2000016 6.582118e-55 

DECAY -2000015 6.365685e-01 
   4.086378e-01 2 1000022 -15 
   3.428700e-01 2 1000024 -16 
   2.484922e-01 2 1000023 -15 

DECAY -2000014 6.582118e-55 

DECAY -2000013 3.740265e-01 
   9.861587e-01 2 -13 1000039 
   9.465851e-03 2 1000022 -13 
   4.375477e-03 2 1000023 -13 

DECAY -2000012 6.582118e-55 

DECAY -2000011 3.740265e-01 
   9.861586e-01 2 -11 1000039 
   9.465850e-03 2 1000022 -11 
   4.375477e-03 2 1000023 -11 

DECAY -2000006 2.353783e+01 
   3.352206e-01 2 23 -1000006 
   1.879038e-01 2 1000022 -6 
   1.874840e-01 2 -1000024 -5 
   1.454562e-01 2 1000023 -6 
   1.439356e-01 2 -24 -1000005 

DECAY -2000005 2.436468e+01 
   2.506358e-01 2 37 -1000006 
   2.168886e-01 2 36 -1000005 
   2.163286e-01 2 35 -1000005 
   1.815236e-01 2 37 -2000006 
   4.479320e-02 2 1000021 -5 
   4.303871e-02 2 1000024 -6 
   2.206161e-02 2 1000022 -5 
   2.162803e-02 2 1000023 -5 
   8.832786e-04 2 24 -1000006 
   7.878972e-04 2 25 -1000005 
   7.800529e-04 2 23 -1000005 
   6.505810e-04 2 24 -2000006 

DECAY -2000004 1.085639e+00 
   9.978815e-01 2 1000021 -4 
   1.448817e-03 2 1000022 -4 
   6.696978e-04 2 1000023 -4 

DECAY -2000003 1.093775e+00 
   9.994741e-01 2 1000021 -3 
   3.595989e-04 2 1000022 -3 
   1.662202e-04 2 1000023 -3 

DECAY -2000002 1.085746e+00 
   9.978817e-01 2 1000021 -2 
   1.448688e-03 2 1000022 -2 
   6.696380e-04 2 1000023 -2 

DECAY -2000001 1.093775e+00 
   9.994741e-01 2 1000021 -1 
   3.595989e-04 2 1000022 -1 
   1.662202e-04 2 1000023 -1 

DECAY -1000037 7.196088e+01 
   2.849869e-01 2 1000005 -6 
   1.503324e-01 2 -2000006 5 
   1.363800e-01 2 -1000006 5 
   6.141747e-02 2 -1000024 23 
   6.125074e-02 2 1000023 -24 
   6.030569e-02 2 -1000024 25 
   5.999028e-02 2 1000022 -24 
   4.684999e-02 2 1000022 -37 
   4.647528e-02 2 -1000024 36 
   4.622186e-02 2 -1000024 35 
   4.578960e-02 2 1000023 -37 

DECAY -1000024 1.682933e-11 
   4.999964e-01 3 1000022 -2 1 
   1.666722e-01 3 1000022 15 -16 
   1.666657e-01 3 1000022 11 -12 
   1.666657e-01 3 1000022 13 -14 

DECAY -1000016 8.392669e-01 
   5.335168e-01 2 -1000024 -15 
   4.378541e-01 2 -16 1000039 
   1.957900e-02 2 1000022 -16 
   9.050059e-03 2 1000023 -16 

DECAY -1000015 9.257680e-01 
   3.975759e-01 2 -15 1000039 
   2.535850e-01 2 1000023 -15 
   1.914374e-01 2 1000024 -16 
   1.574017e-01 2 1000022 -15 

DECAY -1000014 4.462756e-01 
   8.234540e-01 2 -14 1000039 
   1.227045e-01 2 -1000024 -13 
   3.682141e-02 2 1000022 -14 
   1.702007e-02 2 1000023 -14 

DECAY -1000013 3.779351e-01 
   9.761625e-01 2 -13 1000039 
   1.250165e-02 2 1000022 -13 
   5.778637e-03 2 1000023 -13 
   5.557305e-03 2 1000024 -14 

DECAY -1000012 4.462756e-01 
   8.234540e-01 2 -12 1000039 
   1.227045e-01 2 -1000024 -11 
   3.682141e-02 2 1000022 -12 
   1.702007e-02 2 1000023 -12 

DECAY -1000011 3.779351e-01 
   9.761624e-01 2 -11 1000039 
   1.250165e-02 2 1000022 -11 
   5.778637e-03 2 1000023 -11 
   5.557305e-03 2 1000024 -12 

DECAY -1000006 4.575682e+00 
   4.968702e-01 2 -1000024 -5 
   3.830251e-01 2 1000023 -6 
   1.201047e-01 2 1000022 -6 

DECAY -1000005 9.792924e+00 
   5.534782e-01 2 1000024 -6 
   4.198477e-01 2 24 -1000006 
   1.362826e-02 2 1000022 -5 
   1.304585e-02 2 1000023 -5 

DECAY -1000004 1.141579e+00 
   9.419836e-01 2 1000021 -4 
   4.797483e-02 2 -1000024 -3 
   6.867370e-03 2 1000022 -4 
   3.174312e-03 2 1000023 -4 

DECAY -1000003 1.127094e+00 
   9.828878e-01 2 1000021 -3 
   1.042826e-02 2 1000022 -3 
   4.820286e-03 2 1000023 -3 
   1.863729e-03 2 1000024 -4 

DECAY -1000002 1.141678e+00 
   9.419884e-01 2 1000021 -2 
   4.797088e-02 2 -1000024 -1 
   6.866811e-03 2 1000022 -2 
   3.174054e-03 2 1000023 -2 

DECAY -1000001 1.127094e+00 
   9.828878e-01 2 1000021 -1 
   1.042826e-02 2 1000022 -1 
   4.820286e-03 2 1000023 -1 
   1.863731e-03 2 1000024 -2 

DECAY -37 1.400123e+00 
   9.052505e-01 2 -6 5 
   8.847316e-02 2 -16 15 
   3.332592e-03 2 -4 3 
   1.580075e-03 2 25 -24 
   8.945456e-04 2 -1000024 1000023 
   3.089035e-04 2 -14 13 
   1.602789e-04 2 -1000024 1000022 

DECAY -6 1.146810e+00 
   3.333333e-01 3 -2 1 -5 
   3.333333e-01 3 -4 3 -5 
   1.111111e-01 3 -12 11 -5 
   1.111111e-01 3 -14 13 -5 
   1.111111e-01 3 -16 15 -5 

DECAY 6 1.146810e+00 
   3.333333e-01 3 2 -1 5 
   3.333333e-01 3 4 -3 5 
   1.111111e-01 3 12 -11 5 
   1.111111e-01 3 14 -13 5 
   1.111111e-01 3 16 -15 5 

DECAY 25 4.685115e-03 
   7.959093e-01 2 5 -5 
   5.802741e-02 2 15 -15 
   3.661706e-02 2 21 21 
   3.211088e-02 2 4 -4 
   1.120538e-02 3 24 -2 1 
   1.120538e-02 3 24 -4 3 
   1.120538e-02 3 -24 2 -1 
   1.120538e-02 3 -24 4 -3 
   3.735127e-03 3 24 11 -12 
   3.735127e-03 3 24 13 -14 
   3.735127e-03 3 24 15 -16 
   3.735127e-03 3 -24 -11 12 
   3.735127e-03 3 -24 -13 14 
   3.735127e-03 3 -24 -15 16 
   2.435892e-03 2 3 -3 
   1.720678e-03 2 22 22 
   8.725433e-04 3 23 1 -1 
   8.725433e-04 3 23 3 -3 
   8.725433e-04 3 23 5 -5 
   6.773108e-04 3 23 2 -2 
   6.773108e-04 3 23 4 -4 
   3.928196e-04 3 23 12 -12 
   3.928196e-04 3 23 14 -14 
   3.928196e-04 3 23 16 -16 
   2.028752e-04 2 13 -13 
   1.977022e-04 3 23 11 -11 
   1.977022e-04 3 23 13 -13 
   1.977022e-04 3 23 15 -15 

DECAY 35 1.689846e+00 
   7.834647e-01 2 5 -5 
   1.278746e-01 2 6 -6 
   7.253123e-02 2 15 -15 
   4.614717e-03 2 25 25 
   4.061723e-03 2 1000024 -1000024 
   2.982423e-03 2 3 -3 
   1.363379e-03 2 24 -24 
   1.049737e-03 2 1000022 1000022 
   6.927048e-04 2 1000023 1000023 
   6.785020e-04 2 23 23 
   2.652438e-04 2 1000022 1000023 
   2.532513e-04 2 13 -13 
   1.677902e-04 2 21 21 

DECAY 36 1.741117e+00 
   7.568254e-01 2 5 -5 
   1.579097e-01 2 6 -6 
   6.999207e-02 2 15 -15 
   7.371017e-03 2 1000024 -1000024 
   2.878100e-03 2 3 -3 
   2.613052e-03 2 1000022 1000022 
   1.196161e-03 2 25 23 
   7.794882e-04 2 1000023 1000023 
   2.443770e-04 2 13 -13 
   1.782680e-04 2 21 21 
   1.232720e-05 2 1000022 1000023 

DECAY 37 1.400123e+00 
   9.052505e-01 2 6 -5 
   8.847316e-02 2 16 -15 
   3.332592e-03 2 4 -3 
   1.580075e-03 2 25 24 
   8.945456e-04 2 1000024 1000023 
   3.089035e-04 2 14 -13 
   1.602789e-04 2 1000024 1000022 

DECAY 1000001 1.127094e+00 
   9.828878e-01 2 1000021 1 
   1.042826e-02 2 1000022 1 
   4.820286e-03 2 1000023 1 
   1.863731e-03 2 -1000024 2 

DECAY 1000002 1.141678e+00 
   9.419884e-01 2 1000021 2 
   4.797088e-02 2 1000024 1 
   6.866811e-03 2 1000022 2 
   3.174054e-03 2 1000023 2 

DECAY 1000003 1.127094e+00 
   9.828878e-01 2 1000021 3 
   1.042826e-02 2 1000022 3 
   4.820286e-03 2 1000023 3 
   1.863729e-03 2 -1000024 4 

DECAY 1000004 1.141579e+00 
   9.419836e-01 2 1000021 4 
   4.797483e-02 2 1000024 3 
   6.867370e-03 2 1000022 4 
   3.174312e-03 2 1000023 4 

DECAY 1000005 9.792924e+00 
   5.534782e-01 2 -1000024 6 
   4.198477e-01 2 -24 1000006 
   1.362826e-02 2 1000022 5 
   1.304585e-02 2 1000023 5 

DECAY 1000006 4.575682e+00 
   4.968702e-01 2 1000024 5 
   3.830251e-01 2 1000023 6 
   1.201047e-01 2 1000022 6 

DECAY 1000011 3.779351e-01 
   9.761624e-01 2 11 1000039 
   1.250165e-02 2 1000022 11 
   5.778637e-03 2 1000023 11 
   5.557305e-03 2 -1000024 12 

DECAY 1000012 4.462756e-01 
   8.234540e-01 2 12 1000039 
   1.227045e-01 2 1000024 11 
   3.682141e-02 2 1000022 12 
   1.702007e-02 2 1000023 12 

DECAY 1000013 3.779351e-01 
   9.761625e-01 2 13 1000039 
   1.250165e-02 2 1000022 13 
   5.778637e-03 2 1000023 13 
   5.557305e-03 2 -1000024 14 

DECAY 1000014 4.462756e-01 
   8.234540e-01 2 14 1000039 
   1.227045e-01 2 1000024 13 
   3.682141e-02 2 1000022 14 
   1.702007e-02 2 1000023 14 

DECAY 1000015 9.257680e-01 
   3.975759e-01 2 15 1000039 
   2.535850e-01 2 1000023 15 
   1.914374e-01 2 -1000024 16 
   1.574017e-01 2 1000022 15 

DECAY 1000016 8.392669e-01 
   5.335168e-01 2 1000024 15 
   4.378541e-01 2 16 1000039 
   1.957900e-02 2 1000022 16 
   9.050059e-03 2 1000023 16 

DECAY 1000021 9.902538e+01 
   1.798586e-01 2 -2000006 6 
   1.798586e-01 2 2000006 -6 
   1.684888e-01 2 -1000005 5 
   1.684888e-01 2 1000005 -5 
   1.502131e-01 2 -1000006 6 
   1.502131e-01 2 1000006 -6 
   2.878891e-03 2 1000039 21 

DECAY 1000022 4.313880e-07 
   7.814420e-01 2 1000039 23 
   2.185580e-01 2 1000039 25 

DECAY 1000023 4.544093e-07 
   5.947865e-01 2 1000039 23 
   4.017888e-01 2 1000039 25 
   5.262967e-04 3 1000022 1 -1 
   5.262967e-04 3 1000022 3 -3 
   4.081406e-04 3 1000022 2 -2 
   4.081406e-04 3 1000022 4 -4 
   2.959078e-04 2 1000022 22 
   2.375507e-04 3 1000022 12 -12 
   2.375507e-04 3 1000022 14 -14 
   2.375507e-04 3 1000022 16 -16 
   1.193903e-04 3 1000022 11 -11 
   1.193903e-04 3 1000022 13 -13 
   9.253282e-05 3 -1000024 2 -1 
   9.253282e-05 3 1000024 1 -2 
   3.084427e-05 3 -1000024 12 -11 
   3.084427e-05 3 -1000024 14 -13 
   3.084427e-05 3 1000024 11 -12 
   3.084427e-05 3 1000024 13 -14 

DECAY 1000024 1.682933e-11 
   4.999964e-01 3 1000022 2 -1 
   1.666722e-01 3 1000022 -15 16 
   1.666657e-01 3 1000022 -11 12 
   1.666657e-01 3 1000022 -13 14 

DECAY 1000025 3.378390e+01 
   1.370332e-01 2 2000006 -6 
   1.370332e-01 2 -2000006 6 
   1.196049e-01 2 1000024 -24 
   1.196049e-01 2 -1000024 24 
   1.144299e-01 2 1000006 -6 
   1.144299e-01 2 -1000006 6 
   9.134160e-02 2 1000024 -37 
   9.134160e-02 2 -1000024 37 
   3.200066e-02 2 1000005 -5 
   3.200066e-02 2 -1000005 5 
   1.090504e-02 2 1000039 22 
   2.744410e-04 3 1000039 11 -11 

DECAY 1000035 6.051410e+01 
   1.613406e-01 2 1000005 -5 
   1.613406e-01 2 -1000005 5 
   6.587351e-02 2 1000023 23 
   6.381837e-02 2 1000022 25 
   6.221469e-02 2 2000006 -6 
   6.221469e-02 2 -2000006 6 
   5.987356e-02 2 1000006 -6 
   5.987356e-02 2 -1000006 6 
   3.629762e-02 2 1000022 35 
   3.620702e-02 2 1000023 36 
   3.588240e-02 2 1000022 36 
   3.538540e-02 2 1000023 35 
   2.916566e-02 2 1000022 23 
   2.877095e-02 2 1000023 25 
   2.723920e-02 2 1000024 -24 
   2.723920e-02 2 -1000024 24 
   2.058287e-02 2 1000024 -37 
   2.058287e-02 2 -1000024 37 
   6.096777e-03 2 1000039 23 

DECAY 1000037 7.196088e+01 
   2.849869e-01 2 -1000005 6 
   1.503324e-01 2 2000006 -5 
   1.363800e-01 2 1000006 -5 
   6.141747e-02 2 1000024 23 
   6.125074e-02 2 1000023 24 
   6.030569e-02 2 1000024 25 
   5.999028e-02 2 1000022 24 
   4.684999e-02 2 1000022 37 
   4.647528e-02 2 1000024 36 
   4.622186e-02 2 1000024 35 
   4.578960e-02 2 1000023 37 

DECAY 1000039 6.582118e-55 

DECAY 2000001 1.093775e+00 
   9.994741e-01 2 1000021 1 
   3.595989e-04 2 1000022 1 
   1.662202e-04 2 1000023 1 

DECAY 2000002 1.085746e+00 
   9.978817e-01 2 1000021 2 
   1.448688e-03 2 1000022 2 
   6.696380e-04 2 1000023 2 

DECAY 2000003 1.093775e+00 
   9.994741e-01 2 1000021 3 
   3.595989e-04 2 1000022 3 
   1.662202e-04 2 1000023 3 

DECAY 2000004 1.085639e+00 
   9.978815e-01 2 1000021 4 
   1.448817e-03 2 1000022 4 
   6.696978e-04 2 1000023 4 

DECAY 2000005 2.436468e+01 
   2.506358e-01 2 -37 1000006 
   2.168886e-01 2 36 1000005 
   2.163286e-01 2 35 1000005 
   1.815236e-01 2 -37 2000006 
   4.479320e-02 2 1000021 5 
   4.303871e-02 2 -1000024 6 
   2.206161e-02 2 1000022 5 
   2.162803e-02 2 1000023 5 
   8.832786e-04 2 -24 1000006 
   7.878972e-04 2 25 1000005 
   7.800529e-04 2 23 1000005 
   6.505810e-04 2 -24 2000006 

DECAY 2000006 2.353783e+01 
   3.352206e-01 2 23 1000006 
   1.879038e-01 2 1000022 6 
   1.874840e-01 2 1000024 5 
   1.454562e-01 2 1000023 6 
   1.439356e-01 2 24 1000005 

DECAY 2000011 3.740265e-01 
   9.861586e-01 2 11 1000039 
   9.465850e-03 2 1000022 11 
   4.375477e-03 2 1000023 11 

DECAY 2000012 6.582118e-55 

DECAY 2000013 3.740265e-01 
   9.861587e-01 2 13 1000039 
   9.465851e-03 2 1000022 13 
   4.375477e-03 2 1000023 13 

DECAY 2000014 6.582118e-55 

DECAY 2000015 6.365685e-01 
   4.086378e-01 2 1000022 15 
   3.428700e-01 2 -1000024 16 
   2.484922e-01 2 1000023 15 

DECAY 2000016 6.582118e-55 


BLOCK MSOFT

BLOCK HMIX
    1     196
