#  ISAJET SUSY parameters in SUSY Les Houches Accord 2 format
#  Created by ISALHA 2.0 Last revision: C. Balazs 21 Apr 2009
Block SPINFO   # Program information
     1   ISASUGRA from ISAJET          # Spectrum Calculator
     2   7.80   29-OCT-2009 12:50:36   # Version number
Block MODSEL   # Model selection
     1     1   # Minimal supergravity (mSUGRA) model               
Block SMINPUTS   # Standard Model inputs
     1     1.27835075E+02   # alpha_em^(-1)
     2     1.16570000E-05   # G_Fermi
     3     1.17200002E-01   # alpha_s(M_Z)
     4     9.11699982E+01   # m_{Z}(pole)
     5     4.19999981E+00   # m_{b}(m_{b})
     6     1.72500000E+02   # m_{top}(pole)
     7     1.77699995E+00   # m_{tau}(pole)
Block MINPAR   # SUSY breaking input parameters
     1     2.10000000E+03   # m_0
     2     4.20000000E+02   # m_{1/2}
     3     1.00000000E+01   # tan(beta)
     4     1.00000000E+00   # sign(mu)
     5     0.00000000E+00   # A_0
Block EXTPAR   # Non-universal SUSY breaking parameters
     0     1.99731806E+16   # Input scale
Block MASS   # Scalar and gaugino mass spectrum
#  PDG code   mass                 particle
        24     8.04229965E+01   #  W^+
        25     1.15384140E+02   #  h^0            
        35     2.15594019E+03   #  H^0            
        36     2.14176514E+03   #  A^0            
        37     2.15767358E+03   #  H^+            
   1000001     2.24922534E+03   #  dnl            
   1000002     2.24780127E+03   #  upl            
   1000003     2.24922534E+03   #  stl            
   1000004     2.24780176E+03   #  chl            
   1000005     1.87126196E+03   #  b1             
   1000006     1.38628552E+03   #  t1             
   1000011     2.11424976E+03   #  el-            
   1000012     2.11328052E+03   #  nuel           
   1000013     2.11424976E+03   #  mul-           
   1000014     2.11328052E+03   #  numl           
   1000015     2.08420776E+03   #  tau1           
   1000016     2.10388354E+03   #  nutl           
   1000021     1.08548547E+03   #  glss           
   1000022     1.76796005E+02   #  z1ss           
   1000023     3.31945190E+02   #  z2ss           
   1000024     3.33057037E+02   #  w1ss           
   1000025    -5.07211884E+02   #  z3ss           
   1000035     5.28087708E+02   #  z4ss           
   1000037     5.27148193E+02   #  w2ss           
   2000001     2.24434741E+03   #  dnr            
   2000002     2.24419946E+03   #  upr            
   2000003     2.24434741E+03   #  str            
   2000004     2.24419971E+03   #  chr            
   2000005     2.22172388E+03   #  b2             
   2000006     1.88213208E+03   #  t2             
   2000011     2.10376587E+03   #  er-            
   2000013     2.10376587E+03   #  mur-           
   2000015     2.10481689E+03   #  tau2           
Block ALPHA   # Effective Higgs mixing parameter
         -1.00115910E-01   # alpha
Block STOPMIX   # stop mixing matrix
  1  1     5.63014448E-02   # O_{11}
  1  2     9.98413801E-01   # O_{12}
  2  1    -9.98413801E-01   # O_{21}
  2  2     5.63014448E-02   # O_{22}
Block SBOTMIX   # sbottom mixing matrix
  1  1     9.99932647E-01   # O_{11}
  1  2     1.16057731E-02   # O_{12}
  2  1    -1.16057731E-02   # O_{21}
  2  2     9.99932647E-01   # O_{22}
Block STAUMIX   # stau mixing matrix
  1  1     1.38551310E-01   # O_{11}
  1  2     9.90355253E-01   # O_{12}
  2  1    -9.90355253E-01   # O_{21}
  2  2     1.38551310E-01   # O_{22}
Block NMIX   # neutralino mixing matrix
  1  1     9.93224859E-01   #
  1  2    -2.50952393E-02   #
  1  3     1.04139023E-01   #
  1  4    -4.50576097E-02   #
  2  1    -6.02853335E-02   #
  2  2    -9.43177700E-01   #
  2  3     2.64902294E-01   #
  2  4    -1.91331714E-01   #
  3  1     4.00463641E-02   #
  3  2    -5.59708886E-02   #
  3  3    -7.02086210E-01   #
  3  4    -7.08758652E-01   #
  4  1    -9.09222662E-02   #
  4  2     3.26577276E-01   #
  4  3     6.52730644E-01   #
  4  4    -6.77512407E-01   #
Block UMIX   # chargino U mixing matrix
  1  1    -9.29350674E-01   # U_{11}
  1  2     3.69198292E-01   # U_{12}
  2  1    -3.69198292E-01   # U_{21}
  2  2    -9.29350674E-01   # U_{22}
Block VMIX   # chargino V mixing matrix
  1  1    -9.64081466E-01   # V_{11}
  1  2     2.65606612E-01   # V_{12}
  2  1    -2.65606612E-01   # V_{21}
  2  2    -9.64081466E-01   # V_{22}
Block GAUGE Q=  1.58315173E+03   #
     1     3.57527137E-01   # g`
     2     6.52378678E-01   # g_2
     3     1.21936774E+00   # g_3
Block YU Q=  1.58315173E+03   #
  3  3     8.51587176E-01   # y_t
Block YD Q=  1.58315173E+03   #
  3  3     1.31231084E-01   # y_b
Block YE Q=  1.58315173E+03   #
  3  3     1.01815812E-01   # y_tau
Block HMIX Q=  1.58315173E+03   # Higgs mixing parameters
     1     4.96942474E+02   # mu(Q)
     2     1.00000000E+01   # tan(beta)(M_GUT)
     3     2.51490067E+02   # Higgs vev at Q
     4     4.58715800E+06   # m_A^2(Q)
Block MSOFT Q=  1.58315173E+03   # DRbar SUSY breaking parameters
     1     1.79550476E+02   # M_1(Q)          
     2     3.30424774E+02   # M_2(Q)          
     3     9.44200806E+02   # M_3(Q)          
    31     2.10701270E+03   # MeL(Q)          
    32     2.10701270E+03   # MmuL(Q)         
    33     2.09783862E+03   # MtauL(Q)        
    34     2.10126880E+03   # MeR(Q)          
    35     2.10126880E+03   # MmuR(Q)         
    36     2.08264990E+03   # MtauR(Q)        
    41     2.20280273E+03   # MqL1(Q)         
    42     2.20280273E+03   # MqL2(Q)         
    43     1.83300854E+03   # MqL3(Q)         
    44     2.19885864E+03   # MuR(Q)          
    45     2.19885864E+03   # McR(Q)          
    46     1.36735291E+03   # MtR(Q)          
    47     2.19857642E+03   # MdR(Q)          
    48     2.19857642E+03   # MsR(Q)          
    49     2.18513696E+03   # MbR(Q)          
Block AU Q=  1.58315173E+03   #
  1  1    -7.00136230E+02   # A_u
  2  2    -7.00136230E+02   # A_c
  3  3    -7.00136230E+02   # A_t
Block AD Q=  1.58315173E+03   #
  1  1    -1.03267212E+03   # A_d
  2  2    -1.03267212E+03   # A_s
  3  3    -1.03267212E+03   # A_b
Block AE Q=  1.58315173E+03   #
  1  1    -2.45353943E+02   # A_e
  2  2    -2.45353943E+02   # A_mu
  3  3    -2.45353943E+02   # A_tau
#  ISAJET decay tables in SUSY Les Houches accord format
#  Created by ISALHD. Last revision: C. Balazs, 2005 May 25
Block DCINFO                           # Program information
     1   ISASUGRA from ISAJET          # Spectrum Calculator
     2   7.80   29-OCT-2009 12:50:36   # Version number
#         PDG         Width
DECAY         6  1.14680779E+00   # TP    decays
#          BR          NDA       ID1       ID2       ID3       ID4
      3.33333343E-01    3            2        -1         5             # TP     -->  UP     DB     BT          
      3.33333343E-01    3            4        -3         5             # TP     -->  CH     SB     BT          
      1.11111112E-01    3          -11        12         5             # TP     -->  E+     NUE    BT          
      1.11111112E-01    3          -13        14         5             # TP     -->  MU+    NUM    BT          
      1.11111112E-01    3          -15        16         5             # TP     -->  TAU+   NUT    BT          
#         PDG         Width
DECAY   1000021  5.94100216E-03   # GLSS  decays
#          BR          NDA       ID1       ID2       ID3       ID4
      3.97306271E-02    3      1000024         1        -2             # GLSS   -->  W1SS+  DN     UB          
      3.97306271E-02    3     -1000024         2        -1             # GLSS   -->  W1SS-  UP     DB          
      3.97306085E-02    3      1000024         3        -4             # GLSS   -->  W1SS+  ST     CB          
      3.97306085E-02    3     -1000024         4        -3             # GLSS   -->  W1SS-  CH     SB          
      5.88045344E-02    3      1000024         5        -6             # GLSS   -->  W1SS+  BT     TB          
      5.88045344E-02    3     -1000024         6        -5             # GLSS   -->  W1SS-  TP     BB          
      1.78360695E-03    3      1000037         1        -2             # GLSS   -->  W2SS+  DN     UB          
      1.78360695E-03    3     -1000037         2        -1             # GLSS   -->  W2SS-  UP     DB          
      1.78360613E-03    3      1000037         3        -4             # GLSS   -->  W2SS+  ST     CB          
      1.78360613E-03    3     -1000037         4        -3             # GLSS   -->  W2SS-  CH     SB          
      1.25476420E-01    3      1000037         5        -6             # GLSS   -->  W2SS+  BT     TB          
      1.25476420E-01    3     -1000037         6        -5             # GLSS   -->  W2SS-  TP     BB          
      4.91725268E-06    2      1000022        21                       # GLSS   -->  Z1SS   GL                 
      1.78380422E-02    3      1000022         2        -2             # GLSS   -->  Z1SS   UP     UB          
      5.62793761E-03    3      1000022         1        -1             # GLSS   -->  Z1SS   DN     DB          
      5.62793761E-03    3      1000022         3        -3             # GLSS   -->  Z1SS   ST     SB          
      1.78380348E-02    3      1000022         4        -4             # GLSS   -->  Z1SS   CH     CB          
      7.70353293E-03    3      1000022         5        -5             # GLSS   -->  Z1SS   BT     BB          
      9.35994834E-02    3      1000022         6        -6             # GLSS   -->  Z1SS   TP     TB          
      1.72128354E-03    2      1000023        21                       # GLSS   -->  Z2SS   GL                 
      2.03260798E-02    3      1000023         2        -2             # GLSS   -->  Z2SS   UP     UB          
      1.93098634E-02    3      1000023         1        -1             # GLSS   -->  Z2SS   DN     DB          
      1.93098634E-02    3      1000023         3        -3             # GLSS   -->  Z2SS   ST     SB          
      2.03260612E-02    3      1000023         4        -4             # GLSS   -->  Z2SS   CH     CB          
      4.56555374E-02    3      1000023         5        -5             # GLSS   -->  Z2SS   BT     BB          
      1.97765753E-02    3      1000023         6        -6             # GLSS   -->  Z2SS   TP     TB          
      1.30917588E-02    2      1000025        21                       # GLSS   -->  Z3SS   GL                 
      1.27590074E-05    3      1000025         2        -2             # GLSS   -->  Z3SS   UP     UB          
      1.66258596E-05    3      1000025         1        -1             # GLSS   -->  Z3SS   DN     DB          
      1.66258596E-05    3      1000025         3        -3             # GLSS   -->  Z3SS   ST     SB          
      1.27589965E-05    3      1000025         4        -4             # GLSS   -->  Z3SS   CH     CB          
      1.50955236E-03    3      1000025         5        -5             # GLSS   -->  Z3SS   BT     BB          
      5.20990379E-02    3      1000025         6        -6             # GLSS   -->  Z3SS   TP     TB          
      1.15915211E-02    2      1000035        21                       # GLSS   -->  Z4SS   GL                 
      8.76988575E-04    3      1000035         2        -2             # GLSS   -->  Z4SS   UP     UB          
      1.03454955E-03    3      1000035         1        -1             # GLSS   -->  Z4SS   DN     DB          
      1.03454955E-03    3      1000035         3        -3             # GLSS   -->  Z4SS   ST     SB          
      8.76987702E-04    3      1000035         4        -4             # GLSS   -->  Z4SS   CH     CB          
      3.68565647E-03    3      1000035         5        -5             # GLSS   -->  Z4SS   BT     BB          
      8.48567709E-02    3      1000035         6        -6             # GLSS   -->  Z4SS   TP     TB          
#         PDG         Width
DECAY   1000002  1.02251442E+02   # UPL   decays
#          BR          NDA       ID1       ID2       ID3       ID4
      2.24901945E-03    2      1000022         2                       # UPL    -->  Z1SS   UP                 
      8.06209669E-02    2      1000023         2                       # UPL    -->  Z2SS   UP                 
      1.97147383E-04    2      1000025         2                       # UPL    -->  Z3SS   UP                 
      7.93384481E-03    2      1000035         2                       # UPL    -->  Z4SS   UP                 
      7.32797921E-01    2      1000021         2                       # UPL    -->  GLSS   UP                 
      1.64541796E-01    2      1000024         1                       # UPL    -->  W1SS+  DN                 
      1.16593270E-02    2      1000037         1                       # UPL    -->  W2SS+  DN                 
#         PDG         Width
DECAY   1000001  1.02283394E+02   # DNL   decays
#          BR          NDA       ID1       ID2       ID3       ID4
      3.91970482E-03    2      1000022         1                       # DNL    -->  Z1SS   DN                 
      7.69605935E-02    2      1000023         1                       # DNL    -->  Z2SS   DN                 
      3.34210315E-04    2      1000025         1                       # DNL    -->  Z3SS   DN                 
      9.73580219E-03    2      1000035         1                       # DNL    -->  Z4SS   DN                 
      7.33553588E-01    2      1000021         1                       # DNL    -->  GLSS   DN                 
      1.52957961E-01    2     -1000024         2                       # DNL    -->  W1SS-  UP                 
      2.25381572E-02    2     -1000037         2                       # DNL    -->  W2SS-  UP                 
#         PDG         Width
DECAY   1000003  1.02283379E+02   # STL   decays
#          BR          NDA       ID1       ID2       ID3       ID4
      3.91970528E-03    2      1000022         3                       # STL    -->  Z1SS   ST                 
      7.69606009E-02    2      1000023         3                       # STL    -->  Z2SS   ST                 
      3.34210374E-04    2      1000025         3                       # STL    -->  Z3SS   ST                 
      9.73580312E-03    2      1000035         3                       # STL    -->  Z4SS   ST                 
      7.33553708E-01    2      1000021         3                       # STL    -->  GLSS   ST                 
      1.52957872E-01    2     -1000024         4                       # STL    -->  W1SS-  CH                 
      2.25381423E-02    2     -1000037         4                       # STL    -->  W2SS-  CH                 
#         PDG         Width
DECAY   1000004  1.02251389E+02   # CHL   decays
#          BR          NDA       ID1       ID2       ID3       ID4
      2.24901945E-03    2      1000022         4                       # CHL    -->  Z1SS   CH                 
      8.06209669E-02    2      1000023         4                       # CHL    -->  Z2SS   CH                 
      1.97147339E-04    2      1000025         4                       # CHL    -->  Z3SS   CH                 
      7.93384481E-03    2      1000035         4                       # CHL    -->  Z4SS   CH                 
      7.32797742E-01    2      1000021         4                       # CHL    -->  GLSS   CH                 
      1.64541945E-01    2      1000024         3                       # CHL    -->  W1SS+  ST                 
      1.16593353E-02    2      1000037         3                       # CHL    -->  W2SS+  ST                 
#         PDG         Width
DECAY   1000005  9.32894516E+01   # BT1   decays
#          BR          NDA       ID1       ID2       ID3       ID4
      3.66587355E-03    2      1000022         5                       # BT1    -->  Z1SS   BT                 
      6.93977699E-02    2      1000023         5                       # BT1    -->  Z2SS   BT                 
      3.29877017E-03    2      1000025         5                       # BT1    -->  Z3SS   BT                 
      1.09117357E-02    2      1000035         5                       # BT1    -->  Z4SS   BT                 
      5.09526730E-01    2      1000021         5                       # BT1    -->  GLSS   BT                 
      1.49243742E-01    2     -1000024         6                       # BT1    -->  W1SS-  TP                 
      2.41206571E-01    2     -1000037         6                       # BT1    -->  W2SS-  TP                 
      1.27487611E-02    2          -24   1000006                       # BT1    -->  W-     TP1                
#         PDG         Width
DECAY   1000006  4.14630127E+01   # TP1   decays
#          BR          NDA       ID1       ID2       ID3       ID4
      2.47024208E-01    2      1000021         6                       # TP1    -->  GLSS   TP                 
      7.07671195E-02    2      1000022         6                       # TP1    -->  Z1SS   TP                 
      1.96127128E-02    2      1000023         6                       # TP1    -->  Z2SS   TP                 
      1.71897694E-01    2      1000025         6                       # TP1    -->  Z3SS   TP                 
      1.44486114E-01    2      1000035         6                       # TP1    -->  Z4SS   TP                 
      3.89739834E-02    2      1000024         5                       # TP1    -->  W1SS+  BT                 
      3.07238221E-01    2      1000037         5                       # TP1    -->  W2SS+  BT                 
#         PDG         Width
DECAY   2000002  7.96799240E+01   # UPR   decays
#          BR          NDA       ID1       ID2       ID3       ID4
      6.20321073E-02    2      1000022         2                       # UPR    -->  Z1SS   UP                 
      2.21379843E-04    2      1000023         2                       # UPR    -->  Z2SS   UP                 
      9.19419399E-05    2      1000025         2                       # UPR    -->  Z3SS   UP                 
      4.69668099E-04    2      1000035         2                       # UPR    -->  Z4SS   UP                 
      9.37184870E-01    2      1000021         2                       # UPR    -->  GLSS   UP                 
#         PDG         Width
DECAY   2000001  7.59366455E+01   # DNR   decays
#          BR          NDA       ID1       ID2       ID3       ID4
      1.62735917E-02    2      1000022         1                       # DNR    -->  Z1SS   DN                 
      5.80773594E-05    2      1000023         1                       # DNR    -->  Z2SS   DN                 
      2.41204798E-05    2      1000025         1                       # DNR    -->  Z3SS   DN                 
      1.23215097E-04    2      1000035         1                       # DNR    -->  Z4SS   DN                 
      9.83521044E-01    2      1000021         1                       # DNR    -->  GLSS   DN                 
#         PDG         Width
DECAY   2000003  7.59366455E+01   # STR   decays
#          BR          NDA       ID1       ID2       ID3       ID4
      1.62735917E-02    2      1000022         3                       # STR    -->  Z1SS   ST                 
      5.80773594E-05    2      1000023         3                       # STR    -->  Z2SS   ST                 
      2.41204798E-05    2      1000025         3                       # STR    -->  Z3SS   ST                 
      1.23215097E-04    2      1000035         3                       # STR    -->  Z4SS   ST                 
      9.83521044E-01    2      1000021         3                       # STR    -->  GLSS   ST                 
#         PDG         Width
DECAY   2000004  7.96798401E+01   # CHR   decays
#          BR          NDA       ID1       ID2       ID3       ID4
      6.20321371E-02    2      1000022         4                       # CHR    -->  Z1SS   CH                 
      2.21379960E-04    2      1000023         4                       # CHR    -->  Z2SS   CH                 
      9.19419690E-05    2      1000025         4                       # CHR    -->  Z3SS   CH                 
      4.69668274E-04    2      1000035         4                       # CHR    -->  Z4SS   CH                 
      9.37184930E-01    2      1000021         4                       # CHR    -->  GLSS   CH                 
#         PDG         Width
DECAY   2000005  7.58099442E+01   # BT2   decays
#          BR          NDA       ID1       ID2       ID3       ID4
      1.61931235E-02    2      1000022         5                       # BT2    -->  Z1SS   BT                 
      5.82767883E-04    2      1000023         5                       # BT2    -->  Z2SS   BT                 
      4.70972434E-03    2      1000025         5                       # BT2    -->  Z3SS   BT                 
      4.28637024E-03    2      1000035         5                       # BT2    -->  Z4SS   BT                 
      9.63925242E-01    2      1000021         5                       # BT2    -->  GLSS   BT                 
      1.00025127E-03    2     -1000024         6                       # BT2    -->  W1SS-  TP                 
      8.41103494E-03    2     -1000037         6                       # BT2    -->  W2SS-  TP                 
      9.01986186E-06    2          -24   1000006                       # BT2    -->  W-     TP1                
      2.60748202E-04    2          -24   2000006                       # BT2    -->  W-     TP2                
      1.41801807E-04    2           23   1000005                       # BT2    -->  Z0     BT1                
      4.79820883E-04    2           25   1000005                       # BT2    -->  HL0    BT1                
#         PDG         Width
DECAY   2000006  9.25077057E+01   # TP2   decays
#          BR          NDA       ID1       ID2       ID3       ID4
      4.93801683E-01    2      1000021         6                       # TP2    -->  GLSS   TP                 
      1.43932000E-01    2      1000024         5                       # TP2    -->  W1SS+  BT                 
      2.16697045E-02    2      1000037         5                       # TP2    -->  W2SS+  BT                 
      6.82012225E-03    2           23   1000006                       # TP2    -->  Z0     TP1                
      1.37725584E-02    2           25   1000006                       # TP2    -->  HL0    TP1                
      2.30617216E-03    2      1000022         6                       # TP2    -->  Z1SS   TP                 
      7.66690969E-02    2      1000023         6                       # TP2    -->  Z2SS   TP                 
      1.18823640E-01    2      1000025         6                       # TP2    -->  Z3SS   TP                 
      1.22205026E-01    2      1000035         6                       # TP2    -->  Z4SS   TP                 
#         PDG         Width
DECAY   1000011  2.78111401E+01   # EL-   decays
#          BR          NDA       ID1       ID2       ID3       ID4
      8.55854601E-02    2      1000022        11                       # EL-    -->  Z1SS   E-                 
      2.90166676E-01    2      1000023        11                       # EL-    -->  Z2SS   E-                 
      3.27803427E-04    2      1000025        11                       # EL-    -->  Z3SS   E-                 
      2.15235855E-02    2      1000035        11                       # EL-    -->  Z4SS   E-                 
      5.25668979E-01    2     -1000024        12                       # EL-    -->  W1SS-  NUE                
      7.67274797E-02    2     -1000037        12                       # EL-    -->  W2SS-  NUE                
#         PDG         Width
DECAY   1000013  2.78111401E+01   # MUL-  decays
#          BR          NDA       ID1       ID2       ID3       ID4
      8.55854601E-02    2      1000022        13                       # MUL-   -->  Z1SS   MU-                
      2.90166676E-01    2      1000023        13                       # MUL-   -->  Z2SS   MU-                
      3.27803427E-04    2      1000025        13                       # MUL-   -->  Z3SS   MU-                
      2.15235855E-02    2      1000035        13                       # MUL-   -->  Z4SS   MU-                
      5.25668979E-01    2     -1000024        14                       # MUL-   -->  W1SS-  NUM                
      7.67274797E-02    2     -1000037        14                       # MUL-   -->  W2SS-  NUM                
#         PDG         Width
DECAY   1000015  1.15823107E+01   # TAU1- decays
#          BR          NDA       ID1       ID2       ID3       ID4
      8.79937649E-01    2      1000022        15                       # TAU1-  -->  Z1SS   TAU-               
      2.96227522E-02    2      1000023        15                       # TAU1-  -->  Z2SS   TAU-               
      1.59222875E-02    2      1000025        15                       # TAU1-  -->  Z3SS   TAU-               
      1.18212374E-02    2      1000035        15                       # TAU1-  -->  Z4SS   TAU-               
      5.04417270E-02    2     -1000024        16                       # TAU1-  -->  W1SS-  NUT                
      1.22543797E-02    2     -1000037        16                       # TAU1-  -->  W2SS-  NUT                
#         PDG         Width
DECAY   1000012  2.78528633E+01   # NUEL  decays
#          BR          NDA       ID1       ID2       ID3       ID4
      1.02673829E-01    2      1000022        12                       # NUEL   -->  Z1SS   NUE                
      2.51608044E-01    2      1000023        12                       # NUEL   -->  Z2SS   NUE                
      1.72482419E-03    2      1000025        12                       # NUEL   -->  Z3SS   NUE                
      3.98050696E-02    2      1000035        12                       # NUEL   -->  Z4SS   NUE                
      5.64559877E-01    2      1000024        11                       # NUEL   -->  W1SS+  E-                 
      3.96283790E-02    2      1000037        11                       # NUEL   -->  W2SS+  E-                 
#         PDG         Width
DECAY   1000014  2.78528633E+01   # NUML  decays
#          BR          NDA       ID1       ID2       ID3       ID4
      1.02673829E-01    2      1000022        14                       # NUML   -->  Z1SS   NUM                
      2.51608044E-01    2      1000023        14                       # NUML   -->  Z2SS   NUM                
      1.72482419E-03    2      1000025        14                       # NUML   -->  Z3SS   NUM                
      3.98050696E-02    2      1000035        14                       # NUML   -->  Z4SS   NUM                
      5.64559877E-01    2      1000024        13                       # NUML   -->  W1SS+  MU-                
      3.96283790E-02    2      1000037        13                       # NUML   -->  W2SS+  MU-                
#         PDG         Width
DECAY   1000016  2.81182995E+01   # NUTL  decays
#          BR          NDA       ID1       ID2       ID3       ID4
      1.01239569E-01    2      1000022        16                       # NUTL   -->  Z1SS   NUT                
      2.48012245E-01    2      1000023        16                       # NUTL   -->  Z2SS   NUT                
      1.69908325E-03    2      1000025        16                       # NUTL   -->  Z3SS   NUT                
      3.92071828E-02    2      1000035        16                       # NUTL   -->  Z4SS   NUT                
      5.58559000E-01    2      1000024        15                       # NUTL   -->  W1SS+  TAU-               
      5.12829013E-02    2      1000037        15                       # NUTL   -->  W2SS+  TAU-               
      5.91840577E-10    3      1000015        16       -15             # NUTL   -->  TAU1-  NUT    TAU+        
      5.91840577E-10    3      1000015        12       -11             # NUTL   -->  TAU1-  NUE    E+          
      5.91840577E-10    3      1000015        14       -13             # NUTL   -->  TAU1-  NUM    MU+         
      1.77552173E-09    3      1000015         2        -1             # NUTL   -->  TAU1-  UP     DB          
      1.77552173E-09    3      1000015         4        -3             # NUTL   -->  TAU1-  CH     SB          
#         PDG         Width
DECAY   2000011  1.05370932E+01   # ER-   decays
#          BR          NDA       ID1       ID2       ID3       ID4
      9.87675846E-01    2      1000022        11                       # ER-    -->  Z1SS   E-                 
      3.50913592E-03    2      1000023        11                       # ER-    -->  Z2SS   E-                 
      1.44472590E-03    2      1000025        11                       # ER-    -->  Z3SS   E-                 
      7.37029267E-03    2      1000035        11                       # ER-    -->  Z4SS   E-                 
#         PDG         Width
DECAY   2000013  1.05370932E+01   # MUR-  decays
#          BR          NDA       ID1       ID2       ID3       ID4
      9.87675846E-01    2      1000022        13                       # MUR-   -->  Z1SS   MU-                
      3.50913592E-03    2      1000023        13                       # MUR-   -->  Z2SS   MU-                
      1.44472590E-03    2      1000025        13                       # MUR-   -->  Z3SS   MU-                
      7.37029267E-03    2      1000035        13                       # MUR-   -->  Z4SS   MU-                
#         PDG         Width
DECAY   2000015  2.77228184E+01   # TAU2- decays
#          BR          NDA       ID1       ID2       ID3       ID4
      9.00392756E-02    2      1000022        15                       # TAU2-  -->  Z1SS   TAU-               
      2.80657679E-01    2      1000023        15                       # TAU2-  -->  Z2SS   TAU-               
      8.44681822E-03    2      1000025        15                       # TAU2-  -->  Z3SS   TAU-               
      3.15255374E-02    2      1000035        15                       # TAU2-  -->  Z4SS   TAU-               
      5.05566180E-01    2     -1000024        16                       # TAU2-  -->  W1SS-  NUT                
      8.37644860E-02    2     -1000037        16                       # TAU2-  -->  W2SS-  NUT                
#         PDG         Width
DECAY   1000023  2.40800735E-02   # Z2SS  decays
#          BR          NDA       ID1       ID2       ID3       ID4
      1.60973480E-06    2      1000022        22                       # Z2SS   -->  Z1SS   GM                 
      8.62455070E-02    2      1000022        23                       # Z2SS   -->  Z1SS   Z0                 
      4.00819680E-08    3      1000022         2        -2             # Z2SS   -->  Z1SS   UP     UB          
      6.36277235E-08    3      1000022         1        -1             # Z2SS   -->  Z1SS   DN     DB          
      6.36277235E-08    3      1000022         3        -3             # Z2SS   -->  Z1SS   ST     SB          
      4.00819289E-08    3      1000022         4        -4             # Z2SS   -->  Z1SS   CH     CB          
      1.53822754E-07    3      1000022         5        -5             # Z2SS   -->  Z1SS   BT     BB          
      1.92773214E-07    3      1000022        11       -11             # Z2SS   -->  Z1SS   E-     E+          
      1.92773214E-07    3      1000022        13       -13             # Z2SS   -->  Z1SS   MU-    MU+         
      2.04208703E-07    3      1000022        15       -15             # Z2SS   -->  Z1SS   TAU-   TAU+        
      1.97622725E-07    3      1000022        12       -12             # Z2SS   -->  Z1SS   NUE    ANUE        
      1.97622725E-07    3      1000022        14       -14             # Z2SS   -->  Z1SS   NUM    ANUM        
      2.01231558E-07    3      1000022        16       -16             # Z2SS   -->  Z1SS   NUT    ANUT        
      9.13751364E-01    2      1000022        25                       # Z2SS   -->  Z1SS   HL0                
#         PDG         Width
DECAY   1000025  2.05585122E+00   # Z3SS  decays
#          BR          NDA       ID1       ID2       ID3       ID4
      1.02684325E-07    2      1000022        22                       # Z3SS   -->  Z1SS   GM                 
      6.53886048E-07    2      1000023        22                       # Z3SS   -->  Z2SS   GM                 
      2.87269294E-01    2      1000024       -24                       # Z3SS   -->  W1SS+  W-                 
      2.87269294E-01    2     -1000024        24                       # Z3SS   -->  W1SS-  W+                 
      1.42690569E-01    2      1000022        23                       # Z3SS   -->  Z1SS   Z0                 
      2.56337613E-01    2      1000023        23                       # Z3SS   -->  Z2SS   Z0                 
      1.24126529E-10    3      1000022         2        -2             # Z3SS   -->  Z1SS   UP     UB          
      4.79915760E-11    3      1000022         1        -1             # Z3SS   -->  Z1SS   DN     DB          
      4.79915760E-11    3      1000022         3        -3             # Z3SS   -->  Z1SS   ST     SB          
      1.24126473E-10    3      1000022         4        -4             # Z3SS   -->  Z1SS   CH     CB          
      1.29224453E-08    3      1000022         5        -5             # Z3SS   -->  Z1SS   BT     BB          
      2.74868961E-10    3      1000022        11       -11             # Z3SS   -->  Z1SS   E-     E+          
      2.74868961E-10    3      1000022        13       -13             # Z3SS   -->  Z1SS   MU-    MU+         
      1.15818635E-08    3      1000022        15       -15             # Z3SS   -->  Z1SS   TAU-   TAU+        
      2.04442116E-10    3      1000022        12       -12             # Z3SS   -->  Z1SS   NUE    ANUE        
      2.04442116E-10    3      1000022        14       -14             # Z3SS   -->  Z1SS   NUM    ANUM        
      2.08241493E-10    3      1000022        16       -16             # Z3SS   -->  Z1SS   NUT    ANUT        
      3.80526340E-11    3      1000023         2        -2             # Z3SS   -->  Z2SS   UP     UB          
      6.13200116E-11    3      1000023         1        -1             # Z3SS   -->  Z2SS   DN     DB          
      6.13200116E-11    3      1000023         3        -3             # Z3SS   -->  Z2SS   ST     SB          
      3.80526027E-11    3      1000023         4        -4             # Z3SS   -->  Z2SS   CH     CB          
      5.34606581E-09    3      1000023         5        -5             # Z3SS   -->  Z2SS   BT     BB          
      8.41373585E-12    3      1000023        11       -11             # Z3SS   -->  Z2SS   E-     E+          
      8.41373585E-12    3      1000023        13       -13             # Z3SS   -->  Z2SS   MU-    MU+         
      8.20102208E-10    3      1000023        15       -15             # Z3SS   -->  Z2SS   TAU-   TAU+        
      3.83158470E-11    3      1000023        12       -12             # Z3SS   -->  Z2SS   NUE    ANUE        
      3.83158470E-11    3      1000023        14       -14             # Z3SS   -->  Z2SS   NUM    ANUM        
      3.90350773E-11    3      1000023        16       -16             # Z3SS   -->  Z2SS   NUT    ANUT        
      2.11346690E-02    2      1000022        25                       # Z3SS   -->  Z1SS   HL0                
      5.29787270E-03    2      1000023        25                       # Z3SS   -->  Z2SS   HL0                
#         PDG         Width
DECAY   1000035  2.54742694E+00   # Z4SS  decays
#          BR          NDA       ID1       ID2       ID3       ID4
      3.16794093E-08    2      1000022        22                       # Z4SS   -->  Z1SS   GM                 
      1.82576912E-07    2      1000023        22                       # Z4SS   -->  Z2SS   GM                 
      4.77108753E-09    2      1000025        22                       # Z4SS   -->  Z3SS   GM                 
      3.38402987E-01    2      1000024       -24                       # Z4SS   -->  W1SS+  W-                 
      3.38402987E-01    2     -1000024        24                       # Z4SS   -->  W1SS-  W+                 
      1.99919399E-02    2      1000022        23                       # Z4SS   -->  Z1SS   Z0                 
      9.85128712E-03    2      1000023        23                       # Z4SS   -->  Z2SS   Z0                 
      2.74217227E-09    3      1000022         2        -2             # Z4SS   -->  Z1SS   UP     UB          
      3.00565550E-09    3      1000022         1        -1             # Z4SS   -->  Z1SS   DN     DB          
      3.00565550E-09    3      1000022         3        -3             # Z4SS   -->  Z1SS   ST     SB          
      2.74217049E-09    3      1000022         4        -4             # Z4SS   -->  Z1SS   CH     CB          
      1.49915564E-08    3      1000022         5        -5             # Z4SS   -->  Z1SS   BT     BB          
      8.18066770E-09    3      1000022        11       -11             # Z4SS   -->  Z1SS   E-     E+          
      8.18066770E-09    3      1000022        13       -13             # Z4SS   -->  Z1SS   MU-    MU+         
      1.80220283E-08    3      1000022        15       -15             # Z4SS   -->  Z1SS   TAU-   TAU+        
      1.15143806E-08    3      1000022        12       -12             # Z4SS   -->  Z1SS   NUE    ANUE        
      1.15143806E-08    3      1000022        14       -14             # Z4SS   -->  Z1SS   NUM    ANUM        
      1.17280132E-08    3      1000022        16       -16             # Z4SS   -->  Z1SS   NUT    ANUT        
      5.92886051E-09    3      1000023         2        -2             # Z4SS   -->  Z2SS   UP     UB          
      6.92035673E-09    3      1000023         1        -1             # Z4SS   -->  Z2SS   DN     DB          
      6.92035673E-09    3      1000023         3        -3             # Z4SS   -->  Z2SS   ST     SB          
      5.92885474E-09    3      1000023         4        -4             # Z4SS   -->  Z2SS   CH     CB          
      1.96616572E-08    3      1000023         5        -5             # Z4SS   -->  Z2SS   BT     BB          
      2.12794271E-09    3      1000023        11       -11             # Z4SS   -->  Z2SS   E-     E+          
      2.12794271E-09    3      1000023        13       -13             # Z4SS   -->  Z2SS   MU-    MU+         
      2.86493562E-09    3      1000023        15       -15             # Z4SS   -->  Z2SS   TAU-   TAU+        
      3.43082984E-09    3      1000023        12       -12             # Z4SS   -->  Z2SS   NUE    ANUE        
      3.43082984E-09    3      1000023        14       -14             # Z4SS   -->  Z2SS   NUM    ANUM        
      3.49528517E-09    3      1000023        16       -16             # Z4SS   -->  Z2SS   NUT    ANUT        
      1.68685006E-07    3      1000025         2        -2             # Z4SS   -->  Z3SS   UP     UB          
      2.17547353E-07    3      1000025         1        -1             # Z4SS   -->  Z3SS   DN     DB          
      2.17547353E-07    3      1000025         3        -3             # Z4SS   -->  Z3SS   ST     SB          
      1.68685006E-07    3      1000025         4        -4             # Z4SS   -->  Z3SS   CH     CB          
      1.13829259E-07    3      1000025         5        -5             # Z4SS   -->  Z3SS   BT     BB          
      4.93492855E-08    3      1000025        11       -11             # Z4SS   -->  Z3SS   E-     E+          
      4.93492855E-08    3      1000025        13       -13             # Z4SS   -->  Z3SS   MU-    MU+         
      4.46638708E-08    3      1000025        15       -15             # Z4SS   -->  Z3SS   TAU-   TAU+        
      9.81759314E-08    3      1000025        12       -12             # Z4SS   -->  Z3SS   NUE    ANUE        
      9.81759314E-08    3      1000025        14       -14             # Z4SS   -->  Z3SS   NUM    ANUM        
      9.81758390E-08    3      1000025        16       -16             # Z4SS   -->  Z3SS   NUT    ANUT        
      1.00828834E-01    2      1000022        25                       # Z4SS   -->  Z1SS   HL0                
      1.92520410E-01    2      1000023        25                       # Z4SS   -->  Z2SS   HL0                
#         PDG         Width
DECAY   1000024  2.19204128E-02   # W1SS+ decays
#          BR          NDA       ID1       ID2       ID3       ID4
      1.14899819E-07    3      1000022         2        -1             # W1SS+  -->  Z1SS   UP     DB          
      1.14899770E-07    3      1000022         4        -3             # W1SS+  -->  Z1SS   CH     SB          
      4.44362115E-07    3      1000022       -11        12             # W1SS+  -->  Z1SS   E+     NUE         
      4.44362115E-07    3      1000022       -13        14             # W1SS+  -->  Z1SS   MU+    NUM         
      4.61380921E-07    3      1000022       -15        16             # W1SS+  -->  Z1SS   TAU+   NUT         
      9.99998391E-01    2      1000022        24                       # W1SS+  -->  Z1SS   W+                 
      1.15619458E-10    3      1000023         2        -1             # W1SS+  -->  Z2SS   UP     DB          
      3.85463918E-11    3      1000023       -11        12             # W1SS+  -->  Z2SS   E+     NUE         
      3.85463918E-11    3      1000023       -13        14             # W1SS+  -->  Z2SS   MU+    NUM         
#         PDG         Width
DECAY   1000037  2.22316456E+00   # W2SS+ decays
#          BR          NDA       ID1       ID2       ID3       ID4
      4.74606354E-09    3      1000022         2        -1             # W2SS+  -->  Z1SS   UP     DB          
      4.74606177E-09    3      1000022         4        -3             # W2SS+  -->  Z1SS   CH     SB          
      1.67692953E-08    3      1000022       -11        12             # W2SS+  -->  Z1SS   E+     NUE         
      1.67692953E-08    3      1000022       -13        14             # W2SS+  -->  Z1SS   MU+    NUM         
      2.82486781E-08    3      1000022       -15        16             # W2SS+  -->  Z1SS   TAU+   NUT         
      1.17071785E-01    2      1000022        24                       # W2SS+  -->  Z1SS   W+                 
      5.11285503E-09    3      1000023         2        -1             # W2SS+  -->  Z2SS   UP     DB          
      5.11285503E-09    3      1000023         4        -3             # W2SS+  -->  Z2SS   CH     SB          
      2.33336306E-09    3      1000023       -11        12             # W2SS+  -->  Z2SS   E+     NUE         
      2.33336306E-09    3      1000023       -13        14             # W2SS+  -->  Z2SS   MU+    NUM         
      3.56260310E-09    3      1000023       -15        16             # W2SS+  -->  Z2SS   TAU+   NUT         
      3.29218745E-01    2      1000023        24                       # W2SS+  -->  Z2SS   W+                 
      5.40873373E-07    3      1000025         2        -1             # W2SS+  -->  Z3SS   UP     DB          
      5.40873373E-07    3      1000025         4        -3             # W2SS+  -->  Z3SS   CH     SB          
      1.80286165E-07    3      1000025       -11        12             # W2SS+  -->  Z3SS   E+     NUE         
      1.80286165E-07    3      1000025       -13        14             # W2SS+  -->  Z3SS   MU+    NUM         
      1.80293384E-07    3      1000025       -15        16             # W2SS+  -->  Z3SS   TAU+   NUT         
      3.06984991E-01    2      1000024        23                       # W2SS+  -->  W1SS+  Z0                 
      6.58814336E-09    3      1000024         1        -1             # W2SS+  -->  W1SS+  DN     DB          
      6.58813848E-09    3      1000024         3        -3             # W2SS+  -->  W1SS+  ST     SB          
      1.17975940E-08    3      1000024         2        -2             # W2SS+  -->  W1SS+  UP     UB          
      1.17975940E-08    3      1000024         4        -4             # W2SS+  -->  W1SS+  CH     CB          
      5.08920728E-09    3      1000024        12       -12             # W2SS+  -->  W1SS+  NUE    ANUE        
      5.08920728E-09    3      1000024        14       -14             # W2SS+  -->  W1SS+  NUM    ANUM        
      5.40294254E-09    3      1000024        16       -16             # W2SS+  -->  W1SS+  NUT    ANUT        
      2.83993562E-09    3      1000024        11       -11             # W2SS+  -->  W1SS+  E-     E+          
      2.83993562E-09    3      1000024        13       -13             # W2SS+  -->  W1SS+  MU-    MU+         
      2.89331403E-09    3      1000024        15       -15             # W2SS+  -->  W1SS+  TAU-   TAU+        
      2.46722743E-01    2      1000024        25                       # W2SS+  -->  W1SS+  HL0                
#         PDG         Width
DECAY        25  4.10222821E-03   # HL0   decays
#          BR          NDA       ID1       ID2       ID3       ID4
      4.82275686E-09    2           11       -11                       # HL0    -->  E-     E+                 
      2.03624484E-04    2           13       -13                       # HL0    -->  MU-    MU+                
      5.82384840E-02    2           15       -15                       # HL0    -->  TAU-   TAU+               
      6.05276227E-06    2            1        -1                       # HL0    -->  DN     DB                 
      2.44561932E-03    2            3        -3                       # HL0    -->  ST     SB                 
      8.01345468E-01    2            5        -5                       # HL0    -->  BT     BB                 
      1.91930781E-06    2            2        -2                       # HL0    -->  UP     UB                 
      3.61123756E-02    2            4        -4                       # HL0    -->  CH     CB                 
      1.85183075E-03    2           22        22                       # HL0    -->  GM     GM                 
      3.92122716E-02    2           21        21                       # HL0    -->  GL     GL                 
      3.12881148E-03    3           24        11       -12             # HL0    -->  W+     E-     ANUE        
      3.12881148E-03    3           24        13       -14             # HL0    -->  W+     MU-    ANUM        
      3.12881148E-03    3           24        15       -16             # HL0    -->  W+     TAU-   ANUT        
      9.38643422E-03    3           24        -2         1             # HL0    -->  W+     UB     DN          
      9.38643422E-03    3           24        -4         3             # HL0    -->  W+     CB     ST          
      3.12881148E-03    3          -24       -11        12             # HL0    -->  W-     E+     NUE         
      3.12881148E-03    3          -24       -13        14             # HL0    -->  W-     MU+    NUM         
      3.12881148E-03    3          -24       -15        16             # HL0    -->  W-     TAU+   NUT         
      9.38643422E-03    3          -24         2        -1             # HL0    -->  W-     UP     DB          
      9.38643422E-03    3          -24         4        -3             # HL0    -->  W-     CH     SB          
      2.91616045E-04    3           23        12       -12             # HL0    -->  Z0     NUE    ANUE        
      2.91616045E-04    3           23        14       -14             # HL0    -->  Z0     NUM    ANUM        
      2.91616045E-04    3           23        16       -16             # HL0    -->  Z0     NUT    ANUT        
      1.46767416E-04    3           23        11       -11             # HL0    -->  Z0     E-     E+          
      1.46767416E-04    3           23        13       -13             # HL0    -->  Z0     MU-    MU+         
      1.46767416E-04    3           23        15       -15             # HL0    -->  Z0     TAU-   TAU+        
      5.02812734E-04    3           23         2        -2             # HL0    -->  Z0     UP     UB          
      5.02812734E-04    3           23         4        -4             # HL0    -->  Z0     CH     CB          
      6.47746667E-04    3           23         1        -1             # HL0    -->  Z0     DN     DB          
      6.47746667E-04    3           23         3        -3             # HL0    -->  Z0     ST     SB          
      6.47746667E-04    3           23         5        -5             # HL0    -->  Z0     BT     BB          
#         PDG         Width
DECAY        35  2.94860229E+01   # HH0   decays
#          BR          NDA       ID1       ID2       ID3       ID4
      1.24243760E-09    2           11       -11                       # HH0    -->  E-     E+                 
      5.24579518E-05    2           13       -13                       # HH0    -->  MU-    MU+                
      1.50247011E-02    2           15       -15                       # HH0    -->  TAU-   TAU+               
      1.51308359E-06    2            1        -1                       # HH0    -->  DN     DB                 
      6.11362339E-04    2            3        -3                       # HH0    -->  ST     SB                 
      8.09703097E-02    2            5        -5                       # HH0    -->  BT     BB                 
      4.88521862E-11    2            2        -2                       # HH0    -->  UP     UB                 
      6.30973716E-07    2            4        -4                       # HH0    -->  CH     CB                 
      3.23347077E-02    2            6        -6                       # HH0    -->  TP     TB                 
      2.10541273E-07    2           22        22                       # HH0    -->  GM     GM                 
      9.12674022E-06    2           21        21                       # HH0    -->  GL     GL                 
      2.19339945E-05    2           24       -24                       # HH0    -->  W+     W-                 
      1.12316784E-05    2           23        23                       # HH0    -->  Z0     Z0                 
      1.89248065E-03    2      1000022   1000022                       # HH0    -->  Z1SS   Z1SS               
      1.48730995E-02    2      1000022   1000023                       # HH0    -->  Z1SS   Z2SS               
      5.24651520E-02    2      1000022   1000025                       # HH0    -->  Z1SS   Z3SS               
      2.22816672E-02    2      1000022   1000035                       # HH0    -->  Z1SS   Z4SS               
      2.62346435E-02    2      1000023   1000023                       # HH0    -->  Z2SS   Z2SS               
      1.30227923E-01    2      1000023   1000025                       # HH0    -->  Z2SS   Z3SS               
      4.52072844E-02    2      1000023   1000035                       # HH0    -->  Z2SS   Z4SS               
      1.52242230E-03    2      1000025   1000025                       # HH0    -->  Z3SS   Z3SS               
      3.03083286E-02    2      1000025   1000035                       # HH0    -->  Z3SS   Z4SS               
      1.95704419E-02    2      1000035   1000035                       # HH0    -->  Z4SS   Z4SS               
      5.74871711E-02    2      1000024  -1000024                       # HH0    -->  W1SS+  W1SS-              
      1.80211756E-02    2      1000037  -1000037                       # HH0    -->  W2SS+  W2SS-              
      2.25397795E-01    2      1000024  -1000037                       # HH0    -->  W1SS+  W2SS-              
      2.25397795E-01    2     -1000024   1000037                       # HH0    -->  W1SS-  W2SS+              
      7.44907302E-05    2           25        25                       # HH0    -->  HL0    HL0                
#         PDG         Width
DECAY        36  2.92435932E+01   # HA0   decays
#          BR          NDA       ID1       ID2       ID3       ID4
      1.24461219E-09    2           11       -11                       # HA0    -->  E-     E+                 
      5.25497744E-05    2           13       -13                       # HA0    -->  MU-    MU+                
      1.50510408E-02    2           15       -15                       # HA0    -->  TAU-   TAU+               
      1.51580377E-06    2            1        -1                       # HA0    -->  DN     DB                 
      6.12461474E-04    2            3        -3                       # HA0    -->  ST     SB                 
      8.11166018E-02    2            5        -5                       # HA0    -->  BT     BB                 
      4.85008561E-11    2            2        -2                       # HA0    -->  UP     UB                 
      6.26888664E-07    2            4        -4                       # HA0    -->  CH     CB                 
      3.27733532E-02    2            6        -6                       # HA0    -->  TP     TB                 
      2.68403824E-07    2           22        22                       # HA0    -->  GM     GM                 
      1.49526531E-05    2           21        21                       # HA0    -->  GL     GL                 
      2.31707306E-03    2      1000022   1000022                       # HA0    -->  Z1SS   Z1SS               
      2.00471506E-02    2      1000022   1000023                       # HA0    -->  Z1SS   Z2SS               
      3.17882672E-02    2      1000022   1000025                       # HA0    -->  Z1SS   Z3SS               
      3.79752405E-02    2      1000022   1000035                       # HA0    -->  Z1SS   Z4SS               
      3.87789048E-02    2      1000023   1000023                       # HA0    -->  Z2SS   Z2SS               
      7.22639412E-02    2      1000023   1000025                       # HA0    -->  Z2SS   Z3SS               
      8.31110179E-02    2      1000023   1000035                       # HA0    -->  Z2SS   Z4SS               
      1.30264868E-03    2      1000025   1000025                       # HA0    -->  Z3SS   Z3SS               
      1.76824033E-02    2      1000025   1000035                       # HA0    -->  Z3SS   Z4SS               
      3.90885584E-02    2      1000035   1000035                       # HA0    -->  Z4SS   Z4SS               
      8.40538144E-02    2      1000024  -1000024                       # HA0    -->  W1SS+  W1SS-              
      4.23881263E-02    2      1000037  -1000037                       # HA0    -->  W2SS+  W2SS-              
      1.99778840E-01    2      1000024  -1000037                       # HA0    -->  W1SS+  W2SS-              
      1.99778840E-01    2     -1000024   1000037                       # HA0    -->  W1SS-  W2SS+              
      2.18403347E-05    2           25        23                       # HA0    -->  HL0    Z0                 
#         PDG         Width
DECAY        37  2.91821957E+01   # H+    decays
#          BR          NDA       ID1       ID2       ID3       ID4
      1.25649491E-09    2           12       -11                       # H+     -->  NUE    E+                 
      5.30514808E-05    2           14       -13                       # H+     -->  NUM    MU+                
      1.51947374E-02    2           16       -15                       # H+     -->  NUT    TAU+               
      1.41489591E-06    2            2        -1                       # H+     -->  UP     DB                 
      5.72255463E-04    2            4        -3                       # H+     -->  CH     SB                 
      1.05059087E-01    2            6        -5                       # H+     -->  TP     BB                 
      3.15805934E-02    2      1000024   1000022                       # H+     -->  W1SS+  Z1SS               
      4.21388795E-05    2      1000024   1000023                       # H+     -->  W1SS+  Z2SS               
      2.33959809E-01    2      1000024   1000025                       # H+     -->  W1SS+  Z3SS               
      2.44248986E-01    2      1000024   1000035                       # H+     -->  W1SS+  Z4SS               
      5.06421775E-02    2      1000037   1000022                       # H+     -->  W2SS+  Z1SS               
      2.89272219E-01    2      1000037   1000023                       # H+     -->  W2SS+  Z2SS               
      2.76980586E-02    2      1000037   1000025                       # H+     -->  W2SS+  Z3SS               
      1.65336893E-03    2      1000037   1000035                       # H+     -->  W2SS+  Z4SS               
      2.21172359E-05    2           25        24                       # H+     -->  HL0    W+                 
