  65
  401    403.8563    0.90798E-25
  402    396.8215    0.98714E-25
  403    403.8563    0.90798E-25
  404    396.8238    0.98720E-25
  405   3000.0916    0.40042E-26
  406   3002.5991    0.27449E-26
  407    403.8563    0.90798E-25
  408    396.8215    0.98714E-25
  409    403.8563    0.90798E-25
  410    396.8238    0.98720E-25
  411   3000.0916    0.40042E-26
  412   3002.5991    0.27449E-26
  413    400.7083    0.12169E-24
  414    398.5796    0.11489E-24
  415    400.7084    0.12169E-24
  416    398.5818    0.11490E-24
  417   3000.5220    0.27902E-26
  418   3002.8484    0.28004E-26
  419    400.7083    0.12169E-24
  420    398.5796    0.11489E-24
  421    400.7084    0.12169E-24
  422    398.5818    0.11490E-24
  423   3000.5220    0.27902E-26
  424   3002.8484    0.28004E-26
  425    200.0027    0.17997E-22
  426    185.3874    0.19106E-22
  427    200.0027    0.17997E-22
  428    185.3874    0.19106E-22
  429   3000.2717    0.42835E-25
  430   2999.3887    0.16006E-25
  431    200.0027    0.17997E-22
  432    185.3874    0.19106E-22
  433    200.0027    0.17997E-22
  434    185.3874    0.19106E-22
  435   3000.2717    0.42835E-25
  436   2999.3887    0.16006E-25
  437    200.0010    0.34705E-23
  438      0.0000    0.10000E+31
  439    200.0010    0.34705E-23
  440      0.0000    0.10000E+31
  441   3000.3406    0.16017E-25
  442      0.0000    0.10000E+31
  443    200.0010    0.34705E-23
  444      0.0000    0.10000E+31
  445    200.0010    0.34705E-23
  446      0.0000    0.10000E+31
  447   3000.3406    0.16017E-25
  448      0.0000    0.10000E+31
  449    300.0000    0.27319E-20
  450    150.0080    0.10000E+31
  451    249.8129    0.10783E-23
  452   -453.2513    0.22498E-24
  453    477.6193    0.16754E-24
  454    248.7866    0.10639E-23
  455    475.7310    0.16877E-24
  456    248.7866    0.10639E-23
  457    475.7310    0.16877E-24
  203    106.8545    0.17587E-21
  204   1007.6987    0.58026E-25
  205   1000.0000    0.59361E-25
  206   1011.4158    0.59186E-25
  207   1011.4158    0.59186E-25
  458      0.0000    0.10000E+31
    6    172.5000    0.57395E-24
   12    172.5000    0.57395E-24
   4
   401  0.10622027E-01     0   450     1     0     0     0
   401  0.76446287E-01     0   451     1     0     0     0
   401  0.75767440E+00     0   449     1     0     0     0
   401  0.15525733E+00     0   456     2     0     0     0
   4
   402  0.24246278E-02     0   450     2     0     0     0
   402  0.84950410E-01     0   451     2     0     0     0
   402  0.74113727E+00     0   449     2     0     0     0
   402  0.17148770E+00     0   454     1     0     0     0
   4
   403  0.10622114E-01     0   450     3     0     0     0
   403  0.76446958E-01     0   451     3     0     0     0
   403  0.75768125E+00     0   449     3     0     0     0
   403  0.15524967E+00     0   456     4     0     0     0
   4
   404  0.24247367E-02     0   450     4     0     0     0
   404  0.84952459E-01     0   451     4     0     0     0
   404  0.74112010E+00     0   449     4     0     0     0
   404  0.17150271E+00     0   454     3     0     0     0
   7
   405  0.10021605E-01     0   450     5     0     0     0
   405  0.20715148E-03     0   451     5     0     0     0
   405  0.66315301E-03     0   452     5     0     0     0
   405  0.68473269E-03     0   453     5     0     0     0
   405  0.98711127E+00     0   449     5     0     0     0
   405  0.19000922E-03     0   456     6     0     0     0
   405  0.11221089E-02     0   457     6     0     0     0
   7
   406  0.67265218E+00     0   449     6     0     0     0
   406  0.27952712E-01     0   450     6     0     0     0
   406  0.52691917E-02     0   451     6     0     0     0
   406  0.75290501E-01     0   452     6     0     0     0
   406  0.68799615E-01     0   453     6     0     0     0
   406  0.10995330E-01     0   454     5     0     0     0
   406  0.13904043E+00     0   455     5     0     0     0
   4
   407  0.10622027E-01     0   450     7     0     0     0
   407  0.76446287E-01     0   451     7     0     0     0
   407  0.75767440E+00     0   449     7     0     0     0
   407  0.15525733E+00     0   454     8     0     0     0
   4
   408  0.24246278E-02     0   450     8     0     0     0
   408  0.84950410E-01     0   451     8     0     0     0
   408  0.74113727E+00     0   449     8     0     0     0
   408  0.17148770E+00     0   456     7     0     0     0
   4
   409  0.10622114E-01     0   450     9     0     0     0
   409  0.76446958E-01     0   451     9     0     0     0
   409  0.75768125E+00     0   449     9     0     0     0
   409  0.15524967E+00     0   454    10     0     0     0
   4
   410  0.24247367E-02     0   450    10     0     0     0
   410  0.84952459E-01     0   451    10     0     0     0
   410  0.74112010E+00     0   449    10     0     0     0
   410  0.17150271E+00     0   456     9     0     0     0
   7
   411  0.10021605E-01     0   450    11     0     0     0
   411  0.20715148E-03     0   451    11     0     0     0
   411  0.66315301E-03     0   452    11     0     0     0
   411  0.68473269E-03     0   453    11     0     0     0
   411  0.98711127E+00     0   449    11     0     0     0
   411  0.19000922E-03     0   454    12     0     0     0
   411  0.11221089E-02     0   455    12     0     0     0
   7
   412  0.67265218E+00     0   449    12     0     0     0
   412  0.27952712E-01     0   450    12     0     0     0
   412  0.52691917E-02     0   451    12     0     0     0
   412  0.75290501E-01     0   452    12     0     0     0
   412  0.68799615E-01     0   453    12     0     0     0
   412  0.10995330E-01     0   456    11     0     0     0
   412  0.13904043E+00     0   457    11     0     0     0
   3
   413  0.30159425E-01     0   450     1     0     0     0
   413  0.18472946E-03     0   451     1     0     0     0
   413  0.96965587E+00     0   449     1     0     0     0
   3
   414  0.11289439E+00     0   450     2     0     0     0
   414  0.68449194E-03     0   451     2     0     0     0
   414  0.88642114E+00     0   449     2     0     0     0
   3
   415  0.30159401E-01     0   450     3     0     0     0
   415  0.18472936E-03     0   451     3     0     0     0
   415  0.96965587E+00     0   449     3     0     0     0
   3
   416  0.11290098E+00     0   450     4     0     0     0
   416  0.68451813E-03     0   451     4     0     0     0
   416  0.88641447E+00     0   449     4     0     0     0
   7
   417  0.32630158E-02     0   450     5     0     0     0
   417  0.45219041E-01     0   451     5     0     0     0
   417  0.66531077E-03     0   452     5     0     0     0
   417  0.61483295E-02     0   453     5     0     0     0
   417  0.68793184E+00     0   449     5     0     0     0
   417  0.10068135E+00     0   456     6     0     0     0
   417  0.15609115E+00     0   457     6     0     0     0
   7
   418  0.68632567E+00     0   449     6     0     0     0
   418  0.98705597E-01     0   454     5     0     0     0
   418  0.80309566E-02     0   455     5     0     0     0
   418  0.14704886E-02     0   450     6     0     0     0
   418  0.53738207E-01     0   451     6     0     0     0
   418  0.76966710E-01     0   452     6     0     0     0
   418  0.74762382E-01     0   453     6     0     0     0
   3
   419  0.30159425E-01     0   450     7     0     0     0
   419  0.18472946E-03     0   451     7     0     0     0
   419  0.96965587E+00     0   449     7     0     0     0
   3
   420  0.11289439E+00     0   450     8     0     0     0
   420  0.68449194E-03     0   451     8     0     0     0
   420  0.88642114E+00     0   449     8     0     0     0
   3
   421  0.30159401E-01     0   450     9     0     0     0
   421  0.18472936E-03     0   451     9     0     0     0
   421  0.96965587E+00     0   449     9     0     0     0
   3
   422  0.11290098E+00     0   450    10     0     0     0
   422  0.68451813E-03     0   451    10     0     0     0
   422  0.88641447E+00     0   449    10     0     0     0
   7
   423  0.32630158E-02     0   450    11     0     0     0
   423  0.45219041E-01     0   451    11     0     0     0
   423  0.66531077E-03     0   452    11     0     0     0
   423  0.61483295E-02     0   453    11     0     0     0
   423  0.68793184E+00     0   449    11     0     0     0
   423  0.10068135E+00     0   454    12     0     0     0
   423  0.15609115E+00     0   455    12     0     0     0
   7
   424  0.68632567E+00     0   449    12     0     0     0
   424  0.98705597E-01     0   456    11     0     0     0
   424  0.80309566E-02     0   457    11     0     0     0
   424  0.14704886E-02     0   450    12     0     0     0
   424  0.53738207E-01     0   451    12     0     0     0
   424  0.76966710E-01     0   452    12     0     0     0
   424  0.74762382E-01     0   453    12     0     0     0
   1
   425  0.10000000E+01     0   450   121     0     0     0
   1
   426  0.10000000E+01     0   450   122     0     0     0
   1
   427  0.10000000E+01     0   450   123     0     0     0
   1
   428  0.10000000E+01     0   450   124     0     0     0
   6
   429  0.96284616E+00     0   450   125     0     0     0
   429  0.11977215E-01     0   451   125     0     0     0
   429  0.44403290E-02     0   452   125     0     0     0
   429  0.14442636E-01     0   453   125     0     0     0
   429  0.91128086E-03     0   456   126     0     0     0
   429  0.53824522E-02     0   457   126     0     0     0
   6
   430  0.11313725E+00     0   450   126     0     0     0
   430  0.23714343E+00     0   451   126     0     0     0
   430  0.18013116E-02     0   452   126     0     0     0
   430  0.41514836E-01     0   453   126     0     0     0
   430  0.56306112E+00     0   454   125     0     0     0
   430  0.43342069E-01     0   455   125     0     0     0
   1
   431  0.10000000E+01     0   450   127     0     0     0
   1
   432  0.10000000E+01     0   450   128     0     0     0
   1
   433  0.10000000E+01     0   450   129     0     0     0
   1
   434  0.10000000E+01     0   450   130     0     0     0
   6
   435  0.96284616E+00     0   450   131     0     0     0
   435  0.11977215E-01     0   451   131     0     0     0
   435  0.44403290E-02     0   452   131     0     0     0
   435  0.14442636E-01     0   453   131     0     0     0
   435  0.91128086E-03     0   454   132     0     0     0
   435  0.53824522E-02     0   455   132     0     0     0
   6
   436  0.11313725E+00     0   450   132     0     0     0
   436  0.23714343E+00     0   451   132     0     0     0
   436  0.18013116E-02     0   452   132     0     0     0
   436  0.41514836E-01     0   453   132     0     0     0
   436  0.56306112E+00     0   456   131     0     0     0
   436  0.43342069E-01     0   457   131     0     0     0
   1
   437  0.10000000E+01     0   450   121     0     0     0
   0
   1
   439  0.10000000E+01     0   450   123     0     0     0
   0
   6
   441  0.69459677E-01     0   450   125     0     0     0
   441  0.30593351E+00     0   451   125     0     0     0
   441  0.15565857E-02     0   452   125     0     0     0
   441  0.19919952E-01     0   453   125     0     0     0
   441  0.52121079E+00     0   456   126     0     0     0
   441  0.81919506E-01     0   457   126     0     0     0
   0
   1
   443  0.10000000E+01     0   450   127     0     0     0
   0
   1
   445  0.10000000E+01     0   450   129     0     0     0
   0
   6
   447  0.69459677E-01     0   450   131     0     0     0
   447  0.30593351E+00     0   451   131     0     0     0
   447  0.15565857E-02     0   452   131     0     0     0
   447  0.19919952E-01     0   453   131     0     0     0
   447  0.52121079E+00     0   454   132     0     0     0
   447  0.81919506E-01     0   455   132     0     0     0
   0
  13
   449  0.15804054E-01     0   454     1     8     0     0
   449  0.15804054E-01     0   456     2     7     0     0
   449  0.15803665E-01     0   454     3    10     0     0
   449  0.15803665E-01     0   456     4     9     0     0
   449  0.33856875E+00     0   450     2     8     0     0
   449  0.11529527E+00     0   450     1     7     0     0
   449  0.11529517E+00     0   450     3     9     0     0
   449  0.33855671E+00     0   450     4    10     0     0
   449  0.16204074E-04     0   450     5    11     0     0
   449  0.80711329E-02     0   451     2     8     0     0
   449  0.64552883E-02     0   451     1     7     0     0
   449  0.64552794E-02     0   451     3     9     0     0
   449  0.80707697E-02     0   451     4    10     0     0
   0
  13
   451  0.89282903E-03     0   450   200     0     0     0
   451  0.11201526E+00     0   425   127     0     0     0
   451  0.11201526E+00     0   431   121     0     0     0
   451  0.11201495E+00     0   427   129     0     0     0
   451  0.11201495E+00     0   433   123     0     0     0
   451  0.15839293E-02     0   437   127     0     0     0
   451  0.15839293E-02     0   443   121     0     0     0
   451  0.15839249E-02     0   439   129     0     0     0
   451  0.15839249E-02     0   445   123     0     0     0
   451  0.13617776E+00     0   426   128     0     0     0
   451  0.13617776E+00     0   432   122     0     0     0
   451  0.13617776E+00     0   428   130     0     0     0
   451  0.13617776E+00     0   434   124     0     0     0
  30
   452  0.30253538E+00     0   454   199     0     0     0
   452  0.30253538E+00     0   456   198     0     0     0
   452  0.12894973E+00     0   450   200     0     0     0
   452  0.23937884E+00     0   451   200     0     0     0
   452  0.10790104E-01     0   450   203     0     0     0
   452  0.62506380E-02     0   451   203     0     0     0
   452  0.13738497E-03     0   402     8     0     0     0
   452  0.13738497E-03     0   408     2     0     0     0
   452  0.17321479E-03     0   401     7     0     0     0
   452  0.17321479E-03     0   407     1     0     0     0
   452  0.17321306E-03     0   403     9     0     0     0
   452  0.17321306E-03     0   409     3     0     0     0
   452  0.13734031E-03     0   404    10     0     0     0
   452  0.13734031E-03     0   410     4     0     0     0
   452  0.38388724E-04     0   414     8     0     0     0
   452  0.38388724E-04     0   420     2     0     0     0
   452  0.38375485E-04     0   416    10     0     0     0
   452  0.38375485E-04     0   422     4     0     0     0
   452  0.28848607E-03     0   425   127     0     0     0
   452  0.28848607E-03     0   431   121     0     0     0
   452  0.28848602E-03     0   427   129     0     0     0
   452  0.28848602E-03     0   433   123     0     0     0
   452  0.36332454E-03     0   437   127     0     0     0
   452  0.36332454E-03     0   443   121     0     0     0
   452  0.36332445E-03     0   439   129     0     0     0
   452  0.36332445E-03     0   445   123     0     0     0
   452  0.13892858E-02     0   426   128     0     0     0
   452  0.13892858E-02     0   432   122     0     0     0
   452  0.13892858E-02     0   428   130     0     0     0
   452  0.13892858E-02     0   434   124     0     0     0
  34
   453  0.26979282E+00     0   454   199     0     0     0
   453  0.26979282E+00     0   456   198     0     0     0
   453  0.99445814E-02     0   450   200     0     0     0
   453  0.80778347E-02     0   451   200     0     0     0
   453  0.76519556E-01     0   450   203     0     0     0
   453  0.14891300E+00     0   451   203     0     0     0
   453  0.64279702E-02     0   402     8     0     0     0
   453  0.64279702E-02     0   408     2     0     0     0
   453  0.70559895E-02     0   401     7     0     0     0
   453  0.70559895E-02     0   407     1     0     0     0
   453  0.70559541E-02     0   403     9     0     0     0
   453  0.70559541E-02     0   409     3     0     0     0
   453  0.64269011E-02     0   404    10     0     0     0
   453  0.64269011E-02     0   410     4     0     0     0
   453  0.47369854E-03     0   414     8     0     0     0
   453  0.47369854E-03     0   420     2     0     0     0
   453  0.11267701E-03     0   413     7     0     0     0
   453  0.11267701E-03     0   419     1     0     0     0
   453  0.11267655E-03     0   415     9     0     0     0
   453  0.11267655E-03     0   421     3     0     0     0
   453  0.47361653E-03     0   416    10     0     0     0
   453  0.47361653E-03     0   422     4     0     0     0
   453  0.11274467E-01     0   425   127     0     0     0
   453  0.11274467E-01     0   431   121     0     0     0
   453  0.11274465E-01     0   427   129     0     0     0
   453  0.11274465E-01     0   433   123     0     0     0
   453  0.26214158E-02     0   437   127     0     0     0
   453  0.26214158E-02     0   443   121     0     0     0
   453  0.26214153E-02     0   439   129     0     0     0
   453  0.26214153E-02     0   445   123     0     0     0
   453  0.26274174E-01     0   426   128     0     0     0
   453  0.26274174E-01     0   432   122     0     0     0
   453  0.26274174E-01     0   428   130     0     0     0
   453  0.26274174E-01     0   434   124     0     0     0
   5
   454  0.13721421E-01     0   450   198     0     0     0
   454  0.31105861E+00     0   426   127     0     0     0
   454  0.31105828E+00     0   428   129     0     0     0
   454  0.18208088E+00     0   431   122     0     0     0
   454  0.18208069E+00     0   433   124     0     0     0
  12
   455  0.54913525E-01     0   450   198     0     0     0
   455  0.29999679E+00     0   451   198     0     0     0
   455  0.10097427E-01     0   402     7     0     0     0
   455  0.16856736E-01     0   407     2     0     0     0
   455  0.10096868E-01     0   404     9     0     0     0
   455  0.19990755E-01     0   409     4     0     0     0
   455  0.26159564E-01     0   426   127     0     0     0
   455  0.26159564E-01     0   428   129     0     0     0
   455  0.48803993E-01     0   431   122     0     0     0
   455  0.48803978E-01     0   433   124     0     0     0
   455  0.25851089E+00     0   454   200     0     0     0
   455  0.17960994E+00     0   454   203     0     0     0
   5
   456  0.13721421E-01     0   450   199     0     0     0
   456  0.31105861E+00     0   432   121     0     0     0
   456  0.31105828E+00     0   434   123     0     0     0
   456  0.18208088E+00     0   425   128     0     0     0
   456  0.18208069E+00     0   427   130     0     0     0
  12
   457  0.54913525E-01     0   450   199     0     0     0
   457  0.29999679E+00     0   451   199     0     0     0
   457  0.10097427E-01     0   408     1     0     0     0
   457  0.16856736E-01     0   401     8     0     0     0
   457  0.10096868E-01     0   410     3     0     0     0
   457  0.19990755E-01     0   403    10     0     0     0
   457  0.26159564E-01     0   432   121     0     0     0
   457  0.26159564E-01     0   434   123     0     0     0
   457  0.48803993E-01     0   425   128     0     0     0
   457  0.48803978E-01     0   427   130     0     0     0
   457  0.25851089E+00     0   456   200     0     0     0
   457  0.17960994E+00     0   456   203     0     0     0
  28
   203  0.21258148E-03     0   123   129     0     0     0
   203  0.60785942E-01     0   125   131     0     0     0
   203  0.25561829E-02     0     3     9     0     0     0
   203  0.84671891E+00     0     5    11     0     0     0
   203  0.37053071E-01     0     4    10     0     0     0
   203  0.15230456E-02     0    59    59     0     0     0
   203  0.34190141E-01     0    13    13     0     0     0
   203  0.90886577E-03     0   198   121   128     0     0
   203  0.90886577E-03     0   198   123   130     0     0
   203  0.90886577E-03     0   198   125   132     0     0
   203  0.27265972E-02     0   198     8     1     0     0
   203  0.27265972E-02     0   198    10     3     0     0
   203  0.90886577E-03     0   199   127   122     0     0
   203  0.90886577E-03     0   199   129   124     0     0
   203  0.90886577E-03     0   199   131   126     0     0
   203  0.27265972E-02     0   199     2     7     0     0
   203  0.27265972E-02     0   199     4     9     0     0
   203  0.41078336E-04     0   200   122   128     0     0
   203  0.41078336E-04     0   200   124   130     0     0
   203  0.41078336E-04     0   200   126   132     0     0
   203  0.20674315E-04     0   200   121   127     0     0
   203  0.20674315E-04     0   200   123   129     0     0
   203  0.20674315E-04     0   200   125   131     0     0
   203  0.70828450E-04     0   200     2     8     0     0
   203  0.70828450E-04     0   200     4    10     0     0
   203  0.91244496E-04     0   200     1     7     0     0
   203  0.91244496E-04     0   200     3     9     0     0
   203  0.91244496E-04     0   200     5    11     0     0
  37
   204  0.10174539E-04     0   123   129     0     0     0
   204  0.29140902E-02     0   125   131     0     0     0
   204  0.11927455E-03     0     3     9     0     0     0
   204  0.29409569E-01     0     5    11     0     0     0
   204  0.24660054E+00     0     6    12     0     0     0
   204  0.13632338E-03     0    13    13     0     0     0
   204  0.61674812E-03     0   198   199     0     0     0
   204  0.31313999E-03     0   200   200     0     0     0
   204  0.27849788E-02     0   450   450     0     0     0
   204  0.13581313E-01     0   450   451     0     0     0
   204  0.68035565E-01     0   450   452     0     0     0
   204  0.10023334E-01     0   450   453     0     0     0
   204  0.15442569E-01     0   451   451     0     0     0
   204  0.13810067E+00     0   451   452     0     0     0
   204  0.13717616E-01     0   451   453     0     0     0
   204  0.27974250E-03     0   452   452     0     0     0
   204  0.18446783E-01     0   452   453     0     0     0
   204  0.74792205E-03     0   453   453     0     0     0
   204  0.41024864E-01     0   454   456     0     0     0
   204  0.60079532E-03     0   455   457     0     0     0
   204  0.19552119E+00     0   454   457     0     0     0
   204  0.19552119E+00     0   456   455     0     0     0
   204  0.26180642E-02     0   203   203     0     0     0
   204  0.11997572E-03     0   425   431     0     0     0
   204  0.89908419E-04     0   437   443     0     0     0
   204  0.11996583E-03     0   427   433     0     0     0
   204  0.89899877E-04     0   439   445     0     0     0
   204  0.40122270E-03     0   402   408     0     0     0
   204  0.79896694E-04     0   414   420     0     0     0
   204  0.40094924E-03     0   404   410     0     0     0
   204  0.79776022E-04     0   416   422     0     0     0
   204  0.58321765E-03     0   401   407     0     0     0
   204  0.19794437E-04     0   413   419     0     0     0
   204  0.58332650E-03     0   403   409     0     0     0
   204  0.19774225E-04     0   415   421     0     0     0
   204  0.42306655E-03     0   426   432     0     0     0
   204  0.42306655E-03     0   428   434     0     0     0
  23
   205  0.10353599E-04     0   123   129     0     0     0
   205  0.29654107E-02     0   125   131     0     0     0
   205  0.12138134E-03     0     3     9     0     0     0
   205  0.29957484E-01     0     5    11     0     0     0
   205  0.26814067E+00     0     6    12     0     0     0
   205  0.14823704E-03     0    13    13     0     0     0
   205  0.53747394E-02     0   450   450     0     0     0
   205  0.31005338E-01     0   450   451     0     0     0
   205  0.16311841E-01     0   450   452     0     0     0
   205  0.46717018E-01     0   450   453     0     0     0
   205  0.42830732E-01     0   451   451     0     0     0
   205  0.24382010E-01     0   451   452     0     0     0
   205  0.86125270E-01     0   451   453     0     0     0
   205  0.50856301E-03     0   452   452     0     0     0
   205  0.11973677E-02     0   452   453     0     0     0
   205  0.20418528E-01     0   453   453     0     0     0
   205  0.11073726E+00     0   454   456     0     0     0
   205  0.24977831E-01     0   455   457     0     0     0
   205  0.14370970E+00     0   454   457     0     0     0
   205  0.14370970E+00     0   456   455     0     0     0
   205  0.61103917E-03     0   203   200     0     0     0
   205  0.19692634E-04     0   404   422     0     0     0
   205  0.19692634E-04     0   416   410     0     0     0
  17
   206  0.10440855E-04     0   124   129     0     0     0
   206  0.29904023E-02     0   126   131     0     0     0
   206  0.11740647E-03     0     4     9     0     0     0
   206  0.26884511E+00     0     6    11     0     0     0
   206  0.38264796E-01     0   454   450     0     0     0
   206  0.58649009E-03     0   454   451     0     0     0
   206  0.19921272E+00     0   454   452     0     0     0
   206  0.19657089E+00     0   454   453     0     0     0
   206  0.33724856E-01     0   455   450     0     0     0
   206  0.24236006E+00     0   455   451     0     0     0
   206  0.12889608E-01     0   455   452     0     0     0
   206  0.84522867E-03     0   455   453     0     0     0
   206  0.62650710E-03     0   203   198     0     0     0
   206  0.98247966E-03     0   402   407     0     0     0
   206  0.98207861E-03     0   404   409     0     0     0
   206  0.49552997E-03     0   431   426     0     0     0
   206  0.49551553E-03     0   433   428     0     0     0
  17
   207  0.10440855E-04     0   130   123     0     0     0
   207  0.29904023E-02     0   132   125     0     0     0
   207  0.11740647E-03     0    10     3     0     0     0
   207  0.26884511E+00     0    12     5     0     0     0
   207  0.38264796E-01     0   456   450     0     0     0
   207  0.58649009E-03     0   456   451     0     0     0
   207  0.19921272E+00     0   456   452     0     0     0
   207  0.19657089E+00     0   456   453     0     0     0
   207  0.33724856E-01     0   457   450     0     0     0
   207  0.24236006E+00     0   457   451     0     0     0
   207  0.12889608E-01     0   457   452     0     0     0
   207  0.84522867E-03     0   457   453     0     0     0
   207  0.62650710E-03     0   203   199     0     0     0
   207  0.98247966E-03     0   408   401     0     0     0
   207  0.98207861E-03     0   410   403     0     0     0
   207  0.49552997E-03     0   425   432     0     0     0
   207  0.49551553E-03     0   427   434     0     0     0
   0
   5
     6  0.33333334E+00   100     2     7     5     0     0
     6  0.33333334E+00   100     4     9     5     0     0
     6  0.11111111E+00   100   122   127     5     0     0
     6  0.11111111E+00   100   124   129     5     0     0
     6  0.11111111E+00   100   126   131     5     0     0
   5
    12  0.33333334E+00   100     8     1    11     0     0
    12  0.33333334E+00   100    10     3    11     0     0
    12  0.11111111E+00   100   128   121    11     0     0
    12  0.11111111E+00   100   130   123    11     0     0
    12  0.11111111E+00   100   132   125    11     0     0
      4.00000000     -0.24965078
      0.98706847     -0.06605358      0.12859787     -0.06924690
     -0.10865485     -0.94472611      0.25257987     -0.17857808
     -0.03770870      0.05766165      0.70118207      0.70964575
     -0.11165939      0.31591865      0.65422451     -0.67802465
     -0.96393776      0.26612777     -0.26612777     -0.96393776
     -0.92723203      0.37448734     -0.37448734     -0.92723203
      1.57075512     -1.57079613     -1.57079506
    112.50000000   1800.00000000   1800.00000000
    450.00000000
    T
