  65
  401   2000.8307    0.26236E-25
  402   1999.3210    0.26138E-25
  403   2000.8307    0.26236E-25
  404   1999.3215    0.26138E-25
  405   1999.9324    0.51710E-25
  406   1828.7444    0.13901E-25
  407   2000.8307    0.26236E-25
  408   1999.3210    0.26138E-25
  409   2000.8307    0.26236E-25
  410   1999.3215    0.26138E-25
  411   1999.9324    0.51710E-25
  412   1828.7444    0.13901E-25
  413   2000.1520    0.58579E-24
  414   1999.6959    0.14648E-24
  415   2000.1520    0.58579E-24
  416   1999.6964    0.14648E-24
  417   2001.0538    0.13879E-25
  418   2165.5852    0.80586E-26
  419   2000.1520    0.58579E-24
  420   1999.6959    0.14648E-24
  421   2000.1520    0.58579E-24
  422   1999.6964    0.14648E-24
  423   2001.0538    0.13879E-25
  424   2165.5852    0.80586E-26
  425   2000.5267    0.24063E-25
  426   1999.0170    0.24020E-25
  427   2000.5267    0.24063E-25
  428   1999.0170    0.24020E-25
  429     83.5987    0.18574E-22
  430   1999.0170    0.23893E-25
  431   2000.5267    0.24063E-25
  432   1999.0170    0.24020E-25
  433   2000.5267    0.24063E-25
  434   1999.0170    0.24020E-25
  435     83.5987    0.18574E-22
  436   1999.0170    0.23893E-25
  437     83.6286    0.18879E-22
  438      0.0000    0.10000E+31
  439     83.6287    0.18879E-22
  440      0.0000    0.10000E+31
  441   2000.5475    0.23935E-25
  442      0.0000    0.10000E+31
  443     83.6286    0.18879E-22
  444      0.0000    0.10000E+31
  445     83.6287    0.18879E-22
  446      0.0000    0.10000E+31
  447   2000.5475    0.23935E-25
  448      0.0000    0.10000E+31
  449   2000.0000    0.19503E-24
  450     53.7193    0.10000E+31
  451    113.5258    0.25801E-23
  452   -121.8007    0.65252E-22
  453    214.5557    0.84847E-24
  454     72.8084    0.24733E-18
  455    212.9194    0.12739E-23
  456     72.8084    0.24733E-18
  457    212.9194    0.12739E-23
  203    119.0149    0.46276E-22
  204    504.3801    0.10801E-24
  205    500.0000    0.10790E-24
  206    509.4134    0.11161E-24
  207    509.4134    0.11161E-24
  458      0.0000    0.10000E+31
    6    172.5000    0.57395E-24
   12    172.5000    0.57395E-24
   6
   401  0.75782821E-01     0   450     1     0     0     0
   401  0.28180014E-01     0   451     1     0     0     0
   401  0.13378542E-01     0   452     1     0     0     0
   401  0.22399437E+00     0   453     1     0     0     0
   401  0.11957084E+00     0   456     2     0     0     0
   401  0.53909349E+00     0   457     2     0     0     0
   6
   402  0.29411903E-01     0   450     2     0     0     0
   402  0.11882162E+00     0   451     2     0     0     0
   402  0.79614138E-02     0   452     2     0     0     0
   402  0.18403774E+00     0   453     2     0     0     0
   402  0.32279465E+00     0   454     1     0     0     0
   402  0.33697262E+00     0   455     1     0     0     0
   6
   403  0.75782865E-01     0   450     3     0     0     0
   403  0.28180031E-01     0   451     3     0     0     0
   403  0.13378550E-01     0   452     3     0     0     0
   403  0.22399451E+00     0   453     3     0     0     0
   403  0.11957079E+00     0   456     4     0     0     0
   403  0.53909332E+00     0   457     4     0     0     0
   6
   404  0.29411886E-01     0   450     4     0     0     0
   404  0.11882153E+00     0   451     4     0     0     0
   404  0.79614092E-02     0   452     4     0     0     0
   404  0.18403763E+00     0   453     4     0     0     0
   404  0.32279480E+00     0   454     3     0     0     0
   404  0.33697277E+00     0   455     3     0     0     0
   7
   405  0.10430915E+00     0   450     5     0     0     0
   405  0.61778720E-01     0   451     5     0     0     0
   405  0.68461720E-03     0   452     5     0     0     0
   405  0.62333547E-01     0   453     5     0     0     0
   405  0.31303471E+00     0   456     6     0     0     0
   405  0.33784139E+00     0   457     6     0     0     0
   405  0.12001782E+00     0   199   406     0     0     0
   6
   406  0.23037842E-01     0   450     6     0     0     0
   406  0.82936309E-01     0   451     6     0     0     0
   406  0.20994255E+00     0   452     6     0     0     0
   406  0.28373498E+00     0   453     6     0     0     0
   406  0.83130253E-02     0   454     5     0     0     0
   406  0.39203525E+00     0   455     5     0     0     0
   6
   407  0.75782821E-01     0   450     7     0     0     0
   407  0.28180014E-01     0   451     7     0     0     0
   407  0.13378542E-01     0   452     7     0     0     0
   407  0.22399437E+00     0   453     7     0     0     0
   407  0.11957084E+00     0   454     8     0     0     0
   407  0.53909349E+00     0   455     8     0     0     0
   6
   408  0.29411903E-01     0   450     8     0     0     0
   408  0.11882162E+00     0   451     8     0     0     0
   408  0.79614138E-02     0   452     8     0     0     0
   408  0.18403774E+00     0   453     8     0     0     0
   408  0.32279465E+00     0   456     7     0     0     0
   408  0.33697262E+00     0   457     7     0     0     0
   6
   409  0.75782865E-01     0   450     9     0     0     0
   409  0.28180031E-01     0   451     9     0     0     0
   409  0.13378550E-01     0   452     9     0     0     0
   409  0.22399451E+00     0   453     9     0     0     0
   409  0.11957079E+00     0   454    10     0     0     0
   409  0.53909332E+00     0   455    10     0     0     0
   6
   410  0.29411886E-01     0   450    10     0     0     0
   410  0.11882153E+00     0   451    10     0     0     0
   410  0.79614092E-02     0   452    10     0     0     0
   410  0.18403763E+00     0   453    10     0     0     0
   410  0.32279480E+00     0   456     9     0     0     0
   410  0.33697277E+00     0   457     9     0     0     0
   7
   411  0.10430915E+00     0   450    11     0     0     0
   411  0.61778720E-01     0   451    11     0     0     0
   411  0.68461720E-03     0   452    11     0     0     0
   411  0.62333547E-01     0   453    11     0     0     0
   411  0.31303471E+00     0   454    12     0     0     0
   411  0.33784139E+00     0   455    12     0     0     0
   411  0.12001782E+00     0   198   412     0     0     0
   6
   412  0.23037842E-01     0   450    12     0     0     0
   412  0.82936309E-01     0   451    12     0     0     0
   412  0.20994255E+00     0   452    12     0     0     0
   412  0.28373498E+00     0   453    12     0     0     0
   412  0.83130253E-02     0   456    11     0     0     0
   412  0.39203525E+00     0   457    11     0     0     0
   4
   413  0.23865280E+00     0   450     1     0     0     0
   413  0.70410508E+00     0   451     1     0     0     0
   413  0.15366310E-01     0   452     1     0     0     0
   413  0.41875791E-01     0   453     1     0     0     0
   4
   414  0.23865330E+00     0   450     2     0     0     0
   414  0.70410496E+00     0   451     2     0     0     0
   414  0.15366300E-01     0   452     2     0     0     0
   414  0.41875456E-01     0   453     2     0     0     0
   4
   415  0.23865280E+00     0   450     3     0     0     0
   415  0.70410508E+00     0   451     3     0     0     0
   415  0.15366310E-01     0   452     3     0     0     0
   415  0.41875791E-01     0   453     3     0     0     0
   4
   416  0.23865326E+00     0   450     4     0     0     0
   416  0.70410496E+00     0   451     4     0     0     0
   416  0.15366299E-01     0   452     4     0     0     0
   416  0.41875456E-01     0   453     4     0     0     0
   7
   417  0.24248917E-01     0   450     5     0     0     0
   417  0.15700161E-01     0   451     5     0     0     0
   417  0.13157397E-01     0   452     5     0     0     0
   417  0.10411271E+00     0   453     5     0     0     0
   417  0.25420690E+00     0   456     6     0     0     0
   417  0.45127168E+00     0   457     6     0     0     0
   417  0.13730220E+00     0   199   406     0     0     0
   9
   418  0.27924994E+00     0   454     5     0     0     0
   418  0.24722456E-02     0   455     5     0     0     0
   418  0.21573931E+00     0   200   406     0     0     0
   418  0.16661098E-01     0   198   405     0     0     0
   418  0.67538708E-01     0   198   417     0     0     0
   418  0.11684828E+00     0   450     6     0     0     0
   418  0.56404866E-01     0   451     6     0     0     0
   418  0.21806337E+00     0   452     6     0     0     0
   418  0.27022231E-01     0   453     6     0     0     0
   4
   419  0.23865280E+00     0   450     7     0     0     0
   419  0.70410508E+00     0   451     7     0     0     0
   419  0.15366310E-01     0   452     7     0     0     0
   419  0.41875791E-01     0   453     7     0     0     0
   4
   420  0.23865330E+00     0   450     8     0     0     0
   420  0.70410496E+00     0   451     8     0     0     0
   420  0.15366300E-01     0   452     8     0     0     0
   420  0.41875456E-01     0   453     8     0     0     0
   4
   421  0.23865280E+00     0   450     9     0     0     0
   421  0.70410508E+00     0   451     9     0     0     0
   421  0.15366310E-01     0   452     9     0     0     0
   421  0.41875791E-01     0   453     9     0     0     0
   4
   422  0.23865326E+00     0   450    10     0     0     0
   422  0.70410496E+00     0   451    10     0     0     0
   422  0.15366299E-01     0   452    10     0     0     0
   422  0.41875456E-01     0   453    10     0     0     0
   7
   423  0.24248917E-01     0   450    11     0     0     0
   423  0.15700161E-01     0   451    11     0     0     0
   423  0.13157397E-01     0   452    11     0     0     0
   423  0.10411271E+00     0   453    11     0     0     0
   423  0.25420690E+00     0   454    12     0     0     0
   423  0.45127168E+00     0   455    12     0     0     0
   423  0.13730220E+00     0   198   412     0     0     0
   9
   424  0.27924994E+00     0   456    11     0     0     0
   424  0.24722456E-02     0   457    11     0     0     0
   424  0.21573931E+00     0   200   412     0     0     0
   424  0.16661098E-01     0   199   411     0     0     0
   424  0.67538708E-01     0   199   423     0     0     0
   424  0.11684828E+00     0   450    12     0     0     0
   424  0.56404866E-01     0   451    12     0     0     0
   424  0.21806337E+00     0   452    12     0     0     0
   424  0.27022231E-01     0   453    12     0     0     0
   6
   425  0.43005664E-02     0   450   121     0     0     0
   425  0.25092366E+00     0   451   121     0     0     0
   425  0.36616041E-02     0   452   121     0     0     0
   425  0.13709581E+00     0   453   121     0     0     0
   425  0.10965121E+00     0   456   122     0     0     0
   425  0.49436718E+00     0   457   122     0     0     0
   6
   426  0.13117684E+00     0   450   122     0     0     0
   426  0.86808621E-04     0   451   122     0     0     0
   426  0.18419348E-01     0   452   122     0     0     0
   426  0.24410310E+00     0   453   122     0     0     0
   426  0.29659432E+00     0   454   121     0     0     0
   426  0.30961958E+00     0   455   121     0     0     0
   6
   427  0.43005664E-02     0   450   123     0     0     0
   427  0.25092366E+00     0   451   123     0     0     0
   427  0.36616041E-02     0   452   123     0     0     0
   427  0.13709581E+00     0   453   123     0     0     0
   427  0.10965121E+00     0   456   124     0     0     0
   427  0.49436718E+00     0   457   124     0     0     0
   6
   428  0.13117684E+00     0   450   124     0     0     0
   428  0.86808621E-04     0   451   124     0     0     0
   428  0.18419348E-01     0   452   124     0     0     0
   428  0.24410310E+00     0   453   124     0     0     0
   428  0.29659432E+00     0   454   123     0     0     0
   428  0.30961958E+00     0   455   123     0     0     0
   2
   429  0.99167788E+00     0   450   125     0     0     0
   429  0.83221439E-02     0   456   126     0     0     0
   7
   430  0.13048007E+00     0   450   126     0     0     0
   430  0.86347514E-04     0   451   126     0     0     0
   430  0.18321509E-01     0   452   126     0     0     0
   430  0.24280648E+00     0   453   126     0     0     0
   430  0.29937923E+00     0   454   125     0     0     0
   430  0.30891094E+00     0   455   125     0     0     0
   430  0.15542475E-04     0   198   429     0     0     0
   6
   431  0.43005664E-02     0   450   127     0     0     0
   431  0.25092366E+00     0   451   127     0     0     0
   431  0.36616041E-02     0   452   127     0     0     0
   431  0.13709581E+00     0   453   127     0     0     0
   431  0.10965121E+00     0   454   128     0     0     0
   431  0.49436718E+00     0   455   128     0     0     0
   6
   432  0.13117684E+00     0   450   128     0     0     0
   432  0.86808621E-04     0   451   128     0     0     0
   432  0.18419348E-01     0   452   128     0     0     0
   432  0.24410310E+00     0   453   128     0     0     0
   432  0.29659432E+00     0   456   127     0     0     0
   432  0.30961958E+00     0   457   127     0     0     0
   6
   433  0.43005664E-02     0   450   129     0     0     0
   433  0.25092366E+00     0   451   129     0     0     0
   433  0.36616041E-02     0   452   129     0     0     0
   433  0.13709581E+00     0   453   129     0     0     0
   433  0.10965121E+00     0   454   130     0     0     0
   433  0.49436718E+00     0   455   130     0     0     0
   6
   434  0.13117684E+00     0   450   130     0     0     0
   434  0.86808621E-04     0   451   130     0     0     0
   434  0.18419348E-01     0   452   130     0     0     0
   434  0.24410310E+00     0   453   130     0     0     0
   434  0.29659432E+00     0   456   129     0     0     0
   434  0.30961958E+00     0   457   129     0     0     0
   2
   435  0.99167788E+00     0   450   131     0     0     0
   435  0.83221439E-02     0   454   132     0     0     0
   7
   436  0.13048007E+00     0   450   132     0     0     0
   436  0.86347514E-04     0   451   132     0     0     0
   436  0.18321509E-01     0   452   132     0     0     0
   436  0.24280648E+00     0   453   132     0     0     0
   436  0.29937923E+00     0   456   131     0     0     0
   436  0.30891094E+00     0   457   131     0     0     0
   436  0.15542475E-04     0   199   435     0     0     0
   1
   437  0.10000000E+01     0   450   121     0     0     0
   0
   1
   439  0.10000000E+01     0   450   123     0     0     0
   0
   6
   441  0.66606291E-02     0   450   125     0     0     0
   441  0.24984391E+00     0   451   125     0     0     0
   441  0.58136168E-02     0   452   125     0     0     0
   441  0.13687037E+00     0   453   125     0     0     0
   441  0.10905644E+00     0   456   126     0     0     0
   441  0.49175504E+00     0   457   126     0     0     0
   0
   1
   443  0.10000000E+01     0   450   127     0     0     0
   0
   1
   445  0.10000000E+01     0   450   129     0     0     0
   0
   6
   447  0.66606291E-02     0   450   131     0     0     0
   447  0.24984391E+00     0   451   131     0     0     0
   447  0.58136168E-02     0   452   131     0     0     0
   447  0.13687037E+00     0   453   131     0     0     0
   447  0.10905644E+00     0   454   132     0     0     0
   447  0.49175504E+00     0   455   132     0     0     0
   0
  32
   449  0.14876630E-02     0   454     1     8     0     0
   449  0.14876630E-02     0   456     2     7     0     0
   449  0.14876630E-02     0   454     3    10     0     0
   449  0.14876630E-02     0   456     4     9     0     0
   449  0.15955381E-01     0   454     5    12     0     0
   449  0.15955381E-01     0   456     6    11     0     0
   449  0.65765455E-02     0   455     1     8     0     0
   449  0.65765455E-02     0   457     2     7     0     0
   449  0.65765455E-02     0   455     3    10     0     0
   449  0.65765455E-02     0   457     4     9     0     0
   449  0.18544099E+00     0   455     5    12     0     0
   449  0.18544099E+00     0   457     6    11     0     0
   449  0.34267362E-03     0   450    13     0     0     0
   449  0.21995832E-02     0   450     1     7     0     0
   449  0.21995832E-02     0   450     3     9     0     0
   449  0.25174387E-02     0   450     5    11     0     0
   449  0.22872107E-01     0   450     6    12     0     0
   449  0.79275305E-04     0   451    13     0     0     0
   449  0.15505564E-02     0   451     1     7     0     0
   449  0.15505564E-02     0   451     3     9     0     0
   449  0.15735724E-02     0   451     5    11     0     0
   449  0.71257718E-01     0   451     6    12     0     0
   449  0.94612228E-03     0   452    13     0     0     0
   449  0.33388974E-03     0   452     1     7     0     0
   449  0.33388974E-03     0   452     3     9     0     0
   449  0.70426555E-03     0   452     5    11     0     0
   449  0.18955854E+00     0   452     6    12     0     0
   449  0.28486361E-03     0   453    13     0     0     0
   449  0.59002722E-02     0   453     1     7     0     0
   449  0.59002722E-02     0   453     3     9     0     0
   449  0.59523564E-02     0   453     5    11     0     0
   449  0.24889283E+00     0   453     6    12     0     0
   0
  16
   451  0.74534895E-04     0   456     2     7     0     0
   451  0.24844967E-04     0   456   122   127     0     0
   451  0.24844967E-04     0   456   124   129     0     0
   451  0.74534895E-04     0   454     1     8     0     0
   451  0.24844967E-04     0   454   121   128     0     0
   451  0.24844967E-04     0   454   123   130     0     0
   451  0.74534895E-04     0   456     4     9     0     0
   451  0.24844967E-04     0   456   126   131     0     0
   451  0.74534895E-04     0   454     3    10     0     0
   451  0.24844967E-04     0   454   125   132     0     0
   451  0.16675483E+00     0   437   127     0     0     0
   451  0.16675483E+00     0   443   121     0     0     0
   451  0.16675343E+00     0   439   129     0     0     0
   451  0.16675343E+00     0   445   123     0     0     0
   451  0.16626820E+00     0   429   131     0     0     0
   451  0.16626820E+00     0   435   125     0     0     0
  27
   452  0.63679148E-02     0   456     2     7     0     0
   452  0.21226383E-02     0   456   122   127     0     0
   452  0.21226383E-02     0   456   124   129     0     0
   452  0.63679148E-02     0   454     1     8     0     0
   452  0.21226383E-02     0   454   121   128     0     0
   452  0.21226383E-02     0   454   123   130     0     0
   452  0.63679148E-02     0   456     4     9     0     0
   452  0.21226383E-02     0   456   126   131     0     0
   452  0.63679148E-02     0   454     3    10     0     0
   452  0.21226383E-02     0   454   125   132     0     0
   452  0.59638433E-02     0   450     2     8     0     0
   452  0.76854825E-02     0   450     1     7     0     0
   452  0.76854825E-02     0   450     3     9     0     0
   452  0.59638433E-02     0   450     4    10     0     0
   452  0.73201791E-02     0   450     5    11     0     0
   452  0.17440377E-02     0   450   121   127     0     0
   452  0.17440377E-02     0   450   123   129     0     0
   452  0.17300446E-02     0   450   125   131     0     0
   452  0.34722053E-02     0   450   122   128     0     0
   452  0.34722053E-02     0   450   124   130     0     0
   452  0.34722053E-02     0   450   126   132     0     0
   452  0.13202658E+00     0   437   127     0     0     0
   452  0.13202658E+00     0   443   121     0     0     0
   452  0.13202585E+00     0   439   129     0     0     0
   452  0.13202585E+00     0   445   123     0     0     0
   452  0.19171707E+00     0   429   131     0     0     0
   452  0.19171707E+00     0   435   125     0     0     0
  12
   453  0.42909414E+00     0   454   199     0     0     0
   453  0.42909414E+00     0   456   198     0     0     0
   453  0.17097341E-03     0   450   200     0     0     0
   453  0.28639785E-02     0   451   200     0     0     0
   453  0.28093851E-02     0   452   200     0     0     0
   453  0.55882391E-02     0   450   203     0     0     0
   453  0.21551149E-01     0   437   127     0     0     0
   453  0.21551149E-01     0   443   121     0     0     0
   453  0.21551136E-01     0   439   129     0     0     0
   453  0.21551136E-01     0   445   123     0     0     0
   453  0.22087388E-01     0   429   131     0     0     0
   453  0.22087388E-01     0   435   125     0     0     0
   5
   454  0.33226570E+00     0   450     2     7     0     0
   454  0.33226570E+00     0   450     4     9     0     0
   454  0.11075014E+00     0   450   127   122     0     0
   454  0.11075014E+00     0   450   129   124     0     0
   454  0.11396828E+00     0   450   131   126     0     0
   6
   455  0.21653511E+00     0   450   198     0     0     0
   455  0.19212338E+00     0   451   198     0     0     0
   455  0.99591739E-01     0   452   198     0     0     0
   455  0.19074664E-02     0   435   126     0     0     0
   455  0.42993301E+00     0   454   200     0     0     0
   455  0.59909310E-01     0   454   203     0     0     0
   5
   456  0.33226570E+00     0   450     8     1     0     0
   456  0.33226570E+00     0   450    10     3     0     0
   456  0.11075014E+00     0   450   121   128     0     0
   456  0.11075014E+00     0   450   123   130     0     0
   456  0.11396828E+00     0   450   125   132     0     0
   6
   457  0.21653511E+00     0   450   199     0     0     0
   457  0.19212338E+00     0   451   199     0     0     0
   457  0.99591739E-01     0   452   199     0     0     0
   457  0.19074664E-02     0   429   132     0     0     0
   457  0.42993301E+00     0   456   200     0     0     0
   457  0.59909310E-01     0   456   203     0     0     0
  29
   203  0.71381408E-04     0   123   129     0     0     0
   203  0.20417485E-01     0   125   131     0     0     0
   203  0.85692387E-03     0     3     9     0     0     0
   203  0.27955467E+00     0     5    11     0     0     0
   203  0.10631828E-01     0     4    10     0     0     0
   203  0.68567938E-03     0    59    59     0     0     0
   203  0.12345297E-01     0    13    13     0     0     0
   203  0.14547282E-02     0   198   121   128     0     0
   203  0.14547282E-02     0   198   123   130     0     0
   203  0.14547282E-02     0   198   125   132     0     0
   203  0.43641846E-02     0   198     8     1     0     0
   203  0.43641846E-02     0   198    10     3     0     0
   203  0.14547282E-02     0   199   127   122     0     0
   203  0.14547282E-02     0   199   129   124     0     0
   203  0.14547282E-02     0   199   131   126     0     0
   203  0.43641846E-02     0   199     2     7     0     0
   203  0.43641846E-02     0   199     4     9     0     0
   203  0.16229304E-03     0   200   122   128     0     0
   203  0.16229304E-03     0   200   124   130     0     0
   203  0.16229304E-03     0   200   126   132     0     0
   203  0.81680460E-04     0   200   121   127     0     0
   203  0.81680460E-04     0   200   123   129     0     0
   203  0.81680460E-04     0   200   125   131     0     0
   203  0.27983027E-03     0   200     2     8     0     0
   203  0.27983027E-03     0   200     4    10     0     0
   203  0.36049035E-03     0   200     1     7     0     0
   203  0.36049035E-03     0   200     3     9     0     0
   203  0.36049035E-03     0   200     5    11     0     0
   203  0.64687872E+00     0   450   450     0     0     0
  25
   204  0.21266093E-04     0   123   129     0     0     0
   204  0.60904832E-02     0   125   131     0     0     0
   204  0.25083756E-03     0     3     9     0     0     0
   204  0.67304380E-01     0     5    11     0     0     0
   204  0.67128539E-01     0     6    12     0     0     0
   204  0.10137703E-03     0    13    13     0     0     0
   204  0.13388845E-02     0   198   199     0     0     0
   204  0.65818656E-03     0   200   200     0     0     0
   204  0.95552921E-01     0   450   450     0     0     0
   204  0.31850450E-02     0   450   451     0     0     0
   204  0.39783828E-01     0   450   452     0     0     0
   204  0.30278167E-01     0   450   453     0     0     0
   204  0.96302817E-03     0   451   452     0     0     0
   204  0.39084288E-02     0   451   453     0     0     0
   204  0.16386712E-01     0   452   452     0     0     0
   204  0.13479683E+00     0   452   453     0     0     0
   204  0.37799906E-02     0   453   453     0     0     0
   204  0.19593592E+00     0   454   456     0     0     0
   204  0.36902889E-02     0   455   457     0     0     0
   204  0.16142783E+00     0   454   457     0     0     0
   204  0.16142783E+00     0   456   455     0     0     0
   204  0.54747579E-02     0   203   203     0     0     0
   204  0.17480280E-03     0   437   443     0     0     0
   204  0.17476791E-03     0   439   445     0     0     0
   204  0.16493400E-03     0   429   435     0     0     0
  21
   205  0.21171032E-04     0   123   129     0     0     0
   205  0.60635554E-02     0   125   131     0     0     0
   205  0.24973709E-03     0     3     9     0     0     0
   205  0.67096494E-01     0     5    11     0     0     0
   205  0.99935330E-01     0     6    12     0     0     0
   205  0.86401327E-04     0    13    13     0     0     0
   205  0.15254650E+00     0   450   450     0     0     0
   205  0.74509815E-02     0   450   451     0     0     0
   205  0.66925650E-02     0   450   452     0     0     0
   205  0.40542904E-01     0   450   453     0     0     0
   205  0.11171947E-04     0   451   451     0     0     0
   205  0.11850595E-02     0   451   452     0     0     0
   205  0.13440513E-01     0   451   453     0     0     0
   205  0.94534745E-02     0   452   452     0     0     0
   205  0.42138636E-01     0   452   453     0     0     0
   205  0.42464040E-01     0   453   453     0     0     0
   205  0.29807800E+00     0   454   456     0     0     0
   205  0.58738042E-01     0   455   457     0     0     0
   205  0.76331191E-01     0   454   457     0     0     0
   205  0.76331191E-01     0   456   455     0     0     0
   205  0.11430562E-02     0   203   200     0     0     0
  13
   206  0.22312850E-04     0   124   129     0     0     0
   206  0.63905874E-02     0   126   131     0     0     0
   206  0.24268363E-03     0     4     9     0     0     0
   206  0.14161006E+00     0     6    11     0     0     0
   206  0.29717652E-01     0   454   450     0     0     0
   206  0.14898093E+00     0   454   451     0     0     0
   206  0.75360738E-01     0   454   452     0     0     0
   206  0.15697560E+00     0   454   453     0     0     0
   206  0.19780605E+00     0   455   450     0     0     0
   206  0.10453426E+00     0   455   451     0     0     0
   206  0.13553084E+00     0   455   452     0     0     0
   206  0.15461332E-02     0   455   453     0     0     0
   206  0.12821654E-02     0   203   198     0     0     0
  13
   207  0.22312850E-04     0   130   123     0     0     0
   207  0.63905874E-02     0   132   125     0     0     0
   207  0.24268363E-03     0    10     3     0     0     0
   207  0.14161006E+00     0    12     5     0     0     0
   207  0.29717652E-01     0   456   450     0     0     0
   207  0.14898093E+00     0   456   451     0     0     0
   207  0.75360738E-01     0   456   452     0     0     0
   207  0.15697560E+00     0   456   453     0     0     0
   207  0.19780605E+00     0   457   450     0     0     0
   207  0.10453426E+00     0   457   451     0     0     0
   207  0.13553084E+00     0   457   452     0     0     0
   207  0.15461332E-02     0   457   453     0     0     0
   207  0.12821654E-02     0   203   199     0     0     0
   0
   5
     6  0.33333334E+00   100     2     7     5     0     0
     6  0.33333334E+00   100     4     9     5     0     0
     6  0.11111111E+00   100   122   127     5     0     0
     6  0.11111111E+00   100   124   129     5     0     0
     6  0.11111111E+00   100   126   131     5     0     0
   5
    12  0.33333334E+00   100     8     1    11     0     0
    12  0.33333334E+00   100    10     3    11     0     0
    12  0.11111111E+00   100   128   121    11     0     0
    12  0.11111111E+00   100   130   123    11     0     0
    12  0.11111111E+00   100   132   125    11     0     0
      6.00000000     -0.18023436
      0.48741400     -0.38617140      0.66983503     -0.40573415
      0.83930814      0.44443345     -0.21889710      0.22388580
      0.12405081     -0.17764662     -0.63948685     -0.73763782
     -0.20639972      0.78853828      0.30734548     -0.49106598
     -0.69585872      0.71817875     -0.71817875     -0.69585872
     -0.42256820      0.90633112     -0.90633112     -0.42256820
      0.78484112     -1.11495078     -1.57050788
   4899.00000000      0.00000000      0.00000000
    110.00000000
    T
