#  ISAJET SUSY parameters in SUSY Les Houches Accord 2 format
#  Created by ISALHA 2.0 Last revision: C. Balazs 21 Apr 2009
Block SPINFO   # Program information
     1   ISASUGRA from ISAJET          # Spectrum Calculator
     2   7.80   29-OCT-2009 12:50:36   # Version number
Block MODSEL   # Model selection
     1     1   # Minimal supergravity (mSUGRA) model               
Block SMINPUTS   # Standard Model inputs
     1     1.27838608E+02   # alpha_em^(-1)
     2     1.16570000E-05   # G_Fermi
     3     1.17200002E-01   # alpha_s(M_Z)
     4     9.11699982E+01   # m_{Z}(pole)
     5     4.19999981E+00   # m_{b}(m_{b})
     6     1.72500000E+02   # m_{top}(pole)
     7     1.77699995E+00   # m_{tau}(pole)
Block MINPAR   # SUSY breaking input parameters
     1     2.58000000E+03   # m_0
     2     1.20000000E+02   # m_{1/2}
     3     1.00000000E+01   # tan(beta)
     4     1.00000000E+00   # sign(mu)
     5     0.00000000E+00   # A_0
Block EXTPAR   # Non-universal SUSY breaking parameters
     0     2.87256282E+16   # Input scale
Block MASS   # Scalar and gaugino mass spectrum
#  PDG code   mass                 particle
        24     8.04229965E+01   #  W^+
        25     1.15819901E+02   #  h^0            
        35     2.55916992E+03   #  H^0            
        36     2.54237036E+03   #  A^0            
        37     2.56038208E+03   #  H^+            
   1000001     2.56473486E+03   #  dnl            
   1000002     2.56348267E+03   #  upl            
   1000003     2.56473486E+03   #  stl            
   1000004     2.56348291E+03   #  chl            
   1000005     2.08656885E+03   #  b1             
   1000006     1.46992737E+03   #  t1             
   1000011     2.57567163E+03   #  el-            
   1000012     2.57537695E+03   #  nuel           
   1000013     2.57567163E+03   #  mul-           
   1000014     2.57537695E+03   #  numl           
   1000015     2.55397046E+03   #  tau1           
   1000016     2.56356079E+03   #  nutl           
   1000021     3.90928772E+02   #  glss           
   1000022     4.22344780E+01   #  z1ss           
   1000023     7.61567307E+01   #  z2ss           
   1000024     7.46266861E+01   #  w1ss           
   1000025    -1.80183960E+02   #  z3ss           
   1000035     2.13491272E+02   #  z4ss           
   1000037     2.11001923E+02   #  w2ss           
   2000001     2.57590552E+03   #  dnr            
   2000002     2.57402905E+03   #  upr            
   2000003     2.57590552E+03   #  str            
   2000004     2.57402954E+03   #  chr            
   2000005     2.55145605E+03   #  b2             
   2000006     2.09583130E+03   #  t2             
   2000011     2.57773291E+03   #  er-            
   2000013     2.57773291E+03   #  mur-           
   2000015     2.56342188E+03   #  tau2           
Block ALPHA   # Effective Higgs mixing parameter
         -9.99973193E-02   # alpha
Block STOPMIX   # stop mixing matrix
  1  1     1.22095449E-02   # O_{11}
  1  2     9.99925435E-01   # O_{12}
  2  1    -9.99925435E-01   # O_{21}
  2  2     1.22095449E-02   # O_{22}
Block SBOTMIX   # sbottom mixing matrix
  1  1     9.99989569E-01   # O_{11}
  1  2     4.56501590E-03   # O_{12}
  2  1    -4.56501590E-03   # O_{21}
  2  2     9.99989569E-01   # O_{22}
Block STAUMIX   # stau mixing matrix
  1  1     1.35267437E-01   # O_{11}
  1  2     9.90809143E-01   # O_{12}
  2  1    -9.90809143E-01   # O_{21}
  2  2     1.35267437E-01   # O_{22}
Block NMIX   # neutralino mixing matrix
  1  1     8.86593521E-01   #
  1  2    -2.45587274E-01   #
  1  3     3.69099915E-01   #
  1  4    -1.31925523E-01   #
  2  1    -4.06986713E-01   #
  2  2    -8.11809063E-01   #
  2  3     3.62604797E-01   #
  2  4    -2.09393814E-01   #
  3  1    -1.20853245E-01   #
  3  2     1.69892922E-01   #
  3  3     6.60986662E-01   #
  3  4     7.20852137E-01   #
  4  1    -1.83598697E-01   #
  4  2     5.01786292E-01   #
  4  3     5.43488562E-01   #
  4  4    -6.47396684E-01   #
Block UMIX   # chargino U mixing matrix
  1  1    -7.75210917E-01   # U_{11}
  1  2     6.31702542E-01   # U_{12}
  2  1    -6.31702542E-01   # U_{21}
  2  2    -7.75210917E-01   # U_{22}
Block VMIX   # chargino V mixing matrix
  1  1    -9.37483668E-01   # V_{11}
  1  2     3.48029226E-01   # V_{12}
  2  1    -3.48029226E-01   # V_{21}
  2  2    -9.37483668E-01   # V_{22}
Block GAUGE Q=  1.75350452E+03   #
     1     3.57523263E-01   # g`
     2     6.52363062E-01   # g_2
     3     1.21922934E+00   # g_3
Block YU Q=  1.75350452E+03   #
  3  3     8.55578005E-01   # y_t
Block YD Q=  1.75350452E+03   #
  3  3     1.31996155E-01   # y_b
Block YE Q=  1.75350452E+03   #
  3  3     1.02050416E-01   # y_tau
Block HMIX Q=  1.75350452E+03   # Higgs mixing parameters
     1     1.65159271E+02   # mu(Q)
     2     1.00000000E+01   # tan(beta)(M_GUT)
     3     2.51612427E+02   # Higgs vev at Q
     4     6.46364700E+06   # m_A^2(Q)
Block MSOFT Q=  1.75350452E+03   # DRbar SUSY breaking parameters
     1     5.05312538E+01   # M_1(Q)          
     2     9.38136215E+01   # M_2(Q)          
     3     3.01495361E+02   # M_3(Q)          
    31     2.56715674E+03   # MeL(Q)          
    32     2.56715674E+03   # MmuL(Q)         
    33     2.55563574E+03   # MtauL(Q)        
    34     2.57488428E+03   # MeR(Q)          
    35     2.57488428E+03   # MmuR(Q)         
    36     2.55192554E+03   # MtauR(Q)        
    41     2.52928174E+03   # MqL1(Q)         
    42     2.52928174E+03   # MqL2(Q)         
    43     2.06297363E+03   # MqL3(Q)         
    44     2.53938916E+03   # MuR(Q)          
    45     2.53938916E+03   # McR(Q)          
    46     1.49045911E+03   # MtR(Q)          
    47     2.54087036E+03   # MdR(Q)          
    48     2.54087036E+03   # MsR(Q)          
    49     2.51953076E+03   # MbR(Q)          
Block AU Q=  1.75350452E+03   #
  1  1    -2.05093643E+02   # A_u
  2  2    -2.05093643E+02   # A_c
  3  3    -2.05093643E+02   # A_t
Block AD Q=  1.75350452E+03   #
  1  1    -3.02911194E+02   # A_d
  2  2    -3.02911194E+02   # A_s
  3  3    -3.02911194E+02   # A_b
Block AE Q=  1.75350452E+03   #
  1  1    -7.12918777E+01   # A_e
  2  2    -7.12918777E+01   # A_mu
  3  3    -7.12918777E+01   # A_tau
#  ISAJET decay tables in SUSY Les Houches accord format
#  Created by ISALHD. Last revision: C. Balazs, 2005 May 25
Block DCINFO                           # Program information
     1   ISASUGRA from ISAJET          # Spectrum Calculator
     2   7.80   29-OCT-2009 12:50:36   # Version number
#         PDG         Width
DECAY         6  1.14680779E+00   # TP    decays
#          BR          NDA       ID1       ID2       ID3       ID4
      3.33333343E-01    3            2        -1         5             # TP     -->  UP     DB     BT          
      3.33333343E-01    3            4        -3         5             # TP     -->  CH     SB     BT          
      1.11111112E-01    3          -11        12         5             # TP     -->  E+     NUE    BT          
      1.11111112E-01    3          -13        14         5             # TP     -->  MU+    NUM    BT          
      1.11111112E-01    3          -15        16         5             # TP     -->  TAU+   NUT    BT          
#         PDG         Width
DECAY   1000021  1.28536503E-05   # GLSS  decays
#          BR          NDA       ID1       ID2       ID3       ID4
      6.87017366E-02    3      1000024         1        -2             # GLSS   -->  W1SS+  DN     UB          
      6.87017366E-02    3     -1000024         2        -1             # GLSS   -->  W1SS-  UP     DB          
      6.87017217E-02    3      1000024         3        -4             # GLSS   -->  W1SS+  ST     CB          
      6.87017217E-02    3     -1000024         4        -3             # GLSS   -->  W1SS-  CH     SB          
      1.35774808E-02    3      1000024         5        -6             # GLSS   -->  W1SS+  BT     TB          
      1.35774808E-02    3     -1000024         6        -5             # GLSS   -->  W1SS-  TP     BB          
      4.03445819E-03    3      1000037         1        -2             # GLSS   -->  W2SS+  DN     UB          
      4.03445819E-03    3     -1000037         2        -1             # GLSS   -->  W2SS-  UP     DB          
      4.03445773E-03    3      1000037         3        -4             # GLSS   -->  W2SS+  ST     CB          
      4.03445773E-03    3     -1000037         4        -3             # GLSS   -->  W2SS-  CH     SB          
      7.20374010E-06    3      1000037         5        -6             # GLSS   -->  W2SS+  BT     TB          
      7.20374010E-06    3     -1000037         6        -5             # GLSS   -->  W2SS-  TP     BB          
      1.06586199E-02    2      1000022        21                       # GLSS   -->  Z1SS   GL                 
      2.18201652E-02    3      1000022         2        -2             # GLSS   -->  Z1SS   UP     UB          
      1.39386756E-02    3      1000022         1        -1             # GLSS   -->  Z1SS   DN     DB          
      1.39386756E-02    3      1000022         3        -3             # GLSS   -->  Z1SS   ST     SB          
      2.18201466E-02    3      1000022         4        -4             # GLSS   -->  Z1SS   CH     CB          
      2.67869849E-02    3      1000022         5        -5             # GLSS   -->  Z1SS   BT     BB          
      6.82974905E-06    3      1000022         6        -6             # GLSS   -->  Z1SS   TP     TB          
      3.49579342E-02    2      1000023        21                       # GLSS   -->  Z2SS   GL                 
      4.04089354E-02    3      1000023         2        -2             # GLSS   -->  Z2SS   UP     UB          
      2.61142142E-02    3      1000023         1        -1             # GLSS   -->  Z2SS   DN     DB          
      2.61142142E-02    3      1000023         3        -3             # GLSS   -->  Z2SS   ST     SB          
      4.04089168E-02    3      1000023         4        -4             # GLSS   -->  Z2SS   CH     CB          
      5.97767085E-02    3      1000023         5        -5             # GLSS   -->  Z2SS   BT     BB          
      2.07437754E-01    2      1000025        21                       # GLSS   -->  Z3SS   GL                 
      1.70509767E-04    3      1000025         2        -2             # GLSS   -->  Z3SS   UP     UB          
      2.23502546E-04    3      1000025         1        -1             # GLSS   -->  Z3SS   DN     DB          
      2.23502546E-04    3      1000025         3        -3             # GLSS   -->  Z3SS   ST     SB          
      1.70509637E-04    3      1000025         4        -4             # GLSS   -->  Z3SS   CH     CB          
      2.41644587E-03    3      1000025         5        -5             # GLSS   -->  Z3SS   BT     BB          
      1.20195113E-01    2      1000035        21                       # GLSS   -->  Z4SS   GL                 
      1.83176587E-03    3      1000035         2        -2             # GLSS   -->  Z4SS   UP     UB          
      2.24594097E-03    3      1000035         1        -1             # GLSS   -->  Z4SS   DN     DB          
      2.24594097E-03    3      1000035         3        -3             # GLSS   -->  Z4SS   ST     SB          
      1.83176529E-03    3      1000035         4        -4             # GLSS   -->  Z4SS   CH     CB          
      6.14201138E-03    3      1000035         5        -5             # GLSS   -->  Z4SS   BT     BB          
#         PDG         Width
DECAY   1000002  1.69563126E+02   # UPL   decays
#          BR          NDA       ID1       ID2       ID3       ID4
      4.39819327E-04    2      1000022         2                       # UPL    -->  Z1SS   UP                 
      4.99086753E-02    2      1000023         2                       # UPL    -->  Z2SS   UP                 
      1.37554377E-03    2      1000025         2                       # UPL    -->  Z3SS   UP                 
      1.37541983E-02    2      1000035         2                       # UPL    -->  Z4SS   UP                 
      8.07645082E-01    2      1000021         2                       # UPL    -->  GLSS   UP                 
      1.11668862E-01    2      1000024         1                       # UPL    -->  W1SS+  DN                 
      1.52078485E-02    2      1000037         1                       # UPL    -->  W2SS+  DN                 
#         PDG         Width
DECAY   1000001  1.69567383E+02   # DNL   decays
#          BR          NDA       ID1       ID2       ID3       ID4
      1.05933668E-02    2      1000022         1                       # DNL    -->  Z1SS   DN                 
      3.45438868E-02    2      1000023         1                       # DNL    -->  Z2SS   DN                 
      2.32472294E-03    2      1000025         1                       # DNL    -->  Z3SS   DN                 
      1.79997571E-02    2      1000035         1                       # DNL    -->  Z4SS   DN                 
      8.08019817E-01    2      1000021         1                       # DNL    -->  GLSS   DN                 
      7.63917342E-02    2     -1000024         2                       # DNL    -->  W1SS-  UP                 
      5.01266383E-02    2     -1000037         2                       # DNL    -->  W2SS-  UP                 
#         PDG         Width
DECAY   1000003  1.69567352E+02   # STL   decays
#          BR          NDA       ID1       ID2       ID3       ID4
      1.05933696E-02    2      1000022         3                       # STL    -->  Z1SS   ST                 
      3.45438942E-02    2      1000023         3                       # STL    -->  Z2SS   ST                 
      2.32472341E-03    2      1000025         3                       # STL    -->  Z3SS   ST                 
      1.79997608E-02    2      1000035         3                       # STL    -->  Z4SS   ST                 
      8.08019996E-01    2      1000021         3                       # STL    -->  GLSS   ST                 
      7.63916969E-02    2     -1000024         4                       # STL    -->  W1SS-  CH                 
      5.01266196E-02    2     -1000037         4                       # STL    -->  W2SS-  CH                 
#         PDG         Width
DECAY   1000004  1.69563049E+02   # CHL   decays
#          BR          NDA       ID1       ID2       ID3       ID4
      4.39819298E-04    2      1000022         4                       # CHL    -->  Z1SS   CH                 
      4.99086715E-02    2      1000023         4                       # CHL    -->  Z2SS   CH                 
      1.37554388E-03    2      1000025         4                       # CHL    -->  Z3SS   CH                 
      1.37541974E-02    2      1000035         4                       # CHL    -->  Z4SS   CH                 
      8.07644963E-01    2      1000021         4                       # CHL    -->  GLSS   CH                 
      1.11668922E-01    2      1000024         3                       # CHL    -->  W1SS+  ST                 
      1.52078569E-02    2      1000037         3                       # CHL    -->  W2SS+  ST                 
#         PDG         Width
DECAY   1000005  1.66586823E+02   # BT1   decays
#          BR          NDA       ID1       ID2       ID3       ID4
      9.42595489E-03    2      1000022         5                       # BT1    -->  Z1SS   BT                 
      2.92039178E-02    2      1000023         5                       # BT1    -->  Z2SS   BT                 
      3.84692964E-03    2      1000025         5                       # BT1    -->  Z3SS   BT                 
      1.60720795E-02    2      1000035         5                       # BT1    -->  Z4SS   BT                 
      6.65825725E-01    2      1000021         5                       # BT1    -->  GLSS   BT                 
      8.29020515E-02    2     -1000024         6                       # BT1    -->  W1SS-  TP                 
      1.92064852E-01    2     -1000037         6                       # BT1    -->  W2SS-  TP                 
      6.58504141E-04    2          -24   1000006                       # BT1    -->  W-     TP1                
#         PDG         Width
DECAY   1000006  1.15218056E+02   # TP1   decays
#          BR          NDA       ID1       ID2       ID3       ID4
      6.31208122E-01    2      1000021         6                       # TP1    -->  GLSS   TP                 
      2.51388848E-02    2      1000022         6                       # TP1    -->  Z1SS   TP                 
      1.26335407E-02    2      1000023         6                       # TP1    -->  Z2SS   TP                 
      8.86919424E-02    2      1000025         6                       # TP1    -->  Z3SS   TP                 
      7.02181458E-02    2      1000035         6                       # TP1    -->  Z4SS   TP                 
      2.26292908E-02    2      1000024         5                       # TP1    -->  W1SS+  BT                 
      1.49480134E-01    2      1000037         5                       # TP1    -->  W2SS+  BT                 
#         PDG         Width
DECAY   2000002  1.43322021E+02   # UPR   decays
#          BR          NDA       ID1       ID2       ID3       ID4
      3.18956822E-02    2      1000022         2                       # UPR    -->  Z1SS   UP                 
      6.71299919E-03    2      1000023         2                       # UPR    -->  Z2SS   UP                 
      5.87173912E-04    2      1000025         2                       # UPR    -->  Z3SS   UP                 
      1.34977151E-03    2      1000035         2                       # UPR    -->  Z4SS   UP                 
      9.59454358E-01    2      1000021         2                       # UPR    -->  GLSS   UP                 
#         PDG         Width
DECAY   2000001  1.39065094E+02   # DNR   decays
#          BR          NDA       ID1       ID2       ID3       ID4
      8.22400860E-03    2      1000022         1                       # DNR    -->  Z1SS   DN                 
      1.73088803E-03    2      1000023         1                       # DNR    -->  Z2SS   DN                 
      1.51399450E-04    2      1000025         1                       # DNR    -->  Z3SS   DN                 
      3.48032918E-04    2      1000035         1                       # DNR    -->  Z4SS   DN                 
      9.89545703E-01    2      1000021         1                       # DNR    -->  GLSS   DN                 
#         PDG         Width
DECAY   2000003  1.39065094E+02   # STR   decays
#          BR          NDA       ID1       ID2       ID3       ID4
      8.22400860E-03    2      1000022         3                       # STR    -->  Z1SS   ST                 
      1.73088803E-03    2      1000023         3                       # STR    -->  Z2SS   ST                 
      1.51399450E-04    2      1000025         3                       # STR    -->  Z3SS   ST                 
      3.48032918E-04    2      1000035         3                       # STR    -->  Z4SS   ST                 
      9.89545703E-01    2      1000021         3                       # STR    -->  GLSS   ST                 
#         PDG         Width
DECAY   2000004  1.43321960E+02   # CHR   decays
#          BR          NDA       ID1       ID2       ID3       ID4
      3.18956859E-02    2      1000022         4                       # CHR    -->  Z1SS   CH                 
      6.71299919E-03    2      1000023         4                       # CHR    -->  Z2SS   CH                 
      5.87173970E-04    2      1000025         4                       # CHR    -->  Z3SS   CH                 
      1.34977151E-03    2      1000035         4                       # CHR    -->  Z4SS   CH                 
      9.59454358E-01    2      1000021         4                       # CHR    -->  GLSS   CH                 
#         PDG         Width
DECAY   2000005  1.39583466E+02   # BT2   decays
#          BR          NDA       ID1       ID2       ID3       ID4
      8.96209292E-03    2      1000022         5                       # BT2    -->  Z1SS   BT                 
      2.53521255E-03    2      1000023         5                       # BT2    -->  Z2SS   BT                 
      3.04812333E-03    2      1000025         5                       # BT2    -->  Z3SS   BT                 
      2.34153820E-03    2      1000035         5                       # BT2    -->  Z4SS   BT                 
      9.76484716E-01    2      1000021         5                       # BT2    -->  GLSS   BT                 
      2.47800304E-03    2     -1000024         6                       # BT2    -->  W1SS-  TP                 
      4.04114742E-03    2     -1000037         6                       # BT2    -->  W2SS-  TP                 
      7.11057453E-08    2          -24   1000006                       # BT2    -->  W-     TP1                
      5.29272002E-05    2          -24   2000006                       # BT2    -->  W-     TP2                
      2.79921078E-05    2           23   1000005                       # BT2    -->  Z0     BT1                
      2.81551584E-05    2           25   1000005                       # BT2    -->  HL0    BT1                
#         PDG         Width
DECAY   2000006  1.65779282E+02   # TP2   decays
#          BR          NDA       ID1       ID2       ID3       ID4
      6.61928117E-01    2      1000021         6                       # TP2    -->  GLSS   TP                 
      9.40202475E-02    2      1000024         5                       # TP2    -->  W1SS+  BT                 
      1.64283346E-02    2      1000037         5                       # TP2    -->  W2SS+  BT                 
      3.46285582E-04    2           23   1000006                       # TP2    -->  Z0     TP1                
      6.84293511E-04    2           25   1000006                       # TP2    -->  HL0    TP1                
      3.16973939E-03    2      1000022         6                       # TP2    -->  Z1SS   TP                 
      4.82616015E-02    2      1000023         6                       # TP2    -->  Z2SS   TP                 
      9.03612077E-02    2      1000025         6                       # TP2    -->  Z3SS   TP                 
      8.48001391E-02    2      1000035         6                       # TP2    -->  Z4SS   TP                 
#         PDG         Width
DECAY   1000011  3.56173630E+01   # EL-   decays
#          BR          NDA       ID1       ID2       ID3       ID4
      1.77734643E-02    2      1000022        11                       # EL-    -->  Z1SS   E-                 
      3.25821102E-01    2      1000023        11                       # EL-    -->  Z2SS   E-                 
      3.22703552E-03    2      1000025        11                       # EL-    -->  Z3SS   E-                 
      4.82474230E-02    2      1000035        11                       # EL-    -->  Z4SS   E-                 
      3.65242362E-01    2     -1000024        12                       # EL-    -->  W1SS-  NUE                
      2.39688545E-01    2     -1000037        12                       # EL-    -->  W2SS-  NUE                
#         PDG         Width
DECAY   1000013  3.56173630E+01   # MUL-  decays
#          BR          NDA       ID1       ID2       ID3       ID4
      1.77734643E-02    2      1000022        13                       # MUL-   -->  Z1SS   MU-                
      3.25821102E-01    2      1000023        13                       # MUL-   -->  Z2SS   MU-                
      3.22703552E-03    2      1000025        13                       # MUL-   -->  Z3SS   MU-                
      4.82474230E-02    2      1000035        13                       # MUL-   -->  Z4SS   MU-                
      3.65242362E-01    2     -1000024        14                       # MUL-   -->  W1SS-  NUM                
      2.39688545E-01    2     -1000037        14                       # MUL-   -->  W2SS-  NUM                
#         PDG         Width
DECAY   1000015  1.44780302E+01   # TAU1- decays
#          BR          NDA       ID1       ID2       ID3       ID4
      7.10193217E-01    2      1000022        15                       # TAU1-  -->  Z1SS   TAU-               
      1.74818531E-01    2      1000023        15                       # TAU1-  -->  Z2SS   TAU-               
      2.24335305E-02    2      1000025        15                       # TAU1-  -->  Z3SS   TAU-               
      2.79810522E-02    2      1000035        15                       # TAU1-  -->  Z4SS   TAU-               
      6.24809675E-02    2     -1000024        16                       # TAU1-  -->  W1SS-  NUT                
      2.09276285E-03    2     -1000037        16                       # TAU1-  -->  W2SS-  NUT                
#         PDG         Width
DECAY   1000012  3.56598740E+01   # NUEL  decays
#          BR          NDA       ID1       ID2       ID3       ID4
      1.63193390E-01    2      1000022        12                       # NUEL   -->  Z1SS   NUE                
      1.04965359E-01    2      1000023        12                       # NUEL   -->  Z2SS   NUE                
      1.68111976E-02    2      1000025        12                       # NUEL   -->  Z3SS   NUE                
      1.08913116E-01    2      1000035        12                       # NUEL   -->  Z4SS   NUE                
      5.33458769E-01    2      1000024        11                       # NUEL   -->  W1SS+  E-                 
      7.26581439E-02    2      1000037        11                       # NUEL   -->  W2SS+  E-                 
#         PDG         Width
DECAY   1000014  3.56598740E+01   # NUML  decays
#          BR          NDA       ID1       ID2       ID3       ID4
      1.63193390E-01    2      1000022        14                       # NUML   -->  Z1SS   NUM                
      1.04965359E-01    2      1000023        14                       # NUML   -->  Z2SS   NUM                
      1.68111976E-02    2      1000025        14                       # NUML   -->  Z3SS   NUM                
      1.08913116E-01    2      1000035        14                       # NUML   -->  Z4SS   NUM                
      5.33458769E-01    2      1000024        13                       # NUML   -->  W1SS+  MU-                
      7.26581439E-02    2      1000037        13                       # NUML   -->  W2SS+  MU-                
#         PDG         Width
DECAY   1000016  3.60458107E+01   # NUTL  decays
#          BR          NDA       ID1       ID2       ID3       ID4
      1.60704568E-01    2      1000022        16                       # NUTL   -->  Z1SS   NUT                
      1.03363410E-01    2      1000023        16                       # NUTL   -->  Z2SS   NUT                
      1.65533908E-02    2      1000025        16                       # NUTL   -->  Z3SS   NUT                
      1.07238933E-01    2      1000035        16                       # NUTL   -->  Z4SS   NUT                
      5.31453609E-01    2      1000024        15                       # NUTL   -->  W1SS+  TAU-               
      8.06861445E-02    2      1000037        15                       # NUTL   -->  W2SS+  TAU-               
      1.16170641E-11    3      1000015        16       -15             # NUTL   -->  TAU1-  NUT    TAU+        
      1.16170641E-11    3      1000015        12       -11             # NUTL   -->  TAU1-  NUE    E+          
      1.16170641E-11    3      1000015        14       -13             # NUTL   -->  TAU1-  NUM    MU+         
      3.48511914E-11    3      1000015         2        -1             # NUTL   -->  TAU1-  UP     DB          
      3.48511914E-11    3      1000015         4        -3             # NUTL   -->  TAU1-  CH     SB          
#         PDG         Width
DECAY   2000011  1.30937986E+01   # ER-   decays
#          BR          NDA       ID1       ID2       ID3       ID4
      7.86659777E-01    2      1000022        11                       # ER-    -->  Z1SS   E-                 
      1.65566757E-01    2      1000023        11                       # ER-    -->  Z2SS   E-                 
      1.44821592E-02    2      1000025        11                       # ER-    -->  Z3SS   E-                 
      3.32913771E-02    2      1000035        11                       # ER-    -->  Z4SS   E-                 
#         PDG         Width
DECAY   2000013  1.30937986E+01   # MUR-  decays
#          BR          NDA       ID1       ID2       ID3       ID4
      7.86659777E-01    2      1000022        13                       # MUR-   -->  Z1SS   MU-                
      1.65566757E-01    2      1000023        13                       # MUR-   -->  Z2SS   MU-                
      1.44821592E-02    2      1000025        13                       # MUR-   -->  Z3SS   MU-                
      3.32913771E-02    2      1000035        13                       # MUR-   -->  Z4SS   MU-                
#         PDG         Width
DECAY   2000015  3.55877380E+01   # TAU2- decays
#          BR          NDA       ID1       ID2       ID3       ID4
      1.97856706E-02    2      1000022        15                       # TAU2-  -->  Z1SS   TAU-               
      3.17825586E-01    2      1000023        15                       # TAU2-  -->  Z2SS   TAU-               
      1.28575172E-02    2      1000025        15                       # TAU2-  -->  Z3SS   TAU-               
      5.79050072E-02    2      1000035        15                       # TAU2-  -->  Z4SS   TAU-               
      3.44508559E-01    2     -1000024        16                       # TAU2-  -->  W1SS-  NUT                
      2.47117624E-01    2     -1000037        16                       # TAU2-  -->  W2SS-  NUT                
#         PDG         Width
DECAY   1000023  8.14523617E-07   # Z2SS  decays
#          BR          NDA       ID1       ID2       ID3       ID4
      1.15044499E-02    2      1000022        22                       # Z2SS   -->  Z1SS   GM                 
      1.10790625E-05    3     -1000024         2        -1             # Z2SS   -->  W1SS-  UP     DB          
      3.69302097E-06    3     -1000024        12       -11             # Z2SS   -->  W1SS-  NUE    E+          
      3.69302097E-06    3     -1000024        14       -13             # Z2SS   -->  W1SS-  NUM    MU+         
      1.10790625E-05    3      1000024         1        -2             # Z2SS   -->  W1SS+  DN     UB          
      3.69302097E-06    3      1000024        11       -12             # Z2SS   -->  W1SS+  E-     ANUE        
      3.69302097E-06    3      1000024        13       -14             # Z2SS   -->  W1SS+  MU-    ANUM        
      1.20188914E-01    3      1000022         2        -2             # Z2SS   -->  Z1SS   UP     UB          
      1.55829251E-01    3      1000022         1        -1             # Z2SS   -->  Z1SS   DN     DB          
      1.55829251E-01    3      1000022         3        -3             # Z2SS   -->  Z1SS   ST     SB          
      1.20188914E-01    3      1000022         4        -4             # Z2SS   -->  Z1SS   CH     CB          
      1.24929018E-01    3      1000022         5        -5             # Z2SS   -->  Z1SS   BT     BB          
      3.47525291E-02    3      1000022        11       -11             # Z2SS   -->  Z1SS   E-     E+          
      3.47525291E-02    3      1000022        13       -13             # Z2SS   -->  Z1SS   MU-    MU+         
      3.37141082E-02    3      1000022        15       -15             # Z2SS   -->  Z1SS   TAU-   TAU+        
      6.94262460E-02    3      1000022        12       -12             # Z2SS   -->  Z1SS   NUE    ANUE        
      6.94262460E-02    3      1000022        14       -14             # Z2SS   -->  Z1SS   NUM    ANUM        
      6.94215521E-02    3      1000022        16       -16             # Z2SS   -->  Z1SS   NUT    ANUT        
#         PDG         Width
DECAY   1000025  3.70497793E-01   # Z3SS  decays
#          BR          NDA       ID1       ID2       ID3       ID4
      8.94660523E-09    2      1000022        22                       # Z3SS   -->  Z1SS   GM                 
      2.48976721E-06    2      1000023        22                       # Z3SS   -->  Z2SS   GM                 
      3.30740064E-01    2      1000024       -24                       # Z3SS   -->  W1SS+  W-                 
      3.30740064E-01    2     -1000024        24                       # Z3SS   -->  W1SS-  W+                 
      2.60209680E-01    2      1000022        23                       # Z3SS   -->  Z1SS   Z0                 
      5.75643219E-02    2      1000023        23                       # Z3SS   -->  Z2SS   Z0                 
      2.59160540E-11    3      1000022         2        -2             # Z3SS   -->  Z1SS   UP     UB          
      4.81376605E-11    3      1000022         1        -1             # Z3SS   -->  Z1SS   DN     DB          
      4.81376605E-11    3      1000022         3        -3             # Z3SS   -->  Z1SS   ST     SB          
      2.59160367E-11    3      1000022         4        -4             # Z3SS   -->  Z1SS   CH     CB          
      4.87554719E-10    3      1000022         5        -5             # Z3SS   -->  Z1SS   BT     BB          
      4.31113895E-11    3      1000022        11       -11             # Z3SS   -->  Z1SS   E-     E+          
      4.31113895E-11    3      1000022        13       -13             # Z3SS   -->  Z1SS   MU-    MU+         
      1.96518732E-10    3      1000022        15       -15             # Z3SS   -->  Z1SS   TAU-   TAU+        
      7.46339240E-11    3      1000022        12       -12             # Z3SS   -->  Z1SS   NUE    ANUE        
      7.46339240E-11    3      1000022        14       -14             # Z3SS   -->  Z1SS   NUM    ANUM        
      7.60229102E-11    3      1000022        16       -16             # Z3SS   -->  Z1SS   NUT    ANUT        
      4.73227880E-11    3      1000023         2        -2             # Z3SS   -->  Z2SS   UP     UB          
      5.31852826E-11    3      1000023         1        -1             # Z3SS   -->  Z2SS   DN     DB          
      5.31852826E-11    3      1000023         3        -3             # Z3SS   -->  Z2SS   ST     SB          
      4.73227603E-11    3      1000023         4        -4             # Z3SS   -->  Z2SS   CH     CB          
      4.09722851E-08    3      1000023         5        -5             # Z3SS   -->  Z2SS   BT     BB          
      1.30151948E-11    3      1000023        11       -11             # Z3SS   -->  Z2SS   E-     E+          
      1.30151948E-11    3      1000023        13       -13             # Z3SS   -->  Z2SS   MU-    MU+         
      8.35391578E-09    3      1000023        15       -15             # Z3SS   -->  Z2SS   TAU-   TAU+        
      1.67674694E-11    3      1000023        12       -12             # Z3SS   -->  Z2SS   NUE    ANUE        
      1.67674694E-11    3      1000023        14       -14             # Z3SS   -->  Z2SS   NUM    ANUM        
      1.70796571E-11    3      1000023        16       -16             # Z3SS   -->  Z2SS   NUT    ANUT        
      2.07432713E-02    2      1000022        25                       # Z3SS   -->  Z1SS   HL0                
#         PDG         Width
DECAY   1000035  8.04932117E-01   # Z4SS  decays
#          BR          NDA       ID1       ID2       ID3       ID4
      6.03328729E-08    2      1000022        22                       # Z4SS   -->  Z1SS   GM                 
      1.20253333E-06    2      1000023        22                       # Z4SS   -->  Z2SS   GM                 
      1.32537309E-07    2      1000025        22                       # Z4SS   -->  Z3SS   GM                 
      4.21853900E-01    2      1000024       -24                       # Z4SS   -->  W1SS+  W-                 
      4.21853900E-01    2     -1000024        24                       # Z4SS   -->  W1SS-  W+                 
      7.46829057E-11    3     -1000037         2        -1             # Z4SS   -->  W2SS-  UP     DB          
      2.48943019E-11    3     -1000037        12       -11             # Z4SS   -->  W2SS-  NUE    E+          
      2.48943019E-11    3     -1000037        14       -13             # Z4SS   -->  W2SS-  NUM    MU+         
      7.46829057E-11    3      1000037         1        -2             # Z4SS   -->  W2SS+  DN     UB          
      2.48943019E-11    3      1000037        11       -12             # Z4SS   -->  W2SS+  E-     ANUE        
      2.48943019E-11    3      1000037        13       -14             # Z4SS   -->  W2SS+  MU-    ANUM        
      5.07501885E-02    2      1000022        23                       # Z4SS   -->  Z1SS   Z0                 
      1.20616434E-02    2      1000023        23                       # Z4SS   -->  Z2SS   Z0                 
      1.57495239E-10    3      1000022         2        -2             # Z4SS   -->  Z1SS   UP     UB          
      8.38703940E-10    3      1000022         1        -1             # Z4SS   -->  Z1SS   DN     DB          
      8.38703940E-10    3      1000022         3        -3             # Z4SS   -->  Z1SS   ST     SB          
      1.57495142E-10    3      1000022         4        -4             # Z4SS   -->  Z1SS   CH     CB          
      1.92132865E-09    3      1000022         5        -5             # Z4SS   -->  Z1SS   BT     BB          
      2.73445433E-10    3      1000022        11       -11             # Z4SS   -->  Z1SS   E-     E+          
      2.73445433E-10    3      1000022        13       -13             # Z4SS   -->  Z1SS   MU-    MU+         
      3.45538126E-10    3      1000022        15       -15             # Z4SS   -->  Z1SS   TAU-   TAU+        
      1.11309340E-09    3      1000022        12       -12             # Z4SS   -->  Z1SS   NUE    ANUE        
      1.11309340E-09    3      1000022        14       -14             # Z4SS   -->  Z1SS   NUM    ANUM        
      1.13381804E-09    3      1000022        16       -16             # Z4SS   -->  Z1SS   NUT    ANUT        
      1.75634907E-09    3      1000023         2        -2             # Z4SS   -->  Z2SS   UP     UB          
      1.57280822E-09    3      1000023         1        -1             # Z4SS   -->  Z2SS   DN     DB          
      1.57280822E-09    3      1000023         3        -3             # Z4SS   -->  Z2SS   ST     SB          
      1.75634840E-09    3      1000023         4        -4             # Z4SS   -->  Z2SS   CH     CB          
      3.80048792E-09    3      1000023         5        -5             # Z4SS   -->  Z2SS   BT     BB          
      5.96450778E-10    3      1000023        11       -11             # Z4SS   -->  Z2SS   E-     E+          
      5.96450778E-10    3      1000023        13       -13             # Z4SS   -->  Z2SS   MU-    MU+         
      6.59224120E-10    3      1000023        15       -15             # Z4SS   -->  Z2SS   TAU-   TAU+        
      4.15500523E-10    3      1000023        12       -12             # Z4SS   -->  Z2SS   NUE    ANUE        
      4.15500523E-10    3      1000023        14       -14             # Z4SS   -->  Z2SS   NUM    ANUM        
      4.23240748E-10    3      1000023        16       -16             # Z4SS   -->  Z2SS   NUT    ANUT        
      3.75043123E-06    3      1000025         2        -2             # Z4SS   -->  Z3SS   UP     UB          
      4.83849408E-06    3      1000025         1        -1             # Z4SS   -->  Z3SS   DN     DB          
      4.83849408E-06    3      1000025         3        -3             # Z4SS   -->  Z3SS   ST     SB          
      3.75043123E-06    3      1000025         4        -4             # Z4SS   -->  Z3SS   CH     CB          
      3.75462878E-06    3      1000025         5        -5             # Z4SS   -->  Z3SS   BT     BB          
      1.09748544E-06    3      1000025        11       -11             # Z4SS   -->  Z3SS   E-     E+          
      1.09748544E-06    3      1000025        13       -13             # Z4SS   -->  Z3SS   MU-    MU+         
      1.05240190E-06    3      1000025        15       -15             # Z4SS   -->  Z3SS   TAU-   TAU+        
      2.18261084E-06    3      1000025        12       -12             # Z4SS   -->  Z3SS   NUE    ANUE        
      2.18261084E-06    3      1000025        14       -14             # Z4SS   -->  Z3SS   NUM    ANUM        
      2.18260448E-06    3      1000025        16       -16             # Z4SS   -->  Z3SS   NUT    ANUT        
      6.77098930E-02    2      1000022        25                       # Z4SS   -->  Z1SS   HL0                
      2.57383678E-02    2      1000023        25                       # Z4SS   -->  Z2SS   HL0                
#         PDG         Width
DECAY   1000024  1.02969589E-05   # W1SS+ decays
#          BR          NDA       ID1       ID2       ID3       ID4
      3.33390623E-01    3      1000022         2        -1             # W1SS+  -->  Z1SS   UP     DB          
      3.33390623E-01    3      1000022         4        -3             # W1SS+  -->  Z1SS   CH     SB          
      1.11072242E-01    3      1000022       -11        12             # W1SS+  -->  Z1SS   E+     NUE         
      1.11072242E-01    3      1000022       -13        14             # W1SS+  -->  Z1SS   MU+    NUM         
      1.11074358E-01    3      1000022       -15        16             # W1SS+  -->  Z1SS   TAU+   NUT         
#         PDG         Width
DECAY   1000037  5.54751515E-01   # W2SS+ decays
#          BR          NDA       ID1       ID2       ID3       ID4
      1.15370058E-09    3      1000022         2        -1             # W2SS+  -->  Z1SS   UP     DB          
      1.15370058E-09    3      1000022         4        -3             # W2SS+  -->  Z1SS   CH     SB          
      6.67856770E-10    3      1000022       -11        12             # W2SS+  -->  Z1SS   E+     NUE         
      6.67856770E-10    3      1000022       -13        14             # W2SS+  -->  Z1SS   MU+    NUM         
      8.35077008E-10    3      1000022       -15        16             # W2SS+  -->  Z1SS   TAU+   NUT         
      1.99809317E-02    2      1000022        24                       # W2SS+  -->  Z1SS   W+                 
      1.90170368E-09    3      1000023         2        -1             # W2SS+  -->  Z2SS   UP     DB          
      1.90170368E-09    3      1000023         4        -3             # W2SS+  -->  Z2SS   CH     SB          
      1.14673815E-09    3      1000023       -11        12             # W2SS+  -->  Z2SS   E+     NUE         
      1.14673815E-09    3      1000023       -13        14             # W2SS+  -->  Z2SS   MU+    NUM         
      1.34556255E-09    3      1000023       -15        16             # W2SS+  -->  Z2SS   TAU+   NUT         
      5.64170361E-01    2      1000023        24                       # W2SS+  -->  Z2SS   W+                 
      1.50530823E-05    3      1000025         2        -1             # W2SS+  -->  Z3SS   UP     DB          
      1.50530823E-05    3      1000025         4        -3             # W2SS+  -->  Z3SS   CH     SB          
      5.01721206E-06    3      1000025       -11        12             # W2SS+  -->  Z3SS   E+     NUE         
      5.01721206E-06    3      1000025       -13        14             # W2SS+  -->  Z3SS   MU+    NUM         
      5.01732893E-06    3      1000025       -15        16             # W2SS+  -->  Z3SS   TAU+   NUT         
      3.21976334E-01    2      1000024        23                       # W2SS+  -->  W1SS+  Z0                 
      2.13736939E-09    3      1000024         1        -1             # W2SS+  -->  W1SS+  DN     DB          
      2.13736850E-09    3      1000024         3        -3             # W2SS+  -->  W1SS+  ST     SB          
      4.80545470E-09    3      1000024         2        -2             # W2SS+  -->  W1SS+  UP     UB          
      4.80545470E-09    3      1000024         4        -4             # W2SS+  -->  W1SS+  CH     CB          
      1.57469293E-09    3      1000024        12       -12             # W2SS+  -->  W1SS+  NUE    ANUE        
      1.57469293E-09    3      1000024        14       -14             # W2SS+  -->  W1SS+  NUM    ANUM        
      1.62908942E-09    3      1000024        16       -16             # W2SS+  -->  W1SS+  NUT    ANUT        
      6.99341085E-10    3      1000024        11       -11             # W2SS+  -->  W1SS+  E-     E+          
      6.99341085E-10    3      1000024        13       -13             # W2SS+  -->  W1SS+  MU-    MU+         
      7.12369275E-10    3      1000024        15       -15             # W2SS+  -->  W1SS+  TAU-   TAU+        
      9.38272625E-02    2      1000024        25                       # W2SS+  -->  W1SS+  HL0                
#         PDG         Width
DECAY        25  8.86427425E-03   # HL0   decays
#          BR          NDA       ID1       ID2       ID3       ID4
      2.23502816E-09    2           11       -11                       # HL0    -->  E-     E+                 
      9.43664490E-05    2           13       -13                       # HL0    -->  MU-    MU+                
      2.69899648E-02    2           15       -15                       # HL0    -->  TAU-   TAU+               
      2.80489508E-06    2            1        -1                       # HL0    -->  DN     DB                 
      1.13331818E-03    2            3        -3                       # HL0    -->  ST     SB                 
      3.71151239E-01    2            5        -5                       # HL0    -->  BT     BB                 
      8.91546563E-07    2            2        -2                       # HL0    -->  UP     UB                 
      1.67650227E-02    2            4        -4                       # HL0    -->  CH     CB                 
      9.61889222E-04    2           22        22                       # HL0    -->  GM     GM                 
      1.83254778E-02    2           21        21                       # HL0    -->  GL     GL                 
      1.53677631E-03    3           24        11       -12             # HL0    -->  W+     E-     ANUE        
      1.53677631E-03    3           24        13       -14             # HL0    -->  W+     MU-    ANUM        
      1.53677631E-03    3           24        15       -16             # HL0    -->  W+     TAU-   ANUT        
      4.61032894E-03    3           24        -2         1             # HL0    -->  W+     UB     DN          
      4.61032894E-03    3           24        -4         3             # HL0    -->  W+     CB     ST          
      1.53677631E-03    3          -24       -11        12             # HL0    -->  W-     E+     NUE         
      1.53677631E-03    3          -24       -13        14             # HL0    -->  W-     MU+    NUM         
      1.53677631E-03    3          -24       -15        16             # HL0    -->  W-     TAU+   NUT         
      4.61032894E-03    3          -24         2        -1             # HL0    -->  W-     UP     DB          
      4.61032894E-03    3          -24         4        -3             # HL0    -->  W-     CH     SB          
      1.46773047E-04    3           23        12       -12             # HL0    -->  Z0     NUE    ANUE        
      1.46773047E-04    3           23        14       -14             # HL0    -->  Z0     NUM    ANUM        
      1.46773047E-04    3           23        16       -16             # HL0    -->  Z0     NUT    ANUT        
      7.38693998E-05    3           23        11       -11             # HL0    -->  Z0     E-     E+          
      7.38693998E-05    3           23        13       -13             # HL0    -->  Z0     MU-    MU+         
      7.38693998E-05    3           23        15       -15             # HL0    -->  Z0     TAU-   TAU+        
      2.53070320E-04    3           23         2        -2             # HL0    -->  Z0     UP     UB          
      2.53070320E-04    3           23         4        -4             # HL0    -->  Z0     CH     CB          
      3.26016918E-04    3           23         1        -1             # HL0    -->  Z0     DN     DB          
      3.26016918E-04    3           23         3        -3             # HL0    -->  Z0     ST     SB          
      3.26016918E-04    3           23         5        -5             # HL0    -->  Z0     BT     BB          
      5.34766853E-01    2      1000022   1000022                       # HL0    -->  Z1SS   Z1SS               
#         PDG         Width
DECAY        35  3.96703568E+01   # HH0   decays
#          BR          NDA       ID1       ID2       ID3       ID4
      1.09621912E-09    2           11       -11                       # HH0    -->  E-     E+                 
      4.62843454E-05    2           13       -13                       # HH0    -->  MU-    MU+                
      1.32565079E-02    2           15       -15                       # HH0    -->  TAU-   TAU+               
      1.33339881E-06    2            1        -1                       # HH0    -->  DN     DB                 
      5.38760622E-04    2            3        -3                       # HH0    -->  ST     SB                 
      7.17921630E-02    2            5        -5                       # HH0    -->  BT     BB                 
      4.29481832E-11    2            2        -2                       # HH0    -->  UP     UB                 
      5.44493275E-07    2            4        -4                       # HH0    -->  CH     CB                 
      2.81379353E-02    2            6        -6                       # HH0    -->  TP     TB                 
      2.64329941E-07    2           22        22                       # HH0    -->  GM     GM                 
      6.84058205E-06    2           21        21                       # HH0    -->  GL     GL                 
      1.47595165E-05    2           24       -24                       # HH0    -->  W+     W-                 
      7.56308873E-06    2           23        23                       # HH0    -->  Z0     Z0                 
      3.65128033E-02    2      1000022   1000022                       # HH0    -->  Z1SS   Z1SS               
      5.66101782E-02    2      1000022   1000023                       # HH0    -->  Z1SS   Z2SS               
      5.48004359E-02    2      1000022   1000025                       # HH0    -->  Z1SS   Z3SS               
      4.90370765E-03    2      1000022   1000035                       # HH0    -->  Z1SS   Z4SS               
      2.15859674E-02    2      1000023   1000023                       # HH0    -->  Z2SS   Z2SS               
      3.27891223E-02    2      1000023   1000025                       # HH0    -->  Z2SS   Z3SS               
      1.50321750E-03    2      1000023   1000035                       # HH0    -->  Z2SS   Z4SS               
      1.56690422E-02    2      1000025   1000025                       # HH0    -->  Z3SS   Z3SS               
      8.18177313E-02    2      1000025   1000035                       # HH0    -->  Z3SS   Z4SS               
      4.28702421E-02    2      1000035   1000035                       # HH0    -->  Z4SS   Z4SS               
      1.70852035E-01    2      1000024  -1000024                       # HH0    -->  W1SS+  W1SS-              
      2.28332784E-02    2      1000037  -1000037                       # HH0    -->  W2SS+  W2SS-              
      1.71697006E-01    2      1000024  -1000037                       # HH0    -->  W1SS+  W2SS-              
      1.71697006E-01    2     -1000024   1000037                       # HH0    -->  W1SS-  W2SS+              
      5.52353122E-05    2           25        25                       # HH0    -->  HL0    HL0                
#         PDG         Width
DECAY        36  3.94149208E+01   # HA0   decays
#          BR          NDA       ID1       ID2       ID3       ID4
      1.09615284E-09    2           11       -11                       # HA0    -->  E-     E+                 
      4.62815515E-05    2           13       -13                       # HA0    -->  MU-    MU+                
      1.32557321E-02    2           15       -15                       # HA0    -->  TAU-   TAU+               
      1.33337926E-06    2            1        -1                       # HA0    -->  DN     DB                 
      5.38752705E-04    2            3        -3                       # HA0    -->  ST     SB                 
      7.17915595E-02    2            5        -5                       # HA0    -->  BT     BB                 
      4.26638724E-11    2            2        -2                       # HA0    -->  UP     UB                 
      5.41272584E-07    2            4        -4                       # HA0    -->  CH     CB                 
      2.83618905E-02    2            6        -6                       # HA0    -->  TP     TB                 
      9.98937594E-07    2           22        22                       # HA0    -->  GM     GM                 
      1.11151703E-05    2           21        21                       # HA0    -->  GL     GL                 
      4.21806797E-02    2      1000022   1000022                       # HA0    -->  Z1SS   Z1SS               
      6.87153637E-02    2      1000022   1000023                       # HA0    -->  Z1SS   Z2SS               
      3.09008788E-02    2      1000022   1000025                       # HA0    -->  Z1SS   Z3SS               
      1.23194428E-02    2      1000022   1000035                       # HA0    -->  Z1SS   Z4SS               
      2.73074806E-02    2      1000023   1000023                       # HA0    -->  Z2SS   Z2SS               
      1.72955580E-02    2      1000023   1000025                       # HA0    -->  Z2SS   Z3SS               
      4.25852789E-03    2      1000023   1000035                       # HA0    -->  Z2SS   Z4SS               
      1.03077656E-02    2      1000025   1000025                       # HA0    -->  Z3SS   Z3SS               
      6.44518733E-02    2      1000025   1000035                       # HA0    -->  Z3SS   Z4SS               
      7.12222606E-02    2      1000035   1000035                       # HA0    -->  Z4SS   Z4SS               
      2.05777362E-01    2      1000024  -1000024                       # HA0    -->  W1SS+  W1SS-              
      5.73943406E-02    2      1000037  -1000037                       # HA0    -->  W2SS+  W2SS-              
      1.36922792E-01    2      1000024  -1000037                       # HA0    -->  W1SS+  W2SS-              
      1.36922792E-01    2     -1000024   1000037                       # HA0    -->  W1SS-  W2SS+              
      1.46950697E-05    2           25        23                       # HA0    -->  HL0    Z0                 
#         PDG         Width
DECAY        37  3.93226738E+01   # H+    decays
#          BR          NDA       ID1       ID2       ID3       ID4
      1.10650833E-09    2           12       -11                       # H+     -->  NUE    E+                 
      4.67187783E-05    2           14       -13                       # H+     -->  NUM    MU+                
      1.33809615E-02    2           16       -15                       # H+     -->  NUT    TAU+               
      1.24600115E-06    2            2        -1                       # H+     -->  UP     DB                 
      5.03936550E-04    2            4        -3                       # H+     -->  CH     SB                 
      9.27979276E-02    2            6        -5                       # H+     -->  TP     BB                 
      8.42915624E-02    2      1000024   1000022                       # H+     -->  W1SS+  Z1SS               
      1.78258456E-02    2      1000024   1000023                       # H+     -->  W1SS+  Z2SS               
      1.69831485E-01    2      1000024   1000025                       # H+     -->  W1SS+  Z3SS               
      1.95469737E-01    2      1000024   1000035                       # H+     -->  W1SS+  Z4SS               
      5.48935868E-03    2      1000037   1000022                       # H+     -->  W2SS+  Z1SS               
      3.42591882E-01    2      1000037   1000023                       # H+     -->  W2SS+  Z2SS               
      6.96917251E-02    2      1000037   1000025                       # H+     -->  W2SS+  Z3SS               
      8.06275755E-03    2      1000037   1000035                       # H+     -->  W2SS+  Z4SS               
      1.48635563E-05    2           25        24                       # H+     -->  HL0    W+                 
