  65
  401   2000.8307    0.27550E-25
  402   1999.3210    0.27445E-25
  403   2000.8307    0.27550E-25
  404   1999.3215    0.27445E-25
  405   1999.7639    0.40221E-25
  406   1829.0583    0.14291E-25
  407   2000.8307    0.27550E-25
  408   1999.3210    0.27445E-25
  409   2000.8307    0.27550E-25
  410   1999.3215    0.27445E-25
  411   1999.7639    0.40221E-25
  412   1829.0583    0.14291E-25
  413   2000.1520    0.58579E-24
  414   1999.6959    0.14648E-24
  415   2000.1520    0.58579E-24
  416   1999.6964    0.14648E-24
  417   2001.2222    0.15542E-25
  418   2165.3201    0.81203E-26
  419   2000.1520    0.58579E-24
  420   1999.6959    0.14648E-24
  421   2000.1520    0.58579E-24
  422   1999.6964    0.14648E-24
  423   2001.2222    0.15542E-25
  424   2165.3201    0.81203E-26
  425   2000.5267    0.25164E-25
  426   1999.0170    0.25119E-25
  427   2000.5267    0.25164E-25
  428   1999.0170    0.25119E-25
  429    121.1378    0.51245E-23
  430   1999.0170    0.24980E-25
  431   2000.5267    0.25164E-25
  432   1999.0170    0.25119E-25
  433   2000.5267    0.25164E-25
  434   1999.0170    0.25119E-25
  435    121.1378    0.51245E-23
  436   1999.0170    0.24980E-25
  437    121.1763    0.51045E-23
  438      0.0000    0.10000E+31
  439    121.1764    0.51045E-23
  440      0.0000    0.10000E+31
  441   2000.5476    0.25024E-25
  442      0.0000    0.10000E+31
  443    121.1763    0.51045E-23
  444      0.0000    0.10000E+31
  445    121.1764    0.51045E-23
  446      0.0000    0.10000E+31
  447   2000.5476    0.25024E-25
  448      0.0000    0.10000E+31
  449   2000.0000    0.22093E-24
  450     82.9511    0.10000E+31
  451    159.3401    0.61473E-23
  452   -166.9793    0.81048E-22
  453    374.6881    0.23675E-24
  454    143.8898    0.94209E-21
  455    374.6084    0.23821E-24
  456    143.8898    0.94209E-21
  457    374.6084    0.23821E-24
  203    119.0230    0.13106E-21
  204    504.3768    0.37391E-24
  205    500.0000    0.28326E-24
  206    509.4133    0.39141E-24
  207    509.4133    0.39141E-24
  458      0.0000    0.10000E+31
    6    172.5000    0.57395E-24
   12    172.5000    0.57395E-24
   6
   401  0.23326164E-01     0   450     1     0     0     0
   401  0.12616443E-01     0   451     1     0     0     0
   401  0.43194075E-02     0   452     1     0     0     0
   401  0.30146715E+00     0   453     1     0     0     0
   401  0.30594468E-01     0   456     2     0     0     0
   401  0.62767631E+00     0   457     2     0     0     0
   6
   402  0.11648613E-02     0   450     2     0     0     0
   402  0.48075017E-01     0   451     2     0     0     0
   402  0.19512667E-02     0   452     2     0     0     0
   402  0.28939354E+00     0   453     2     0     0     0
   402  0.10150027E+00     0   454     1     0     0     0
   402  0.55791503E+00     0   455     1     0     0     0
   6
   403  0.23326181E-01     0   450     3     0     0     0
   403  0.12616452E-01     0   451     3     0     0     0
   403  0.43194108E-02     0   452     3     0     0     0
   403  0.30146739E+00     0   453     3     0     0     0
   403  0.30594457E-01     0   456     4     0     0     0
   403  0.62767613E+00     0   457     4     0     0     0
   6
   404  0.11648604E-02     0   450     4     0     0     0
   404  0.48074987E-01     0   451     4     0     0     0
   404  0.19512653E-02     0   452     4     0     0     0
   404  0.28939334E+00     0   453     4     0     0     0
   404  0.10150030E+00     0   454     3     0     0     0
   404  0.55791527E+00     0   455     3     0     0     0
   7
   405  0.72372071E-01     0   450     5     0     0     0
   405  0.24726911E-01     0   451     5     0     0     0
   405  0.26469175E-02     0   452     5     0     0     0
   405  0.10467349E+00     0   453     5     0     0     0
   405  0.39144111E+00     0   456     6     0     0     0
   405  0.27773279E+00     0   457     6     0     0     0
   405  0.12640670E+00     0   199   406     0     0     0
   6
   406  0.24284441E-01     0   450     6     0     0     0
   406  0.18687725E+00     0   451     6     0     0     0
   406  0.22046749E+00     0   452     6     0     0     0
   406  0.17343928E+00     0   453     6     0     0     0
   406  0.96651271E-01     0   454     5     0     0     0
   406  0.29828030E+00     0   455     5     0     0     0
   6
   407  0.23326164E-01     0   450     7     0     0     0
   407  0.12616443E-01     0   451     7     0     0     0
   407  0.43194075E-02     0   452     7     0     0     0
   407  0.30146715E+00     0   453     7     0     0     0
   407  0.30594468E-01     0   454     8     0     0     0
   407  0.62767631E+00     0   455     8     0     0     0
   6
   408  0.11648613E-02     0   450     8     0     0     0
   408  0.48075017E-01     0   451     8     0     0     0
   408  0.19512667E-02     0   452     8     0     0     0
   408  0.28939354E+00     0   453     8     0     0     0
   408  0.10150027E+00     0   456     7     0     0     0
   408  0.55791503E+00     0   457     7     0     0     0
   6
   409  0.23326181E-01     0   450     9     0     0     0
   409  0.12616452E-01     0   451     9     0     0     0
   409  0.43194108E-02     0   452     9     0     0     0
   409  0.30146739E+00     0   453     9     0     0     0
   409  0.30594457E-01     0   454    10     0     0     0
   409  0.62767613E+00     0   455    10     0     0     0
   6
   410  0.11648604E-02     0   450    10     0     0     0
   410  0.48074987E-01     0   451    10     0     0     0
   410  0.19512653E-02     0   452    10     0     0     0
   410  0.28939334E+00     0   453    10     0     0     0
   410  0.10150030E+00     0   456     9     0     0     0
   410  0.55791527E+00     0   457     9     0     0     0
   7
   411  0.72372071E-01     0   450    11     0     0     0
   411  0.24726911E-01     0   451    11     0     0     0
   411  0.26469175E-02     0   452    11     0     0     0
   411  0.10467349E+00     0   453    11     0     0     0
   411  0.39144111E+00     0   454    12     0     0     0
   411  0.27773279E+00     0   455    12     0     0     0
   411  0.12640670E+00     0   198   412     0     0     0
   6
   412  0.24284441E-01     0   450    12     0     0     0
   412  0.18687725E+00     0   451    12     0     0     0
   412  0.22046749E+00     0   452    12     0     0     0
   412  0.17343928E+00     0   453    12     0     0     0
   412  0.96651271E-01     0   456    11     0     0     0
   412  0.29828030E+00     0   457    11     0     0     0
   4
   413  0.74279743E+00     0   450     1     0     0     0
   413  0.24536318E+00     0   451     1     0     0     0
   413  0.97777182E-02     0   452     1     0     0     0
   413  0.20617577E-02     0   453     1     0     0     0
   4
   414  0.74279833E+00     0   450     2     0     0     0
   414  0.24536240E+00     0   451     2     0     0     0
   414  0.97776800E-02     0   452     2     0     0     0
   414  0.20616951E-02     0   453     2     0     0     0
   4
   415  0.74279743E+00     0   450     3     0     0     0
   415  0.24536318E+00     0   451     3     0     0     0
   415  0.97777182E-02     0   452     3     0     0     0
   415  0.20617577E-02     0   453     3     0     0     0
   4
   416  0.74279827E+00     0   450     4     0     0     0
   416  0.24536242E+00     0   451     4     0     0     0
   416  0.97776819E-02     0   452     4     0     0     0
   416  0.20616951E-02     0   453     4     0     0     0
   7
   417  0.77815941E-02     0   450     5     0     0     0
   417  0.95024016E-02     0   451     5     0     0     0
   417  0.90792878E-02     0   452     5     0     0     0
   417  0.13002931E+00     0   453     5     0     0     0
   417  0.37075272E+00     0   456     6     0     0     0
   417  0.33315626E+00     0   457     6     0     0     0
   417  0.13969845E+00     0   199   406     0     0     0
   9
   418  0.25898576E+00     0   454     5     0     0     0
   418  0.21868836E-01     0   455     5     0     0     0
   418  0.21627156E+00     0   200   406     0     0     0
   418  0.22922156E-01     0   198   405     0     0     0
   418  0.61405346E-01     0   198   417     0     0     0
   418  0.74956305E-01     0   450     6     0     0     0
   418  0.12601145E+00     0   451     6     0     0     0
   418  0.19552635E+00     0   452     6     0     0     0
   418  0.22052376E-01     0   453     6     0     0     0
   4
   419  0.74279743E+00     0   450     7     0     0     0
   419  0.24536318E+00     0   451     7     0     0     0
   419  0.97777182E-02     0   452     7     0     0     0
   419  0.20617577E-02     0   453     7     0     0     0
   4
   420  0.74279833E+00     0   450     8     0     0     0
   420  0.24536240E+00     0   451     8     0     0     0
   420  0.97776800E-02     0   452     8     0     0     0
   420  0.20616951E-02     0   453     8     0     0     0
   4
   421  0.74279743E+00     0   450     9     0     0     0
   421  0.24536318E+00     0   451     9     0     0     0
   421  0.97777182E-02     0   452     9     0     0     0
   421  0.20617577E-02     0   453     9     0     0     0
   4
   422  0.74279827E+00     0   450    10     0     0     0
   422  0.24536242E+00     0   451    10     0     0     0
   422  0.97776819E-02     0   452    10     0     0     0
   422  0.20616951E-02     0   453    10     0     0     0
   7
   423  0.77815941E-02     0   450    11     0     0     0
   423  0.95024016E-02     0   451    11     0     0     0
   423  0.90792878E-02     0   452    11     0     0     0
   423  0.13002931E+00     0   453    11     0     0     0
   423  0.37075272E+00     0   454    12     0     0     0
   423  0.33315626E+00     0   455    12     0     0     0
   423  0.13969845E+00     0   198   412     0     0     0
   9
   424  0.25898576E+00     0   456    11     0     0     0
   424  0.21868836E-01     0   457    11     0     0     0
   424  0.21627156E+00     0   200   412     0     0     0
   424  0.22922156E-01     0   199   411     0     0     0
   424  0.61405346E-01     0   199   423     0     0     0
   424  0.74956305E-01     0   450    12     0     0     0
   424  0.12601145E+00     0   451    12     0     0     0
   424  0.19552635E+00     0   452    12     0     0     0
   424  0.22052376E-01     0   453    12     0     0     0
   6
   425  0.44663779E-01     0   450   121     0     0     0
   425  0.97776383E-01     0   451   121     0     0     0
   425  0.47587047E-03     0   452   121     0     0     0
   425  0.25591579E+00     0   453   121     0     0     0
   425  0.27941011E-01     0   456   122     0     0     0
   425  0.57322717E+00     0   457   122     0     0     0
   6
   426  0.10509890E+00     0   450   122     0     0     0
   426  0.21718242E-04     0   451   122     0     0     0
   426  0.69217859E-02     0   452   122     0     0     0
   426  0.28452560E+00     0   453   122     0     0     0
   426  0.92884541E-01     0   454   121     0     0     0
   426  0.51054746E+00     0   455   121     0     0     0
   6
   427  0.44663779E-01     0   450   123     0     0     0
   427  0.97776383E-01     0   451   123     0     0     0
   427  0.47587047E-03     0   452   123     0     0     0
   427  0.25591579E+00     0   453   123     0     0     0
   427  0.27941011E-01     0   456   124     0     0     0
   427  0.57322717E+00     0   457   124     0     0     0
   6
   428  0.10509890E+00     0   450   124     0     0     0
   428  0.21718242E-04     0   451   124     0     0     0
   428  0.69217859E-02     0   452   124     0     0     0
   428  0.28452560E+00     0   453   124     0     0     0
   428  0.92884541E-01     0   454   123     0     0     0
   428  0.51054746E+00     0   455   123     0     0     0
   1
   429  0.10000000E+01     0   450   125     0     0     0
   7
   430  0.10451726E+00     0   450   126     0     0     0
   430  0.21598051E-04     0   451   126     0     0     0
   430  0.68834797E-02     0   452   126     0     0     0
   430  0.28295100E+00     0   453   126     0     0     0
   430  0.97636387E-01     0   454   125     0     0     0
   430  0.50795591E+00     0   455   125     0     0     0
   430  0.34319775E-04     0   198   429     0     0     0
   6
   431  0.44663779E-01     0   450   127     0     0     0
   431  0.97776383E-01     0   451   127     0     0     0
   431  0.47587047E-03     0   452   127     0     0     0
   431  0.25591579E+00     0   453   127     0     0     0
   431  0.27941011E-01     0   454   128     0     0     0
   431  0.57322717E+00     0   455   128     0     0     0
   6
   432  0.10509890E+00     0   450   128     0     0     0
   432  0.21718242E-04     0   451   128     0     0     0
   432  0.69217859E-02     0   452   128     0     0     0
   432  0.28452560E+00     0   453   128     0     0     0
   432  0.92884541E-01     0   456   127     0     0     0
   432  0.51054746E+00     0   457   127     0     0     0
   6
   433  0.44663779E-01     0   450   129     0     0     0
   433  0.97776383E-01     0   451   129     0     0     0
   433  0.47587047E-03     0   452   129     0     0     0
   433  0.25591579E+00     0   453   129     0     0     0
   433  0.27941011E-01     0   454   130     0     0     0
   433  0.57322717E+00     0   455   130     0     0     0
   6
   434  0.10509890E+00     0   450   130     0     0     0
   434  0.21718242E-04     0   451   130     0     0     0
   434  0.69217859E-02     0   452   130     0     0     0
   434  0.28452560E+00     0   453   130     0     0     0
   434  0.92884541E-01     0   456   129     0     0     0
   434  0.51054746E+00     0   457   129     0     0     0
   1
   435  0.10000000E+01     0   450   131     0     0     0
   7
   436  0.10451726E+00     0   450   132     0     0     0
   436  0.21598051E-04     0   451   132     0     0     0
   436  0.68834797E-02     0   452   132     0     0     0
   436  0.28295100E+00     0   453   132     0     0     0
   436  0.97636387E-01     0   456   131     0     0     0
   436  0.50795591E+00     0   457   131     0     0     0
   436  0.34319775E-04     0   199   435     0     0     0
   1
   437  0.10000000E+01     0   450   121     0     0     0
   0
   1
   439  0.10000000E+01     0   450   123     0     0     0
   0
   8
   441  0.45400273E-01     0   450   125     0     0     0
   441  0.99092908E-01     0   451   125     0     0     0
   441  0.30177338E-02     0   452   125     0     0     0
   441  0.25462130E+00     0   453   125     0     0     0
   441  0.27775791E-01     0   456   126     0     0     0
   441  0.57005686E+00     0   457   126     0     0     0
   441  0.17433124E-04     0   200   429     0     0     0
   441  0.17767483E-04     0   203   429     0     0     0
   0
   1
   443  0.10000000E+01     0   450   127     0     0     0
   0
   1
   445  0.10000000E+01     0   450   129     0     0     0
   0
   8
   447  0.45400273E-01     0   450   131     0     0     0
   447  0.99092908E-01     0   451   131     0     0     0
   447  0.30177338E-02     0   452   131     0     0     0
   447  0.25462130E+00     0   453   131     0     0     0
   447  0.27775791E-01     0   454   132     0     0     0
   447  0.57005686E+00     0   455   132     0     0     0
   447  0.17433124E-04     0   200   435     0     0     0
   447  0.17767483E-04     0   203   435     0     0     0
   0
  32
   449  0.40751690E-03     0   454     1     8     0     0
   449  0.40751690E-03     0   456     2     7     0     0
   449  0.40751690E-03     0   454     3    10     0     0
   449  0.40751690E-03     0   456     4     9     0     0
   449  0.61353821E-01     0   454     5    12     0     0
   449  0.61353821E-01     0   456     6    11     0     0
   449  0.78992713E-02     0   455     1     8     0     0
   449  0.78992713E-02     0   457     2     7     0     0
   449  0.78992713E-02     0   455     3    10     0     0
   449  0.78992713E-02     0   457     4     9     0     0
   449  0.13838860E+00     0   455     5    12     0     0
   449  0.13838860E+00     0   457     6    11     0     0
   449  0.17845206E-03     0   450    13     0     0     0
   449  0.16224911E-02     0   450     1     7     0     0
   449  0.16224911E-02     0   450     3     9     0     0
   449  0.17479827E-02     0   450     5    11     0     0
   449  0.21790899E-01     0   450     6    12     0     0
   449  0.60033234E-03     0   451    13     0     0     0
   449  0.68150699E-03     0   451     1     7     0     0
   449  0.68150699E-03     0   451     3     9     0     0
   449  0.10019249E-02     0   451     5    11     0     0
   449  0.16510275E+00     0   451     6    12     0     0
   449  0.98850718E-03     0   452    13     0     0     0
   449  0.11986456E-03     0   452     1     7     0     0
   449  0.11986456E-03     0   452     3     9     0     0
   449  0.57904120E-03     0   452     5    11     0     0
   449  0.19637099E+00     0   452     6    12     0     0
   449  0.70438116E-04     0   453    13     0     0     0
   449  0.84430911E-02     0   453     1     7     0     0
   449  0.84430911E-02     0   453     3     9     0     0
   449  0.83894469E-02     0   453     5    11     0     0
   449  0.14873329E+00     0   453     6    12     0     0
   0
  17
   451  0.90711095E-04     0   450     2     8     0     0
   451  0.11672723E-03     0   450     1     7     0     0
   451  0.11672723E-03     0   450     3     9     0     0
   451  0.90711088E-04     0   450     4    10     0     0
   451  0.11372268E-03     0   450     5    11     0     0
   451  0.26341391E-04     0   450   121   127     0     0
   451  0.26341391E-04     0   450   123   129     0     0
   451  0.26295431E-04     0   450   125   131     0     0
   451  0.52635074E-04     0   450   122   128     0     0
   451  0.52635074E-04     0   450   124   130     0     0
   451  0.52635074E-04     0   450   126   132     0     0
   451  0.16621834E+00     0   437   127     0     0     0
   451  0.16621834E+00     0   443   121     0     0     0
   451  0.16621755E+00     0   439   129     0     0     0
   451  0.16621755E+00     0   445   123     0     0     0
   451  0.16718136E+00     0   429   131     0     0     0
   451  0.16718136E+00     0   435   125     0     0     0
  28
   452  0.24232611E-04     0   450    59     0     0     0
   452  0.27374856E-03     0   456     2     7     0     0
   452  0.91249516E-04     0   456   122   127     0     0
   452  0.91249516E-04     0   456   124   129     0     0
   452  0.27374856E-03     0   454     1     8     0     0
   452  0.91249516E-04     0   454   121   128     0     0
   452  0.91249516E-04     0   454   123   130     0     0
   452  0.27374856E-03     0   456     4     9     0     0
   452  0.91249516E-04     0   456   126   131     0     0
   452  0.27374856E-03     0   454     3    10     0     0
   452  0.91249516E-04     0   454   125   132     0     0
   452  0.15590306E-01     0   450     2     8     0     0
   452  0.20099293E-01     0   450     1     7     0     0
   452  0.20099293E-01     0   450     3     9     0     0
   452  0.15590306E-01     0   450     4    10     0     0
   452  0.19870350E-01     0   450     5    11     0     0
   452  0.45604608E-02     0   450   121   127     0     0
   452  0.45604608E-02     0   450   123   129     0     0
   452  0.45500528E-02     0   450   125   131     0     0
   452  0.90764593E-02     0   450   122   128     0     0
   452  0.90764593E-02     0   450   124   130     0     0
   452  0.90764593E-02     0   450   126   132     0     0
   452  0.11548167E+00     0   437   127     0     0     0
   452  0.11548167E+00     0   443   121     0     0     0
   452  0.11548128E+00     0   439   129     0     0     0
   452  0.11548128E+00     0   445   123     0     0     0
   452  0.20212872E+00     0   429   131     0     0     0
   452  0.20212872E+00     0   435   125     0     0     0
  14
   453  0.29324955E+00     0   454   199     0     0     0
   453  0.29324955E+00     0   456   198     0     0     0
   453  0.43637329E-03     0   450   200     0     0     0
   453  0.19581316E-01     0   451   200     0     0     0
   453  0.21398555E+00     0   452   200     0     0     0
   453  0.86127128E-02     0   450   203     0     0     0
   453  0.15655774E+00     0   451   203     0     0     0
   453  0.10536366E-01     0   452   203     0     0     0
   453  0.60488220E-03     0   437   127     0     0     0
   453  0.60488220E-03     0   443   121     0     0     0
   453  0.60488214E-03     0   439   129     0     0     0
   453  0.60488214E-03     0   445   123     0     0     0
   453  0.68572507E-03     0   429   131     0     0     0
   453  0.68572507E-03     0   435   125     0     0     0
   6
   454  0.12853013E+00     0   450     2     7     0     0
   454  0.12853013E+00     0   450     4     9     0     0
   454  0.42832337E-01     0   450   127   122     0     0
   454  0.42832337E-01     0   450   129   124     0     0
   454  0.42832408E-01     0   450   131   126     0     0
   454  0.61444271E+00     0   435   126     0     0     0
   6
   455  0.16564270E-01     0   450   198     0     0     0
   455  0.26881611E+00     0   451   198     0     0     0
   455  0.25823912E+00     0   452   198     0     0     0
   455  0.16772193E-03     0   435   126     0     0     0
   455  0.26971376E+00     0   454   200     0     0     0
   455  0.18649907E+00     0   454   203     0     0     0
   6
   456  0.12853013E+00     0   450     8     1     0     0
   456  0.12853013E+00     0   450    10     3     0     0
   456  0.42832337E-01     0   450   121   128     0     0
   456  0.42832337E-01     0   450   123   130     0     0
   456  0.42832408E-01     0   450   125   132     0     0
   456  0.61444271E+00     0   429   132     0     0     0
   6
   457  0.16564270E-01     0   450   199     0     0     0
   457  0.26881611E+00     0   451   199     0     0     0
   457  0.25823912E+00     0   452   199     0     0     0
   457  0.16772193E-03     0   429   132     0     0     0
   457  0.26971376E+00     0   456   200     0     0     0
   457  0.18649907E+00     0   456   203     0     0     0
  28
   203  0.20216728E-03     0   123   129     0     0     0
   203  0.57826653E-01     0   125   131     0     0     0
   203  0.24269880E-02     0     3     9     0     0     0
   203  0.79174972E+00     0     5    11     0     0     0
   203  0.30114090E-01     0     4    10     0     0     0
   203  0.17381835E-02     0    59    59     0     0     0
   203  0.34973491E-01     0    13    13     0     0     0
   203  0.41243802E-02     0   198   121   128     0     0
   203  0.41243802E-02     0   198   123   130     0     0
   203  0.41243802E-02     0   198   125   132     0     0
   203  0.12373139E-01     0   198     8     1     0     0
   203  0.12373139E-01     0   198    10     3     0     0
   203  0.41243802E-02     0   199   127   122     0     0
   203  0.41243802E-02     0   199   129   124     0     0
   203  0.41243802E-02     0   199   131   126     0     0
   203  0.12373139E-01     0   199     2     7     0     0
   203  0.12373139E-01     0   199     4     9     0     0
   203  0.46028406E-03     0   200   122   128     0     0
   203  0.46028406E-03     0   200   124   130     0     0
   203  0.46028406E-03     0   200   126   132     0     0
   203  0.23165633E-03     0   200   121   127     0     0
   203  0.23165633E-03     0   200   123   129     0     0
   203  0.23165633E-03     0   200   125   131     0     0
   203  0.79363497E-03     0   200     2     8     0     0
   203  0.79363497E-03     0   200     4    10     0     0
   203  0.10223974E-02     0   200     1     7     0     0
   203  0.10223974E-02     0   200     3     9     0     0
   203  0.10223974E-02     0   200     5    11     0     0
  20
   204  0.73622803E-04     0   123   129     0     0     0
   204  0.21085136E-01     0   125   131     0     0     0
   204  0.86839485E-03     0     3     9     0     0     0
   204  0.23300670E+00     0     5    11     0     0     0
   204  0.23237254E+00     0     6    12     0     0     0
   204  0.35093966E-03     0    13    13     0     0     0
   204  0.46300017E-02     0   198   199     0     0     0
   204  0.22760762E-02     0   200   200     0     0     0
   204  0.90153545E-01     0   450   450     0     0     0
   204  0.59167951E-01     0   450   451     0     0     0
   204  0.16286501E+00     0   450   452     0     0     0
   204  0.66611180E-02     0   450   453     0     0     0
   204  0.16850578E-04     0   451   451     0     0     0
   204  0.36012030E-02     0   451   452     0     0     0
   204  0.14114887E-01     0   452   452     0     0     0
   204  0.14821492E+00     0   454   456     0     0     0
   204  0.18885408E-01     0   203   203     0     0     0
   204  0.56253711E-03     0   437   443     0     0     0
   204  0.56242495E-03     0   439   445     0     0     0
   204  0.53069094E-03     0   429   435     0     0     0
  15
   205  0.55581797E-04     0   123   129     0     0     0
   205  0.15919078E-01     0   125   131     0     0     0
   205  0.65565231E-03     0     3     9     0     0     0
   205  0.17615312E+00     0     5    11     0     0     0
   205  0.26236725E+00     0     6    12     0     0     0
   205  0.22683549E-03     0    13    13     0     0     0
   205  0.11884750E+00     0   450   450     0     0     0
   205  0.11452758E+00     0   450   451     0     0     0
   205  0.35680421E-01     0   450   452     0     0     0
   205  0.22415427E-01     0   450   453     0     0     0
   205  0.42749001E-04     0   451   451     0     0     0
   205  0.35023310E-02     0   451   452     0     0     0
   205  0.89629116E-02     0   452   452     0     0     0
   205  0.23764615E+00     0   454   456     0     0     0
   205  0.29975572E-02     0   203   200     0     0     0
   9
   206  0.78246849E-04     0   124   129     0     0     0
   206  0.22410557E-01     0   126   131     0     0     0
   206  0.85104455E-03     0     4     9     0     0     0
   206  0.49659902E+00     0     6    11     0     0     0
   206  0.25114483E+00     0   454   450     0     0     0
   206  0.11752877E+00     0   454   451     0     0     0
   206  0.53496957E-01     0   454   452     0     0     0
   206  0.53399451E-01     0   455   450     0     0     0
   206  0.44912337E-02     0   203   198     0     0     0
   9
   207  0.78246849E-04     0   130   123     0     0     0
   207  0.22410557E-01     0   132   125     0     0     0
   207  0.85104455E-03     0    10     3     0     0     0
   207  0.49659902E+00     0    12     5     0     0     0
   207  0.25114483E+00     0   456   450     0     0     0
   207  0.11752877E+00     0   456   451     0     0     0
   207  0.53496957E-01     0   456   452     0     0     0
   207  0.53399451E-01     0   457   450     0     0     0
   207  0.44912337E-02     0   203   199     0     0     0
   0
   5
     6  0.33333334E+00   100     2     7     5     0     0
     6  0.33333334E+00   100     4     9     5     0     0
     6  0.11111111E+00   100   122   127     5     0     0
     6  0.11111111E+00   100   124   129     5     0     0
     6  0.11111111E+00   100   126   131     5     0     0
   5
    12  0.33333334E+00   100     8     1    11     0     0
    12  0.33333334E+00   100    10     3    11     0     0
    12  0.11111111E+00   100   128   121    11     0     0
    12  0.11111111E+00   100   130   123    11     0     0
    12  0.11111111E+00   100   132   125    11     0     0
      6.00000000     -0.18022604
      0.86076480     -0.09998298      0.42215437     -0.26621938
     -0.49701715     -0.28144756      0.58127010     -0.57955682
      0.09927909     -0.09328221     -0.67927831     -0.72112626
      0.04691750     -0.94978374     -0.14997184      0.27058867
     -0.38227728      0.92404765     -0.92404765     -0.38227728
     -0.20939784      0.97783053     -0.97783053     -0.20939784
      0.78484017     -1.02983105     -1.57037592
   4899.00000000      0.00000000      0.00000000
    160.00000000
    T
