#
#                              ======================
#                              | THE SUSYHIT OUTPUT |
#                              ======================
#
#
#              ------------------------------------------------------
#              |     This is the output of the SUSY-HIT package     |
#              |  created by A.Djouadi, M.Muehlleitner and M.Spira. |
#              |  In case of problems with SUSY-HIT email to        |
#              |           margarete.muehlleitner@cern.ch           |
#              |           michael.spira@psi.ch                     |
#              |           abdelhak.djouadi@cern.ch                 |
#              ------------------------------------------------------
#
#              ------------------------------------------------------
#              |  SUSY Les Houches Accord - MSSM Spectrum + Decays  |
#              |              based on the decay programs           |
#              |                                                    |
#              |                     SDECAY 1.3b                    |
#              |                                                    |
#              |  Authors: M.Muhlleitner, A.Djouadi and Y.Mambrini  |
#              |  Ref.:    Comput.Phys.Commun.168(2005)46           |
#              |           [hep-ph/0311167]                         |
#              |                                                    |
#              |                     HDECAY 3.4                     |
#              |                                                    |
#              |  By: A.Djouadi,J.Kalinowski,M.Muhlleitner,M.Spira  |
#              |  Ref.:    Comput.Phys.Commun.108(1998)56           |
#              |           [hep-ph/9704448]                         |
#              |                                                    |
#              |                                                    |
#              |  If not stated otherwise all DRbar couplings and   |
#              |  soft SUSY breaking masses are given at the scale  |
#              |  Q=  0.91187600E+02
#              |                                                    |
#              ------------------------------------------------------
#
#
BLOCK DCINFO  # Decay Program information
     1   SDECAY/HDECAY # decay calculator
     2   1.3b  /3.4    # version number
#
BLOCK SPINFO  # Spectrum calculator information
     1   SuSpect     # RGE +Spectrum calculator            
     2   2.41         # version number                     
#
BLOCK MODSEL  # Model selection
     1     0   # #general MSSM low scale                           
#
BLOCK SMINPUTS  # Standard Model inputs
         1     1.27934000E+02   # alpha_em^-1(M_Z)^MSbar
         2     1.16639000E-05   # G_F [GeV^-2]
         3     1.17200000E-01   # alpha_S(M_Z)^MSbar
         4     9.11870000E+01   # M_Z pole mass
         5     4.25000000E+00   # mb(mb)^MSbar
         6     1.75000000E+02   # mt pole mass
         7     1.77700000E+00   # mtau pole mass
#
BLOCK MINPAR  # Input parameters - minimal models
#
BLOCK EXTPAR  # Input parameters - non-minimal models
         0     9.11876000E+01   # EWSB                
         1     2.32000000E+02   # M_1                 
         2     2.50000000E+03   # M_2                 
         3     9.00000000E+02   # M_3                 
        11     0.00000000E+00   # A_t                 
        12     0.00000000E+00   # A_b                 
        13     0.00000000E+00   # A_tau               
        14     0.00000000E+00   # A_u                 
        15     0.00000000E+00   # A_d                 
        16     0.00000000E+00   # A_e                 
        23    -2.00000000E+02   # mu(EWSB)            
        25     1.50000000E+00   # tanbeta(in)         
        26     2.00000000E+03   # MA_pole             
        31     2.50000000E+03   # M_eL                
        32     2.50000000E+03   # M_muL               
        33     2.50000000E+03   # M_tauL              
        34     2.50000000E+03   # M_eR                
        35     2.50000000E+03   # M_muR               
        36     2.50000000E+03   # M_tauR              
        41     2.50000000E+03   # M_q1L               
        42     2.50000000E+03   # M_q2L               
        43     2.50000000E+03   # M_q3L               
        44     2.50000000E+03   # M_uR                
        45     2.50000000E+03   # M_cR                
        46     2.50000000E+03   # M_tR                
        47     2.50000000E+03   # M_dR                
        48     2.50000000E+03   # M_sR                
        49     2.50000000E+03   # M_bR                
#
BLOCK MASS  # Mass Spectrum
# PDG code           mass       particle
        24     8.05485413E+01   # W+
        25     1.25000000E+02   # h
        35     2.00412403E+03   # H
        36     2.00000000E+03   # A
        37     2.00204072E+03   # H+
         5     4.87877839E+00   # b-quark pole mass calculated from mb(mb)_Msbar
   1000001     2.50026863E+03   # ~d_L
   2000001     2.50005079E+03   # ~d_R
   1000002     2.49978213E+03   # ~u_L
   2000002     2.49989842E+03   # ~u_R
   1000003     2.50026863E+03   # ~s_L
   2000003     2.50005079E+03   # ~s_R
   1000004     2.49978213E+03   # ~c_L
   2000004     2.49989842E+03   # ~c_R
   1000005     2.49996503E+03   # ~b_1
   2000005     2.50035734E+03   # ~b_2
   1000006     2.50056644E+03   # ~t_1
   2000006     2.50890039E+03   # ~t_2
   1000011     2.50016707E+03   # ~e_L
   2000011     2.50015236E+03   # ~e_R
   1000012     2.49968054E+03   # ~nu_eL
   1000013     2.50016707E+03   # ~mu_L
   2000013     2.50015236E+03   # ~mu_R
   1000014     2.49968054E+03   # ~nu_muL
   1000015     2.50005352E+03   # ~tau_1
   2000015     2.50026716E+03   # ~tau_2
   1000016     2.49968054E+03   # ~nu_tauL
   1000021     9.00000000E+02   # ~g
   1000022     1.97957233E+02   # ~chi_10
   1000023    -2.06593555E+02   # ~chi_20
   1000025     2.38279511E+02   # ~chi_30
   1000035     2.50235681E+03   # ~chi_40
   1000024     2.02144722E+02   # ~chi_1+
   1000037     2.50235624E+03   # ~chi_2+
   1000039     4.49000000E-09   # ~gravitino
#
BLOCK NMIX  # Neutralino Mixing Matrix
  1  1     2.18035655E-01   # N_11
  1  2    -5.76159347E-03   # N_12
  1  3    -7.07560749E-01   # N_13
  1  4    -6.72149569E-01   # N_14
  2  1     9.90359864E-02   # N_21
  2  2    -2.86771420E-02   # N_22
  2  3     7.01053454E-01   # N_23
  2  4    -7.05615724E-01   # N_24
  3  1     9.70902667E-01   # N_31
  3  2     4.81688415E-03   # N_32
  3  3     8.73960085E-02   # N_33
  3  4     2.22905240E-01   # N_34
  4  1     5.80679018E-04   # N_41
  4  2    -9.99560515E-01   # N_42
  4  3    -1.56134175E-02   # N_43
  4  4     2.51924753E-02   # N_44
#
BLOCK UMIX  # Chargino Mixing Matrix U
  1  1    -2.20680466E-02   # U_11
  1  2     9.99756471E-01   # U_12
  2  1     9.99756471E-01   # U_21
  2  2     2.20680466E-02   # U_22
#
BLOCK VMIX  # Chargino Mixing Matrix V
  1  1     3.56237359E-02   # V_11
  1  2    -9.99365273E-01   # V_12
  2  1     9.99365273E-01   # V_21
  2  2     3.56237359E-02   # V_22
#
BLOCK STOPMIX  # Stop Mixing Matrix
  1  1     7.12013584E-01   # cos(theta_t)
  1  2    -7.02165690E-01   # sin(theta_t)
  2  1     7.02165690E-01   # -sin(theta_t)
  2  2     7.12013584E-01   # cos(theta_t)
#
BLOCK SBOTMIX  # Sbottom Mixing Matrix
  1  1    -4.71548027E-01   # cos(theta_b)
  1  2     8.81840381E-01   # sin(theta_b)
  2  1    -8.81840381E-01   # -sin(theta_b)
  2  2    -4.71548027E-01   # cos(theta_b)
#
BLOCK STAUMIX  # Stau Mixing Matrix
  1  1    -6.82334965E-01   # cos(theta_tau)
  1  2     7.31039668E-01   # sin(theta_tau)
  2  1    -7.31039668E-01   # -sin(theta_tau)
  2  2    -6.82334965E-01   # cos(theta_tau)
#
BLOCK ALPHA  # Higgs mixing
          -5.89974051E-01   # Mixing angle in the neutral Higgs boson sector
#
BLOCK HMIX Q=  9.11876000E+01  # DRbar Higgs Parameters
         1    -2.00000000E+02   # mu(Q)               
         2     1.49999979E+00   # tanbeta(Q)          
         3     2.51662339E+02   # vev(Q)              
         4     3.98617633E+06   # MA^2(Q)             
#
BLOCK GAUGE Q=  9.11876000E+01  # The gauge couplings
     1     3.53691901E-01   # gprime(Q) DRbar
     2     6.32016983E-01   # g(Q) DRbar
     3     1.10492597E+00   # g3(Q) DRbar
#
BLOCK AU Q=  9.11876000E+01  # The trilinear couplings
  1  1     0.00000000E+00   # A_u(Q) DRbar
  2  2     0.00000000E+00   # A_c(Q) DRbar
  3  3     0.00000000E+00   # A_t(Q) DRbar
#
BLOCK AD Q=  9.11876000E+01  # The trilinear couplings
  1  1     0.00000000E+00   # A_d(Q) DRbar
  2  2     0.00000000E+00   # A_s(Q) DRbar
  3  3     0.00000000E+00   # A_b(Q) DRbar
#
BLOCK AE Q=  9.11876000E+01  # The trilinear couplings
  1  1     0.00000000E+00   # A_e(Q) DRbar
  2  2     0.00000000E+00   # A_mu(Q) DRbar
  3  3     0.00000000E+00   # A_tau(Q) DRbar
#
BLOCK Yu Q=  9.11876000E+01  # The Yukawa couplings
  1  1     0.00000000E+00   # y_u(Q) DRbar
  2  2     0.00000000E+00   # y_c(Q) DRbar
  3  3     1.05725209E+00   # y_t(Q) DRbar
#
BLOCK Yd Q=  9.11876000E+01  # The Yukawa couplings
  1  1     0.00000000E+00   # y_d(Q) DRbar
  2  2     0.00000000E+00   # y_s(Q) DRbar
  3  3     2.75464221E-02   # y_b(Q) DRbar
#
BLOCK Ye Q=  9.11876000E+01  # The Yukawa couplings
  1  1     0.00000000E+00   # y_e(Q) DRbar
  2  2     0.00000000E+00   # y_mu(Q) DRbar
  3  3     1.79947655E-02   # y_tau(Q) DRbar
#
BLOCK MSOFT Q=  9.11876000E+01  # The soft SUSY breaking masses at the scale Q
         1     2.32000000E+02   # M_1                 
         2     2.50000000E+03   # M_2                 
         3     9.00000000E+02   # M_3                 
        14     0.00000000E+00   # A_u                 
        15     0.00000000E+00   # A_d                 
        16     0.00000000E+00   # A_e                 
        21     2.88768402E+06   # M^2_Hd              
        22    -8.26868527E+04   # M^2_Hu              
        31     2.50000000E+03   # M_eL                
        32     2.50000000E+03   # M_muL               
        33     2.50000000E+03   # M_tauL              
        34     2.50000000E+03   # M_eR                
        35     2.50000000E+03   # M_muR               
        36     2.50000000E+03   # M_tauR              
        41     2.50000000E+03   # M_q1L               
        42     2.50000000E+03   # M_q2L               
        43     2.50000000E+03   # M_q3L               
        44     2.50000000E+03   # M_uR                
        45     2.50000000E+03   # M_cR                
        46     2.50000000E+03   # M_tR                
        47     2.50000000E+03   # M_dR                
        48     2.50000000E+03   # M_sR                
        49     2.50000000E+03   # M_bR                
#
#
#
#                             =================
#                             |The decay table|
#                             =================
#
# - The QCD corrections to the decays gluino -> squark  + quark
#                                     squark -> gaugino + quark_prime
#                                     squark -> squark_prime + Higgs
#                                     squark -> gluino  + quark
#   are included.
#
# - The multi-body decays for the inos, stops and sbottoms are included.
#
# - The loop induced decays for the gluino, neutralinos and stops
#   are included.
#
# - The SUSY decays of the top quark are included.
#
# - Possible decays of the NLSP in GMSB models are included.
#
#
#         PDG            Width
DECAY         6     1.45130968E+00   # top decays
#          BR         NDA      ID1       ID2
     1.00000000E+00    2           5        24   # BR(t ->  b    W+)
#
#         PDG            Width
DECAY   1000021     6.92168789E-04   # gluino decays
#          BR         NDA      ID1       ID2
     3.58485368E-02    2     1000022        21   # BR(~g -> ~chi_10 g)
     3.87126241E-02    2     1000023        21   # BR(~g -> ~chi_20 g)
     3.64627876E-03    2     1000025        21   # BR(~g -> ~chi_30 g)
#          BR         NDA      ID1       ID2
     4.87185394E-05    2     1000039        21   # BR(~g -> ~G      g)
#           BR         NDA      ID1       ID2       ID3
     5.03768867E-04    3     1000022         1        -1   # BR(~g -> ~chi_10 d  db)
     1.05968125E-04    3     1000023         1        -1   # BR(~g -> ~chi_20 d  db)
     8.23738278E-03    3     1000025         1        -1   # BR(~g -> ~chi_30 d  db)
     1.59039510E-03    3     1000022         2        -2   # BR(~g -> ~chi_10 u  ub)
     1.64414371E-04    3     1000023         2        -2   # BR(~g -> ~chi_20 u  ub)
     2.84036676E-02    3     1000025         2        -2   # BR(~g -> ~chi_30 u  ub)
     5.03768867E-04    3     1000022         3        -3   # BR(~g -> ~chi_10 s  sb)
     1.05968125E-04    3     1000023         3        -3   # BR(~g -> ~chi_20 s  sb)
     8.23738278E-03    3     1000025         3        -3   # BR(~g -> ~chi_30 s  sb)
     1.59039510E-03    3     1000022         4        -4   # BR(~g -> ~chi_10 c  cb)
     1.64414371E-04    3     1000023         4        -4   # BR(~g -> ~chi_20 c  cb)
     2.84036676E-02    3     1000025         4        -4   # BR(~g -> ~chi_30 c  cb)
     7.75825477E-04    3     1000022         5        -5   # BR(~g -> ~chi_10 b  bb)
     3.36141799E-04    3     1000023         5        -5   # BR(~g -> ~chi_20 b  bb)
     8.22633101E-03    3     1000025         5        -5   # BR(~g -> ~chi_30 b  bb)
     1.59511372E-01    3     1000022         6        -6   # BR(~g -> ~chi_10 t  tb)
     1.33985225E-01    3     1000023         6        -6   # BR(~g -> ~chi_20 t  tb)
     3.62387882E-02    3     1000025         6        -6   # BR(~g -> ~chi_30 t  tb)
     5.54561051E-05    3     1000024         1        -2   # BR(~g -> ~chi_1+ d  ub)
     5.54561051E-05    3    -1000024         2        -1   # BR(~g -> ~chi_1- u  db)
     5.54561051E-05    3     1000024         3        -4   # BR(~g -> ~chi_1+ s  cb)
     5.54561051E-05    3    -1000024         4        -3   # BR(~g -> ~chi_1- c  sb)
     2.52218570E-01    3     1000024         5        -6   # BR(~g -> ~chi_1+ b  tb)
     2.52218570E-01    3    -1000024         6        -5   # BR(~g -> ~chi_1- t  bb)
#
#         PDG            Width
DECAY   1000006     1.67757201E+02   # stop1 decays
#          BR         NDA      ID1       ID2
     9.94905196E-02    2     1000022         6   # BR(~t_1 -> ~chi_10 t )
     1.10806271E-01    2     1000023         6   # BR(~t_1 -> ~chi_20 t )
     4.14742315E-02    2     1000025         6   # BR(~t_1 -> ~chi_30 t )
     1.15102702E-01    2     1000024         5   # BR(~t_1 -> ~chi_1+ b )
     6.33126275E-01    2     1000021         6   # BR(~t_1 -> ~g      t )
#
#         PDG            Width
DECAY   2000006     1.81509104E+02   # stop2 decays
#          BR         NDA      ID1       ID2
     1.09680648E-01    2     1000022         6   # BR(~t_2 -> ~chi_10 t )
     1.18564440E-01    2     1000023         6   # BR(~t_2 -> ~chi_20 t )
     1.25762904E-02    2     1000025         6   # BR(~t_2 -> ~chi_30 t )
     1.16669799E-01    2     1000024         5   # BR(~t_2 -> ~chi_1+ b )
     1.09389283E-06    2     1000037         5   # BR(~t_2 -> ~chi_2+ b )
     6.42507729E-01    2     1000021         6   # BR(~t_2 -> ~g      t )
#
#         PDG            Width
DECAY   1000005     1.29980918E+02   # sbottom1 decays
#          BR         NDA      ID1       ID2
     8.46718536E-04    2     1000022         5   # BR(~b_1 -> ~chi_10 b )
    -2.34725092E-05    2     1000023         5   # BR(~b_1 -> ~chi_20 b )
     6.51961854E-03    2     1000025         5   # BR(~b_1 -> ~chi_30 b )
     1.32984410E-01    2    -1000024         6   # BR(~b_1 -> ~chi_1- t )
     8.59672726E-01    2     1000021         5   # BR(~b_1 -> ~g      b )
#
#         PDG            Width
DECAY   2000005     1.35612366E+02   # sbottom2 decays
#          BR         NDA      ID1       ID2
     2.44662792E-06    2     1000022         5   # BR(~b_2 -> ~chi_10 b )
     4.70574594E-04    2     1000023         5   # BR(~b_2 -> ~chi_20 b )
     4.99933641E-03    2     1000025         5   # BR(~b_2 -> ~chi_30 b )
     1.68626316E-01    2    -1000024         6   # BR(~b_2 -> ~chi_1- t )
     8.25901327E-01    2     1000021         5   # BR(~b_2 -> ~g      b )
#
#         PDG            Width
DECAY   1000002     1.12209292E+02   # sup_L decays
#          BR         NDA      ID1       ID2
     1.02898297E-04    2     1000022         2   # BR(~u_L -> ~chi_10 u)
     8.78081467E-06    2     1000023         2   # BR(~u_L -> ~chi_20 u)
     2.90536228E-03    2     1000025         2   # BR(~u_L -> ~chi_30 u)
     2.14192695E-04    2     1000024         1   # BR(~u_L -> ~chi_1+ d)
     9.96768766E-01    2     1000021         2   # BR(~u_L -> ~g      u)
#
#         PDG            Width
DECAY   2000002     1.17107078E+02   # sup_R decays
#          BR         NDA      ID1       ID2
     2.14128050E-03    2     1000022         2   # BR(~u_R -> ~chi_10 u)
     4.41383240E-04    2     1000023         2   # BR(~u_R -> ~chi_20 u)
     4.22656813E-02    2     1000025         2   # BR(~u_R -> ~chi_30 u)
     9.55151655E-01    2     1000021         2   # BR(~u_R -> ~g      u)
#
#         PDG            Width
DECAY   1000001     1.12225313E+02   # sdown_L decays
#          BR         NDA      ID1       ID2
     1.82047171E-04    2     1000022         1   # BR(~d_L -> ~chi_10 d)
     1.87546236E-04    2     1000023         1   # BR(~d_L -> ~chi_20 d)
     2.61224194E-03    2     1000025         1   # BR(~d_L -> ~chi_30 d)
     8.22012969E-05    2    -1000024         2   # BR(~d_L -> ~chi_1- u)
     9.96935963E-01    2     1000021         1   # BR(~d_L -> ~g      d)
#
#         PDG            Width
DECAY   2000001     1.13178996E+02   # sdown_R decays
#          BR         NDA      ID1       ID2
     5.53934168E-04    2     1000022         1   # BR(~d_R -> ~chi_10 d)
     1.14182745E-04    2     1000023         1   # BR(~d_R -> ~chi_20 d)
     1.09338401E-02    2     1000025         1   # BR(~d_R -> ~chi_30 d)
     9.88398043E-01    2     1000021         1   # BR(~d_R -> ~g      d)
#
#         PDG            Width
DECAY   1000004     1.12209292E+02   # scharm_L decays
#          BR         NDA      ID1       ID2
     1.02898297E-04    2     1000022         4   # BR(~c_L -> ~chi_10 c)
     8.78081467E-06    2     1000023         4   # BR(~c_L -> ~chi_20 c)
     2.90536228E-03    2     1000025         4   # BR(~c_L -> ~chi_30 c)
     2.14192695E-04    2     1000024         3   # BR(~c_L -> ~chi_1+ s)
     9.96768766E-01    2     1000021         4   # BR(~c_L -> ~g      c)
#
#         PDG            Width
DECAY   2000004     1.17107078E+02   # scharm_R decays
#          BR         NDA      ID1       ID2
     2.14128050E-03    2     1000022         4   # BR(~c_R -> ~chi_10 c)
     4.41383240E-04    2     1000023         4   # BR(~c_R -> ~chi_20 c)
     4.22656813E-02    2     1000025         4   # BR(~c_R -> ~chi_30 c)
     9.55151655E-01    2     1000021         4   # BR(~c_R -> ~g      c)
#
#         PDG            Width
DECAY   1000003     1.12225313E+02   # sstrange_L decays
#          BR         NDA      ID1       ID2
     1.82047171E-04    2     1000022         3   # BR(~s_L -> ~chi_10 s)
     1.87546236E-04    2     1000023         3   # BR(~s_L -> ~chi_20 s)
     2.61224194E-03    2     1000025         3   # BR(~s_L -> ~chi_30 s)
     8.22012969E-05    2    -1000024         4   # BR(~s_L -> ~chi_1- c)
     9.96935963E-01    2     1000021         3   # BR(~s_L -> ~g      s)
#
#         PDG            Width
DECAY   2000003     1.13178996E+02   # sstrange_R decays
#          BR         NDA      ID1       ID2
     5.53934168E-04    2     1000022         3   # BR(~s_R -> ~chi_10 s)
     1.14182745E-04    2     1000023         3   # BR(~s_R -> ~chi_20 s)
     1.09338401E-02    2     1000025         3   # BR(~s_R -> ~chi_30 s)
     9.88398043E-01    2     1000021         3   # BR(~s_R -> ~g      s)
#
#         PDG            Width
DECAY   1000011     3.08011697E+00   # selectron_L decays
#          BR         NDA      ID1       ID2
     4.30458034E-02    2     1000022        11   # BR(~e_L -> ~chi_10 e-)
     2.27572000E-03    2     1000023        11   # BR(~e_L -> ~chi_20 e-)
     9.51578057E-01    2     1000025        11   # BR(~e_L -> ~chi_30 e-)
     3.10042002E-03    2    -1000024        12   # BR(~e_L -> ~chi_1- nu_e)
#
#         PDG            Width
DECAY   2000011     1.22232832E+01   # selectron_R decays
#          BR         NDA      ID1       ID2
     4.77948983E-02    2     1000022        11   # BR(~e_R -> ~chi_10 e-)
     9.84971973E-03    2     1000023        11   # BR(~e_R -> ~chi_20 e-)
     9.42355382E-01    2     1000025        11   # BR(~e_R -> ~chi_30 e-)
#
#         PDG            Width
DECAY   1000013     3.08011697E+00   # smuon_L decays
#          BR         NDA      ID1       ID2
     4.30458034E-02    2     1000022        13   # BR(~mu_L -> ~chi_10 mu-)
     2.27572000E-03    2     1000023        13   # BR(~mu_L -> ~chi_20 mu-)
     9.51578057E-01    2     1000025        13   # BR(~mu_L -> ~chi_30 mu-)
     3.10042002E-03    2    -1000024        14   # BR(~mu_L -> ~chi_1- nu_mu)
#
#         PDG            Width
DECAY   2000013     1.22232832E+01   # smuon_R decays
#          BR         NDA      ID1       ID2
     4.77948983E-02    2     1000022        13   # BR(~mu_R -> ~chi_10 mu-)
     9.84971973E-03    2     1000023        13   # BR(~mu_R -> ~chi_20 mu-)
     9.42355382E-01    2     1000025        13   # BR(~mu_R -> ~chi_30 mu-)
#
#         PDG            Width
DECAY   1000015     7.97131802E+00   # stau_1 decays
#          BR         NDA      ID1       ID2
     5.23739802E-02    2     1000022        15   # BR(~tau_1 -> ~chi_10  tau-)
     6.54968176E-03    2     1000023        15   # BR(~tau_1 -> ~chi_20  tau-)
     9.40994273E-01    2     1000025        15   # BR(~tau_1 -> ~chi_30  tau-)
     8.13648220E-05    2    -1000024        16   # BR(~tau_1 -> ~chi_1-  nu_tau)
     6.99697171E-07    2     1000039        15   # BR(~tau_1 -> ~G       tau-)
#
#         PDG            Width
DECAY   2000015     7.37975730E+00   # stau_2 decays
#          BR         NDA      ID1       ID2
     4.27163983E-02    2     1000022        15   # BR(~tau_2 -> ~chi_10  tau-)
     1.23065415E-02    2     1000023        15   # BR(~tau_2 -> ~chi_20  tau-)
     9.41617793E-01    2     1000025        15   # BR(~tau_2 -> ~chi_30  tau-)
     3.35926686E-03    2    -1000024        16   # BR(~tau_2 -> ~chi_1-  nu_tau)
#
#         PDG            Width
DECAY   1000012     3.08259583E+00   # snu_eL decays
#          BR         NDA      ID1       ID2
     5.19498147E-02    2     1000022        12   # BR(~nu_eL -> ~chi_10 nu_e)
     2.24783680E-02    2     1000023        12   # BR(~nu_eL -> ~chi_20 nu_e)
     9.17500665E-01    2     1000025        12   # BR(~nu_eL -> ~chi_30 nu_e)
     8.07115242E-03    2     1000024        11   # BR(~nu_eL -> ~chi_1+ e-)
#
#         PDG            Width
DECAY   1000014     3.08259583E+00   # snu_muL decays
#          BR         NDA      ID1       ID2
     5.19498147E-02    2     1000022        14   # BR(~nu_muL -> ~chi_10 nu_mu)
     2.24783680E-02    2     1000023        14   # BR(~nu_muL -> ~chi_20 nu_mu)
     9.17500665E-01    2     1000025        14   # BR(~nu_muL -> ~chi_30 nu_mu)
     8.07115242E-03    2     1000024        13   # BR(~nu_muL -> ~chi_1+ mu-)
#
#         PDG            Width
DECAY   1000016     3.09848574E+00   # snu_tauL decays
#          BR         NDA      ID1       ID2
     5.16834015E-02    2     1000022        16   # BR(~nu_tauL -> ~chi_10 nu_tau)
     2.23630926E-02    2     1000023        16   # BR(~nu_tauL -> ~chi_20 nu_tau)
     9.12795465E-01    2     1000025        16   # BR(~nu_tauL -> ~chi_30 nu_tau)
     1.31580408E-02    2     1000024        15   # BR(~nu_tauL -> ~chi_1+ tau-)
#
#         PDG            Width
DECAY   1000024     1.28203549E-09   # chargino1+ decays
#          BR         NDA      ID1       ID2
     3.83950142E-03    2     1000039        24   # BR(~chi_1+ -> ~G       W+)
#           BR         NDA      ID1       ID2       ID3
     3.54948391E-01    3     1000022         2        -1   # BR(~chi_1+ -> ~chi_10 u    db)
     3.54948391E-01    3     1000022         4        -3   # BR(~chi_1+ -> ~chi_10 c    sb)
     1.18317295E-01    3     1000022       -11        12   # BR(~chi_1+ -> ~chi_10 e+   nu_e)
     1.18317295E-01    3     1000022       -13        14   # BR(~chi_1+ -> ~chi_10 mu+  nu_mu)
     4.96291256E-02    3     1000022       -15        16   # BR(~chi_1+ -> ~chi_10 tau+ nu_tau)
#
#         PDG            Width
DECAY   1000037     2.00787207E+01   # chargino2+ decays
#          BR         NDA      ID1       ID2
     2.59230859E-04    2     1000002        -1   # BR(~chi_2+ -> ~u_L     db)
     2.09303954E-04    2    -1000001         2   # BR(~chi_2+ -> ~d_L*    u )
     2.59230859E-04    2     1000004        -3   # BR(~chi_2+ -> ~c_L     sb)
     2.09303954E-04    2    -1000003         4   # BR(~chi_2+ -> ~s_L*    c )
     2.25938990E-06    2     1000012       -11   # BR(~chi_2+ -> ~nu_eL   e+  )
     2.25938990E-06    2     1000014       -13   # BR(~chi_2+ -> ~nu_muL  mu+ )
     1.68815575E-06    2     1000016       -15   # BR(~chi_2+ -> ~nu_tau1 tau+)
     1.51390890E-06    2    -1000011        12   # BR(~chi_2+ -> ~e_L+    nu_e)
     1.51390890E-06    2    -1000013        14   # BR(~chi_2+ -> ~mu_L+   nu_mu)
     7.80878063E-07    2    -1000015        16   # BR(~chi_2+ -> ~tau_1+  nu_tau)
     7.35936779E-07    2    -2000015        16   # BR(~chi_2+ -> ~tau_2+  nu_tau)
     2.10701324E-01    2     1000024        23   # BR(~chi_2+ -> ~chi_1+  Z )
     1.91030519E-01    2     1000022        24   # BR(~chi_2+ -> ~chi_10  W+)
     2.02758446E-01    2     1000023        24   # BR(~chi_2+ -> ~chi_20  W+)
     1.80589878E-02    2     1000025        24   # BR(~chi_2+ -> ~chi_30  W+)
     2.09027360E-01    2     1000024        25   # BR(~chi_2+ -> ~chi_1+  h )
     4.16946630E-02    2     1000024        35   # BR(~chi_2+ -> ~chi_1+  H )
     4.21357447E-02    2     1000024        36   # BR(~chi_2+ -> ~chi_1+  A )
     4.04154958E-02    2     1000022        37   # BR(~chi_2+ -> ~chi_10  H+)
     4.14737483E-02    2     1000023        37   # BR(~chi_2+ -> ~chi_20  H+)
     1.75561237E-03    2     1000025        37   # BR(~chi_2+ -> ~chi_30  H+)
     2.77836771E-07    2     1000039        24   # BR(~chi_2+ -> ~G       W+)
     1.70338700E-12    2     1000039        37   # BR(~chi_2+ -> ~G       H+)
#
#         PDG            Width
DECAY   1000022     1.81472770E-12   # neutralino1 decays
#          BR         NDA      ID1       ID2
     3.36147232E-01    2     1000039        22   # BR(~chi_10 -> ~G        gam)
     9.70647187E-02    2     1000039        23   # BR(~chi_10 -> ~G        Z)
     5.66788049E-01    2     1000039        25   # BR(~chi_10 -> ~G        h)
#
#         PDG            Width
DECAY   1000023     3.92452241E-08   # neutralino2 decays
#          BR         NDA      ID1       ID2
     2.25245004E-02    2     1000022        22   # BR(~chi_20 -> ~chi_10 gam)
#          BR         NDA      ID1       ID2
     2.87205584E-06    2     1000039        22   # BR(~chi_20 -> ~G        gam)
     1.10866792E-04    2     1000039        23   # BR(~chi_20 -> ~G        Z)
     1.70398172E-06    2     1000039        25   # BR(~chi_20 -> ~G        h)
#           BR         NDA      ID1       ID2       ID3
     1.23510663E-01    3     1000022        -2         2   # BR(~chi_20 -> ~chi_10 ub      u)
     1.59783272E-01    3     1000022        -1         1   # BR(~chi_20 -> ~chi_10 db      d)
     1.23510663E-01    3     1000022        -4         4   # BR(~chi_20 -> ~chi_10 cb      c)
     1.59783272E-01    3     1000022        -3         3   # BR(~chi_20 -> ~chi_10 sb      s)
     3.64272231E-02    3     1000022       -11        11   # BR(~chi_20 -> ~chi_10 e+      e-)
     3.64272231E-02    3     1000022       -13        13   # BR(~chi_20 -> ~chi_10 mu+     mu-)
     2.77222469E-02    3     1000022       -15        15   # BR(~chi_20 -> ~chi_10 tau+    tau-)
     7.27063820E-02    3     1000022       -12        12   # BR(~chi_20 -> ~chi_10 nu_eb   nu_e)
     7.27063820E-02    3     1000022       -14        14   # BR(~chi_20 -> ~chi_10 nu_mub  nu_mu)
     7.27063820E-02    3     1000022       -16        16   # BR(~chi_20 -> ~chi_10 nu_taub nu_tau)
     1.63168409E-02    3     1000024        -2         1   # BR(~chi_20 -> ~chi_1+ ub      d)
     1.63168409E-02    3    -1000024        -1         2   # BR(~chi_20 -> ~chi_1- db      u)
     1.63168409E-02    3     1000024        -4         3   # BR(~chi_20 -> ~chi_1+ cb      s)
     1.63168409E-02    3    -1000024        -3         4   # BR(~chi_20 -> ~chi_1- sb      c)
     5.43895293E-03    3     1000024       -12        11   # BR(~chi_20 -> ~chi_1+ nu_eb   e-)
     5.43895293E-03    3    -1000024        12       -11   # BR(~chi_20 -> ~chi_1- nu_e    e+)
     5.43895293E-03    3     1000024       -14        13   # BR(~chi_20 -> ~chi_1+ nu_mub  mu-)
     5.43895293E-03    3    -1000024        14       -13   # BR(~chi_20 -> ~chi_1- nu_mu   mu+)
     2.52658611E-03    3     1000024       -16        15   # BR(~chi_20 -> ~chi_1+ nu_taub tau-)
     2.52658611E-03    3    -1000024        16       -15   # BR(~chi_20 -> ~chi_1- nu_tau  tau+)
#
#         PDG            Width
DECAY   1000025     1.55974482E-05   # neutralino3 decays
#          BR         NDA      ID1       ID2
     1.41901204E-01    2     1000022        22   # BR(~chi_30 -> ~chi_10 gam)
     3.91778874E-03    2     1000023        22   # BR(~chi_30 -> ~chi_20 gam)
#          BR         NDA      ID1       ID2
     2.03006220E-06    2     1000039        22   # BR(~chi_30 -> ~G        gam)
     3.43671711E-07    2     1000039        23   # BR(~chi_30 -> ~G        Z)
     2.12216628E-08    2     1000039        25   # BR(~chi_30 -> ~G        h)
#           BR         NDA      ID1       ID2       ID3
     1.68388033E-02    3     1000022        -2         2   # BR(~chi_30 -> ~chi_10 ub      u)
     2.18253735E-02    3     1000022        -1         1   # BR(~chi_30 -> ~chi_10 db      d)
     1.68388033E-02    3     1000022        -4         4   # BR(~chi_30 -> ~chi_10 cb      c)
     2.18253735E-02    3     1000022        -3         3   # BR(~chi_30 -> ~chi_10 sb      s)
     1.85460475E-02    3     1000022        -5         5   # BR(~chi_30 -> ~chi_10 bb      b)
     5.00760900E-03    3     1000022       -11        11   # BR(~chi_30 -> ~chi_10 e+      e-)
     5.00760900E-03    3     1000022       -13        13   # BR(~chi_30 -> ~chi_10 mu+     mu-)
     4.87000980E-03    3     1000022       -15        15   # BR(~chi_30 -> ~chi_10 tau+    tau-)
     9.91337298E-03    3     1000022       -12        12   # BR(~chi_30 -> ~chi_10 nu_eb   nu_e)
     9.91337298E-03    3     1000022       -14        14   # BR(~chi_30 -> ~chi_10 nu_mub  nu_mu)
     9.91337298E-03    3     1000022       -16        16   # BR(~chi_30 -> ~chi_10 nu_taub nu_tau)
     9.73399580E-03    3     1000023        -2         2   # BR(~chi_30 -> ~chi_20 ub      u)
     1.25974897E-02    3     1000023        -1         1   # BR(~chi_30 -> ~chi_20 db      d)
     9.73399580E-03    3     1000023        -4         4   # BR(~chi_30 -> ~chi_20 cb      c)
     1.25974897E-02    3     1000023        -3         3   # BR(~chi_30 -> ~chi_20 sb      s)
     1.02020174E-02    3     1000023        -5         5   # BR(~chi_30 -> ~chi_20 bb      b)
     2.87516003E-03    3     1000023       -11        11   # BR(~chi_30 -> ~chi_20 e+      e-)
     2.87516003E-03    3     1000023       -13        13   # BR(~chi_30 -> ~chi_20 mu+     mu-)
     2.81937704E-03    3     1000023       -15        15   # BR(~chi_30 -> ~chi_20 tau+    tau-)
     5.72910258E-03    3     1000023       -12        12   # BR(~chi_30 -> ~chi_20 nu_eb   nu_e)
     5.72910258E-03    3     1000023       -14        14   # BR(~chi_30 -> ~chi_20 nu_mub  nu_mu)
     5.72910258E-03    3     1000023       -16        16   # BR(~chi_30 -> ~chi_20 nu_taub nu_tau)
     1.05651407E-01    3     1000024        -2         1   # BR(~chi_30 -> ~chi_1+ ub      d)
     1.05651407E-01    3    -1000024        -1         2   # BR(~chi_30 -> ~chi_1- db      u)
     1.05651407E-01    3     1000024        -4         3   # BR(~chi_30 -> ~chi_1+ cb      s)
     1.05651407E-01    3    -1000024        -3         4   # BR(~chi_30 -> ~chi_1- sb      c)
     3.52117753E-02    3     1000024       -12        11   # BR(~chi_30 -> ~chi_1+ nu_eb   e-)
     3.52117753E-02    3    -1000024        12       -11   # BR(~chi_30 -> ~chi_1- nu_e    e+)
     3.52117753E-02    3     1000024       -14        13   # BR(~chi_30 -> ~chi_1+ nu_mub  mu-)
     3.52117753E-02    3    -1000024        14       -13   # BR(~chi_30 -> ~chi_1- nu_mu   mu+)
     3.48020712E-02    3     1000024       -16        15   # BR(~chi_30 -> ~chi_1+ nu_taub tau-)
     3.48020712E-02    3    -1000024        16       -15   # BR(~chi_30 -> ~chi_1- nu_tau  tau+)
#
#         PDG            Width
DECAY   1000035     2.00791007E+01   # neutralino4 decays
#          BR         NDA      ID1       ID2
     1.88233450E-01    2     1000022        23   # BR(~chi_40 -> ~chi_10   Z )
     1.11834149E-02    2     1000023        23   # BR(~chi_40 -> ~chi_20   Z )
     1.16165096E-02    2     1000025        23   # BR(~chi_40 -> ~chi_30   Z )
     2.05578037E-01    2     1000024       -24   # BR(~chi_40 -> ~chi_1+   W-)
     2.05578037E-01    2    -1000024        24   # BR(~chi_40 -> ~chi_1-   W+)
     7.39900946E-03    2     1000022        25   # BR(~chi_40 -> ~chi_10   h )
     3.93684537E-02    2     1000022        35   # BR(~chi_40 -> ~chi_10   H )
     8.26379074E-04    2     1000022        36   # BR(~chi_40 -> ~chi_10   A )
     1.95173600E-01    2     1000023        25   # BR(~chi_40 -> ~chi_20   h )
     5.83726637E-04    2     1000023        35   # BR(~chi_40 -> ~chi_20   H )
     4.10460937E-02    2     1000023        36   # BR(~chi_40 -> ~chi_20   A )
     6.81580566E-03    2     1000025        25   # BR(~chi_40 -> ~chi_30   h )
     1.68921674E-03    2     1000025        35   # BR(~chi_40 -> ~chi_30   H )
     6.05511437E-05    2     1000025        36   # BR(~chi_40 -> ~chi_30   A )
     4.19497192E-02    2     1000024       -37   # BR(~chi_40 -> ~chi_1+   H-)
     4.19497192E-02    2    -1000024        37   # BR(~chi_40 -> ~chi_1-   H+)
     2.56191413E-04    2     1000002        -2   # BR(~chi_40 -> ~u_L      ub)
     2.56191413E-04    2    -1000002         2   # BR(~chi_40 -> ~u_L*     u )
     4.59414486E-11    2     2000002        -2   # BR(~chi_40 -> ~u_R      ub)
     4.59414486E-11    2    -2000002         2   # BR(~chi_40 -> ~u_R*     u )
     2.07255871E-04    2     1000001        -1   # BR(~chi_40 -> ~d_L      db)
     2.07255871E-04    2    -1000001         1   # BR(~chi_40 -> ~d_L*     d )
     1.07635068E-11    2     2000001        -1   # BR(~chi_40 -> ~d_R      db)
     1.07635068E-11    2    -2000001         1   # BR(~chi_40 -> ~d_R*     d )
     2.56191413E-04    2     1000004        -4   # BR(~chi_40 -> ~c_L      cb)
     2.56191413E-04    2    -1000004         4   # BR(~chi_40 -> ~c_L*     c )
     4.59414486E-11    2     2000004        -4   # BR(~chi_40 -> ~c_R      cb)
     4.59414486E-11    2    -2000004         4   # BR(~chi_40 -> ~c_R*     c )
     2.07255871E-04    2     1000003        -3   # BR(~chi_40 -> ~s_L      sb)
     2.07255871E-04    2    -1000003         3   # BR(~chi_40 -> ~s_L*     s )
     1.07635068E-11    2     2000003        -3   # BR(~chi_40 -> ~s_R      sb)
     1.07635068E-11    2    -2000003         3   # BR(~chi_40 -> ~s_R*     s )
     7.56544998E-07    2     1000011       -11   # BR(~chi_40 -> ~e_L-     e+)
     7.56544998E-07    2    -1000011        11   # BR(~chi_40 -> ~e_L+     e-)
     3.24367138E-13    2     2000011       -11   # BR(~chi_40 -> ~e_R-     e+)
     3.24367138E-13    2    -2000011        11   # BR(~chi_40 -> ~e_R+     e-)
     7.56544998E-07    2     1000013       -13   # BR(~chi_40 -> ~mu_L-    mu+)
     7.56544998E-07    2    -1000013        13   # BR(~chi_40 -> ~mu_L+    mu-)
     3.24367138E-13    2     2000013       -13   # BR(~chi_40 -> ~mu_R-    mu+)
     3.24367138E-13    2    -2000013        13   # BR(~chi_40 -> ~mu_R+    mu-)
     2.47826571E-07    2     1000015       -15   # BR(~chi_40 -> ~tau_1-   tau+)
     2.47826571E-07    2    -1000015        15   # BR(~chi_40 -> ~tau_1+   tau-)
     1.93563614E-07    2     2000015       -15   # BR(~chi_40 -> ~tau_2-   tau+)
     1.93563614E-07    2    -2000015        15   # BR(~chi_40 -> ~tau_2+   tau-)
     1.13133128E-06    2     1000012       -12   # BR(~chi_40 -> ~nu_eL    nu_eb)
     1.13133128E-06    2    -1000012        12   # BR(~chi_40 -> ~nu_eL*   nu_e )
     1.13133128E-06    2     1000014       -14   # BR(~chi_40 -> ~nu_muL   nu_mub)
     1.13133128E-06    2    -1000014        14   # BR(~chi_40 -> ~nu_muL*  nu_mu )
     1.13133128E-06    2     1000016       -16   # BR(~chi_40 -> ~nu_tau1  nu_taub)
     1.13133128E-06    2    -1000016        16   # BR(~chi_40 -> ~nu_tau1* nu_tau )
     6.63560240E-08    2     1000039        22   # BR(~chi_40 -> ~G        gam)
     2.11453047E-07    2     1000039        23   # BR(~chi_40 -> ~G        Z)
     2.07213056E-11    2     1000039        25   # BR(~chi_40 -> ~G        h)
     1.68013586E-12    2     1000039        35   # BR(~chi_40 -> ~G        H)
     2.29560573E-15    2     1000039        36   # BR(~chi_40 -> ~G        A)
#
#         PDG            Width
DECAY        25     4.07838620E-03   # h decays
#          BR         NDA      ID1       ID2
     6.17183434E-01    2           5        -5   # BR(h -> b       bb     )
     6.38192400E-02    2         -15        15   # BR(h -> tau+    tau-   )
     2.25896605E-04    2         -13        13   # BR(h -> mu+     mu-    )
     4.78709059E-04    2           3        -3   # BR(h -> s       sb     )
     2.06726586E-02    2           4        -4   # BR(h -> c       cb     )
     6.72789809E-02    2          21        21   # BR(h -> g       g      )
     2.28113550E-03    2          22        22   # BR(h -> gam     gam    )
     1.54090725E-03    2          22        23   # BR(h -> Z       gam    )
     2.00856007E-01    2          24       -24   # BR(h -> W+      W-     )
     2.56630307E-02    2          23        23   # BR(h -> Z       Z      )
#
#         PDG            Width
DECAY        35     4.10098859E+01   # H decays
#          BR         NDA      ID1       ID2
     1.36321864E-03    2           5        -5   # BR(H -> b       bb     )
     2.27282593E-04    2         -15        15   # BR(H -> tau+    tau-   )
     8.03528585E-07    2         -13        13   # BR(H -> mu+     mu-    )
     1.02899740E-06    2           3        -3   # BR(H -> s       sb     )
     9.27732071E-06    2           4        -4   # BR(H -> c       cb     )
     9.41648779E-01    2           6        -6   # BR(H -> t       tb     )
     7.57235239E-04    2          21        21   # BR(H -> g       g      )
     2.50390941E-06    2          22        22   # BR(H -> gam     gam    )
     1.10760710E-06    2          23        22   # BR(H -> Z       gam    )
     2.47917020E-04    2          24       -24   # BR(H -> W+      W-     )
     1.23620669E-04    2          23        23   # BR(H -> Z       Z      )
     8.08129781E-04    2          25        25   # BR(H -> h       h      )
     9.70698515E-24    2          36        36   # BR(H -> A       A      )
     3.13921454E-11    2          23        36   # BR(H -> Z       A      )
     2.51626885E-12    2          24       -37   # BR(H -> W+      H-     )
     2.51626885E-12    2         -24        37   # BR(H -> W-      H+     )
     1.17376573E-04    2     1000024  -1000024   # BR(H -> ~chi_1+ ~chi_1-)
     5.35194910E-03    2     1000022   1000022   # BR(H -> ~chi_10 ~chi_10)
     9.28696786E-05    2     1000023   1000023   # BR(H -> ~chi_20 ~chi_20)
     3.84160288E-03    2     1000025   1000025   # BR(H -> ~chi_30 ~chi_30)
     6.17866814E-04    2     1000022   1000023   # BR(H -> ~chi_10 ~chi_20)
     4.22002740E-02    2     1000022   1000025   # BR(H -> ~chi_10 ~chi_30)
     2.58715645E-03    2     1000023   1000025   # BR(H -> ~chi_20 ~chi_30)
#
#         PDG            Width
DECAY        36     4.15219587E+01   # A decays
#          BR         NDA      ID1       ID2
     1.36380417E-03    2           5        -5   # BR(A -> b       bb     )
     2.24609259E-04    2         -15        15   # BR(A -> tau+    tau-   )
     7.94074870E-07    2         -13        13   # BR(A -> mu+     mu-    )
     1.04707578E-06    2           3        -3   # BR(A -> s       sb     )
     9.17578723E-06    2           4        -4   # BR(A -> c       cb     )
     9.42562121E-01    2           6        -6   # BR(A -> t       tb     )
     8.98919780E-04    2          21        21   # BR(A -> g       g      )
     3.15391575E-06    2          22        22   # BR(A -> gam     gam    )
     1.29074430E-06    2          23        22   # BR(A -> Z       gam    )
     2.41323625E-04    2          23        25   # BR(A -> Z       h      )
     7.04204058E-04    2     1000024  -1000024   # BR(A -> ~chi_1+ ~chi_1-)
     2.76482923E-04    2     1000022   1000022   # BR(A -> ~chi_10 ~chi_10)
     2.51620300E-03    2     1000023   1000023   # BR(A -> ~chi_20 ~chi_20)
     2.69183305E-04    2     1000025   1000025   # BR(A -> ~chi_30 ~chi_30)
     1.95960524E-03    2     1000022   1000023   # BR(A -> ~chi_10 ~chi_20)
     2.70918547E-03    2     1000022   1000025   # BR(A -> ~chi_10 ~chi_30)
     4.62588963E-02    2     1000023   1000025   # BR(A -> ~chi_20 ~chi_30)
#
#         PDG            Width
DECAY        37     4.06906166E+01   # H+ decays
#          BR         NDA      ID1       ID2
     2.19026310E-06    2           4        -5   # BR(H+ -> c       bb     )
     2.29432073E-04    2         -15        16   # BR(H+ -> tau+    nu_tau )
     8.11125256E-07    2         -13        14   # BR(H+ -> mu+     nu_mu  )
     1.39257208E-08    2           2        -5   # BR(H+ -> u       bb     )
     5.02407408E-08    2           2        -3   # BR(H+ -> u       sb     )
     1.00106574E-05    2           4        -3   # BR(H+ -> c       sb     )
     9.44328489E-01    2           6        -5   # BR(H+ -> t       bb     )
     2.47360426E-04    2          24        25   # BR(H+ -> W+      h      )
     1.14360802E-12    2          24        36   # BR(H+ -> W+      A      )
     2.30558166E-03    2     1000024   1000022   # BR(H+ -> ~chi_1+ ~chi_10)
     5.19829711E-04    2     1000024   1000023   # BR(H+ -> ~chi_1+ ~chi_20)
     5.23562308E-02    2     1000024   1000025   # BR(H+ -> ~chi_1+ ~chi_30)
