#  ISAJET SUSY parameters in SUSY Les Houches Accord 2 format
#  Created by ISALHA 2.0 Last revision: C. Balazs 21 Apr 2009
Block SPINFO   # Program information
     1   ISASUGRA from ISAJET          # Spectrum Calculator
     2   7.80   29-OCT-2009 12:50:36   # Version number
Block MODSEL   # Model selection
     1     1   # Minimal supergravity (mSUGRA) model               
Block SMINPUTS   # Standard Model inputs
     1     1.27845840E+02   # alpha_em^(-1)
     2     1.16570000E-05   # G_Fermi
     3     1.17200002E-01   # alpha_s(M_Z)
     4     9.11699982E+01   # m_{Z}(pole)
     5     4.19999981E+00   # m_{b}(m_{b})
     6     1.72500000E+02   # m_{top}(pole)
     7     1.77699995E+00   # m_{tau}(pole)
Block MINPAR   # SUSY breaking input parameters
     1     2.06000000E+03   # m_0
     2     4.60000000E+02   # m_{1/2}
     3     4.00000000E+01   # tan(beta)
     4     1.00000000E+00   # sign(mu)
     5    -5.00000000E+02   # A_0
Block EXTPAR   # Non-universal SUSY breaking parameters
     0     1.93819870E+16   # Input scale
Block MASS   # Scalar and gaugino mass spectrum
#  PDG code   mass                 particle
        24     8.04229965E+01   #  W^+
        25     1.16917175E+02   #  h^0            
        35     1.50839404E+03   #  H^0            
        36     1.49852637E+03   #  A^0            
        37     1.51106860E+03   #  H^+            
   1000001     2.24713745E+03   #  dnl            
   1000002     2.24568579E+03   #  upl            
   1000003     2.24713745E+03   #  stl            
   1000004     2.24568604E+03   #  chl            
   1000005     1.72889795E+03   #  b1             
   1000006     1.39741602E+03   #  t1             
   1000011     2.07895459E+03   #  el-            
   1000012     2.07774072E+03   #  nuel           
   1000013     2.07895459E+03   #  mul-           
   1000014     2.07774072E+03   #  numl           
   1000015     1.72613281E+03   #  tau1           
   1000016     1.91744556E+03   #  nutl           
   1000021     1.17177124E+03   #  glss           
   1000022     1.95579346E+02   #  z1ss           
   1000023     3.69364288E+02   #  z2ss           
   1000024     3.70585083E+02   #  w1ss           
   1000025    -5.42476929E+02   #  z3ss           
   1000035     5.59917480E+02   #  z4ss           
   1000037     5.59738892E+02   #  w2ss           
   2000001     2.23882397E+03   #  dnr            
   2000002     2.23899414E+03   #  upr            
   2000003     2.23882397E+03   #  str            
   2000004     2.23899463E+03   #  chr            
   2000005     1.96410510E+03   #  b2             
   2000006     1.74474548E+03   #  t2             
   2000011     2.06516602E+03   #  er-            
   2000013     2.06516602E+03   #  mur-           
   2000015     1.91860486E+03   #  tau2           
Block ALPHA   # Effective Higgs mixing parameter
         -2.51908898E-02   # alpha
Block STOPMIX   # stop mixing matrix
  1  1     1.09231904E-01   # O_{11}
  1  2     9.94016290E-01   # O_{12}
  2  1    -9.94016290E-01   # O_{21}
  2  2     1.09231904E-01   # O_{22}
Block SBOTMIX   # sbottom mixing matrix
  1  1     9.97615874E-01   # O_{11}
  1  2     6.90110698E-02   # O_{12}
  2  1    -6.90110698E-02   # O_{21}
  2  2     9.97615874E-01   # O_{22}
Block STAUMIX   # stau mixing matrix
  1  1     6.80172145E-02   # O_{11}
  1  2     9.97684121E-01   # O_{12}
  2  1    -9.97684121E-01   # O_{21}
  2  2     6.80172145E-02   # O_{22}
Block NMIX   # neutralino mixing matrix
  1  1     9.94654655E-01   #
  1  2    -1.68057419E-02   #
  1  3     9.52780545E-02   #
  1  4    -3.60766649E-02   #
  2  1     4.70830090E-02   #
  2  2     9.48518693E-01   #
  2  3    -2.55769283E-01   #
  2  4     1.80770457E-01   #
  3  1     4.06448245E-02   #
  3  2    -5.64479008E-02   #
  3  3    -7.02467024E-01   #
  3  4    -7.08309174E-01   #
  4  1     8.24199319E-02   #
  4  2    -3.11197460E-01   #
  4  3    -6.57300711E-01   #
  4  4     6.81409419E-01   #
Block UMIX   # chargino U mixing matrix
  1  1    -9.34637666E-01   # U_{11}
  1  2     3.55601549E-01   # U_{12}
  2  1    -3.55601549E-01   # U_{21}
  2  2    -9.34637666E-01   # U_{22}
Block VMIX   # chargino V mixing matrix
  1  1    -9.68234539E-01   # V_{11}
  1  2     2.50043839E-01   # V_{12}
  2  1    -2.50043839E-01   # V_{21}
  2  2    -9.68234539E-01   # V_{22}
Block GAUGE Q=  1.52258496E+03   #
     1     3.57495666E-01   # g`
     2     6.52450800E-01   # g_2
     3     1.22088110E+00   # g_3
Block YU Q=  1.52258496E+03   #
  3  3     8.46496582E-01   # y_t
Block YD Q=  1.52258496E+03   #
  3  3     5.05811214E-01   # y_b
Block YE Q=  1.52258496E+03   #
  3  3     4.11504358E-01   # y_tau
Block HMIX Q=  1.52258496E+03   # Higgs mixing parameters
     1     5.31980408E+02   # mu(Q)
     2     4.00000000E+01   # tan(beta)(M_GUT)
     3     2.51487808E+02   # Higgs vev at Q
     4     2.24558125E+06   # m_A^2(Q)
Block MSOFT Q=  1.52258496E+03   # DRbar SUSY breaking parameters
     1     1.97578461E+02   # M_1(Q)          
     2     3.64007050E+02   # M_2(Q)          
     3     1.02963281E+03   # M_3(Q)          
    31     2.07165015E+03   # MeL(Q)          
    32     2.07165015E+03   # MmuL(Q)         
    33     1.91429041E+03   # MtauL(Q)        
    34     2.06277808E+03   # MeR(Q)          
    35     2.06277808E+03   # MmuR(Q)         
    36     1.72935974E+03   # MtauR(Q)        
    41     2.19739209E+03   # MqL1(Q)         
    42     2.19739209E+03   # MqL2(Q)         
    43     1.68978784E+03   # MqL3(Q)         
    44     2.19034521E+03   # MuR(Q)          
    45     2.19034521E+03   # McR(Q)          
    46     1.37192676E+03   # MtR(Q)          
    47     2.18973511E+03   # MdR(Q)          
    48     2.18973511E+03   # MsR(Q)          
    49     1.92973792E+03   # MbR(Q)          
Block AU Q=  1.52258496E+03   #
  1  1    -9.10379761E+02   # A_u
  2  2    -9.10379761E+02   # A_c
  3  3    -9.10379761E+02   # A_t
Block AD Q=  1.52258496E+03   #
  1  1    -1.28269983E+03   # A_d
  2  2    -1.28269983E+03   # A_s
  3  3    -1.28269983E+03   # A_b
Block AE Q=  1.52258496E+03   #
  1  1    -5.07900513E+02   # A_e
  2  2    -5.07900513E+02   # A_mu
  3  3    -5.07900513E+02   # A_tau
#  ISAJET decay tables in SUSY Les Houches accord format
#  Created by ISALHD. Last revision: C. Balazs, 2005 May 25
Block DCINFO                           # Program information
     1   ISASUGRA from ISAJET          # Spectrum Calculator
     2   7.80   29-OCT-2009 12:50:36   # Version number
#         PDG         Width
DECAY         6  1.14680779E+00   # TP    decays
#          BR          NDA       ID1       ID2       ID3       ID4
      3.33333343E-01    3            2        -1         5             # TP     -->  UP     DB     BT          
      3.33333343E-01    3            4        -3         5             # TP     -->  CH     SB     BT          
      1.11111112E-01    3          -11        12         5             # TP     -->  E+     NUE    BT          
      1.11111112E-01    3          -13        14         5             # TP     -->  MU+    NUM    BT          
      1.11111112E-01    3          -15        16         5             # TP     -->  TAU+   NUT    BT          
#         PDG         Width
DECAY   1000021  1.25443870E-02   # GLSS  decays
#          BR          NDA       ID1       ID2       ID3       ID4
      2.79856753E-02    3      1000024         1        -2             # GLSS   -->  W1SS+  DN     UB          
      2.79856753E-02    3     -1000024         2        -1             # GLSS   -->  W1SS-  UP     DB          
      2.79856659E-02    3      1000024         3        -4             # GLSS   -->  W1SS+  ST     CB          
      2.79856659E-02    3     -1000024         4        -3             # GLSS   -->  W1SS-  CH     SB          
      7.04003200E-02    3      1000024         5        -6             # GLSS   -->  W1SS+  BT     TB          
      7.04003200E-02    3     -1000024         6        -5             # GLSS   -->  W1SS-  TP     BB          
      1.25144655E-03    3      1000037         1        -2             # GLSS   -->  W2SS+  DN     UB          
      1.25144655E-03    3     -1000037         2        -1             # GLSS   -->  W2SS-  UP     DB          
      1.25144643E-03    3      1000037         3        -4             # GLSS   -->  W2SS+  ST     CB          
      1.25144643E-03    3     -1000037         4        -3             # GLSS   -->  W2SS-  CH     SB          
      1.35486126E-01    3      1000037         5        -6             # GLSS   -->  W2SS+  BT     TB          
      1.35486126E-01    3     -1000037         6        -5             # GLSS   -->  W2SS-  TP     BB          
      2.29217039E-06    2      1000022        21                       # GLSS   -->  Z1SS   GL                 
      1.29215084E-02    3      1000022         2        -2             # GLSS   -->  Z1SS   UP     UB          
      3.97707382E-03    3      1000022         1        -1             # GLSS   -->  Z1SS   DN     DB          
      3.97707382E-03    3      1000022         3        -3             # GLSS   -->  Z1SS   ST     SB          
      1.29214963E-02    3      1000022         4        -4             # GLSS   -->  Z1SS   CH     CB          
      1.05624171E-02    3      1000022         5        -5             # GLSS   -->  Z1SS   BT     BB          
      7.54037127E-02    3      1000022         6        -6             # GLSS   -->  Z1SS   TP     TB          
      1.10249710E-03    2      1000023        21                       # GLSS   -->  Z2SS   GL                 
      1.42541975E-02    3      1000023         2        -2             # GLSS   -->  Z2SS   UP     UB          
      1.36906570E-02    3      1000023         1        -1             # GLSS   -->  Z2SS   DN     DB          
      1.36906570E-02    3      1000023         3        -3             # GLSS   -->  Z2SS   ST     SB          
      1.42541910E-02    3      1000023         4        -4             # GLSS   -->  Z2SS   CH     CB          
      5.67678250E-02    3      1000023         5        -5             # GLSS   -->  Z2SS   BT     BB          
      2.06386521E-02    3      1000023         6        -6             # GLSS   -->  Z2SS   TP     TB          
      8.96757003E-03    2      1000025        21                       # GLSS   -->  Z3SS   GL                 
      9.85385759E-06    3      1000025         2        -2             # GLSS   -->  Z3SS   UP     UB          
      1.28198253E-05    3      1000025         1        -1             # GLSS   -->  Z3SS   DN     DB          
      1.28198253E-05    3      1000025         3        -3             # GLSS   -->  Z3SS   ST     SB          
      9.85385213E-06    3      1000025         4        -4             # GLSS   -->  Z3SS   CH     CB          
      2.61848141E-02    3      1000025         5        -5             # GLSS   -->  Z3SS   BT     BB          
      5.76003753E-02    3      1000025         6        -6             # GLSS   -->  Z3SS   TP     TB          
      8.20790324E-03    2      1000035        21                       # GLSS   -->  Z4SS   GL                 
      6.16614707E-04    3      1000035         2        -2             # GLSS   -->  Z4SS   UP     UB          
      7.22527388E-04    3      1000035         1        -1             # GLSS   -->  Z4SS   DN     DB          
      7.22527388E-04    3      1000035         3        -3             # GLSS   -->  Z4SS   ST     SB          
      6.16614241E-04    3      1000035         4        -4             # GLSS   -->  Z4SS   CH     CB          
      2.35132743E-02    3      1000035         5        -5             # GLSS   -->  Z4SS   BT     BB          
      8.99168327E-02    3      1000035         6        -6             # GLSS   -->  Z4SS   TP     TB          
#         PDG         Width
DECAY   1000002  9.44455261E+01   # UPL   decays
#          BR          NDA       ID1       ID2       ID3       ID4
      2.69744592E-03    2      1000022         2                       # UPL    -->  Z1SS   UP                 
      8.67987424E-02    2      1000023         2                       # UPL    -->  Z2SS   UP                 
      2.13095496E-04    2      1000025         2                       # UPL    -->  Z3SS   UP                 
      7.71794468E-03    2      1000035         2                       # UPL    -->  Z4SS   UP                 
      7.13986039E-01    2      1000021         2                       # UPL    -->  GLSS   UP                 
      1.77578166E-01    2      1000024         1                       # UPL    -->  W1SS+  DN                 
      1.10085737E-02    2      1000037         1                       # UPL    -->  W2SS+  DN                 
#         PDG         Width
DECAY   1000001  9.44808044E+01   # DNL   decays
#          BR          NDA       ID1       ID2       ID3       ID4
      3.90612031E-03    2      1000022         1                       # DNL    -->  Z1SS   DN                 
      8.37268010E-02    2      1000023         1                       # DNL    -->  Z2SS   DN                 
      3.62466788E-04    2      1000025         1                       # DNL    -->  Z3SS   DN                 
      9.37674195E-03    2      1000035         1                       # DNL    -->  Z4SS   DN                 
      7.14827299E-01    2      1000021         1                       # DNL    -->  GLSS   DN                 
      1.65525436E-01    2     -1000024         2                       # DNL    -->  W1SS-  UP                 
      2.22750548E-02    2     -1000037         2                       # DNL    -->  W2SS-  UP                 
#         PDG         Width
DECAY   1000003  9.44807892E+01   # STL   decays
#          BR          NDA       ID1       ID2       ID3       ID4
      3.90612101E-03    2      1000022         3                       # STL    -->  Z1SS   ST                 
      8.37268159E-02    2      1000023         3                       # STL    -->  Z2SS   ST                 
      3.62466846E-04    2      1000025         3                       # STL    -->  Z3SS   ST                 
      9.37674381E-03    2      1000035         3                       # STL    -->  Z4SS   ST                 
      7.14827418E-01    2      1000021         3                       # STL    -->  GLSS   ST                 
      1.65525362E-01    2     -1000024         4                       # STL    -->  W1SS-  CH                 
      2.22750418E-02    2     -1000037         4                       # STL    -->  W2SS-  CH                 
#         PDG         Width
DECAY   1000004  9.44454498E+01   # CHL   decays
#          BR          NDA       ID1       ID2       ID3       ID4
      2.69744638E-03    2      1000022         4                       # CHL    -->  Z1SS   CH                 
      8.67987648E-02    2      1000023         4                       # CHL    -->  Z2SS   CH                 
      2.13095525E-04    2      1000025         4                       # CHL    -->  Z3SS   CH                 
      7.71794654E-03    2      1000035         4                       # CHL    -->  Z4SS   CH                 
      7.13985860E-01    2      1000021         4                       # CHL    -->  GLSS   CH                 
      1.77578315E-01    2      1000024         3                       # CHL    -->  W1SS+  ST                 
      1.10085849E-02    2      1000037         3                       # CHL    -->  W2SS+  ST                 
#         PDG         Width
DECAY   1000005  7.66364059E+01   # BT1   decays
#          BR          NDA       ID1       ID2       ID3       ID4
      5.47817582E-03    2      1000022         5                       # BT1    -->  Z1SS   BT                 
      8.59490633E-02    2      1000023         5                       # BT1    -->  Z2SS   BT                 
      4.59190197E-02    2      1000025         5                       # BT1    -->  Z3SS   BT                 
      4.53434922E-02    2      1000035         5                       # BT1    -->  Z4SS   BT                 
      3.83742154E-01    2      1000021         5                       # BT1    -->  GLSS   BT                 
      1.65652603E-01    2     -1000024         6                       # BT1    -->  W1SS-  TP                 
      2.48106599E-01    2     -1000037         6                       # BT1    -->  W2SS-  TP                 
      1.98088679E-02    2          -24   1000006                       # BT1    -->  W-     TP1                
#         PDG         Width
DECAY   1000006  3.54113655E+01   # TP1   decays
#          BR          NDA       ID1       ID2       ID3       ID4
      1.46098301E-01    2      1000021         6                       # TP1    -->  GLSS   TP                 
      8.27458426E-02    2      1000022         6                       # TP1    -->  Z1SS   TP                 
      2.55505182E-02    2      1000023         6                       # TP1    -->  Z2SS   TP                 
      1.96462214E-01    2      1000025         6                       # TP1    -->  Z3SS   TP                 
      1.57376081E-01    2      1000035         6                       # TP1    -->  Z4SS   TP                 
      5.17234765E-02    2      1000024         5                       # TP1    -->  W1SS+  BT                 
      3.40043545E-01    2      1000037         5                       # TP1    -->  W2SS+  BT                 
#         PDG         Width
DECAY   2000002  7.19295120E+01   # UPR   decays
#          BR          NDA       ID1       ID2       ID3       ID4
      6.85573071E-02    2      1000022         2                       # UPR    -->  Z1SS   UP                 
      1.47612969E-04    2      1000023         2                       # UPR    -->  Z2SS   UP                 
      1.02997437E-04    2      1000025         2                       # UPR    -->  Z3SS   UP                 
      4.20082099E-04    2      1000035         2                       # UPR    -->  Z4SS   UP                 
      9.30771947E-01    2      1000021         2                       # UPR    -->  GLSS   UP                 
#         PDG         Width
DECAY   2000001  6.81824875E+01   # DNR   decays
#          BR          NDA       ID1       ID2       ID3       ID4
      1.80798154E-02    2      1000022         1                       # DNR    -->  Z1SS   DN                 
      3.89279994E-05    2      1000023         1                       # DNR    -->  Z2SS   DN                 
      2.71618574E-05    2      1000025         1                       # DNR    -->  Z3SS   DN                 
      1.10781351E-04    2      1000035         1                       # DNR    -->  Z4SS   DN                 
      9.81743276E-01    2      1000021         1                       # DNR    -->  GLSS   DN                 
#         PDG         Width
DECAY   2000003  6.81824875E+01   # STR   decays
#          BR          NDA       ID1       ID2       ID3       ID4
      1.80798154E-02    2      1000022         3                       # STR    -->  Z1SS   ST                 
      3.89279994E-05    2      1000023         3                       # STR    -->  Z2SS   ST                 
      2.71618574E-05    2      1000025         3                       # STR    -->  Z3SS   ST                 
      1.10781351E-04    2      1000035         3                       # STR    -->  Z4SS   ST                 
      9.81743276E-01    2      1000021         3                       # STR    -->  GLSS   ST                 
#         PDG         Width
DECAY   2000004  7.19294434E+01   # CHR   decays
#          BR          NDA       ID1       ID2       ID3       ID4
      6.85573295E-02    2      1000022         4                       # CHR    -->  Z1SS   CH                 
      1.47613042E-04    2      1000023         4                       # CHR    -->  Z2SS   CH                 
      1.02997496E-04    2      1000025         4                       # CHR    -->  Z3SS   CH                 
      4.20082244E-04    2      1000035         4                       # CHR    -->  Z4SS   CH                 
      9.30772007E-01    2      1000021         4                       # CHR    -->  GLSS   CH                 
#         PDG         Width
DECAY   2000005  6.57748642E+01   # BT2   decays
#          BR          NDA       ID1       ID2       ID3       ID4
      1.66619271E-02    2      1000022         5                       # BT2    -->  Z1SS   BT                 
      5.63287130E-03    2      1000023         5                       # BT2    -->  Z2SS   BT                 
      6.51838779E-02    2      1000025         5                       # BT2    -->  Z3SS   BT                 
      5.96120507E-02    2      1000035         5                       # BT2    -->  Z4SS   BT                 
      7.10894525E-01    2      1000021         5                       # BT2    -->  GLSS   BT                 
      1.05158370E-02    2     -1000024         6                       # BT2    -->  W1SS-  TP                 
      1.20540164E-01    2     -1000037         6                       # BT2    -->  W2SS-  TP                 
      4.97105764E-04    2          -24   1000006                       # BT2    -->  W-     TP1                
      2.66298349E-03    2          -24   2000006                       # BT2    -->  W-     TP2                
      1.60827523E-03    2           23   1000005                       # BT2    -->  Z0     BT1                
      6.19035028E-03    2           25   1000005                       # BT2    -->  HL0    BT1                
#         PDG         Width
DECAY   2000006  7.57411652E+01   # TP2   decays
#          BR          NDA       ID1       ID2       ID3       ID4
      3.56851578E-01    2      1000021         6                       # TP2    -->  GLSS   TP                 
      1.65424690E-01    2      1000024         5                       # TP2    -->  W1SS+  BT                 
      1.04952917E-01    2      1000037         5                       # TP2    -->  W2SS+  BT                 
      1.12701776E-02    2           23   1000006                       # TP2    -->  Z0     TP1                
      2.01895442E-02    2           25   1000006                       # TP2    -->  HL0    TP1                
      2.73661036E-03    2      1000022         6                       # TP2    -->  Z1SS   TP                 
      7.96422213E-02    2      1000023         6                       # TP2    -->  Z2SS   TP                 
      1.23846896E-01    2      1000025         6                       # TP2    -->  Z3SS   TP                 
      1.35085404E-01    2      1000035         6                       # TP2    -->  Z4SS   TP                 
#         PDG         Width
DECAY   1000011  2.69836884E+01   # EL-   decays
#          BR          NDA       ID1       ID2       ID3       ID4
      8.94509703E-02    2      1000022        11                       # EL-    -->  Z1SS   E-                 
      2.88780093E-01    2      1000023        11                       # EL-    -->  Z2SS   E-                 
      3.27668240E-04    2      1000025        11                       # EL-    -->  Z3SS   E-                 
      1.97232459E-02    2      1000035        11                       # EL-    -->  Z4SS   E-                 
      5.31159520E-01    2     -1000024        12                       # EL-    -->  W1SS-  NUE                
      7.05585778E-02    2     -1000037        12                       # EL-    -->  W2SS-  NUE                
#         PDG         Width
DECAY   1000013  2.69836884E+01   # MUL-  decays
#          BR          NDA       ID1       ID2       ID3       ID4
      8.94509703E-02    2      1000022        13                       # MUL-   -->  Z1SS   MU-                
      2.88780093E-01    2      1000023        13                       # MUL-   -->  Z2SS   MU-                
      3.27668240E-04    2      1000025        13                       # MUL-   -->  Z3SS   MU-                
      1.97232459E-02    2      1000035        13                       # MUL-   -->  Z4SS   MU-                
      5.31159520E-01    2     -1000024        14                       # MUL-   -->  W1SS-  NUM                
      7.05585778E-02    2     -1000037        14                       # MUL-   -->  W2SS-  NUM                
#         PDG         Width
DECAY   1000015  1.81749306E+01   # TAU1- decays
#          BR          NDA       ID1       ID2       ID3       ID4
      4.69445050E-01    2      1000022        15                       # TAU1-  -->  Z1SS   TAU-               
      3.21665220E-02    2      1000023        15                       # TAU1-  -->  Z2SS   TAU-               
      1.27258256E-01    2      1000025        15                       # TAU1-  -->  Z3SS   TAU-               
      1.04766540E-01    2      1000035        15                       # TAU1-  -->  Z4SS   TAU-               
      6.05511777E-02    2     -1000024        16                       # TAU1-  -->  W1SS-  NUT                
      2.05812439E-01    2     -1000037        16                       # TAU1-  -->  W2SS-  NUT                
#         PDG         Width
DECAY   1000012  2.70250626E+01   # NUEL  decays
#          BR          NDA       ID1       ID2       ID3       ID4
      1.00943163E-01    2      1000022        12                       # NUEL   -->  Z1SS   NUE                
      2.58350343E-01    2      1000023        12                       # NUEL   -->  Z2SS   NUE                
      1.74430688E-03    2      1000025        12                       # NUEL   -->  Z3SS   NUE                
      3.53722759E-02    2      1000035        12                       # NUEL   -->  Z4SS   NUE                
      5.68783641E-01    2      1000024        11                       # NUEL   -->  W1SS+  E-                 
      3.48061882E-02    2      1000037        11                       # NUEL   -->  W2SS+  E-                 
#         PDG         Width
DECAY   1000014  2.70250626E+01   # NUML  decays
#          BR          NDA       ID1       ID2       ID3       ID4
      1.00943163E-01    2      1000022        14                       # NUML   -->  Z1SS   NUM                
      2.58350343E-01    2      1000023        14                       # NUML   -->  Z2SS   NUM                
      1.74430688E-03    2      1000025        14                       # NUML   -->  Z3SS   NUM                
      3.53722759E-02    2      1000035        14                       # NUML   -->  Z4SS   NUM                
      5.68783641E-01    2      1000024        13                       # NUML   -->  W1SS+  MU-                
      3.48061882E-02    2      1000037        13                       # NUML   -->  W2SS+  MU-                
#         PDG         Width
DECAY   1000016  3.02597256E+01   # NUTL  decays
#          BR          NDA       ID1       ID2       ID3       ID4
      8.29385966E-02    2      1000022        16                       # NUTL   -->  Z1SS   NUT                
      2.10518822E-01    2      1000023        16                       # NUTL   -->  Z2SS   NUT                
      1.40125502E-03    2      1000025        16                       # NUTL   -->  Z3SS   NUT                
      2.83639822E-02    2      1000035        16                       # NUTL   -->  Z4SS   NUT                
      4.88485336E-01    2      1000024        15                       # NUTL   -->  W1SS+  TAU-               
      1.84723556E-01    2      1000037        15                       # NUTL   -->  W2SS+  TAU-               
      3.56844789E-03    2           24   1000015                       # NUTL   -->  W+     TAU1-              
#         PDG         Width
DECAY   2000011  1.03045177E+01   # ER-   decays
#          BR          NDA       ID1       ID2       ID3       ID4
      9.90478992E-01    2      1000022        11                       # ER-    -->  Z1SS   E-                 
      2.11745943E-03    2      1000023        11                       # ER-    -->  Z2SS   E-                 
      1.45960494E-03    2      1000025        11                       # ER-    -->  Z3SS   E-                 
      5.94392559E-03    2      1000035        11                       # ER-    -->  Z4SS   E-                 
#         PDG         Width
DECAY   2000013  1.03045177E+01   # MUR-  decays
#          BR          NDA       ID1       ID2       ID3       ID4
      9.90478992E-01    2      1000022        13                       # MUR-   -->  Z1SS   MU-                
      2.11745943E-03    2      1000023        13                       # MUR-   -->  Z2SS   MU-                
      1.45960494E-03    2      1000025        13                       # MUR-   -->  Z3SS   MU-                
      5.94392559E-03    2      1000035        13                       # MUR-   -->  Z4SS   MU-                
#         PDG         Width
DECAY   2000015  3.00875740E+01   # TAU2- decays
#          BR          NDA       ID1       ID2       ID3       ID4
      7.51191229E-02    2      1000022        15                       # TAU2-  -->  Z1SS   TAU-               
      2.41117358E-01    2      1000023        15                       # TAU2-  -->  Z2SS   TAU-               
      9.19113606E-02    2      1000025        15                       # TAU2-  -->  Z3SS   TAU-               
      1.00288905E-01    2      1000035        15                       # TAU2-  -->  Z4SS   TAU-               
      4.18490380E-01    2     -1000024        16                       # TAU2-  -->  W1SS-  NUT                
      7.01368451E-02    2     -1000037        16                       # TAU2-  -->  W2SS-  NUT                
      1.68333680E-03    2           23   1000015                       # TAU2-  -->  Z0     TAU1-              
      1.25264376E-03    2           25   1000015                       # TAU2-  -->  HL0    TAU1-              
#         PDG         Width
DECAY   1000023  2.05160417E-02   # Z2SS  decays
#          BR          NDA       ID1       ID2       ID3       ID4
      2.36116853E-06    2      1000022        22                       # Z2SS   -->  Z1SS   GM                 
      1.21965796E-01    2      1000022        23                       # Z2SS   -->  Z1SS   Z0                 
      9.12067222E-08    3      1000022         2        -2             # Z2SS   -->  Z1SS   UP     UB          
      1.23964810E-07    3      1000022         1        -1             # Z2SS   -->  Z1SS   DN     DB          
      1.23964810E-07    3      1000022         3        -3             # Z2SS   -->  Z1SS   ST     SB          
      9.12066938E-08    3      1000022         4        -4             # Z2SS   -->  Z1SS   CH     CB          
      1.94063887E-06    3      1000022         5        -5             # Z2SS   -->  Z1SS   BT     BB          
      4.36892037E-07    3      1000022        11       -11             # Z2SS   -->  Z1SS   E-     E+          
      4.36892037E-07    3      1000022        13       -13             # Z2SS   -->  Z1SS   MU-    MU+         
      1.22609015E-06    3      1000022        15       -15             # Z2SS   -->  Z1SS   TAU-   TAU+        
      4.38626131E-07    3      1000022        12       -12             # Z2SS   -->  Z1SS   NUE    ANUE        
      4.38626131E-07    3      1000022        14       -14             # Z2SS   -->  Z1SS   NUM    ANUM        
      6.08837013E-07    3      1000022        16       -16             # Z2SS   -->  Z1SS   NUT    ANUT        
      8.78025889E-01    2      1000022        25                       # Z2SS   -->  Z1SS   HL0                
#         PDG         Width
DECAY   1000025  1.89147329E+00   # Z3SS  decays
#          BR          NDA       ID1       ID2       ID3       ID4
      6.53345609E-08    2      1000022        22                       # Z3SS   -->  Z1SS   GM                 
      5.14172939E-07    2      1000023        22                       # Z3SS   -->  Z2SS   GM                 
      2.84874141E-01    2      1000024       -24                       # Z3SS   -->  W1SS+  W-                 
      2.84874141E-01    2     -1000024        24                       # Z3SS   -->  W1SS-  W+                 
      1.43966332E-01    2      1000022        23                       # Z3SS   -->  Z1SS   Z0                 
      2.53512770E-01    2      1000023        23                       # Z3SS   -->  Z2SS   Z0                 
      1.87027144E-10    3      1000022         2        -2             # Z3SS   -->  Z1SS   UP     UB          
      6.58397226E-11    3      1000022         1        -1             # Z3SS   -->  Z1SS   DN     DB          
      6.58397226E-11    3      1000022         3        -3             # Z3SS   -->  Z1SS   ST     SB          
      1.87026991E-10    3      1000022         4        -4             # Z3SS   -->  Z1SS   CH     CB          
      9.09723042E-07    3      1000022         5        -5             # Z3SS   -->  Z1SS   BT     BB          
      4.39514675E-10    3      1000022        11       -11             # Z3SS   -->  Z1SS   E-     E+          
      4.39514675E-10    3      1000022        13       -13             # Z3SS   -->  Z1SS   MU-    MU+         
      6.33145874E-07    3      1000022        15       -15             # Z3SS   -->  Z1SS   TAU-   TAU+        
      3.12374099E-10    3      1000022        12       -12             # Z3SS   -->  Z1SS   NUE    ANUE        
      3.12374099E-10    3      1000022        14       -14             # Z3SS   -->  Z1SS   NUM    ANUM        
      4.36672615E-10    3      1000022        16       -16             # Z3SS   -->  Z1SS   NUT    ANUT        
      4.22160501E-11    3      1000023         2        -2             # Z3SS   -->  Z2SS   UP     UB          
      6.89936580E-11    3      1000023         1        -1             # Z3SS   -->  Z2SS   DN     DB          
      6.89936580E-11    3      1000023         3        -3             # Z3SS   -->  Z2SS   ST     SB          
      4.22160293E-11    3      1000023         4        -4             # Z3SS   -->  Z2SS   CH     CB          
      2.08779184E-07    3      1000023         5        -5             # Z3SS   -->  Z2SS   BT     BB          
      9.80972421E-12    3      1000023        11       -11             # Z3SS   -->  Z2SS   E-     E+          
      9.80972421E-12    3      1000023        13       -13             # Z3SS   -->  Z2SS   MU-    MU+         
      3.88896026E-08    3      1000023        15       -15             # Z3SS   -->  Z2SS   TAU-   TAU+        
      4.68105485E-11    3      1000023        12       -12             # Z3SS   -->  Z2SS   NUE    ANUE        
      4.68105485E-11    3      1000023        14       -14             # Z3SS   -->  Z2SS   NUM    ANUM        
      6.57405866E-11    3      1000023        16       -16             # Z3SS   -->  Z2SS   NUT    ANUT        
      2.71995980E-02    2      1000022        25                       # Z3SS   -->  Z1SS   HL0                
      5.57064777E-03    2      1000023        25                       # Z3SS   -->  Z2SS   HL0                
#         PDG         Width
DECAY   1000035  2.30875111E+00   # Z4SS  decays
#          BR          NDA       ID1       ID2       ID3       ID4
      4.73204480E-08    2      1000022        22                       # Z4SS   -->  Z1SS   GM                 
      2.08879172E-07    2      1000023        22                       # Z4SS   -->  Z2SS   GM                 
      2.72819634E-09    2      1000025        22                       # Z4SS   -->  Z3SS   GM                 
      3.25576186E-01    2      1000024       -24                       # Z4SS   -->  W1SS+  W-                 
      3.25576186E-01    2     -1000024        24                       # Z4SS   -->  W1SS-  W+                 
      2.61687040E-02    2      1000022        23                       # Z4SS   -->  Z1SS   Z0                 
      1.15094800E-02    2      1000023        23                       # Z4SS   -->  Z2SS   Z0                 
      3.54196028E-09    3      1000022         2        -2             # Z4SS   -->  Z1SS   UP     UB          
      3.51576568E-09    3      1000022         1        -1             # Z4SS   -->  Z1SS   DN     DB          
      3.51576568E-09    3      1000022         3        -3             # Z4SS   -->  Z1SS   ST     SB          
      3.54195806E-09    3      1000022         4        -4             # Z4SS   -->  Z1SS   CH     CB          
      6.82400582E-07    3      1000022         5        -5             # Z4SS   -->  Z1SS   BT     BB          
      1.11509681E-08    3      1000022        11       -11             # Z4SS   -->  Z1SS   E-     E+          
      1.11509681E-08    3      1000022        13       -13             # Z4SS   -->  Z1SS   MU-    MU+         
      5.43610497E-07    3      1000022        15       -15             # Z4SS   -->  Z1SS   TAU-   TAU+        
      1.50668562E-08    3      1000022        12       -12             # Z4SS   -->  Z1SS   NUE    ANUE        
      1.50668562E-08    3      1000022        14       -14             # Z4SS   -->  Z1SS   NUM    ANUM        
      2.10438564E-08    3      1000022        16       -16             # Z4SS   -->  Z1SS   NUT    ANUT        
      5.63578828E-09    3      1000023         2        -2             # Z4SS   -->  Z2SS   UP     UB          
      6.58139054E-09    3      1000023         1        -1             # Z4SS   -->  Z2SS   DN     DB          
      6.58139054E-09    3      1000023         3        -3             # Z4SS   -->  Z2SS   ST     SB          
      5.63578606E-09    3      1000023         4        -4             # Z4SS   -->  Z2SS   CH     CB          
      2.10941508E-07    3      1000023         5        -5             # Z4SS   -->  Z2SS   BT     BB          
      2.17091656E-09    3      1000023        11       -11             # Z4SS   -->  Z2SS   E-     E+          
      2.17091656E-09    3      1000023        13       -13             # Z4SS   -->  Z2SS   MU-    MU+         
      3.65392090E-08    3      1000023        15       -15             # Z4SS   -->  Z2SS   TAU-   TAU+        
      3.50624618E-09    3      1000023        12       -12             # Z4SS   -->  Z2SS   NUE    ANUE        
      3.50624618E-09    3      1000023        14       -14             # Z4SS   -->  Z2SS   NUM    ANUM        
      4.92530505E-09    3      1000023        16       -16             # Z4SS   -->  Z2SS   NUT    ANUT        
      7.69671686E-08    3      1000025         2        -2             # Z4SS   -->  Z3SS   UP     UB          
      9.92615767E-08    3      1000025         1        -1             # Z4SS   -->  Z3SS   DN     DB          
      9.92615767E-08    3      1000025         3        -3             # Z4SS   -->  Z3SS   ST     SB          
      7.69671686E-08    3      1000025         4        -4             # Z4SS   -->  Z3SS   CH     CB          
      3.83910113E-08    3      1000025         5        -5             # Z4SS   -->  Z3SS   BT     BB          
      2.25169252E-08    3      1000025        11       -11             # Z4SS   -->  Z3SS   E-     E+          
      2.25169252E-08    3      1000025        13       -13             # Z4SS   -->  Z3SS   MU-    MU+         
      1.96835579E-08    3      1000025        15       -15             # Z4SS   -->  Z3SS   TAU-   TAU+        
      4.47953923E-08    3      1000025        12       -12             # Z4SS   -->  Z3SS   NUE    ANUE        
      4.47953923E-08    3      1000025        14       -14             # Z4SS   -->  Z3SS   NUM    ANUM        
      4.47945965E-08    3      1000025        16       -16             # Z4SS   -->  Z3SS   NUT    ANUT        
      1.07295290E-01    2      1000022        25                       # Z4SS   -->  Z1SS   HL0                
      2.03871891E-01    2      1000023        25                       # Z4SS   -->  Z2SS   HL0                
#         PDG         Width
DECAY   1000024  1.96302012E-02   # W1SS+ decays
#          BR          NDA       ID1       ID2       ID3       ID4
      2.29329373E-07    3      1000022         2        -1             # W1SS+  -->  Z1SS   UP     DB          
      2.29329316E-07    3      1000022         4        -3             # W1SS+  -->  Z1SS   CH     SB          
      9.47434330E-07    3      1000022       -11        12             # W1SS+  -->  Z1SS   E+     NUE         
      9.47434330E-07    3      1000022       -13        14             # W1SS+  -->  Z1SS   MU+    NUM         
      1.94667768E-06    3      1000022       -15        16             # W1SS+  -->  Z1SS   TAU+   NUT         
      9.99995708E-01    2      1000022        24                       # W1SS+  -->  Z1SS   W+                 
      2.07505554E-10    3      1000023         2        -1             # W1SS+  -->  Z2SS   UP     DB          
      6.91839919E-11    3      1000023       -11        12             # W1SS+  -->  Z2SS   E+     NUE         
      6.91839919E-11    3      1000023       -13        14             # W1SS+  -->  Z2SS   MU+    NUM         
#         PDG         Width
DECAY   1000037  2.03455782E+00   # W2SS+ decays
#          BR          NDA       ID1       ID2       ID3       ID4
      5.94474781E-09    3      1000022         2        -1             # W2SS+  -->  Z1SS   UP     DB          
      5.94474692E-09    3      1000022         4        -3             # W2SS+  -->  Z1SS   CH     SB          
      2.31007746E-08    3      1000022       -11        12             # W2SS+  -->  Z1SS   E+     NUE         
      2.31007746E-08    3      1000022       -13        14             # W2SS+  -->  Z1SS   MU+    NUM         
      6.18937463E-07    3      1000022       -15        16             # W2SS+  -->  Z1SS   TAU+   NUT         
      1.34104624E-01    2      1000022        24                       # W2SS+  -->  Z1SS   W+                 
      4.91879115E-09    3      1000023         2        -1             # W2SS+  -->  Z2SS   UP     DB          
      4.91879115E-09    3      1000023         4        -3             # W2SS+  -->  Z2SS   CH     SB          
      2.38059950E-09    3      1000023       -11        12             # W2SS+  -->  Z2SS   E+     NUE         
      2.38059950E-09    3      1000023       -13        14             # W2SS+  -->  Z2SS   MU+    NUM         
      6.63700703E-08    3      1000023       -15        16             # W2SS+  -->  Z2SS   TAU+   NUT         
      3.19944233E-01    2      1000023        24                       # W2SS+  -->  Z2SS   W+                 
      2.90818065E-07    3      1000025         2        -1             # W2SS+  -->  Z3SS   UP     DB          
      2.90818065E-07    3      1000025         4        -3             # W2SS+  -->  Z3SS   CH     SB          
      9.69367093E-08    3      1000025       -11        12             # W2SS+  -->  Z3SS   E+     NUE         
      9.69367093E-08    3      1000025       -13        14             # W2SS+  -->  Z3SS   MU+    NUM         
      9.70299041E-08    3      1000025       -15        16             # W2SS+  -->  Z3SS   TAU+   NUT         
      2.96397805E-01    2      1000024        23                       # W2SS+  -->  W1SS+  Z0                 
      6.10433171E-09    3      1000024         1        -1             # W2SS+  -->  W1SS+  DN     DB          
      6.10432860E-09    3      1000024         3        -3             # W2SS+  -->  W1SS+  ST     SB          
      1.14731966E-08    3      1000024         2        -2             # W2SS+  -->  W1SS+  UP     UB          
      1.14731966E-08    3      1000024         4        -4             # W2SS+  -->  W1SS+  CH     CB          
      5.30176347E-09    3      1000024        12       -12             # W2SS+  -->  W1SS+  NUE    ANUE        
      5.30176347E-09    3      1000024        14       -14             # W2SS+  -->  W1SS+  NUM    ANUM        
      1.17187833E-08    3      1000024        16       -16             # W2SS+  -->  W1SS+  NUT    ANUT        
      2.82013124E-09    3      1000024        11       -11             # W2SS+  -->  W1SS+  E-     E+          
      2.82013124E-09    3      1000024        13       -13             # W2SS+  -->  W1SS+  MU-    MU+         
      3.96232691E-09    3      1000024        15       -15             # W2SS+  -->  W1SS+  TAU-   TAU+        
      2.49551684E-01    2      1000024        25                       # W2SS+  -->  W1SS+  HL0                
#         PDG         Width
DECAY        25  4.23456822E-03   # HL0   decays
#          BR          NDA       ID1       ID2       ID3       ID4
      4.76594009E-09    2           11       -11                       # HL0    -->  E-     E+                 
      2.01225615E-04    2           13       -13                       # HL0    -->  MU-    MU+                
      5.75545169E-02    2           15       -15                       # HL0    -->  TAU-   TAU+               
      5.98026918E-06    2            1        -1                       # HL0    -->  DN     DB                 
      2.41632853E-03    2            3        -3                       # HL0    -->  ST     SB                 
      7.90268958E-01    2            5        -5                       # HL0    -->  BT     BB                 
      1.88380545E-06    2            2        -2                       # HL0    -->  UP     UB                 
      3.53726968E-02    2            4        -4                       # HL0    -->  CH     CB                 
      1.87876110E-03    2           22        22                       # HL0    -->  GM     GM                 
      3.97016369E-02    2           21        21                       # HL0    -->  GL     GL                 
      3.72685562E-03    3           24        11       -12             # HL0    -->  W+     E-     ANUE        
      3.72685562E-03    3           24        13       -14             # HL0    -->  W+     MU-    ANUM        
      3.72685562E-03    3           24        15       -16             # HL0    -->  W+     TAU-   ANUT        
      1.11805666E-02    3           24        -2         1             # HL0    -->  W+     UB     DN          
      1.11805666E-02    3           24        -4         3             # HL0    -->  W+     CB     ST          
      3.72685562E-03    3          -24       -11        12             # HL0    -->  W-     E+     NUE         
      3.72685562E-03    3          -24       -13        14             # HL0    -->  W-     MU+    NUM         
      3.72685562E-03    3          -24       -15        16             # HL0    -->  W-     TAU+   NUT         
      1.11805666E-02    3          -24         2        -1             # HL0    -->  W-     UP     DB          
      1.11805666E-02    3          -24         4        -3             # HL0    -->  W-     CH     SB          
      3.77132586E-04    3           23        12       -12             # HL0    -->  Z0     NUE    ANUE        
      3.77132586E-04    3           23        14       -14             # HL0    -->  Z0     NUM    ANUM        
      3.77132586E-04    3           23        16       -16             # HL0    -->  Z0     NUT    ANUT        
      1.89807048E-04    3           23        11       -11             # HL0    -->  Z0     E-     E+          
      1.89807048E-04    3           23        13       -13             # HL0    -->  Z0     MU-    MU+         
      1.89807048E-04    3           23        15       -15             # HL0    -->  Z0     TAU-   TAU+        
      6.50262868E-04    3           23         2        -2             # HL0    -->  Z0     UP     UB          
      6.50262868E-04    3           23         4        -4             # HL0    -->  Z0     CH     CB          
      8.37698753E-04    3           23         1        -1             # HL0    -->  Z0     DN     DB          
      8.37698753E-04    3           23         3        -3             # HL0    -->  Z0     ST     SB          
      8.37698753E-04    3           23         5        -5             # HL0    -->  Z0     BT     BB          
#         PDG         Width
DECAY        35  4.46405602E+01   # HH0   decays
#          BR          NDA       ID1       ID2       ID3       ID4
      9.18742415E-09    2           11       -11                       # HH0    -->  E-     E+                 
      3.87909648E-04    2           13       -13                       # HH0    -->  MU-    MU+                
      1.11102350E-01    2           15       -15                       # HH0    -->  TAU-   TAU+               
      1.12184289E-05    2            1        -1                       # HH0    -->  DN     DB                 
      4.53281309E-03    2            3        -3                       # HH0    -->  ST     SB                 
      5.78417122E-01    2            5        -5                       # HH0    -->  BT     BB                 
      1.42425882E-12    2            2        -2                       # HH0    -->  UP     UB                 
      1.91417726E-08    2            4        -4                       # HH0    -->  CH     CB                 
      9.50388494E-04    2            6        -6                       # HH0    -->  TP     TB                 
      4.77112927E-08    2           22        22                       # HH0    -->  GM     GM                 
      1.41389773E-06    2           21        21                       # HH0    -->  GL     GL                 
      9.45607042E-07    2           24       -24                       # HH0    -->  W+     W-                 
      4.83013935E-07    2           23        23                       # HH0    -->  Z0     Z0                 
      7.24154466E-04    2      1000022   1000022                       # HH0    -->  Z1SS   Z1SS               
      5.88312419E-03    2      1000022   1000023                       # HH0    -->  Z1SS   Z2SS               
      1.81406271E-02    2      1000022   1000025                       # HH0    -->  Z1SS   Z3SS               
      9.56705678E-03    2      1000022   1000035                       # HH0    -->  Z1SS   Z4SS               
      1.01217432E-02    2      1000023   1000023                       # HH0    -->  Z2SS   Z2SS               
      4.61498871E-02    2      1000023   1000025                       # HH0    -->  Z2SS   Z3SS               
      1.73006244E-02    2      1000023   1000035                       # HH0    -->  Z2SS   Z4SS               
      3.07001639E-04    2      1000025   1000025                       # HH0    -->  Z3SS   Z3SS               
      9.15542711E-03    2      1000025   1000035                       # HH0    -->  Z3SS   Z4SS               
      4.45182994E-03    2      1000035   1000035                       # HH0    -->  Z4SS   Z4SS               
      2.15101372E-02    2      1000024  -1000024                       # HH0    -->  W1SS+  W1SS-              
      4.33370937E-03    2      1000037  -1000037                       # HH0    -->  W2SS+  W2SS-              
      7.84744769E-02    2      1000024  -1000037                       # HH0    -->  W1SS+  W2SS-              
      7.84744769E-02    2     -1000024   1000037                       # HH0    -->  W1SS-  W2SS+              
      1.16400497E-06    2           25        25                       # HH0    -->  HL0    HL0                
#         PDG         Width
DECAY        36  4.42453537E+01   # HA0   decays
#          BR          NDA       ID1       ID2       ID3       ID4
      9.20893939E-09    2           11       -11                       # HA0    -->  E-     E+                 
      3.88818007E-04    2           13       -13                       # HA0    -->  MU-    MU+                
      1.11363128E-01    2           15       -15                       # HA0    -->  TAU-   TAU+               
      1.12452653E-05    2            1        -1                       # HA0    -->  DN     DB                 
      4.54365648E-03    2            3        -3                       # HA0    -->  ST     SB                 
      5.79811811E-01    2            5        -5                       # HA0    -->  BT     BB                 
      1.40551763E-12    2            2        -2                       # HA0    -->  UP     UB                 
      1.89039628E-08    2            4        -4                       # HA0    -->  CH     CB                 
      9.79869510E-04    2            6        -6                       # HA0    -->  TP     TB                 
      2.92410700E-08    2           22        22                       # HA0    -->  GM     GM                 
      7.26885310E-06    2           21        21                       # HA0    -->  GL     GL                 
      8.07948527E-04    2      1000022   1000022                       # HA0    -->  Z1SS   Z1SS               
      7.16596842E-03    2      1000022   1000023                       # HA0    -->  Z1SS   Z2SS               
      1.30738523E-02    2      1000022   1000025                       # HA0    -->  Z1SS   Z3SS               
      1.34196971E-02    2      1000022   1000035                       # HA0    -->  Z1SS   Z4SS               
      1.42983291E-02    2      1000023   1000023                       # HA0    -->  Z2SS   Z2SS               
      2.64264662E-02    2      1000023   1000025                       # HA0    -->  Z2SS   Z3SS               
      3.05661950E-02    2      1000023   1000035                       # HA0    -->  Z2SS   Z4SS               
      5.72094985E-04    2      1000025   1000025                       # HA0    -->  Z3SS   Z3SS               
      3.91192827E-03    2      1000025   1000035                       # HA0    -->  Z3SS   Z4SS               
      1.09427227E-02    2      1000035   1000035                       # HA0    -->  Z4SS   Z4SS               
      3.03634834E-02    2      1000024  -1000024                       # HA0    -->  W1SS+  W1SS-              
      1.11217005E-02    2      1000037  -1000037                       # HA0    -->  W2SS+  W2SS-              
      7.01114461E-02    2      1000024  -1000037                       # HA0    -->  W1SS+  W2SS-              
      7.01114461E-02    2     -1000024   1000037                       # HA0    -->  W1SS-  W2SS+              
      9.35939283E-07    2           25        23                       # HA0    -->  HL0    Z0                 
#         PDG         Width
DECAY        37  4.20114212E+01   # H+    decays
#          BR          NDA       ID1       ID2       ID3       ID4
      9.77979386E-09    2           12       -11                       # H+     -->  NUE    E+                 
      4.12920548E-04    2           14       -13                       # H+     -->  NUM    MU+                
      1.18266448E-01    2           16       -15                       # H+     -->  NUT    TAU+               
      1.10123392E-05    2            2        -1                       # H+     -->  UP     DB                 
      4.44955332E-03    2            4        -3                       # H+     -->  CH     SB                 
      5.53948164E-01    2            6        -5                       # H+     -->  TP     BB                 
      1.27391322E-02    2      1000024   1000022                       # H+     -->  W1SS+  Z1SS               
      8.22025686E-06    2      1000024   1000023                       # H+     -->  W1SS+  Z2SS               
      8.69551897E-02    2      1000024   1000025                       # H+     -->  W1SS+  Z3SS               
      8.91882703E-02    2      1000024   1000035                       # H+     -->  W1SS+  Z4SS               
      2.16849186E-02    2      1000037   1000022                       # H+     -->  W2SS+  Z1SS               
      1.03866167E-01    2      1000037   1000023                       # H+     -->  W2SS+  Z2SS               
      7.97474012E-03    2      1000037   1000025                       # H+     -->  W2SS+  Z3SS               
      4.94221924E-04    2      1000037   1000035                       # H+     -->  W2SS+  Z4SS               
      1.00046475E-06    2           25        24                       # H+     -->  HL0    W+                 
