  65
  401    403.8563    0.20006E-23
  402    396.8215    0.26415E-23
  403    403.8563    0.20011E-23
  404    396.8238    0.26417E-23
  405   2000.1373    0.61766E-26
  406   2004.0999    0.43562E-26
  407    403.8563    0.20006E-23
  408    396.8215    0.26415E-23
  409    403.8563    0.20011E-23
  410    396.8238    0.26417E-23
  411   2000.1373    0.61766E-26
  412   2004.0999    0.43562E-26
  413    400.7083    0.15603E-22
  414    398.5796    0.40326E-23
  415    400.7084    0.15603E-22
  416    398.5818    0.40329E-23
  417   2000.7828    0.43739E-26
  418   2004.4734    0.44119E-26
  419    400.7083    0.15603E-22
  420    398.5796    0.40326E-23
  421    400.7084    0.15603E-22
  422    398.5818    0.40329E-23
  423   2000.7828    0.43739E-26
  424   2004.4734    0.44119E-26
  425   2000.4913    0.25386E-25
  426   1999.0830    0.25346E-25
  427   2000.4913    0.25386E-25
  428   1999.0830    0.25346E-25
  429   2000.4075    0.67102E-25
  430   1999.0830    0.25292E-25
  431   2000.4913    0.25386E-25
  432   1999.0830    0.25346E-25
  433   2000.4913    0.25386E-25
  434   1999.0830    0.25346E-25
  435   2000.4075    0.67102E-25
  436   1999.0830    0.25292E-25
  437   2000.4253    0.67875E-25
  438      0.0000    0.10000E+31
  439   2000.4253    0.67875E-25
  440      0.0000    0.10000E+31
  441   2000.5106    0.25331E-25
  442      0.0000    0.10000E+31
  443   2000.4253    0.67875E-25
  444      0.0000    0.10000E+31
  445   2000.4253    0.67875E-25
  446      0.0000    0.10000E+31
  447   2000.5106    0.25331E-25
  448      0.0000    0.10000E+31
  449    410.0000    0.32024E-23
  450    299.9030    0.10000E+31
  451    349.8113    0.68123E-18
  452   -602.3521    0.15432E-24
  453    623.1166    0.12886E-24
  454    348.2328    0.16654E-19
  455    620.5282    0.12762E-24
  456    348.2328    0.16654E-19
  457    620.5282    0.12762E-24
  203    105.4009    0.17895E-21
  204   1007.7203    0.10351E-24
  205   1000.0000    0.10321E-24
  206   1006.3821    0.11769E-24
  207   1006.3821    0.11769E-24
  458      0.0000    0.10000E+31
    6    172.5000    0.57395E-24
   12    172.5000    0.57395E-24
   3
   401  0.10949076E+00     0   450     1     0     0     0
   401  0.27326319E+00     0   451     1     0     0     0
   401  0.61724603E+00     0   456     2     0     0     0
   3
   402  0.13592805E-02     0   450     2     0     0     0
   402  0.32465032E+00     0   451     2     0     0     0
   402  0.67399043E+00     0   454     1     0     0     0
   3
   403  0.10951367E+00     0   450     3     0     0     0
   403  0.27332050E+00     0   451     3     0     0     0
   403  0.61716580E+00     0   456     4     0     0     0
   3
   404  0.13592506E-02     0   450     4     0     0     0
   404  0.32454896E+00     0   451     4     0     0     0
   404  0.67409182E+00     0   454     3     0     0     0
   7
   405  0.96856756E-02     0   450     5     0     0     0
   405  0.38002912E-03     0   451     5     0     0     0
   405  0.61414664E-03     0   452     5     0     0     0
   405  0.66021207E-03     0   453     5     0     0     0
   405  0.98745143E+00     0   449     5     0     0     0
   405  0.12665469E-03     0   456     6     0     0     0
   405  0.10818851E-02     0   457     6     0     0     0
   7
   406  0.68668985E+00     0   449     6     0     0     0
   406  0.27868699E-01     0   450     6     0     0     0
   406  0.41867895E-02     0   451     6     0     0     0
   406  0.71225889E-01     0   452     6     0     0     0
   406  0.66548839E-01     0   453     6     0     0     0
   406  0.79990458E-02     0   454     5     0     0     0
   406  0.13548088E+00     0   455     5     0     0     0
   3
   407  0.10949076E+00     0   450     7     0     0     0
   407  0.27326319E+00     0   451     7     0     0     0
   407  0.61724603E+00     0   454     8     0     0     0
   3
   408  0.13592805E-02     0   450     8     0     0     0
   408  0.32465032E+00     0   451     8     0     0     0
   408  0.67399043E+00     0   456     7     0     0     0
   3
   409  0.10951367E+00     0   450     9     0     0     0
   409  0.27332050E+00     0   451     9     0     0     0
   409  0.61716580E+00     0   454    10     0     0     0
   3
   410  0.13592506E-02     0   450    10     0     0     0
   410  0.32454896E+00     0   451    10     0     0     0
   410  0.67409182E+00     0   456     9     0     0     0
   7
   411  0.96856756E-02     0   450    11     0     0     0
   411  0.38002912E-03     0   451    11     0     0     0
   411  0.61414664E-03     0   452    11     0     0     0
   411  0.66021207E-03     0   453    11     0     0     0
   411  0.98745143E+00     0   449    11     0     0     0
   411  0.12665469E-03     0   454    12     0     0     0
   411  0.10818851E-02     0   455    12     0     0     0
   7
   412  0.68668985E+00     0   449    12     0     0     0
   412  0.27868699E-01     0   450    12     0     0     0
   412  0.41867895E-02     0   451    12     0     0     0
   412  0.71225889E-01     0   452    12     0     0     0
   412  0.66548839E-01     0   453    12     0     0     0
   412  0.79990458E-02     0   456    11     0     0     0
   412  0.13548088E+00     0   457    11     0     0     0
   2
   413  0.99000663E+00     0   450     1     0     0     0
   413  0.99933483E-02     0   451     1     0     0     0
   2
   414  0.99041718E+00     0   450     2     0     0     0
   414  0.95828697E-02     0   451     2     0     0     0
   2
   415  0.99000663E+00     0   450     3     0     0     0
   415  0.99933539E-02     0   451     3     0     0     0
   2
   416  0.99041963E+00     0   450     4     0     0     0
   416  0.95803458E-02     0   451     4     0     0     0
   7
   417  0.56497301E-02     0   450     5     0     0     0
   417  0.44633511E-01     0   451     5     0     0     0
   417  0.53525175E-03     0   452     5     0     0     0
   417  0.39502559E-02     0   453     5     0     0     0
   417  0.69950336E+00     0   449     5     0     0     0
   417  0.10024730E+00     0   456     6     0     0     0
   417  0.14548059E+00     0   457     6     0     0     0
   7
   418  0.69562823E+00     0   449     6     0     0     0
   418  0.10127958E+00     0   454     5     0     0     0
   418  0.53084721E-02     0   455     5     0     0     0
   418  0.13801662E-02     0   450     6     0     0     0
   418  0.53420480E-01     0   451     6     0     0     0
   418  0.72341464E-01     0   452     6     0     0     0
   418  0.70641562E-01     0   453     6     0     0     0
   2
   419  0.99000663E+00     0   450     7     0     0     0
   419  0.99933483E-02     0   451     7     0     0     0
   2
   420  0.99041718E+00     0   450     8     0     0     0
   420  0.95828697E-02     0   451     8     0     0     0
   2
   421  0.99000663E+00     0   450     9     0     0     0
   421  0.99933539E-02     0   451     9     0     0     0
   2
   422  0.99041963E+00     0   450    10     0     0     0
   422  0.95803458E-02     0   451    10     0     0     0
   7
   423  0.56497301E-02     0   450    11     0     0     0
   423  0.44633511E-01     0   451    11     0     0     0
   423  0.53525175E-03     0   452    11     0     0     0
   423  0.39502559E-02     0   453    11     0     0     0
   423  0.69950336E+00     0   449    11     0     0     0
   423  0.10024730E+00     0   454    12     0     0     0
   423  0.14548059E+00     0   455    12     0     0     0
   7
   424  0.69562823E+00     0   449    12     0     0     0
   424  0.10127958E+00     0   456    11     0     0     0
   424  0.53084721E-02     0   457    11     0     0     0
   424  0.13801662E-02     0   450    12     0     0     0
   424  0.53420480E-01     0   451    12     0     0     0
   424  0.72341464E-01     0   452    12     0     0     0
   424  0.70641562E-01     0   453    12     0     0     0
   6
   425  0.47430974E-01     0   450   121     0     0     0
   425  0.33890286E+00     0   451   121     0     0     0
   425  0.22762154E-03     0   452   121     0     0     0
   425  0.10062062E-01     0   453   121     0     0     0
   425  0.55451387E+00     0   456   122     0     0     0
   425  0.48862606E-01     0   457   122     0     0     0
   6
   426  0.14412527E+00     0   450   122     0     0     0
   426  0.22228107E+00     0   451   122     0     0     0
   426  0.86336752E-03     0   452   122     0     0     0
   426  0.27302789E-01     0   453   122     0     0     0
   426  0.57958722E+00     0   454   121     0     0     0
   426  0.25840294E-01     0   455   121     0     0     0
   6
   427  0.47430974E-01     0   450   123     0     0     0
   427  0.33890286E+00     0   451   123     0     0     0
   427  0.22762154E-03     0   452   123     0     0     0
   427  0.10062062E-01     0   453   123     0     0     0
   427  0.55451387E+00     0   456   124     0     0     0
   427  0.48862606E-01     0   457   124     0     0     0
   6
   428  0.14412527E+00     0   450   124     0     0     0
   428  0.22228107E+00     0   451   124     0     0     0
   428  0.86336752E-03     0   452   124     0     0     0
   428  0.27302789E-01     0   453   124     0     0     0
   428  0.57958722E+00     0   454   123     0     0     0
   428  0.25840294E-01     0   455   123     0     0     0
   6
   429  0.94489378E+00     0   450   125     0     0     0
   429  0.32304071E-01     0   451   125     0     0     0
   429  0.33607050E-02     0   452   125     0     0     0
   429  0.13743001E-01     0   453   125     0     0     0
   429  0.59595087E-03     0   456   126     0     0     0
   429  0.51024663E-02     0   457   126     0     0     0
   6
   430  0.14381595E+00     0   450   126     0     0     0
   430  0.22180401E+00     0   451   126     0     0     0
   430  0.86151459E-03     0   452   126     0     0     0
   430  0.27244192E-01     0   453   126     0     0     0
   430  0.57855946E+00     0   454   125     0     0     0
   430  0.27714815E-01     0   455   125     0     0     0
   6
   431  0.47430974E-01     0   450   127     0     0     0
   431  0.33890286E+00     0   451   127     0     0     0
   431  0.22762154E-03     0   452   127     0     0     0
   431  0.10062062E-01     0   453   127     0     0     0
   431  0.55451387E+00     0   454   128     0     0     0
   431  0.48862606E-01     0   455   128     0     0     0
   6
   432  0.14412527E+00     0   450   128     0     0     0
   432  0.22228107E+00     0   451   128     0     0     0
   432  0.86336752E-03     0   452   128     0     0     0
   432  0.27302789E-01     0   453   128     0     0     0
   432  0.57958722E+00     0   456   127     0     0     0
   432  0.25840294E-01     0   457   127     0     0     0
   6
   433  0.47430974E-01     0   450   129     0     0     0
   433  0.33890286E+00     0   451   129     0     0     0
   433  0.22762154E-03     0   452   129     0     0     0
   433  0.10062062E-01     0   453   129     0     0     0
   433  0.55451387E+00     0   454   130     0     0     0
   433  0.48862606E-01     0   455   130     0     0     0
   6
   434  0.14412527E+00     0   450   130     0     0     0
   434  0.22228107E+00     0   451   130     0     0     0
   434  0.86336752E-03     0   452   130     0     0     0
   434  0.27302789E-01     0   453   130     0     0     0
   434  0.57958722E+00     0   456   129     0     0     0
   434  0.25840294E-01     0   457   129     0     0     0
   6
   435  0.94489378E+00     0   450   131     0     0     0
   435  0.32304071E-01     0   451   131     0     0     0
   435  0.33607050E-02     0   452   131     0     0     0
   435  0.13743001E-01     0   453   131     0     0     0
   435  0.59595087E-03     0   454   132     0     0     0
   435  0.51024663E-02     0   455   132     0     0     0
   6
   436  0.14381595E+00     0   450   132     0     0     0
   436  0.22180401E+00     0   451   132     0     0     0
   436  0.86151459E-03     0   452   132     0     0     0
   436  0.27244192E-01     0   453   132     0     0     0
   436  0.57855946E+00     0   456   131     0     0     0
   436  0.27714815E-01     0   457   131     0     0     0
   4
   437  0.95567572E+00     0   450   121     0     0     0
   437  0.32431427E-01     0   451   121     0     0     0
   437  0.54926687E-03     0   452   121     0     0     0
   437  0.11343539E-01     0   453   121     0     0     0
   0
   4
   439  0.95567572E+00     0   450   123     0     0     0
   439  0.32431427E-01     0   451   123     0     0     0
   439  0.54926687E-03     0   452   123     0     0     0
   439  0.11343539E-01     0   453   123     0     0     0
   0
   6
   441  0.47373559E-01     0   450   125     0     0     0
   441  0.33826047E+00     0   451   125     0     0     0
   441  0.12908541E-02     0   452   125     0     0     0
   441  0.10996462E-01     0   453   125     0     0     0
   441  0.55332100E+00     0   456   126     0     0     0
   441  0.48757661E-01     0   457   126     0     0     0
   0
   4
   443  0.95567572E+00     0   450   127     0     0     0
   443  0.32431427E-01     0   451   127     0     0     0
   443  0.54926687E-03     0   452   127     0     0     0
   443  0.11343539E-01     0   453   127     0     0     0
   0
   4
   445  0.95567572E+00     0   450   129     0     0     0
   445  0.32431427E-01     0   451   129     0     0     0
   445  0.54926687E-03     0   452   129     0     0     0
   445  0.11343539E-01     0   453   129     0     0     0
   0
   6
   447  0.47373559E-01     0   450   131     0     0     0
   447  0.33826047E+00     0   451   131     0     0     0
   447  0.12908541E-02     0   452   131     0     0     0
   447  0.10996462E-01     0   453   131     0     0     0
   447  0.55332100E+00     0   454   132     0     0     0
   447  0.48757661E-01     0   455   132     0     0     0
   0
  16
   449  0.10114209E+00     0   408     2     0     0     0
   449  0.10114209E+00     0   402     8     0     0     0
   449  0.22366889E-01     0   407     1     0     0     0
   449  0.22366889E-01     0   401     7     0     0     0
   449  0.76288059E-01     0   420     2     0     0     0
   449  0.76288059E-01     0   414     8     0     0     0
   449  0.50764535E-01     0   419     1     0     0     0
   449  0.50764535E-01     0   413     7     0     0     0
   449  0.22355113E-01     0   409     3     0     0     0
   449  0.22355113E-01     0   403     9     0     0     0
   449  0.50752886E-01     0   421     3     0     0     0
   449  0.50752886E-01     0   415     9     0     0     0
   449  0.10059259E+00     0   410     4     0     0     0
   449  0.10059259E+00     0   404    10     0     0     0
   449  0.75737819E-01     0   422     4     0     0     0
   449  0.75737819E-01     0   416    10     0     0     0
   0
  14
   451  0.11675763E-02     0   450    59     0     0     0
   451  0.15452268E-04     0   456     2     7     0     0
   451  0.15452268E-04     0   454     1     8     0     0
   451  0.83259374E-01     0   450     2     8     0     0
   451  0.37229842E+00     0   450     1     7     0     0
   451  0.37229821E+00     0   450     3     9     0     0
   451  0.83256342E-01     0   450     4    10     0     0
   451  0.32690316E-01     0   450     5    11     0     0
   451  0.60449331E-02     0   450   121   127     0     0
   451  0.60449331E-02     0   450   123   129     0     0
   451  0.64069265E-02     0   450   125   131     0     0
   451  0.12167358E-01     0   450   122   128     0     0
   451  0.12167358E-01     0   450   124   130     0     0
   451  0.12167358E-01     0   450   126   132     0     0
  22
   452  0.30300573E+00     0   454   199     0     0     0
   452  0.30300573E+00     0   456   198     0     0     0
   452  0.15489441E+00     0   450   200     0     0     0
   452  0.22343911E+00     0   451   200     0     0     0
   452  0.58601652E-02     0   450   203     0     0     0
   452  0.51943660E-02     0   451   203     0     0     0
   452  0.41976070E-03     0   402     8     0     0     0
   452  0.41976070E-03     0   408     2     0     0     0
   452  0.61100750E-03     0   401     7     0     0     0
   452  0.61100750E-03     0   407     1     0     0     0
   452  0.61100721E-03     0   403     9     0     0     0
   452  0.61100721E-03     0   409     3     0     0     0
   452  0.41974758E-03     0   404    10     0     0     0
   452  0.41974758E-03     0   410     4     0     0     0
   452  0.95806718E-04     0   414     8     0     0     0
   452  0.95806718E-04     0   420     2     0     0     0
   452  0.23553721E-04     0   413     7     0     0     0
   452  0.23553721E-04     0   419     1     0     0     0
   452  0.23553708E-04     0   415     9     0     0     0
   452  0.23553708E-04     0   421     3     0     0     0
   452  0.95803669E-04     0   416    10     0     0     0
   452  0.95803669E-04     0   422     4     0     0     0
  22
   453  0.27977189E+00     0   454   199     0     0     0
   453  0.27977189E+00     0   456   198     0     0     0
   453  0.62538139E-02     0   450   200     0     0     0
   453  0.62650070E-02     0   451   200     0     0     0
   453  0.11197157E+00     0   450   203     0     0     0
   453  0.16436158E+00     0   451   203     0     0     0
   453  0.15303946E-01     0   402     8     0     0     0
   453  0.15303946E-01     0   408     2     0     0     0
   453  0.20210972E-01     0   401     7     0     0     0
   453  0.20210972E-01     0   407     1     0     0     0
   453  0.20210961E-01     0   403     9     0     0     0
   453  0.20210961E-01     0   409     3     0     0     0
   453  0.15303540E-01     0   404    10     0     0     0
   453  0.15303540E-01     0   410     4     0     0     0
   453  0.19147570E-02     0   414     8     0     0     0
   453  0.19147570E-02     0   420     2     0     0     0
   453  0.47161474E-03     0   413     7     0     0     0
   453  0.47161474E-03     0   419     1     0     0     0
   453  0.47161450E-03     0   415     9     0     0     0
   453  0.47161450E-03     0   421     3     0     0     0
   453  0.19147055E-02     0   416    10     0     0     0
   453  0.19147055E-02     0   422     4     0     0     0
   5
   454  0.34432724E+00     0   450     2     7     0     0
   454  0.34432733E+00     0   450     4     9     0     0
   454  0.10378174E+00     0   450   127   122     0     0
   454  0.10378174E+00     0   450   129   124     0     0
   454  0.10378189E+00     0   450   131   126     0     0
   8
   455  0.36455352E-01     0   450   198     0     0     0
   455  0.32645530E+00     0   451   198     0     0     0
   455  0.25917128E-01     0   402     7     0     0     0
   455  0.46493635E-01     0   407     2     0     0     0
   455  0.25916707E-01     0   404     9     0     0     0
   455  0.48881996E-01     0   409     4     0     0     0
   455  0.27265429E+00     0   454   200     0     0     0
   455  0.21722558E+00     0   454   203     0     0     0
   5
   456  0.34432724E+00     0   450     8     1     0     0
   456  0.34432733E+00     0   450    10     3     0     0
   456  0.10378174E+00     0   450   121   128     0     0
   456  0.10378174E+00     0   450   123   130     0     0
   456  0.10378189E+00     0   450   125   132     0     0
   8
   457  0.36455352E-01     0   450   199     0     0     0
   457  0.32645530E+00     0   451   199     0     0     0
   457  0.25917128E-01     0   408     1     0     0     0
   457  0.46493635E-01     0   401     8     0     0     0
   457  0.25916707E-01     0   410     3     0     0     0
   457  0.48881996E-01     0   403    10     0     0     0
   457  0.27265429E+00     0   456   200     0     0     0
   457  0.21722558E+00     0   456   203     0     0     0
  28
   203  0.21323192E-03     0   123   129     0     0     0
   203  0.60969125E-01     0   125   131     0     0     0
   203  0.25645453E-02     0     3     9     0     0     0
   203  0.85113186E+00     0     5    11     0     0     0
   203  0.37278347E-01     0     4    10     0     0     0
   203  0.14908641E-02     0    59    59     0     0     0
   203  0.33215303E-01     0    13    13     0     0     0
   203  0.70843688E-03     0   198   121   128     0     0
   203  0.70843688E-03     0   198   123   130     0     0
   203  0.70843688E-03     0   198   125   132     0     0
   203  0.21253107E-02     0   198     8     1     0     0
   203  0.21253107E-02     0   198    10     3     0     0
   203  0.70843688E-03     0   199   127   122     0     0
   203  0.70843688E-03     0   199   129   124     0     0
   203  0.70843688E-03     0   199   131   126     0     0
   203  0.21253107E-02     0   199     2     7     0     0
   203  0.21253107E-02     0   199     4     9     0     0
   203  0.26318727E-04     0   200   122   128     0     0
   203  0.26318727E-04     0   200   124   130     0     0
   203  0.26318727E-04     0   200   126   132     0     0
   203  0.13245951E-04     0   200   121   127     0     0
   203  0.13245951E-04     0   200   123   129     0     0
   203  0.13245951E-04     0   200   125   131     0     0
   203  0.45379504E-04     0   200     2     8     0     0
   203  0.45379504E-04     0   200     4    10     0     0
   203  0.58459980E-04     0   200     1     7     0     0
   203  0.58459980E-04     0   200     3     9     0     0
   203  0.58459980E-04     0   200     5    11     0     0
  27
   204  0.18150975E-04     0   123   129     0     0     0
   204  0.51986207E-02     0   125   131     0     0     0
   204  0.21278103E-03     0     3     9     0     0     0
   204  0.52465364E-01     0     5    11     0     0     0
   204  0.43963397E+00     0     6    12     0     0     0
   204  0.25717600E-03     0    13    13     0     0     0
   204  0.10629626E-02     0   198   199     0     0     0
   204  0.53969549E-03     0   200   200     0     0     0
   204  0.36908740E-02     0   450   450     0     0     0
   204  0.11351529E-01     0   450   451     0     0     0
   204  0.86362459E-01     0   450   452     0     0     0
   204  0.35128200E-02     0   450   453     0     0     0
   204  0.84155751E-02     0   451   451     0     0     0
   204  0.10378702E+00     0   451   452     0     0     0
   204  0.14828496E-02     0   451   453     0     0     0
   204  0.27766852E-01     0   454   456     0     0     0
   204  0.12292282E+00     0   454   457     0     0     0
   204  0.12292282E+00     0   456   455     0     0     0
   204  0.45294506E-02     0   203   203     0     0     0
   204  0.71551843E-03     0   402   408     0     0     0
   204  0.14248348E-03     0   414   420     0     0     0
   204  0.71503082E-03     0   404   410     0     0     0
   204  0.14226834E-03     0   416   422     0     0     0
   204  0.10400820E-02     0   401   407     0     0     0
   204  0.35300378E-04     0   413   419     0     0     0
   204  0.10402763E-02     0   403   409     0     0     0
   204  0.35264336E-04     0   415   421     0     0     0
  19
   205  0.18000985E-04     0   123   129     0     0     0
   205  0.51557254E-02     0   125   131     0     0     0
   205  0.21103615E-03     0     3     9     0     0     0
   205  0.52084710E-01     0     5    11     0     0     0
   205  0.46619499E+00     0     6    12     0     0     0
   205  0.27226488E-03     0    13    13     0     0     0
   205  0.11148774E-01     0   450   450     0     0     0
   205  0.39050665E-01     0   450   451     0     0     0
   205  0.58354703E-02     0   450   452     0     0     0
   205  0.55736285E-01     0   450   453     0     0     0
   205  0.33656981E-01     0   451   451     0     0     0
   205  0.32779064E-02     0   451   452     0     0     0
   205  0.53346969E-01     0   451   453     0     0     0
   205  0.10834756E+00     0   454   456     0     0     0
   205  0.82256787E-01     0   454   457     0     0     0
   205  0.82256787E-01     0   456   455     0     0     0
   205  0.10273404E-02     0   203   200     0     0     0
   205  0.60867616E-04     0   404   422     0     0     0
   205  0.60867616E-04     0   416   410     0     0     0
  13
   206  0.20657662E-04     0   124   129     0     0     0
   206  0.59166341E-02     0   126   131     0     0     0
   206  0.23229928E-03     0     4     9     0     0     0
   206  0.48018697E+00     0     6    11     0     0     0
   206  0.42933188E-01     0   454   450     0     0     0
   206  0.15844187E-02     0   454   451     0     0     0
   206  0.15893157E+00     0   454   452     0     0     0
   206  0.12464237E+00     0   454   453     0     0     0
   206  0.21167351E-01     0   455   450     0     0     0
   206  0.15930569E+00     0   455   451     0     0     0
   206  0.11861335E-02     0   203   198     0     0     0
   206  0.19467726E-02     0   402   407     0     0     0
   206  0.19459778E-02     0   404   409     0     0     0
  13
   207  0.20657662E-04     0   130   123     0     0     0
   207  0.59166341E-02     0   132   125     0     0     0
   207  0.23229928E-03     0    10     3     0     0     0
   207  0.48018697E+00     0    12     5     0     0     0
   207  0.42933188E-01     0   456   450     0     0     0
   207  0.15844187E-02     0   456   451     0     0     0
   207  0.15893157E+00     0   456   452     0     0     0
   207  0.12464237E+00     0   456   453     0     0     0
   207  0.21167351E-01     0   457   450     0     0     0
   207  0.15930569E+00     0   457   451     0     0     0
   207  0.11861335E-02     0   203   199     0     0     0
   207  0.19467726E-02     0   408   401     0     0     0
   207  0.19459778E-02     0   410   403     0     0     0
   0
   5
     6  0.33333334E+00   100     2     7     5     0     0
     6  0.33333334E+00   100     4     9     5     0     0
     6  0.11111111E+00   100   122   127     5     0     0
     6  0.11111111E+00   100   124   129     5     0     0
     6  0.11111111E+00   100   126   131     5     0     0
   5
    12  0.33333334E+00   100     8     1    11     0     0
    12  0.33333334E+00   100    10     3    11     0     0
    12  0.11111111E+00   100   128   121    11     0     0
    12  0.11111111E+00   100   130   123    11     0     0
    12  0.11111111E+00   100   132   125    11     0     0
      4.00000000     -0.24957091
      0.97632778     -0.14566325      0.13304706     -0.08868220
     -0.18135872     -0.95407563      0.19284722     -0.14020917
     -0.02516154      0.04294296      0.70392406      0.70852917
     -0.11515094      0.25822034      0.67052162     -0.68590313
     -0.97528017      0.22097191     -0.22097191     -0.97528017
     -0.95283914      0.30347574     -0.30347574     -0.95283914
      1.57074499     -1.57079601     -1.57079482
    150.00000000   2400.00000000   2400.00000000
    600.00000000
    T
