  65
  401    503.0903    0.23822E-23
  402    497.4608    0.30256E-23
  403    503.0904    0.23827E-23
  404    497.4627    0.30258E-23
  405   3000.0916    0.45427E-26
  406   3002.5991    0.30689E-26
  407    503.0903    0.23822E-23
  408    497.4608    0.30256E-23
  409    503.0904    0.23827E-23
  410    497.4627    0.30258E-23
  411   3000.0916    0.45427E-26
  412   3002.5991    0.30689E-26
  413    500.5669    0.90269E-23
  414    498.8644    0.22944E-23
  415    500.5669    0.90269E-23
  416    498.8662    0.22945E-23
  417   3000.5220    0.30990E-26
  418   3002.8484    0.31113E-26
  419    500.5669    0.90269E-23
  420    498.8644    0.22944E-23
  421    500.5669    0.90269E-23
  422    498.8662    0.22945E-23
  423   3000.5220    0.30990E-26
  424   3002.8484    0.31113E-26
  425    400.0154    0.29515E-22
  426    392.9119    0.25869E-22
  427    400.0154    0.29515E-22
  428    392.9119    0.25869E-22
  429    399.9224    0.59963E-23
  430    392.9119    0.25869E-22
  431    400.0154    0.29515E-22
  432    392.9119    0.25869E-22
  433    400.0154    0.29515E-22
  434    392.9119    0.25869E-22
  435    399.9224    0.59963E-23
  436    392.9119    0.25869E-22
  437    400.0115    0.59706E-23
  438      0.0000    0.10000E+31
  439    400.0115    0.59707E-23
  440      0.0000    0.10000E+31
  441    400.1121    0.29396E-22
  442      0.0000    0.10000E+31
  443    400.0115    0.59706E-23
  444      0.0000    0.10000E+31
  445    400.0115    0.59707E-23
  446      0.0000    0.10000E+31
  447    400.1121    0.29396E-22
  448      0.0000    0.10000E+31
  449    800.0000    0.11752E-25
  450    349.9929    0.10000E+31
  451    449.3520    0.12503E-23
  452   -751.8834    0.11664E-24
  453    769.0857    0.95132E-25
  454    448.8122    0.12461E-23
  455    767.1262    0.95260E-25
  456    448.8122    0.12461E-23
  457    767.1262    0.95260E-25
  203    106.8533    0.17587E-21
  204   1007.7639    0.18810E-24
  205   1000.0000    0.15982E-24
  206   1014.3581    0.19440E-24
  207   1014.3581    0.19440E-24
  458      0.0000    0.10000E+31
    6    172.5000    0.57395E-24
   12    172.5000    0.57395E-24
   3
   401  0.11439279E+00     0   450     1     0     0     0
   401  0.28843969E+00     0   451     1     0     0     0
   401  0.59716749E+00     0   456     2     0     0     0
   3
   402  0.39621085E-01     0   450     2     0     0     0
   402  0.31796780E+00     0   451     2     0     0     0
   402  0.64241111E+00     0   454     1     0     0     0
   3
   403  0.11441632E+00     0   450     3     0     0     0
   403  0.28849915E+00     0   451     3     0     0     0
   403  0.59708464E+00     0   456     4     0     0     0
   3
   404  0.39622456E-01     0   450     4     0     0     0
   404  0.31787500E+00     0   451     4     0     0     0
   404  0.64250255E+00     0   454     3     0     0     0
   7
   405  0.11234695E-01     0   450     5     0     0     0
   405  0.11124160E-03     0   451     5     0     0     0
   405  0.68931351E-03     0   452     5     0     0     0
   405  0.71773987E-03     0   453     5     0     0     0
   405  0.98587847E+00     0   449     5     0     0     0
   405  0.97041819E-04     0   456     6     0     0     0
   405  0.12714814E-02     0   457     6     0     0     0
   7
   406  0.66161025E+00     0   449     6     0     0     0
   406  0.30593423E-01     0   450     6     0     0     0
   406  0.29505619E-02     0   451     6     0     0     0
   406  0.77008635E-01     0   452     6     0     0     0
   406  0.73527016E-01     0   453     6     0     0     0
   406  0.59978967E-02     0   454     5     0     0     0
   406  0.14831215E+00     0   455     5     0     0     0
   3
   407  0.11439279E+00     0   450     7     0     0     0
   407  0.28843969E+00     0   451     7     0     0     0
   407  0.59716749E+00     0   454     8     0     0     0
   3
   408  0.39621085E-01     0   450     8     0     0     0
   408  0.31796780E+00     0   451     8     0     0     0
   408  0.64241111E+00     0   456     7     0     0     0
   3
   409  0.11441632E+00     0   450     9     0     0     0
   409  0.28849915E+00     0   451     9     0     0     0
   409  0.59708464E+00     0   454    10     0     0     0
   3
   410  0.39622456E-01     0   450    10     0     0     0
   410  0.31787500E+00     0   451    10     0     0     0
   410  0.64250255E+00     0   456     9     0     0     0
   7
   411  0.11234695E-01     0   450    11     0     0     0
   411  0.11124160E-03     0   451    11     0     0     0
   411  0.68931351E-03     0   452    11     0     0     0
   411  0.71773987E-03     0   453    11     0     0     0
   411  0.98587847E+00     0   449    11     0     0     0
   411  0.97041819E-04     0   454    12     0     0     0
   411  0.12714814E-02     0   455    12     0     0     0
   7
   412  0.66161025E+00     0   449    12     0     0     0
   412  0.30593423E-01     0   450    12     0     0     0
   412  0.29505619E-02     0   451    12     0     0     0
   412  0.77008635E-01     0   452    12     0     0     0
   412  0.73527016E-01     0   453    12     0     0     0
   412  0.59978967E-02     0   456    11     0     0     0
   412  0.14831215E+00     0   457    11     0     0     0
   2
   413  0.99913782E+00     0   450     1     0     0     0
   413  0.86221786E-03     0   451     1     0     0     0
   2
   414  0.99917525E+00     0   450     2     0     0     0
   414  0.82476059E-03     0   451     2     0     0     0
   2
   415  0.99913782E+00     0   450     3     0     0     0
   415  0.86221861E-03     0   451     3     0     0     0
   2
   416  0.99917555E+00     0   450     4     0     0     0
   416  0.82450820E-03     0   451     4     0     0     0
   7
   417  0.32511482E-02     0   450     5     0     0     0
   417  0.52326009E-01     0   451     5     0     0     0
   417  0.54221123E-03     0   452     5     0     0     0
   417  0.33333085E-02     0   453     5     0     0     0
   417  0.67267972E+00     0   449     5     0     0     0
   417  0.11065276E+00     0   456     6     0     0     0
   417  0.15721491E+00     0   457     6     0     0     0
   7
   418  0.67083263E+00     0   449     6     0     0     0
   418  0.11020930E+00     0   454     5     0     0     0
   418  0.46025286E-02     0   455     5     0     0     0
   418  0.15173848E-02     0   450     6     0     0     0
   418  0.57645015E-01     0   451     6     0     0     0
   418  0.78179315E-01     0   452     6     0     0     0
   418  0.77013813E-01     0   453     6     0     0     0
   2
   419  0.99913782E+00     0   450     7     0     0     0
   419  0.86221786E-03     0   451     7     0     0     0
   2
   420  0.99917525E+00     0   450     8     0     0     0
   420  0.82476059E-03     0   451     8     0     0     0
   2
   421  0.99913782E+00     0   450     9     0     0     0
   421  0.86221861E-03     0   451     9     0     0     0
   2
   422  0.99917555E+00     0   450    10     0     0     0
   422  0.82450820E-03     0   451    10     0     0     0
   7
   423  0.32511482E-02     0   450    11     0     0     0
   423  0.52326009E-01     0   451    11     0     0     0
   423  0.54221123E-03     0   452    11     0     0     0
   423  0.33333085E-02     0   453    11     0     0     0
   423  0.67267972E+00     0   449    11     0     0     0
   423  0.11065276E+00     0   454    12     0     0     0
   423  0.15721491E+00     0   455    12     0     0     0
   7
   424  0.67083263E+00     0   449    12     0     0     0
   424  0.11020930E+00     0   456    11     0     0     0
   424  0.46025286E-02     0   457    11     0     0     0
   424  0.15173848E-02     0   450    12     0     0     0
   424  0.57645015E-01     0   451    12     0     0     0
   424  0.78179315E-01     0   452    12     0     0     0
   424  0.77013813E-01     0   453    12     0     0     0
   1
   425  0.10000000E+01     0   450   121     0     0     0
   1
   426  0.10000000E+01     0   450   122     0     0     0
   1
   427  0.10000000E+01     0   450   123     0     0     0
   1
   428  0.10000000E+01     0   450   124     0     0     0
   1
   429  0.10000000E+01     0   450   125     0     0     0
   1
   430  0.10000000E+01     0   450   126     0     0     0
   1
   431  0.10000000E+01     0   450   127     0     0     0
   1
   432  0.10000000E+01     0   450   128     0     0     0
   1
   433  0.10000000E+01     0   450   129     0     0     0
   1
   434  0.10000000E+01     0   450   130     0     0     0
   1
   435  0.10000000E+01     0   450   131     0     0     0
   1
   436  0.10000000E+01     0   450   132     0     0     0
   1
   437  0.10000000E+01     0   450   121     0     0     0
   0
   1
   439  0.10000000E+01     0   450   123     0     0     0
   0
   1
   441  0.10000000E+01     0   450   125     0     0     0
   0
   1
   443  0.10000000E+01     0   450   127     0     0     0
   0
   1
   445  0.10000000E+01     0   450   129     0     0     0
   0
   1
   447  0.10000000E+01     0   450   131     0     0     0
   0
  16
   449  0.63312829E-01     0   408     2     0     0     0
   449  0.63312829E-01     0   402     8     0     0     0
   449  0.61508853E-01     0   407     1     0     0     0
   449  0.61508853E-01     0   401     7     0     0     0
   449  0.62862523E-01     0   420     2     0     0     0
   449  0.62862523E-01     0   414     8     0     0     0
   449  0.62316786E-01     0   419     1     0     0     0
   449  0.62316786E-01     0   413     7     0     0     0
   449  0.61508853E-01     0   409     3     0     0     0
   449  0.61508853E-01     0   403     9     0     0     0
   449  0.62316772E-01     0   421     3     0     0     0
   449  0.62316772E-01     0   415     9     0     0     0
   449  0.63311860E-01     0   410     4     0     0     0
   449  0.63311860E-01     0   404    10     0     0     0
   449  0.62861562E-01     0   422     4     0     0     0
   449  0.62861562E-01     0   416    10     0     0     0
   0
  19
   451  0.24038838E-03     0   450   200     0     0     0
   451  0.79806387E-01     0   425   127     0     0     0
   451  0.79806387E-01     0   431   121     0     0     0
   451  0.79806112E-01     0   427   129     0     0     0
   451  0.79806112E-01     0   433   123     0     0     0
   451  0.55128278E-03     0   437   127     0     0     0
   451  0.55128278E-03     0   443   121     0     0     0
   451  0.55128167E-03     0   439   129     0     0     0
   451  0.55128167E-03     0   445   123     0     0     0
   451  0.56389056E-03     0   429   131     0     0     0
   451  0.56389056E-03     0   435   125     0     0     0
   451  0.79577535E-01     0   441   131     0     0     0
   451  0.79577535E-01     0   447   125     0     0     0
   451  0.86341113E-01     0   426   128     0     0     0
   451  0.86341113E-01     0   432   122     0     0     0
   451  0.86341113E-01     0   428   130     0     0     0
   451  0.86341113E-01     0   434   124     0     0     0
   451  0.86341113E-01     0   430   132     0     0     0
   451  0.86341113E-01     0   436   126     0     0     0
  40
   452  0.29976714E+00     0   454   199     0     0     0
   452  0.29976714E+00     0   456   198     0     0     0
   452  0.11911140E+00     0   450   200     0     0     0
   452  0.26256332E+00     0   451   200     0     0     0
   452  0.54097241E-02     0   450   203     0     0     0
   452  0.55816211E-02     0   451   203     0     0     0
   452  0.24525227E-03     0   402     8     0     0     0
   452  0.24525227E-03     0   408     2     0     0     0
   452  0.36911207E-03     0   401     7     0     0     0
   452  0.36911207E-03     0   407     1     0     0     0
   452  0.36911195E-03     0   403     9     0     0     0
   452  0.36911195E-03     0   409     3     0     0     0
   452  0.24524727E-03     0   404    10     0     0     0
   452  0.24524727E-03     0   410     4     0     0     0
   452  0.60254646E-04     0   414     8     0     0     0
   452  0.60254646E-04     0   420     2     0     0     0
   452  0.14902114E-04     0   413     7     0     0     0
   452  0.14902114E-04     0   419     1     0     0     0
   452  0.14902110E-04     0   415     9     0     0     0
   452  0.14902110E-04     0   421     3     0     0     0
   452  0.60253413E-04     0   416    10     0     0     0
   452  0.60253413E-04     0   422     4     0     0     0
   452  0.74983865E-04     0   425   127     0     0     0
   452  0.74983865E-04     0   431   121     0     0     0
   452  0.74983858E-04     0   427   129     0     0     0
   452  0.74983858E-04     0   433   123     0     0     0
   452  0.74131160E-04     0   437   127     0     0     0
   452  0.74131160E-04     0   443   121     0     0     0
   452  0.74131160E-04     0   439   129     0     0     0
   452  0.74131160E-04     0   445   123     0     0     0
   452  0.65143447E-03     0   429   131     0     0     0
   452  0.65143447E-03     0   435   125     0     0     0
   452  0.65183529E-03     0   441   131     0     0     0
   452  0.65183529E-03     0   447   125     0     0     0
   452  0.30657172E-03     0   426   128     0     0     0
   452  0.30657172E-03     0   432   122     0     0     0
   452  0.30657172E-03     0   428   130     0     0     0
   452  0.30657172E-03     0   434   124     0     0     0
   452  0.30657172E-03     0   430   132     0     0     0
   452  0.30657172E-03     0   436   126     0     0     0
  40
   453  0.26211616E+00     0   454   199     0     0     0
   453  0.26211616E+00     0   456   198     0     0     0
   453  0.51308563E-02     0   450   200     0     0     0
   453  0.60136383E-02     0   451   200     0     0     0
   453  0.87406136E-01     0   450   203     0     0     0
   453  0.19535223E+00     0   451   203     0     0     0
   453  0.98454850E-02     0   402     8     0     0     0
   453  0.98454850E-02     0   408     2     0     0     0
   453  0.12820260E-01     0   401     7     0     0     0
   453  0.12820260E-01     0   407     1     0     0     0
   453  0.12820253E-01     0   403     9     0     0     0
   453  0.12820253E-01     0   409     3     0     0     0
   453  0.98453062E-02     0   404    10     0     0     0
   453  0.98453062E-02     0   410     4     0     0     0
   453  0.10013757E-02     0   414     8     0     0     0
   453  0.10013757E-02     0   420     2     0     0     0
   453  0.24786367E-03     0   413     7     0     0     0
   453  0.24786367E-03     0   419     1     0     0     0
   453  0.24786362E-03     0   415     9     0     0     0
   453  0.24786362E-03     0   421     3     0     0     0
   453  0.10013573E-02     0   416    10     0     0     0
   453  0.10013573E-02     0   422     4     0     0     0
   453  0.36416778E-02     0   425   127     0     0     0
   453  0.36416778E-02     0   431   121     0     0     0
   453  0.36416769E-02     0   427   129     0     0     0
   453  0.36416769E-02     0   433   123     0     0     0
   453  0.11910867E-02     0   437   127     0     0     0
   453  0.11910867E-02     0   443   121     0     0     0
   453  0.11910867E-02     0   439   129     0     0     0
   453  0.11910867E-02     0   445   123     0     0     0
   453  0.16459159E-02     0   429   131     0     0     0
   453  0.16459159E-02     0   435   125     0     0     0
   453  0.40875128E-02     0   441   131     0     0     0
   453  0.40875128E-02     0   447   125     0     0     0
   453  0.92345346E-02     0   426   128     0     0     0
   453  0.92345346E-02     0   432   122     0     0     0
   453  0.92345346E-02     0   428   130     0     0     0
   453  0.92345346E-02     0   434   124     0     0     0
   453  0.92345346E-02     0   430   132     0     0     0
   453  0.92345346E-02     0   436   126     0     0     0
   8
   454  0.11652914E-01     0   450   198     0     0     0
   454  0.18818487E+00     0   426   127     0     0     0
   454  0.18818457E+00     0   428   129     0     0     0
   454  0.18836278E+00     0   430   131     0     0     0
   454  0.14136769E+00     0   431   122     0     0     0
   454  0.14136750E+00     0   433   124     0     0     0
   454  0.39687216E-04     0   435   126     0     0     0
   454  0.14083998E+00     0   447   126     0     0     0
  15
   455  0.62007345E-01     0   450   198     0     0     0
   455  0.28462210E+00     0   451   198     0     0     0
   455  0.16795130E-01     0   402     7     0     0     0
   455  0.29673366E-01     0   407     2     0     0     0
   455  0.16794948E-01     0   404     9     0     0     0
   455  0.30677868E-01     0   409     4     0     0     0
   455  0.90719294E-02     0   426   127     0     0     0
   455  0.90719294E-02     0   428   129     0     0     0
   455  0.99876905E-02     0   430   131     0     0     0
   455  0.16143795E-01     0   431   122     0     0     0
   455  0.16143788E-01     0   433   124     0     0     0
   455  0.92841440E-03     0   435   126     0     0     0
   455  0.16138051E-01     0   447   126     0     0     0
   455  0.26031446E+00     0   454   200     0     0     0
   455  0.22162934E+00     0   454   203     0     0     0
   8
   456  0.11652914E-01     0   450   199     0     0     0
   456  0.18818487E+00     0   432   121     0     0     0
   456  0.18818457E+00     0   434   123     0     0     0
   456  0.18836278E+00     0   436   125     0     0     0
   456  0.14136769E+00     0   425   128     0     0     0
   456  0.14136750E+00     0   427   130     0     0     0
   456  0.39687216E-04     0   429   132     0     0     0
   456  0.14083998E+00     0   441   132     0     0     0
  15
   457  0.62007345E-01     0   450   199     0     0     0
   457  0.28462210E+00     0   451   199     0     0     0
   457  0.16795130E-01     0   408     1     0     0     0
   457  0.29673366E-01     0   401     8     0     0     0
   457  0.16794948E-01     0   410     3     0     0     0
   457  0.30677868E-01     0   403    10     0     0     0
   457  0.90719294E-02     0   432   121     0     0     0
   457  0.90719294E-02     0   434   123     0     0     0
   457  0.99876905E-02     0   436   125     0     0     0
   457  0.16143795E-01     0   425   128     0     0     0
   457  0.16143788E-01     0   427   130     0     0     0
   457  0.92841440E-03     0   429   132     0     0     0
   457  0.16138051E-01     0   441   132     0     0     0
   457  0.26031446E+00     0   456   200     0     0     0
   457  0.22162934E+00     0   456   203     0     0     0
  28
   203  0.21257962E-03     0   123   129     0     0     0
   203  0.60785405E-01     0   125   131     0     0     0
   203  0.25561608E-02     0     3     9     0     0     0
   203  0.84671295E+00     0     5    11     0     0     0
   203  0.37052758E-01     0     4    10     0     0     0
   203  0.15203330E-02     0    59    59     0     0     0
   203  0.34203380E-01     0    13    13     0     0     0
   203  0.90867706E-03     0   198   121   128     0     0
   203  0.90867706E-03     0   198   123   130     0     0
   203  0.90867706E-03     0   198   125   132     0     0
   203  0.27260312E-02     0   198     8     1     0     0
   203  0.27260312E-02     0   198    10     3     0     0
   203  0.90867706E-03     0   199   127   122     0     0
   203  0.90867706E-03     0   199   129   124     0     0
   203  0.90867706E-03     0   199   131   126     0     0
   203  0.27260312E-02     0   199     2     7     0     0
   203  0.27260312E-02     0   199     4     9     0     0
   203  0.41063846E-04     0   200   122   128     0     0
   203  0.41063846E-04     0   200   124   130     0     0
   203  0.41063846E-04     0   200   126   132     0     0
   203  0.20667021E-04     0   200   121   127     0     0
   203  0.20667021E-04     0   200   123   129     0     0
   203  0.20667021E-04     0   200   125   131     0     0
   203  0.70803464E-04     0   200     2     8     0     0
   203  0.70803464E-04     0   200     4    10     0     0
   203  0.91212307E-04     0   200     1     7     0     0
   203  0.91212307E-04     0   200     3     9     0     0
   203  0.91212307E-04     0   200     5    11     0     0
  33
   204  0.32983688E-04     0   123   129     0     0     0
   204  0.94468584E-02     0   125   131     0     0     0
   204  0.38666243E-03     0     3     9     0     0     0
   204  0.95338777E-01     0     5    11     0     0     0
   204  0.17518609E-04     0     4    10     0     0     0
   204  0.79943788E+00     0     6    12     0     0     0
   204  0.42443906E-03     0    13    13     0     0     0
   204  0.19998003E-02     0   198   199     0     0     0
   204  0.10153549E-02     0   200   200     0     0     0
   204  0.17007594E-02     0   450   450     0     0     0
   204  0.60787834E-02     0   450   451     0     0     0
   204  0.36367457E-02     0   451   451     0     0     0
   204  0.89089274E-02     0   454   456     0     0     0
   204  0.86898422E-02     0   203   203     0     0     0
   204  0.25764591E-03     0   425   431     0     0     0
   204  0.19307972E-03     0   437   443     0     0     0
   204  0.25762463E-03     0   427   433     0     0     0
   204  0.19306138E-03     0   439   445     0     0     0
   204  0.18783142E-03     0   429   435     0     0     0
   204  0.25162916E-03     0   441   447     0     0     0
   204  0.28802391E-01     0   429   447     0     0     0
   204  0.28802391E-01     0   441   435     0     0     0
   204  0.33585343E-03     0   402   408     0     0     0
   204  0.59595302E-04     0   414   420     0     0     0
   204  0.33558035E-03     0   404   410     0     0     0
   204  0.59495062E-04     0   416   422     0     0     0
   204  0.17714816E-03     0   401   407     0     0     0
   204  0.12120478E-04     0   413   419     0     0     0
   204  0.17717859E-03     0   403   409     0     0     0
   204  0.12108034E-04     0   415   421     0     0     0
   204  0.92330534E-03     0   426   432     0     0     0
   204  0.92330534E-03     0   428   434     0     0     0
   204  0.92330534E-03     0   430   436     0     0     0
  16
   205  0.27875147E-04     0   123   129     0     0     0
   205  0.79838187E-02     0   125   131     0     0     0
   205  0.32679675E-03     0     3     9     0     0     0
   205  0.80654971E-01     0     5    11     0     0     0
   205  0.14247673E-04     0     4    10     0     0     0
   205  0.72191906E+00     0     6    12     0     0     0
   205  0.39910077E-03     0    13    13     0     0     0
   205  0.53075817E-02     0   450   450     0     0     0
   205  0.27556879E-01     0   450   451     0     0     0
   205  0.30993002E-01     0   451   451     0     0     0
   205  0.74463069E-01     0   454   456     0     0     0
   205  0.16452475E-02     0   203   200     0     0     0
   205  0.24333334E-01     0   429   447     0     0     0
   205  0.24333334E-01     0   441   435     0     0     0
   205  0.20802425E-04     0   404   422     0     0     0
   205  0.20802425E-04     0   416   410     0     0     0
  13
   206  0.34393666E-04     0   124   129     0     0     0
   206  0.98508140E-02     0   126   131     0     0     0
   206  0.38674826E-03     0     4     9     0     0     0
   206  0.88562781E+00     0     6    11     0     0     0
   206  0.36149684E-01     0   454   450     0     0     0
   206  0.19331470E-03     0   454   451     0     0     0
   206  0.20766556E-02     0   203   198     0     0     0
   206  0.86596282E-03     0   402   407     0     0     0
   206  0.86555514E-03     0   404   409     0     0     0
   206  0.10947896E-02     0   431   426     0     0     0
   206  0.10947576E-02     0   433   428     0     0     0
   206  0.60673900E-01     0   435   430     0     0     0
   206  0.10856922E-02     0   447   430     0     0     0
  13
   207  0.34393666E-04     0   130   123     0     0     0
   207  0.98508140E-02     0   132   125     0     0     0
   207  0.38674826E-03     0    10     3     0     0     0
   207  0.88562781E+00     0    12     5     0     0     0
   207  0.36149684E-01     0   456   450     0     0     0
   207  0.19331470E-03     0   456   451     0     0     0
   207  0.20766556E-02     0   203   199     0     0     0
   207  0.86596282E-03     0   408   401     0     0     0
   207  0.86555514E-03     0   410   403     0     0     0
   207  0.10947896E-02     0   425   432     0     0     0
   207  0.10947576E-02     0   427   434     0     0     0
   207  0.60673900E-01     0   429   436     0     0     0
   207  0.10856922E-02     0   441   436     0     0     0
   0
   5
     6  0.33333334E+00   100     2     7     5     0     0
     6  0.33333334E+00   100     4     9     5     0     0
     6  0.11111111E+00   100   122   127     5     0     0
     6  0.11111111E+00   100   124   129     5     0     0
     6  0.11111111E+00   100   126   131     5     0     0
   5
    12  0.33333334E+00   100     8     1    11     0     0
    12  0.33333334E+00   100    10     3    11     0     0
    12  0.11111111E+00   100   128   121    11     0     0
    12  0.11111111E+00   100   130   123    11     0     0
    12  0.11111111E+00   100   132   125    11     0     0
      4.00000000     -0.24965097
      0.99285519     -0.05485313      0.08918451     -0.05723717
     -0.07678099     -0.97337151      0.17374705     -0.12831515
     -0.02063027      0.03414672      0.70506555      0.70801914
     -0.08898231      0.21993926      0.68171912     -0.69207513
     -0.98200083      0.18887667     -0.18887667     -0.98200083
     -0.96686929      0.25527203     -0.25527203     -0.96686929
      1.57071400     -1.57079577     -1.57078528
    187.50000000   3000.00000000   3000.00000000
    750.00000000
    T
