  65
  401   2733.3047    0.27791E-25
  402   2732.1877    0.27741E-25
  403   2733.3047    0.27791E-25
  404   2732.1880    0.27741E-25
  405   2522.2817    0.15855E-25
  406   2151.8916    0.37884E-25
  407   2733.3047    0.27791E-25
  408   2732.1877    0.27741E-25
  409   2733.3047    0.27791E-25
  410   2732.1880    0.27741E-25
  411   2522.2817    0.15855E-25
  412   2151.8916    0.37884E-25
  413   2601.1582    0.50240E-24
  414   2614.4148    0.12481E-24
  415   2601.1582    0.50240E-24
  416   2614.4150    0.12481E-24
  417   2595.5310    0.30365E-24
  418   2541.4116    0.15041E-25
  419   2601.1582    0.50240E-24
  420   2614.4148    0.12481E-24
  421   2601.1582    0.50240E-24
  422   2614.4150    0.12481E-24
  423   2595.5310    0.30365E-24
  424   2541.4116    0.15041E-25
  425    934.1450    0.15653E-23
  426    930.8716    0.15514E-23
  427    934.0721    0.15658E-23
  428    930.7985    0.15518E-23
  429    526.0005    0.31819E-09
  430    930.0508    0.11679E-23
  431    934.1450    0.15653E-23
  432    930.8716    0.15514E-23
  433    934.0721    0.15658E-23
  434    930.7985    0.15518E-23
  435    526.0005    0.31819E-09
  436    930.0508    0.11679E-23
  437    529.3638    0.14211E-22
  438      0.0000    0.10000E+31
  439    531.0112    0.35122E-12
  440      0.0000    0.10000E+31
  441    933.7075    0.11588E-23
  442      0.0000    0.10000E+31
  443    529.3638    0.14211E-22
  444      0.0000    0.10000E+31
  445    531.0112    0.35122E-12
  446      0.0000    0.10000E+31
  447    933.7075    0.11588E-23
  448      0.0000    0.10000E+31
  449   3020.3101    0.12251E-25
  450    613.0989    0.10744E-23
  451   1140.2257    0.21025E-24
  452  -1577.1135    0.66885E-25
  453   1586.7185    0.63877E-25
  454   1140.3665    0.21006E-24
  455   1586.2728    0.64099E-25
  456   1140.3665    0.21006E-24
  457   1586.2728    0.64099E-25
  203    120.4481    0.12293E-21
  204   1800.5834    0.15902E-24
  205   1798.0699    0.15736E-24
  206   1802.1241    0.17175E-24
  207   1802.1241    0.17175E-24
  458      0.0000    0.10000E+31
    6    173.3000    0.56017E-24
   12    173.3000    0.56017E-24
   6
   401  0.15227843E-01     0   450     1     0     0     0
   401  0.32323295E+00     0   451     1     0     0     0
   401  0.83485254E-04     0   452     1     0     0     0
   401  0.49380334E-02     0   453     1     0     0     0
   401  0.64516872E+00     0   456     2     0     0     0
   401  0.11348949E-01     0   457     2     0     0     0
   6
   402  0.14116209E-01     0   450     2     0     0     0
   402  0.32453591E+00     0   451     2     0     0     0
   402  0.50294908E-04     0   452     2     0     0     0
   402  0.41060154E-02     0   453     2     0     0     0
   402  0.65016508E+00     0   454     1     0     0     0
   402  0.70266020E-02     0   455     1     0     0     0
   6
   403  0.15227851E-01     0   450     3     0     0     0
   403  0.32323313E+00     0   451     3     0     0     0
   403  0.83485298E-04     0   452     3     0     0     0
   403  0.49380362E-02     0   453     3     0     0     0
   403  0.64516854E+00     0   456     4     0     0     0
   403  0.11348943E-01     0   457     4     0     0     0
   6
   404  0.14116205E-01     0   450     4     0     0     0
   404  0.32453573E+00     0   451     4     0     0     0
   404  0.50294861E-04     0   452     4     0     0     0
   404  0.41060112E-02     0   453     4     0     0     0
   404  0.65016514E+00     0   454     3     0     0     0
   404  0.70266025E-02     0   455     3     0     0     0
   7
   405  0.82157683E-02     0   450     5     0     0     0
   405  0.15766189E+00     0   451     5     0     0     0
   405  0.28662644E-02     0   452     5     0     0     0
   405  0.44982689E-02     0   453     5     0     0     0
   405  0.31034926E+00     0   456     6     0     0     0
   405  0.31054592E+00     0   457     6     0     0     0
   405  0.20586266E+00     0   199   406     0     0     0
   6
   406  0.22668014E+00     0   450     6     0     0     0
   406  0.35231277E-01     0   451     6     0     0     0
   406  0.19551462E+00     0   452     6     0     0     0
   406  0.14227368E+00     0   453     6     0     0     0
   406  0.73454723E-01     0   454     5     0     0     0
   406  0.32684559E+00     0   455     5     0     0     0
   6
   407  0.15227843E-01     0   450     7     0     0     0
   407  0.32323295E+00     0   451     7     0     0     0
   407  0.83485254E-04     0   452     7     0     0     0
   407  0.49380334E-02     0   453     7     0     0     0
   407  0.64516872E+00     0   454     8     0     0     0
   407  0.11348949E-01     0   455     8     0     0     0
   6
   408  0.14116209E-01     0   450     8     0     0     0
   408  0.32453591E+00     0   451     8     0     0     0
   408  0.50294908E-04     0   452     8     0     0     0
   408  0.41060154E-02     0   453     8     0     0     0
   408  0.65016508E+00     0   456     7     0     0     0
   408  0.70266020E-02     0   457     7     0     0     0
   6
   409  0.15227851E-01     0   450     9     0     0     0
   409  0.32323313E+00     0   451     9     0     0     0
   409  0.83485298E-04     0   452     9     0     0     0
   409  0.49380362E-02     0   453     9     0     0     0
   409  0.64516854E+00     0   454    10     0     0     0
   409  0.11348943E-01     0   455    10     0     0     0
   6
   410  0.14116205E-01     0   450    10     0     0     0
   410  0.32453573E+00     0   451    10     0     0     0
   410  0.50294861E-04     0   452    10     0     0     0
   410  0.41060112E-02     0   453    10     0     0     0
   410  0.65016514E+00     0   456     9     0     0     0
   410  0.70266025E-02     0   457     9     0     0     0
   7
   411  0.82157683E-02     0   450    11     0     0     0
   411  0.15766189E+00     0   451    11     0     0     0
   411  0.28662644E-02     0   452    11     0     0     0
   411  0.44982689E-02     0   453    11     0     0     0
   411  0.31034926E+00     0   454    12     0     0     0
   411  0.31054592E+00     0   455    12     0     0     0
   411  0.20586266E+00     0   198   412     0     0     0
   6
   412  0.22668014E+00     0   450    12     0     0     0
   412  0.35231277E-01     0   451    12     0     0     0
   412  0.19551462E+00     0   452    12     0     0     0
   412  0.14227368E+00     0   453    12     0     0     0
   412  0.73454723E-01     0   456    11     0     0     0
   412  0.32684559E+00     0   457    11     0     0     0
   4
   413  0.99930483E+00     0   450     1     0     0     0
   413  0.58022091E-04     0   451     1     0     0     0
   413  0.63985521E-04     0   452     1     0     0     0
   413  0.57317625E-03     0   453     1     0     0     0
   4
   414  0.99929768E+00     0   450     2     0     0     0
   414  0.58231904E-04     0   451     2     0     0     0
   414  0.64662796E-04     0   452     2     0     0     0
   414  0.57937502E-03     0   453     2     0     0     0
   4
   415  0.99930483E+00     0   450     3     0     0     0
   415  0.58022091E-04     0   451     3     0     0     0
   415  0.63985521E-04     0   452     3     0     0     0
   415  0.57317625E-03     0   453     3     0     0     0
   4
   416  0.99929768E+00     0   450     4     0     0     0
   416  0.58231901E-04     0   451     4     0     0     0
   416  0.64662767E-04     0   452     4     0     0     0
   416  0.57937473E-03     0   453     4     0     0     0
   7
   417  0.59609783E+00     0   450     5     0     0     0
   417  0.96306400E-02     0   451     5     0     0     0
   417  0.62629521E-01     0   452     5     0     0     0
   417  0.68878122E-01     0   453     5     0     0     0
   417  0.19222172E-01     0   456     6     0     0     0
   417  0.19707485E+00     0   457     6     0     0     0
   417  0.46466943E-01     0   199   406     0     0     0
   8
   418  0.27301168E+00     0   454     5     0     0     0
   418  0.33377957E-01     0   455     5     0     0     0
   418  0.10713435E+00     0   200   406     0     0     0
   418  0.13310736E+00     0   203   406     0     0     0
   418  0.99643711E-02     0   450     6     0     0     0
   418  0.13469635E+00     0   451     6     0     0     0
   418  0.14132263E+00     0   452     6     0     0     0
   418  0.16738531E+00     0   453     6     0     0     0
   4
   419  0.99930483E+00     0   450     7     0     0     0
   419  0.58022091E-04     0   451     7     0     0     0
   419  0.63985521E-04     0   452     7     0     0     0
   419  0.57317625E-03     0   453     7     0     0     0
   4
   420  0.99929768E+00     0   450     8     0     0     0
   420  0.58231904E-04     0   451     8     0     0     0
   420  0.64662796E-04     0   452     8     0     0     0
   420  0.57937502E-03     0   453     8     0     0     0
   4
   421  0.99930483E+00     0   450     9     0     0     0
   421  0.58022091E-04     0   451     9     0     0     0
   421  0.63985521E-04     0   452     9     0     0     0
   421  0.57317625E-03     0   453     9     0     0     0
   4
   422  0.99929768E+00     0   450    10     0     0     0
   422  0.58231901E-04     0   451    10     0     0     0
   422  0.64662767E-04     0   452    10     0     0     0
   422  0.57937473E-03     0   453    10     0     0     0
   7
   423  0.59609783E+00     0   450    11     0     0     0
   423  0.96306400E-02     0   451    11     0     0     0
   423  0.62629521E-01     0   452    11     0     0     0
   423  0.68878122E-01     0   453    11     0     0     0
   423  0.19222172E-01     0   454    12     0     0     0
   423  0.19707485E+00     0   455    12     0     0     0
   423  0.46466943E-01     0   198   412     0     0     0
   8
   424  0.27301168E+00     0   456    11     0     0     0
   424  0.33377957E-01     0   457    11     0     0     0
   424  0.10713435E+00     0   200   412     0     0     0
   424  0.13310736E+00     0   203   412     0     0     0
   424  0.99643711E-02     0   450    12     0     0     0
   424  0.13469635E+00     0   451    12     0     0     0
   424  0.14132263E+00     0   452    12     0     0     0
   424  0.16738531E+00     0   453    12     0     0     0
   2
   425  0.90281260E+00     0   450   121     0     0     0
   425  0.97187363E-01     0   121   130     0     0     0
   2
   426  0.90401697E+00     0   450   122     0     0     0
   426  0.95983028E-01     0   129   121     0     0     0
   2
   427  0.90279186E+00     0   450   123     0     0     0
   427  0.97208090E-01     0   121   128     0     0     0
   2
   428  0.90399611E+00     0   450   124     0     0     0
   428  0.96003927E-01     0   127   121     0     0     0
   3
   429  0.58155198E-03     0   125   130     0     0     0
   429  0.49970350E+00     0   125   124     0     0     0
   429  0.49971497E+00     0   123   126     0     0     0
   2
   430  0.67809689E+00     0   450   126     0     0     0
   430  0.32190314E+00     0   198   429     0     0     0
   2
   431  0.90281260E+00     0   450   127     0     0     0
   431  0.97187363E-01     0   127   124     0     0     0
   2
   432  0.90401697E+00     0   450   128     0     0     0
   432  0.95983028E-01     0   123   127     0     0     0
   2
   433  0.90279186E+00     0   450   129     0     0     0
   433  0.97208090E-01     0   127   122     0     0     0
   2
   434  0.90399611E+00     0   450   130     0     0     0
   434  0.96003927E-01     0   121   127     0     0     0
   3
   435  0.58155198E-03     0   131   124     0     0     0
   435  0.49970350E+00     0   131   130     0     0     0
   435  0.49971497E+00     0   129   132     0     0     0
   2
   436  0.67809689E+00     0   450   132     0     0     0
   436  0.32190314E+00     0   199   435     0     0     0
   2
   437  0.50000000E+00     0   123   122     0     0     0
   437  0.50000000E+00     0   121   124     0     0     0
   0
   2
   439  0.42565224E+00     0   429   123   131     0     0
   439  0.57434773E+00     0   435   123   125     0     0
   0
   3
   441  0.66871542E+00     0   450   125     0     0     0
   441  0.16064838E+00     0   200   429     0     0     0
   441  0.17063618E+00     0   203   429     0     0     0
   0
   2
   443  0.50000000E+00     0   129   128     0     0     0
   443  0.50000000E+00     0   127   130     0     0     0
   0
   2
   445  0.42565224E+00     0   435   129   125     0     0
   445  0.57434773E+00     0   429   129   131     0     0
   0
   3
   447  0.66871542E+00     0   450   131     0     0     0
   447  0.16064838E+00     0   200   435     0     0     0
   447  0.17063618E+00     0   203   435     0     0     0
   0
  24
   449  0.19189443E-01     0   408     2     0     0     0
   449  0.19189443E-01     0   402     8     0     0     0
   449  0.19048350E-01     0   407     1     0     0     0
   449  0.19048350E-01     0   401     7     0     0     0
   449  0.36540050E-01     0   420     2     0     0     0
   449  0.36540050E-01     0   414     8     0     0     0
   449  0.38782701E-01     0   419     1     0     0     0
   449  0.38782701E-01     0   413     7     0     0     0
   449  0.19048346E-01     0   409     3     0     0     0
   449  0.19048346E-01     0   403     9     0     0     0
   449  0.38782697E-01     0   421     3     0     0     0
   449  0.38782697E-01     0   415     9     0     0     0
   449  0.19189235E-01     0   410     4     0     0     0
   449  0.19189235E-01     0   404    10     0     0     0
   449  0.36539853E-01     0   422     4     0     0     0
   449  0.36539853E-01     0   416    10     0     0     0
   449  0.53127881E-01     0   411     5     0     0     0
   449  0.53127881E-01     0   405    11     0     0     0
   449  0.39832462E-01     0   423     5     0     0     0
   449  0.39832462E-01     0   417    11     0     0     0
   449  0.12581983E+00     0   412     6     0     0     0
   449  0.12581983E+00     0   406    12     0     0     0
   449  0.54099087E-01     0   424     6     0     0     0
   449  0.54099087E-01     0   418    12     0     0     0
   6
   450  0.16458863E+00     0   437   127     0     0     0
   450  0.16458863E+00     0   443   121     0     0     0
   450  0.15863223E+00     0   439   129     0     0     0
   450  0.15863223E+00     0   445   123     0     0     0
   450  0.17677908E+00     0   429   131     0     0     0
   450  0.17677908E+00     0   435   125     0     0     0
  20
   451  0.33064885E-03     0   450   200     0     0     0
   451  0.81933737E-02     0   450   203     0     0     0
   451  0.81901014E-01     0   425   127     0     0     0
   451  0.81901014E-01     0   431   121     0     0     0
   451  0.81953198E-01     0   427   129     0     0     0
   451  0.81953198E-01     0   433   123     0     0     0
   451  0.45165751E-04     0   437   127     0     0     0
   451  0.45165751E-04     0   443   121     0     0     0
   451  0.45011155E-04     0   439   129     0     0     0
   451  0.45011155E-04     0   445   123     0     0     0
   451  0.12669582E-02     0   429   131     0     0     0
   451  0.12669582E-02     0   435   125     0     0     0
   451  0.82072660E-01     0   441   131     0     0     0
   451  0.82072660E-01     0   447   125     0     0     0
   451  0.82606368E-01     0   426   128     0     0     0
   451  0.82606368E-01     0   432   122     0     0     0
   451  0.82658254E-01     0   428   130     0     0     0
   451  0.82658254E-01     0   434   124     0     0     0
   451  0.83189450E-01     0   430   132     0     0     0
   451  0.83189450E-01     0   436   126     0     0     0
  24
   452  0.29229167E+00     0   454   199     0     0     0
   452  0.29229167E+00     0   456   198     0     0     0
   452  0.10821938E+00     0   450   200     0     0     0
   452  0.28238592E+00     0   451   200     0     0     0
   452  0.11288837E-01     0   450   203     0     0     0
   452  0.37844705E-02     0   451   203     0     0     0
   452  0.16891307E-04     0   425   127     0     0     0
   452  0.16891307E-04     0   431   121     0     0     0
   452  0.16894153E-04     0   427   129     0     0     0
   452  0.16894153E-04     0   433   123     0     0     0
   452  0.45759698E-04     0   437   127     0     0     0
   452  0.45759698E-04     0   443   121     0     0     0
   452  0.45687291E-04     0   439   129     0     0     0
   452  0.45687291E-04     0   445   123     0     0     0
   452  0.29033546E-02     0   429   131     0     0     0
   452  0.29033546E-02     0   435   125     0     0     0
   452  0.15923337E-02     0   441   131     0     0     0
   452  0.15923337E-02     0   447   125     0     0     0
   452  0.82683553E-04     0   426   128     0     0     0
   452  0.82683553E-04     0   432   122     0     0     0
   452  0.82697436E-04     0   428   130     0     0     0
   452  0.82697436E-04     0   434   124     0     0     0
   452  0.82839477E-04     0   430   132     0     0     0
   452  0.82839477E-04     0   436   126     0     0     0
  24
   453  0.28860885E+00     0   454   199     0     0     0
   453  0.28860885E+00     0   456   198     0     0     0
   453  0.11042120E-01     0   450   200     0     0     0
   453  0.42630136E-02     0   451   200     0     0     0
   453  0.99767476E-01     0   450   203     0     0     0
   453  0.26124743E+00     0   451   203     0     0     0
   453  0.21858234E-02     0   425   127     0     0     0
   453  0.21858234E-02     0   431   121     0     0     0
   453  0.21861852E-02     0   427   129     0     0     0
   453  0.21861852E-02     0   433   123     0     0     0
   453  0.40073995E-03     0   437   127     0     0     0
   453  0.40073995E-03     0   443   121     0     0     0
   453  0.40011440E-03     0   439   129     0     0     0
   453  0.40011440E-03     0   445   123     0     0     0
   453  0.28276185E-02     0   429   131     0     0     0
   453  0.28276185E-02     0   435   125     0     0     0
   453  0.38027654E-02     0   441   131     0     0     0
   453  0.38027654E-02     0   447   125     0     0     0
   453  0.38067889E-02     0   426   128     0     0     0
   453  0.38067889E-02     0   432   122     0     0     0
   453  0.38074164E-02     0   428   130     0     0     0
   453  0.38074164E-02     0   434   124     0     0     0
   453  0.38138356E-02     0   430   132     0     0     0
   453  0.38138356E-02     0   436   126     0     0     0
   8
   454  0.84372740E-02     0   450   198     0     0     0
   454  0.16774422E+00     0   426   127     0     0     0
   454  0.16784948E+00     0   428   129     0     0     0
   454  0.16902621E+00     0   430   131     0     0     0
   454  0.16138874E+00     0   431   122     0     0     0
   454  0.16149151E+00     0   433   124     0     0     0
   454  0.24355059E-02     0   435   126     0     0     0
   454  0.16162707E+00     0   447   126     0     0     0
  11
   455  0.10911375E+00     0   450   198     0     0     0
   455  0.29228762E+00     0   451   198     0     0     0
   455  0.46101622E-02     0   426   127     0     0     0
   455  0.46109231E-02     0   428   129     0     0     0
   455  0.75663971E-02     0   430   131     0     0     0
   455  0.73684878E-02     0   431   122     0     0     0
   455  0.73697087E-02     0   433   124     0     0     0
   455  0.48889355E-02     0   435   126     0     0     0
   455  0.76884814E-02     0   447   126     0     0     0
   455  0.28623161E+00     0   454   200     0     0     0
   455  0.26826388E+00     0   454   203     0     0     0
   8
   456  0.84372740E-02     0   450   199     0     0     0
   456  0.16774422E+00     0   432   121     0     0     0
   456  0.16784948E+00     0   434   123     0     0     0
   456  0.16902621E+00     0   436   125     0     0     0
   456  0.16138874E+00     0   425   128     0     0     0
   456  0.16149151E+00     0   427   130     0     0     0
   456  0.24355059E-02     0   429   132     0     0     0
   456  0.16162707E+00     0   441   132     0     0     0
  11
   457  0.10911375E+00     0   450   199     0     0     0
   457  0.29228762E+00     0   451   199     0     0     0
   457  0.46101622E-02     0   432   121     0     0     0
   457  0.46109231E-02     0   434   123     0     0     0
   457  0.75663971E-02     0   436   125     0     0     0
   457  0.73684878E-02     0   425   128     0     0     0
   457  0.73697087E-02     0   427   130     0     0     0
   457  0.48889355E-02     0   429   132     0     0     0
   457  0.76884814E-02     0   441   132     0     0     0
   457  0.28623161E+00     0   456   200     0     0     0
   457  0.26826388E+00     0   456   203     0     0     0
  28
   203  0.16517489E-03     0   123   129     0     0     0
   203  0.47247071E-01     0   125   131     0     0     0
   203  0.19825480E-02     0     3     9     0     0     0
   203  0.77885020E+00     0     5    11     0     0     0
   203  0.38654469E-01     0     4    10     0     0     0
   203  0.17009102E-02     0    59    59     0     0     0
   203  0.34018129E-01     0    13    13     0     0     0
   203  0.49663642E-02     0   198   121   128     0     0
   203  0.49663642E-02     0   198   123   130     0     0
   203  0.49663642E-02     0   198   125   132     0     0
   203  0.14899091E-01     0   198     8     1     0     0
   203  0.14899091E-01     0   198    10     3     0     0
   203  0.49663642E-02     0   199   127   122     0     0
   203  0.49663642E-02     0   199   129   124     0     0
   203  0.49663642E-02     0   199   131   126     0     0
   203  0.14899091E-01     0   199     2     7     0     0
   203  0.14899091E-01     0   199     4     9     0     0
   203  0.54620695E-03     0   200   122   128     0     0
   203  0.54620695E-03     0   200   124   130     0     0
   203  0.54620695E-03     0   200   126   132     0     0
   203  0.27490049E-03     0   200   121   127     0     0
   203  0.27490049E-03     0   200   123   129     0     0
   203  0.27490049E-03     0   200   125   131     0     0
   203  0.94178575E-03     0   200     2     8     0     0
   203  0.94178575E-03     0   200     4    10     0     0
   203  0.12132521E-02     0   200     1     7     0     0
   203  0.12132521E-02     0   200     3     9     0     0
   203  0.12132521E-02     0   200     5    11     0     0
  17
   204  0.14120400E-03     0   123   129     0     0     0
   204  0.40442757E-01     0   125   131     0     0     0
   204  0.16477952E-02     0     3     9     0     0     0
   204  0.45961237E+00     0     5    11     0     0     0
   204  0.11613781E-04     0     4    10     0     0     0
   204  0.49062869E+00     0     6    12     0     0     0
   204  0.15449981E-03     0    13    13     0     0     0
   204  0.40614346E-03     0   198   199     0     0     0
   204  0.20339606E-03     0   200   200     0     0     0
   204  0.43807449E-03     0   450   450     0     0     0
   204  0.15425592E-03     0   450   451     0     0     0
   204  0.10790420E-02     0   203   203     0     0     0
   204  0.45887900E-04     0   437   443     0     0     0
   204  0.45800338E-04     0   439   445     0     0     0
   204  0.11141311E-03     0   429   435     0     0     0
   204  0.24384661E-02     0   429   447     0     0     0
   204  0.24384661E-02     0   441   435     0     0     0
  13
   205  0.13957391E-03     0   123   129     0     0     0
   205  0.39976031E-01     0   125   131     0     0     0
   205  0.16287896E-02     0     3     9     0     0     0
   205  0.45438737E+00     0     5    11     0     0     0
   205  0.11335125E-04     0     4    10     0     0     0
   205  0.49333727E+00     0     6    12     0     0     0
   205  0.20793646E-03     0    13    13     0     0     0
   205  0.10950803E-02     0   450   450     0     0     0
   205  0.39706393E-02     0   450   451     0     0     0
   205  0.39746633E-03     0   203   200     0     0     0
   205  0.16077547E-04     0   429   435     0     0     0
   205  0.24162654E-02     0   429   447     0     0     0
   205  0.24162654E-02     0   441   435     0     0     0
   7
   206  0.15268222E-03     0   124   129     0     0     0
   206  0.43730441E-01     0   126   131     0     0     0
   206  0.16567154E-02     0     4     9     0     0     0
   206  0.94397342E+00     0     6    11     0     0     0
   206  0.46495232E-02     0   454   450     0     0     0
   206  0.43646258E-03     0   203   198     0     0     0
   206  0.54007345E-02     0   435   430     0     0     0
   7
   207  0.15268222E-03     0   130   123     0     0     0
   207  0.43730441E-01     0   132   125     0     0     0
   207  0.16567154E-02     0    10     3     0     0     0
   207  0.94397342E+00     0    12     5     0     0     0
   207  0.46495232E-02     0   456   450     0     0     0
   207  0.43646258E-03     0   203   199     0     0     0
   207  0.54007345E-02     0   429   436     0     0     0
   0
   5
     6  0.33333334E+00   100     2     7     5     0     0
     6  0.33333334E+00   100     4     9     5     0     0
     6  0.11111111E+00   100   122   127     5     0     0
     6  0.11111111E+00   100   124   129     5     0     0
     6  0.11111111E+00   100   126   131     5     0     0
   5
    12  0.33333334E+00   100     8     1    11     0     0
    12  0.33333334E+00   100    10     3    11     0     0
    12  0.11111111E+00   100   128   121    11     0     0
    12  0.11111111E+00   100   130   123    11     0     0
    12  0.11111111E+00   100   132   125    11     0     0
      6.69164991     -0.14928356
      0.99924093     -0.00336295      0.03458928     -0.01760200
     -0.00890155     -0.98920226      0.11491262     -0.09052499
      0.01194143     -0.01746443     -0.70660198     -0.70729476
     -0.03599607      0.14547375      0.69736099     -0.70087737
     -0.99171883      0.12842806     -0.12842806     -0.99171883
     -0.98663145      0.16296752     -0.16296752     -0.98663145
     -1.36071610     -0.08333680     -1.53669512
  -2344.42993164   -107.08100128  -1066.43994141
   1575.96997070
    F
  0.00000000E+00  0.00000000E+00  0.00000000E+00  0.46893299E-01 -0.79278600E-27  0.00000000E+00  0.00000000E+00  0.00000000E+00 -0.45663799E-26 -0.46893299E-01  0.79278600E-27 -0.00000000E+00  0.00000000E+00  0.00000000E+00  0.00000000E+00  0.00000000E+00  0.00000000E+00  0.99447597E-08 -0.00000000E+00 -0.00000000E+00  0.45663799E-26 -0.00000000E+00 -0.00000000E+00 -0.99447597E-08  0.00000000E+00  0.00000000E+00  0.00000000E+00
 -0.69881796E-29  0.00000000E+00  0.00000000E+00  0.00000000E+00 -0.15300400E-27  0.00000000E+00  0.00000000E+00  0.00000000E+00 -0.65149703E-26  0.15219000E-10  0.12376199E-37  0.00000000E+00  0.58615334E-39  0.33321601E-09  0.00000000E+00  0.00000000E+00  0.00000000E+00  0.14188500E-07  0.00000000E+00  0.00000000E+00  0.00000000E+00  0.00000000E+00  0.00000000E+00  0.00000000E+00  0.00000000E+00  0.00000000E+00  0.00000000E+00
  0.00000000E+00  0.00000000E+00  0.00000000E+00  0.00000000E+00  0.00000000E+00  0.00000000E+00  0.00000000E+00  0.00000000E+00  0.00000000E+00  0.00000000E+00  0.00000000E+00  0.00000000E+00  0.00000000E+00  0.00000000E+00  0.00000000E+00  0.00000000E+00  0.00000000E+00  0.00000000E+00  0.00000000E+00  0.00000000E+00  0.00000000E+00  0.00000000E+00  0.00000000E+00  0.00000000E+00  0.00000000E+00  0.00000000E+00  0.00000000E+00
