  65
  401    305.1227    0.55379E-24
  402    295.7487    0.61043E-24
  403    305.1228    0.55383E-24
  404    295.7518    0.61043E-24
  405   3000.0916    0.41499E-26
  406   3002.5991    0.28123E-26
  407    305.1227    0.55379E-24
  408    295.7487    0.61043E-24
  409    305.1228    0.55383E-24
  410    295.7518    0.61043E-24
  411   3000.0916    0.41499E-26
  412   3002.5991    0.28123E-26
  413    300.9438    0.49701E-23
  414    298.1035    0.12604E-23
  415    300.9439    0.49701E-23
  416    298.1065    0.12605E-23
  417   3000.5220    0.28574E-26
  418   3002.8484    0.28681E-26
  419    300.9438    0.49701E-23
  420    298.1035    0.12604E-23
  421    300.9439    0.49701E-23
  422    298.1065    0.12605E-23
  423   3000.5220    0.28574E-26
  424   3002.8484    0.28681E-26
  425    150.0129    0.14057E-22
  426    129.8895    0.20250E-22
  427    150.0120    0.14057E-22
  428    129.8884    0.20252E-22
  429   3000.2717    0.42711E-25
  430   2999.3887    0.15917E-25
  431    150.0129    0.14057E-22
  432    129.8895    0.20250E-22
  433    150.0120    0.14057E-22
  434    129.8884    0.20252E-22
  435   3000.2717    0.42711E-25
  436   2999.3887    0.15917E-25
  437    150.0079    0.28486E-23
  438      0.0000    0.10000E+31
  439    150.0079    0.28486E-23
  440      0.0000    0.10000E+31
  441   3000.3406    0.15928E-25
  442      0.0000    0.10000E+31
  443    150.0079    0.28486E-23
  444      0.0000    0.10000E+31
  445    150.0079    0.28486E-23
  446      0.0000    0.10000E+31
  447   3000.3406    0.15928E-25
  448      0.0000    0.10000E+31
  449    500.0000    0.16203E-25
  450    100.0020    0.10000E+31
  451    199.9255    0.82155E-24
  452   -453.5255    0.19296E-24
  453    472.5888    0.14577E-24
  454    199.2941    0.80283E-24
  455    471.3403    0.14581E-24
  456    199.2941    0.80283E-24
  457    471.3403    0.14581E-24
  203    106.8545    0.17588E-21
  204   1007.6987    0.55624E-25
  205   1000.0000    0.56479E-25
  206   1011.4158    0.56673E-25
  207   1011.4158    0.56673E-25
  458      0.0000    0.10000E+31
    6    172.5000    0.57395E-24
   12    172.5000    0.57395E-24
   3
   401  0.47853664E-01     0   450     1     0     0     0
   401  0.31522736E+00     0   451     1     0     0     0
   401  0.63691902E+00     0   456     2     0     0     0
   3
   402  0.14646483E-01     0   450     2     0     0     0
   402  0.32545882E+00     0   451     2     0     0     0
   402  0.65989459E+00     0   454     1     0     0     0
   3
   403  0.47857273E-01     0   450     3     0     0     0
   403  0.31525138E+00     0   451     3     0     0     0
   403  0.63689137E+00     0   456     4     0     0     0
   3
   404  0.14645970E-01     0   450     4     0     0     0
   404  0.32542831E+00     0   451     4     0     0     0
   404  0.65992576E+00     0   454     3     0     0     0
   7
   405  0.10483106E-01     0   450     5     0     0     0
   405  0.14591037E-03     0   451     5     0     0     0
   405  0.68875460E-03     0   452     5     0     0     0
   405  0.71114278E-03     0   453     5     0     0     0
   405  0.98661119E+00     0   449     5     0     0     0
   405  0.14619686E-03     0   456     6     0     0     0
   405  0.12136512E-02     0   457     6     0     0     0
   7
   406  0.66452605E+00     0   449     6     0     0     0
   406  0.28600728E-01     0   450     6     0     0     0
   406  0.32114540E-02     0   451     6     0     0     0
   406  0.77161282E-01     0   452     6     0     0     0
   406  0.72779432E-01     0   453     6     0     0     0
   406  0.65592886E-02     0   454     5     0     0     0
   406  0.14716186E+00     0   455     5     0     0     0
   3
   407  0.47853664E-01     0   450     7     0     0     0
   407  0.31522736E+00     0   451     7     0     0     0
   407  0.63691902E+00     0   454     8     0     0     0
   3
   408  0.14646483E-01     0   450     8     0     0     0
   408  0.32545882E+00     0   451     8     0     0     0
   408  0.65989459E+00     0   456     7     0     0     0
   3
   409  0.47857273E-01     0   450     9     0     0     0
   409  0.31525138E+00     0   451     9     0     0     0
   409  0.63689137E+00     0   454    10     0     0     0
   3
   410  0.14645970E-01     0   450    10     0     0     0
   410  0.32542831E+00     0   451    10     0     0     0
   410  0.65992576E+00     0   456     9     0     0     0
   7
   411  0.10483106E-01     0   450    11     0     0     0
   411  0.14591037E-03     0   451    11     0     0     0
   411  0.68875460E-03     0   452    11     0     0     0
   411  0.71114278E-03     0   453    11     0     0     0
   411  0.98661119E+00     0   449    11     0     0     0
   411  0.14619686E-03     0   454    12     0     0     0
   411  0.12136512E-02     0   455    12     0     0     0
   7
   412  0.66452605E+00     0   449    12     0     0     0
   412  0.28600728E-01     0   450    12     0     0     0
   412  0.32114540E-02     0   451    12     0     0     0
   412  0.77161282E-01     0   452    12     0     0     0
   412  0.72779432E-01     0   453    12     0     0     0
   412  0.65592886E-02     0   456    11     0     0     0
   412  0.14716186E+00     0   457    11     0     0     0
   2
   413  0.99707389E+00     0   450     1     0     0     0
   413  0.29261068E-02     0   451     1     0     0     0
   2
   414  0.99714798E+00     0   450     2     0     0     0
   414  0.28520105E-02     0   451     2     0     0     0
   2
   415  0.99707389E+00     0   450     3     0     0     0
   415  0.29261096E-02     0   451     3     0     0     0
   2
   416  0.99714810E+00     0   450     4     0     0     0
   416  0.28518534E-02     0   451     4     0     0     0
   7
   417  0.30539688E-02     0   450     5     0     0     0
   417  0.48725083E-01     0   451     5     0     0     0
   417  0.71780116E-03     0   452     5     0     0     0
   417  0.44551650E-02     0   453     5     0     0     0
   417  0.67944694E+00     0   449     5     0     0     0
   417  0.10301421E+00     0   456     6     0     0     0
   417  0.16058685E+00     0   457     6     0     0     0
   7
   418  0.67777801E+00     0   449     6     0     0     0
   418  0.10480946E+00     0   454     5     0     0     0
   418  0.51459176E-02     0   455     5     0     0     0
   418  0.13215537E-02     0   450     6     0     0     0
   418  0.54699730E-01     0   451     6     0     0     0
   418  0.78866951E-01     0   452     6     0     0     0
   418  0.77378325E-01     0   453     6     0     0     0
   2
   419  0.99707389E+00     0   450     7     0     0     0
   419  0.29261068E-02     0   451     7     0     0     0
   2
   420  0.99714798E+00     0   450     8     0     0     0
   420  0.28520105E-02     0   451     8     0     0     0
   2
   421  0.99707389E+00     0   450     9     0     0     0
   421  0.29261096E-02     0   451     9     0     0     0
   2
   422  0.99714810E+00     0   450    10     0     0     0
   422  0.28518534E-02     0   451    10     0     0     0
   7
   423  0.30539688E-02     0   450    11     0     0     0
   423  0.48725083E-01     0   451    11     0     0     0
   423  0.71780116E-03     0   452    11     0     0     0
   423  0.44551650E-02     0   453    11     0     0     0
   423  0.67944694E+00     0   449    11     0     0     0
   423  0.10301421E+00     0   454    12     0     0     0
   423  0.16058685E+00     0   455    12     0     0     0
   7
   424  0.67777801E+00     0   449    12     0     0     0
   424  0.10480946E+00     0   456    11     0     0     0
   424  0.51459176E-02     0   457    11     0     0     0
   424  0.13215537E-02     0   450    12     0     0     0
   424  0.54699730E-01     0   451    12     0     0     0
   424  0.78866951E-01     0   452    12     0     0     0
   424  0.77378325E-01     0   453    12     0     0     0
   1
   425  0.10000000E+01     0   450   121     0     0     0
   1
   426  0.10000000E+01     0   450   122     0     0     0
   1
   427  0.10000000E+01     0   450   123     0     0     0
   1
   428  0.10000000E+01     0   450   124     0     0     0
   6
   429  0.96944666E+00     0   450   125     0     0     0
   429  0.74792732E-02     0   451   125     0     0     0
   429  0.46784487E-02     0   452   125     0     0     0
   429  0.12120036E-01     0   453   125     0     0     0
   429  0.67458337E-03     0   456   126     0     0     0
   429  0.56009893E-02     0   457   126     0     0     0
   6
   430  0.10918988E+00     0   450   126     0     0     0
   430  0.25341263E+00     0   451   126     0     0     0
   430  0.21041259E-02     0   452   126     0     0     0
   430  0.28731460E-01     0   453   126     0     0     0
   430  0.58063757E+00     0   454   125     0     0     0
   430  0.25924297E-01     0   455   125     0     0     0
   1
   431  0.10000000E+01     0   450   127     0     0     0
   1
   432  0.10000000E+01     0   450   128     0     0     0
   1
   433  0.10000000E+01     0   450   129     0     0     0
   1
   434  0.10000000E+01     0   450   130     0     0     0
   6
   435  0.96944666E+00     0   450   131     0     0     0
   435  0.74792732E-02     0   451   131     0     0     0
   435  0.46784487E-02     0   452   131     0     0     0
   435  0.12120036E-01     0   453   131     0     0     0
   435  0.67458337E-03     0   454   132     0     0     0
   435  0.56009893E-02     0   455   132     0     0     0
   6
   436  0.10918988E+00     0   450   132     0     0     0
   436  0.25341263E+00     0   451   132     0     0     0
   436  0.21041259E-02     0   452   132     0     0     0
   436  0.28731460E-01     0   453   132     0     0     0
   436  0.58063757E+00     0   456   131     0     0     0
   436  0.25924297E-01     0   457   131     0     0     0
   1
   437  0.10000000E+01     0   450   121     0     0     0
   0
   1
   439  0.10000000E+01     0   450   123     0     0     0
   0
   6
   441  0.73278785E-01     0   450   125     0     0     0
   441  0.30852425E+00     0   451   125     0     0     0
   441  0.16079380E-02     0   452   125     0     0     0
   441  0.13283908E-01     0   453   125     0     0     0
   441  0.54307103E+00     0   456   126     0     0     0
   441  0.60234003E-01     0   457   126     0     0     0
   0
   1
   443  0.10000000E+01     0   450   127     0     0     0
   0
   1
   445  0.10000000E+01     0   450   129     0     0     0
   0
   6
   447  0.73278785E-01     0   450   131     0     0     0
   447  0.30852425E+00     0   451   131     0     0     0
   447  0.16079380E-02     0   452   131     0     0     0
   447  0.13283908E-01     0   453   131     0     0     0
   447  0.54307103E+00     0   454   132     0     0     0
   447  0.60234003E-01     0   455   132     0     0     0
   0
  16
   449  0.64483806E-01     0   408     2     0     0     0
   449  0.64483806E-01     0   402     8     0     0     0
   449  0.60091887E-01     0   407     1     0     0     0
   449  0.60091887E-01     0   401     7     0     0     0
   449  0.63379005E-01     0   420     2     0     0     0
   449  0.63379005E-01     0   414     8     0     0     0
   449  0.62047563E-01     0   419     1     0     0     0
   449  0.62047563E-01     0   413     7     0     0     0
   449  0.60091835E-01     0   409     3     0     0     0
   449  0.60091835E-01     0   403     9     0     0     0
   449  0.62047504E-01     0   421     3     0     0     0
   449  0.62047504E-01     0   415     9     0     0     0
   449  0.64481601E-01     0   410     4     0     0     0
   449  0.64481601E-01     0   404    10     0     0     0
   449  0.63376777E-01     0   422     4     0     0     0
   449  0.63376777E-01     0   416    10     0     0     0
   0
  13
   451  0.43493902E-03     0   450   200     0     0     0
   451  0.10211203E+00     0   425   127     0     0     0
   451  0.10211203E+00     0   431   121     0     0     0
   451  0.10211501E+00     0   427   129     0     0     0
   451  0.10211501E+00     0   433   123     0     0     0
   451  0.88481850E-03     0   437   127     0     0     0
   451  0.88481850E-03     0   443   121     0     0     0
   451  0.88481599E-03     0   439   129     0     0     0
   451  0.88481599E-03     0   445   123     0     0     0
   451  0.14689110E+00     0   426   128     0     0     0
   451  0.14689110E+00     0   432   122     0     0     0
   451  0.14689472E+00     0   428   130     0     0     0
   451  0.14689472E+00     0   434   124     0     0     0
  34
   452  0.30272940E+00     0   454   199     0     0     0
   452  0.30272940E+00     0   456   198     0     0     0
   452  0.10026207E+00     0   450   200     0     0     0
   452  0.24886790E+00     0   451   200     0     0     0
   452  0.13620982E-01     0   450   203     0     0     0
   452  0.12295339E-01     0   451   203     0     0     0
   452  0.83281647E-03     0   402     8     0     0     0
   452  0.83281647E-03     0   408     2     0     0     0
   452  0.12282460E-02     0   401     7     0     0     0
   452  0.12282460E-02     0   407     1     0     0     0
   452  0.12282444E-02     0   403     9     0     0     0
   452  0.12282444E-02     0   409     3     0     0     0
   452  0.83277200E-03     0   404    10     0     0     0
   452  0.83277200E-03     0   410     4     0     0     0
   452  0.24631343E-03     0   414     8     0     0     0
   452  0.24631343E-03     0   420     2     0     0     0
   452  0.59797625E-04     0   413     7     0     0     0
   452  0.59797625E-04     0   419     1     0     0     0
   452  0.59797538E-04     0   415     9     0     0     0
   452  0.59797538E-04     0   421     3     0     0     0
   452  0.24629990E-03     0   416    10     0     0     0
   452  0.24629990E-03     0   422     4     0     0     0
   452  0.35017982E-03     0   425   127     0     0     0
   452  0.35017982E-03     0   431   121     0     0     0
   452  0.35018084E-03     0   427   129     0     0     0
   452  0.35018084E-03     0   433   123     0     0     0
   452  0.45424222E-03     0   437   127     0     0     0
   452  0.45424222E-03     0   443   121     0     0     0
   452  0.45424217E-03     0   439   129     0     0     0
   452  0.45424217E-03     0   445   123     0     0     0
   452  0.17021085E-02     0   426   128     0     0     0
   452  0.17021085E-02     0   432   122     0     0     0
   452  0.17021135E-02     0   428   130     0     0     0
   452  0.17021135E-02     0   434   124     0     0     0
  34
   453  0.25259078E+00     0   454   199     0     0     0
   453  0.25259078E+00     0   456   198     0     0     0
   453  0.12139287E-01     0   450   200     0     0     0
   453  0.13131364E-01     0   451   200     0     0     0
   453  0.63055515E-01     0   450   203     0     0     0
   453  0.16044562E+00     0   451   203     0     0     0
   453  0.14284345E-01     0   402     8     0     0     0
   453  0.14284345E-01     0   408     2     0     0     0
   453  0.17382780E-01     0   401     7     0     0     0
   453  0.17382780E-01     0   407     1     0     0     0
   453  0.17382761E-01     0   403     9     0     0     0
   453  0.17382761E-01     0   409     3     0     0     0
   453  0.14283718E-01     0   404    10     0     0     0
   453  0.14283718E-01     0   410     4     0     0     0
   453  0.12734915E-02     0   414     8     0     0     0
   453  0.12734915E-02     0   420     2     0     0     0
   453  0.31036718E-03     0   413     7     0     0     0
   453  0.31036718E-03     0   419     1     0     0     0
   453  0.31036680E-03     0   415     9     0     0     0
   453  0.31036680E-03     0   421     3     0     0     0
   453  0.12734343E-02     0   416    10     0     0     0
   453  0.12734343E-02     0   422     4     0     0     0
   453  0.75012231E-02     0   425   127     0     0     0
   453  0.75012231E-02     0   431   121     0     0     0
   453  0.75012436E-02     0   427   129     0     0     0
   453  0.75012436E-02     0   433   123     0     0     0
   453  0.21304360E-02     0   437   127     0     0     0
   453  0.21304360E-02     0   443   121     0     0     0
   453  0.21304355E-02     0   439   129     0     0     0
   453  0.21304355E-02     0   445   123     0     0     0
   453  0.18629359E-01     0   426   128     0     0     0
   453  0.18629359E-01     0   432   122     0     0     0
   453  0.18629411E-01     0   428   130     0     0     0
   453  0.18629411E-01     0   434   124     0     0     0
   5
   454  0.60538957E-02     0   450   198     0     0     0
   454  0.32467225E+00     0   426   127     0     0     0
   454  0.32468009E+00     0   428   129     0     0     0
   454  0.17229423E+00     0   431   122     0     0     0
   454  0.17229961E+00     0   433   124     0     0     0
  12
   455  0.53182896E-01     0   450   198     0     0     0
   455  0.27321652E+00     0   451   198     0     0     0
   455  0.19889081E-01     0   402     7     0     0     0
   455  0.46098728E-01     0   407     2     0     0     0
   455  0.19888539E-01     0   404     9     0     0     0
   455  0.50208021E-01     0   409     4     0     0     0
   455  0.15400391E-01     0   426   127     0     0     0
   455  0.15400434E-01     0   428   129     0     0     0
   455  0.36774337E-01     0   431   122     0     0     0
   455  0.36774434E-01     0   433   124     0     0     0
   455  0.24373716E+00     0   454   200     0     0     0
   455  0.18942943E+00     0   454   203     0     0     0
   5
   456  0.60538957E-02     0   450   199     0     0     0
   456  0.32467225E+00     0   432   121     0     0     0
   456  0.32468009E+00     0   434   123     0     0     0
   456  0.17229423E+00     0   425   128     0     0     0
   456  0.17229961E+00     0   427   130     0     0     0
  12
   457  0.53182896E-01     0   450   199     0     0     0
   457  0.27321652E+00     0   451   199     0     0     0
   457  0.19889081E-01     0   408     1     0     0     0
   457  0.46098728E-01     0   401     8     0     0     0
   457  0.19888539E-01     0   410     3     0     0     0
   457  0.50208021E-01     0   403    10     0     0     0
   457  0.15400391E-01     0   432   121     0     0     0
   457  0.15400434E-01     0   434   123     0     0     0
   457  0.36774337E-01     0   425   128     0     0     0
   457  0.36774434E-01     0   427   130     0     0     0
   457  0.24373716E+00     0   456   200     0     0     0
   457  0.18942943E+00     0   456   203     0     0     0
  28
   203  0.21259503E-03     0   123   129     0     0     0
   203  0.60789816E-01     0   125   131     0     0     0
   203  0.25563459E-02     0     3     9     0     0     0
   203  0.84677291E+00     0     5    11     0     0     0
   203  0.37055437E-01     0     4    10     0     0     0
   203  0.15128222E-02     0    59    59     0     0     0
   203  0.34138862E-01     0    13    13     0     0     0
   203  0.90892374E-03     0   198   121   128     0     0
   203  0.90892374E-03     0   198   123   130     0     0
   203  0.90892374E-03     0   198   125   132     0     0
   203  0.27267712E-02     0   198     8     1     0     0
   203  0.27267712E-02     0   198    10     3     0     0
   203  0.90892374E-03     0   199   127   122     0     0
   203  0.90892374E-03     0   199   129   124     0     0
   203  0.90892374E-03     0   199   131   126     0     0
   203  0.27267712E-02     0   199     2     7     0     0
   203  0.27267712E-02     0   199     4     9     0     0
   203  0.41080955E-04     0   200   122   128     0     0
   203  0.41080955E-04     0   200   124   130     0     0
   203  0.41080955E-04     0   200   126   132     0     0
   203  0.20675634E-04     0   200   121   127     0     0
   203  0.20675634E-04     0   200   123   129     0     0
   203  0.20675634E-04     0   200   125   131     0     0
   203  0.70832968E-04     0   200     2     8     0     0
   203  0.70832968E-04     0   200     4    10     0     0
   203  0.91250309E-04     0   200     1     7     0     0
   203  0.91250309E-04     0   200     3     9     0     0
   203  0.91250309E-04     0   200     5    11     0     0
  36
   204  0.27934825E-02     0   125   131     0     0     0
   204  0.11433804E-03     0     3     9     0     0     0
   204  0.28192373E-01     0     5    11     0     0     0
   204  0.23639430E+00     0     6    12     0     0     0
   204  0.13139674E-03     0    13    13     0     0     0
   204  0.59122231E-03     0   198   199     0     0     0
   204  0.30017979E-03     0   200   200     0     0     0
   204  0.23688488E-02     0   450   450     0     0     0
   204  0.12127457E-01     0   450   451     0     0     0
   204  0.62229235E-01     0   450   452     0     0     0
   204  0.12079753E-01     0   450   453     0     0     0
   204  0.14865425E-01     0   451   451     0     0     0
   204  0.14532180E+00     0   451   452     0     0     0
   204  0.20719321E-01     0   451   453     0     0     0
   204  0.31214865E-03     0   452   452     0     0     0
   204  0.13511886E-01     0   452   453     0     0     0
   204  0.67623326E-03     0   453   453     0     0     0
   204  0.36982551E-01     0   454   456     0     0     0
   204  0.36886544E-03     0   455   457     0     0     0
   204  0.20169896E+00     0   454   457     0     0     0
   204  0.20169896E+00     0   456   455     0     0     0
   204  0.25097085E-02     0   203   203     0     0     0
   204  0.11962248E-03     0   425   431     0     0     0
   204  0.89643843E-04     0   437   443     0     0     0
   204  0.11961268E-03     0   427   433     0     0     0
   204  0.89635330E-04     0   439   445     0     0     0
   204  0.50532358E-03     0   402   408     0     0     0
   204  0.10093769E-03     0   414   420     0     0     0
   204  0.50498109E-03     0   404   410     0     0     0
   204  0.10078567E-03     0   416   422     0     0     0
   204  0.74406510E-03     0   401   407     0     0     0
   204  0.25103911E-04     0   413   419     0     0     0
   204  0.74420415E-03     0   403   409     0     0     0
   204  0.25078281E-04     0   415   421     0     0     0
   204  0.42141139E-03     0   426   432     0     0     0
   204  0.42141171E-03     0   428   434     0     0     0
  22
   205  0.28214271E-02     0   125   131     0     0     0
   205  0.11548775E-03     0     3     9     0     0     0
   205  0.28502917E-01     0     5    11     0     0     0
   205  0.25512129E+00     0     6    12     0     0     0
   205  0.14103949E-03     0    13    13     0     0     0
   205  0.39215377E-02     0   450   450     0     0     0
   205  0.23170933E-01     0   450   451     0     0     0
   205  0.16786138E-01     0   450   452     0     0     0
   205  0.47834594E-01     0   450   453     0     0     0
   205  0.33658344E-01     0   451   451     0     0     0
   205  0.29805321E-01     0   451   452     0     0     0
   205  0.10670402E+00     0   451   453     0     0     0
   205  0.56539429E-03     0   452   452     0     0     0
   205  0.10166647E-02     0   452   453     0     0     0
   205  0.15554595E-01     0   453   453     0     0     0
   205  0.82228467E-01     0   454   456     0     0     0
   205  0.16612122E-01     0   455   457     0     0     0
   205  0.16740429E+00     0   454   457     0     0     0
   205  0.16740429E+00     0   456   455     0     0     0
   205  0.58137061E-03     0   203   200     0     0     0
   205  0.24872690E-04     0   404   422     0     0     0
   205  0.24872690E-04     0   416   410     0     0     0
  16
   206  0.28634302E-02     0   126   131     0     0     0
   206  0.11242142E-03     0     4     9     0     0     0
   206  0.25742999E+00     0     6    11     0     0     0
   206  0.31297959E-01     0   454   450     0     0     0
   206  0.28442577E-03     0   454   451     0     0     0
   206  0.20764904E+00     0   454   452     0     0     0
   206  0.20401372E+00     0   454   453     0     0     0
   206  0.39778356E-01     0   455   450     0     0     0
   206  0.24295664E+00     0   455   451     0     0     0
   206  0.87112403E-02     0   455   452     0     0     0
   206  0.84021664E-03     0   455   453     0     0     0
   206  0.59990567E-03     0   203   198     0     0     0
   206  0.12385453E-02     0   402   407     0     0     0
   206  0.12380425E-02     0   404   409     0     0     0
   206  0.49311697E-03     0   431   426     0     0     0
   206  0.49310282E-03     0   433   428     0     0     0
  16
   207  0.28634302E-02     0   132   125     0     0     0
   207  0.11242142E-03     0    10     3     0     0     0
   207  0.25742999E+00     0    12     5     0     0     0
   207  0.31297959E-01     0   456   450     0     0     0
   207  0.28442577E-03     0   456   451     0     0     0
   207  0.20764904E+00     0   456   452     0     0     0
   207  0.20401372E+00     0   456   453     0     0     0
   207  0.39778356E-01     0   457   450     0     0     0
   207  0.24295664E+00     0   457   451     0     0     0
   207  0.87112403E-02     0   457   452     0     0     0
   207  0.84021664E-03     0   457   453     0     0     0
   207  0.59990567E-03     0   203   199     0     0     0
   207  0.12385453E-02     0   408   401     0     0     0
   207  0.12380425E-02     0   410   403     0     0     0
   207  0.49311697E-03     0   425   432     0     0     0
   207  0.49310282E-03     0   427   434     0     0     0
   0
   5
     6  0.33333334E+00   100     2     7     5     0     0
     6  0.33333334E+00   100     4     9     5     0     0
     6  0.11111111E+00   100   122   127     5     0     0
     6  0.11111111E+00   100   124   129     5     0     0
     6  0.11111111E+00   100   126   131     5     0     0
   5
    12  0.33333334E+00   100     8     1    11     0     0
    12  0.33333334E+00   100    10     3    11     0     0
    12  0.11111111E+00   100   128   121    11     0     0
    12  0.11111111E+00   100   130   123    11     0     0
    12  0.11111111E+00   100   132   125    11     0     0
      4.00000000     -0.24965078
      0.99050903     -0.05429518      0.11526270     -0.05156542
     -0.08544197     -0.96209073      0.21964395     -0.13724999
     -0.04115489      0.06234059      0.70053118      0.70970166
     -0.09949071      0.25989807      0.66912466     -0.68907714
     -0.97926664      0.20257555     -0.20257555     -0.97926664
     -0.94678503      0.32186657     -0.32186657     -0.94678503
      1.57075512     -1.57079613     -1.57079506
    112.50000000   1800.00000000   1800.00000000
    450.00000000
    T
