  65
  401   1205.7854    0.59522E-25
  402   1203.1395    0.58964E-25
  403   1205.7854    0.59522E-25
  404   1203.1403    0.58964E-25
  405   1055.3119    0.60272E-25
  406    923.7579    0.97824E-25
  407   1205.7854    0.59522E-25
  408   1203.1395    0.58964E-25
  409   1205.7854    0.59522E-25
  410   1203.1403    0.58964E-25
  411   1055.3119    0.60272E-25
  412    923.7579    0.97824E-25
  413   1148.2096    0.11140E-23
  414   1154.0339    0.27682E-24
  415   1148.2096    0.11140E-23
  416   1154.0348    0.27682E-24
  417   1109.0693    0.50114E-25
  418   1121.2365    0.34832E-25
  419   1148.2096    0.11140E-23
  420   1154.0339    0.27682E-24
  421   1148.2096    0.11140E-23
  422   1154.0348    0.27682E-24
  423   1109.0693    0.50114E-25
  424   1121.2365    0.34832E-25
  425    397.9783    0.31122E-23
  426    389.8883    0.31028E-23
  427    397.9882    0.31119E-23
  428    389.8984    0.31025E-23
  429    115.9213    0.15639E-11
  430    374.9984    0.24770E-24
  431    397.9783    0.31122E-23
  432    389.8883    0.31028E-23
  433    397.9882    0.31119E-23
  434    389.8984    0.31025E-23
  435    115.9213    0.15639E-11
  436    374.9984    0.24770E-24
  437    229.0749    0.32006E-22
  438      0.0000    0.10000E+31
  439    229.6825    0.41709E-20
  440      0.0000    0.10000E+31
  441    405.9221    0.24730E-24
  442      0.0000    0.10000E+31
  443    229.0749    0.32006E-22
  444      0.0000    0.10000E+31
  445    229.6825    0.41709E-20
  446      0.0000    0.10000E+31
  447    405.9221    0.24730E-24
  448      0.0000    0.10000E+31
  449   1313.6100    0.30600E-25
  450    241.3350    0.95173E-24
  451    453.2295    0.61815E-24
  452   -711.4119    0.13213E-24
  453    723.1555    0.12121E-24
  454    453.3419    0.61893E-24
  455    723.5720    0.12343E-24
  456    453.3419    0.61893E-24
  457    723.5720    0.12343E-24
  203    117.8771    0.12348E-21
  204    646.9528    0.18637E-25
  205    646.3850    0.18639E-25
  206    653.2444    0.20973E-25
  207    653.2444    0.20973E-25
  458      0.0000    0.10000E+31
    6    171.4000    0.58581E-24
   12    171.4000    0.58581E-24
   6
   401  0.15726445E-01     0   450     1     0     0     0
   401  0.31806034E+00     0   451     1     0     0     0
   401  0.54079707E-03     0   452     1     0     0     0
   401  0.10132698E-01     0   453     1     0     0     0
   401  0.62900293E+00     0   456     2     0     0     0
   401  0.26536800E-01     0   457     2     0     0     0
   6
   402  0.12433467E-01     0   450     2     0     0     0
   402  0.32029960E+00     0   451     2     0     0     0
   402  0.32311794E-03     0   452     2     0     0     0
   402  0.80169858E-02     0   453     2     0     0     0
   402  0.64767563E+00     0   454     1     0     0     0
   402  0.11251220E-01     0   455     1     0     0     0
   6
   403  0.15726481E-01     0   450     3     0     0     0
   403  0.31806105E+00     0   451     3     0     0     0
   403  0.54079836E-03     0   452     3     0     0     0
   403  0.10132722E-01     0   453     3     0     0     0
   403  0.62900227E+00     0   456     4     0     0     0
   403  0.26536698E-01     0   457     4     0     0     0
   6
   404  0.12433445E-01     0   450     4     0     0     0
   404  0.32029888E+00     0   451     4     0     0     0
   404  0.32311669E-03     0   452     4     0     0     0
   404  0.80169542E-02     0   453     4     0     0     0
   404  0.64767635E+00     0   454     3     0     0     0
   404  0.11251245E-01     0   455     3     0     0     0
   7
   405  0.54394551E-01     0   450     5     0     0     0
   405  0.21686992E+00     0   451     5     0     0     0
   405  0.10923897E+00     0   452     5     0     0     0
   405  0.76773338E-01     0   453     5     0     0     0
   405  0.36982712E+00     0   456     6     0     0     0
   405  0.13148786E+00     0   457     6     0     0     0
   405  0.41408230E-01     0   199   406     0     0     0
   6
   406  0.21840896E+00     0   450     6     0     0     0
   406  0.10767746E+00     0   451     6     0     0     0
   406  0.14928406E+00     0   452     6     0     0     0
   406  0.22072252E-01     0   453     6     0     0     0
   406  0.26641870E+00     0   454     5     0     0     0
   406  0.23613857E+00     0   455     5     0     0     0
   6
   407  0.15726445E-01     0   450     7     0     0     0
   407  0.31806034E+00     0   451     7     0     0     0
   407  0.54079707E-03     0   452     7     0     0     0
   407  0.10132698E-01     0   453     7     0     0     0
   407  0.62900293E+00     0   454     8     0     0     0
   407  0.26536800E-01     0   455     8     0     0     0
   6
   408  0.12433467E-01     0   450     8     0     0     0
   408  0.32029960E+00     0   451     8     0     0     0
   408  0.32311794E-03     0   452     8     0     0     0
   408  0.80169858E-02     0   453     8     0     0     0
   408  0.64767563E+00     0   456     7     0     0     0
   408  0.11251220E-01     0   457     7     0     0     0
   6
   409  0.15726481E-01     0   450     9     0     0     0
   409  0.31806105E+00     0   451     9     0     0     0
   409  0.54079836E-03     0   452     9     0     0     0
   409  0.10132722E-01     0   453     9     0     0     0
   409  0.62900227E+00     0   454    10     0     0     0
   409  0.26536698E-01     0   455    10     0     0     0
   6
   410  0.12433445E-01     0   450    10     0     0     0
   410  0.32029888E+00     0   451    10     0     0     0
   410  0.32311669E-03     0   452    10     0     0     0
   410  0.80169542E-02     0   453    10     0     0     0
   410  0.64767635E+00     0   456     9     0     0     0
   410  0.11251245E-01     0   457     9     0     0     0
   7
   411  0.54394551E-01     0   450    11     0     0     0
   411  0.21686992E+00     0   451    11     0     0     0
   411  0.10923897E+00     0   452    11     0     0     0
   411  0.76773338E-01     0   453    11     0     0     0
   411  0.36982712E+00     0   454    12     0     0     0
   411  0.13148786E+00     0   455    12     0     0     0
   411  0.41408230E-01     0   198   412     0     0     0
   6
   412  0.21840896E+00     0   450    12     0     0     0
   412  0.10767746E+00     0   451    12     0     0     0
   412  0.14928406E+00     0   452    12     0     0     0
   412  0.22072252E-01     0   453    12     0     0     0
   412  0.26641870E+00     0   456    11     0     0     0
   412  0.23613857E+00     0   457    11     0     0     0
   4
   413  0.99731880E+00     0   450     1     0     0     0
   413  0.55726344E-03     0   451     1     0     0     0
   413  0.41931588E-03     0   452     1     0     0     0
   413  0.17045933E-02     0   453     1     0     0     0
   4
   414  0.99729145E+00     0   450     2     0     0     0
   414  0.55880088E-03     0   451     2     0     0     0
   414  0.42418682E-03     0   452     2     0     0     0
   414  0.17255808E-02     0   453     2     0     0     0
   4
   415  0.99731880E+00     0   450     3     0     0     0
   415  0.55726344E-03     0   451     3     0     0     0
   415  0.41931588E-03     0   452     3     0     0     0
   415  0.17045933E-02     0   453     3     0     0     0
   4
   416  0.99729145E+00     0   450     4     0     0     0
   416  0.55880065E-03     0   451     4     0     0     0
   416  0.42418586E-03     0   452     4     0     0     0
   416  0.17255765E-02     0   453     4     0     0     0
   7
   417  0.13362654E-01     0   450     5     0     0     0
   417  0.66656902E-01     0   451     5     0     0     0
   417  0.12401397E+00     0   452     5     0     0     0
   417  0.13760823E+00     0   453     5     0     0     0
   417  0.10719991E+00     0   456     6     0     0     0
   417  0.42876461E+00     0   457     6     0     0     0
   417  0.12239373E+00     0   199   406     0     0     0
   8
   418  0.24053584E+00     0   454     5     0     0     0
   418  0.21199694E+00     0   455     5     0     0     0
   418  0.82618684E-01     0   200   406     0     0     0
   418  0.53090360E-01     0   203   406     0     0     0
   418  0.20227244E-01     0   450     6     0     0     0
   418  0.10148933E+00     0   451     6     0     0     0
   418  0.98598719E-01     0   452     6     0     0     0
   418  0.19144289E+00     0   453     6     0     0     0
   4
   419  0.99731880E+00     0   450     7     0     0     0
   419  0.55726344E-03     0   451     7     0     0     0
   419  0.41931588E-03     0   452     7     0     0     0
   419  0.17045933E-02     0   453     7     0     0     0
   4
   420  0.99729145E+00     0   450     8     0     0     0
   420  0.55880088E-03     0   451     8     0     0     0
   420  0.42418682E-03     0   452     8     0     0     0
   420  0.17255808E-02     0   453     8     0     0     0
   4
   421  0.99731880E+00     0   450     9     0     0     0
   421  0.55726344E-03     0   451     9     0     0     0
   421  0.41931588E-03     0   452     9     0     0     0
   421  0.17045933E-02     0   453     9     0     0     0
   4
   422  0.99729145E+00     0   450    10     0     0     0
   422  0.55880065E-03     0   451    10     0     0     0
   422  0.42418586E-03     0   452    10     0     0     0
   422  0.17255765E-02     0   453    10     0     0     0
   7
   423  0.13362654E-01     0   450    11     0     0     0
   423  0.66656902E-01     0   451    11     0     0     0
   423  0.12401397E+00     0   452    11     0     0     0
   423  0.13760823E+00     0   453    11     0     0     0
   423  0.10719991E+00     0   454    12     0     0     0
   423  0.42876461E+00     0   455    12     0     0     0
   423  0.12239373E+00     0   198   412     0     0     0
   8
   424  0.24053584E+00     0   456    11     0     0     0
   424  0.21199694E+00     0   457    11     0     0     0
   424  0.82618684E-01     0   200   412     0     0     0
   424  0.53090360E-01     0   203   412     0     0     0
   424  0.20227244E-01     0   450    12     0     0     0
   424  0.10148933E+00     0   451    12     0     0     0
   424  0.98598719E-01     0   452    12     0     0     0
   424  0.19144289E+00     0   453    12     0     0     0
   4
   425  0.91585475E+00     0   450   121     0     0     0
   425  0.84474988E-04     0   429   121   131     0     0
   425  0.21865850E-03     0   435   121   125     0     0
   425  0.83842136E-01     0   121   130     0     0     0
   5
   426  0.91707820E+00     0   450   122     0     0     0
   426  0.60864561E-04     0   429   122   131     0     0
   426  0.17113947E-03     0   435   122   125     0     0
   426  0.79884811E-03     0   435   121   126     0     0
   426  0.81890963E-01     0   129   121     0     0     0
   4
   427  0.91585910E+00     0   450   123     0     0     0
   427  0.84488900E-04     0   429   123   131     0     0
   427  0.21868135E-03     0   435   123   125     0     0
   427  0.83837718E-01     0   121   128     0     0     0
   5
   428  0.91708285E+00     0   450   124     0     0     0
   428  0.60874379E-04     0   429   124   131     0     0
   428  0.17115656E-03     0   435   124   125     0     0
   428  0.79900539E-03     0   435   123   126     0     0
   428  0.81886120E-01     0   127   121     0     0     0
   3
   429  0.62320177E-01     0   125   130     0     0     0
   429  0.46873009E+00     0   125   124     0     0     0
   429  0.46894971E+00     0   123   126     0     0     0
   3
   430  0.63508630E-01     0   450   126     0     0     0
   430  0.93648094E+00     0   198   429     0     0     0
   430  0.10411214E-04     0   429   126   131     0     0
   4
   431  0.91585475E+00     0   450   127     0     0     0
   431  0.84474988E-04     0   435   127   125     0     0
   431  0.21865850E-03     0   429   127   131     0     0
   431  0.83842136E-01     0   127   124     0     0     0
   5
   432  0.91707820E+00     0   450   128     0     0     0
   432  0.60864561E-04     0   435   128   125     0     0
   432  0.17113947E-03     0   429   128   131     0     0
   432  0.79884811E-03     0   429   127   132     0     0
   432  0.81890963E-01     0   123   127     0     0     0
   4
   433  0.91585910E+00     0   450   129     0     0     0
   433  0.84488900E-04     0   435   129   125     0     0
   433  0.21868135E-03     0   429   129   131     0     0
   433  0.83837718E-01     0   127   122     0     0     0
   5
   434  0.91708285E+00     0   450   130     0     0     0
   434  0.60874379E-04     0   435   130   125     0     0
   434  0.17115656E-03     0   429   130   131     0     0
   434  0.79900539E-03     0   429   129   132     0     0
   434  0.81886120E-01     0   121   127     0     0     0
   3
   435  0.62320177E-01     0   131   124     0     0     0
   435  0.46873009E+00     0   131   130     0     0     0
   435  0.46894971E+00     0   129   132     0     0     0
   3
   436  0.63508630E-01     0   450   132     0     0     0
   436  0.93648094E+00     0   199   435     0     0     0
   436  0.10411214E-04     0   435   132   125     0     0
   4
   437  0.27692539E-02     0   429   121   131     0     0
   437  0.46104901E-02     0   435   121   125     0     0
   437  0.49631003E+00     0   123   122     0     0     0
   437  0.49631023E+00     0   121   124     0     0     0
   0
   2
   439  0.37683657E+00     0   429   123   131     0     0
   439  0.62316346E+00     0   435   123   125     0     0
   0
   3
   441  0.10097159E+00     0   450   125     0     0     0
   441  0.54294783E+00     0   200   429     0     0     0
   441  0.35608059E+00     0   203   429     0     0     0
   0
   4
   443  0.27692539E-02     0   435   127   125     0     0
   443  0.46104901E-02     0   429   127   131     0     0
   443  0.49631003E+00     0   129   128     0     0     0
   443  0.49631023E+00     0   127   130     0     0     0
   0
   2
   445  0.37683657E+00     0   435   129   125     0     0
   445  0.62316346E+00     0   429   129   131     0     0
   0
   3
   447  0.10097159E+00     0   450   131     0     0     0
   447  0.54294783E+00     0   200   435     0     0     0
   447  0.35608059E+00     0   203   435     0     0     0
   0
  24
   449  0.17757218E-01     0   408     2     0     0     0
   449  0.17757218E-01     0   402     8     0     0     0
   449  0.16952386E-01     0   407     1     0     0     0
   449  0.16952386E-01     0   401     7     0     0     0
   449  0.35620738E-01     0   420     2     0     0     0
   449  0.35620738E-01     0   414     8     0     0     0
   449  0.38087994E-01     0   419     1     0     0     0
   449  0.38087994E-01     0   413     7     0     0     0
   449  0.16952360E-01     0   409     3     0     0     0
   449  0.16952360E-01     0   403     9     0     0     0
   449  0.38087972E-01     0   421     3     0     0     0
   449  0.38087972E-01     0   415     9     0     0     0
   449  0.17755782E-01     0   410     4     0     0     0
   449  0.17755782E-01     0   404    10     0     0     0
   449  0.35619270E-01     0   422     4     0     0     0
   449  0.35619270E-01     0   416    10     0     0     0
   449  0.84151864E-01     0   411     5     0     0     0
   449  0.84151864E-01     0   405    11     0     0     0
   449  0.57889435E-01     0   423     5     0     0     0
   449  0.57889435E-01     0   417    11     0     0     0
   449  0.10011567E+00     0   412     6     0     0     0
   449  0.10011567E+00     0   406    12     0     0     0
   449  0.41009307E-01     0   424     6     0     0     0
   449  0.41009307E-01     0   418    12     0     0     0
   6
   450  0.86495420E-02     0   437   127     0     0     0
   450  0.86495420E-02     0   443   121     0     0     0
   450  0.78333477E-02     0   439   129     0     0     0
   450  0.78333477E-02     0   445   123     0     0     0
   450  0.48351711E+00     0   429   131     0     0     0
   450  0.48351711E+00     0   435   125     0     0     0
  20
   451  0.13395882E-02     0   450   200     0     0     0
   451  0.11663235E-01     0   450   203     0     0     0
   451  0.45927878E-01     0   425   127     0     0     0
   451  0.45927878E-01     0   431   121     0     0     0
   451  0.45912392E-01     0   427   129     0     0     0
   451  0.45912392E-01     0   433   123     0     0     0
   451  0.42725666E-03     0   437   127     0     0     0
   451  0.42725666E-03     0   443   121     0     0     0
   451  0.42570065E-03     0   439   129     0     0     0
   451  0.42570065E-03     0   445   123     0     0     0
   451  0.17903355E+00     0   429   131     0     0     0
   451  0.17903355E+00     0   435   125     0     0     0
   451  0.28190704E-01     0   441   131     0     0     0
   451  0.28190704E-01     0   447   125     0     0     0
   451  0.55759564E-01     0   426   128     0     0     0
   451  0.55759564E-01     0   432   122     0     0     0
   451  0.55743109E-01     0   428   130     0     0     0
   451  0.55743109E-01     0   434   124     0     0     0
   451  0.82078420E-01     0   430   132     0     0     0
   451  0.82078420E-01     0   436   126     0     0     0
  26
   452  0.22169241E+00     0   454   199     0     0     0
   452  0.22169241E+00     0   456   198     0     0     0
   452  0.75948179E-01     0   450   200     0     0     0
   452  0.19721527E+00     0   451   200     0     0     0
   452  0.10344297E-03     0   450     5    11     0     0
   452  0.21870752E-04     0   451     5    11     0     0
   452  0.15539306E-01     0   450   203     0     0     0
   452  0.73523461E-02     0   451   203     0     0     0
   452  0.12274946E-03     0   425   127     0     0     0
   452  0.12274946E-03     0   431   121     0     0     0
   452  0.12274388E-03     0   427   129     0     0     0
   452  0.12274388E-03     0   433   123     0     0     0
   452  0.29349377E-03     0   437   127     0     0     0
   452  0.29349377E-03     0   443   121     0     0     0
   452  0.29313317E-03     0   439   129     0     0     0
   452  0.29313317E-03     0   445   123     0     0     0
   452  0.81699081E-01     0   429   131     0     0     0
   452  0.81699081E-01     0   435   125     0     0     0
   452  0.45822874E-01     0   441   131     0     0     0
   452  0.45822874E-01     0   447   125     0     0     0
   452  0.60786348E-03     0   426   128     0     0     0
   452  0.60786348E-03     0   432   122     0     0     0
   452  0.60783641E-03     0   428   130     0     0     0
   452  0.60783641E-03     0   434   124     0     0     0
   452  0.64759504E-03     0   430   132     0     0     0
   452  0.64759504E-03     0   436   126     0     0     0
  26
   453  0.22044183E+00     0   454   199     0     0     0
   453  0.22044183E+00     0   456   198     0     0     0
   453  0.15850689E-01     0   450   200     0     0     0
   453  0.10424460E-01     0   451   200     0     0     0
   453  0.95532516E-04     0   450     5    11     0     0
   453  0.21441483E-04     0   451     5    11     0     0
   453  0.64346977E-01     0   450   203     0     0     0
   453  0.17000122E+00     0   451   203     0     0     0
   453  0.46214671E-02     0   425   127     0     0     0
   453  0.46214671E-02     0   431   121     0     0     0
   453  0.46212659E-02     0   427   129     0     0     0
   453  0.46212659E-02     0   433   123     0     0     0
   453  0.11688598E-02     0   437   127     0     0     0
   453  0.11688598E-02     0   443   121     0     0     0
   453  0.11674750E-02     0   439   129     0     0     0
   453  0.11674750E-02     0   445   123     0     0     0
   453  0.55898052E-01     0   429   131     0     0     0
   453  0.55898052E-01     0   435   125     0     0     0
   453  0.53414930E-01     0   441   131     0     0     0
   453  0.53414930E-01     0   447   125     0     0     0
   453  0.92400797E-02     0   426   128     0     0     0
   453  0.92400797E-02     0   432   122     0     0     0
   453  0.92396876E-02     0   428   130     0     0     0
   453  0.92396876E-02     0   434   124     0     0     0
   453  0.98161912E-02     0   430   132     0     0     0
   453  0.98161912E-02     0   436   126     0     0     0
   8
   454  0.12755667E-01     0   450   198     0     0     0
   454  0.11792206E+00     0   426   127     0     0     0
   454  0.11788717E+00     0   428   129     0     0     0
   454  0.17866933E+00     0   430   131     0     0     0
   454  0.87710172E-01     0   431   122     0     0     0
   454  0.87680794E-01     0   433   124     0     0     0
   454  0.34583026E+00     0   435   126     0     0     0
   454  0.51544536E-01     0   447   126     0     0     0
  11
   455  0.77973276E-01     0   450   198     0     0     0
   455  0.22733803E+00     0   451   198     0     0     0
   455  0.87535745E-02     0   426   127     0     0     0
   455  0.87532029E-02     0   428   129     0     0     0
   455  0.97551405E-01     0   430   131     0     0     0
   455  0.19615950E-01     0   431   122     0     0     0
   455  0.19615101E-01     0   433   124     0     0     0
   455  0.93383409E-01     0   435   126     0     0     0
   455  0.50553016E-01     0   447   126     0     0     0
   455  0.21300375E+00     0   454   200     0     0     0
   455  0.18345927E+00     0   454   203     0     0     0
   8
   456  0.12755667E-01     0   450   199     0     0     0
   456  0.11792206E+00     0   432   121     0     0     0
   456  0.11788717E+00     0   434   123     0     0     0
   456  0.17866933E+00     0   436   125     0     0     0
   456  0.87710172E-01     0   425   128     0     0     0
   456  0.87680794E-01     0   427   130     0     0     0
   456  0.34583026E+00     0   429   132     0     0     0
   456  0.51544536E-01     0   441   132     0     0     0
  11
   457  0.77973276E-01     0   450   199     0     0     0
   457  0.22733803E+00     0   451   199     0     0     0
   457  0.87535745E-02     0   432   121     0     0     0
   457  0.87532029E-02     0   434   123     0     0     0
   457  0.97551405E-01     0   436   125     0     0     0
   457  0.19615950E-01     0   425   128     0     0     0
   457  0.19615101E-01     0   427   130     0     0     0
   457  0.93383409E-01     0   429   132     0     0     0
   457  0.50553016E-01     0   441   132     0     0     0
   457  0.21300375E+00     0   456   200     0     0     0
   457  0.18345927E+00     0   456   203     0     0     0
  28
   203  0.17059894E-03     0   123   129     0     0     0
   203  0.48795775E-01     0   125   131     0     0     0
   203  0.20483106E-02     0     3     9     0     0     0
   203  0.80712658E+00     0     5    11     0     0     0
   203  0.38144942E-01     0     4    10     0     0     0
   203  0.15648199E-02     0    59    59     0     0     0
   203  0.31823657E-01     0    13    13     0     0     0
   203  0.36178394E-02     0   198   121   128     0     0
   203  0.36178394E-02     0   198   123   130     0     0
   203  0.36178394E-02     0   198   125   132     0     0
   203  0.10853518E-01     0   198     8     1     0     0
   203  0.10853518E-01     0   198    10     3     0     0
   203  0.36178394E-02     0   199   127   122     0     0
   203  0.36178394E-02     0   199   129   124     0     0
   203  0.36178394E-02     0   199   131   126     0     0
   203  0.10853518E-01     0   199     2     7     0     0
   203  0.10853518E-01     0   199     4     9     0     0
   203  0.35591374E-03     0   200   122   128     0     0
   203  0.35591374E-03     0   200   124   130     0     0
   203  0.35591374E-03     0   200   126   132     0     0
   203  0.17912780E-03     0   200   121   127     0     0
   203  0.17912780E-03     0   200   123   129     0     0
   203  0.17912780E-03     0   200   125   131     0     0
   203  0.61367673E-03     0   200     2     8     0     0
   203  0.61367673E-03     0   200     4    10     0     0
   203  0.79056679E-03     0   200     1     7     0     0
   203  0.79056679E-03     0   200     3     9     0     0
   203  0.79056679E-03     0   200     5    11     0     0
  10
   204  0.17388951E-03     0   123   129     0     0     0
   204  0.49802370E-01     0   125   131     0     0     0
   204  0.20463304E-02     0     3     9     0     0     0
   204  0.64295053E+00     0     5    11     0     0     0
   204  0.57561428E-03     0     6    12     0     0     0
   204  0.11203256E-04     0    13    13     0     0     0
   204  0.71987466E-04     0   450   450     0     0     0
   204  0.11703759E+00     0   429   435     0     0     0
   204  0.93665235E-01     0   429   447     0     0     0
   204  0.93665235E-01     0   441   435     0     0     0
  10
   205  0.17376312E-03     0   123   129     0     0     0
   205  0.49767669E-01     0   125   131     0     0     0
   205  0.20448591E-02     0     3     9     0     0     0
   205  0.64263141E+00     0     5    11     0     0     0
   205  0.72579202E-03     0     6    12     0     0     0
   205  0.20139849E-04     0    13    13     0     0     0
   205  0.16884599E-03     0   450   450     0     0     0
   205  0.11722645E+00     0   429   435     0     0     0
   205  0.93620546E-01     0   429   447     0     0     0
   205  0.93620546E-01     0   441   435     0     0     0
   5
   206  0.19759836E-03     0   124   129     0     0     0
   206  0.56594368E-01     0   126   131     0     0     0
   206  0.21292784E-02     0     4     9     0     0     0
   206  0.57984835E+00     0     6    11     0     0     0
   206  0.36123040E+00     0   435   430     0     0     0
   5
   207  0.19759836E-03     0   130   123     0     0     0
   207  0.56594368E-01     0   132   125     0     0     0
   207  0.21292784E-02     0    10     3     0     0     0
   207  0.57984835E+00     0    12     5     0     0     0
   207  0.36123040E+00     0   429   436     0     0     0
   0
   5
     6  0.33333334E+00   100     2     7     5     0     0
     6  0.33333334E+00   100     4     9     5     0     0
     6  0.11111111E+00   100   122   127     5     0     0
     6  0.11111111E+00   100   124   129     5     0     0
     6  0.11111111E+00   100   126   131     5     0     0
   5
    12  0.33333334E+00   100     8     1    11     0     0
    12  0.33333334E+00   100    10     3    11     0     0
    12  0.11111111E+00   100   128   121    11     0     0
    12  0.11111111E+00   100   130   123    11     0     0
    12  0.11111111E+00   100   132   125    11     0     0
     36.18270111     -0.02850018
      0.99700445     -0.01017170      0.07201999     -0.02629644
     -0.02668378     -0.97430289      0.18698329     -0.12271617
      0.03171506     -0.04684449     -0.70411104     -0.70783281
     -0.06529914      0.22008221      0.68123257     -0.69514179
     -0.98466581      0.17445125     -0.17445125     -0.98466581
     -0.96405417      0.26570579     -0.26570579     -0.96405417
     -1.13664830     -0.76684642     -1.22114766
  -1010.03002930   6643.00000000  -2275.47998047
    707.87200928
    F
  0.00000000E+00  0.00000000E+00  0.00000000E+00  0.47324799E-01  0.13582100E-20  0.00000000E+00  0.00000000E+00  0.00000000E+00 -0.78982404E-20 -0.47324799E-01 -0.13582100E-20  0.00000000E+00  0.00000000E+00  0.00000000E+00  0.00000000E+00  0.00000000E+00  0.00000000E+00 -0.31138501E-06  0.00000000E+00  0.00000000E+00  0.78982404E-20  0.00000000E+00  0.00000000E+00  0.31138501E-06  0.00000000E+00  0.00000000E+00  0.00000000E+00
  0.00000000E+00  0.00000000E+00  0.00000000E+00  0.00000000E+00  0.00000000E+00  0.00000000E+00  0.00000000E+00  0.00000000E+00 -0.97413999E-20  0.00000000E+00  0.00000000E+00  0.00000000E+00  0.00000000E+00  0.00000000E+00  0.00000000E+00  0.00000000E+00  0.00000000E+00 -0.38405000E-06  0.00000000E+00  0.00000000E+00  0.00000000E+00  0.00000000E+00  0.00000000E+00  0.00000000E+00  0.00000000E+00  0.00000000E+00  0.00000000E+00
  0.00000000E+00  0.00000000E+00  0.00000000E+00  0.00000000E+00  0.00000000E+00  0.00000000E+00  0.00000000E+00  0.00000000E+00  0.00000000E+00  0.00000000E+00  0.00000000E+00  0.00000000E+00  0.00000000E+00  0.00000000E+00  0.00000000E+00  0.00000000E+00  0.00000000E+00  0.00000000E+00  0.00000000E+00  0.00000000E+00  0.00000000E+00  0.00000000E+00  0.00000000E+00  0.00000000E+00  0.00000000E+00  0.00000000E+00  0.00000000E+00
