  65
  401   1053.1819    0.67616E-25
  402   1050.1603    0.66800E-25
  403   1053.1820    0.67616E-25
  404   1050.1611    0.66800E-25
  405    950.9224    0.59519E-25
  406    801.6298    0.13661E-24
  407   1053.1819    0.67616E-25
  408   1050.1603    0.66800E-25
  409   1053.1820    0.67616E-25
  410   1050.1611    0.66800E-25
  411    950.9224    0.59519E-25
  412    801.6298    0.13661E-24
  413   1003.7488    0.12701E-23
  414   1008.4055    0.31579E-24
  415   1003.7488    0.12701E-23
  416   1008.4064    0.31579E-24
  417    990.8451    0.11121E-24
  418   1002.6685    0.41505E-25
  419   1003.7488    0.12701E-23
  420   1008.4055    0.31579E-24
  421   1003.7488    0.12701E-23
  422   1008.4064    0.31579E-24
  423    990.8451    0.11121E-24
  424   1002.6685    0.41505E-25
  425    344.7825    0.35364E-23
  426    335.4389    0.35032E-23
  427    344.8290    0.35350E-23
  428    335.4868    0.35016E-23
  429    163.1644    0.96669E-11
  430    330.5532    0.10059E-23
  431    344.7825    0.35364E-23
  432    335.4389    0.35032E-23
  433    344.8290    0.35350E-23
  434    335.4868    0.35016E-23
  435    163.1644    0.96669E-11
  436    330.5532    0.10059E-23
  437    199.1443    0.36903E-22
  438      0.0000    0.10000E+31
  439    199.7433    0.99816E-19
  440      0.0000    0.10000E+31
  441    350.2435    0.85740E-24
  442      0.0000    0.10000E+31
  443    199.1443    0.36903E-22
  444      0.0000    0.10000E+31
  445    199.7433    0.99816E-19
  446      0.0000    0.10000E+31
  447    350.2435    0.85740E-24
  448      0.0000    0.10000E+31
  449   1145.8800    0.41623E-25
  450    205.9864    0.45545E-23
  451    386.4771    0.10611E-23
  452   -629.1524    0.17509E-24
  453    642.2119    0.15153E-24
  454    386.5499    0.10590E-23
  455    642.5686    0.15526E-24
  456    386.5499    0.10590E-23
  457    642.5686    0.15526E-24
  203    117.0950    0.12428E-21
  204    657.2416    0.69623E-25
  205    656.4030    0.69322E-25
  206    662.2778    0.82701E-25
  207    662.2778    0.82701E-25
  458      0.0000    0.10000E+31
    6    171.4000    0.58581E-24
   12    171.4000    0.58581E-24
   6
   401  0.16296042E-01     0   450     1     0     0     0
   401  0.31665468E+00     0   451     1     0     0     0
   401  0.65616617E-03     0   452     1     0     0     0
   401  0.11290548E-01     0   453     1     0     0     0
   401  0.62527078E+00     0   456     2     0     0     0
   401  0.29831795E-01     0   457     2     0     0     0
   6
   402  0.11747078E-01     0   450     2     0     0     0
   402  0.31957868E+00     0   451     2     0     0     0
   402  0.39070027E-03     0   452     2     0     0     0
   402  0.88077849E-02     0   453     2     0     0     0
   402  0.64726651E+00     0   454     1     0     0     0
   402  0.12209219E-01     0   455     1     0     0     0
   6
   403  0.16296089E-01     0   450     3     0     0     0
   403  0.31665561E+00     0   451     3     0     0     0
   403  0.65616827E-03     0   452     3     0     0     0
   403  0.11290584E-01     0   453     3     0     0     0
   403  0.62526989E+00     0   456     4     0     0     0
   403  0.29831639E-01     0   457     4     0     0     0
   6
   404  0.11747049E-01     0   450     4     0     0     0
   404  0.31957778E+00     0   451     4     0     0     0
   404  0.39069823E-03     0   452     4     0     0     0
   404  0.88077364E-02     0   453     4     0     0     0
   404  0.64726752E+00     0   454     3     0     0     0
   404  0.12209254E-01     0   455     3     0     0     0
   7
   405  0.32258883E-01     0   450     5     0     0     0
   405  0.21892668E+00     0   451     5     0     0     0
   405  0.35137646E-01     0   452     5     0     0     0
   405  0.24292428E-01     0   453     5     0     0     0
   405  0.37359235E+00     0   456     6     0     0     0
   405  0.21289341E+00     0   457     6     0     0     0
   405  0.10289861E+00     0   199   406     0     0     0
   5
   406  0.25902027E+00     0   450     6     0     0     0
   406  0.13503605E+00     0   451     6     0     0     0
   406  0.33350058E-01     0   452     6     0     0     0
   406  0.34620595E+00     0   454     5     0     0     0
   406  0.22638765E+00     0   455     5     0     0     0
   6
   407  0.16296042E-01     0   450     7     0     0     0
   407  0.31665468E+00     0   451     7     0     0     0
   407  0.65616617E-03     0   452     7     0     0     0
   407  0.11290548E-01     0   453     7     0     0     0
   407  0.62527078E+00     0   454     8     0     0     0
   407  0.29831795E-01     0   455     8     0     0     0
   6
   408  0.11747078E-01     0   450     8     0     0     0
   408  0.31957868E+00     0   451     8     0     0     0
   408  0.39070027E-03     0   452     8     0     0     0
   408  0.88077849E-02     0   453     8     0     0     0
   408  0.64726651E+00     0   456     7     0     0     0
   408  0.12209219E-01     0   457     7     0     0     0
   6
   409  0.16296089E-01     0   450     9     0     0     0
   409  0.31665561E+00     0   451     9     0     0     0
   409  0.65616827E-03     0   452     9     0     0     0
   409  0.11290584E-01     0   453     9     0     0     0
   409  0.62526989E+00     0   454    10     0     0     0
   409  0.29831639E-01     0   455    10     0     0     0
   6
   410  0.11747049E-01     0   450    10     0     0     0
   410  0.31957778E+00     0   451    10     0     0     0
   410  0.39069823E-03     0   452    10     0     0     0
   410  0.88077364E-02     0   453    10     0     0     0
   410  0.64726752E+00     0   456     9     0     0     0
   410  0.12209254E-01     0   457     9     0     0     0
   7
   411  0.32258883E-01     0   450    11     0     0     0
   411  0.21892668E+00     0   451    11     0     0     0
   411  0.35137646E-01     0   452    11     0     0     0
   411  0.24292428E-01     0   453    11     0     0     0
   411  0.37359235E+00     0   454    12     0     0     0
   411  0.21289341E+00     0   455    12     0     0     0
   411  0.10289861E+00     0   198   412     0     0     0
   5
   412  0.25902027E+00     0   450    12     0     0     0
   412  0.13503605E+00     0   451    12     0     0     0
   412  0.33350058E-01     0   452    12     0     0     0
   412  0.34620595E+00     0   456    11     0     0     0
   412  0.22638765E+00     0   457    11     0     0     0
   4
   413  0.99650425E+00     0   450     1     0     0     0
   413  0.94054727E-03     0   451     1     0     0     0
   413  0.50688582E-03     0   452     1     0     0     0
   413  0.20483416E-02     0   453     1     0     0     0
   4
   414  0.99647188E+00     0   450     2     0     0     0
   414  0.94277185E-03     0   451     2     0     0     0
   414  0.51251682E-03     0   452     2     0     0     0
   414  0.20728407E-02     0   453     2     0     0     0
   4
   415  0.99650425E+00     0   450     3     0     0     0
   415  0.94054727E-03     0   451     3     0     0     0
   415  0.50688582E-03     0   452     3     0     0     0
   415  0.20483416E-02     0   453     3     0     0     0
   4
   416  0.99647188E+00     0   450     4     0     0     0
   416  0.94277144E-03     0   451     4     0     0     0
   416  0.51251496E-03     0   452     4     0     0     0
   416  0.20728328E-02     0   453     4     0     0     0
   7
   417  0.53348999E-01     0   450     5     0     0     0
   417  0.58261961E-01     0   451     5     0     0     0
   417  0.93005061E-01     0   452     5     0     0     0
   417  0.11002717E+00     0   453     5     0     0     0
   417  0.98503888E-01     0   456     6     0     0     0
   417  0.44211793E+00     0   457     6     0     0     0
   417  0.14473498E+00     0   199   406     0     0     0
   8
   418  0.24458632E+00     0   454     5     0     0     0
   418  0.14675368E+00     0   455     5     0     0     0
   418  0.10344073E+00     0   200   406     0     0     0
   418  0.63552037E-01     0   203   406     0     0     0
   418  0.21001285E-01     0   450     6     0     0     0
   418  0.10671049E+00     0   451     6     0     0     0
   418  0.10222687E+00     0   452     6     0     0     0
   418  0.21172857E+00     0   453     6     0     0     0
   4
   419  0.99650425E+00     0   450     7     0     0     0
   419  0.94054727E-03     0   451     7     0     0     0
   419  0.50688582E-03     0   452     7     0     0     0
   419  0.20483416E-02     0   453     7     0     0     0
   4
   420  0.99647188E+00     0   450     8     0     0     0
   420  0.94277185E-03     0   451     8     0     0     0
   420  0.51251682E-03     0   452     8     0     0     0
   420  0.20728407E-02     0   453     8     0     0     0
   4
   421  0.99650425E+00     0   450     9     0     0     0
   421  0.94054727E-03     0   451     9     0     0     0
   421  0.50688582E-03     0   452     9     0     0     0
   421  0.20483416E-02     0   453     9     0     0     0
   4
   422  0.99647188E+00     0   450    10     0     0     0
   422  0.94277144E-03     0   451    10     0     0     0
   422  0.51251496E-03     0   452    10     0     0     0
   422  0.20728328E-02     0   453    10     0     0     0
   7
   423  0.53348999E-01     0   450    11     0     0     0
   423  0.58261961E-01     0   451    11     0     0     0
   423  0.93005061E-01     0   452    11     0     0     0
   423  0.11002717E+00     0   453    11     0     0     0
   423  0.98503888E-01     0   454    12     0     0     0
   423  0.44211793E+00     0   455    12     0     0     0
   423  0.14473498E+00     0   198   412     0     0     0
   8
   424  0.24458632E+00     0   456    11     0     0     0
   424  0.14675368E+00     0   457    11     0     0     0
   424  0.10344073E+00     0   200   412     0     0     0
   424  0.63552037E-01     0   203   412     0     0     0
   424  0.21001285E-01     0   450    12     0     0     0
   424  0.10671049E+00     0   451    12     0     0     0
   424  0.10222687E+00     0   452    12     0     0     0
   424  0.21172857E+00     0   453    12     0     0     0
   4
   425  0.91699398E+00     0   450   121     0     0     0
   425  0.25396639E-04     0   429   121   131     0     0
   425  0.52007737E-04     0   435   121   125     0     0
   425  0.82928605E-01     0   121   130     0     0     0
   5
   426  0.91987377E+00     0   450   122     0     0     0
   426  0.15759450E-04     0   429   122   131     0     0
   426  0.35011068E-04     0   435   122   125     0     0
   426  0.15245550E-03     0   435   121   126     0     0
   426  0.79922959E-01     0   129   121     0     0     0
   4
   427  0.91701663E+00     0   450   123     0     0     0
   427  0.25429645E-04     0   429   123   131     0     0
   427  0.52060583E-04     0   435   123   125     0     0
   427  0.82905829E-01     0   121   128     0     0     0
   5
   428  0.91989905E+00     0   450   124     0     0     0
   428  0.15779899E-04     0   429   124   131     0     0
   428  0.35046498E-04     0   435   124   125     0     0
   428  0.15261133E-03     0   435   123   126     0     0
   428  0.79897560E-01     0   127   121     0     0     0
   3
   429  0.37995599E-01     0   125   130     0     0     0
   429  0.48094535E+00     0   125   124     0     0     0
   429  0.48105904E+00     0   123   126     0     0     0
   2
   430  0.25099444E+00     0   450   126     0     0     0
   430  0.74900556E+00     0   198   429     0     0     0
   4
   431  0.91699398E+00     0   450   127     0     0     0
   431  0.25396639E-04     0   435   127   125     0     0
   431  0.52007737E-04     0   429   127   131     0     0
   431  0.82928605E-01     0   127   124     0     0     0
   5
   432  0.91987377E+00     0   450   128     0     0     0
   432  0.15759450E-04     0   435   128   125     0     0
   432  0.35011068E-04     0   429   128   131     0     0
   432  0.15245550E-03     0   429   127   132     0     0
   432  0.79922959E-01     0   123   127     0     0     0
   4
   433  0.91701663E+00     0   450   129     0     0     0
   433  0.25429645E-04     0   435   129   125     0     0
   433  0.52060583E-04     0   429   129   131     0     0
   433  0.82905829E-01     0   127   122     0     0     0
   5
   434  0.91989905E+00     0   450   130     0     0     0
   434  0.15779899E-04     0   435   130   125     0     0
   434  0.35046498E-04     0   429   130   131     0     0
   434  0.15261133E-03     0   429   129   132     0     0
   434  0.79897560E-01     0   121   127     0     0     0
   3
   435  0.37995599E-01     0   131   124     0     0     0
   435  0.48094535E+00     0   131   130     0     0     0
   435  0.48105904E+00     0   129   132     0     0     0
   2
   436  0.25099444E+00     0   450   132     0     0     0
   436  0.74900556E+00     0   199   435     0     0     0
   4
   437  0.14648277E-03     0   429   121   131     0     0
   437  0.18119809E-03     0   435   121   125     0     0
   437  0.49983600E+00     0   123   122     0     0     0
   437  0.49983633E+00     0   121   124     0     0     0
   0
   2
   439  0.44850805E+00     0   429   123   131     0     0
   439  0.55149192E+00     0   435   123   125     0     0
   0
   3
   441  0.27863508E+00     0   450   125     0     0     0
   441  0.38139376E+00     0   200   429     0     0     0
   441  0.33997115E+00     0   203   429     0     0     0
   0
   4
   443  0.14648277E-03     0   435   127   125     0     0
   443  0.18119809E-03     0   429   127   131     0     0
   443  0.49983600E+00     0   129   128     0     0     0
   443  0.49983633E+00     0   127   130     0     0     0
   0
   2
   445  0.44850805E+00     0   435   129   125     0     0
   445  0.55149192E+00     0   429   129   131     0     0
   0
   3
   447  0.27863508E+00     0   450   131     0     0     0
   447  0.38139376E+00     0   200   435     0     0     0
   447  0.33997115E+00     0   203   435     0     0     0
   0
  32
   449  0.14070621E-02     0   454     5    12     0     0
   449  0.14070621E-02     0   456     6    11     0     0
   449  0.58286625E-03     0   455     5    12     0     0
   449  0.58286625E-03     0   457     6    11     0     0
   449  0.22418257E-03     0   450     6    12     0     0
   449  0.11506747E-02     0   451     6    12     0     0
   449  0.45148583E-04     0   452    13     0     0     0
   449  0.59015647E-03     0   452     6    12     0     0
   449  0.34820001E-04     0   453    13     0     0     0
   449  0.19866608E-02     0   453     6    12     0     0
   449  0.21088278E-01     0   408     2     0     0     0
   449  0.21088278E-01     0   402     8     0     0     0
   449  0.19832361E-01     0   407     1     0     0     0
   449  0.19832361E-01     0   401     7     0     0     0
   449  0.41860878E-01     0   420     2     0     0     0
   449  0.41860878E-01     0   414     8     0     0     0
   449  0.44551596E-01     0   419     1     0     0     0
   449  0.44551596E-01     0   413     7     0     0     0
   449  0.19832265E-01     0   409     3     0     0     0
   449  0.19832265E-01     0   403     9     0     0     0
   449  0.44551555E-01     0   421     3     0     0     0
   449  0.44551555E-01     0   415     9     0     0     0
   449  0.21086000E-01     0   410     4     0     0     0
   449  0.21086000E-01     0   404    10     0     0     0
   449  0.41858595E-01     0   422     4     0     0     0
   449  0.41858595E-01     0   416    10     0     0     0
   449  0.77822961E-01     0   411     5     0     0     0
   449  0.77822961E-01     0   405    11     0     0     0
   449  0.53897452E-01     0   423     5     0     0     0
   449  0.53897452E-01     0   417    11     0     0     0
   449  0.10961231E+00     0   412     6     0     0     0
   449  0.10961231E+00     0   406    12     0     0     0
   6
   450  0.15349331E-01     0   437   127     0     0     0
   450  0.15349331E-01     0   443   121     0     0     0
   450  0.12815358E-01     0   439   129     0     0     0
   450  0.12815358E-01     0   445   123     0     0     0
   450  0.47183532E+00     0   429   131     0     0     0
   450  0.47183532E+00     0   435   125     0     0     0
  20
   451  0.22424671E-02     0   450   200     0     0     0
   451  0.19629734E-01     0   450   203     0     0     0
   451  0.53428363E-01     0   425   127     0     0     0
   451  0.53428363E-01     0   431   121     0     0     0
   451  0.53315707E-01     0   427   129     0     0     0
   451  0.53315707E-01     0   433   123     0     0     0
   451  0.10124350E-02     0   437   127     0     0     0
   451  0.10124350E-02     0   443   121     0     0     0
   451  0.10080294E-02     0   439   129     0     0     0
   451  0.10080294E-02     0   445   123     0     0     0
   451  0.11387224E+00     0   429   131     0     0     0
   451  0.11387224E+00     0   435   125     0     0     0
   451  0.36736749E-01     0   441   131     0     0     0
   451  0.36736749E-01     0   447   125     0     0     0
   451  0.72168902E-01     0   426   128     0     0     0
   451  0.72168902E-01     0   432   122     0     0     0
   451  0.72043188E-01     0   428   130     0     0     0
   451  0.72043188E-01     0   434   124     0     0     0
   451  0.85478283E-01     0   430   132     0     0     0
   451  0.85478283E-01     0   436   126     0     0     0
  25
   452  0.26899734E+00     0   454   199     0     0     0
   452  0.26899734E+00     0   456   198     0     0     0
   452  0.91830909E-01     0   450   200     0     0     0
   452  0.23441142E+00     0   451   200     0     0     0
   452  0.23016526E-04     0   450     5    11     0     0
   452  0.18106053E-01     0   450   203     0     0     0
   452  0.92122229E-02     0   451   203     0     0     0
   452  0.18831063E-03     0   425   127     0     0     0
   452  0.18831063E-03     0   431   121     0     0     0
   452  0.18826696E-03     0   427   129     0     0     0
   452  0.18826696E-03     0   433   123     0     0     0
   452  0.43294975E-03     0   437   127     0     0     0
   452  0.43294975E-03     0   443   121     0     0     0
   452  0.43236898E-03     0   439   129     0     0     0
   452  0.43236898E-03     0   445   123     0     0     0
   452  0.29680679E-01     0   429   131     0     0     0
   452  0.29680679E-01     0   435   125     0     0     0
   452  0.20459909E-01     0   441   131     0     0     0
   452  0.20459909E-01     0   447   125     0     0     0
   452  0.93565695E-03     0   426   128     0     0     0
   452  0.93565695E-03     0   432   122     0     0     0
   452  0.93544490E-03     0   428   130     0     0     0
   452  0.93544490E-03     0   434   124     0     0     0
   452  0.95727219E-03     0   430   132     0     0     0
   452  0.95727219E-03     0   436   126     0     0     0
  25
   453  0.25583836E+00     0   454   199     0     0     0
   453  0.25583836E+00     0   456   198     0     0     0
   453  0.17864566E-01     0   450   200     0     0     0
   453  0.12930318E-01     0   451   200     0     0     0
   453  0.19638832E-04     0   450     5    11     0     0
   453  0.72124638E-01     0   450   203     0     0     0
   453  0.18797036E+00     0   451   203     0     0     0
   453  0.61172619E-02     0   425   127     0     0     0
   453  0.61172619E-02     0   431   121     0     0     0
   453  0.61159236E-02     0   427   129     0     0     0
   453  0.61159236E-02     0   433   123     0     0     0
   453  0.16477022E-02     0   437   127     0     0     0
   453  0.16477022E-02     0   443   121     0     0     0
   453  0.16455904E-02     0   439   129     0     0     0
   453  0.16455904E-02     0   445   123     0     0     0
   453  0.17163416E-01     0   429   131     0     0     0
   453  0.17163416E-01     0   435   125     0     0     0
   453  0.27731096E-01     0   441   131     0     0     0
   453  0.27731096E-01     0   447   125     0     0     0
   453  0.12670725E-01     0   426   128     0     0     0
   453  0.12670725E-01     0   432   122     0     0     0
   453  0.12668013E-01     0   428   130     0     0     0
   453  0.12668013E-01     0   434   124     0     0     0
   453  0.12947149E-01     0   430   132     0     0     0
   453  0.12947149E-01     0   436   126     0     0     0
   8
   454  0.21360749E-01     0   450   198     0     0     0
   454  0.15412126E+00     0   426   127     0     0     0
   454  0.15385295E+00     0   428   129     0     0     0
   454  0.18534347E+00     0   430   131     0     0     0
   454  0.10031401E+00     0   431   122     0     0     0
   454  0.10010319E+00     0   433   124     0     0     0
   454  0.21753348E+00     0   435   126     0     0     0
   454  0.67370877E-01     0   447   126     0     0     0
  11
   455  0.86078368E-01     0   450   198     0     0     0
   455  0.26706091E+00     0   451   198     0     0     0
   455  0.11739387E-01     0   426   127     0     0     0
   455  0.11736877E-01     0   428   129     0     0     0
   455  0.46186544E-01     0   430   131     0     0     0
   455  0.26888469E-01     0   431   122     0     0     0
   455  0.26882596E-01     0   433   124     0     0     0
   455  0.28623059E-01     0   435   126     0     0     0
   455  0.41559312E-01     0   447   126     0     0     0
   455  0.24672680E+00     0   454   200     0     0     0
   455  0.20651770E+00     0   454   203     0     0     0
   8
   456  0.21360749E-01     0   450   199     0     0     0
   456  0.15412126E+00     0   432   121     0     0     0
   456  0.15385295E+00     0   434   123     0     0     0
   456  0.18534347E+00     0   436   125     0     0     0
   456  0.10031401E+00     0   425   128     0     0     0
   456  0.10010319E+00     0   427   130     0     0     0
   456  0.21753348E+00     0   429   132     0     0     0
   456  0.67370877E-01     0   441   132     0     0     0
  11
   457  0.86078368E-01     0   450   199     0     0     0
   457  0.26706091E+00     0   451   199     0     0     0
   457  0.11739387E-01     0   432   121     0     0     0
   457  0.11736877E-01     0   434   123     0     0     0
   457  0.46186544E-01     0   436   125     0     0     0
   457  0.26888469E-01     0   425   128     0     0     0
   457  0.26882596E-01     0   427   130     0     0     0
   457  0.28623059E-01     0   429   132     0     0     0
   457  0.41559312E-01     0   441   132     0     0     0
   457  0.24672680E+00     0   456   200     0     0     0
   457  0.20651770E+00     0   456   203     0     0     0
  28
   203  0.17182648E-03     0   123   129     0     0     0
   203  0.49145989E-01     0   125   131     0     0     0
   203  0.20632553E-02     0     3     9     0     0     0
   203  0.81377530E+00     0     5    11     0     0     0
   203  0.38175080E-01     0     4    10     0     0     0
   203  0.15202223E-02     0    59    59     0     0     0
   203  0.31364672E-01     0    13    13     0     0     0
   203  0.32905319E-02     0   198   121   128     0     0
   203  0.32905319E-02     0   198   123   130     0     0
   203  0.32905319E-02     0   198   125   132     0     0
   203  0.98715955E-02     0   198     8     1     0     0
   203  0.98715955E-02     0   198    10     3     0     0
   203  0.32905319E-02     0   199   127   122     0     0
   203  0.32905319E-02     0   199   129   124     0     0
   203  0.32905319E-02     0   199   131   126     0     0
   203  0.98715955E-02     0   199     2     7     0     0
   203  0.98715955E-02     0   199     4     9     0     0
   203  0.31145362E-03     0   200   122   128     0     0
   203  0.31145362E-03     0   200   124   130     0     0
   203  0.31145362E-03     0   200   126   132     0     0
   203  0.15675147E-03     0   200   121   127     0     0
   203  0.15675147E-03     0   200   123   129     0     0
   203  0.15675147E-03     0   200   125   131     0     0
   203  0.53701724E-03     0   200     2     8     0     0
   203  0.53701724E-03     0   200     4    10     0     0
   203  0.69181056E-03     0   200     1     7     0     0
   203  0.69181056E-03     0   200     3     9     0     0
   203  0.69181056E-03     0   200     5    11     0     0
  13
   204  0.23021278E-03     0   123   129     0     0     0
   204  0.65933593E-01     0   125   131     0     0     0
   204  0.27087559E-02     0     3     9     0     0     0
   204  0.84944093E+00     0     5    11     0     0     0
   204  0.63924687E-02     0     6    12     0     0     0
   204  0.17985802E-04     0    13    13     0     0     0
   204  0.24626590E-04     0   198   199     0     0     0
   204  0.12053080E-04     0   200   200     0     0     0
   204  0.56181411E-03     0   450   450     0     0     0
   204  0.79196144E-03     0   450   451     0     0     0
   204  0.16020609E-01     0   429   435     0     0     0
   204  0.28932502E-01     0   429   447     0     0     0
   204  0.28932502E-01     0   441   435     0     0     0
  12
   205  0.22896132E-03     0   123   129     0     0     0
   205  0.65577075E-01     0   125   131     0     0     0
   205  0.26940615E-02     0     3     9     0     0     0
   205  0.84505904E+00     0     5    11     0     0     0
   205  0.78719882E-02     0     6    12     0     0     0
   205  0.35260975E-04     0    13    13     0     0     0
   205  0.98689541E-03     0   450   450     0     0     0
   205  0.42772149E-02     0   450   451     0     0     0
   205  0.22773063E-04     0   203   200     0     0     0
   205  0.15600039E-01     0   429   435     0     0     0
   205  0.28823346E-01     0   429   447     0     0     0
   205  0.28823346E-01     0   441   435     0     0     0
   7
   206  0.27559343E-03     0   124   129     0     0     0
   206  0.78933045E-01     0   126   131     0     0     0
   206  0.29699327E-02     0     4     9     0     0     0
   206  0.81727755E+00     0     6    11     0     0     0
   206  0.61048917E-02     0   454   450     0     0     0
   206  0.28328901E-04     0   203   198     0     0     0
   206  0.94410643E-01     0   435   430     0     0     0
   7
   207  0.27559343E-03     0   130   123     0     0     0
   207  0.78933045E-01     0   132   125     0     0     0
   207  0.29699327E-02     0    10     3     0     0     0
   207  0.81727755E+00     0    12     5     0     0     0
   207  0.61048917E-02     0   456   450     0     0     0
   207  0.28328901E-04     0   203   199     0     0     0
   207  0.94410643E-01     0   429   436     0     0     0
   0
   5
     6  0.33333334E+00   100     2     7     5     0     0
     6  0.33333334E+00   100     4     9     5     0     0
     6  0.11111111E+00   100   122   127     5     0     0
     6  0.11111111E+00   100   124   129     5     0     0
     6  0.11111111E+00   100   126   131     5     0     0
   5
    12  0.33333334E+00   100     8     1    11     0     0
    12  0.33333334E+00   100    10     3    11     0     0
    12  0.11111111E+00   100   128   121    11     0     0
    12  0.11111111E+00   100   130   123    11     0     0
    12  0.11111111E+00   100   132   125    11     0     0
     21.37150002     -0.04840804
      0.99608999     -0.01419833      0.08176509     -0.03029548
     -0.03441529     -0.96992588      0.20237786     -0.13077706
      0.03544495     -0.05252703     -0.70328063     -0.70808256
     -0.07324062      0.23724079      0.67657512     -0.69325227
     -0.98246235      0.18646096     -0.18646096     -0.98246235
     -0.95754182      0.28829437     -0.28829437     -0.95754182
     -1.12978315     -0.51222211     -1.29679310
   -899.16802979   2636.16992188   -962.22399902
    625.26599121
    F
  0.00000000E+00  0.00000000E+00  0.00000000E+00  0.47436900E-01  0.36393899E-22  0.00000000E+00  0.00000000E+00  0.00000000E+00 -0.21143600E-21 -0.47436900E-01 -0.36393899E-22  0.00000000E+00  0.00000000E+00  0.00000000E+00  0.00000000E+00  0.00000000E+00  0.00000000E+00 -0.10434500E-06  0.00000000E+00  0.00000000E+00  0.21143600E-21  0.00000000E+00  0.00000000E+00  0.10434500E-06  0.00000000E+00  0.00000000E+00  0.00000000E+00
  0.00000000E+00  0.00000000E+00  0.00000000E+00  0.00000000E+00  0.00000000E+00  0.00000000E+00  0.00000000E+00  0.00000000E+00 -0.28320301E-21  0.00000000E+00  0.00000000E+00  0.00000000E+00  0.00000000E+00  0.00000000E+00  0.00000000E+00  0.00000000E+00  0.00000000E+00 -0.13976199E-06  0.00000000E+00  0.00000000E+00  0.00000000E+00  0.00000000E+00  0.00000000E+00  0.00000000E+00  0.00000000E+00  0.00000000E+00  0.00000000E+00
  0.00000000E+00  0.00000000E+00  0.00000000E+00  0.00000000E+00  0.00000000E+00  0.00000000E+00  0.00000000E+00  0.00000000E+00  0.00000000E+00  0.00000000E+00  0.00000000E+00  0.00000000E+00  0.00000000E+00  0.00000000E+00  0.00000000E+00  0.00000000E+00  0.00000000E+00  0.00000000E+00  0.00000000E+00  0.00000000E+00  0.00000000E+00  0.00000000E+00  0.00000000E+00  0.00000000E+00  0.00000000E+00  0.00000000E+00  0.00000000E+00
