#  ISAJET SUSY parameters in SUSY Les Houches Accord 2 format
#  Created by ISALHA 2.0 Last revision: C. Balazs 21 Apr 2009
Block SPINFO   # Program information
     1   ISASUGRA from ISAJET          # Spectrum Calculator
     2   7.80   29-OCT-2009 12:50:36   # Version number
Block MODSEL   # Model selection
     1     2   # Minimal gauge mediated (GMSB) model               
Block SMINPUTS   # Standard Model inputs
     1     1.27836258E+02   # alpha_em^(-1)
     2     1.16570000E-05   # G_Fermi
     3     1.17200002E-01   # alpha_s(M_Z)
     4     9.11699982E+01   # m_{Z}(pole)
     5     4.19999981E+00   # m_{b}(m_{b})
     6     1.72500000E+02   # m_{top}(pole)
     7     1.77699995E+00   # m_{tau}(pole)
Block MINPAR   # SUSY breaking input parameters
     1     3.50000000E+04   # Lambda scale of soft SSB
     2     2.50000000E+05   # M_mess overall messenger scale
     3     1.50000000E+01   # tan(beta)
     4     1.00000000E+00   # sign(mu)
     5     3.00000000E+00   # N_5 messenger index
     6     1.00000000E+00   # c_grav gravitino mass factor
    51     3.00000000E+00   # N5_1  U(1)_Y messenger index
    52     3.00000000E+00   # N5_2 SU(2)_L messenger index
    53     3.00000000E+00   # N5_3 SU(3)_C messenger index
   101     1.00000000E+00   # Rsl
   102     0.00000000E+00   # dmH_d^2
   103     0.00000000E+00   # dmH_u^2
   104     0.00000000E+00   # d_Y
Block MASS   # Scalar and gaugino mass spectrum
#  PDG code   mass                 particle
        24     8.04229965E+01   #  W^+
        25     1.09785500E+02   #  h^0            
        35     3.65475525E+02   #  H^0            
        36     3.62859772E+02   #  A^0            
        37     3.74018494E+02   #  H^+            
   1000001     7.94714050E+02   #  dnl            
   1000002     7.90422913E+02   #  upl            
   1000003     7.94714050E+02   #  stl            
   1000004     7.90424194E+02   #  chl            
   1000005     7.52594910E+02   #  b1             
   1000006     6.98393433E+02   #  t1             
   1000011     2.35374130E+02   #  el-            
   1000012     2.19328918E+02   #  nuel           
   1000013     2.35374146E+02   #  mul-           
   1000014     2.19328918E+02   #  numl           
   1000015     1.10485817E+02   #  tau1           
   1000016     2.16071564E+02   #  nutl           
   1000021     8.12046692E+02   #  glss           
   1000022     1.36770432E+02   #  z1ss           
   1000023     2.36595963E+02   #  z2ss           
   1000024     2.36149292E+02   #  w1ss           
   1000025    -3.06523163E+02   #  z3ss           
   1000035     3.54184326E+02   #  z4ss           
   1000037     3.52907684E+02   #  w2ss           
   1000039     2.10492290E-09   #  gvss
   2000001     7.62829712E+02   #  dnr            
   2000002     7.64040894E+02   #  upr            
   2000003     7.62829712E+02   #  str            
   2000004     7.64042175E+02   #  chr            
   2000005     7.68780823E+02   #  b2             
   2000006     7.88234680E+02   #  t2             
   2000011     1.15433525E+02   #  er-            
   2000013     1.15433571E+02   #  mur-           
   2000015     2.36084824E+02   #  tau2           
Block ALPHA   # Effective Higgs mixing parameter
         -7.69007429E-02   # alpha
Block STOPMIX   # stop mixing matrix
  1  1     3.53159219E-01   # O_{11}
  1  2     9.35563266E-01   # O_{12}
  2  1    -9.35563266E-01   # O_{21}
  2  2     3.53159219E-01   # O_{22}
Block SBOTMIX   # sbottom mixing matrix
  1  1     6.37528479E-01   # O_{11}
  1  2     7.70426750E-01   # O_{12}
  2  1    -7.70426750E-01   # O_{21}
  2  2     6.37528479E-01   # O_{22}
Block STAUMIX   # stau mixing matrix
  1  1     1.79145232E-01   # O_{11}
  1  2     9.83822644E-01   # O_{12}
  2  1    -9.83822644E-01   # O_{21}
  2  2     1.79145232E-01   # O_{22}
Block NMIX   # neutralino mixing matrix
  1  1     9.71873760E-01   #
  1  2    -6.47106543E-02   #
  1  3     2.01970905E-01   #
  1  4    -1.02379844E-01   #
  2  1    -1.90315887E-01   #
  2  2    -7.67898858E-01   #
  2  3     4.73487675E-01   #
  2  4    -3.87196422E-01   #
  3  1     6.37845695E-02   #
  3  2    -8.56787860E-02   #
  3  3    -6.94869220E-01   #
  3  4    -7.11159706E-01   #
  4  1    -1.23177692E-01   #
  4  2     6.31508589E-01   #
  4  3     5.02170384E-01   #
  4  4    -5.77796996E-01   #
Block UMIX   # chargino U mixing matrix
  1  1    -7.20816731E-01   # U_{11}
  1  2     6.93125665E-01   # U_{12}
  2  1    -6.93125665E-01   # U_{21}
  2  2    -7.20816731E-01   # U_{22}
Block VMIX   # chargino V mixing matrix
  1  1    -8.27270448E-01   # V_{11}
  1  2     5.61803877E-01   # V_{12}
  2  1    -5.61803877E-01   # V_{21}
  2  2    -8.27270448E-01   # V_{22}
Block GAUGE Q=  6.96623413E+02   #
     1     3.57524991E-01   # g`
     2     6.52378619E-01   # g_2
     3     1.21928000E+00   # g_3
Block YU Q=  6.96623413E+02   #
  3  3     8.75642300E-01   # y_t
Block YD Q=  6.96623413E+02   #
  3  3     2.01861709E-01   # y_b
Block YE Q=  6.96623413E+02   #
  3  3     1.53293326E-01   # y_tau
Block HMIX Q=  6.96623413E+02   # Higgs mixing parameters
     1     2.98074615E+02   # mu(Q)
     2     1.50000000E+01   # tan(beta)(M_GUT)
     3     2.49810699E+02   # Higgs vev at Q
     4     1.31667219E+05   # m_A^2(Q)
Block MSOFT Q=  6.96623413E+02   # DRbar SUSY breaking parameters
     1     1.44734329E+02   # M_1(Q)          
     2     2.74025635E+02   # M_2(Q)          
     3     7.60814697E+02   # M_3(Q)          
    31     2.28825562E+02   # MeL(Q)          
    32     2.28825562E+02   # MmuL(Q)         
    33     2.25763504E+02   # MtauL(Q)        
    34     1.07610291E+02   # MeR(Q)          
    35     1.07610291E+02   # MmuR(Q)         
    36     1.05203918E+02   # MtauR(Q)        
    41     7.53412537E+02   # MqL1(Q)         
    42     7.53412537E+02   # MqL2(Q)         
    43     7.26447449E+02   # MqL3(Q)         
    44     7.26702942E+02   # MuR(Q)          
    45     7.26702942E+02   # McR(Q)          
    46     6.68023865E+02   # MtR(Q)          
    47     7.24210876E+02   # MdR(Q)          
    48     7.24210876E+02   # MsR(Q)          
    49     7.22271790E+02   # MbR(Q)          
Block AU Q=  6.96623413E+02   #
  1  1    -2.63311066E+02   # A_u
  2  2    -2.63311066E+02   # A_c
  3  3    -2.63311066E+02   # A_t
Block AD Q=  6.96623413E+02   #
  1  1    -2.98386139E+02   # A_d
  2  2    -2.98386139E+02   # A_s
  3  3    -2.98386139E+02   # A_b
Block AE Q=  6.96623413E+02   #
  1  1    -2.95472527E+01   # A_e
  2  2    -2.95472527E+01   # A_mu
  3  3    -2.95472527E+01   # A_tau
#  ISAJET decay tables in SUSY Les Houches accord format
#  Created by ISALHD. Last revision: C. Balazs, 2005 May 25
Block DCINFO                           # Program information
     1   ISASUGRA from ISAJET          # Spectrum Calculator
     2   7.80   29-OCT-2009 12:50:36   # Version number
#         PDG         Width
DECAY         6  1.14680779E+00   # TP    decays
#          BR          NDA       ID1       ID2       ID3       ID4
      3.33333343E-01    3            2        -1         5             # TP     -->  UP     DB     BT          
      3.33333343E-01    3            4        -3         5             # TP     -->  CH     SB     BT          
      1.11111112E-01    3          -11        12         5             # TP     -->  E+     NUE    BT          
      1.11111112E-01    3          -13        14         5             # TP     -->  MU+    NUM    BT          
      1.11111112E-01    3          -15        16         5             # TP     -->  TAU+   NUT    BT          
#         PDG         Width
DECAY   1000021  1.81147969E+00   # GLSS  decays
#          BR          NDA       ID1       ID2       ID3       ID4
      1.42172456E-03    3      1000024         5        -6             # GLSS   -->  W1SS+  BT     TB          
      1.42172456E-03    3     -1000024         6        -5             # GLSS   -->  W1SS-  TP     BB          
      2.63977190E-03    3      1000037         5        -6             # GLSS   -->  W2SS+  BT     TB          
      2.63977190E-03    3     -1000037         6        -5             # GLSS   -->  W2SS-  TP     BB          
      4.21061912E-07    2      1000022        21                       # GLSS   -->  Z1SS   GL                 
      1.57481560E-03    3      1000022         6        -6             # GLSS   -->  Z1SS   TP     TB          
      1.05767838E-04    2      1000023        21                       # GLSS   -->  Z2SS   GL                 
      1.93321216E-03    3      1000023         6        -6             # GLSS   -->  Z2SS   TP     TB          
      3.39619903E-04    2      1000025        21                       # GLSS   -->  Z3SS   GL                 
      2.71565840E-03    3      1000025         6        -6             # GLSS   -->  Z3SS   TP     TB          
      2.52611295E-04    2      1000035        21                       # GLSS   -->  Z4SS   GL                 
      2.82390765E-03    3      1000035         6        -6             # GLSS   -->  Z4SS   TP     TB          
      1.45631107E-02    2     -1000002         2                       # GLSS   -->  UBL    UP                 
      1.45631107E-02    2      1000002        -2                       # GLSS   -->  UPL    UB                 
      9.40682925E-03    2     -1000001         1                       # GLSS   -->  DBL    DN                 
      9.40682925E-03    2      1000001        -1                       # GLSS   -->  DNL    DB                 
      6.94320425E-02    2     -2000002         2                       # GLSS   -->  UBR    UP                 
      6.94320425E-02    2      2000002        -2                       # GLSS   -->  UPR    UB                 
      7.28676319E-02    2     -2000001         1                       # GLSS   -->  DBR    DN                 
      7.28676319E-02    2      2000001        -1                       # GLSS   -->  DNR    DB                 
      9.40623786E-03    2     -1000003         3                       # GLSS   -->  SBL    ST                 
      9.40623786E-03    2      1000003        -3                       # GLSS   -->  STL    SB                 
      7.28671253E-02    2     -2000003         3                       # GLSS   -->  SBR    ST                 
      7.28671253E-02    2      2000003        -3                       # GLSS   -->  STR    SB                 
      1.45337433E-02    2     -1000004         4                       # GLSS   -->  CBL    CH                 
      1.45337433E-02    2      1000004        -4                       # GLSS   -->  CHL    CB                 
      6.94026202E-02    2     -2000004         4                       # GLSS   -->  CBR    CH                 
      6.94026202E-02    2      2000004        -4                       # GLSS   -->  CHR    CB                 
      9.56351757E-02    2     -1000005         5                       # GLSS   -->  BB1    BT                 
      9.56351757E-02    2      1000005        -5                       # GLSS   -->  BT1    BB                 
      6.29509017E-02    2     -2000005         5                       # GLSS   -->  BB2    BT                 
      6.29509017E-02    2      2000005        -5                       # GLSS   -->  BT2    BB                 
      5.06507085E-08    2      1000039        21                       # GLSS   -->  GVSS   GL                 
#         PDG         Width
DECAY   1000002  7.74223137E+00   # UPL   decays
#          BR          NDA       ID1       ID2       ID3       ID4
      5.19510591E-03    2      1000022         2                       # UPL    -->  Z1SS   UP                 
      2.29535803E-01    2      1000023         2                       # UPL    -->  Z2SS   UP                 
      1.69836113E-03    2      1000025         2                       # UPL    -->  Z3SS   UP                 
      1.01784065E-01    2      1000035         2                       # UPL    -->  Z4SS   UP                 
      4.87887681E-01    2      1000024         1                       # UPL    -->  W1SS+  DN                 
      1.73898920E-01    2      1000037         1                       # UPL    -->  W2SS+  DN                 
#         PDG         Width
DECAY   1000001  7.58163023E+00   # DNL   decays
#          BR          NDA       ID1       ID2       ID3       ID4
      2.44859345E-02    2      1000022         1                       # DNL    -->  Z1SS   DN                 
      1.96921423E-01    2      1000023         1                       # DNL    -->  Z2SS   DN                 
      3.03081772E-03    2      1000025         1                       # DNL    -->  Z3SS   DN                 
      1.21223345E-01    2      1000035         1                       # DNL    -->  Z4SS   DN                 
      3.81106019E-01    2     -1000024         2                       # DNL    -->  W1SS-  UP                 
      2.73232400E-01    2     -1000037         2                       # DNL    -->  W2SS-  UP                 
#         PDG         Width
DECAY   1000003  7.58159161E+00   # STL   decays
#          BR          NDA       ID1       ID2       ID3       ID4
      2.44860593E-02    2      1000022         3                       # STL    -->  Z1SS   ST                 
      1.96922421E-01    2      1000023         3                       # STL    -->  Z2SS   ST                 
      3.03083309E-03    2      1000025         3                       # STL    -->  Z3SS   ST                 
      1.21223964E-01    2      1000035         3                       # STL    -->  Z4SS   ST                 
      3.81105363E-01    2     -1000024         4                       # STL    -->  W1SS-  CH                 
      2.73231357E-01    2     -1000037         4                       # STL    -->  W2SS-  CH                 
#         PDG         Width
DECAY   1000004  7.74222994E+00   # CHL   decays
#          BR          NDA       ID1       ID2       ID3       ID4
      5.19508496E-03    2      1000022         4                       # CHL    -->  Z1SS   CH                 
      2.29534730E-01    2      1000023         4                       # CHL    -->  Z2SS   CH                 
      1.69835286E-03    2      1000025         4                       # CHL    -->  Z3SS   CH                 
      1.01783477E-01    2      1000035         4                       # CHL    -->  Z4SS   CH                 
      4.87888843E-01    2      1000024         3                       # CHL    -->  W1SS+  ST                 
      1.73899546E-01    2      1000037         3                       # CHL    -->  W2SS+  ST                 
#         PDG         Width
DECAY   1000005  6.25935841E+00   # BT1   decays
#          BR          NDA       ID1       ID2       ID3       ID4
      7.55705461E-02    2      1000022         5                       # BT1    -->  Z1SS   BT                 
      1.65279880E-01    2      1000023         5                       # BT1    -->  Z2SS   BT                 
      2.22876091E-02    2      1000025         5                       # BT1    -->  Z3SS   BT                 
      2.20947359E-02    2      1000035         5                       # BT1    -->  Z4SS   BT                 
      3.72161150E-01    2     -1000024         6                       # BT1    -->  W1SS-  TP                 
      3.42606038E-01    2     -1000037         6                       # BT1    -->  W2SS-  TP                 
#         PDG         Width
DECAY   1000006  1.40218143E+01   # TP1   decays
#          BR          NDA       ID1       ID2       ID3       ID4
      9.06625912E-02    2      1000022         6                       # TP1    -->  Z1SS   TP                 
      1.24338582E-01    2      1000023         6                       # TP1    -->  Z2SS   TP                 
      2.52684027E-01    2      1000025         6                       # TP1    -->  Z3SS   TP                 
      4.97980602E-02    2      1000035         6                       # TP1    -->  Z4SS   TP                 
      3.22658002E-01    2      1000024         5                       # TP1    -->  W1SS+  BT                 
      1.59858659E-01    2      1000037         5                       # TP1    -->  W2SS+  BT                 
#         PDG         Width
DECAY   2000002  1.60072863E+00   # UPR   decays
#          BR          NDA       ID1       ID2       ID3       ID4
      9.54873323E-01    2      1000022         2                       # UPR    -->  Z1SS   UP                 
      3.19452323E-02    2      1000023         2                       # UPR    -->  Z2SS   UP                 
      3.09044658E-03    2      1000025         2                       # UPR    -->  Z3SS   UP                 
      1.00910254E-02    2      1000035         2                       # UPR    -->  Z4SS   UP                 
#         PDG         Width
DECAY   2000001  3.99450392E-01   # DNR   decays
#          BR          NDA       ID1       ID2       ID3       ID4
      9.54905152E-01    2      1000022         1                       # DNR    -->  Z1SS   DN                 
      3.19314823E-02    2      1000023         1                       # DNR    -->  Z2SS   DN                 
      3.08743212E-03    2      1000025         1                       # DNR    -->  Z3SS   DN                 
      1.00759324E-02    2      1000035         1                       # DNR    -->  Z4SS   DN                 
#         PDG         Width
DECAY   2000003  3.99450392E-01   # STR   decays
#          BR          NDA       ID1       ID2       ID3       ID4
      9.54905152E-01    2      1000022         3                       # STR    -->  Z1SS   ST                 
      3.19314823E-02    2      1000023         3                       # STR    -->  Z2SS   ST                 
      3.08743212E-03    2      1000025         3                       # STR    -->  Z3SS   ST                 
      1.00759324E-02    2      1000035         3                       # STR    -->  Z4SS   ST                 
#         PDG         Width
DECAY   2000004  1.60072112E+00   # CHR   decays
#          BR          NDA       ID1       ID2       ID3       ID4
      9.54873323E-01    2      1000022         4                       # CHR    -->  Z1SS   CH                 
      3.19452137E-02    2      1000023         4                       # CHR    -->  Z2SS   CH                 
      3.09044286E-03    2      1000025         4                       # CHR    -->  Z3SS   CH                 
      1.00910049E-02    2      1000035         4                       # CHR    -->  Z4SS   CH                 
#         PDG         Width
DECAY   2000005  9.01241589E+00   # BT2   decays
#          BR          NDA       ID1       ID2       ID3       ID4
      1.40988985E-02    2      1000022         5                       # BT2    -->  Z1SS   BT                 
      6.68821707E-02    2      1000023         5                       # BT2    -->  Z2SS   BT                 
      3.47807556E-02    2      1000025         5                       # BT2    -->  Z3SS   BT                 
      1.02435663E-01    2      1000035         5                       # BT2    -->  Z4SS   BT                 
      2.20266208E-01    2     -1000024         6                       # BT2    -->  W1SS-  TP                 
      5.61536312E-01    2     -1000037         6                       # BT2    -->  W2SS-  TP                 
#         PDG         Width
DECAY   2000006  1.46809683E+01   # TP2   decays
#          BR          NDA       ID1       ID2       ID3       ID4
      1.13123447E-01    2      1000024         5                       # TP2    -->  W1SS+  BT                 
      2.54261106E-01    2      1000037         5                       # TP2    -->  W2SS+  BT                 
      6.38149353E-03    2      1000022         6                       # TP2    -->  Z1SS   TP                 
      1.10279620E-01    2      1000023         6                       # TP2    -->  Z2SS   TP                 
      2.07082912E-01    2      1000025         6                       # TP2    -->  Z3SS   TP                 
      3.08871418E-01    2      1000035         6                       # TP2    -->  Z4SS   TP                 
#         PDG         Width
DECAY   1000011  9.58161578E-02   # EL-   decays
#          BR          NDA       ID1       ID2       ID3       ID4
      9.99743462E-01    2      1000022        11                       # EL-    -->  Z1SS   E-                 
      1.12647831E-04    3      1000015        11       -15             # EL-    -->  TAU1-  E-     TAU+        
      1.43840472E-04    3     -1000015        11        15             # EL-    -->  TAU1+  E-     TAU-        
      1.95915550E-09    2           11   1000039                       # EL-    -->  E-     GVSS               
#         PDG         Width
DECAY   1000013  9.58160833E-02   # MUL-  decays
#          BR          NDA       ID1       ID2       ID3       ID4
      9.99743462E-01    2      1000022        13                       # MUL-   -->  Z1SS   MU-                
      1.12648122E-04    3      1000015        13       -15             # MUL-   -->  TAU1-  MU-    TAU+        
      1.43840822E-04    3     -1000015        13        15             # MUL-   -->  TAU1+  MU-    TAU-        
      1.95915595E-09    2           13   1000039                       # MUL-   -->  MU-    GVSS               
#         PDG         Width
DECAY   1000015  4.27363266E-12   # TAU1- decays
#          BR          NDA       ID1       ID2       ID3       ID4
      1.00000000E+00    2           15   1000039                       # TAU1-  -->  TAU-   GVSS               
#         PDG         Width
DECAY   1000012  1.23683028E-01   # NUEL  decays
#          BR          NDA       ID1       ID2       ID3       ID4
      9.99883771E-01    2      1000022        12                       # NUEL   -->  Z1SS   NUE                
      1.22565389E-05    3      1000015        12       -15             # NUEL   -->  TAU1-  NUE    TAU+        
      2.10035414E-05    3     -1000015        12        15             # NUEL   -->  TAU1+  NUE    TAU-        
      8.29214478E-05    3     -1000015        11        16             # NUEL   -->  TAU1+  E-     NUT         
      1.06630971E-09    2           12   1000039                       # NUEL   -->  NUE    GVSS               
#         PDG         Width
DECAY   1000014  1.23683028E-01   # NUML  decays
#          BR          NDA       ID1       ID2       ID3       ID4
      9.99883771E-01    2      1000022        14                       # NUML   -->  Z1SS   NUM                
      1.22565389E-05    3      1000015        14       -15             # NUML   -->  TAU1-  NUM    TAU+        
      2.10035414E-05    3     -1000015        14        15             # NUML   -->  TAU1+  NUM    TAU-        
      8.29299097E-05    3     -1000015        13        16             # NUML   -->  TAU1+  MU-    NUT         
      1.06630971E-09    2           14   1000039                       # NUML   -->  NUM    GVSS               
#         PDG         Width
DECAY   1000016  1.38190940E-01   # NUTL  decays
#          BR          NDA       ID1       ID2       ID3       ID4
      8.47868145E-01    2      1000022        16                       # NUTL   -->  Z1SS   NUT                
      1.52105674E-01    2           24   1000015                       # NUTL   -->  W+     TAU1-              
      1.07090291E-05    3     -1000015        16        15             # NUTL   -->  TAU1+  NUT    TAU-        
      1.55571615E-05    3      1000015        16       -15             # NUTL   -->  TAU1-  NUT    TAU+        
      8.85569285E-10    2           16   1000039                       # NUTL   -->  NUT    GVSS               
#         PDG         Width
DECAY   2000011  4.23766716E-10   # ER-   decays
#          BR          NDA       ID1       ID2       ID3       ID4
      3.97203237E-01    3      1000015        11       -15             # ER-    -->  TAU1-  E-     TAU+        
      5.90229332E-01    3     -1000015        11        15             # ER-    -->  TAU1+  E-     TAU-        
      2.49442932E-11    3      1000015        12       -16             # ER-    -->  TAU1-  NUE    ANUT        
      1.25674419E-02    2           11   1000039                       # ER-    -->  E-     GVSS               
#         PDG         Width
DECAY   2000013  4.23791779E-10   # MUR-  decays
#          BR          NDA       ID1       ID2       ID3       ID4
      3.97203207E-01    3      1000015        13       -15             # MUR-   -->  TAU1-  MU-    TAU+        
      5.90229034E-01    3     -1000015        13        15             # MUR-   -->  TAU1+  MU-    TAU-        
      1.06190930E-06    3      1000015        14       -16             # MUR-   -->  TAU1-  NUM    ANUT        
      1.25666829E-02    2           13   1000039                       # MUR-   -->  MU-    GVSS               
#         PDG         Width
DECAY   2000015  1.50431529E-01   # TAU2- decays
#          BR          NDA       ID1       ID2       ID3       ID4
      6.95704401E-01    2      1000022        15                       # TAU2-  -->  Z1SS   TAU-               
      1.24697782E-01    2           23   1000015                       # TAU2-  -->  Z0     TAU1-              
      1.79597855E-01    2           25   1000015                       # TAU2-  -->  HL0    TAU1-              
#         PDG         Width
DECAY   1000022  1.87000677E-01   # Z1SS  decays
#          BR          NDA       ID1       ID2       ID3       ID4
      1.45390257E-01    2      2000011       -11                       # Z1SS   -->  ER-    E+                 
      1.45390257E-01    2     -2000011        11                       # Z1SS   -->  ER+    E-                 
      1.45388216E-01    2      2000013       -13                       # Z1SS   -->  MUR-   MU+                
      1.45388216E-01    2     -2000013        13                       # Z1SS   -->  MUR+   MU-                
      2.09221482E-01    2      1000015       -15                       # Z1SS   -->  TAU1-  TAU+               
      2.09221482E-01    2     -1000015        15                       # Z1SS   -->  TAU1+  TAU-               
      4.47744342E-11    2      1000039        22                       # Z1SS   -->  GVSS   GM                 
      9.27684362E-13    3      1000039        11       -11             # Z1SS   -->  GVSS   E-     E+          
      1.78851736E-12    2      1000039        23                       # Z1SS   -->  GVSS   Z0                 
      3.98707556E-15    2      1000039        25                       # Z1SS   -->  GVSS   HL0                
#         PDG         Width
DECAY   1000023  1.61839753E-01   # Z2SS  decays
#          BR          NDA       ID1       ID2       ID3       ID4
      1.82261147E-07    2      1000022        22                       # Z2SS   -->  Z1SS   GM                 
      2.47424766E-02    2      1000022        23                       # Z2SS   -->  Z1SS   Z0                 
      4.38435492E-08    3      1000022         2        -2             # Z2SS   -->  Z1SS   UP     UB          
      7.05552026E-08    3      1000022         1        -1             # Z2SS   -->  Z1SS   DN     DB          
      7.05552026E-08    3      1000022         3        -3             # Z2SS   -->  Z1SS   ST     SB          
      4.38432473E-08    3      1000022         4        -4             # Z2SS   -->  Z1SS   CH     CB          
      7.04121521E-06    3      1000022         5        -5             # Z2SS   -->  Z1SS   BT     BB          
      1.23144400E-06    3      1000022        15       -15             # Z2SS   -->  Z1SS   TAU-   TAU+        
      2.48575234E-04    2      1000011       -11                       # Z2SS   -->  EL-    E+                 
      2.48575234E-04    2     -1000011        11                       # Z2SS   -->  EL+    E-                 
      2.47653661E-04    2      1000013       -13                       # Z2SS   -->  MUL-   MU+                
      2.47653661E-04    2     -1000013        13                       # Z2SS   -->  MUL+   MU-                
      7.81818181E-02    2      2000011       -11                       # Z2SS   -->  ER-    E+                 
      7.81818181E-02    2     -2000011        11                       # Z2SS   -->  ER+    E-                 
      7.81817585E-02    2      2000013       -13                       # Z2SS   -->  MUR-   MU+                
      7.81817585E-02    2     -2000013        13                       # Z2SS   -->  MUR+   MU-                
      2.39926577E-01    2      1000015       -15                       # Z2SS   -->  TAU1-  TAU+               
      2.39926577E-01    2     -1000015        15                       # Z2SS   -->  TAU1+  TAU-               
      2.67740227E-02    2      1000012       -12                       # Z2SS   -->  NUEL   ANUE               
      2.67740227E-02    2     -1000012        12                       # Z2SS   -->  ANUEL  NUE                
      2.67740227E-02    2      1000014       -14                       # Z2SS   -->  NUML   ANUM               
      2.67740227E-02    2     -1000014        14                       # Z2SS   -->  ANUML  NUM                
      3.72898541E-02    2      1000016       -16                       # Z2SS   -->  NUTL   ANUT               
      3.72898541E-02    2     -1000016        16                       # Z2SS   -->  ANUTL  NUT                
      3.42809947E-10    2      1000039        22                       # Z2SS   -->  GVSS   GM                 
      7.41417518E-12    3      1000039        11       -11             # Z2SS   -->  GVSS   E-     E+          
      2.66077160E-10    2      1000039        23                       # Z2SS   -->  GVSS   Z0                 
      2.75897898E-11    2      1000039        25                       # Z2SS   -->  GVSS   HL0                
#         PDG         Width
DECAY   1000025  2.43576169E-01   # Z3SS  decays
#          BR          NDA       ID1       ID2       ID3       ID4
      6.57963684E-11    2      1000022        22                       # Z3SS   -->  Z1SS   GM                 
      1.00534339E-06    2      1000023        22                       # Z3SS   -->  Z2SS   GM                 
      1.82392669E-03    3     -1000024         2        -1             # Z3SS   -->  W1SS-  UP     DB          
      6.07975584E-04    3     -1000024        12       -11             # Z3SS   -->  W1SS-  NUE    E+          
      6.07975584E-04    3     -1000024        14       -13             # Z3SS   -->  W1SS-  NUM    MU+         
      1.82392669E-03    3      1000024         1        -2             # Z3SS   -->  W1SS+  DN     UB          
      6.07975584E-04    3      1000024        11       -12             # Z3SS   -->  W1SS+  E-     ANUE        
      6.07975584E-04    3      1000024        13       -14             # Z3SS   -->  W1SS+  MU-    ANUM        
      1.82392669E-03    3     -1000024         4        -3             # Z3SS   -->  W1SS-  CH     SB          
      6.07975584E-04    3     -1000024        16       -15             # Z3SS   -->  W1SS-  NUT    TAU+        
      1.82392669E-03    3      1000024         3        -4             # Z3SS   -->  W1SS+  ST     CB          
      6.07975584E-04    3      1000024        15       -16             # Z3SS   -->  W1SS+  TAU-   ANUT        
      5.79677701E-01    2      1000022        23                       # Z3SS   -->  Z1SS   Z0                 
      8.79379414E-09    3      1000022         2        -2             # Z3SS   -->  Z1SS   UP     UB          
      4.05755918E-09    3      1000022         1        -1             # Z3SS   -->  Z1SS   DN     DB          
      4.05755918E-09    3      1000022         3        -3             # Z3SS   -->  Z1SS   ST     SB          
      8.79372664E-09    3      1000022         4        -4             # Z3SS   -->  Z1SS   CH     CB          
      9.08719994E-06    3      1000022         5        -5             # Z3SS   -->  Z1SS   BT     BB          
      1.40653844E-06    3      1000022        15       -15             # Z3SS   -->  Z1SS   TAU-   TAU+        
      3.51337279E-04    3      1000023         2        -2             # Z3SS   -->  Z2SS   UP     UB          
      4.51031519E-04    3      1000023         1        -1             # Z3SS   -->  Z2SS   DN     DB          
      4.51031519E-04    3      1000023         3        -3             # Z3SS   -->  Z2SS   ST     SB          
      3.51337279E-04    3      1000023         4        -4             # Z3SS   -->  Z2SS   CH     CB          
      4.35165857E-04    3      1000023         5        -5             # Z3SS   -->  Z2SS   BT     BB          
      1.02564591E-04    3      1000023        11       -11             # Z3SS   -->  Z2SS   E-     E+          
      1.02564591E-04    3      1000023        13       -13             # Z3SS   -->  Z2SS   MU-    MU+         
      1.01892583E-04    3      1000023        15       -15             # Z3SS   -->  Z2SS   TAU-   TAU+        
      2.04071286E-04    3      1000023        12       -12             # Z3SS   -->  Z2SS   NUE    ANUE        
      2.04071286E-04    3      1000023        14       -14             # Z3SS   -->  Z2SS   NUM    ANUM        
      2.04071286E-04    3      1000023        16       -16             # Z3SS   -->  Z2SS   NUT    ANUT        
      4.62951027E-02    2      1000022        25                       # Z3SS   -->  Z1SS   HL0                
      1.14287459E-03    2      1000011       -11                       # Z3SS   -->  EL-    E+                 
      1.14287459E-03    2     -1000011        11                       # Z3SS   -->  EL+    E-                 
      1.14287308E-03    2      1000013       -13                       # Z3SS   -->  MUL-   MU+                
      1.14287308E-03    2     -1000013        13                       # Z3SS   -->  MUL+   MU-                
      9.58926603E-03    2      2000011       -11                       # Z3SS   -->  ER-    E+                 
      9.58926603E-03    2     -2000011        11                       # Z3SS   -->  ER+    E-                 
      9.58926417E-03    2      2000013       -13                       # Z3SS   -->  MUR-   MU+                
      9.58926417E-03    2     -2000013        13                       # Z3SS   -->  MUR+   MU-                
      1.00253589E-01    2      1000015       -15                       # Z3SS   -->  TAU1-  TAU+               
      1.00253589E-01    2     -1000015        15                       # Z3SS   -->  TAU1+  TAU-               
      3.01770270E-02    2      2000015       -15                       # Z3SS   -->  TAU2-  TAU+               
      3.01770270E-02    2     -2000015        15                       # Z3SS   -->  TAU2+  TAU-               
      9.19463951E-03    2      1000012       -12                       # Z3SS   -->  NUEL   ANUE               
      9.19463951E-03    2     -1000012        12                       # Z3SS   -->  ANUEL  NUE                
      9.19463951E-03    2      1000014       -14                       # Z3SS   -->  NUML   ANUM               
      9.19463951E-03    2     -1000014        14                       # Z3SS   -->  ANUML  NUM                
      9.77224857E-03    2      1000016       -16                       # Z3SS   -->  NUTL   ANUT               
      9.77224857E-03    2     -1000016        16                       # Z3SS   -->  ANUTL  NUT                
      6.17820844E-13    2      1000039        22                       # Z3SS   -->  GVSS   GM                 
      1.36272389E-14    3      1000039        11       -11             # Z3SS   -->  GVSS   E-     E+          
      4.60800287E-10    2      1000039        23                       # Z3SS   -->  GVSS   Z0                 
      4.84489060E-10    2      1000039        25                       # Z3SS   -->  GVSS   HL0                
#         PDG         Width
DECAY   1000035  2.02602530E+00   # Z4SS  decays
#          BR          NDA       ID1       ID2       ID3       ID4
      1.93140259E-09    2      1000022        22                       # Z4SS   -->  Z1SS   GM                 
      1.47890788E-07    2      1000023        22                       # Z4SS   -->  Z2SS   GM                 
      9.70225287E-08    2      1000025        22                       # Z4SS   -->  Z3SS   GM                 
      1.35956749E-01    2      1000024       -24                       # Z4SS   -->  W1SS+  W-                 
      1.35956749E-01    2     -1000024        24                       # Z4SS   -->  W1SS-  W+                 
      1.43718869E-12    3     -1000037         2        -1             # Z4SS   -->  W2SS-  UP     DB          
      4.79062861E-13    3     -1000037        12       -11             # Z4SS   -->  W2SS-  NUE    E+          
      4.79062861E-13    3     -1000037        14       -13             # Z4SS   -->  W2SS-  NUM    MU+         
      1.43718869E-12    3      1000037         1        -2             # Z4SS   -->  W2SS+  DN     UB          
      4.79062861E-13    3      1000037        11       -12             # Z4SS   -->  W2SS+  E-     ANUE        
      4.79062861E-13    3      1000037        13       -14             # Z4SS   -->  W2SS+  MU-    ANUM        
      9.26479232E-03    2      1000022        23                       # Z4SS   -->  Z1SS   Z0                 
      3.25179804E-04    2      1000023        23                       # Z4SS   -->  Z2SS   Z0                 
      5.70044421E-08    3      1000022         2        -2             # Z4SS   -->  Z1SS   UP     UB          
      1.48289686E-07    3      1000022         1        -1             # Z4SS   -->  Z1SS   DN     DB          
      1.48289686E-07    3      1000022         3        -3             # Z4SS   -->  Z1SS   ST     SB          
      5.70040264E-08    3      1000022         4        -4             # Z4SS   -->  Z1SS   CH     CB          
      7.05148238E-07    3      1000022         5        -5             # Z4SS   -->  Z1SS   BT     BB          
      8.89647822E-08    3      1000022        15       -15             # Z4SS   -->  Z1SS   TAU-   TAU+        
      1.40831162E-07    3      1000023         2        -2             # Z4SS   -->  Z2SS   UP     UB          
      1.32007997E-07    3      1000023         1        -1             # Z4SS   -->  Z2SS   DN     DB          
      1.32007997E-07    3      1000023         3        -3             # Z4SS   -->  Z2SS   ST     SB          
      1.40830110E-07    3      1000023         4        -4             # Z4SS   -->  Z2SS   CH     CB          
      1.61925925E-07    3      1000023         5        -5             # Z4SS   -->  Z2SS   BT     BB          
      1.21969310E-11    3      1000023        15       -15             # Z4SS   -->  Z2SS   TAU-   TAU+        
      8.59469947E-06    3      1000025         2        -2             # Z4SS   -->  Z3SS   UP     UB          
      1.11256631E-05    3      1000025         1        -1             # Z4SS   -->  Z3SS   DN     DB          
      1.11256631E-05    3      1000025         3        -3             # Z4SS   -->  Z3SS   ST     SB          
      8.59469947E-06    3      1000025         4        -4             # Z4SS   -->  Z3SS   CH     CB          
      9.92127116E-06    3      1000025         5        -5             # Z4SS   -->  Z3SS   BT     BB          
      2.51842289E-06    3      1000025        11       -11             # Z4SS   -->  Z3SS   E-     E+          
      2.51842289E-06    3      1000025        13       -13             # Z4SS   -->  Z3SS   MU-    MU+         
      2.46956802E-06    3      1000025        15       -15             # Z4SS   -->  Z3SS   TAU-   TAU+        
      5.01086970E-06    3      1000025        12       -12             # Z4SS   -->  Z3SS   NUE    ANUE        
      5.01086970E-06    3      1000025        14       -14             # Z4SS   -->  Z3SS   NUM    ANUM        
      5.01086970E-06    3      1000025        16       -16             # Z4SS   -->  Z3SS   NUT    ANUT        
      3.92926037E-02    2      1000022        25                       # Z4SS   -->  Z1SS   HL0                
      2.43118592E-03    2      1000023        25                       # Z4SS   -->  Z2SS   HL0                
      3.64646614E-02    2      1000011       -11                       # Z4SS   -->  EL-    E+                 
      3.64646614E-02    2     -1000011        11                       # Z4SS   -->  EL+    E-                 
      3.64646465E-02    2      1000013       -13                       # Z4SS   -->  MUL-   MU+                
      3.64646465E-02    2     -1000013        13                       # Z4SS   -->  MUL+   MU-                
      5.38863707E-03    2      2000011       -11                       # Z4SS   -->  ER-    E+                 
      5.38863707E-03    2     -2000011        11                       # Z4SS   -->  ER+    E-                 
      5.38863568E-03    2      2000013       -13                       # Z4SS   -->  MUR-   MU+                
      5.38863568E-03    2     -2000013        13                       # Z4SS   -->  MUR+   MU-                
      4.42112191E-03    2      1000015       -15                       # Z4SS   -->  TAU1-  TAU+               
      4.42112191E-03    2     -1000015        15                       # Z4SS   -->  TAU1+  TAU-               
      4.25706096E-02    2      2000015       -15                       # Z4SS   -->  TAU2-  TAU+               
      4.25706096E-02    2     -2000015        15                       # Z4SS   -->  TAU2+  TAU-               
      6.83734789E-02    2      1000012       -12                       # Z4SS   -->  NUEL   ANUE               
      6.83734789E-02    2     -1000012        12                       # Z4SS   -->  ANUEL  NUE                
      6.83734789E-02    2      1000014       -14                       # Z4SS   -->  NUML   ANUM               
      6.83734789E-02    2     -1000014        14                       # Z4SS   -->  ANUML  NUM                
      7.09040835E-02    2      1000016       -16                       # Z4SS   -->  NUTL   ANUT               
      7.09040835E-02    2     -1000016        16                       # Z4SS   -->  ANUTL  NUT                
      2.75254611E-11    2      1000039        22                       # Z4SS   -->  GVSS   GM                 
      6.13722614E-13    3      1000039        11       -11             # Z4SS   -->  GVSS   E-     E+          
      3.05105552E-10    2      1000039        23                       # Z4SS   -->  GVSS   Z0                 
      6.89413873E-11    2      1000039        25                       # Z4SS   -->  GVSS   HL0                
#         PDG         Width
DECAY   1000024  1.16585866E-01   # W1SS+ decays
#          BR          NDA       ID1       ID2       ID3       ID4
      1.11292067E-07    3      1000022         2        -1             # W1SS+  -->  Z1SS   UP     DB          
      1.11291840E-07    3      1000022         4        -3             # W1SS+  -->  Z1SS   CH     SB          
      1.92341133E-07    3      1000022       -15        16             # W1SS+  -->  Z1SS   TAU+   NUT         
      1.70320868E-01    2      1000022        24                       # W1SS+  -->  Z1SS   W+                 
      1.10130496E-01    2      1000012       -11                       # W1SS+  -->  NUEL   E+                 
      1.10128507E-01    2      1000014       -13                       # W1SS+  -->  NUML   MU+                
      1.65978596E-01    2      1000016       -15                       # W1SS+  -->  NUTL   TAU+               
      1.90304621E-04    2     -1000011        12                       # W1SS+  -->  EL+    NUE                
      1.90296472E-04    2     -1000013        14                       # W1SS+  -->  MUL+   NUM                
      4.43059385E-01    2     -1000015        16                       # W1SS+  -->  TAU1+  NUT                
      1.17344155E-06    2     -2000015        16                       # W1SS+  -->  TAU2+  NUT                
#         PDG         Width
DECAY   1000037  1.69083953E+00   # W2SS+ decays
#          BR          NDA       ID1       ID2       ID3       ID4
      1.99101436E-07    3      1000022         2        -1             # W2SS+  -->  Z1SS   UP     DB          
      1.99101137E-07    3      1000022         4        -3             # W2SS+  -->  Z1SS   CH     SB          
      3.48466500E-08    3      1000022       -15        16             # W2SS+  -->  Z1SS   TAU+   NUT         
      3.58062349E-02    2      1000022        24                       # W2SS+  -->  Z1SS   W+                 
      1.07987702E-07    3      1000023         2        -1             # W2SS+  -->  Z2SS   UP     DB          
      1.07987383E-07    3      1000023         4        -3             # W2SS+  -->  Z2SS   CH     SB          
      1.47911251E-07    3      1000023       -15        16             # W2SS+  -->  Z2SS   TAU+   NUT         
      1.48778036E-01    2      1000023        24                       # W2SS+  -->  Z2SS   W+                 
      3.45039880E-05    3      1000025         2        -1             # W2SS+  -->  Z3SS   UP     DB          
      3.45039880E-05    3      1000025         4        -3             # W2SS+  -->  Z3SS   CH     SB          
      1.14939194E-05    3      1000025       -11        12             # W2SS+  -->  Z3SS   E+     NUE         
      1.14939194E-05    3      1000025       -13        14             # W2SS+  -->  Z3SS   MU+    NUM         
      1.14945869E-05    3      1000025       -15        16             # W2SS+  -->  Z3SS   TAU+   NUT         
      1.04453236E-01    2      1000012       -11                       # W2SS+  -->  NUEL   E+                 
      1.04453236E-01    2      1000014       -13                       # W2SS+  -->  NUML   MU+                
      1.17447183E-01    2      1000016       -15                       # W2SS+  -->  NUTL   TAU+               
      1.30090341E-01    2     -1000011        12                       # W2SS+  -->  EL+    NUE                
      1.30090266E-01    2     -1000013        14                       # W2SS+  -->  MUL+   NUM                
      1.45001640E-03    2     -1000015        16                       # W2SS+  -->  TAU1+  NUT                
      1.36221260E-01    2     -2000015        16                       # W2SS+  -->  TAU2+  NUT                
      8.52958485E-02    2      1000024        23                       # W2SS+  -->  W1SS+  Z0                 
      1.99011907E-07    3      1000024         1        -1             # W2SS+  -->  W1SS+  DN     DB          
      1.99010387E-07    3      1000024         3        -3             # W2SS+  -->  W1SS+  ST     SB          
      2.24246946E-07    3      1000024         2        -2             # W2SS+  -->  W1SS+  UP     UB          
      2.24246946E-07    3      1000024         4        -4             # W2SS+  -->  W1SS+  CH     CB          
      5.80918975E-03    2      1000024        25                       # W2SS+  -->  W1SS+  HL0                
#         PDG         Width
DECAY        25  4.87342849E-03   # HL0   decays
#          BR          NDA       ID1       ID2       ID3       ID4
      5.10641796E-09    2           11       -11                       # HL0    -->  E-     E+                 
      2.15601001E-04    2           13       -13                       # HL0    -->  MU-    MU+                
      6.16547242E-02    2           15       -15                       # HL0    -->  TAU-   TAU+               
      6.41360157E-06    2            1        -1                       # HL0    -->  DN     DB                 
      2.59141577E-03    2            3        -3                       # HL0    -->  ST     SB                 
      8.55115056E-01    2            5        -5                       # HL0    -->  BT     BB                 
      1.53620840E-06    2            2        -2                       # HL0    -->  UP     UB                 
      2.91265864E-02    2            4        -4                       # HL0    -->  CH     CB                 
      1.25159416E-03    2           22        22                       # HL0    -->  GM     GM                 
      2.83557605E-02    2           21        21                       # HL0    -->  GL     GL                 
      1.14685111E-03    3           24        11       -12             # HL0    -->  W+     E-     ANUE        
      1.14685111E-03    3           24        13       -14             # HL0    -->  W+     MU-    ANUM        
      1.14685111E-03    3           24        15       -16             # HL0    -->  W+     TAU-   ANUT        
      3.44055309E-03    3           24        -2         1             # HL0    -->  W+     UB     DN          
      3.44055309E-03    3           24        -4         3             # HL0    -->  W+     CB     ST          
      1.14685111E-03    3          -24       -11        12             # HL0    -->  W-     E+     NUE         
      1.14685111E-03    3          -24       -13        14             # HL0    -->  W-     MU+    NUM         
      1.14685111E-03    3          -24       -15        16             # HL0    -->  W-     TAU+   NUT         
      3.44055309E-03    3          -24         2        -1             # HL0    -->  W-     UP     DB          
      3.44055309E-03    3          -24         4        -3             # HL0    -->  W-     CH     SB          
      7.10342647E-05    3           23        12       -12             # HL0    -->  Z0     NUE    ANUE        
      7.10342647E-05    3           23        14       -14             # HL0    -->  Z0     NUM    ANUM        
      7.10342647E-05    3           23        16       -16             # HL0    -->  Z0     NUT    ANUT        
      3.57508325E-05    3           23        11       -11             # HL0    -->  Z0     E-     E+          
      3.57508325E-05    3           23        13       -13             # HL0    -->  Z0     MU-    MU+         
      3.57508325E-05    3           23        15       -15             # HL0    -->  Z0     TAU-   TAU+        
      1.22479323E-04    3           23         2        -2             # HL0    -->  Z0     UP     UB          
      1.22479323E-04    3           23         4        -4             # HL0    -->  Z0     CH     CB          
      1.57783536E-04    3           23         1        -1             # HL0    -->  Z0     DN     DB          
      1.57783536E-04    3           23         3        -3             # HL0    -->  Z0     ST     SB          
      1.57783536E-04    3           23         5        -5             # HL0    -->  Z0     BT     BB          
#         PDG         Width
DECAY        35  1.37522411E+00   # HH0   decays
#          BR          NDA       ID1       ID2       ID3       ID4
      1.01464748E-08    2           11       -11                       # HH0    -->  E-     E+                 
      4.28402273E-04    2           13       -13                       # HH0    -->  MU-    MU+                
      1.22683629E-01    2           15       -15                       # HH0    -->  TAU-   TAU+               
      1.25459164E-05    2            1        -1                       # HH0    -->  DN     DB                 
      5.06918505E-03    2            3        -3                       # HH0    -->  ST     SB                 
      8.52919638E-01    2            5        -5                       # HH0    -->  BT     BB                 
      1.05925810E-10    2            2        -2                       # HH0    -->  UP     UB                 
      1.69250563E-06    2            4        -4                       # HH0    -->  CH     CB                 
      4.99428296E-03    2            6        -6                       # HH0    -->  TP     TB                 
      6.16712896E-07    2           22        22                       # HH0    -->  GM     GM                 
      1.26942512E-04    2           21        21                       # HH0    -->  GL     GL                 
      9.23999236E-04    2           24       -24                       # HH0    -->  W+     W-                 
      4.37509792E-04    2           23        23                       # HH0    -->  Z0     Z0                 
      8.76413658E-03    2      1000022   1000022                       # HH0    -->  Z1SS   Z1SS               
      3.16781900E-03    2           25        25                       # HH0    -->  HL0    HL0                
      1.56669354E-04    2      2000011  -2000011                       # HH0    -->  ER-    ER+                
      1.56484020E-04    2      2000013  -2000013                       # HH0    -->  MUR-   MUR+               
      1.44094302E-04    2      1000015  -1000015                       # HH0    -->  TAU1-  TAU1+              
      6.20399442E-06    2      1000015  -2000015                       # HH0    -->  TAU1-  TAU2+              
      6.20399442E-06    2      2000015  -1000015                       # HH0    -->  TAU2-  TAU1+              
#         PDG         Width
DECAY        36  1.41754603E+00   # HA0   decays
#          BR          NDA       ID1       ID2       ID3       ID4
      9.78761516E-09    2           11       -11                       # HA0    -->  E-     E+                 
      4.13250702E-04    2           13       -13                       # HA0    -->  MU-    MU+                
      1.18355684E-01    2           15       -15                       # HA0    -->  TAU-   TAU+               
      1.21030844E-05    2            1        -1                       # HA0    -->  DN     DB                 
      4.89025889E-03    2            3        -3                       # HA0    -->  ST     SB                 
      8.23132575E-01    2            5        -5                       # HA0    -->  BT     BB                 
      7.64958513E-11    2            2        -2                       # HA0    -->  UP     UB                 
      1.22344954E-06    2            4        -4                       # HA0    -->  CH     CB                 
      3.04061417E-02    2            6        -6                       # HA0    -->  TP     TB                 
      1.01144877E-07    2           22        22                       # HA0    -->  GM     GM                 
      4.18718519E-05    2           21        21                       # HA0    -->  GL     GL                 
      2.20409688E-02    2      1000022   1000022                       # HA0    -->  Z1SS   Z1SS               
      6.82108861E-04    2           25        23                       # HA0    -->  HL0    Z0                 
      3.54041471E-12    2      1000011  -2000011                       # HA0    -->  EL-    ER+                
      3.54041471E-12    2      2000011  -1000011                       # HA0    -->  ER-    EL+                
      1.49482347E-07    2      1000013  -2000013                       # HA0    -->  MUL-   MUR+               
      1.49482347E-07    2      2000013  -1000013                       # HA0    -->  MUR-   MUL+               
      1.16953406E-05    2      1000015  -2000015                       # HA0    -->  TAU1-  TAU2+              
      1.16953406E-05    2      2000015  -1000015                       # HA0    -->  TAU2-  TAU1+              
#         PDG         Width
DECAY        37  9.17289972E-01   # H+    decays
#          BR          NDA       ID1       ID2       ID3       ID4
      1.55905582E-08    2           12       -11                       # H+     -->  NUE    E+                 
      6.58261415E-04    2           14       -13                       # H+     -->  NUM    MU+                
      1.88527673E-01    2           16       -15                       # H+     -->  NUT    TAU+               
      1.75555433E-05    2            2        -1                       # H+     -->  UP     DB                 
      7.09486008E-03    2            4        -3                       # H+     -->  CH     SB                 
      7.84031570E-01    2            6        -5                       # H+     -->  TP     BB                 
      1.82755962E-02    2      1000024   1000022                       # H+     -->  W1SS+  Z1SS               
      1.25319907E-03    2           25        24                       # H+     -->  HL0    W+                 
      1.41281227E-04    2     -1000015   1000016                       # H+     -->  TAU1+  NUTL               
