#  ISAJET SUSY parameters in Les Houches accord format
#  Created by ISALHA3. Last revision by C. Balazs on 2005 Jan. 10
Block SPINFO   # Program information
     1   ISASUGRA from ISAJET          # Spectrum Calculator
     2   7.79   16-DEC-2008 15:42:00   # Version number
Block MODSEL   # Model selection
     1     1   # Minimal supergravity (mSUGRA,CMSSM) model         
Block SMINPUTS   # Standard Model inputs
     1     1.27845573E+02   # alpha_em^(-1)
     2     1.16570000E-05   # G_Fermi
     3     1.17200002E-01   # alpha_s(M_Z)
     4     9.11699982E+01   # m_{Z}(pole)
     5     4.19999981E+00   # m_{b}(m_{b})
     6     1.72500000E+02   # m_{top}(pole)
     7     1.77699995E+00   # m_{tau}(pole)
Block MINPAR   # SUSY breaking input parameters
     1     3.20000000E+02   # m_0
     2     1.00000000E+02   # m_{1/2}
     3     3.00000000E+00   # tan(beta)
     4     1.00000000E+00   # sign(mu)
     5     0.00000000E+00   # A_0
#  
#  M_{GUT} =   0.29891349E+17
Block MASS   # Scalar and gaugino mass spectrum
#  PDG code   mass                 particle
        24     8.04229965E+01   #  W^+
        25     8.84931259E+01   #  h^0            
        35     4.19250275E+02   #  H^0            
        36     4.12847168E+02   #  A^0            
        37     4.22966797E+02   #  H^+            
   1000001     3.98188965E+02   #  dnl            
   1000002     3.91589020E+02   #  upl            
   1000003     3.98188995E+02   #  stl            
   1000004     3.91591400E+02   #  chl            
   1000005     3.37135895E+02   #  b1             
   1000006     2.44706680E+02   #  t1             
   1000011     3.28498260E+02   #  el-            
   1000012     3.20396606E+02   #  nuel           
   1000013     3.28498260E+02   #  mul-           
   1000014     3.20396606E+02   #  numl           
   1000015     3.22873871E+02   #  tau1           
   1000016     3.20267273E+02   #  nutl           
   1000021     2.82546204E+02   #  glss           
   1000022     2.84199524E+01   #  z1ss           
   1000023     5.87031822E+01   #  z2ss           
   1000024     5.28818665E+01   #  w1ss           
   1000025    -2.27838959E+02   #  z3ss           
   1000035     2.60121735E+02   #  z4ss           
   1000037     2.55465439E+02   #  w2ss           
   2000001     3.92223602E+02   #  dnr            
   2000002     3.90512115E+02   #  upr            
   2000003     3.92223633E+02   #  str            
   2000004     3.90514496E+02   #  chr            
   2000005     3.90766205E+02   #  b2             
   2000006     3.94916199E+02   #  t2             
   2000011     3.23966797E+02   #  er-            
   2000013     3.23966827E+02   #  mur-           
   2000015     3.29061523E+02   #  tau2           
#  Higgs mixing
Block ALPHA   # Effective Higgs mixing parameter
         -3.47960740E-01   # alpha
Block STOPMIX   # stop mixing matrix
  1  1     4.92843300E-01   # O_{11}
  1  2    -8.70118082E-01   # O_{12}
  2  1     8.70118082E-01   # O_{21}
  2  2     4.92843300E-01   # O_{22}
Block SBOTMIX   # sbottom mixing matrix
  1  1     9.98095691E-01   # O_{11}
  1  2    -6.16841875E-02   # O_{12}
  2  1     6.16841875E-02   # O_{21}
  2  2     9.98095691E-01   # O_{22}
Block STAUMIX   # stau mixing matrix
  1  1     3.44700277E-01   # O_{11}
  1  2    -9.38712776E-01   # O_{12}
  2  1     9.38712776E-01   # O_{21}
  2  2     3.44700277E-01   # O_{22}
Block NMIX   # neutralino mixing matrix
  1  1    -8.73548269E-01   #
  1  2     3.59237492E-01   #
  1  3    -2.99691498E-01   #
  1  4     1.34337336E-01   #
  2  1    -4.51353997E-01   #
  2  2    -8.49907935E-01   #
  2  3     2.37461612E-01   #
  2  4    -1.32468969E-01   #
  3  1     7.51538351E-02   #
  3  2    -1.19034499E-01   #
  3  3    -6.83013141E-01   #
  3  4    -7.16711581E-01   #
  4  1    -1.65965602E-01   #
  4  2     3.66654813E-01   #
  4  3     6.22326136E-01   #
  4  4    -6.71364069E-01   #
Block UMIX   # chargino U mixing matrix
  1  1    -8.77367496E-01   # U_{11}
  1  2     4.79819000E-01   # U_{12}
  2  1    -4.79819000E-01   # U_{21}
  2  2    -8.77367496E-01   # U_{22}
Block VMIX   # chargino V mixing matrix
  1  1    -9.62735415E-01   # V_{11}
  1  2     2.70445138E-01   # V_{12}
  2  1    -2.70445138E-01   # V_{21}
  2  2    -9.62735415E-01   # V_{22}
Block GAUGE Q=  2.73892242E+02   #
     1     3.57493669E-01   # g`
     2     6.52466059E-01   # g_2
     3     1.22121167E+00   # g_3
Block YU Q=  2.73892242E+02   #
  3  3     9.49144781E-01   # y_t
Block YD Q=  2.73892242E+02   #
  3  3     4.62115742E-02   # y_b
Block YE Q=  2.73892242E+02   #
  3  3     3.16604339E-02   # y_tau
Block HMIX Q=  2.73892242E+02   # Higgs mixing parameters
     1     2.22705490E+02   # mu(Q)
     2     3.00000000E+00   # tan(beta)(M_{GUT})
     3     2.49878433E+02   # Higgs vev at Q
     4     1.70442781E+05   # m_A^2(Q)
Block MSOFT Q=  2.73892242E+02   # DRbar SUSY breaking parameters
     1     3.96955376E+01   # M_1(Q)          
     2     7.59942780E+01   # M_2(Q)          
     3     2.50397430E+02   # M_3(Q)          
    31     3.25263794E+02   # MeL(Q)          
    32     3.25263794E+02   # MmuL(Q)         
    33     3.25137817E+02   # MtauL(Q)        
    34     3.21401886E+02   # MeR(Q)          
    35     3.21401886E+02   # MmuR(Q)         
    36     3.21113373E+02   # MtauR(Q)        
    41     3.82045990E+02   # MqL1(Q)         
    42     3.82045990E+02   # MqL2(Q)         
    43     3.20740204E+02   # MqL3(Q)         
    44     3.79296875E+02   # MuR(Q)          
    45     3.79296875E+02   # McR(Q)          
    46     2.33886993E+02   # MtR(Q)          
    47     3.78993225E+02   # MdR(Q)          
    48     3.78993225E+02   # MsR(Q)          
    49     3.80746826E+02   # MbR(Q)          
Block AU Q=  2.73892242E+02   #
  1  1    -1.87295547E+02   # A_u
  2  2    -1.87295547E+02   # A_c
  3  3    -1.87295547E+02   # A_t
Block AD Q=  2.73892242E+02   #
  1  1    -3.04803650E+02   # A_d
  2  2    -3.04803650E+02   # A_s
  3  3    -3.04803650E+02   # A_b
Block AE Q=  2.73892242E+02   #
  1  1    -6.47598648E+01   # A_e
  2  2    -6.47598648E+01   # A_mu
  3  3    -6.47598648E+01   # A_tau
#  ISAJET decay tables in SUSY Les Houches accord format
#  Created by ISALHD. Last revision: C. Balazs, 2005 May 25
Block DCINFO                           # Program information
     1   ISASUGRA from ISAJET          # Spectrum Calculator
     2   7.79   16-DEC-2008 15:42:00   # Version number
#         PDG         Width
DECAY         6  1.14680767E+00   # TP    decays
#          BR          NDA       ID1       ID2       ID3       ID4
      3.33333343E-01    3            2        -1         5             # TP     -->  UP     DB     BT          
      3.33333343E-01    3            4        -3         5             # TP     -->  CH     SB     BT          
      1.11111112E-01    3          -11        12         5             # TP     -->  E+     NUE    BT          
      1.11111112E-01    3          -13        14         5             # TP     -->  MU+    NUM    BT          
      1.11111112E-01    3          -15        16         5             # TP     -->  TAU+   NUT    BT          
#         PDG         Width
DECAY   1000021  5.19087771E-03   # GLSS  decays
#          BR          NDA       ID1       ID2       ID3       ID4
      1.19376108E-01    3      1000024         1        -2             # GLSS   -->  W1SS+  DN     UB          
      1.19376108E-01    3     -1000024         2        -1             # GLSS   -->  W1SS-  UP     DB          
      1.19373940E-01    3      1000024         3        -4             # GLSS   -->  W1SS+  ST     CB          
      1.19373940E-01    3     -1000024         4        -3             # GLSS   -->  W1SS-  CH     SB          
      4.34567966E-03    3      1000024         5        -6             # GLSS   -->  W1SS+  BT     TB          
      4.34567966E-03    3     -1000024         6        -5             # GLSS   -->  W1SS-  TP     BB          
      5.58464581E-06    3      1000037         1        -2             # GLSS   -->  W2SS+  DN     UB          
      5.58464581E-06    3     -1000037         2        -1             # GLSS   -->  W2SS-  UP     DB          
      5.58455667E-06    3      1000037         3        -4             # GLSS   -->  W2SS+  ST     CB          
      5.58455667E-06    3     -1000037         4        -3             # GLSS   -->  W2SS-  CH     SB          
      3.49217583E-03    2      1000022        21                       # GLSS   -->  Z1SS   GL                 
      3.60689834E-02    3      1000022         2        -2             # GLSS   -->  Z1SS   UP     UB          
      2.75876746E-02    3      1000022         1        -1             # GLSS   -->  Z1SS   DN     DB          
      2.75876634E-02    3      1000022         3        -3             # GLSS   -->  Z1SS   ST     SB          
      3.60678136E-02    3      1000022         4        -4             # GLSS   -->  Z1SS   CH     CB          
      5.79929873E-02    3      1000022         5        -5             # GLSS   -->  Z1SS   BT     BB          
      3.44902277E-03    2      1000023        21                       # GLSS   -->  Z2SS   GL                 
      6.94230050E-02    3      1000023         2        -2             # GLSS   -->  Z2SS   UP     UB          
      4.00209092E-02    3      1000023         1        -1             # GLSS   -->  Z2SS   DN     DB          
      4.00208943E-02    3      1000023         3        -3             # GLSS   -->  Z2SS   ST     SB          
      6.94207326E-02    3      1000023         4        -4             # GLSS   -->  Z2SS   CH     CB          
      1.00284494E-01    3      1000023         5        -5             # GLSS   -->  Z2SS   BT     BB          
      2.14270269E-03    2      1000025        21                       # GLSS   -->  Z3SS   GL                 
      2.49755044E-06    3      1000025         2        -2             # GLSS   -->  Z3SS   UP     UB          
      2.89459422E-06    3      1000025         1        -1             # GLSS   -->  Z3SS   DN     DB          
      2.89459331E-06    3      1000025         3        -3             # GLSS   -->  Z3SS   ST     SB          
      2.49744176E-06    3      1000025         4        -4             # GLSS   -->  Z3SS   CH     CB          
      1.82055610E-05    3      1000025         5        -5             # GLSS   -->  Z3SS   BT     BB          
      1.89420374E-04    2      1000035        21                       # GLSS   -->  Z4SS   GL                 
      1.11084387E-06    3      1000035         2        -2             # GLSS   -->  Z4SS   UP     UB          
      1.23511609E-06    3      1000035         1        -1             # GLSS   -->  Z4SS   DN     DB          
      1.23511541E-06    3      1000035         3        -3             # GLSS   -->  Z4SS   ST     SB          
      1.11079169E-06    3      1000035         4        -4             # GLSS   -->  Z4SS   CH     CB          
      4.05080345E-06    3      1000035         5        -5             # GLSS   -->  Z4SS   BT     BB          
#         PDG         Width
DECAY   1000002  1.06395969E+01   # UPL   decays
#          BR          NDA       ID1       ID2       ID3       ID4
      6.08271128E-03    2      1000022         2                       # UPL    -->  Z1SS   UP                 
      1.28755257E-01    2      1000023         2                       # UPL    -->  Z2SS   UP                 
      7.51128886E-04    2      1000025         2                       # UPL    -->  Z3SS   UP                 
      5.46842022E-03    2      1000035         2                       # UPL    -->  Z4SS   UP                 
      5.74659884E-01    2      1000021         2                       # UPL    -->  GLSS   UP                 
      2.76805460E-01    2      1000024         1                       # UPL    -->  W1SS+  DN                 
      7.47708231E-03    2      1000037         1                       # UPL    -->  W2SS+  DN                 
#         PDG         Width
DECAY   1000001  1.09055929E+01   # DNL   decays
#          BR          NDA       ID1       ID2       ID3       ID4
      4.10218574E-02    2      1000022         1                       # DNL    -->  Z1SS   DN                 
      8.65768567E-02    2      1000023         1                       # DNL    -->  Z2SS   DN                 
      1.22626405E-03    2      1000025         1                       # DNL    -->  Z3SS   DN                 
      7.96255469E-03    2      1000035         1                       # DNL    -->  Z4SS   DN                 
      6.10368848E-01    2      1000021         1                       # DNL    -->  GLSS   DN                 
      2.28343546E-01    2     -1000024         2                       # DNL    -->  W1SS-  UP                 
      2.45000813E-02    2     -1000037         2                       # DNL    -->  W2SS-  UP                 
#         PDG         Width
DECAY   1000003  1.09055195E+01   # STL   decays
#          BR          NDA       ID1       ID2       ID3       ID4
      4.10221368E-02    2      1000022         3                       # STL    -->  Z1SS   ST                 
      8.65774453E-02    2      1000023         3                       # STL    -->  Z2SS   ST                 
      1.22627255E-03    2      1000025         3                       # STL    -->  Z3SS   ST                 
      7.96261057E-03    2      1000035         3                       # STL    -->  Z4SS   ST                 
      6.10373199E-01    2      1000021         3                       # STL    -->  GLSS   ST                 
      2.28339657E-01    2     -1000024         4                       # STL    -->  W1SS-  CH                 
      2.44986303E-02    2     -1000037         4                       # STL    -->  W2SS-  CH                 
#         PDG         Width
DECAY   1000004  1.06391497E+01   # CHL   decays
#          BR          NDA       ID1       ID2       ID3       ID4
      6.08285842E-03    2      1000022         4                       # CHL    -->  Z1SS   CH                 
      1.28758311E-01    2      1000023         4                       # CHL    -->  Z2SS   CH                 
      7.51133601E-04    2      1000025         4                       # CHL    -->  Z3SS   CH                 
      5.46837226E-03    2      1000035         4                       # CHL    -->  Z4SS   CH                 
      5.74642837E-01    2      1000021         4                       # CHL    -->  GLSS   CH                 
      2.76818931E-01    2      1000024         3                       # CHL    -->  W1SS+  ST                 
      7.47757684E-03    2      1000037         3                       # CHL    -->  W2SS+  ST                 
#         PDG         Width
DECAY   1000005  4.44562483E+00   # BT1   decays
#          BR          NDA       ID1       ID2       ID3       ID4
      8.58620405E-02    2      1000022         5                       # BT1    -->  Z1SS   BT                 
      1.76631242E-01    2      1000023         5                       # BT1    -->  Z2SS   BT                 
      1.91831880E-03    2      1000025         5                       # BT1    -->  Z3SS   BT                 
      8.35012738E-03    2      1000035         5                       # BT1    -->  Z4SS   BT                 
      4.66863394E-01    2      1000021         5                       # BT1    -->  GLSS   BT                 
      2.43650943E-01    2     -1000024         6                       # BT1    -->  W1SS-  TP                 
      1.67239029E-02    2          -24   1000006                       # BT1    -->  W-     TP1                
#         PDG         Width
DECAY   1000006  1.43540454E+00   # TP1   decays
#          BR          NDA       ID1       ID2       ID3       ID4
      7.09191784E-02    2      1000022         6                       # TP1    -->  Z1SS   TP                 
      6.21892288E-02    2      1000023         6                       # TP1    -->  Z2SS   TP                 
      8.66891623E-01    2      1000024         5                       # TP1    -->  W1SS+  BT                 
#         PDG         Width
DECAY   2000002  6.87431145E+00   # UPR   decays
#          BR          NDA       ID1       ID2       ID3       ID4
      9.69578251E-02    2      1000022         2                       # UPR    -->  Z1SS   UP                 
      2.49921344E-02    2      1000023         2                       # UPR    -->  Z2SS   UP                 
      3.15564306E-04    2      1000025         2                       # UPR    -->  Z3SS   UP                 
      1.09467225E-03    2      1000035         2                       # UPR    -->  Z4SS   UP                 
      8.76639843E-01    2      1000021         2                       # UPR    -->  GLSS   UP                 
#         PDG         Width
DECAY   2000001  6.37900352E+00   # DNR   decays
#          BR          NDA       ID1       ID2       ID3       ID4
      2.62384806E-02    2      1000022         1                       # DNR    -->  Z1SS   DN                 
      6.76540472E-03    2      1000023         1                       # DNR    -->  Z2SS   DN                 
      8.61584849E-05    2      1000025         1                       # DNR    -->  Z3SS   DN                 
      3.00338841E-04    2      1000035         1                       # DNR    -->  Z4SS   DN                 
      9.66609597E-01    2      1000021         1                       # DNR    -->  GLSS   DN                 
#         PDG         Width
DECAY   2000003  6.37900591E+00   # STR   decays
#          BR          NDA       ID1       ID2       ID3       ID4
      2.62384731E-02    2      1000022         3                       # STR    -->  Z1SS   ST                 
      6.76540285E-03    2      1000023         3                       # STR    -->  Z2SS   ST                 
      8.61584849E-05    2      1000025         3                       # STR    -->  Z3SS   ST                 
      3.00338812E-04    2      1000035         3                       # STR    -->  Z4SS   ST                 
      9.66609597E-01    2      1000021         3                       # STR    -->  GLSS   ST                 
#         PDG         Width
DECAY   2000004  6.87385559E+00   # CHR   decays
#          BR          NDA       ID1       ID2       ID3       ID4
      9.69625115E-02    2      1000022         4                       # CHR    -->  Z1SS   CH                 
      2.49933321E-02    2      1000023         4                       # CHR    -->  Z2SS   CH                 
      3.15573794E-04    2      1000025         4                       # CHR    -->  Z3SS   CH                 
      1.09468820E-03    2      1000035         4                       # CHR    -->  Z4SS   CH                 
      8.76633883E-01    2      1000021         4                       # CHR    -->  GLSS   CH                 
#         PDG         Width
DECAY   2000005  6.23537016E+00   # BT2   decays
#          BR          NDA       ID1       ID2       ID3       ID4
      2.63189171E-02    2      1000022         5                       # BT2    -->  Z1SS   BT                 
      7.11713452E-03    2      1000023         5                       # BT2    -->  Z2SS   BT                 
      7.94064777E-04    2      1000025         5                       # BT2    -->  Z3SS   BT                 
      9.97987925E-04    2      1000035         5                       # BT2    -->  Z4SS   BT                 
      9.63771045E-01    2      1000021         5                       # BT2    -->  GLSS   BT                 
      2.66955787E-04    2     -1000024         6                       # BT2    -->  W1SS-  TP                 
      7.33917346E-04    2          -24   1000006                       # BT2    -->  W-     TP1                
#         PDG         Width
DECAY   2000006  3.51519442E+00   # TP2   decays
#          BR          NDA       ID1       ID2       ID3       ID4
      3.79442424E-01    2      1000024         5                       # TP2    -->  W1SS+  BT                 
      2.74209142E-01    2      1000037         5                       # TP2    -->  W2SS+  BT                 
      1.20890446E-01    2           23   1000006                       # TP2    -->  Z0     TP1                
      7.01748282E-02    2           25   1000006                       # TP2    -->  HL0    TP1                
      2.32031895E-03    2      1000022         6                       # TP2    -->  Z1SS   TP                 
      1.52962819E-01    2      1000023         6                       # TP2    -->  Z2SS   TP                 
#         PDG         Width
DECAY   1000011  3.71833801E+00   # EL-   decays
#          BR          NDA       ID1       ID2       ID3       ID4
      5.35304938E-03    2      1000022        11                       # EL-    -->  Z1SS   E-                 
      4.20141965E-01    2      1000023        11                       # EL-    -->  Z2SS   E-                 
      6.05072186E-04    2      1000025        11                       # EL-    -->  Z3SS   E-                 
      3.92456399E-03    2      1000035        11                       # EL-    -->  Z4SS   E-                 
      5.43229461E-01    2     -1000024        12                       # EL-    -->  W1SS-  NUE                
      2.67458688E-02    2     -1000037        12                       # EL-    -->  W2SS-  NUE                
#         PDG         Width
DECAY   1000013  3.71833754E+00   # MUL-  decays
#          BR          NDA       ID1       ID2       ID3       ID4
      5.35304938E-03    2      1000022        13                       # MUL-   -->  Z1SS   MU-                
      4.20141935E-01    2      1000023        13                       # MUL-   -->  Z2SS   MU-                
      6.05071837E-04    2      1000025        13                       # MUL-   -->  Z3SS   MU-                
      3.92455934E-03    2      1000035        13                       # MUL-   -->  Z4SS   MU-                
      5.43229520E-01    2     -1000024        14                       # MUL-   -->  W1SS-  NUM                
      2.67458707E-02    2     -1000037        14                       # MUL-   -->  W2SS-  NUM                
#         PDG         Width
DECAY   1000015  1.85551608E+00   # TAU1- decays
#          BR          NDA       ID1       ID2       ID3       ID4
      5.95679700E-01    2      1000022        15                       # TAU1-  -->  Z1SS   TAU-               
      2.51747012E-01    2      1000023        15                       # TAU1-  -->  Z2SS   TAU-               
      7.42757751E-04    2      1000025        15                       # TAU1-  -->  Z3SS   TAU-               
      2.42896960E-03    2      1000035        15                       # TAU1-  -->  Z4SS   TAU-               
      1.46211252E-01    2     -1000024        16                       # TAU1-  -->  W1SS-  NUT                
      3.19030322E-03    2     -1000037        16                       # TAU1-  -->  W2SS-  NUT                
#         PDG         Width
DECAY   1000012  3.82466793E+00   # NUEL  decays
#          BR          NDA       ID1       ID2       ID3       ID4
      2.44534180E-01    2      1000022        12                       # NUEL   -->  Z1SS   NUE                
      1.19289212E-01    2      1000023        12                       # NUEL   -->  Z2SS   NUE                
      2.21513817E-03    2      1000025        12                       # NUEL   -->  Z3SS   NUE                
      8.58913083E-03    2      1000035        12                       # NUEL   -->  Z4SS   NUE                
      6.18528724E-01    2      1000024        11                       # NUEL   -->  W1SS+  E-                 
      6.84362603E-03    2      1000037        11                       # NUEL   -->  W2SS+  E-                 
#         PDG         Width
DECAY   1000014  3.82466769E+00   # NUML  decays
#          BR          NDA       ID1       ID2       ID3       ID4
      2.44534194E-01    2      1000022        14                       # NUML   -->  Z1SS   NUM                
      1.19289219E-01    2      1000023        14                       # NUML   -->  Z2SS   NUM                
      2.21513840E-03    2      1000025        14                       # NUML   -->  Z3SS   NUM                
      8.58913176E-03    2      1000035        14                       # NUML   -->  Z4SS   NUM                
      6.18528664E-01    2      1000024        13                       # NUML   -->  W1SS+  MU-                
      6.84361532E-03    2      1000037        13                       # NUML   -->  W2SS+  MU-                
#         PDG         Width
DECAY   1000016  3.82470202E+00   # NUTL  decays
#          BR          NDA       ID1       ID2       ID3       ID4
      2.44430155E-01    2      1000022        16                       # NUTL   -->  Z1SS   NUT                
      1.19233310E-01    2      1000023        16                       # NUTL   -->  Z2SS   NUT                
      2.21056608E-03    2      1000025        16                       # NUTL   -->  Z3SS   NUT                
      8.55878461E-03    2      1000035        16                       # NUTL   -->  Z4SS   NUT                
      6.18521333E-01    2      1000024        15                       # NUTL   -->  W1SS+  TAU-               
      7.04584923E-03    2      1000037        15                       # NUTL   -->  W2SS+  TAU-               
#         PDG         Width
DECAY   2000011  1.56023204E+00   # ER-   decays
#          BR          NDA       ID1       ID2       ID3       ID4
      7.93548822E-01    2      1000022        11                       # ER-    -->  Z1SS   E-                 
      2.01255038E-01    2      1000023        11                       # ER-    -->  Z2SS   E-                 
      1.52363570E-03    2      1000025        11                       # ER-    -->  Z3SS   E-                 
      3.67245264E-03    2      1000035        11                       # ER-    -->  Z4SS   E-                 
#         PDG         Width
DECAY   2000013  1.56023204E+00   # MUR-  decays
#          BR          NDA       ID1       ID2       ID3       ID4
      7.93548822E-01    2      1000022        13                       # MUR-   -->  Z1SS   MU-                
      2.01255038E-01    2      1000023        13                       # MUR-   -->  Z2SS   MU-                
      1.52363535E-03    2      1000025        13                       # MUR-   -->  Z3SS   MU-                
      3.67244962E-03    2      1000035        13                       # MUR-   -->  Z4SS   MU-                
#         PDG         Width
DECAY   2000015  3.42491198E+00   # TAU2- decays
#          BR          NDA       ID1       ID2       ID3       ID4
      4.44009714E-02    2      1000022        15                       # TAU2-  -->  Z1SS   TAU-               
      4.11153108E-01    2      1000023        15                       # TAU2-  -->  Z2SS   TAU-               
      1.44167710E-03    2      1000025        15                       # TAU2-  -->  Z3SS   TAU-               
      4.93956730E-03    2      1000035        15                       # TAU2-  -->  Z4SS   TAU-               
      5.10421515E-01    2     -1000024        16                       # TAU2-  -->  W1SS-  NUT                
      2.76431348E-02    2     -1000037        16                       # TAU2-  -->  W2SS-  NUT                
#         PDG         Width
DECAY   1000023  1.46189279E-07   # Z2SS  decays
#          BR          NDA       ID1       ID2       ID3       ID4
      2.11952580E-03    2      1000022        22                       # Z2SS   -->  Z1SS   GM                 
      4.74041216E-02    3     -1000024         2        -1             # Z2SS   -->  W1SS-  UP     DB          
      1.58013739E-02    3     -1000024        12       -11             # Z2SS   -->  W1SS-  NUE    E+          
      1.58013739E-02    3     -1000024        14       -13             # Z2SS   -->  W1SS-  NUM    MU+         
      4.74041216E-02    3      1000024         1        -2             # Z2SS   -->  W1SS+  DN     UB          
      1.58013739E-02    3      1000024        11       -12             # Z2SS   -->  W1SS+  E-     ANUE        
      1.58013739E-02    3      1000024        13       -14             # Z2SS   -->  W1SS+  MU-    ANUM        
      4.74041216E-02    3     -1000024         4        -3             # Z2SS   -->  W1SS-  CH     SB          
      1.58013739E-02    3     -1000024        16       -15             # Z2SS   -->  W1SS-  NUT    TAU+        
      4.74041216E-02    3      1000024         3        -4             # Z2SS   -->  W1SS+  ST     CB          
      1.58013739E-02    3      1000024        15       -16             # Z2SS   -->  W1SS+  TAU-   ANUT        
      7.18926787E-02    3      1000022         2        -2             # Z2SS   -->  Z1SS   UP     UB          
      1.78197294E-01    3      1000022         1        -1             # Z2SS   -->  Z1SS   DN     DB          
      1.78197280E-01    3      1000022         3        -3             # Z2SS   -->  Z1SS   ST     SB          
      7.18926862E-02    3      1000022         4        -4             # Z2SS   -->  Z1SS   CH     CB          
      1.65581778E-01    3      1000022         5        -5             # Z2SS   -->  Z1SS   BT     BB          
      7.26840133E-03    3      1000022        11       -11             # Z2SS   -->  Z1SS   E-     E+          
      7.26840692E-03    3      1000022        13       -13             # Z2SS   -->  Z1SS   MU-    MU+         
      7.65540637E-03    3      1000022        15       -15             # Z2SS   -->  Z1SS   TAU-   TAU+        
      8.50674976E-03    3      1000022        12       -12             # Z2SS   -->  Z1SS   NUE    ANUE        
      8.50674976E-03    3      1000022        14       -14             # Z2SS   -->  Z1SS   NUM    ANUM        
      8.48828163E-03    3      1000022        16       -16             # Z2SS   -->  Z1SS   NUT    ANUT        
#         PDG         Width
DECAY   1000025  1.31729758E+00   # Z3SS  decays
#          BR          NDA       ID1       ID2       ID3       ID4
      5.78365984E-07    2      1000022        22                       # Z3SS   -->  Z1SS   GM                 
      3.19382742E-08    2      1000023        22                       # Z3SS   -->  Z2SS   GM                 
      3.20126474E-01    2      1000024       -24                       # Z3SS   -->  W1SS+  W-                 
      3.20126474E-01    2     -1000024        24                       # Z3SS   -->  W1SS-  W+                 
      2.10773185E-01    2      1000022        23                       # Z3SS   -->  Z1SS   Z0                 
      1.08493492E-01    2      1000023        23                       # Z3SS   -->  Z2SS   Z0                 
      4.72216897E-08    3      1000022         2        -2             # Z3SS   -->  Z1SS   UP     UB          
      1.24134829E-07    3      1000022         1        -1             # Z3SS   -->  Z1SS   DN     DB          
      1.24134786E-07    3      1000022         3        -3             # Z3SS   -->  Z1SS   ST     SB          
      4.72203041E-08    3      1000022         4        -4             # Z3SS   -->  Z1SS   CH     CB          
      4.53292472E-07    3      1000022         5        -5             # Z3SS   -->  Z1SS   BT     BB          
      1.54338707E-07    3      1000022        11       -11             # Z3SS   -->  Z1SS   E-     E+          
      1.54338636E-07    3      1000022        13       -13             # Z3SS   -->  Z1SS   MU-    MU+         
      2.36678900E-07    3      1000022        15       -15             # Z3SS   -->  Z1SS   TAU-   TAU+        
      4.65718244E-07    3      1000022        12       -12             # Z3SS   -->  Z1SS   NUE    ANUE        
      4.65718244E-07    3      1000022        14       -14             # Z3SS   -->  Z1SS   NUM    ANUM        
      4.66745576E-07    3      1000022        16       -16             # Z3SS   -->  Z1SS   NUT    ANUT        
      1.67570931E-07    3      1000023         2        -2             # Z3SS   -->  Z2SS   UP     UB          
      1.61062133E-07    3      1000023         1        -1             # Z3SS   -->  Z2SS   DN     DB          
      1.61062076E-07    3      1000023         3        -3             # Z3SS   -->  Z2SS   ST     SB          
      1.67565929E-07    3      1000023         4        -4             # Z3SS   -->  Z2SS   CH     CB          
      5.73311979E-07    3      1000023         5        -5             # Z3SS   -->  Z2SS   BT     BB          
      1.26753676E-07    3      1000023        11       -11             # Z3SS   -->  Z2SS   E-     E+          
      1.26753662E-07    3      1000023        13       -13             # Z3SS   -->  Z2SS   MU-    MU+         
      2.14923574E-07    3      1000023        15       -15             # Z3SS   -->  Z2SS   TAU-   TAU+        
      1.49173729E-07    3      1000023        12       -12             # Z3SS   -->  Z2SS   NUE    ANUE        
      1.49173729E-07    3      1000023        14       -14             # Z3SS   -->  Z2SS   NUM    ANUM        
      1.49515131E-07    3      1000023        16       -16             # Z3SS   -->  Z2SS   NUT    ANUT        
      3.06660365E-02    2      1000022        25                       # Z3SS   -->  Z1SS   HL0                
      9.80880111E-03    2      1000023        25                       # Z3SS   -->  Z2SS   HL0                
#         PDG         Width
DECAY   1000035  1.48493040E+00   # Z4SS  decays
#          BR          NDA       ID1       ID2       ID3       ID4
      5.12523911E-07    2      1000022        22                       # Z4SS   -->  Z1SS   GM                 
      1.59476349E-06    2      1000023        22                       # Z4SS   -->  Z2SS   GM                 
      2.13290576E-08    2      1000025        22                       # Z4SS   -->  Z3SS   GM                 
      3.74767512E-01    2      1000024       -24                       # Z4SS   -->  W1SS+  W-                 
      3.74767512E-01    2     -1000024        24                       # Z4SS   -->  W1SS-  W+                 
      7.74473596E-10    3     -1000037         2        -1             # Z4SS   -->  W2SS-  UP     DB          
      2.58157856E-10    3     -1000037        12       -11             # Z4SS   -->  W2SS-  NUE    E+          
      2.58157856E-10    3     -1000037        14       -13             # Z4SS   -->  W2SS-  NUM    MU+         
      7.74473596E-10    3      1000037         1        -2             # Z4SS   -->  W2SS+  DN     UB          
      2.58157856E-10    3      1000037        11       -12             # Z4SS   -->  W2SS+  E-     ANUE        
      2.58157856E-10    3      1000037        13       -14             # Z4SS   -->  W2SS+  MU-    ANUM        
      7.74473596E-10    3     -1000037         4        -3             # Z4SS   -->  W2SS-  CH     SB          
      2.58157856E-10    3     -1000037        16       -15             # Z4SS   -->  W2SS-  NUT    TAU+        
      7.74473596E-10    3      1000037         3        -4             # Z4SS   -->  W2SS+  ST     CB          
      2.58157856E-10    3      1000037        15       -16             # Z4SS   -->  W2SS+  TAU-   ANUT        
      3.59590873E-02    2      1000022        23                       # Z4SS   -->  Z1SS   Z0                 
      1.27945319E-02    2      1000023        23                       # Z4SS   -->  Z2SS   Z0                 
      8.40076723E-07    3      1000022         2        -2             # Z4SS   -->  Z1SS   UP     UB          
      3.11958820E-06    3      1000022         1        -1             # Z4SS   -->  Z1SS   DN     DB          
      3.11958661E-06    3      1000022         3        -3             # Z4SS   -->  Z1SS   ST     SB          
      8.40050916E-07    3      1000022         4        -4             # Z4SS   -->  Z1SS   CH     CB          
      7.52663755E-06    3      1000022         5        -5             # Z4SS   -->  Z1SS   BT     BB          
      2.33142123E-06    3      1000022        11       -11             # Z4SS   -->  Z1SS   E-     E+          
      2.33142032E-06    3      1000022        13       -13             # Z4SS   -->  Z1SS   MU-    MU+         
      2.41549969E-06    3      1000022        15       -15             # Z4SS   -->  Z1SS   TAU-   TAU+        
      1.16080191E-05    3      1000022        12       -12             # Z4SS   -->  Z1SS   NUE    ANUE        
      1.16080191E-05    3      1000022        14       -14             # Z4SS   -->  Z1SS   NUM    ANUM        
      1.16364836E-05    3      1000022        16       -16             # Z4SS   -->  Z1SS   NUT    ANUT        
      6.78844435E-06    3      1000023         2        -2             # Z4SS   -->  Z2SS   UP     UB          
      5.79707512E-06    3      1000023         1        -1             # Z4SS   -->  Z2SS   DN     DB          
      5.79707330E-06    3      1000023         3        -3             # Z4SS   -->  Z2SS   ST     SB          
      6.78823289E-06    3      1000023         4        -4             # Z4SS   -->  Z2SS   CH     CB          
      1.42169129E-05    3      1000023         5        -5             # Z4SS   -->  Z2SS   BT     BB          
      5.92765946E-06    3      1000023        11       -11             # Z4SS   -->  Z2SS   E-     E+          
      5.92765946E-06    3      1000023        13       -13             # Z4SS   -->  Z2SS   MU-    MU+         
      6.04832712E-06    3      1000023        15       -15             # Z4SS   -->  Z2SS   TAU-   TAU+        
      5.21790071E-06    3      1000023        12       -12             # Z4SS   -->  Z2SS   NUE    ANUE        
      5.21790071E-06    3      1000023        14       -14             # Z4SS   -->  Z2SS   NUM    ANUM        
      5.23092376E-06    3      1000023        16       -16             # Z4SS   -->  Z2SS   NUT    ANUT        
      2.17590832E-06    3      1000025         2        -2             # Z4SS   -->  Z3SS   UP     UB          
      2.84846760E-06    3      1000025         1        -1             # Z4SS   -->  Z3SS   DN     DB          
      2.84846760E-06    3      1000025         3        -3             # Z4SS   -->  Z3SS   ST     SB          
      2.17590878E-06    3      1000025         4        -4             # Z4SS   -->  Z3SS   CH     CB          
      2.19250387E-06    3      1000025         5        -5             # Z4SS   -->  Z3SS   BT     BB          
      6.47661068E-07    3      1000025        11       -11             # Z4SS   -->  Z3SS   E-     E+          
      6.47661068E-07    3      1000025        13       -13             # Z4SS   -->  Z3SS   MU-    MU+         
      6.20161359E-07    3      1000025        15       -15             # Z4SS   -->  Z3SS   TAU-   TAU+        
      1.24540634E-06    3      1000025        12       -12             # Z4SS   -->  Z3SS   NUE    ANUE        
      1.24540634E-06    3      1000025        14       -14             # Z4SS   -->  Z3SS   NUM    ANUM        
      1.24534881E-06    3      1000025        16       -16             # Z4SS   -->  Z3SS   NUT    ANUT        
      1.29986674E-01    2      1000022        25                       # Z4SS   -->  Z1SS   HL0                
      7.15743378E-02    2      1000023        25                       # Z4SS   -->  Z2SS   HL0                
#         PDG         Width
DECAY   1000024  3.68568658E-06   # W1SS+ decays
#          BR          NDA       ID1       ID2       ID3       ID4
      3.31941783E-01    3      1000022         2        -1             # W1SS+  -->  Z1SS   UP     DB          
      3.31941694E-01    3      1000022         4        -3             # W1SS+  -->  Z1SS   CH     SB          
      1.12034507E-01    3      1000022       -11        12             # W1SS+  -->  Z1SS   E+     NUE         
      1.12034507E-01    3      1000022       -13        14             # W1SS+  -->  Z1SS   MU+    NUM         
      1.12047508E-01    3      1000022       -15        16             # W1SS+  -->  Z1SS   TAU+   NUT         
#         PDG         Width
DECAY   1000037  1.48181033E+00   # W2SS+ decays
#          BR          NDA       ID1       ID2       ID3       ID4
      3.39442954E-06    3      1000022         2        -1             # W2SS+  -->  Z1SS   UP     DB          
      3.39442681E-06    3      1000022         4        -3             # W2SS+  -->  Z1SS   CH     SB          
      3.51192853E-06    3      1000022       -11        12             # W2SS+  -->  Z1SS   E+     NUE         
      3.51192853E-06    3      1000022       -13        14             # W2SS+  -->  Z1SS   MU+    NUM         
      3.69042232E-06    3      1000022       -15        16             # W2SS+  -->  Z1SS   TAU+   NUT         
      1.54811121E-03    2      1000022        24                       # W2SS+  -->  Z1SS   W+                 
      6.45540467E-06    3      1000023         2        -1             # W2SS+  -->  Z2SS   UP     DB          
      6.45534419E-06    3      1000023         4        -3             # W2SS+  -->  Z2SS   CH     SB          
      1.06891675E-05    3      1000023       -11        12             # W2SS+  -->  Z2SS   E+     NUE         
      1.06891675E-05    3      1000023       -13        14             # W2SS+  -->  Z2SS   MU+    NUM         
      1.07586875E-05    3      1000023       -15        16             # W2SS+  -->  Z2SS   TAU+   NUT         
      4.64034200E-01    2      1000023        24                       # W2SS+  -->  Z2SS   W+                 
      3.75750710E-06    3      1000025         2        -1             # W2SS+  -->  Z3SS   UP     DB          
      3.75750710E-06    3      1000025         4        -3             # W2SS+  -->  Z3SS   CH     SB          
      1.24843541E-06    3      1000025       -11        12             # W2SS+  -->  Z3SS   E+     NUE         
      1.24843541E-06    3      1000025       -13        14             # W2SS+  -->  Z3SS   MU+    NUM         
      1.24873452E-06    3      1000025       -15        16             # W2SS+  -->  Z3SS   TAU+   NUT         
      1.58197321E-02    2      1000006        -5                       # W2SS+  -->  TP1    BB                 
      3.24676692E-01    2      1000024        23                       # W2SS+  -->  W1SS+  Z0                 
      6.79104869E-06    3      1000024         1        -1             # W2SS+  -->  W1SS+  DN     DB          
      6.79083905E-06    3      1000024         3        -3             # W2SS+  -->  W1SS+  ST     SB          
      1.63141849E-05    3      1000024         2        -2             # W2SS+  -->  W1SS+  UP     UB          
      1.63141794E-05    3      1000024         4        -4             # W2SS+  -->  W1SS+  CH     CB          
      1.54280806E-05    3      1000024        12       -12             # W2SS+  -->  W1SS+  NUE    ANUE        
      1.54280806E-05    3      1000024        14       -14             # W2SS+  -->  W1SS+  NUM    ANUM        
      1.71164902E-05    3      1000024        16       -16             # W2SS+  -->  W1SS+  NUT    ANUT        
      6.86321982E-06    3      1000024        11       -11             # W2SS+  -->  W1SS+  E-     E+          
      6.86321982E-06    3      1000024        13       -13             # W2SS+  -->  W1SS+  MU-    MU+         
      6.88028695E-06    3      1000024        15       -15             # W2SS+  -->  W1SS+  TAU-   TAU+        
      1.93732694E-01    2      1000024        25                       # W2SS+  -->  W1SS+  HL0                
#         PDG         Width
DECAY        25  1.59591287E-02   # HL0   decays
#          BR          NDA       ID1       ID2       ID3       ID4
      1.09560816E-09    2           11       -11                       # HL0    -->  E-     E+                 
      4.62581629E-05    2           13       -13                       # HL0    -->  MU-    MU+                
      1.32171158E-02    2           15       -15                       # HL0    -->  TAU-   TAU+               
      1.38074688E-06    2            1        -1                       # HL0    -->  DN     DB                 
      5.57890336E-04    2            3        -3                       # HL0    -->  ST     SB                 
      1.89735949E-01    2            5        -5                       # HL0    -->  BT     BB                 
      3.73109344E-07    2            2        -2                       # HL0    -->  UP     UB                 
      7.31769018E-03    2            4        -4                       # HL0    -->  CH     CB                 
      2.39839719E-04    2           22        22                       # HL0    -->  GM     GM                 
      4.56556072E-03    2           21        21                       # HL0    -->  GL     GL                 
      7.72968769E-01    2      1000022   1000022                       # HL0    -->  Z1SS   Z1SS               
      1.13491798E-02    2      1000022   1000023                       # HL0    -->  Z1SS   Z2SS               
#         PDG         Width
DECAY        35  3.63052630E+00   # HH0   decays
#          BR          NDA       ID1       ID2       ID3       ID4
      1.73427300E-10    2           11       -11                       # HH0    -->  E-     E+                 
      7.32241051E-06    2           13       -13                       # HH0    -->  MU-    MU+                
      2.09702551E-03    2           15       -15                       # HH0    -->  TAU-   TAU+               
      2.14143213E-07    2            1        -1                       # HH0    -->  DN     DB                 
      8.65246839E-05    2            3        -3                       # HH0    -->  ST     SB                 
      1.38711724E-02    2            5        -5                       # HH0    -->  BT     BB                 
      1.00163322E-09    2            2        -2                       # HH0    -->  UP     UB                 
      1.57197301E-05    2            4        -4                       # HH0    -->  CH     CB                 
      1.94229454E-01    2            6        -6                       # HH0    -->  TP     TB                 
      4.13015005E-06    2           22        22                       # HH0    -->  GM     GM                 
      6.32226351E-04    2           21        21                       # HH0    -->  GL     GL                 
      3.64072295E-03    2           24       -24                       # HH0    -->  W+     W-                 
      1.75638322E-03    2           23        23                       # HH0    -->  Z0     Z0                 
      3.70766893E-02    2      1000022   1000022                       # HH0    -->  Z1SS   Z1SS               
      3.85419987E-02    2      1000022   1000023                       # HH0    -->  Z1SS   Z2SS               
      1.30598828E-01    2      1000022   1000025                       # HH0    -->  Z1SS   Z3SS               
      5.63612999E-03    2      1000022   1000035                       # HH0    -->  Z1SS   Z4SS               
      9.87724960E-03    2      1000023   1000023                       # HH0    -->  Z2SS   Z2SS               
      6.93133324E-02    2      1000023   1000025                       # HH0    -->  Z2SS   Z3SS               
      2.05848902E-03    2      1000023   1000035                       # HH0    -->  Z2SS   Z4SS               
      1.09979719E-01    2      1000024  -1000024                       # HH0    -->  W1SS+  W1SS-              
      1.84348047E-01    2      1000024  -1000037                       # HH0    -->  W1SS+  W2SS-              
      1.84348047E-01    2     -1000024   1000037                       # HH0    -->  W1SS-  W2SS+              
      1.18805533E-02    2           25        25                       # HH0    -->  HL0    HL0                
#         PDG         Width
DECAY        36  4.49682617E+00   # HA0   decays
#          BR          NDA       ID1       ID2       ID3       ID4
      1.40416762E-10    2           11       -11                       # HA0    -->  E-     E+                 
      5.92864808E-06    2           13       -13                       # HA0    -->  MU-    MU+                
      1.69799302E-03    2           15       -15                       # HA0    -->  TAU-   TAU+               
      1.73409234E-07    2            1        -1                       # HA0    -->  DN     DB                 
      7.00661112E-05    2            3        -3                       # HA0    -->  ST     SB                 
      1.12358481E-02    2            5        -5                       # HA0    -->  BT     BB                 
      6.85003942E-10    2            2        -2                       # HA0    -->  UP     UB                 
      1.07721817E-05    2            4        -4                       # HA0    -->  CH     CB                 
      3.82463425E-01    2            6        -6                       # HA0    -->  TP     TB                 
      3.49164134E-06    2           22        22                       # HA0    -->  GM     GM                 
      4.01960657E-04    2           21        21                       # HA0    -->  GL     GL                 
      5.75984865E-02    2      1000022   1000022                       # HA0    -->  Z1SS   Z1SS               
      6.63888380E-02    2      1000022   1000023                       # HA0    -->  Z1SS   Z2SS               
      1.47992028E-02    2      1000022   1000025                       # HA0    -->  Z1SS   Z3SS               
      4.30472717E-02    2      1000022   1000035                       # HA0    -->  Z1SS   Z4SS               
      1.91571079E-02    2      1000023   1000023                       # HA0    -->  Z2SS   Z2SS               
      5.84089383E-03    2      1000023   1000025                       # HA0    -->  Z2SS   Z3SS               
      2.12534927E-02    2      1000023   1000035                       # HA0    -->  Z2SS   Z4SS               
      1.96821883E-01    2      1000024  -1000024                       # HA0    -->  W1SS+  W1SS-              
      8.83086249E-02    2      1000024  -1000037                       # HA0    -->  W1SS+  W2SS-              
      8.83086249E-02    2     -1000024   1000037                       # HA0    -->  W1SS-  W2SS+              
      2.58591888E-03    2           25        23                       # HA0    -->  HL0    Z0                 
#         PDG         Width
DECAY        37  4.39433670E+00   # H+    decays
#          BR          NDA       ID1       ID2       ID3       ID4
      1.47213852E-10    2           12       -11                       # H+     -->  NUE    E+                 
      6.21563413E-06    2           14       -13                       # H+     -->  NUM    MU+                
      1.78019016E-03    2           16       -15                       # H+     -->  NUT    TAU+               
      1.66421998E-07    2            2        -1                       # H+     -->  UP     DB                 
      7.72415951E-05    2            4        -3                       # H+     -->  CH     SB                 
      3.80479693E-01    2            6        -5                       # H+     -->  TP     BB                 
      6.68585971E-02    2      1000024   1000022                       # H+     -->  W1SS+  Z1SS               
      1.90322865E-02    2      1000024   1000023                       # H+     -->  W1SS+  Z2SS               
      1.71247646E-01    2      1000024   1000025                       # H+     -->  W1SS+  Z3SS               
      1.39650732E-01    2      1000024   1000035                       # H+     -->  W1SS+  Z4SS               
      1.35126617E-03    2      1000037   1000022                       # H+     -->  W2SS+  Z1SS               
      2.16552034E-01    2      1000037   1000023                       # H+     -->  W2SS+  Z2SS               
      2.96390732E-03    2           25        24                       # H+     -->  HL0    W+                 
