  65
  401   2000.8307    0.27558E-25
  402   1999.3210    0.27453E-25
  403   2000.8307    0.27558E-25
  404   1999.3215    0.27453E-25
  405   1999.6924    0.37683E-25
  406   1829.1840    0.14370E-25
  407   2000.8307    0.27558E-25
  408   1999.3210    0.27453E-25
  409   2000.8307    0.27558E-25
  410   1999.3215    0.27453E-25
  411   1999.6924    0.37683E-25
  412   1829.1840    0.14370E-25
  413   2000.1520    0.60151E-24
  414   1999.6959    0.15042E-24
  415   2000.1520    0.60151E-24
  416   1999.6964    0.15042E-24
  417   2001.2937    0.16014E-25
  418   2165.2139    0.81395E-26
  419   2000.1520    0.60151E-24
  420   1999.6959    0.15042E-24
  421   2000.1520    0.60151E-24
  422   1999.6964    0.15042E-24
  423   2001.2937    0.16014E-25
  424   2165.2139    0.81395E-26
  425   2000.5267    0.25228E-25
  426   1999.0170    0.25182E-25
  427   2000.5267    0.25228E-25
  428   1999.0170    0.25182E-25
  429    166.8195    0.17672E-21
  430   1999.0170    0.25043E-25
  431   2000.5267    0.25228E-25
  432   1999.0170    0.25182E-25
  433   2000.5267    0.25228E-25
  434   1999.0170    0.25182E-25
  435    166.8195    0.17672E-21
  436   1999.0170    0.25043E-25
  437    166.8587    0.18179E-21
  438      0.0000    0.10000E+31
  439    166.8587    0.18179E-21
  440      0.0000    0.10000E+31
  441   2000.5476    0.25088E-25
  442      0.0000    0.10000E+31
  443    166.8587    0.18179E-21
  444      0.0000    0.10000E+31
  445    166.8587    0.18179E-21
  446      0.0000    0.10000E+31
  447   2000.5476    0.25088E-25
  448      0.0000    0.10000E+31
  449   2000.0000    0.22938E-24
  450    147.8439    0.10000E+31
  451   -185.7661    0.90023E-21
  452    260.6332    0.49733E-24
  453    377.2888    0.26246E-24
  454    161.8169    0.98660E-18
  455    376.3655    0.26115E-24
  456    161.8169    0.98660E-18
  457    376.3655    0.26115E-24
  203    119.0265    0.13106E-21
  204    504.3753    0.43806E-24
  205    500.0000    0.31110E-24
  206    509.4131    0.47804E-24
  207    509.4131    0.47804E-24
  458      0.0000    0.10000E+31
    6    172.5000    0.57395E-24
   12    172.5000    0.57395E-24
   6
   401  0.39161909E-01     0   450     1     0     0     0
   401  0.34979451E-02     0   451     1     0     0     0
   401  0.33651979E-03     0   452     1     0     0     0
   401  0.29853213E+00     0   453     1     0     0     0
   401  0.39573401E-01     0   456     2     0     0     0
   401  0.61889809E+00     0   457     2     0     0     0
   6
   402  0.17379176E-01     0   450     2     0     0     0
   402  0.21166510E-02     0   451     2     0     0     0
   402  0.48327353E-01     0   452     2     0     0     0
   402  0.27255774E+00     0   453     2     0     0     0
   402  0.11281846E+00     0   454     1     0     0     0
   402  0.54680061E+00     0   455     1     0     0     0
   6
   403  0.39161943E-01     0   450     3     0     0     0
   403  0.34979479E-02     0   451     3     0     0     0
   403  0.33652005E-03     0   452     3     0     0     0
   403  0.29853237E+00     0   453     3     0     0     0
   403  0.39573394E-01     0   456     4     0     0     0
   403  0.61889786E+00     0   457     4     0     0     0
   6
   404  0.17379167E-01     0   450     4     0     0     0
   404  0.21166499E-02     0   451     4     0     0     0
   404  0.48327327E-01     0   452     4     0     0     0
   404  0.27255756E+00     0   453     4     0     0     0
   404  0.11281851E+00     0   454     3     0     0     0
   404  0.54680079E+00     0   455     3     0     0     0
   7
   405  0.55506527E-01     0   450     5     0     0     0
   405  0.33940189E-02     0   451     5     0     0     0
   405  0.36194697E-01     0   452     5     0     0     0
   405  0.10368284E+00     0   453     5     0     0     0
   405  0.39135608E+00     0   456     6     0     0     0
   405  0.28253144E+00     0   457     6     0     0     0
   405  0.12733434E+00     0   199   406     0     0     0
   6
   406  0.10986461E+00     0   450     6     0     0     0
   406  0.22331409E+00     0   451     6     0     0     0
   406  0.86674683E-01     0   452     6     0     0     0
   406  0.18408749E+00     0   453     6     0     0     0
   406  0.88941298E-01     0   454     5     0     0     0
   406  0.30711782E+00     0   455     5     0     0     0
   6
   407  0.39161909E-01     0   450     7     0     0     0
   407  0.34979451E-02     0   451     7     0     0     0
   407  0.33651979E-03     0   452     7     0     0     0
   407  0.29853213E+00     0   453     7     0     0     0
   407  0.39573401E-01     0   454     8     0     0     0
   407  0.61889809E+00     0   455     8     0     0     0
   6
   408  0.17379176E-01     0   450     8     0     0     0
   408  0.21166510E-02     0   451     8     0     0     0
   408  0.48327353E-01     0   452     8     0     0     0
   408  0.27255774E+00     0   453     8     0     0     0
   408  0.11281846E+00     0   456     7     0     0     0
   408  0.54680061E+00     0   457     7     0     0     0
   6
   409  0.39161943E-01     0   450     9     0     0     0
   409  0.34979479E-02     0   451     9     0     0     0
   409  0.33652005E-03     0   452     9     0     0     0
   409  0.29853237E+00     0   453     9     0     0     0
   409  0.39573394E-01     0   454    10     0     0     0
   409  0.61889786E+00     0   455    10     0     0     0
   6
   410  0.17379167E-01     0   450    10     0     0     0
   410  0.21166499E-02     0   451    10     0     0     0
   410  0.48327327E-01     0   452    10     0     0     0
   410  0.27255756E+00     0   453    10     0     0     0
   410  0.11281851E+00     0   456     9     0     0     0
   410  0.54680079E+00     0   457     9     0     0     0
   7
   411  0.55506527E-01     0   450    11     0     0     0
   411  0.33940189E-02     0   451    11     0     0     0
   411  0.36194697E-01     0   452    11     0     0     0
   411  0.10368284E+00     0   453    11     0     0     0
   411  0.39135608E+00     0   454    12     0     0     0
   411  0.28253144E+00     0   455    12     0     0     0
   411  0.12733434E+00     0   198   412     0     0     0
   6
   412  0.10986461E+00     0   450    12     0     0     0
   412  0.22331409E+00     0   451    12     0     0     0
   412  0.86674683E-01     0   452    12     0     0     0
   412  0.18408749E+00     0   453    12     0     0     0
   412  0.88941298E-01     0   456    11     0     0     0
   412  0.30711782E+00     0   457    11     0     0     0
   4
   413  0.94363198E-01     0   450     1     0     0     0
   413  0.37050892E-02     0   451     1     0     0     0
   413  0.89029765E+00     0   452     1     0     0     0
   413  0.11634146E-01     0   453     1     0     0     0
   4
   414  0.94364107E-01     0   450     2     0     0     0
   414  0.37051148E-02     0   451     2     0     0     0
   414  0.89029688E+00     0   452     2     0     0     0
   414  0.11633927E-01     0   453     2     0     0     0
   4
   415  0.94363198E-01     0   450     3     0     0     0
   415  0.37050892E-02     0   451     3     0     0     0
   415  0.89029765E+00     0   452     3     0     0     0
   415  0.11634146E-01     0   453     3     0     0     0
   4
   416  0.94364099E-01     0   450     4     0     0     0
   416  0.37051146E-02     0   451     4     0     0     0
   416  0.89029688E+00     0   452     4     0     0     0
   416  0.11633926E-01     0   453     4     0     0     0
   7
   417  0.95029697E-02     0   450     5     0     0     0
   417  0.84754834E-02     0   451     5     0     0     0
   417  0.89193946E-02     0   452     5     0     0     0
   417  0.13021950E+00     0   453     5     0     0     0
   417  0.36445764E+00     0   456     6     0     0     0
   417  0.33878672E+00     0   457     6     0     0     0
   417  0.13963832E+00     0   199   406     0     0     0
   9
   418  0.26236355E+00     0   454     5     0     0     0
   418  0.18682312E-01     0   455     5     0     0     0
   418  0.21633364E+00     0   200   406     0     0     0
   418  0.24790628E-01     0   198   405     0     0     0
   418  0.59528884E-01     0   198   417     0     0     0
   418  0.17343649E+00     0   450     6     0     0     0
   418  0.19059068E+00     0   451     6     0     0     0
   418  0.35651278E-01     0   452     6     0     0     0
   418  0.18622581E-01     0   453     6     0     0     0
   4
   419  0.94363198E-01     0   450     7     0     0     0
   419  0.37050892E-02     0   451     7     0     0     0
   419  0.89029765E+00     0   452     7     0     0     0
   419  0.11634146E-01     0   453     7     0     0     0
   4
   420  0.94364107E-01     0   450     8     0     0     0
   420  0.37051148E-02     0   451     8     0     0     0
   420  0.89029688E+00     0   452     8     0     0     0
   420  0.11633927E-01     0   453     8     0     0     0
   4
   421  0.94363198E-01     0   450     9     0     0     0
   421  0.37050892E-02     0   451     9     0     0     0
   421  0.89029765E+00     0   452     9     0     0     0
   421  0.11634146E-01     0   453     9     0     0     0
   4
   422  0.94364099E-01     0   450    10     0     0     0
   422  0.37051146E-02     0   451    10     0     0     0
   422  0.89029688E+00     0   452    10     0     0     0
   422  0.11633926E-01     0   453    10     0     0     0
   7
   423  0.95029697E-02     0   450    11     0     0     0
   423  0.84754834E-02     0   451    11     0     0     0
   423  0.89193946E-02     0   452    11     0     0     0
   423  0.13021950E+00     0   453    11     0     0     0
   423  0.36445764E+00     0   454    12     0     0     0
   423  0.33878672E+00     0   455    12     0     0     0
   423  0.13963832E+00     0   198   412     0     0     0
   9
   424  0.26236355E+00     0   456    11     0     0     0
   424  0.18682312E-01     0   457    11     0     0     0
   424  0.21633364E+00     0   200   412     0     0     0
   424  0.24790628E-01     0   199   411     0     0     0
   424  0.59528884E-01     0   199   423     0     0     0
   424  0.17343649E+00     0   450    12     0     0     0
   424  0.19059068E+00     0   451    12     0     0     0
   424  0.35651278E-01     0   452    12     0     0     0
   424  0.18622581E-01     0   453    12     0     0     0
   6
   425  0.40318877E-02     0   450   121     0     0     0
   425  0.10017127E-02     0   451   121     0     0     0
   425  0.16326338E+00     0   452   121     0     0     0
   425  0.22900552E+00     0   453   121     0     0     0
   425  0.36222074E-01     0   456   122     0     0     0
   425  0.56647533E+00     0   457   122     0     0     0
   6
   426  0.63463613E-01     0   450   122     0     0     0
   426  0.47556604E-02     0   451   122     0     0     0
   426  0.30791173E-01     0   452   122     0     0     0
   426  0.29603717E+00     0   453   122     0     0     0
   426  0.10347006E+00     0   454   121     0     0     0
   426  0.50148231E+00     0   455   121     0     0     0
   6
   427  0.40318877E-02     0   450   123     0     0     0
   427  0.10017127E-02     0   451   123     0     0     0
   427  0.16326338E+00     0   452   123     0     0     0
   427  0.22900552E+00     0   453   123     0     0     0
   427  0.36222074E-01     0   456   124     0     0     0
   427  0.56647533E+00     0   457   124     0     0     0
   6
   428  0.63463613E-01     0   450   124     0     0     0
   428  0.47556604E-02     0   451   124     0     0     0
   428  0.30791173E-01     0   452   124     0     0     0
   428  0.29603717E+00     0   453   124     0     0     0
   428  0.10347006E+00     0   454   123     0     0     0
   428  0.50148231E+00     0   455   123     0     0     0
   2
   429  0.98914695E+00     0   450   125     0     0     0
   429  0.10853067E-01     0   456   126     0     0     0
   7
   430  0.63112147E-01     0   450   126     0     0     0
   430  0.47293231E-02     0   451   126     0     0     0
   430  0.30620649E-01     0   452   126     0     0     0
   430  0.29439768E+00     0   453   126     0     0     0
   430  0.10808887E+00     0   454   125     0     0     0
   430  0.49900803E+00     0   455   125     0     0     0
   430  0.43399548E-04     0   198   429     0     0     0
   6
   431  0.40318877E-02     0   450   127     0     0     0
   431  0.10017127E-02     0   451   127     0     0     0
   431  0.16326338E+00     0   452   127     0     0     0
   431  0.22900552E+00     0   453   127     0     0     0
   431  0.36222074E-01     0   454   128     0     0     0
   431  0.56647533E+00     0   455   128     0     0     0
   6
   432  0.63463613E-01     0   450   128     0     0     0
   432  0.47556604E-02     0   451   128     0     0     0
   432  0.30791173E-01     0   452   128     0     0     0
   432  0.29603717E+00     0   453   128     0     0     0
   432  0.10347006E+00     0   456   127     0     0     0
   432  0.50148231E+00     0   457   127     0     0     0
   6
   433  0.40318877E-02     0   450   129     0     0     0
   433  0.10017127E-02     0   451   129     0     0     0
   433  0.16326338E+00     0   452   129     0     0     0
   433  0.22900552E+00     0   453   129     0     0     0
   433  0.36222074E-01     0   454   130     0     0     0
   433  0.56647533E+00     0   455   130     0     0     0
   6
   434  0.63463613E-01     0   450   130     0     0     0
   434  0.47556604E-02     0   451   130     0     0     0
   434  0.30791173E-01     0   452   130     0     0     0
   434  0.29603717E+00     0   453   130     0     0     0
   434  0.10347006E+00     0   456   129     0     0     0
   434  0.50148231E+00     0   457   129     0     0     0
   2
   435  0.98914695E+00     0   450   131     0     0     0
   435  0.10853067E-01     0   454   132     0     0     0
   7
   436  0.63112147E-01     0   450   132     0     0     0
   436  0.47293231E-02     0   451   132     0     0     0
   436  0.30620649E-01     0   452   132     0     0     0
   436  0.29439768E+00     0   453   132     0     0     0
   436  0.10808887E+00     0   456   131     0     0     0
   436  0.49900803E+00     0   457   131     0     0     0
   436  0.43399548E-04     0   199   435     0     0     0
   1
   437  0.10000000E+01     0   450   121     0     0     0
   0
   1
   439  0.10000000E+01     0   450   123     0     0     0
   0
   8
   441  0.66139586E-02     0   450   125     0     0     0
   441  0.35985031E-02     0   451   125     0     0     0
   441  0.16248968E+00     0   452   125     0     0     0
   441  0.22790262E+00     0   453   125     0     0     0
   441  0.36007944E-01     0   456   126     0     0     0
   441  0.56334281E+00     0   457   126     0     0     0
   441  0.22045737E-04     0   200   429     0     0     0
   441  0.22468725E-04     0   203   429     0     0     0
   0
   1
   443  0.10000000E+01     0   450   127     0     0     0
   0
   1
   445  0.10000000E+01     0   450   129     0     0     0
   0
   8
   447  0.66139586E-02     0   450   131     0     0     0
   447  0.35985031E-02     0   451   131     0     0     0
   447  0.16248968E+00     0   452   131     0     0     0
   447  0.22790262E+00     0   453   131     0     0     0
   447  0.36007944E-01     0   454   132     0     0     0
   447  0.56334281E+00     0   455   132     0     0     0
   447  0.22045737E-04     0   200   435     0     0     0
   447  0.22468725E-04     0   203   435     0     0     0
   0
  32
   449  0.54564001E-03     0   454     1     8     0     0
   449  0.54564001E-03     0   456     2     7     0     0
   449  0.54564001E-03     0   454     3    10     0     0
   449  0.54564001E-03     0   456     4     9     0     0
   449  0.58186479E-01     0   454     5    12     0     0
   449  0.58186479E-01     0   456     6    11     0     0
   449  0.80793453E-02     0   455     1     8     0     0
   449  0.80793453E-02     0   457     2     7     0     0
   449  0.80793453E-02     0   455     3    10     0     0
   449  0.80793453E-02     0   457     4     9     0     0
   449  0.14205626E+00     0   455     5    12     0     0
   449  0.14205626E+00     0   457     6    11     0     0
   449  0.74156065E-03     0   450    13     0     0     0
   449  0.12643803E-02     0   450     1     7     0     0
   449  0.12643803E-02     0   450     3     9     0     0
   449  0.16917471E-02     0   450     5    11     0     0
   449  0.10011797E+00     0   450     6    12     0     0
   449  0.10057235E-02     0   451    13     0     0     0
   449  0.94515555E-04     0   451     1     7     0     0
   449  0.94515555E-04     0   451     3     9     0     0
   449  0.57696278E-03     0   451     5    11     0     0
   449  0.19767199E+00     0   451     6    12     0     0
   449  0.58282330E-04     0   452    13     0     0     0
   449  0.12216393E-02     0   452     1     7     0     0
   449  0.12216393E-02     0   452     3     9     0     0
   449  0.12341836E-02     0   452     5    11     0     0
   449  0.73388182E-01     0   452     6    12     0     0
   449  0.87058965E-04     0   453    13     0     0     0
   449  0.86877625E-02     0   453     1     7     0     0
   449  0.86877625E-02     0   453     3     9     0     0
   449  0.86413948E-02     0   453     5    11     0     0
   449  0.15726291E+00     0   453     6    12     0     0
   0
  28
   451  0.19496580E-04     0   450    59     0     0     0
   451  0.36678833E-02     0   456     2     7     0     0
   451  0.12226278E-02     0   456   122   127     0     0
   451  0.12226278E-02     0   456   124   129     0     0
   451  0.36678833E-02     0   454     1     8     0     0
   451  0.12226278E-02     0   454   121   128     0     0
   451  0.12226278E-02     0   454   123   130     0     0
   451  0.36678833E-02     0   456     4     9     0     0
   451  0.12226278E-02     0   456   126   131     0     0
   451  0.36678833E-02     0   454     3    10     0     0
   451  0.12226278E-02     0   454   125   132     0     0
   451  0.89484183E-02     0   450     2     8     0     0
   451  0.11536491E-01     0   450     1     7     0     0
   451  0.11536491E-01     0   450     3     9     0     0
   451  0.89484183E-02     0   450     4    10     0     0
   451  0.94903000E-02     0   450     5    11     0     0
   451  0.26173326E-02     0   450   121   127     0     0
   451  0.26173326E-02     0   450   123   129     0     0
   451  0.25335306E-02     0   450   125   131     0     0
   451  0.52087521E-02     0   450   122   128     0     0
   451  0.52087521E-02     0   450   124   130     0     0
   451  0.52087521E-02     0   450   126   132     0     0
   451  0.88016555E-01     0   437   127     0     0     0
   451  0.88016555E-01     0   443   121     0     0     0
   451  0.88015079E-01     0   439   129     0     0     0
   451  0.88015079E-01     0   445   123     0     0     0
   451  0.27602765E+00     0   429   131     0     0     0
   451  0.27602765E+00     0   435   125     0     0     0
  14
   452  0.33091102E-01     0   454   199     0     0     0
   452  0.33091102E-01     0   456   198     0     0     0
   452  0.34271149E-03     0   450   200     0     0     0
   452  0.16216280E-04     0   451     2     8     0     0
   452  0.20906855E-04     0   451     1     7     0     0
   452  0.20906855E-04     0   451     3     9     0     0
   452  0.16216280E-04     0   451     4    10     0     0
   452  0.20322410E-04     0   451     5    11     0     0
   452  0.15556356E+00     0   437   127     0     0     0
   452  0.15556356E+00     0   443   121     0     0     0
   452  0.15556343E+00     0   439   129     0     0     0
   452  0.15556343E+00     0   445   123     0     0     0
   452  0.15556329E+00     0   429   131     0     0     0
   452  0.15556329E+00     0   435   125     0     0     0
  13
   453  0.29532012E+00     0   454   199     0     0     0
   453  0.29532012E+00     0   456   198     0     0     0
   453  0.14821686E-01     0   450   200     0     0     0
   453  0.23565933E+00     0   451   200     0     0     0
   453  0.14148050E-02     0   452   200     0     0     0
   453  0.13078766E+00     0   450   203     0     0     0
   453  0.85063567E-02     0   451   203     0     0     0
   453  0.29977488E-02     0   437   127     0     0     0
   453  0.29977488E-02     0   443   121     0     0     0
   453  0.29977479E-02     0   439   129     0     0     0
   453  0.29977479E-02     0   445   123     0     0     0
   453  0.30894144E-02     0   429   131     0     0     0
   453  0.30894144E-02     0   435   125     0     0     0
   5
   454  0.33264270E+00     0   450     2     7     0     0
   454  0.33264270E+00     0   450     4     9     0     0
   454  0.11088445E+00     0   450   127   122     0     0
   454  0.11088445E+00     0   450   129   124     0     0
   454  0.11294571E+00     0   450   131   126     0     0
   6
   455  0.22768442E+00     0   450   198     0     0     0
   455  0.26527601E+00     0   451   198     0     0     0
   455  0.35945255E-01     0   452   198     0     0     0
   455  0.19302772E-03     0   435   126     0     0     0
   455  0.28456780E+00     0   454   200     0     0     0
   455  0.18633361E+00     0   454   203     0     0     0
   5
   456  0.33264270E+00     0   450     8     1     0     0
   456  0.33264270E+00     0   450    10     3     0     0
   456  0.11088445E+00     0   450   121   128     0     0
   456  0.11088445E+00     0   450   123   130     0     0
   456  0.11294571E+00     0   450   125   132     0     0
   6
   457  0.22768442E+00     0   450   199     0     0     0
   457  0.26527601E+00     0   451   199     0     0     0
   457  0.35945255E-01     0   452   199     0     0     0
   457  0.19302772E-03     0   429   132     0     0     0
   457  0.28456780E+00     0   456   200     0     0     0
   457  0.18633361E+00     0   456   203     0     0     0
  28
   203  0.20215851E-03     0   123   129     0     0     0
   203  0.57824153E-01     0   125   131     0     0     0
   203  0.24268816E-02     0     3     9     0     0     0
   203  0.79171169E+00     0     5    11     0     0     0
   203  0.30113600E-01     0     4    10     0     0     0
   203  0.17430766E-02     0    59    59     0     0     0
   203  0.34975428E-01     0    13    13     0     0     0
   203  0.41260398E-02     0   198   121   128     0     0
   203  0.41260398E-02     0   198   123   130     0     0
   203  0.41260398E-02     0   198   125   132     0     0
   203  0.12378119E-01     0   198     8     1     0     0
   203  0.12378119E-01     0   198    10     3     0     0
   203  0.41260398E-02     0   199   127   122     0     0
   203  0.41260398E-02     0   199   129   124     0     0
   203  0.41260398E-02     0   199   131   126     0     0
   203  0.12378119E-01     0   199     2     7     0     0
   203  0.12378119E-01     0   199     4     9     0     0
   203  0.46053855E-03     0   200   122   128     0     0
   203  0.46053855E-03     0   200   124   130     0     0
   203  0.46053855E-03     0   200   126   132     0     0
   203  0.23178442E-03     0   200   121   127     0     0
   203  0.23178442E-03     0   200   123   129     0     0
   203  0.23178442E-03     0   200   125   131     0     0
   203  0.79407380E-03     0   200     2     8     0     0
   203  0.79407380E-03     0   200     4    10     0     0
   203  0.10229626E-02     0   200     1     7     0     0
   203  0.10229626E-02     0   200     3     9     0     0
   203  0.10229626E-02     0   200     5    11     0     0
  19
   204  0.86253473E-04     0   123   129     0     0     0
   204  0.24702482E-01     0   125   131     0     0     0
   204  0.10173760E-02     0     3     9     0     0     0
   204  0.27298123E+00     0     5    11     0     0     0
   204  0.11386190E-04     0     4    10     0     0     0
   204  0.27222770E+00     0     6    12     0     0     0
   204  0.41113573E-03     0    13    13     0     0     0
   204  0.54222420E-02     0   198   199     0     0     0
   204  0.26655351E-02     0   200   200     0     0     0
   204  0.97044520E-01     0   450   450     0     0     0
   204  0.88103056E-01     0   450   451     0     0     0
   204  0.44483650E-02     0   450   452     0     0     0
   204  0.85132997E-02     0   451   451     0     0     0
   204  0.45581114E-01     0   451   452     0     0     0
   204  0.15303026E+00     0   454   456     0     0     0
   204  0.22095710E-01     0   203   203     0     0     0
   204  0.56346750E-03     0   437   443     0     0     0
   204  0.56335499E-03     0   439   445     0     0     0
   204  0.53155649E-03     0   429   435     0     0     0
  13
   205  0.61042985E-04     0   123   129     0     0     0
   205  0.17483208E-01     0   125   131     0     0     0
   205  0.72007347E-03     0     3     9     0     0     0
   205  0.19346106E+00     0     5    11     0     0     0
   205  0.28814614E+00     0     6    12     0     0     0
   205  0.24912320E-03     0    13    13     0     0     0
   205  0.19272110E+00     0   450   450     0     0     0
   205  0.98178778E-02     0   450   451     0     0     0
   205  0.13604471E-01     0   450   452     0     0     0
   205  0.62726163E-02     0   451   451     0     0     0
   205  0.35684365E-02     0   451   452     0     0     0
   205  0.27060407E+00     0   454   456     0     0     0
   205  0.32908067E-02     0   203   200     0     0     0
   8
   206  0.95565141E-04     0   124   129     0     0     0
   206  0.27370658E-01     0   126   131     0     0     0
   206  0.10394052E-02     0     4     9     0     0     0
   206  0.60651064E+00     0     6    11     0     0     0
   206  0.18453721E-01     0   454   450     0     0     0
   206  0.81300251E-01     0   454   451     0     0     0
   206  0.25974670E+00     0   454   452     0     0     0
   206  0.54831486E-02     0   203   198     0     0     0
   8
   207  0.95565141E-04     0   130   123     0     0     0
   207  0.27370658E-01     0   132   125     0     0     0
   207  0.10394052E-02     0    10     3     0     0     0
   207  0.60651064E+00     0    12     5     0     0     0
   207  0.18453721E-01     0   456   450     0     0     0
   207  0.81300251E-01     0   456   451     0     0     0
   207  0.25974670E+00     0   456   452     0     0     0
   207  0.54831486E-02     0   203   199     0     0     0
   0
   5
     6  0.33333334E+00   100     2     7     5     0     0
     6  0.33333334E+00   100     4     9     5     0     0
     6  0.11111111E+00   100   122   127     5     0     0
     6  0.11111111E+00   100   124   129     5     0     0
     6  0.11111111E+00   100   126   131     5     0     0
   5
    12  0.33333334E+00   100     8     1    11     0     0
    12  0.33333334E+00   100    10     3    11     0     0
    12  0.11111111E+00   100   128   121    11     0     0
    12  0.11111111E+00   100   130   123    11     0     0
    12  0.11111111E+00   100   132   125    11     0     0
      6.00000000     -0.18022321
      0.30389971     -0.27941152      0.68747568     -0.59745425
      0.06041037     -0.08939762     -0.68729687     -0.71831876
     -0.94439769     -0.20444612      0.15695560     -0.20415679
      0.11004019     -0.93388385     -0.17425603      0.29221064
     -0.40352207      0.91496986     -0.91496986     -0.40352207
     -0.23844379      0.97115630     -0.97115630     -0.23844379
      0.78483981     -1.00614059     -1.57032180
   4899.00000000      0.00000000      0.00000000
    180.00000000
    T
