  65
  401    702.2107    0.12098E-24
  402    698.1886    0.12692E-24
  403    702.2108    0.12098E-24
  404    698.1899    0.12693E-24
  405   3000.0916    0.42563E-26
  406   3002.5991    0.29844E-26
  407    702.2107    0.12098E-24
  408    698.1886    0.12692E-24
  409    702.2108    0.12098E-24
  410    698.1899    0.12693E-24
  411   3000.0916    0.42563E-26
  412   3002.5991    0.29844E-26
  413    700.4050    0.18588E-24
  414    699.1893    0.14280E-24
  415    700.4050    0.18588E-24
  416    699.1906    0.14281E-24
  417   3000.5220    0.29942E-26
  418   3002.8484    0.30058E-26
  419    700.4050    0.18588E-24
  420    699.1893    0.14280E-24
  421    700.4050    0.18588E-24
  422    699.1906    0.14281E-24
  423   3000.5220    0.29942E-26
  424   3002.8484    0.30058E-26
  425    300.0356    0.22360E-23
  426    290.4975    0.22525E-23
  427    300.0356    0.22360E-23
  428    290.4975    0.22525E-23
  429   3000.2717    0.42778E-25
  430   2999.3887    0.16632E-25
  431    300.0356    0.22360E-23
  432    290.4975    0.22525E-23
  433    300.0356    0.22360E-23
  434    290.4975    0.22525E-23
  435   3000.2717    0.42778E-25
  436   2999.3887    0.16632E-25
  437    300.0261    0.54743E-24
  438      0.0000    0.10000E+31
  439    300.0262    0.54743E-24
  440      0.0000    0.10000E+31
  441   3000.3406    0.16643E-25
  442      0.0000    0.10000E+31
  443    300.0261    0.54743E-24
  444      0.0000    0.10000E+31
  445    300.0262    0.54743E-24
  446      0.0000    0.10000E+31
  447   3000.3406    0.16643E-25
  448      0.0000    0.10000E+31
  449    600.0000    0.20218E-21
  450     99.9971    0.10000E+31
  451    499.7049    0.18953E-24
  452   -901.7328    0.90314E-25
  453    913.5967    0.83123E-25
  454    499.6469    0.18946E-24
  455    913.0560    0.82955E-25
  456    499.6469    0.18946E-24
  457    913.0560    0.82955E-25
  203    106.8539    0.17587E-21
  204   1007.8082    0.20115E-24
  205   1000.0000    0.19196E-24
  206   1016.3754    0.20927E-24
  207   1016.3754    0.20927E-24
  458      0.0000    0.10000E+31
    6    172.5000    0.57395E-24
   12    172.5000    0.57395E-24
   4
   401  0.18561983E-01     0   450     1     0     0     0
   401  0.12779106E+00     0   451     1     0     0     0
   401  0.59917730E+00     0   449     1     0     0     0
   401  0.25446966E+00     0   456     2     0     0     0
   4
   402  0.17076645E-01     0   450     2     0     0     0
   402  0.13155660E+00     0   451     2     0     0     0
   402  0.58690870E+00     0   449     2     0     0     0
   402  0.26445809E+00     0   454     1     0     0     0
   4
   403  0.18562114E-01     0   450     3     0     0     0
   403  0.12779203E+00     0   451     3     0     0     0
   403  0.59918201E+00     0   449     3     0     0     0
   403  0.25446382E+00     0   456     4     0     0     0
   4
   404  0.17077416E-01     0   450     4     0     0     0
   404  0.13156050E+00     0   451     4     0     0     0
   404  0.58688790E+00     0   449     4     0     0     0
   404  0.26447415E+00     0   454     3     0     0     0
   7
   405  0.10911831E-01     0   450     5     0     0     0
   405  0.29184637E-04     0   451     5     0     0     0
   405  0.60998369E-03     0   452     5     0     0     0
   405  0.60059398E-03     0   453     5     0     0     0
   405  0.98664069E+00     0   449     5     0     0     0
   405  0.54134842E-04     0   456     6     0     0     0
   405  0.11535125E-02     0   457     6     0     0     0
   7
   406  0.68748647E+00     0   449     6     0     0     0
   406  0.30460700E-01     0   450     6     0     0     0
   406  0.15714583E-02     0   451     6     0     0     0
   406  0.70498042E-01     0   452     6     0     0     0
   406  0.68585716E-01     0   453     6     0     0     0
   406  0.31826706E-02     0   454     5     0     0     0
   406  0.13821489E+00     0   455     5     0     0     0
   4
   407  0.18561983E-01     0   450     7     0     0     0
   407  0.12779106E+00     0   451     7     0     0     0
   407  0.59917730E+00     0   449     7     0     0     0
   407  0.25446966E+00     0   454     8     0     0     0
   4
   408  0.17076645E-01     0   450     8     0     0     0
   408  0.13155660E+00     0   451     8     0     0     0
   408  0.58690870E+00     0   449     8     0     0     0
   408  0.26445809E+00     0   456     7     0     0     0
   4
   409  0.18562114E-01     0   450     9     0     0     0
   409  0.12779203E+00     0   451     9     0     0     0
   409  0.59918201E+00     0   449     9     0     0     0
   409  0.25446382E+00     0   454    10     0     0     0
   4
   410  0.17077416E-01     0   450    10     0     0     0
   410  0.13156050E+00     0   451    10     0     0     0
   410  0.58688790E+00     0   449    10     0     0     0
   410  0.26447415E+00     0   456     9     0     0     0
   7
   411  0.10911831E-01     0   450    11     0     0     0
   411  0.29184637E-04     0   451    11     0     0     0
   411  0.60998369E-03     0   452    11     0     0     0
   411  0.60059398E-03     0   453    11     0     0     0
   411  0.98664069E+00     0   449    11     0     0     0
   411  0.54134842E-04     0   454    12     0     0     0
   411  0.11535125E-02     0   455    12     0     0     0
   7
   412  0.68748647E+00     0   449    12     0     0     0
   412  0.30460700E-01     0   450    12     0     0     0
   412  0.15714583E-02     0   451    12     0     0     0
   412  0.70498042E-01     0   452    12     0     0     0
   412  0.68585716E-01     0   453    12     0     0     0
   412  0.31826706E-02     0   456    11     0     0     0
   412  0.13821489E+00     0   457    11     0     0     0
   2
   413  0.10696767E+00     0   450     1     0     0     0
   413  0.89303237E+00     0   449     1     0     0     0
   3
   414  0.32808235E+00     0   450     2     0     0     0
   414  0.16943019E-04     0   451     2     0     0     0
   414  0.67190069E+00     0   449     2     0     0     0
   2
   415  0.10696760E+00     0   450     3     0     0     0
   415  0.89303243E+00     0   449     3     0     0     0
   3
   416  0.32809982E+00     0   450     4     0     0     0
   416  0.16943655E-04     0   451     4     0     0     0
   416  0.67188323E+00     0   449     4     0     0     0
   7
   417  0.20431592E-02     0   450     5     0     0     0
   417  0.52452546E-01     0   451     5     0     0     0
   417  0.47909011E-03     0   452     5     0     0     0
   417  0.18964562E-02     0   453     5     0     0     0
   417  0.69419283E+00     0   449     5     0     0     0
   417  0.10609151E+00     0   456     6     0     0     0
   417  0.14284445E+00     0   457     6     0     0     0
   7
   418  0.69246823E+00     0   449     6     0     0     0
   418  0.10702922E+00     0   454     5     0     0     0
   418  0.26940596E-02     0   455     5     0     0     0
   418  0.18523268E-02     0   450     6     0     0     0
   418  0.54093264E-01     0   451     6     0     0     0
   418  0.71066633E-01     0   452     6     0     0     0
   418  0.70796207E-01     0   453     6     0     0     0
   2
   419  0.10696767E+00     0   450     7     0     0     0
   419  0.89303237E+00     0   449     7     0     0     0
   3
   420  0.32808235E+00     0   450     8     0     0     0
   420  0.16943019E-04     0   451     8     0     0     0
   420  0.67190069E+00     0   449     8     0     0     0
   2
   421  0.10696760E+00     0   450     9     0     0     0
   421  0.89303243E+00     0   449     9     0     0     0
   3
   422  0.32809982E+00     0   450    10     0     0     0
   422  0.16943655E-04     0   451    10     0     0     0
   422  0.67188323E+00     0   449    10     0     0     0
   7
   423  0.20431592E-02     0   450    11     0     0     0
   423  0.52452546E-01     0   451    11     0     0     0
   423  0.47909011E-03     0   452    11     0     0     0
   423  0.18964562E-02     0   453    11     0     0     0
   423  0.69419283E+00     0   449    11     0     0     0
   423  0.10609151E+00     0   454    12     0     0     0
   423  0.14284445E+00     0   455    12     0     0     0
   7
   424  0.69246823E+00     0   449    12     0     0     0
   424  0.10702922E+00     0   456    11     0     0     0
   424  0.26940596E-02     0   457    11     0     0     0
   424  0.18523268E-02     0   450    12     0     0     0
   424  0.54093264E-01     0   451    12     0     0     0
   424  0.71066633E-01     0   452    12     0     0     0
   424  0.70796207E-01     0   453    12     0     0     0
   1
   425  0.10000000E+01     0   450   121     0     0     0
   1
   426  0.10000000E+01     0   450   122     0     0     0
   1
   427  0.10000000E+01     0   450   123     0     0     0
   1
   428  0.10000000E+01     0   450   124     0     0     0
   6
   429  0.98676974E+00     0   450   125     0     0     0
   429  0.31465091E-03     0   451   125     0     0     0
   429  0.31322553E-02     0   452   125     0     0     0
   429  0.43351469E-02     0   453   125     0     0     0
   429  0.24405684E-03     0   456   126     0     0     0
   429  0.52041421E-02     0   457   126     0     0     0
   6
   430  0.97894877E-01     0   450   126     0     0     0
   430  0.28802764E+00     0   451   126     0     0     0
   430  0.46227314E-03     0   452   126     0     0     0
   430  0.98944893E-02     0   453   126     0     0     0
   430  0.59135431E+00     0   454   125     0     0     0
   430  0.12366395E-01     0   455   125     0     0     0
   1
   431  0.10000000E+01     0   450   127     0     0     0
   1
   432  0.10000000E+01     0   450   128     0     0     0
   1
   433  0.10000000E+01     0   450   129     0     0     0
   1
   434  0.10000000E+01     0   450   130     0     0     0
   6
   435  0.98676974E+00     0   450   131     0     0     0
   435  0.31465091E-03     0   451   131     0     0     0
   435  0.31322553E-02     0   452   131     0     0     0
   435  0.43351469E-02     0   453   131     0     0     0
   435  0.24405684E-03     0   454   132     0     0     0
   435  0.52041421E-02     0   455   132     0     0     0
   6
   436  0.97894877E-01     0   450   132     0     0     0
   436  0.28802764E+00     0   451   132     0     0     0
   436  0.46227314E-03     0   452   132     0     0     0
   436  0.98944893E-02     0   453   132     0     0     0
   436  0.59135431E+00     0   456   131     0     0     0
   436  0.12366395E-01     0   457   131     0     0     0
   1
   437  0.10000000E+01     0   450   121     0     0     0
   0
   1
   439  0.10000000E+01     0   450   123     0     0     0
   0
   6
   441  0.93995012E-01     0   450   125     0     0     0
   441  0.29775909E+00     0   451   125     0     0     0
   441  0.11292462E-02     0   452   125     0     0     0
   441  0.64256717E-02     0   453   125     0     0     0
   441  0.58006221E+00     0   456   126     0     0     0
   441  0.20628825E-01     0   457   126     0     0     0
   0
   1
   443  0.10000000E+01     0   450   127     0     0     0
   0
   1
   445  0.10000000E+01     0   450   129     0     0     0
   0
   6
   447  0.93995012E-01     0   450   131     0     0     0
   447  0.29775909E+00     0   451   131     0     0     0
   447  0.11292462E-02     0   452   131     0     0     0
   447  0.64256717E-02     0   453   131     0     0     0
   447  0.58006221E+00     0   454   132     0     0     0
   447  0.20628825E-01     0   455   132     0     0     0
   0
  14
   449  0.71060406E-02     0   454     1     8     0     0
   449  0.71060406E-02     0   456     2     7     0     0
   449  0.71059628E-02     0   454     3    10     0     0
   449  0.71059628E-02     0   456     4     9     0     0
   449  0.36978561E+00     0   450     2     8     0     0
   449  0.10881194E+00     0   450     1     7     0     0
   449  0.10881190E+00     0   450     3     9     0     0
   449  0.36978114E+00     0   450     4    10     0     0
   449  0.14265806E-03     0   450     5    11     0     0
   449  0.61242048E-04     0   450     6    12     0     0
   449  0.36743991E-02     0   451     2     8     0     0
   449  0.34163781E-02     0   451     1     7     0     0
   449  0.34163748E-02     0   451     3     9     0     0
   449  0.36743251E-02     0   451     4    10     0     0
   0
  14
   451  0.29914695E-03     0   450   200     0     0     0
   451  0.39084358E-02     0   450   203     0     0     0
   451  0.12213980E+00     0   425   127     0     0     0
   451  0.12213980E+00     0   431   121     0     0     0
   451  0.12213977E+00     0   427   129     0     0     0
   451  0.12213977E+00     0   433   123     0     0     0
   451  0.30896859E-04     0   437   127     0     0     0
   451  0.30896859E-04     0   443   121     0     0     0
   451  0.30896848E-04     0   439   129     0     0     0
   451  0.30896848E-04     0   445   123     0     0     0
   451  0.12677746E+00     0   426   128     0     0     0
   451  0.12677746E+00     0   432   122     0     0     0
   451  0.12677746E+00     0   428   130     0     0     0
   451  0.12677746E+00     0   434   124     0     0     0
  30
   452  0.30502960E+00     0   454   199     0     0     0
   452  0.30502960E+00     0   456   198     0     0     0
   452  0.72302289E-01     0   450   200     0     0     0
   452  0.29026952E+00     0   451   200     0     0     0
   452  0.15973492E-01     0   450   203     0     0     0
   452  0.81822015E-02     0   451   203     0     0     0
   452  0.79575744E-04     0   402     8     0     0     0
   452  0.79575744E-04     0   408     2     0     0     0
   452  0.13600210E-03     0   401     7     0     0     0
   452  0.13600210E-03     0   407     1     0     0     0
   452  0.13600195E-03     0   403     9     0     0     0
   452  0.13600195E-03     0   409     3     0     0     0
   452  0.79573540E-04     0   404    10     0     0     0
   452  0.79573540E-04     0   410     4     0     0     0
   452  0.34435147E-04     0   414     8     0     0     0
   452  0.34435147E-04     0   420     2     0     0     0
   452  0.34434175E-04     0   416    10     0     0     0
   452  0.34434175E-04     0   422     4     0     0     0
   452  0.58649264E-04     0   425   127     0     0     0
   452  0.58649264E-04     0   431   121     0     0     0
   452  0.58649264E-04     0   427   129     0     0     0
   452  0.58649264E-04     0   433   123     0     0     0
   452  0.12843710E-03     0   437   127     0     0     0
   452  0.12843710E-03     0   443   121     0     0     0
   452  0.12843710E-03     0   439   129     0     0     0
   452  0.12843710E-03     0   445   123     0     0     0
   452  0.36630643E-03     0   426   128     0     0     0
   452  0.36630643E-03     0   432   122     0     0     0
   452  0.36630643E-03     0   428   130     0     0     0
   452  0.36630643E-03     0   434   124     0     0     0
  34
   453  0.29226464E+00     0   454   199     0     0     0
   453  0.29226464E+00     0   456   198     0     0     0
   453  0.15434812E-01     0   450   200     0     0     0
   453  0.89166379E-02     0   451   200     0     0     0
   453  0.62260251E-01     0   450   203     0     0     0
   453  0.25238189E+00     0   451   203     0     0     0
   453  0.32414324E-02     0   402     8     0     0     0
   453  0.32414324E-02     0   408     2     0     0     0
   453  0.38322541E-02     0   401     7     0     0     0
   453  0.38322541E-02     0   407     1     0     0     0
   453  0.38322511E-02     0   403     9     0     0     0
   453  0.38322511E-02     0   409     3     0     0     0
   453  0.32413509E-02     0   404    10     0     0     0
   453  0.32413509E-02     0   410     4     0     0     0
   453  0.14248508E-03     0   414     8     0     0     0
   453  0.14248508E-03     0   420     2     0     0     0
   453  0.35271583E-04     0   413     7     0     0     0
   453  0.35271583E-04     0   419     1     0     0     0
   453  0.35271551E-04     0   415     9     0     0     0
   453  0.35271551E-04     0   421     3     0     0     0
   453  0.14248147E-03     0   416    10     0     0     0
   453  0.14248147E-03     0   422     4     0     0     0
   453  0.39789323E-02     0   425   127     0     0     0
   453  0.39789323E-02     0   431   121     0     0     0
   453  0.39789323E-02     0   427   129     0     0     0
   453  0.39789323E-02     0   433   123     0     0     0
   453  0.49555762E-03     0   437   127     0     0     0
   453  0.49555762E-03     0   443   121     0     0     0
   453  0.49555762E-03     0   439   129     0     0     0
   453  0.49555762E-03     0   445   123     0     0     0
   453  0.73934654E-02     0   426   128     0     0     0
   453  0.73934654E-02     0   432   122     0     0     0
   453  0.73934654E-02     0   428   130     0     0     0
   453  0.73934654E-02     0   434   124     0     0     0
   5
   454  0.42864792E-02     0   450   198     0     0     0
   454  0.26005968E+00     0   426   127     0     0     0
   454  0.26005962E+00     0   428   129     0     0     0
   454  0.23779717E+00     0   431   122     0     0     0
   454  0.23779708E+00     0   433   124     0     0     0
  12
   455  0.75455129E-01     0   450   198     0     0     0
   455  0.29557803E+00     0   451   198     0     0     0
   455  0.49330625E-02     0   402     7     0     0     0
   455  0.95133791E-02     0   407     2     0     0     0
   455  0.49330099E-02     0   404     9     0     0     0
   455  0.98304078E-02     0   409     4     0     0     0
   455  0.77023352E-02     0   426   127     0     0     0
   455  0.77023352E-02     0   428   129     0     0     0
   455  0.15119384E-01     0   431   122     0     0     0
   455  0.15119384E-01     0   433   124     0     0     0
   455  0.29038253E+00     0   454   200     0     0     0
   455  0.26373100E+00     0   454   203     0     0     0
   5
   456  0.42864792E-02     0   450   199     0     0     0
   456  0.26005968E+00     0   432   121     0     0     0
   456  0.26005962E+00     0   434   123     0     0     0
   456  0.23779717E+00     0   425   128     0     0     0
   456  0.23779708E+00     0   427   130     0     0     0
  12
   457  0.75455129E-01     0   450   199     0     0     0
   457  0.29557803E+00     0   451   199     0     0     0
   457  0.49330625E-02     0   408     1     0     0     0
   457  0.95133791E-02     0   401     8     0     0     0
   457  0.49330099E-02     0   410     3     0     0     0
   457  0.98304078E-02     0   403    10     0     0     0
   457  0.77023352E-02     0   432   121     0     0     0
   457  0.77023352E-02     0   434   123     0     0     0
   457  0.15119384E-01     0   425   128     0     0     0
   457  0.15119384E-01     0   427   130     0     0     0
   457  0.29038253E+00     0   456   200     0     0     0
   457  0.26373100E+00     0   456   203     0     0     0
  28
   203  0.21258004E-03     0   123   129     0     0     0
   203  0.60785525E-01     0   125   131     0     0     0
   203  0.25561654E-02     0     3     9     0     0     0
   203  0.84671384E+00     0     5    11     0     0     0
   203  0.37053090E-01     0     4    10     0     0     0
   203  0.15091689E-02     0    59    59     0     0     0
   203  0.34211367E-01     0    13    13     0     0     0
   203  0.90877590E-03     0   198   121   128     0     0
   203  0.90877590E-03     0   198   123   130     0     0
   203  0.90877590E-03     0   198   125   132     0     0
   203  0.27263279E-02     0   198     8     1     0     0
   203  0.27263279E-02     0   198    10     3     0     0
   203  0.90877590E-03     0   199   127   122     0     0
   203  0.90877590E-03     0   199   129   124     0     0
   203  0.90877590E-03     0   199   131   126     0     0
   203  0.27263279E-02     0   199     2     7     0     0
   203  0.27263279E-02     0   199     4     9     0     0
   203  0.41071307E-04     0   200   122   128     0     0
   203  0.41071307E-04     0   200   124   130     0     0
   203  0.41071307E-04     0   200   126   132     0     0
   203  0.20670779E-04     0   200   121   127     0     0
   203  0.20670779E-04     0   200   123   129     0     0
   203  0.20670779E-04     0   200   125   131     0     0
   203  0.70816328E-04     0   200     2     8     0     0
   203  0.70816328E-04     0   200     4    10     0     0
   203  0.91228882E-04     0   200     1     7     0     0
   203  0.91228882E-04     0   200     3     9     0     0
   203  0.91228882E-04     0   200     5    11     0     0
  21
   204  0.35273930E-04     0   123   129     0     0     0
   204  0.10102806E-01     0   125   131     0     0     0
   204  0.41351045E-03     0     3     9     0     0     0
   204  0.10195812E+00     0     5    11     0     0     0
   204  0.18734772E-04     0     4    10     0     0     0
   204  0.85494781E+00     0     6    12     0     0     0
   204  0.47322173E-03     0    13    13     0     0     0
   204  0.21379790E-02     0   198   199     0     0     0
   204  0.10855132E-02     0   200   200     0     0     0
   204  0.14623491E-02     0   450   450     0     0     0
   204  0.67557399E-02     0   450   451     0     0     0
   204  0.71126185E-02     0   450   452     0     0     0
   204  0.64997570E-04     0   451   451     0     0     0
   204  0.13779473E-03     0   454   456     0     0     0
   204  0.94427094E-02     0   203   203     0     0     0
   204  0.36400574E-03     0   425   431     0     0     0
   204  0.27278598E-03     0   437   443     0     0     0
   204  0.36397579E-03     0   427   433     0     0     0
   204  0.27276008E-03     0   439   445     0     0     0
   204  0.12885929E-02     0   426   432     0     0     0
   204  0.12885929E-02     0   428   434     0     0     0
  12
   205  0.33481305E-04     0   123   129     0     0     0
   205  0.95894979E-02     0   125   131     0     0     0
   205  0.39252109E-03     0     3     9     0     0     0
   205  0.96876040E-01     0     5    11     0     0     0
   205  0.17113120E-04     0     4    10     0     0     0
   205  0.86710912E+00     0     6    12     0     0     0
   205  0.47936663E-03     0    13    13     0     0     0
   205  0.20623198E-02     0   450   450     0     0     0
   205  0.14809751E-01     0   450   451     0     0     0
   205  0.20427613E-02     0   451   451     0     0     0
   205  0.46127504E-02     0   454   456     0     0     0
   205  0.19753270E-02     0   203   200     0     0     0
   9
   206  0.37098303E-04     0   124   129     0     0     0
   206  0.10625458E-01     0   126   131     0     0     0
   206  0.41715713E-03     0     4     9     0     0     0
   206  0.95528030E+00     0     6    11     0     0     0
   206  0.23543144E-01     0   454   450     0     0     0
   206  0.47784811E-02     0   455   450     0     0     0
   206  0.22484392E-02     0   203   198     0     0     0
   206  0.15349591E-02     0   431   426     0     0     0
   206  0.15349144E-02     0   433   428     0     0     0
   9
   207  0.37098303E-04     0   130   123     0     0     0
   207  0.10625458E-01     0   132   125     0     0     0
   207  0.41715713E-03     0    10     3     0     0     0
   207  0.95528030E+00     0    12     5     0     0     0
   207  0.23543144E-01     0   456   450     0     0     0
   207  0.47784811E-02     0   457   450     0     0     0
   207  0.22484392E-02     0   203   199     0     0     0
   207  0.15349591E-02     0   425   432     0     0     0
   207  0.15349144E-02     0   427   434     0     0     0
   0
   5
     6  0.33333334E+00   100     2     7     5     0     0
     6  0.33333334E+00   100     4     9     5     0     0
     6  0.11111111E+00   100   122   127     5     0     0
     6  0.11111111E+00   100   124   129     5     0     0
     6  0.11111111E+00   100   126   131     5     0     0
   5
    12  0.33333334E+00   100     8     1    11     0     0
    12  0.33333334E+00   100    10     3    11     0     0
    12  0.11111111E+00   100   128   121    11     0     0
    12  0.11111111E+00   100   130   123    11     0     0
    12  0.11111111E+00   100   132   125    11     0     0
      4.00000000     -0.24965002
      0.99857664     -0.00572107      0.05002820     -0.01757738
     -0.01436845     -0.98519611      0.13948223     -0.09862510
      0.02271813     -0.02936181     -0.70548588     -0.70775098
     -0.04606463      0.16880108      0.69305962     -0.69932288
     -0.99010855      0.14030342     -0.14030342     -0.99010855
     -0.98018950      0.19806197     -0.19806197     -0.98018950
      1.57071400     -1.57079577     -1.57079387
    225.00000000   3600.00000000   3600.00000000
    900.00000000
    T
