#
#                              ======================
#                              | THE SUSYHIT OUTPUT |
#                              ======================
#
#
#              ------------------------------------------------------
#              |     This is the output of the SUSY-HIT package     |
#              |  created by A.Djouadi, M.Muehlleitner and M.Spira. |
#              |  In case of problems with SUSY-HIT email to        |
#              |           margarete.muehlleitner@cern.ch           |
#              |           michael.spira@psi.ch                     |
#              |           abdelhak.djouadi@cern.ch                 |
#              ------------------------------------------------------
#
#              ------------------------------------------------------
#              |  SUSY Les Houches Accord - MSSM Spectrum + Decays  |
#              |              based on the decay programs           |
#              |                                                    |
#              |                     SDECAY 1.3b                    |
#              |                                                    |
#              |  Authors: M.Muhlleitner, A.Djouadi and Y.Mambrini  |
#              |  Ref.:    Comput.Phys.Commun.168(2005)46           |
#              |           [hep-ph/0311167]                         |
#              |                                                    |
#              |                     HDECAY 3.4                     |
#              |                                                    |
#              |  By: A.Djouadi,J.Kalinowski,M.Muhlleitner,M.Spira  |
#              |  Ref.:    Comput.Phys.Commun.108(1998)56           |
#              |           [hep-ph/9704448]                         |
#              |                                                    |
#              |                                                    |
#              |  If not stated otherwise all DRbar couplings and   |
#              |  soft SUSY breaking masses are given at the scale  |
#              |  Q=  0.91187600E+02
#              |                                                    |
#              ------------------------------------------------------
#
#
BLOCK DCINFO  # Decay Program information
     1   SDECAY/HDECAY # decay calculator
     2   1.3b  /3.4    # version number
#
BLOCK SPINFO  # Spectrum calculator information
     1   SuSpect     # RGE +Spectrum calculator            
     2   2.41         # version number                     
#
BLOCK MODSEL  # Model selection
     1     0   # #general MSSM low scale                           
#
BLOCK SMINPUTS  # Standard Model inputs
         1     1.27934000E+02   # alpha_em^-1(M_Z)^MSbar
         2     1.16639000E-05   # G_F [GeV^-2]
         3     1.17200000E-01   # alpha_S(M_Z)^MSbar
         4     9.11870000E+01   # M_Z pole mass
         5     4.25000000E+00   # mb(mb)^MSbar
         6     1.72500000E+02   # mt pole mass
         7     1.77700000E+00   # mtau pole mass
#
BLOCK MINPAR  # Input parameters - minimal models
#
BLOCK EXTPAR  # Input parameters - non-minimal models
         0     9.11876000E+01   # EWSB                
         1     2.50000000E+03   # M_1                 
         2     2.50000000E+02   # M_2                 
         3     1.00000000E+03   # M_3                 
        11     0.00000000E+00   # A_t                 
        12     0.00000000E+00   # A_b                 
        13     0.00000000E+00   # A_tau               
        14     0.00000000E+00   # A_u                 
        15     0.00000000E+00   # A_d                 
        16     0.00000000E+00   # A_e                 
        23     2.50000000E+03   # mu(EWSB)            
        25     1.50000000E+00   # tanbeta(in)         
        26     2.00000000E+03   # MA_pole             
        31     2.50000000E+03   # M_eL                
        32     2.50000000E+03   # M_muL               
        33     2.50000000E+03   # M_tauL              
        34     2.50000000E+03   # M_eR                
        35     2.50000000E+03   # M_muR               
        36     2.50000000E+03   # M_tauR              
        41     2.50000000E+03   # M_q1L               
        42     2.50000000E+03   # M_q2L               
        43     2.50000000E+03   # M_q3L               
        44     2.50000000E+03   # M_uR                
        45     2.50000000E+03   # M_cR                
        46     2.50000000E+03   # M_tR                
        47     2.50000000E+03   # M_dR                
        48     2.50000000E+03   # M_sR                
        49     2.50000000E+03   # M_bR                
#
BLOCK MASS  # Mass Spectrum
# PDG code           mass       particle
        24     8.05209336E+01   # W+
        25     1.20000000E+02   # h
        35     2.00395059E+03   # H
        36     2.00000000E+03   # A
        37     2.00201517E+03   # H+
         5     4.87877839E+00   # b-quark pole mass calculated from mb(mb)_Msbar
   1000001     2.50027051E+03   # ~d_L
   2000001     2.50005071E+03   # ~d_R
   1000002     2.49978018E+03   # ~u_L
   2000002     2.49989859E+03   # ~u_R
   1000003     2.50027051E+03   # ~s_L
   2000003     2.50005071E+03   # ~s_R
   1000004     2.49978018E+03   # ~c_L
   2000004     2.49989859E+03   # ~c_R
   1000005     2.49813111E+03   # ~b_1
   2000005     2.50219138E+03   # ~b_2
   1000006     2.45294764E+03   # ~t_1
   2000006     2.55510358E+03   # ~t_2
   1000011     2.50016910E+03   # ~e_L
   2000011     2.50015211E+03   # ~e_R
   1000012     2.49967875E+03   # ~nu_eL
   1000013     2.50016910E+03   # ~mu_L
   2000013     2.50015211E+03   # ~mu_R
   1000014     2.49967875E+03   # ~nu_muL
   1000015     2.49882792E+03   # ~tau_1
   2000015     2.50149385E+03   # ~tau_2
   1000016     2.49967875E+03   # ~nu_tauL
   1000021     1.00000000E+03   # ~g
   1000022     2.47367382E+02   # ~chi_10
   1000023     2.45776707E+03   # ~chi_20
   1000025    -2.50010441E+03   # ~chi_30
   1000035     2.54496996E+03   # ~chi_40
   1000024     2.47368354E+02   # ~chi_1+
   1000037     2.50280994E+03   # ~chi_2+
   1000039     1.19000000E-09   # ~gravitino
#
BLOCK NMIX  # Neutralino Mixing Matrix
  1  1     6.50536697E-04   # N_11
  1  2    -9.99379737E-01   # N_12
  1  3     2.85977241E-02   # N_13
  1  4    -2.05399023E-02   # N_14
  2  1     7.17987562E-01   # N_21
  2  2     2.46587539E-02   # N_22
  2  3     4.92714218E-01   # N_23
  2  4    -4.91038192E-01   # N_24
  3  1     1.74507892E-03   # N_31
  3  2    -5.69640955E-03   # N_32
  3  3    -7.07020399E-01   # N_33
  3  4    -7.07168057E-01   # N_34
  4  1     6.96053441E-01   # N_41
  4  2    -2.44874944E-02   # N_42
  4  3    -5.06494842E-01   # N_43
  4  4     5.08303989E-01   # N_44
#
BLOCK UMIX  # Chargino Mixing Matrix U
  1  1    -9.99182711E-01   # U_11
  1  2     4.04216639E-02   # U_12
  2  1     4.04216639E-02   # U_21
  2  2     9.99182711E-01   # U_22
#
BLOCK VMIX  # Chargino Mixing Matrix V
  1  1    -9.99578204E-01   # V_11
  1  2     2.90415789E-02   # V_12
  2  1     2.90415789E-02   # V_21
  2  2     9.99578204E-01   # V_22
#
BLOCK STOPMIX  # Stop Mixing Matrix
  1  1     7.07515785E-01   # cos(theta_t)
  1  2     7.06697541E-01   # sin(theta_t)
  2  1    -7.06697541E-01   # -sin(theta_t)
  2  2     7.07515785E-01   # cos(theta_t)
#
BLOCK SBOTMIX  # Sbottom Mixing Matrix
  1  1     6.87701074E-01   # cos(theta_b)
  1  2     7.25993962E-01   # sin(theta_b)
  2  1    -7.25993962E-01   # -sin(theta_b)
  2  2     6.87701074E-01   # cos(theta_b)
#
BLOCK STAUMIX  # Stau Mixing Matrix
  1  1     7.04850043E-01   # cos(theta_tau)
  1  2     7.09356340E-01   # sin(theta_tau)
  2  1    -7.09356340E-01   # -sin(theta_tau)
  2  2     7.04850043E-01   # cos(theta_tau)
#
BLOCK ALPHA  # Higgs mixing
          -5.89837341E-01   # Mixing angle in the neutral Higgs boson sector
#
BLOCK HMIX Q=  9.11876000E+01  # DRbar Higgs Parameters
         1     2.50000000E+03   # mu(Q)               
         2     1.49999980E+00   # tanbeta(Q)          
         3     2.51777254E+02   # vev(Q)              
         4     3.81482305E+06   # MA^2(Q)             
#
BLOCK GAUGE Q=  9.11876000E+01  # The gauge couplings
     1     3.53244573E-01   # gprime(Q) DRbar
     2     6.34208037E-01   # g(Q) DRbar
     3     1.10324337E+00   # g3(Q) DRbar
#
BLOCK AU Q=  9.11876000E+01  # The trilinear couplings
  1  1     0.00000000E+00   # A_u(Q) DRbar
  2  2     0.00000000E+00   # A_c(Q) DRbar
  3  3     0.00000000E+00   # A_t(Q) DRbar
#
BLOCK AD Q=  9.11876000E+01  # The trilinear couplings
  1  1     0.00000000E+00   # A_d(Q) DRbar
  2  2     0.00000000E+00   # A_s(Q) DRbar
  3  3     0.00000000E+00   # A_b(Q) DRbar
#
BLOCK AE Q=  9.11876000E+01  # The trilinear couplings
  1  1     0.00000000E+00   # A_e(Q) DRbar
  2  2     0.00000000E+00   # A_mu(Q) DRbar
  3  3     0.00000000E+00   # A_tau(Q) DRbar
#
BLOCK Yu Q=  9.11876000E+01  # The Yukawa couplings
  1  1     0.00000000E+00   # y_u(Q) DRbar
  2  2     0.00000000E+00   # y_c(Q) DRbar
  3  3     1.03610197E+00   # y_t(Q) DRbar
#
BLOCK Yd Q=  9.11876000E+01  # The Yukawa couplings
  1  1     0.00000000E+00   # y_d(Q) DRbar
  2  2     0.00000000E+00   # y_s(Q) DRbar
  3  3     2.73712119E-02   # y_b(Q) DRbar
#
BLOCK Ye Q=  9.11876000E+01  # The Yukawa couplings
  1  1     0.00000000E+00   # y_e(Q) DRbar
  2  2     0.00000000E+00   # y_mu(Q) DRbar
  3  3     1.79976671E-02   # y_tau(Q) DRbar
#
BLOCK MSOFT Q=  9.11876000E+01  # The soft SUSY breaking masses at the scale Q
         1     2.50000000E+03   # M_1                 
         2     2.50000000E+02   # M_2                 
         3     1.00000000E+03   # M_3                 
        14     0.00000000E+00   # A_u                 
        15     0.00000000E+00   # A_d                 
        16     0.00000000E+00   # A_e                 
        21    -4.09156877E+06   # M^2_Hd              
        22    -6.16822023E+06   # M^2_Hu              
        31     2.50000000E+03   # M_eL                
        32     2.50000000E+03   # M_muL               
        33     2.50000000E+03   # M_tauL              
        34     2.50000000E+03   # M_eR                
        35     2.50000000E+03   # M_muR               
        36     2.50000000E+03   # M_tauR              
        41     2.50000000E+03   # M_q1L               
        42     2.50000000E+03   # M_q2L               
        43     2.50000000E+03   # M_q3L               
        44     2.50000000E+03   # M_uR                
        45     2.50000000E+03   # M_cR                
        46     2.50000000E+03   # M_tR                
        47     2.50000000E+03   # M_dR                
        48     2.50000000E+03   # M_sR                
        49     2.50000000E+03   # M_bR                
#
#
#
#                             =================
#                             |The decay table|
#                             =================
#
# - The QCD corrections to the decays gluino -> squark  + quark
#                                     squark -> gaugino + quark_prime
#                                     squark -> squark_prime + Higgs
#                                     squark -> gluino  + quark
#   are included.
#
# - The multi-body decays for the inos, stops and sbottoms are included.
#
# - The loop induced decays for the gluino, neutralinos and stops
#   are included.
#
# - The SUSY decays of the top quark are included.
#
# - Possible decays of the NLSP in GMSB models are included.
#
#
#         PDG            Width
DECAY         6     1.39093352E+00   # top decays
#          BR         NDA      ID1       ID2
     1.00000000E+00    2           5        24   # BR(t ->  b    W+)
#
#         PDG            Width
DECAY   1000021     1.05265784E-03   # gluino decays
#          BR         NDA      ID1       ID2
     5.94637293E-05    2     1000022        21   # BR(~g -> ~chi_10 g)
#          BR         NDA      ID1       ID2
     7.72334176E-04    2     1000039        21   # BR(~g -> ~G      g)
#           BR         NDA      ID1       ID2       ID3
     6.14474547E-02    3     1000022         1        -1   # BR(~g -> ~chi_10 d  db)
     6.14697294E-02    3     1000022         2        -2   # BR(~g -> ~chi_10 u  ub)
     6.14474547E-02    3     1000022         3        -3   # BR(~g -> ~chi_10 s  sb)
     6.14697294E-02    3     1000022         4        -4   # BR(~g -> ~chi_10 c  cb)
     6.14051164E-02    3     1000022         5        -5   # BR(~g -> ~chi_10 b  bb)
     2.70494852E-02    3     1000022         6        -6   # BR(~g -> ~chi_10 t  tb)
     1.22917034E-01    3     1000024         1        -2   # BR(~g -> ~chi_1+ d  ub)
     1.22917034E-01    3    -1000024         2        -1   # BR(~g -> ~chi_1- u  db)
     1.22917034E-01    3     1000024         3        -4   # BR(~g -> ~chi_1+ s  cb)
     1.22917034E-01    3    -1000024         4        -3   # BR(~g -> ~chi_1- c  sb)
     8.66055478E-02    3     1000024         5        -6   # BR(~g -> ~chi_1+ b  tb)
     8.66055478E-02    3    -1000024         6        -5   # BR(~g -> ~chi_1- t  bb)
#
#         PDG            Width
DECAY   1000006     1.21870956E+02   # stop1 decays
#          BR         NDA      ID1       ID2
     4.09949367E-02    2     1000022         6   # BR(~t_1 -> ~chi_10 t )
     8.25934069E-02    2     1000024         5   # BR(~t_1 -> ~chi_1+ b )
     8.76411656E-01    2     1000021         6   # BR(~t_1 -> ~g      t )
#
#         PDG            Width
DECAY   2000006     1.15528338E+02   # stop2 decays
#          BR         NDA      ID1       ID2
     3.79420395E-02    2     1000022         6   # BR(~t_2 -> ~chi_10 t )
     7.63856704E-02    2     1000024         5   # BR(~t_2 -> ~chi_1+ b )
     3.46203301E-04    2     1000037         5   # BR(~t_2 -> ~chi_2+ b )
     8.84792033E-01    2     1000021         6   # BR(~t_2 -> ~g      t )
     5.34054229E-04    2     1000006        23   # BR(~t_2 -> ~t_1    Z )
#
#         PDG            Width
DECAY   1000005     1.18007780E+02   # sbottom1 decays
#          BR         NDA      ID1       ID2
     3.73918401E-02    2     1000022         5   # BR(~b_1 -> ~chi_10 b )
     4.74219441E-06    2     1000023         5   # BR(~b_1 -> ~chi_20 b )
     7.42645906E-02    2    -1000024         6   # BR(~b_1 -> ~chi_1- t )
     8.88338827E-01    2     1000021         5   # BR(~b_1 -> ~g      b )
#
#         PDG            Width
DECAY   2000005     1.19846796E+02   # sbottom2 decays
#          BR         NDA      ID1       ID2
     4.18636758E-02    2     1000022         5   # BR(~b_2 -> ~chi_10 b )
     3.59321681E-06    2     1000023         5   # BR(~b_2 -> ~chi_20 b )
     8.31442991E-02    2    -1000024         6   # BR(~b_2 -> ~chi_1- t )
     8.74988432E-01    2     1000021         5   # BR(~b_2 -> ~g      b )
#
#         PDG            Width
DECAY   1000002     1.33215584E+02   # sup_L decays
#          BR         NDA      ID1       ID2
     7.10153714E-02    2     1000022         2   # BR(~u_L -> ~chi_10 u)
     7.32194926E-06    2     1000023         2   # BR(~u_L -> ~chi_20 u)
     1.42121492E-01    2     1000024         1   # BR(~u_L -> ~chi_1+ d)
     7.86855814E-01    2     1000021         2   # BR(~u_L -> ~g      u)
#
#         PDG            Width
DECAY   2000002     1.04841362E+02   # sup_R decays
#          BR         NDA      ID1       ID2
     2.10935040E-08    2     1000022         2   # BR(~u_R -> ~chi_10 u)
     1.06388383E-04    2     1000023         2   # BR(~u_R -> ~chi_20 u)
     9.99893591E-01    2     1000021         2   # BR(~u_R -> ~g      u)
#
#         PDG            Width
DECAY   1000001     1.33246719E+02   # sdown_L decays
#          BR         NDA      ID1       ID2
     7.10476698E-02    2     1000022         1   # BR(~d_L -> ~chi_10 d)
     3.51419279E-06    2     1000023         1   # BR(~d_L -> ~chi_20 d)
     2.97749922E-11    2     1000025         1   # BR(~d_L -> ~chi_30 d)
     1.42004973E-01    2    -1000024         2   # BR(~d_L -> ~chi_1- u)
     7.86943843E-01    2     1000021         1   # BR(~d_L -> ~g      d)
#
#         PDG            Width
DECAY   2000001     1.04844247E+02   # sdown_R decays
#          BR         NDA      ID1       ID2
     5.27356623E-09    2     1000022         1   # BR(~d_R -> ~chi_10 d)
     2.67181954E-05    2     1000023         1   # BR(~d_R -> ~chi_20 d)
     9.99973277E-01    2     1000021         1   # BR(~d_R -> ~g      d)
#
#         PDG            Width
DECAY   1000004     1.33215584E+02   # scharm_L decays
#          BR         NDA      ID1       ID2
     7.10153714E-02    2     1000022         4   # BR(~c_L -> ~chi_10 c)
     7.32194926E-06    2     1000023         4   # BR(~c_L -> ~chi_20 c)
     1.42121492E-01    2     1000024         3   # BR(~c_L -> ~chi_1+ s)
     7.86855814E-01    2     1000021         4   # BR(~c_L -> ~g      c)
#
#         PDG            Width
DECAY   2000004     1.04841362E+02   # scharm_R decays
#          BR         NDA      ID1       ID2
     2.10935040E-08    2     1000022         4   # BR(~c_R -> ~chi_10 c)
     1.06388383E-04    2     1000023         4   # BR(~c_R -> ~chi_20 c)
     9.99893591E-01    2     1000021         4   # BR(~c_R -> ~g      c)
#
#         PDG            Width
DECAY   1000003     1.33246719E+02   # sstrange_L decays
#          BR         NDA      ID1       ID2
     7.10476698E-02    2     1000022         3   # BR(~s_L -> ~chi_10 s)
     3.51419279E-06    2     1000023         3   # BR(~s_L -> ~chi_20 s)
     2.97749922E-11    2     1000025         3   # BR(~s_L -> ~chi_30 s)
     1.42004973E-01    2    -1000024         4   # BR(~s_L -> ~chi_1- c)
     7.86943843E-01    2     1000021         3   # BR(~s_L -> ~g      s)
#
#         PDG            Width
DECAY   2000003     1.04844247E+02   # sstrange_R decays
#          BR         NDA      ID1       ID2
     5.27356623E-09    2     1000022         3   # BR(~s_R -> ~chi_10 s)
     2.67181954E-05    2     1000023         3   # BR(~s_R -> ~chi_20 s)
     9.99973277E-01    2     1000021         3   # BR(~s_R -> ~g      s)
#
#         PDG            Width
DECAY   1000011     2.93752545E+01   # selectron_L decays
#          BR         NDA      ID1       ID2
     3.33236695E-01    2     1000022        11   # BR(~e_L -> ~chi_10 e-)
     6.94291860E-05    2     1000023        11   # BR(~e_L -> ~chi_20 e-)
     2.03532517E-14    2     1000025        11   # BR(~e_L -> ~chi_30 e-)
     6.66693876E-01    2    -1000024        12   # BR(~e_L -> ~chi_1- nu_e)
#
#         PDG            Width
DECAY   2000011     7.23733975E-03   # selectron_R decays
#          BR         NDA      ID1       ID2
     7.11700763E-04    2     1000022        11   # BR(~e_R -> ~chi_10 e-)
     9.99288299E-01    2     1000023        11   # BR(~e_R -> ~chi_20 e-)
     7.60473968E-12    2     1000025        11   # BR(~e_R -> ~chi_30 e-)
#
#         PDG            Width
DECAY   1000013     2.93752545E+01   # smuon_L decays
#          BR         NDA      ID1       ID2
     3.33236695E-01    2     1000022        13   # BR(~mu_L -> ~chi_10 mu-)
     6.94291860E-05    2     1000023        13   # BR(~mu_L -> ~chi_20 mu-)
     2.03532517E-14    2     1000025        13   # BR(~mu_L -> ~chi_30 mu-)
     6.66693876E-01    2    -1000024        14   # BR(~mu_L -> ~chi_1- nu_mu)
#
#         PDG            Width
DECAY   2000013     7.23733975E-03   # smuon_R decays
#          BR         NDA      ID1       ID2
     7.11700763E-04    2     1000022        13   # BR(~mu_R -> ~chi_10 mu-)
     9.99288299E-01    2     1000023        13   # BR(~mu_R -> ~chi_20 mu-)
     7.60473968E-12    2     1000025        13   # BR(~mu_R -> ~chi_30 mu-)
#
#         PDG            Width
DECAY   1000015     1.46232922E+01   # stau_1 decays
#          BR         NDA      ID1       ID2
     3.33153993E-01    2     1000022        15   # BR(~tau_1 -> ~chi_10  tau-)
     3.14555334E-04    2     1000023        15   # BR(~tau_1 -> ~chi_20  tau-)
     6.66526035E-01    2    -1000024        16   # BR(~tau_1 -> ~chi_1-  nu_tau)
     5.41662881E-06    2     1000039        15   # BR(~tau_1 -> ~G       tau-)
#
#         PDG            Width
DECAY   2000015     1.47592654E+01   # stau_2 decays
#          BR         NDA      ID1       ID2
     3.33154174E-01    2     1000022        15   # BR(~tau_2 -> ~chi_10  tau-)
     3.15336533E-04    2     1000023        15   # BR(~tau_2 -> ~chi_20  tau-)
     6.66530490E-01    2    -1000024        16   # BR(~tau_2 -> ~chi_1-  nu_tau)
#
#         PDG            Width
DECAY   1000012     2.93984908E+01   # snu_eL decays
#          BR         NDA      ID1       ID2
     3.33388569E-01    2     1000022        12   # BR(~nu_eL -> ~chi_10 nu_e)
     5.29679296E-05    2     1000023        12   # BR(~nu_eL -> ~chi_20 nu_e)
     6.66558463E-01    2     1000024        11   # BR(~nu_eL -> ~chi_1+ e-)
#
#         PDG            Width
DECAY   1000014     2.93984908E+01   # snu_muL decays
#          BR         NDA      ID1       ID2
     3.33388569E-01    2     1000022        14   # BR(~nu_muL -> ~chi_10 nu_mu)
     5.29679296E-05    2     1000023        14   # BR(~nu_muL -> ~chi_20 nu_mu)
     6.66558463E-01    2     1000024        13   # BR(~nu_muL -> ~chi_1+ mu-)
#
#         PDG            Width
DECAY   1000016     2.93984901E+01   # snu_tauL decays
#          BR         NDA      ID1       ID2
     3.33388578E-01    2     1000022        16   # BR(~nu_tauL -> ~chi_10 nu_tau)
     5.29679310E-05    2     1000023        16   # BR(~nu_tauL -> ~chi_20 nu_tau)
     6.66558454E-01    2     1000024        15   # BR(~nu_tauL -> ~chi_1+ tau-)
#
#         PDG            Width
DECAY   1000024     4.84630706E-10   # chargino1+ decays
#          BR         NDA      ID1       ID2
     1.00000000E+00    2     1000039        24   # BR(~chi_1+ -> ~G       W+)
#           BR         NDA      ID1       ID2       ID3
     2.77701306E-18    3     1000022         2        -1   # BR(~chi_1+ -> ~chi_10 u    db)
     2.77701306E-18    3     1000022         4        -3   # BR(~chi_1+ -> ~chi_10 c    sb)
     9.25671100E-19    3     1000022       -11        12   # BR(~chi_1+ -> ~chi_10 e+   nu_e)
     9.25671100E-19    3     1000022       -13        14   # BR(~chi_1+ -> ~chi_10 mu+  nu_mu)
#
#         PDG            Width
DECAY   1000037     1.85470835E+01   # chargino2+ decays
#          BR         NDA      ID1       ID2
     2.81411690E-07    2     1000002        -1   # BR(~chi_2+ -> ~u_L     db)
     4.54564088E-07    2    -1000001         2   # BR(~chi_2+ -> ~d_L*    u )
     2.81411690E-07    2     1000004        -3   # BR(~chi_2+ -> ~c_L     sb)
     4.54564088E-07    2    -1000003         4   # BR(~chi_2+ -> ~s_L*    c )
     4.05179949E-03    2     1000006        -5   # BR(~chi_2+ -> ~t_1     bb)
     2.84731139E-09    2     1000012       -11   # BR(~chi_2+ -> ~nu_eL   e+  )
     2.84731139E-09    2     1000014       -13   # BR(~chi_2+ -> ~nu_muL  mu+ )
     1.98047123E-09    2     1000016       -15   # BR(~chi_2+ -> ~nu_tau1 tau+)
     3.92440087E-09    2    -1000011        12   # BR(~chi_2+ -> ~e_L+    nu_e)
     3.92440087E-09    2    -1000013        14   # BR(~chi_2+ -> ~mu_L+   nu_mu)
     3.83050377E-10    2    -1000015        16   # BR(~chi_2+ -> ~tau_1+  nu_tau)
     1.41317190E-09    2    -2000015        16   # BR(~chi_2+ -> ~tau_2+  nu_tau)
     3.19786789E-01    2     1000024        23   # BR(~chi_2+ -> ~chi_1+  Z )
     3.12876236E-01    2     1000022        24   # BR(~chi_2+ -> ~chi_10  W+)
     3.15916211E-01    2     1000024        25   # BR(~chi_2+ -> ~chi_1+  h )
     1.56101065E-02    2     1000024        35   # BR(~chi_2+ -> ~chi_1+  H )
     1.59397966E-02    2     1000024        36   # BR(~chi_2+ -> ~chi_1+  A )
     1.58153895E-02    2     1000022        37   # BR(~chi_2+ -> ~chi_10  H+)
     2.14664460E-06    2     1000039        24   # BR(~chi_2+ -> ~G       W+)
     3.61616963E-08    2     1000039        37   # BR(~chi_2+ -> ~G       H+)
#
#         PDG            Width
DECAY   1000022     4.98155056E-10   # neutralino1 decays
#          BR         NDA      ID1       ID2
     3.56635505E-01    2     1000039        22   # BR(~chi_10 -> ~G        gam)
     6.43364146E-01    2     1000039        23   # BR(~chi_10 -> ~G        Z)
     3.49217386E-07    2     1000039        25   # BR(~chi_10 -> ~G        h)
#
#         PDG            Width
DECAY   1000023     8.98972338E+00   # neutralino2 decays
#          BR         NDA      ID1       ID2
     8.10426728E-03    2     1000022        23   # BR(~chi_20 -> ~chi_10   Z )
     3.19610360E-01    2     1000024       -24   # BR(~chi_20 -> ~chi_1+   W-)
     3.19610360E-01    2    -1000024        24   # BR(~chi_20 -> ~chi_1-   W+)
     3.14777398E-01    2     1000022        25   # BR(~chi_20 -> ~chi_10   h )
     1.66603550E-03    2     1000022        35   # BR(~chi_20 -> ~chi_10   H )
     1.10070126E-02    2     1000022        36   # BR(~chi_20 -> ~chi_10   A )
     1.26092063E-02    2     1000024       -37   # BR(~chi_20 -> ~chi_1+   H-)
     1.26092063E-02    2    -1000024        37   # BR(~chi_20 -> ~chi_1-   H+)
     3.31429410E-06    2     1000039        22   # BR(~chi_20 -> ~G        gam)
     2.74200730E-06    2     1000039        23   # BR(~chi_20 -> ~G        Z)
     7.21323634E-08    2     1000039        25   # BR(~chi_20 -> ~G        h)
     2.38527961E-08    2     1000039        35   # BR(~chi_20 -> ~G        H)
     9.99711717E-10    2     1000039        36   # BR(~chi_20 -> ~G        A)
#
#         PDG            Width
DECAY   1000025     1.83757294E+01   # neutralino3 decays
#          BR         NDA      ID1       ID2
     3.13937830E-01    2     1000022        23   # BR(~chi_30 -> ~chi_10   Z )
     3.15415660E-01    2     1000024       -24   # BR(~chi_30 -> ~chi_1+   W-)
     3.15415660E-01    2    -1000024        24   # BR(~chi_30 -> ~chi_1-   W+)
     8.24201204E-03    2     1000022        25   # BR(~chi_30 -> ~chi_10   h )
     1.37206099E-02    2     1000022        35   # BR(~chi_30 -> ~chi_10   H )
     1.84952752E-03    2     1000022        36   # BR(~chi_30 -> ~chi_10   A )
     1.57082594E-02    2     1000024       -37   # BR(~chi_30 -> ~chi_1+   H-)
     1.57082594E-02    2    -1000024        37   # BR(~chi_30 -> ~chi_1-   H+)
     1.00772215E-09    2     1000002        -2   # BR(~chi_30 -> ~u_L      ub)
     1.00772215E-09    2    -1000002         2   # BR(~chi_30 -> ~u_L*     u )
     3.71915347E-11    2     2000002        -2   # BR(~chi_30 -> ~u_R      ub)
     3.71915347E-11    2    -2000002         2   # BR(~chi_30 -> ~u_R*     u )
     2.42250357E-12    2     2000001        -1   # BR(~chi_30 -> ~d_R      db)
     2.42250357E-12    2    -2000001         1   # BR(~chi_30 -> ~d_R*     d )
     1.00772215E-09    2     1000004        -4   # BR(~chi_30 -> ~c_L      cb)
     1.00772215E-09    2    -1000004         4   # BR(~chi_30 -> ~c_L*     c )
     3.71915347E-11    2     2000004        -4   # BR(~chi_30 -> ~c_R      cb)
     3.71915347E-11    2    -2000004         4   # BR(~chi_30 -> ~c_R*     c )
     2.42250357E-12    2     2000003        -3   # BR(~chi_30 -> ~s_R      sb)
     2.42250357E-12    2    -2000003         3   # BR(~chi_30 -> ~s_R*     s )
     1.40308521E-12    2     1000012       -12   # BR(~chi_30 -> ~nu_eL    nu_eb)
     1.40308521E-12    2    -1000012        12   # BR(~chi_30 -> ~nu_eL*   nu_e )
     1.40308521E-12    2     1000014       -14   # BR(~chi_30 -> ~nu_muL   nu_mub)
     1.40308521E-12    2    -1000014        14   # BR(~chi_30 -> ~nu_muL*  nu_mu )
     1.40308521E-12    2     1000016       -16   # BR(~chi_30 -> ~nu_tau1  nu_taub)
     1.40308521E-12    2    -1000016        16   # BR(~chi_30 -> ~nu_tau1* nu_tau )
     6.72335550E-12    2     1000039        22   # BR(~chi_30 -> ~G        gam)
     8.28942640E-08    2     1000039        23   # BR(~chi_30 -> ~G        Z)
     2.06009551E-06    2     1000039        25   # BR(~chi_30 -> ~G        h)
     1.33158684E-09    2     1000039        35   # BR(~chi_30 -> ~G        H)
     3.49147331E-08    2     1000039        36   # BR(~chi_30 -> ~G        A)
#
#         PDG            Width
DECAY   1000035     9.50298195E+00   # neutralino4 decays
#          BR         NDA      ID1       ID2
     8.69767129E-03    2     1000022        23   # BR(~chi_40 -> ~chi_10   Z )
     3.08697299E-01    2     1000024       -24   # BR(~chi_40 -> ~chi_1+   W-)
     3.08697299E-01    2    -1000024        24   # BR(~chi_40 -> ~chi_1-   W+)
     3.03225483E-01    2     1000022        25   # BR(~chi_40 -> ~chi_10   h )
     1.86855894E-03    2     1000022        35   # BR(~chi_40 -> ~chi_10   H )
     1.70728657E-02    2     1000022        36   # BR(~chi_40 -> ~chi_10   A )
     1.88927064E-02    2     1000024       -37   # BR(~chi_40 -> ~chi_1+   H-)
     1.88927064E-02    2    -1000024        37   # BR(~chi_40 -> ~chi_1-   H+)
     1.26008343E-04    2     1000002        -2   # BR(~chi_40 -> ~u_L      ub)
     1.26008343E-04    2    -1000002         2   # BR(~chi_40 -> ~u_L*     u )
     3.05969063E-03    2     2000002        -2   # BR(~chi_40 -> ~u_R      ub)
     3.05969063E-03    2    -2000002         2   # BR(~chi_40 -> ~u_R*     u )
     2.67981542E-04    2     1000001        -1   # BR(~chi_40 -> ~d_L      db)
     2.67981542E-04    2    -1000001         1   # BR(~chi_40 -> ~d_L*     d )
     7.61929700E-04    2     2000001        -1   # BR(~chi_40 -> ~d_R      db)
     7.61929700E-04    2    -2000001         1   # BR(~chi_40 -> ~d_R*     d )
     1.26008343E-04    2     1000004        -4   # BR(~chi_40 -> ~c_L      cb)
     1.26008343E-04    2    -1000004         4   # BR(~chi_40 -> ~c_L*     c )
     3.05969063E-03    2     2000004        -4   # BR(~chi_40 -> ~c_R      cb)
     3.05969063E-03    2    -2000004         4   # BR(~chi_40 -> ~c_R*     c )
     2.67981542E-04    2     1000003        -3   # BR(~chi_40 -> ~s_L      sb)
     2.67981542E-04    2    -1000003         3   # BR(~chi_40 -> ~s_L*     s )
     7.61929700E-04    2     2000003        -3   # BR(~chi_40 -> ~s_R      sb)
     7.61929700E-04    2    -2000003         3   # BR(~chi_40 -> ~s_R*     s )
     1.20564318E-04    2     1000005        -5   # BR(~chi_40 -> ~b_1      bb)
     1.20564318E-04    2    -1000005         5   # BR(~chi_40 -> ~b_1*     b )
     1.34791362E-04    2     2000005        -5   # BR(~chi_40 -> ~b_2      bb)
     1.34791362E-04    2    -2000005         5   # BR(~chi_40 -> ~b_2*     b )
     8.60682886E-05    2     1000011       -11   # BR(~chi_40 -> ~e_L-     e+)
     8.60682886E-05    2    -1000011        11   # BR(~chi_40 -> ~e_L+     e-)
     3.92555314E-04    2     2000011       -11   # BR(~chi_40 -> ~e_R-     e+)
     3.92555314E-04    2    -2000011        11   # BR(~chi_40 -> ~e_R+     e-)
     8.60682886E-05    2     1000013       -13   # BR(~chi_40 -> ~mu_L-    mu+)
     8.60682886E-05    2    -1000013        13   # BR(~chi_40 -> ~mu_L+    mu-)
     3.92555314E-04    2     2000013       -13   # BR(~chi_40 -> ~mu_R-    mu+)
     3.92555314E-04    2    -2000013        13   # BR(~chi_40 -> ~mu_R+    mu-)
     2.41123663E-04    2     1000015       -15   # BR(~chi_40 -> ~tau_1-   tau+)
     2.41123663E-04    2    -1000015        15   # BR(~chi_40 -> ~tau_1+   tau-)
     2.36556354E-04    2     2000015       -15   # BR(~chi_40 -> ~tau_2-   tau+)
     2.36556354E-04    2    -2000015        15   # BR(~chi_40 -> ~tau_2+   tau-)
     1.13262026E-04    2     1000012       -12   # BR(~chi_40 -> ~nu_eL    nu_eb)
     1.13262026E-04    2    -1000012        12   # BR(~chi_40 -> ~nu_eL*   nu_e )
     1.13262026E-04    2     1000014       -14   # BR(~chi_40 -> ~nu_muL   nu_mub)
     1.13262026E-04    2    -1000014        14   # BR(~chi_40 -> ~nu_muL*  nu_mu )
     1.13262026E-04    2     1000016       -16   # BR(~chi_40 -> ~nu_tau1  nu_taub)
     1.13262026E-04    2    -1000016        16   # BR(~chi_40 -> ~nu_tau1* nu_tau )
     3.24631528E-06    2     1000039        22   # BR(~chi_40 -> ~G        gam)
     3.42930487E-06    2     1000039        23   # BR(~chi_40 -> ~G        Z)
     8.95939253E-08    2     1000039        25   # BR(~chi_40 -> ~G        h)
     4.71349767E-08    2     1000039        35   # BR(~chi_40 -> ~G        H)
     1.89996285E-09    2     1000039        36   # BR(~chi_40 -> ~G        A)
#
#         PDG            Width
DECAY        25     3.56352580E-03   # h decays
#          BR         NDA      ID1       ID2
     6.88172721E-01    2           5        -5   # BR(h -> b       bb     )
     7.00824193E-02    2         -15        15   # BR(h -> tau+    tau-   )
     2.48091474E-04    2         -13        13   # BR(h -> mu+     mu-    )
     5.29950096E-04    2           3        -3   # BR(h -> s       sb     )
     2.28993047E-02    2           4        -4   # BR(h -> c       cb     )
     6.83828972E-02    2          21        21   # BR(h -> g       g      )
     2.24914024E-03    2          22        22   # BR(h -> gam     gam    )
     1.09128938E-03    2          22        23   # BR(h -> Z       gam    )
     1.31119210E-01    2          24       -24   # BR(h -> W+      W-     )
     1.52249764E-02    2          23        23   # BR(h -> Z       Z      )
#
#         PDG            Width
DECAY        35     3.75786600E+01   # H decays
#          BR         NDA      ID1       ID2
     1.45938272E-03    2           5        -5   # BR(H -> b       bb     )
     2.48059209E-04    2         -15        15   # BR(H -> tau+    tau-   )
     8.76981658E-07    2         -13        13   # BR(H -> mu+     mu-    )
     1.12283217E-06    2           3        -3   # BR(H -> s       sb     )
     1.01171536E-05    2           4        -4   # BR(H -> c       cb     )
     9.96157984E-01    2           6        -6   # BR(H -> t       tb     )
     7.92068329E-04    2          21        21   # BR(H -> g       g      )
     2.78068434E-06    2          22        22   # BR(H -> gam     gam    )
     1.15411437E-06    2          23        22   # BR(H -> Z       gam    )
     2.34271720E-04    2          24       -24   # BR(H -> W+      W-     )
     1.16815782E-04    2          23        23   # BR(H -> Z       Z      )
     7.86932853E-04    2          25        25   # BR(H -> h       h      )
     8.29581149E-24    2          36        36   # BR(H -> A       A      )
     2.76200157E-11    2          23        36   # BR(H -> Z       A      )
     1.90036349E-12    2          24       -37   # BR(H -> W+      H-     )
     1.90036349E-12    2         -24        37   # BR(H -> W-      H+     )
     1.25571111E-04    2     1000024  -1000024   # BR(H -> ~chi_1+ ~chi_1-)
     6.28625528E-05    2     1000022   1000022   # BR(H -> ~chi_10 ~chi_10)
#
#         PDG            Width
DECAY        36     3.81030680E+01   # A decays
#          BR         NDA      ID1       ID2
     1.45799312E-03    2           5        -5   # BR(A -> b       bb     )
     2.44762876E-04    2         -15        15   # BR(A -> tau+    tau-   )
     8.65325186E-07    2         -13        13   # BR(A -> mu+     mu-    )
     1.14076391E-06    2           3        -3   # BR(A -> s       sb     )
     9.99671579E-06    2           4        -4   # BR(A -> c       cb     )
     9.95506843E-01    2           6        -6   # BR(A -> t       tb     )
     9.40898972E-04    2          21        21   # BR(A -> g       g      )
     2.73819390E-06    2          22        22   # BR(A -> gam     gam    )
     1.34187614E-06    2          23        22   # BR(A -> Z       gam    )
     2.27980457E-04    2          23        25   # BR(A -> Z       h      )
     1.06978837E-03    2     1000024  -1000024   # BR(A -> ~chi_1+ ~chi_1-)
     5.35650755E-04    2     1000022   1000022   # BR(A -> ~chi_10 ~chi_10)
#
#         PDG            Width
DECAY        37     3.72634794E+01   # H+ decays
#          BR         NDA      ID1       ID2
     2.33012221E-06    2           4        -5   # BR(H+ -> c       bb     )
     2.50529839E-04    2         -15        16   # BR(H+ -> tau+    nu_tau )
     8.85713481E-07    2         -13        14   # BR(H+ -> mu+     nu_mu  )
     1.48123858E-08    2           2        -5   # BR(H+ -> u       bb     )
     5.48485061E-08    2           2        -3   # BR(H+ -> u       sb     )
     1.09287714E-05    2           4        -3   # BR(H+ -> c       sb     )
     9.99501100E-01    2           6        -5   # BR(H+ -> t       bb     )
     2.34155442E-04    2          24        25   # BR(H+ -> W+      h      )
     1.17255673E-12    2          24        36   # BR(H+ -> W+      A      )
     1.49297225E-10    2     1000024   1000022   # BR(H+ -> ~chi_1+ ~chi_10)
