#  ISAJET SUSY parameters in SUSY Les Houches Accord 2 format
#  Created by ISALHA 2.0 Last revision: C. Balazs 21 Apr 2009
Block SPINFO   # Program information
     1   ISASUGRA from ISAJET          # Spectrum Calculator
     2   7.80   29-OCT-2009 12:50:36   # Version number
Block MODSEL   # Model selection
     1     1   # Minimal supergravity (mSUGRA) model               
Block SMINPUTS   # Standard Model inputs
     1     1.27837624E+02   # alpha_em^(-1)
     2     1.16570000E-05   # G_Fermi
     3     1.17200002E-01   # alpha_s(M_Z)
     4     9.11699982E+01   # m_{Z}(pole)
     5     4.19999981E+00   # m_{b}(m_{b})
     6     1.72500000E+02   # m_{top}(pole)
     7     1.77699995E+00   # m_{tau}(pole)
Block MINPAR   # SUSY breaking input parameters
     1     2.10000000E+03   # m_0
     2     2.10000000E+02   # m_{1/2}
     3     1.00000000E+01   # tan(beta)
     4     1.00000000E+00   # sign(mu)
     5     0.00000000E+00   # A_0
Block EXTPAR   # Non-universal SUSY breaking parameters
     0     2.43732286E+16   # Input scale
Block MASS   # Scalar and gaugino mass spectrum
#  PDG code   mass                 particle
        24     8.04229965E+01   #  W^+
        25     1.14601486E+02   #  h^0            
        35     2.10485181E+03   #  H^0            
        36     2.09100708E+03   #  A^0            
        37     2.10639893E+03   #  H^+            
   1000001     2.12325488E+03   #  dnl            
   1000002     2.12174268E+03   #  upl            
   1000003     2.12325488E+03   #  stl            
   1000004     2.12174341E+03   #  chl            
   1000005     1.73395105E+03   #  b1             
   1000006     1.23511633E+03   #  t1             
   1000011     2.10026807E+03   #  el-            
   1000012     2.09942920E+03   #  nuel           
   1000013     2.10026807E+03   #  mul-           
   1000014     2.09942920E+03   #  numl           
   1000015     2.07992407E+03   #  tau1           
   1000016     2.08988867E+03   #  nutl           
   1000021     6.07974609E+02   #  glss           
   1000022     8.50628586E+01   #  z1ss           
   1000023     1.57252090E+02   #  z2ss           
   1000024     1.58165390E+02   #  w1ss           
   1000025    -3.16895111E+02   #  z3ss           
   1000035     3.39275940E+02   #  z4ss           
   1000037     3.37979187E+02   #  w2ss           
   2000001     2.12902979E+03   #  dnr            
   2000002     2.12769067E+03   #  upr            
   2000003     2.12902979E+03   #  str            
   2000004     2.12769116E+03   #  chr            
   2000005     2.10798633E+03   #  b2             
   2000006     1.74350305E+03   #  t2             
   2000011     2.09943848E+03   #  er-            
   2000013     2.09943848E+03   #  mur-           
   2000015     2.09060034E+03   #  tau2           
Block ALPHA   # Effective Higgs mixing parameter
         -1.00143373E-01   # alpha
Block STOPMIX   # stop mixing matrix
  1  1     3.15068811E-02   # O_{11}
  1  2     9.99503553E-01   # O_{12}
  2  1    -9.99503553E-01   # O_{21}
  2  2     3.15068811E-02   # O_{22}
Block SBOTMIX   # sbottom mixing matrix
  1  1     9.99969184E-01   # O_{11}
  1  2     7.85401557E-03   # O_{12}
  2  1    -7.85401557E-03   # O_{21}
  2  2     9.99969184E-01   # O_{22}
Block STAUMIX   # stau mixing matrix
  1  1     1.81557283E-01   # O_{11}
  1  2     9.83380377E-01   # O_{12}
  2  1    -9.83380377E-01   # O_{21}
  2  2     1.81557283E-01   # O_{22}
Block NMIX   # neutralino mixing matrix
  1  1     9.80770290E-01   #
  1  2    -7.20431432E-02   #
  1  3     1.70314923E-01   #
  1  4    -6.23892322E-02   #
  2  1    -1.32565618E-01   #
  2  2    -9.25105512E-01   #
  2  3     3.04848045E-01   #
  2  4    -1.83504462E-01   #
  3  1    -6.79167062E-02   #
  3  2     9.68706235E-02   #
  3  3     6.92698717E-01   #
  3  4     7.11457789E-01   #
  4  1    -1.26108974E-01   #
  4  2     3.60007942E-01   #
  4  3     6.31054163E-01   #
  4  4    -6.75471425E-01   #
Block UMIX   # chargino U mixing matrix
  1  1    -8.99384081E-01   # U_{11}
  1  2     4.37159359E-01   # U_{12}
  2  1    -4.37159359E-01   # U_{21}
  2  2    -8.99384081E-01   # U_{22}
Block VMIX   # chargino V mixing matrix
  1  1    -9.65584040E-01   # V_{11}
  1  2     2.60091305E-01   # V_{12}
  2  1    -2.60091305E-01   # V_{21}
  2  2    -9.65584040E-01   # V_{22}
Block GAUGE Q=  1.45651672E+03   #
     1     3.57519567E-01   # g`
     2     6.52396560E-01   # g_2
     3     1.21954346E+00   # g_3
Block YU Q=  1.45651672E+03   #
  3  3     8.58145058E-01   # y_t
Block YD Q=  1.45651672E+03   #
  3  3     1.32898793E-01   # y_b
Block YE Q=  1.45651672E+03   #
  3  3     1.01769067E-01   # y_tau
Block HMIX Q=  1.45651672E+03   # Higgs mixing parameters
     1     3.05380707E+02   # mu(Q)
     2     1.00000000E+01   # tan(beta)(M_GUT)
     3     2.51440918E+02   # Higgs vev at Q
     4     4.37231050E+06   # m_A^2(Q)
Block MSOFT Q=  1.45651672E+03   # DRbar SUSY breaking parameters
     1     8.87106781E+01   # M_1(Q)          
     2     1.64388626E+02   # M_2(Q)          
     3     5.00544861E+02   # M_3(Q)          
    31     2.09325708E+03   # MeL(Q)          
    32     2.09325708E+03   # MmuL(Q)         
    33     2.08394214E+03   # MtauL(Q)        
    34     2.09697754E+03   # MeR(Q)          
    35     2.09697754E+03   # MmuR(Q)         
    36     2.07833618E+03   # MtauR(Q)        
    41     2.09023315E+03   # MqL1(Q)         
    42     2.09023315E+03   # MqL2(Q)         
    43     1.71039819E+03   # MqL3(Q)         
    44     2.09574731E+03   # MuR(Q)          
    45     2.09574731E+03   # McR(Q)          
    46     1.24032007E+03   # MtR(Q)          
    47     2.09662183E+03   # MdR(Q)          
    48     2.09662183E+03   # MsR(Q)          
    49     2.08001099E+03   # MbR(Q)          
Block AU Q=  1.45651672E+03   #
  1  1    -3.57992096E+02   # A_u
  2  2    -3.57992096E+02   # A_c
  3  3    -3.57992096E+02   # A_t
Block AD Q=  1.45651672E+03   #
  1  1    -5.30353333E+02   # A_d
  2  2    -5.30353333E+02   # A_s
  3  3    -5.30353333E+02   # A_b
Block AE Q=  1.45651672E+03   #
  1  1    -1.24265480E+02   # A_e
  2  2    -1.24265480E+02   # A_mu
  3  3    -1.24265480E+02   # A_tau
#  ISAJET decay tables in SUSY Les Houches accord format
#  Created by ISALHD. Last revision: C. Balazs, 2005 May 25
Block DCINFO                           # Program information
     1   ISASUGRA from ISAJET          # Spectrum Calculator
     2   7.80   29-OCT-2009 12:50:36   # Version number
#         PDG         Width
DECAY         6  1.14680779E+00   # TP    decays
#          BR          NDA       ID1       ID2       ID3       ID4
      3.33333343E-01    3            2        -1         5             # TP     -->  UP     DB     BT          
      3.33333343E-01    3            4        -3         5             # TP     -->  CH     SB     BT          
      1.11111112E-01    3          -11        12         5             # TP     -->  E+     NUE    BT          
      1.11111112E-01    3          -13        14         5             # TP     -->  MU+    NUM    BT          
      1.11111112E-01    3          -15        16         5             # TP     -->  TAU+   NUT    BT          
#         PDG         Width
DECAY   1000021  2.13767111E-04   # GLSS  decays
#          BR          NDA       ID1       ID2       ID3       ID4
      7.94806778E-02    3      1000024         1        -2             # GLSS   -->  W1SS+  DN     UB          
      7.94806778E-02    3     -1000024         2        -1             # GLSS   -->  W1SS-  UP     DB          
      7.94806257E-02    3      1000024         3        -4             # GLSS   -->  W1SS+  ST     CB          
      7.94806257E-02    3     -1000024         4        -3             # GLSS   -->  W1SS-  CH     SB          
      5.25533147E-02    3      1000024         5        -6             # GLSS   -->  W1SS+  BT     TB          
      5.25533147E-02    3     -1000024         6        -5             # GLSS   -->  W1SS-  TP     BB          
      2.10785982E-03    3      1000037         1        -2             # GLSS   -->  W2SS+  DN     UB          
      2.10785982E-03    3     -1000037         2        -1             # GLSS   -->  W2SS-  UP     DB          
      2.10785866E-03    3      1000037         3        -4             # GLSS   -->  W2SS+  ST     CB          
      2.10785866E-03    3     -1000037         4        -3             # GLSS   -->  W2SS-  CH     SB          
      2.23283563E-02    3      1000037         5        -6             # GLSS   -->  W2SS+  BT     TB          
      2.23283563E-02    3     -1000037         6        -5             # GLSS   -->  W2SS-  TP     BB          
      3.28629743E-04    2      1000022        21                       # GLSS   -->  Z1SS   GL                 
      3.07042412E-02    3      1000022         2        -2             # GLSS   -->  Z1SS   UP     UB          
      1.12009561E-02    3      1000022         1        -1             # GLSS   -->  Z1SS   DN     DB          
      1.12009561E-02    3      1000022         3        -3             # GLSS   -->  Z1SS   ST     SB          
      3.07042114E-02    3      1000022         4        -4             # GLSS   -->  Z1SS   CH     CB          
      1.67750902E-02    3      1000022         5        -5             # GLSS   -->  Z1SS   BT     BB          
      4.29436229E-02    3      1000022         6        -6             # GLSS   -->  Z1SS   TP     TB          
      9.52671003E-03    2      1000023        21                       # GLSS   -->  Z2SS   GL                 
      4.18458953E-02    3      1000023         2        -2             # GLSS   -->  Z2SS   UP     UB          
      3.72843072E-02    3      1000023         1        -1             # GLSS   -->  Z2SS   DN     DB          
      3.72843072E-02    3      1000023         3        -3             # GLSS   -->  Z2SS   ST     SB          
      4.18458283E-02    3      1000023         4        -4             # GLSS   -->  Z2SS   CH     CB          
      8.75159651E-02    3      1000023         5        -5             # GLSS   -->  Z2SS   BT     BB          
      4.48525837E-03    3      1000023         6        -6             # GLSS   -->  Z2SS   TP     TB          
      6.16748631E-02    2      1000025        21                       # GLSS   -->  Z3SS   GL                 
      4.08413980E-05    3      1000025         2        -2             # GLSS   -->  Z3SS   UP     UB          
      5.34135252E-05    3      1000025         1        -1             # GLSS   -->  Z3SS   DN     DB          
      5.34135252E-05    3      1000025         3        -3             # GLSS   -->  Z3SS   ST     SB          
      4.08413398E-05    3      1000025         4        -4             # GLSS   -->  Z3SS   CH     CB          
      1.74351723E-03    3      1000025         5        -5             # GLSS   -->  Z3SS   BT     BB          
      4.80302535E-02    2      1000035        21                       # GLSS   -->  Z4SS   GL                 
      1.01557455E-03    3      1000035         2        -2             # GLSS   -->  Z4SS   UP     UB          
      1.23622373E-03    3      1000035         1        -1             # GLSS   -->  Z4SS   DN     DB          
      1.23622373E-03    3      1000035         3        -3             # GLSS   -->  Z4SS   ST     SB          
      1.01557316E-03    3      1000035         4        -4             # GLSS   -->  Z4SS   CH     CB          
      4.09589382E-03    3      1000035         5        -5             # GLSS   -->  Z4SS   BT     BB          
#         PDG         Width
DECAY   1000002  1.28609344E+02   # UPL   decays
#          BR          NDA       ID1       ID2       ID3       ID4
      8.02027411E-04    2      1000022         2                       # UPL    -->  Z1SS   UP                 
      6.19069710E-02    2      1000023         2                       # UPL    -->  Z2SS   UP                 
      4.73160151E-04    2      1000025         2                       # UPL    -->  Z3SS   UP                 
      7.48421298E-03    2      1000035         2                       # UPL    -->  Z4SS   UP                 
      7.92352319E-01    2      1000021         2                       # UPL    -->  GLSS   UP                 
      1.28056675E-01    2      1000024         1                       # UPL    -->  W1SS+  DN                 
      8.92461743E-03    2      1000037         1                       # UPL    -->  W2SS+  DN                 
#         PDG         Width
DECAY   1000001  1.28625046E+02   # DNL   decays
#          BR          NDA       ID1       ID2       ID3       ID4
      4.38887905E-03    2      1000022         1                       # DNL    -->  Z1SS   DN                 
      5.57681136E-02    2      1000023         1                       # DNL    -->  Z2SS   DN                 
      7.93722807E-04    2      1000025         1                       # DNL    -->  Z3SS   DN                 
      9.68443882E-03    2      1000035         1                       # DNL    -->  Z4SS   DN                 
      7.92968452E-01    2      1000021         1                       # DNL    -->  GLSS   DN                 
      1.11166976E-01    2     -1000024         2                       # DNL    -->  W1SS-  UP                 
      2.52293572E-02    2     -1000037         2                       # DNL    -->  W2SS-  UP                 
#         PDG         Width
DECAY   1000003  1.28625015E+02   # STL   decays
#          BR          NDA       ID1       ID2       ID3       ID4
      4.38887998E-03    2      1000022         3                       # STL    -->  Z1SS   ST                 
      5.57681285E-02    2      1000023         3                       # STL    -->  Z2SS   ST                 
      7.93722982E-04    2      1000025         3                       # STL    -->  Z3SS   ST                 
      9.68444068E-03    2      1000035         3                       # STL    -->  Z4SS   ST                 
      7.92968631E-01    2      1000021         3                       # STL    -->  GLSS   ST                 
      1.11166917E-01    2     -1000024         4                       # STL    -->  W1SS-  CH                 
      2.52293386E-02    2     -1000037         4                       # STL    -->  W2SS-  CH                 
#         PDG         Width
DECAY   1000004  1.28609299E+02   # CHL   decays
#          BR          NDA       ID1       ID2       ID3       ID4
      8.02027353E-04    2      1000022         4                       # CHL    -->  Z1SS   CH                 
      6.19069599E-02    2      1000023         4                       # CHL    -->  Z2SS   CH                 
      4.73160064E-04    2      1000025         4                       # CHL    -->  Z3SS   CH                 
      7.48421298E-03    2      1000035         4                       # CHL    -->  Z4SS   CH                 
      7.92352200E-01    2      1000021         4                       # CHL    -->  GLSS   CH                 
      1.28056794E-01    2      1000024         3                       # CHL    -->  W1SS+  ST                 
      8.92462581E-03    2      1000037         3                       # CHL    -->  W2SS+  ST                 
#         PDG         Width
DECAY   1000005  1.22478119E+02   # BT1   decays
#          BR          NDA       ID1       ID2       ID3       ID4
      3.93627770E-03    2      1000022         5                       # BT1    -->  Z1SS   BT                 
      4.81020771E-02    2      1000023         5                       # BT1    -->  Z2SS   BT                 
      2.96684820E-03    2      1000025         5                       # BT1    -->  Z3SS   BT                 
      9.94185638E-03    2      1000035         5                       # BT1    -->  Z4SS   BT                 
      6.32978320E-01    2      1000021         5                       # BT1    -->  GLSS   BT                 
      1.04799911E-01    2     -1000024         6                       # BT1    -->  W1SS-  TP                 
      1.94118515E-01    2     -1000037         6                       # BT1    -->  W2SS-  TP                 
      3.15618329E-03    2          -24   1000006                       # BT1    -->  W-     TP1                
#         PDG         Width
DECAY   1000006  7.25489807E+01   # TP1   decays
#          BR          NDA       ID1       ID2       ID3       ID4
      5.54258823E-01    2      1000021         6                       # TP1    -->  GLSS   TP                 
      3.61802727E-02    2      1000022         6                       # TP1    -->  Z1SS   TP                 
      9.56751686E-03    2      1000023         6                       # TP1    -->  Z2SS   TP                 
      1.03420727E-01    2      1000025         6                       # TP1    -->  Z3SS   TP                 
      8.87303054E-02    2      1000035         6                       # TP1    -->  Z4SS   TP                 
      1.86894089E-02    2      1000024         5                       # TP1    -->  W1SS+  BT                 
      1.89152956E-01    2      1000037         5                       # TP1    -->  W2SS+  BT                 
#         PDG         Width
DECAY   2000002  1.07053696E+02   # UPR   decays
#          BR          NDA       ID1       ID2       ID3       ID4
      4.30792645E-02    2      1000022         2                       # UPR    -->  Z1SS   UP                 
      7.80957460E-04    2      1000023         2                       # UPR    -->  Z2SS   UP                 
      1.98148948E-04    2      1000025         2                       # UPR    -->  Z3SS   UP                 
      6.78647251E-04    2      1000035         2                       # UPR    -->  Z4SS   UP                 
      9.55263019E-01    2      1000021         2                       # UPR    -->  GLSS   UP                 
#         PDG         Width
DECAY   2000001  1.03543610E+02   # DNR   decays
#          BR          NDA       ID1       ID2       ID3       ID4
      1.11419614E-02    2      1000022         1                       # DNR    -->  Z1SS   DN                 
      2.01987699E-04    2      1000023         1                       # DNR    -->  Z2SS   DN                 
      5.12516854E-05    2      1000025         1                       # DNR    -->  Z3SS   DN                 
      1.75535199E-04    2      1000035         1                       # DNR    -->  Z4SS   DN                 
      9.88429248E-01    2      1000021         1                       # DNR    -->  GLSS   DN                 
#         PDG         Width
DECAY   2000003  1.03543610E+02   # STR   decays
#          BR          NDA       ID1       ID2       ID3       ID4
      1.11419614E-02    2      1000022         3                       # STR    -->  Z1SS   ST                 
      2.01987699E-04    2      1000023         3                       # STR    -->  Z2SS   ST                 
      5.12516854E-05    2      1000025         3                       # STR    -->  Z3SS   ST                 
      1.75535199E-04    2      1000035         3                       # STR    -->  Z4SS   ST                 
      9.88429248E-01    2      1000021         3                       # STR    -->  GLSS   ST                 
#         PDG         Width
DECAY   2000004  1.07053612E+02   # CHR   decays
#          BR          NDA       ID1       ID2       ID3       ID4
      4.30792719E-02    2      1000022         4                       # CHR    -->  Z1SS   CH                 
      7.80957518E-04    2      1000023         4                       # CHR    -->  Z2SS   CH                 
      1.98148977E-04    2      1000025         4                       # CHR    -->  Z3SS   CH                 
      6.78647368E-04    2      1000035         4                       # CHR    -->  Z4SS   CH                 
      9.55262959E-01    2      1000021         4                       # CHR    -->  GLSS   CH                 
#         PDG         Width
DECAY   2000005  1.03756706E+02   # BT2   decays
#          BR          NDA       ID1       ID2       ID3       ID4
      1.11817783E-02    2      1000022         5                       # BT2    -->  Z1SS   BT                 
      7.87044934E-04    2      1000023         5                       # BT2    -->  Z2SS   BT                 
      3.50153539E-03    2      1000025         5                       # BT2    -->  Z3SS   BT                 
      3.09325452E-03    2      1000035         5                       # BT2    -->  Z4SS   BT                 
      9.74058449E-01    2      1000021         5                       # BT2    -->  GLSS   BT                 
      1.18457188E-03    2     -1000024         6                       # BT2    -->  W1SS-  TP                 
      5.88185480E-03    2     -1000037         6                       # BT2    -->  W2SS-  TP                 
      1.00506315E-06    2          -24   1000006                       # BT2    -->  W-     TP1                
      1.05853367E-04    2          -24   2000006                       # BT2    -->  W-     TP2                
      5.65945593E-05    2           23   1000005                       # BT2    -->  Z0     BT1                
      1.47915474E-04    2           25   1000005                       # BT2    -->  HL0    BT1                
#         PDG         Width
DECAY   2000006  1.21309296E+02   # TP2   decays
#          BR          NDA       ID1       ID2       ID3       ID4
      6.24803960E-01    2      1000021         6                       # TP2    -->  GLSS   TP                 
      1.09404169E-01    2      1000024         5                       # TP2    -->  W1SS+  BT                 
      1.40046356E-02    2      1000037         5                       # TP2    -->  W2SS+  BT                 
      1.67902291E-03    2           23   1000006                       # TP2    -->  Z0     TP1                
      3.35039105E-03    2           25   1000006                       # TP2    -->  HL0    TP1                
      1.23659812E-03    2      1000022         6                       # TP2    -->  Z1SS   TP                 
      5.73961176E-02    2      1000023         6                       # TP2    -->  Z2SS   TP                 
      9.40832049E-02    2      1000025         6                       # TP2    -->  Z3SS   TP                 
      9.40418839E-02    2      1000035         6                       # TP2    -->  Z4SS   TP                 
#         PDG         Width
DECAY   1000011  2.87135849E+01   # EL-   decays
#          BR          NDA       ID1       ID2       ID3       ID4
      6.69304430E-02    2      1000022        11                       # EL-    -->  Z1SS   E-                 
      3.03213388E-01    2      1000023        11                       # EL-    -->  Z2SS   E-                 
      1.04242843E-03    2      1000025        11                       # EL-    -->  Z3SS   E-                 
      2.46780142E-02    2      1000035        11                       # EL-    -->  Z4SS   E-                 
      4.92470026E-01    2     -1000024        12                       # EL-    -->  W1SS-  NUE                
      1.11665681E-01    2     -1000037        12                       # EL-    -->  W2SS-  NUE                
#         PDG         Width
DECAY   1000013  2.87135849E+01   # MUL-  decays
#          BR          NDA       ID1       ID2       ID3       ID4
      6.69304430E-02    2      1000022        13                       # MUL-   -->  Z1SS   MU-                
      3.03213388E-01    2      1000023        13                       # MUL-   -->  Z2SS   MU-                
      1.04242843E-03    2      1000025        13                       # MUL-   -->  Z3SS   MU-                
      2.46780142E-02    2      1000035        13                       # MUL-   -->  Z4SS   MU-                
      4.92470026E-01    2     -1000024        14                       # MUL-   -->  W1SS-  NUM                
      1.11665681E-01    2     -1000037        14                       # MUL-   -->  W2SS-  NUM                
#         PDG         Width
DECAY   1000015  1.19896765E+01   # TAU1- decays
#          BR          NDA       ID1       ID2       ID3       ID4
      8.30446601E-01    2      1000022        15                       # TAU1-  -->  Z1SS   TAU-               
      5.70971072E-02    2      1000023        15                       # TAU1-  -->  Z2SS   TAU-               
      1.56904124E-02    2      1000025        15                       # TAU1-  -->  Z3SS   TAU-               
      1.37377298E-02    2      1000035        15                       # TAU1-  -->  Z4SS   TAU-               
      7.77054802E-02    2     -1000024        16                       # TAU1-  -->  W1SS-  NUT                
      5.32267382E-03    2     -1000037        16                       # TAU1-  -->  W2SS-  NUT                
#         PDG         Width
DECAY   1000012  2.87596016E+01   # NUEL  decays
#          BR          NDA       ID1       ID2       ID3       ID4
      1.14372343E-01    2      1000022        12                       # NUEL   -->  Z1SS   NUE                
      2.20684722E-01    2      1000023        12                       # NUEL   -->  Z2SS   NUE                
      5.28458320E-03    2      1000025        12                       # NUEL   -->  Z3SS   NUE                
      5.37164733E-02    2      1000035        12                       # NUEL   -->  Z4SS   NUE                
      5.66495776E-01    2      1000024        11                       # NUEL   -->  W1SS+  E-                 
      3.94461341E-02    2      1000037        11                       # NUEL   -->  W2SS+  E-                 
#         PDG         Width
DECAY   1000014  2.87596016E+01   # NUML  decays
#          BR          NDA       ID1       ID2       ID3       ID4
      1.14372343E-01    2      1000022        14                       # NUML   -->  Z1SS   NUM                
      2.20684722E-01    2      1000023        14                       # NUML   -->  Z2SS   NUM                
      5.28458320E-03    2      1000025        14                       # NUML   -->  Z3SS   NUM                
      5.37164733E-02    2      1000035        14                       # NUML   -->  Z4SS   NUM                
      5.66495776E-01    2      1000024        13                       # NUML   -->  W1SS+  MU-                
      3.94461341E-02    2      1000037        13                       # NUML   -->  W2SS+  MU-                
#         PDG         Width
DECAY   1000016  2.90549259E+01   # NUTL  decays
#          BR          NDA       ID1       ID2       ID3       ID4
      1.12691976E-01    2      1000022        16                       # NUTL   -->  Z1SS   NUT                
      2.17426479E-01    2      1000023        16                       # NUTL   -->  Z2SS   NUT                
      5.20487642E-03    2      1000025        16                       # NUTL   -->  Z3SS   NUT                
      5.29028848E-02    2      1000035        16                       # NUTL   -->  Z4SS   NUT                
      5.61043143E-01    2      1000024        15                       # NUTL   -->  W1SS+  TAU-               
      5.07306345E-02    2      1000037        15                       # NUTL   -->  W2SS+  TAU-               
      3.18634528E-11    3      1000015        16       -15             # NUTL   -->  TAU1-  NUT    TAU+        
      3.18634528E-11    3      1000015        12       -11             # NUTL   -->  TAU1-  NUE    E+          
      3.18634528E-11    3      1000015        14       -13             # NUTL   -->  TAU1-  NUM    MU+         
      9.55903551E-11    3      1000015         2        -1             # NUTL   -->  TAU1-  UP     DB          
      9.55903551E-11    3      1000015         4        -3             # NUTL   -->  TAU1-  CH     SB          
#         PDG         Width
DECAY   2000011  1.06315289E+01   # ER-   decays
#          BR          NDA       ID1       ID2       ID3       ID4
      9.62972283E-01    2      1000022        11                       # ER-    -->  Z1SS   E-                 
      1.74534507E-02    2      1000023        11                       # ER-    -->  Z2SS   E-                 
      4.42426233E-03    2      1000025        11                       # ER-    -->  Z3SS   E-                 
      1.51500143E-02    2      1000035        11                       # ER-    -->  Z4SS   E-                 
#         PDG         Width
DECAY   2000013  1.06315289E+01   # MUR-  decays
#          BR          NDA       ID1       ID2       ID3       ID4
      9.62972283E-01    2      1000022        13                       # MUR-   -->  Z1SS   MU-                
      1.74534507E-02    2      1000023        13                       # MUR-   -->  Z2SS   MU-                
      4.42426233E-03    2      1000025        13                       # MUR-   -->  Z3SS   MU-                
      1.51500143E-02    2      1000035        13                       # MUR-   -->  Z4SS   MU-                
#         PDG         Width
DECAY   2000015  2.84015846E+01   # TAU2- decays
#          BR          NDA       ID1       ID2       ID3       ID4
      7.48238340E-02    2      1000022        15                       # TAU2-  -->  Z1SS   TAU-               
      2.90281296E-01    2      1000023        15                       # TAU2-  -->  Z2SS   TAU-               
      1.05380779E-02    2      1000025        15                       # TAU2-  -->  Z3SS   TAU-               
      3.66000868E-02    2      1000035        15                       # TAU2-  -->  Z4SS   TAU-               
      4.65551704E-01    2     -1000024        16                       # TAU2-  -->  W1SS-  NUT                
      1.22204974E-01    2     -1000037        16                       # TAU2-  -->  W2SS-  NUT                
#         PDG         Width
DECAY   1000023  1.06432481E-05   # Z2SS  decays
#          BR          NDA       ID1       ID2       ID3       ID4
      1.94376206E-03    2      1000022        22                       # Z2SS   -->  Z1SS   GM                 
      1.18963726E-01    3      1000022         2        -2             # Z2SS   -->  Z1SS   UP     UB          
      1.54043138E-01    3      1000022         1        -1             # Z2SS   -->  Z1SS   DN     DB          
      1.54043138E-01    3      1000022         3        -3             # Z2SS   -->  Z1SS   ST     SB          
      1.18963726E-01    3      1000022         4        -4             # Z2SS   -->  Z1SS   CH     CB          
      1.49955422E-01    3      1000022         5        -5             # Z2SS   -->  Z1SS   BT     BB          
      3.35677192E-02    3      1000022        11       -11             # Z2SS   -->  Z1SS   E-     E+          
      3.35677192E-02    3      1000022        13       -13             # Z2SS   -->  Z1SS   MU-    MU+         
      3.35017443E-02    3      1000022        15       -15             # Z2SS   -->  Z1SS   TAU-   TAU+        
      6.71548322E-02    3      1000022        12       -12             # Z2SS   -->  Z1SS   NUE    ANUE        
      6.71548322E-02    3      1000022        14       -14             # Z2SS   -->  Z1SS   NUM    ANUM        
      6.71402514E-02    3      1000022        16       -16             # Z2SS   -->  Z1SS   NUT    ANUT        
#         PDG         Width
DECAY   1000025  1.36446500E+00   # Z3SS  decays
#          BR          NDA       ID1       ID2       ID3       ID4
      1.17028804E-07    2      1000022        22                       # Z3SS   -->  Z1SS   GM                 
      1.11288909E-06    2      1000023        22                       # Z3SS   -->  Z2SS   GM                 
      3.02988499E-01    2      1000024       -24                       # Z3SS   -->  W1SS+  W-                 
      3.02988499E-01    2     -1000024        24                       # Z3SS   -->  W1SS-  W+                 
      1.35228634E-01    2      1000022        23                       # Z3SS   -->  Z1SS   Z0                 
      2.24183127E-01    2      1000023        23                       # Z3SS   -->  Z2SS   Z0                 
      8.65562205E-11    3      1000022         2        -2             # Z3SS   -->  Z1SS   UP     UB          
      5.35511739E-11    3      1000022         1        -1             # Z3SS   -->  Z1SS   DN     DB          
      5.35511739E-11    3      1000022         3        -3             # Z3SS   -->  Z1SS   ST     SB          
      8.65561373E-11    3      1000022         4        -4             # Z3SS   -->  Z1SS   CH     CB          
      3.30455707E-09    3      1000022         5        -5             # Z3SS   -->  Z1SS   BT     BB          
      1.61981470E-10    3      1000022        11       -11             # Z3SS   -->  Z1SS   E-     E+          
      1.61981470E-10    3      1000022        13       -13             # Z3SS   -->  Z1SS   MU-    MU+         
      2.27880870E-09    3      1000022        15       -15             # Z3SS   -->  Z1SS   TAU-   TAU+        
      1.50257112E-10    3      1000022        12       -12             # Z3SS   -->  Z1SS   NUE    ANUE        
      1.50257112E-10    3      1000022        14       -14             # Z3SS   -->  Z1SS   NUM    ANUM        
      1.53052682E-10    3      1000022        16       -16             # Z3SS   -->  Z1SS   NUT    ANUT        
      9.83202339E-11    3      1000023         2        -2             # Z3SS   -->  Z2SS   UP     UB          
      1.47452550E-10    3      1000023         1        -1             # Z3SS   -->  Z2SS   DN     DB          
      1.47452550E-10    3      1000023         3        -3             # Z3SS   -->  Z2SS   ST     SB          
      9.83201159E-11    3      1000023         4        -4             # Z3SS   -->  Z2SS   CH     CB          
      4.14614787E-09    3      1000023         5        -5             # Z3SS   -->  Z2SS   BT     BB          
      1.93305684E-11    3      1000023        11       -11             # Z3SS   -->  Z2SS   E-     E+          
      1.93305684E-11    3      1000023        13       -13             # Z3SS   -->  Z2SS   MU-    MU+         
      5.34520594E-10    3      1000023        15       -15             # Z3SS   -->  Z2SS   TAU-   TAU+        
      6.93990490E-11    3      1000023        12       -12             # Z3SS   -->  Z2SS   NUE    ANUE        
      6.93990490E-11    3      1000023        14       -14             # Z3SS   -->  Z2SS   NUM    ANUM        
      7.06935274E-11    3      1000023        16       -16             # Z3SS   -->  Z2SS   NUT    ANUT        
      2.45627407E-02    2      1000022        25                       # Z3SS   -->  Z1SS   HL0                
      1.00474088E-02    2      1000023        25                       # Z3SS   -->  Z2SS   HL0                
#         PDG         Width
DECAY   1000035  1.73503065E+00   # Z4SS  decays
#          BR          NDA       ID1       ID2       ID3       ID4
      7.08709749E-08    2      1000022        22                       # Z4SS   -->  Z1SS   GM                 
      4.36379764E-07    2      1000023        22                       # Z4SS   -->  Z2SS   GM                 
      1.24761952E-08    2      1000025        22                       # Z4SS   -->  Z3SS   GM                 
      3.63000333E-01    2      1000024       -24                       # Z4SS   -->  W1SS+  W-                 
      3.63000333E-01    2     -1000024        24                       # Z4SS   -->  W1SS-  W+                 
      1.08972954E-12    3     -1000037         2        -1             # Z4SS   -->  W2SS-  UP     DB          
      3.63243181E-13    3     -1000037        12       -11             # Z4SS   -->  W2SS-  NUE    E+          
      3.63243181E-13    3     -1000037        14       -13             # Z4SS   -->  W2SS-  NUM    MU+         
      1.08972954E-12    3      1000037         1        -2             # Z4SS   -->  W2SS+  DN     UB          
      3.63243181E-13    3      1000037        11       -12             # Z4SS   -->  W2SS+  E-     ANUE        
      3.63243181E-13    3      1000037        13       -14             # Z4SS   -->  W2SS+  MU-    ANUM        
      2.85048801E-02    2      1000022        23                       # Z4SS   -->  Z1SS   Z0                 
      2.07639597E-02    2      1000023        23                       # Z4SS   -->  Z2SS   Z0                 
      8.80635620E-10    3      1000022         2        -2             # Z4SS   -->  Z1SS   UP     UB          
      1.48066359E-09    3      1000022         1        -1             # Z4SS   -->  Z1SS   DN     DB          
      1.48066359E-09    3      1000022         3        -3             # Z4SS   -->  Z1SS   ST     SB          
      8.80634787E-10    3      1000022         4        -4             # Z4SS   -->  Z1SS   CH     CB          
      5.14229637E-09    3      1000022         5        -5             # Z4SS   -->  Z1SS   BT     BB          
      2.19823804E-09    3      1000022        11       -11             # Z4SS   -->  Z1SS   E-     E+          
      2.19823804E-09    3      1000022        13       -13             # Z4SS   -->  Z1SS   MU-    MU+         
      4.08821776E-09    3      1000022        15       -15             # Z4SS   -->  Z1SS   TAU-   TAU+        
      3.71432640E-09    3      1000022        12       -12             # Z4SS   -->  Z1SS   NUE    ANUE        
      3.71432640E-09    3      1000022        14       -14             # Z4SS   -->  Z1SS   NUM    ANUM        
      3.78342335E-09    3      1000022        16       -16             # Z4SS   -->  Z1SS   NUT    ANUT        
      5.75413761E-09    3      1000023         2        -2             # Z4SS   -->  Z2SS   UP     UB          
      6.67463063E-09    3      1000023         1        -1             # Z4SS   -->  Z2SS   DN     DB          
      6.67463063E-09    3      1000023         3        -3             # Z4SS   -->  Z2SS   ST     SB          
      5.75412873E-09    3      1000023         4        -4             # Z4SS   -->  Z2SS   CH     CB          
      1.84969444E-08    3      1000023         5        -5             # Z4SS   -->  Z2SS   BT     BB          
      1.65104952E-09    3      1000023        11       -11             # Z4SS   -->  Z2SS   E-     E+          
      1.65104952E-09    3      1000023        13       -13             # Z4SS   -->  Z2SS   MU-    MU+         
      2.10458029E-09    3      1000023        15       -15             # Z4SS   -->  Z2SS   TAU-   TAU+        
      2.61783306E-09    3      1000023        12       -12             # Z4SS   -->  Z2SS   NUE    ANUE        
      2.61783306E-09    3      1000023        14       -14             # Z4SS   -->  Z2SS   NUM    ANUM        
      2.66668376E-09    3      1000023        16       -16             # Z4SS   -->  Z2SS   NUT    ANUT        
      3.23698941E-07    3      1000025         2        -2             # Z4SS   -->  Z3SS   UP     UB          
      4.17522187E-07    3      1000025         1        -1             # Z4SS   -->  Z3SS   DN     DB          
      4.17522187E-07    3      1000025         3        -3             # Z4SS   -->  Z3SS   ST     SB          
      3.23698941E-07    3      1000025         4        -4             # Z4SS   -->  Z3SS   CH     CB          
      2.38115035E-07    3      1000025         5        -5             # Z4SS   -->  Z3SS   BT     BB          
      9.47089447E-08    3      1000025        11       -11             # Z4SS   -->  Z3SS   E-     E+          
      9.47089447E-08    3      1000025        13       -13             # Z4SS   -->  Z3SS   MU-    MU+         
      8.67203127E-08    3      1000025        15       -15             # Z4SS   -->  Z3SS   TAU-   TAU+        
      1.88389720E-07    3      1000025        12       -12             # Z4SS   -->  Z3SS   NUE    ANUE        
      1.88389720E-07    3      1000025        14       -14             # Z4SS   -->  Z3SS   NUM    ANUM        
      1.88389393E-07    3      1000025        16       -16             # Z4SS   -->  Z3SS   NUT    ANUT        
      8.29107314E-02    2      1000022        25                       # Z4SS   -->  Z1SS   HL0                
      1.41816705E-01    2      1000023        25                       # Z4SS   -->  Z2SS   HL0                
#         PDG         Width
DECAY   1000024  1.33625770E-04   # W1SS+ decays
#          BR          NDA       ID1       ID2       ID3       ID4
      3.33701998E-01    3      1000022         2        -1             # W1SS+  -->  Z1SS   UP     DB          
      3.33701998E-01    3      1000022         4        -3             # W1SS+  -->  Z1SS   CH     SB          
      1.10865369E-01    3      1000022       -11        12             # W1SS+  -->  Z1SS   E+     NUE         
      1.10865369E-01    3      1000022       -13        14             # W1SS+  -->  Z1SS   MU+    NUM         
      1.10865280E-01    3      1000022       -15        16             # W1SS+  -->  Z1SS   TAU+   NUT         
      2.33959985E-09    3      1000023       -11        12             # W1SS+  -->  Z2SS   E+     NUE         
      2.33959985E-09    3      1000023       -13        14             # W1SS+  -->  Z2SS   MU+    NUM         
#         PDG         Width
DECAY   1000037  1.44764555E+00   # W2SS+ decays
#          BR          NDA       ID1       ID2       ID3       ID4
      2.03272310E-09    3      1000022         2        -1             # W2SS+  -->  Z1SS   UP     DB          
      2.03272243E-09    3      1000022         4        -3             # W2SS+  -->  Z1SS   CH     SB          
      4.19811164E-09    3      1000022       -11        12             # W2SS+  -->  Z1SS   E+     NUE         
      4.19811164E-09    3      1000022       -13        14             # W2SS+  -->  Z1SS   MU+    NUM         
      6.51170318E-09    3      1000022       -15        16             # W2SS+  -->  Z1SS   TAU+   NUT         
      8.64250734E-02    2      1000022        24                       # W2SS+  -->  Z1SS   W+                 
      5.89524829E-09    3      1000023         2        -1             # W2SS+  -->  Z2SS   UP     DB          
      5.89524740E-09    3      1000023         4        -3             # W2SS+  -->  Z2SS   CH     SB          
      2.42929543E-09    3      1000023       -11        12             # W2SS+  -->  Z2SS   E+     NUE         
      2.42929543E-09    3      1000023       -13        14             # W2SS+  -->  Z2SS   MU+    NUM         
      3.35628947E-09    3      1000023       -15        16             # W2SS+  -->  Z2SS   TAU+   NUT         
      3.76160204E-01    2      1000023        24                       # W2SS+  -->  Z2SS   W+                 
      1.04867092E-06    3      1000025         2        -1             # W2SS+  -->  Z3SS   UP     DB          
      1.04867092E-06    3      1000025         4        -3             # W2SS+  -->  Z3SS   CH     SB          
      3.49538084E-07    3      1000025       -11        12             # W2SS+  -->  Z3SS   E+     NUE         
      3.49538084E-07    3      1000025       -13        14             # W2SS+  -->  Z3SS   MU+    NUM         
      3.49551414E-07    3      1000025       -15        16             # W2SS+  -->  Z3SS   TAU+   NUT         
      3.18301678E-01    2      1000024        23                       # W2SS+  -->  W1SS+  Z0                 
      5.60963720E-09    3      1000024         1        -1             # W2SS+  -->  W1SS+  DN     DB          
      5.60962876E-09    3      1000024         3        -3             # W2SS+  -->  W1SS+  ST     SB          
      1.37093537E-08    3      1000024         2        -2             # W2SS+  -->  W1SS+  UP     UB          
      1.37093537E-08    3      1000024         4        -4             # W2SS+  -->  W1SS+  CH     CB          
      4.77624473E-09    3      1000024        12       -12             # W2SS+  -->  W1SS+  NUE    ANUE        
      4.77624473E-09    3      1000024        14       -14             # W2SS+  -->  W1SS+  NUM    ANUM        
      4.96881070E-09    3      1000024        16       -16             # W2SS+  -->  W1SS+  NUT    ANUT        
      1.95187888E-09    3      1000024        11       -11             # W2SS+  -->  W1SS+  E-     E+          
      1.95187888E-09    3      1000024        13       -13             # W2SS+  -->  W1SS+  MU-    MU+         
      1.98831351E-09    3      1000024        15       -15             # W2SS+  -->  W1SS+  TAU-   TAU+        
      2.19109952E-01    2      1000024        25                       # W2SS+  -->  W1SS+  HL0                
#         PDG         Width
DECAY        25  4.05269023E-03   # HL0   decays
#          BR          NDA       ID1       ID2       ID3       ID4
      4.85124607E-09    2           11       -11                       # HL0    -->  E-     E+                 
      2.04827331E-04    2           13       -13                       # HL0    -->  MU-    MU+                
      5.85813709E-02    2           15       -15                       # HL0    -->  TAU-   TAU+               
      6.08914206E-06    2            1        -1                       # HL0    -->  DN     DB                 
      2.46031815E-03    2            3        -3                       # HL0    -->  ST     SB                 
      8.06939244E-01    2            5        -5                       # HL0    -->  BT     BB                 
      1.92977768E-06    2            2        -2                       # HL0    -->  UP     UB                 
      3.63473482E-02    2            4        -4                       # HL0    -->  CH     CB                 
      1.85639807E-03    2           22        22                       # HL0    -->  GM     GM                 
      3.87633853E-02    2           21        21                       # HL0    -->  GL     GL                 
      2.84117181E-03    3           24        11       -12             # HL0    -->  W+     E-     ANUE        
      2.84117181E-03    3           24        13       -14             # HL0    -->  W+     MU-    ANUM        
      2.84117181E-03    3           24        15       -16             # HL0    -->  W+     TAU-   ANUT        
      8.52351543E-03    3           24        -2         1             # HL0    -->  W+     UB     DN          
      8.52351543E-03    3           24        -4         3             # HL0    -->  W+     CB     ST          
      2.84117181E-03    3          -24       -11        12             # HL0    -->  W-     E+     NUE         
      2.84117181E-03    3          -24       -13        14             # HL0    -->  W-     MU+    NUM         
      2.84117181E-03    3          -24       -15        16             # HL0    -->  W-     TAU+   NUT         
      8.52351543E-03    3          -24         2        -1             # HL0    -->  W-     UP     DB          
      8.52351543E-03    3          -24         4        -3             # HL0    -->  W-     CH     SB          
      2.52880767E-04    3           23        12       -12             # HL0    -->  Z0     NUE    ANUE        
      2.52880767E-04    3           23        14       -14             # HL0    -->  Z0     NUM    ANUM        
      2.52880767E-04    3           23        16       -16             # HL0    -->  Z0     NUT    ANUT        
      1.27272346E-04    3           23        11       -11             # HL0    -->  Z0     E-     E+          
      1.27272346E-04    3           23        13       -13             # HL0    -->  Z0     MU-    MU+         
      1.27272346E-04    3           23        15       -15             # HL0    -->  Z0     TAU-   TAU+        
      4.36024246E-04    3           23         2        -2             # HL0    -->  Z0     UP     UB          
      4.36024246E-04    3           23         4        -4             # HL0    -->  Z0     CH     CB          
      5.61706664E-04    3           23         1        -1             # HL0    -->  Z0     DN     DB          
      5.61706664E-04    3           23         3        -3             # HL0    -->  Z0     ST     SB          
      5.61706664E-04    3           23         5        -5             # HL0    -->  Z0     BT     BB          
#         PDG         Width
DECAY        35  3.14656067E+01   # HH0   decays
#          BR          NDA       ID1       ID2       ID3       ID4
      1.13667686E-09    2           11       -11                       # HH0    -->  E-     E+                 
      4.79925475E-05    2           13       -13                       # HH0    -->  MU-    MU+                
      1.37457429E-02    2           15       -15                       # HH0    -->  TAU-   TAU+               
      1.38452322E-06    2            1        -1                       # HH0    -->  DN     DB                 
      5.59417414E-04    2            3        -3                       # HH0    -->  ST     SB                 
      7.55209550E-02    2            5        -5                       # HH0    -->  BT     BB                 
      4.47261186E-11    2            2        -2                       # HH0    -->  UP     UB                 
      5.79200730E-07    2            4        -4                       # HH0    -->  CH     CB                 
      2.96388417E-02    2            6        -6                       # HH0    -->  TP     TB                 
      1.69698325E-07    2           22        22                       # HH0    -->  GM     GM                 
      8.78160336E-06    2           21        21                       # HH0    -->  GL     GL                 
      2.15396958E-05    2           24       -24                       # HH0    -->  W+     W-                 
      1.10284818E-05    2           23        23                       # HH0    -->  Z0     Z0                 
      5.54810325E-03    2      1000022   1000022                       # HH0    -->  Z1SS   Z1SS               
      2.70671565E-02    2      1000022   1000023                       # HH0    -->  Z1SS   Z2SS               
      5.31971604E-02    2      1000022   1000025                       # HH0    -->  Z1SS   Z3SS               
      1.94831900E-02    2      1000022   1000035                       # HH0    -->  Z1SS   Z4SS               
      3.21114324E-02    2      1000023   1000023                       # HH0    -->  Z2SS   Z2SS               
      1.01124994E-01    2      1000023   1000025                       # HH0    -->  Z2SS   Z3SS               
      3.24835144E-02    2      1000023   1000035                       # HH0    -->  Z2SS   Z4SS               
      5.08447550E-03    2      1000025   1000025                       # HH0    -->  Z3SS   Z3SS               
      4.31509167E-02    2      1000025   1000035                       # HH0    -->  Z3SS   Z4SS               
      2.76466496E-02    2      1000035   1000035                       # HH0    -->  Z4SS   Z4SS               
      8.56009200E-02    2      1000024  -1000024                       # HH0    -->  W1SS+  W1SS-              
      1.73672698E-02    2      1000037  -1000037                       # HH0    -->  W2SS+  W2SS-              
      2.15249598E-01    2      1000024  -1000037                       # HH0    -->  W1SS+  W2SS-              
      2.15249598E-01    2     -1000024   1000037                       # HH0    -->  W1SS-  W2SS+              
      7.85452794E-05    2           25        25                       # HH0    -->  HL0    HL0                
#         PDG         Width
DECAY        36  3.12499733E+01   # HA0   decays
#          BR          NDA       ID1       ID2       ID3       ID4
      1.13710041E-09    2           11       -11                       # HA0    -->  E-     E+                 
      4.80104318E-05    2           13       -13                       # HA0    -->  MU-    MU+                
      1.37509033E-02    2           15       -15                       # HA0    -->  TAU-   TAU+               
      1.38510495E-06    2            1        -1                       # HA0    -->  DN     DB                 
      5.59652515E-04    2            3        -3                       # HA0    -->  ST     SB                 
      7.55533949E-02    2            5        -5                       # HA0    -->  BT     BB                 
      4.43189201E-11    2            2        -2                       # HA0    -->  UP     UB                 
      5.74343403E-07    2            4        -4                       # HA0    -->  CH     CB                 
      3.00145876E-02    2            6        -6                       # HA0    -->  TP     TB                 
      6.38269455E-07    2           22        22                       # HA0    -->  GM     GM                 
      1.43402458E-05    2           21        21                       # HA0    -->  GL     GL                 
      6.47077663E-03    2      1000022   1000022                       # HA0    -->  Z1SS   Z1SS               
      3.34790125E-02    2      1000022   1000023                       # HA0    -->  Z1SS   Z2SS               
      3.32208164E-02    2      1000022   1000025                       # HA0    -->  Z1SS   Z3SS               
      3.29199992E-02    2      1000022   1000035                       # HA0    -->  Z1SS   Z4SS               
      4.18335684E-02    2      1000023   1000023                       # HA0    -->  Z2SS   Z2SS               
      6.07607774E-02    2      1000023   1000025                       # HA0    -->  Z2SS   Z3SS               
      5.58412373E-02    2      1000023   1000035                       # HA0    -->  Z2SS   Z4SS               
      3.69790266E-03    2      1000025   1000025                       # HA0    -->  Z3SS   Z3SS               
      3.10372002E-02    2      1000025   1000035                       # HA0    -->  Z3SS   Z4SS               
      4.74553257E-02    2      1000035   1000035                       # HA0    -->  Z4SS   Z4SS               
      1.09422565E-01    2      1000024  -1000024                       # HA0    -->  W1SS+  W1SS-              
      4.02435698E-02    2      1000037  -1000037                       # HA0    -->  W2SS+  W2SS-              
      1.91826165E-01    2      1000024  -1000037                       # HA0    -->  W1SS+  W2SS-              
      1.91826165E-01    2     -1000024   1000037                       # HA0    -->  W1SS-  W2SS+              
      2.14144147E-05    2           25        23                       # HA0    -->  HL0    Z0                 
#         PDG         Width
DECAY        37  3.11540623E+01   # H+    decays
#          BR          NDA       ID1       ID2       ID3       ID4
      1.14899701E-09    2           12       -11                       # H+     -->  NUE    E+                 
      4.85127275E-05    2           14       -13                       # H+     -->  NUM    MU+                
      1.38947684E-02    2           16       -15                       # H+     -->  NUT    TAU+               
      1.29384625E-06    2            2        -1                       # H+     -->  UP     DB                 
      5.23298222E-04    2            4        -3                       # H+     -->  CH     SB                 
      9.73978564E-02    2            6        -5                       # H+     -->  TP     BB                 
      4.93170694E-02    2      1000024   1000022                       # H+     -->  W1SS+  Z1SS               
      6.49240392E-04    2      1000024   1000023                       # H+     -->  W1SS+  Z2SS               
      2.22374588E-01    2      1000024   1000025                       # H+     -->  W1SS+  Z3SS               
      2.32217029E-01    2      1000024   1000035                       # H+     -->  W1SS+  Z4SS               
      2.69855876E-02    2      1000037   1000022                       # H+     -->  W2SS+  Z1SS               
      3.16037029E-01    2      1000037   1000023                       # H+     -->  W2SS+  Z2SS               
      3.63500156E-02    2      1000037   1000025                       # H+     -->  W2SS+  Z3SS               
      4.18189121E-03    2      1000037   1000035                       # H+     -->  W2SS+  Z4SS               
      2.17041306E-05    2           25        24                       # H+     -->  HL0    W+                 
