  65
  401   2000.8307    0.26157E-25
  402   1999.3210    0.26060E-25
  403   2000.8307    0.26157E-25
  404   1999.3215    0.26060E-25
  405   1999.7639    0.39417E-25
  406   1829.0583    0.13963E-25
  407   2000.8307    0.26157E-25
  408   1999.3210    0.26060E-25
  409   2000.8307    0.26157E-25
  410   1999.3215    0.26060E-25
  411   1999.7639    0.39417E-25
  412   1829.0583    0.13963E-25
  413   2000.1520    0.58579E-24
  414   1999.6959    0.14648E-24
  415   2000.1520    0.58579E-24
  416   1999.6964    0.14648E-24
  417   2001.2222    0.15202E-25
  418   2165.3201    0.80943E-26
  419   2000.1520    0.58579E-24
  420   1999.6959    0.14648E-24
  421   2000.1520    0.58579E-24
  422   1999.6964    0.14648E-24
  423   2001.2222    0.15202E-25
  424   2165.3201    0.80943E-26
  425   2000.5267    0.23997E-25
  426   1999.0170    0.23955E-25
  427   2000.5267    0.23997E-25
  428   1999.0170    0.23955E-25
  429   2000.0695    0.36067E-25
  430   1999.0170    0.23829E-25
  431   2000.5267    0.23997E-25
  432   1999.0170    0.23955E-25
  433   2000.5267    0.23997E-25
  434   1999.0170    0.23955E-25
  435   2000.0695    0.36067E-25
  436   1999.0170    0.23829E-25
  437   1999.9562    0.65094E-25
  438      0.0000    0.10000E+31
  439   1999.9562    0.65094E-25
  440      0.0000    0.10000E+31
  441   2000.9147    0.33363E-25
  442      0.0000    0.10000E+31
  443   1999.9562    0.65094E-25
  444      0.0000    0.10000E+31
  445   1999.9562    0.65094E-25
  446      0.0000    0.10000E+31
  447   2000.9147    0.33363E-25
  448      0.0000    0.10000E+31
  449   2000.0000    0.21527E-24
  450     71.9833    0.10000E+31
  451    112.4934    0.52354E-19
  452   -170.0585    0.24304E-22
  453    225.5818    0.97296E-24
  454     90.9124    0.22364E-18
  455    223.3174    0.13647E-23
  456     90.9124    0.22364E-18
  457    223.3174    0.13647E-23
  203    119.0230    0.13104E-21
  204    504.3768    0.11453E-24
  205    500.0000    0.11561E-24
  206    509.4133    0.11855E-24
  207    509.4133    0.11855E-24
  458      0.0000    0.10000E+31
    6    172.5000    0.57395E-24
   12    172.5000    0.57395E-24
   6
   401  0.11328989E+00     0   450     1     0     0     0
   401  0.75159639E-01     0   451     1     0     0     0
   401  0.10100843E-01     0   452     1     0     0     0
   401  0.14276086E+00     0   453     1     0     0     0
   401  0.28335273E+00     0   456     2     0     0     0
   401  0.37533614E+00     0   457     2     0     0     0
   6
   402  0.41572493E-01     0   450     2     0     0     0
   402  0.18436217E+00     0   451     2     0     0     0
   402  0.63193603E-02     0   452     2     0     0     0
   402  0.10795855E+00     0   453     2     0     0     0
   402  0.47727355E+00     0   454     1     0     0     0
   402  0.18251382E+00     0   455     1     0     0     0
   6
   403  0.11328996E+00     0   450     3     0     0     0
   403  0.75159684E-01     0   451     3     0     0     0
   403  0.10100850E-01     0   452     3     0     0     0
   403  0.14276095E+00     0   453     3     0     0     0
   403  0.28335258E+00     0   456     4     0     0     0
   403  0.37533599E+00     0   457     4     0     0     0
   6
   404  0.41572470E-01     0   450     4     0     0     0
   404  0.18436208E+00     0   451     4     0     0     0
   404  0.63193562E-02     0   452     4     0     0     0
   404  0.10795847E+00     0   453     4     0     0     0
   404  0.47727370E+00     0   454     3     0     0     0
   404  0.18251389E+00     0   455     3     0     0     0
   7
   405  0.11014485E+00     0   450     5     0     0     0
   405  0.62161081E-01     0   451     5     0     0     0
   405  0.10379551E-02     0   452     5     0     0     0
   405  0.33610627E-01     0   453     5     0     0     0
   405  0.29073364E+00     0   456     6     0     0     0
   405  0.37843335E+00     0   457     6     0     0     0
   405  0.12387844E+00     0   199   406     0     0     0
   6
   406  0.33433693E-02     0   450     6     0     0     0
   406  0.71751721E-01     0   451     6     0     0     0
   406  0.20563032E+00     0   452     6     0     0     0
   406  0.31816310E+00     0   453     6     0     0     0
   406  0.82693640E-02     0   454     5     0     0     0
   406  0.39284217E+00     0   455     5     0     0     0
   6
   407  0.11328989E+00     0   450     7     0     0     0
   407  0.75159639E-01     0   451     7     0     0     0
   407  0.10100843E-01     0   452     7     0     0     0
   407  0.14276086E+00     0   453     7     0     0     0
   407  0.28335273E+00     0   454     8     0     0     0
   407  0.37533614E+00     0   455     8     0     0     0
   6
   408  0.41572493E-01     0   450     8     0     0     0
   408  0.18436217E+00     0   451     8     0     0     0
   408  0.63193603E-02     0   452     8     0     0     0
   408  0.10795855E+00     0   453     8     0     0     0
   408  0.47727355E+00     0   456     7     0     0     0
   408  0.18251382E+00     0   457     7     0     0     0
   6
   409  0.11328996E+00     0   450     9     0     0     0
   409  0.75159684E-01     0   451     9     0     0     0
   409  0.10100850E-01     0   452     9     0     0     0
   409  0.14276095E+00     0   453     9     0     0     0
   409  0.28335258E+00     0   454    10     0     0     0
   409  0.37533599E+00     0   455    10     0     0     0
   6
   410  0.41572470E-01     0   450    10     0     0     0
   410  0.18436208E+00     0   451    10     0     0     0
   410  0.63193562E-02     0   452    10     0     0     0
   410  0.10795847E+00     0   453    10     0     0     0
   410  0.47727370E+00     0   456     9     0     0     0
   410  0.18251389E+00     0   457     9     0     0     0
   7
   411  0.11014485E+00     0   450    11     0     0     0
   411  0.62161081E-01     0   451    11     0     0     0
   411  0.10379551E-02     0   452    11     0     0     0
   411  0.33610627E-01     0   453    11     0     0     0
   411  0.29073364E+00     0   454    12     0     0     0
   411  0.37843335E+00     0   455    12     0     0     0
   411  0.12387844E+00     0   198   412     0     0     0
   6
   412  0.33433693E-02     0   450    12     0     0     0
   412  0.71751721E-01     0   451    12     0     0     0
   412  0.20563032E+00     0   452    12     0     0     0
   412  0.31816310E+00     0   453    12     0     0     0
   412  0.82693640E-02     0   456    11     0     0     0
   412  0.39284217E+00     0   457    11     0     0     0
   4
   413  0.39147219E+00     0   450     1     0     0     0
   413  0.54609925E+00     0   451     1     0     0     0
   413  0.97134588E-02     0   452     1     0     0     0
   413  0.52715130E-01     0   453     1     0     0     0
   4
   414  0.39147282E+00     0   450     2     0     0     0
   414  0.54609913E+00     0   451     2     0     0     0
   414  0.97134216E-02     0   452     2     0     0     0
   414  0.52714661E-01     0   453     2     0     0     0
   4
   415  0.39147219E+00     0   450     3     0     0     0
   415  0.54609925E+00     0   451     3     0     0     0
   415  0.97134588E-02     0   452     3     0     0     0
   415  0.52715130E-01     0   453     3     0     0     0
   4
   416  0.39147285E+00     0   450     4     0     0     0
   416  0.54609913E+00     0   451     4     0     0     0
   416  0.97134206E-02     0   452     4     0     0     0
   416  0.52714657E-01     0   453     4     0     0     0
   7
   417  0.38171038E-01     0   450     5     0     0     0
   417  0.34670249E-01     0   451     5     0     0     0
   417  0.12652163E-01     0   452     5     0     0     0
   417  0.74720047E-01     0   453     5     0     0     0
   417  0.21380574E+00     0   456     6     0     0     0
   417  0.48933598E+00     0   457     6     0     0     0
   417  0.13664480E+00     0   199   406     0     0     0
   9
   418  0.25227830E+00     0   454     5     0     0     0
   418  0.29802585E-01     0   455     5     0     0     0
   418  0.21557949E+00     0   200   406     0     0     0
   418  0.22848805E-01     0   198   405     0     0     0
   418  0.61208852E-01     0   198   417     0     0     0
   418  0.98608427E-01     0   450     6     0     0     0
   418  0.63937671E-01     0   451     6     0     0     0
   418  0.20580938E+00     0   452     6     0     0     0
   418  0.49926560E-01     0   453     6     0     0     0
   4
   419  0.39147219E+00     0   450     7     0     0     0
   419  0.54609925E+00     0   451     7     0     0     0
   419  0.97134588E-02     0   452     7     0     0     0
   419  0.52715130E-01     0   453     7     0     0     0
   4
   420  0.39147282E+00     0   450     8     0     0     0
   420  0.54609913E+00     0   451     8     0     0     0
   420  0.97134216E-02     0   452     8     0     0     0
   420  0.52714661E-01     0   453     8     0     0     0
   4
   421  0.39147219E+00     0   450     9     0     0     0
   421  0.54609925E+00     0   451     9     0     0     0
   421  0.97134588E-02     0   452     9     0     0     0
   421  0.52715130E-01     0   453     9     0     0     0
   4
   422  0.39147285E+00     0   450    10     0     0     0
   422  0.54609913E+00     0   451    10     0     0     0
   422  0.97134206E-02     0   452    10     0     0     0
   422  0.52714657E-01     0   453    10     0     0     0
   7
   423  0.38171038E-01     0   450    11     0     0     0
   423  0.34670249E-01     0   451    11     0     0     0
   423  0.12652163E-01     0   452    11     0     0     0
   423  0.74720047E-01     0   453    11     0     0     0
   423  0.21380574E+00     0   454    12     0     0     0
   423  0.48933598E+00     0   455    12     0     0     0
   423  0.13664480E+00     0   198   412     0     0     0
   9
   424  0.25227830E+00     0   456    11     0     0     0
   424  0.29802585E-01     0   457    11     0     0     0
   424  0.21557949E+00     0   200   412     0     0     0
   424  0.22848805E-01     0   199   411     0     0     0
   424  0.61208852E-01     0   199   423     0     0     0
   424  0.98608427E-01     0   450    12     0     0     0
   424  0.63937671E-01     0   451    12     0     0     0
   424  0.20580938E+00     0   452    12     0     0     0
   424  0.49926560E-01     0   453    12     0     0     0
   6
   425  0.47701327E-02     0   450   121     0     0     0
   425  0.31554487E+00     0   451   121     0     0     0
   425  0.31760342E-02     0   452   121     0     0     0
   425  0.72317578E-01     0   453   121     0     0     0
   425  0.25991014E+00     0   456   122     0     0     0
   425  0.34428126E+00     0   457   122     0     0     0
   6
   426  0.20110108E+00     0   450   122     0     0     0
   426  0.12733018E-01     0   451   122     0     0     0
   426  0.13469357E-01     0   452   122     0     0     0
   426  0.16631797E+00     0   453   122     0     0     0
   426  0.43863970E+00     0   454   121     0     0     0
   426  0.16773883E+00     0   455   121     0     0     0
   6
   427  0.47701327E-02     0   450   123     0     0     0
   427  0.31554487E+00     0   451   123     0     0     0
   427  0.31760342E-02     0   452   123     0     0     0
   427  0.72317578E-01     0   453   123     0     0     0
   427  0.25991014E+00     0   456   124     0     0     0
   427  0.34428126E+00     0   457   124     0     0     0
   6
   428  0.20110108E+00     0   450   124     0     0     0
   428  0.12733018E-01     0   451   124     0     0     0
   428  0.13469357E-01     0   452   124     0     0     0
   428  0.16631797E+00     0   453   124     0     0     0
   428  0.43863970E+00     0   454   123     0     0     0
   428  0.16773883E+00     0   455   123     0     0     0
   6
   429  0.15033942E+00     0   450   125     0     0     0
   429  0.38395974E+00     0   451   125     0     0     0
   429  0.20976870E-03     0   452   125     0     0     0
   429  0.46649773E-01     0   453   125     0     0     0
   429  0.22270352E+00     0   456   126     0     0     0
   429  0.19613783E+00     0   457   126     0     0     0
   6
   430  0.20004602E+00     0   450   126     0     0     0
   430  0.12666214E-01     0   451   126     0     0     0
   430  0.13398690E-01     0   452   126     0     0     0
   430  0.16544539E+00     0   453   126     0     0     0
   430  0.43937466E+00     0   454   125     0     0     0
   430  0.16906904E+00     0   455   125     0     0     0
   6
   431  0.47701327E-02     0   450   127     0     0     0
   431  0.31554487E+00     0   451   127     0     0     0
   431  0.31760342E-02     0   452   127     0     0     0
   431  0.72317578E-01     0   453   127     0     0     0
   431  0.25991014E+00     0   454   128     0     0     0
   431  0.34428126E+00     0   455   128     0     0     0
   6
   432  0.20110108E+00     0   450   128     0     0     0
   432  0.12733018E-01     0   451   128     0     0     0
   432  0.13469357E-01     0   452   128     0     0     0
   432  0.16631797E+00     0   453   128     0     0     0
   432  0.43863970E+00     0   456   127     0     0     0
   432  0.16773883E+00     0   457   127     0     0     0
   6
   433  0.47701327E-02     0   450   129     0     0     0
   433  0.31554487E+00     0   451   129     0     0     0
   433  0.31760342E-02     0   452   129     0     0     0
   433  0.72317578E-01     0   453   129     0     0     0
   433  0.25991014E+00     0   454   130     0     0     0
   433  0.34428126E+00     0   455   130     0     0     0
   6
   434  0.20110108E+00     0   450   130     0     0     0
   434  0.12733018E-01     0   451   130     0     0     0
   434  0.13469357E-01     0   452   130     0     0     0
   434  0.16631797E+00     0   453   130     0     0     0
   434  0.43863970E+00     0   456   129     0     0     0
   434  0.16773883E+00     0   457   129     0     0     0
   6
   435  0.15033942E+00     0   450   131     0     0     0
   435  0.38395974E+00     0   451   131     0     0     0
   435  0.20976870E-03     0   452   131     0     0     0
   435  0.46649773E-01     0   453   131     0     0     0
   435  0.22270352E+00     0   454   132     0     0     0
   435  0.19613783E+00     0   455   132     0     0     0
   6
   436  0.20004602E+00     0   450   132     0     0     0
   436  0.12666214E-01     0   451   132     0     0     0
   436  0.13398690E-01     0   452   132     0     0     0
   436  0.16544539E+00     0   453   132     0     0     0
   436  0.43937466E+00     0   456   131     0     0     0
   436  0.16906904E+00     0   457   131     0     0     0
   4
   437  0.39147246E+00     0   450   121     0     0     0
   437  0.54609919E+00     0   451   121     0     0     0
   437  0.97134383E-02     0   452   121     0     0     0
   437  0.52714910E-01     0   453   121     0     0     0
   0
   4
   439  0.39147246E+00     0   450   123     0     0     0
   439  0.54609919E+00     0   451   123     0     0     0
   439  0.97134383E-02     0   452   123     0     0     0
   439  0.52714910E-01     0   453   123     0     0     0
   0
   6
   441  0.72610006E-01     0   450   125     0     0     0
   441  0.36423820E+00     0   451   125     0     0     0
   441  0.15685344E-01     0   452   125     0     0     0
   441  0.87541260E-01     0   453   125     0     0     0
   441  0.15959536E+00     0   456   126     0     0     0
   441  0.30032980E+00     0   457   126     0     0     0
   0
   4
   443  0.39147246E+00     0   450   127     0     0     0
   443  0.54609919E+00     0   451   127     0     0     0
   443  0.97134383E-02     0   452   127     0     0     0
   443  0.52714910E-01     0   453   127     0     0     0
   0
   4
   445  0.39147246E+00     0   450   129     0     0     0
   445  0.54609919E+00     0   451   129     0     0     0
   445  0.97134383E-02     0   452   129     0     0     0
   445  0.52714910E-01     0   453   129     0     0     0
   0
   6
   447  0.72610006E-01     0   450   131     0     0     0
   447  0.36423820E+00     0   451   131     0     0     0
   447  0.15685344E-01     0   452   131     0     0     0
   447  0.87541260E-01     0   453   131     0     0     0
   447  0.15959536E+00     0   454   132     0     0     0
   447  0.30032980E+00     0   455   132     0     0     0
   0
  32
   449  0.38973109E-02     0   454     1     8     0     0
   449  0.38973109E-02     0   456     2     7     0     0
   449  0.38973109E-02     0   454     3    10     0     0
   449  0.38973109E-02     0   456     4     9     0     0
   449  0.13893661E-01     0   454     5    12     0     0
   449  0.13893661E-01     0   456     6    11     0     0
   449  0.50583398E-02     0   455     1     8     0     0
   449  0.50583398E-02     0   457     2     7     0     0
   449  0.50583398E-02     0   455     3    10     0     0
   449  0.50583398E-02     0   457     4     9     0     0
   449  0.18779834E+00     0   455     5    12     0     0
   449  0.18779834E+00     0   457     6    11     0     0
   449  0.25315234E-03     0   450    13     0     0     0
   449  0.37020196E-02     0   450     1     7     0     0
   449  0.37020196E-02     0   450     3     9     0     0
   449  0.38911232E-02     0   450     5    11     0     0
   449  0.49391999E-02     0   450     6    12     0     0
   449  0.63618063E-04     0   451    13     0     0     0
   449  0.28495255E-02     0   451     1     7     0     0
   449  0.28495255E-02     0   451     3     9     0     0
   449  0.28583372E-02     0   451     5    11     0     0
   449  0.60171757E-01     0   451     6    12     0     0
   449  0.98570227E-03     0   452    13     0     0     0
   449  0.27050063E-03     0   452     1     7     0     0
   449  0.27050063E-03     0   452     3     9     0     0
   449  0.70145534E-03     0   452     5    11     0     0
   449  0.18317841E+00     0   452     6    12     0     0
   449  0.48928102E-03     0   453    13     0     0     0
   449  0.41999724E-02     0   453     1     7     0     0
   449  0.41999724E-02     0   453     3     9     0     0
   449  0.43954002E-02     0   453     5    11     0     0
   449  0.27682191E+00     0   453     6    12     0     0
   0
  22
   451  0.37047211E-02     0   450    59     0     0     0
   451  0.15253478E+00     0   456     2     7     0     0
   451  0.50844930E-01     0   456   122   127     0     0
   451  0.50844930E-01     0   456   124   129     0     0
   451  0.15253478E+00     0   454     1     8     0     0
   451  0.50844930E-01     0   454   121   128     0     0
   451  0.50844930E-01     0   454   123   130     0     0
   451  0.15253478E+00     0   456     4     9     0     0
   451  0.50844930E-01     0   456   126   131     0     0
   451  0.15253478E+00     0   454     3    10     0     0
   451  0.50844930E-01     0   454   125   132     0     0
   451  0.96735694E-02     0   450     2     8     0     0
   451  0.12736778E-01     0   450     1     7     0     0
   451  0.12736778E-01     0   450     3     9     0     0
   451  0.96735694E-02     0   450     4    10     0     0
   451  0.10993551E-01     0   450     5    11     0     0
   451  0.28064239E-02     0   450   121   127     0     0
   451  0.28064239E-02     0   450   123   129     0     0
   451  0.27567693E-02     0   450   125   131     0     0
   451  0.56342627E-02     0   450   122   128     0     0
   451  0.56342627E-02     0   450   124   130     0     0
   451  0.56342627E-02     0   450   126   132     0     0
  24
   452  0.29303332E-04     0   450    59     0     0     0
   452  0.58384387E-04     0   451    59     0     0     0
   452  0.53768311E-01     0   456     2     7     0     0
   452  0.17922770E-01     0   456   122   127     0     0
   452  0.17922770E-01     0   456   124   129     0     0
   452  0.53768311E-01     0   454     1     8     0     0
   452  0.17922770E-01     0   454   121   128     0     0
   452  0.17922770E-01     0   454   123   130     0     0
   452  0.53768311E-01     0   456     4     9     0     0
   452  0.17922770E-01     0   456   126   131     0     0
   452  0.53768311E-01     0   454     3    10     0     0
   452  0.17922770E-01     0   454   125   132     0     0
   452  0.67585784E+00     0   450   200     0     0     0
   452  0.17229056E-03     0   451     2     8     0     0
   452  0.22172817E-03     0   451     1     7     0     0
   452  0.22172817E-03     0   451     3     9     0     0
   452  0.17229056E-03     0   451     4    10     0     0
   452  0.20558531E-03     0   451     5    11     0     0
   452  0.50331349E-04     0   451   121   127     0     0
   452  0.50331349E-04     0   451   123   129     0     0
   452  0.49696038E-04     0   451   125   131     0     0
   452  0.10021713E-03     0   451   122   128     0     0
   452  0.10021713E-03     0   451   124   130     0     0
   452  0.10021713E-03     0   451   126   132     0     0
  15
   453  0.47387096E+00     0   454   199     0     0     0
   453  0.47387096E+00     0   456   198     0     0     0
   453  0.21656126E-01     0   450   200     0     0     0
   453  0.46674446E-04     0   452     2     8     0     0
   453  0.60241819E-04     0   452     1     7     0     0
   453  0.60241819E-04     0   452     3     9     0     0
   453  0.46674446E-04     0   452     4    10     0     0
   453  0.55494038E-04     0   452     5    11     0     0
   453  0.13662998E-04     0   452   121   127     0     0
   453  0.13662998E-04     0   452   123   129     0     0
   453  0.13474974E-04     0   452   125   131     0     0
   453  0.27160233E-04     0   452   122   128     0     0
   453  0.27160233E-04     0   452   124   130     0     0
   453  0.27160233E-04     0   452   126   132     0     0
   453  0.30210439E-01     0   450   203     0     0     0
   5
   454  0.33334264E+00     0   450     2     7     0     0
   454  0.33334264E+00     0   450     4     9     0     0
   454  0.11110458E+00     0   450   127   122     0     0
   454  0.11110458E+00     0   450   129   124     0     0
   454  0.11110561E+00     0   450   131   126     0     0
   9
   455  0.11278148E+00     0   450   198     0     0     0
   455  0.44888881E+00     0   451   198     0     0     0
   455  0.22386304E-03     0   452     2     7     0     0
   455  0.22386304E-03     0   452     4     9     0     0
   455  0.74608273E-04     0   452   127   122     0     0
   455  0.74608273E-04     0   452   129   124     0     0
   455  0.74609321E-04     0   452   131   126     0     0
   455  0.42247143E+00     0   454   200     0     0     0
   455  0.15186979E-01     0   454   203     0     0     0
   5
   456  0.33334264E+00     0   450     8     1     0     0
   456  0.33334264E+00     0   450    10     3     0     0
   456  0.11110458E+00     0   450   121   128     0     0
   456  0.11110458E+00     0   450   123   130     0     0
   456  0.11110561E+00     0   450   125   132     0     0
   9
   457  0.11278148E+00     0   450   199     0     0     0
   457  0.44888881E+00     0   451   199     0     0     0
   457  0.22386304E-03     0   452     8     1     0     0
   457  0.22386304E-03     0   452    10     3     0     0
   457  0.74608273E-04     0   452   121   128     0     0
   457  0.74608273E-04     0   452   123   130     0     0
   457  0.74609321E-04     0   452   125   132     0     0
   457  0.42247143E+00     0   456   200     0     0     0
   457  0.15186979E-01     0   456   203     0     0     0
  28
   203  0.20213358E-03     0   123   129     0     0     0
   203  0.57817012E-01     0   125   131     0     0     0
   203  0.24265833E-02     0     3     9     0     0     0
   203  0.79161775E+00     0     5    11     0     0     0
   203  0.30109070E-01     0     4    10     0     0     0
   203  0.19046493E-02     0    59    59     0     0     0
   203  0.34967661E-01     0    13    13     0     0     0
   203  0.41236929E-02     0   198   121   128     0     0
   203  0.41236929E-02     0   198   123   130     0     0
   203  0.41236929E-02     0   198   125   132     0     0
   203  0.12371077E-01     0   198     8     1     0     0
   203  0.12371077E-01     0   198    10     3     0     0
   203  0.41236929E-02     0   199   127   122     0     0
   203  0.41236929E-02     0   199   129   124     0     0
   203  0.41236929E-02     0   199   131   126     0     0
   203  0.12371077E-01     0   199     2     7     0     0
   203  0.12371077E-01     0   199     4     9     0     0
   203  0.46020735E-03     0   200   122   128     0     0
   203  0.46020735E-03     0   200   124   130     0     0
   203  0.46020735E-03     0   200   126   132     0     0
   203  0.23161771E-03     0   200   121   127     0     0
   203  0.23161771E-03     0   200   123   129     0     0
   203  0.23161771E-03     0   200   125   131     0     0
   203  0.79350267E-03     0   200     2     8     0     0
   203  0.79350267E-03     0   200     4    10     0     0
   203  0.10222270E-02     0   200     1     7     0     0
   203  0.10222270E-02     0   200     3     9     0     0
   203  0.10222270E-02     0   200     5    11     0     0
  23
   204  0.22550494E-04     0   123   129     0     0     0
   204  0.64583281E-02     0   125   131     0     0     0
   204  0.26598736E-03     0     3     9     0     0     0
   204  0.71369410E-01     0     5    11     0     0     0
   204  0.71175165E-01     0     6    12     0     0     0
   204  0.10749201E-03     0    13    13     0     0     0
   204  0.14181586E-02     0   198   199     0     0     0
   204  0.69715682E-03     0   200   200     0     0     0
   204  0.97717650E-01     0   450   450     0     0     0
   204  0.18734559E-01     0   450   451     0     0     0
   204  0.87519668E-01     0   450   452     0     0     0
   204  0.99021324E-03     0   450   453     0     0     0
   204  0.79315738E-03     0   451   451     0     0     0
   204  0.43440601E-02     0   451   452     0     0     0
   204  0.71578636E-03     0   451   453     0     0     0
   204  0.81515061E-02     0   452   452     0     0     0
   204  0.97616263E-01     0   452   453     0     0     0
   204  0.44896435E-02     0   453   453     0     0     0
   204  0.19527274E+00     0   454   456     0     0     0
   204  0.37392867E-02     0   455   457     0     0     0
   204  0.16130830E+00     0   454   457     0     0     0
   204  0.16130830E+00     0   456   455     0     0     0
   204  0.57845567E-02     0   203   203     0     0     0
  21
   205  0.22684104E-04     0   123   129     0     0     0
   205  0.64969114E-02     0   125   131     0     0     0
   205  0.26758556E-03     0     3     9     0     0     0
   205  0.71891807E-01     0     5    11     0     0     0
   205  0.10707761E+00     0     6    12     0     0     0
   205  0.92576345E-04     0    13    13     0     0     0
   205  0.16005829E+00     0   450   450     0     0     0
   205  0.35377596E-01     0   450   451     0     0     0
   205  0.23576232E-01     0   450   452     0     0     0
   205  0.35317575E-04     0   450   453     0     0     0
   205  0.17225427E-02     0   451   451     0     0     0
   205  0.67010446E-03     0   451   452     0     0     0
   205  0.13473359E-02     0   451   453     0     0     0
   205  0.69623636E-02     0   452   452     0     0     0
   205  0.22487303E-01     0   452   453     0     0     0
   205  0.54409523E-01     0   453   453     0     0     0
   205  0.32891262E+00     0   454   456     0     0     0
   205  0.66260062E-01     0   455   457     0     0     0
   205  0.55554144E-01     0   454   457     0     0     0
   205  0.55554144E-01     0   456   455     0     0     0
   205  0.12233664E-02     0   203   200     0     0     0
  13
   206  0.23700190E-04     0   124   129     0     0     0
   206  0.67879334E-02     0   126   131     0     0     0
   206  0.25777289E-03     0     4     9     0     0     0
   206  0.15041487E+00     0     6    11     0     0     0
   206  0.57042949E-01     0   454   450     0     0     0
   206  0.10350925E+00     0   454   451     0     0     0
   206  0.14233832E+00     0   454   452     0     0     0
   206  0.15740912E+00     0   454   453     0     0     0
   206  0.10464421E+00     0   455   450     0     0     0
   206  0.19253951E+00     0   455   451     0     0     0
   206  0.80211535E-01     0   455   452     0     0     0
   206  0.34606131E-02     0   455   453     0     0     0
   206  0.13603497E-02     0   203   198     0     0     0
  13
   207  0.23700190E-04     0   130   123     0     0     0
   207  0.67879334E-02     0   132   125     0     0     0
   207  0.25777289E-03     0    10     3     0     0     0
   207  0.15041487E+00     0    12     5     0     0     0
   207  0.57042949E-01     0   456   450     0     0     0
   207  0.10350925E+00     0   456   451     0     0     0
   207  0.14233832E+00     0   456   452     0     0     0
   207  0.15740912E+00     0   456   453     0     0     0
   207  0.10464421E+00     0   457   450     0     0     0
   207  0.19253951E+00     0   457   451     0     0     0
   207  0.80211535E-01     0   457   452     0     0     0
   207  0.34606131E-02     0   457   453     0     0     0
   207  0.13603497E-02     0   203   199     0     0     0
   0
   5
     6  0.33333334E+00   100     2     7     5     0     0
     6  0.33333334E+00   100     4     9     5     0     0
     6  0.11111111E+00   100   122   127     5     0     0
     6  0.11111111E+00   100   124   129     5     0     0
     6  0.11111111E+00   100   126   131     5     0     0
   5
    12  0.33333334E+00   100     8     1    11     0     0
    12  0.33333334E+00   100    10     3    11     0     0
    12  0.11111111E+00   100   128   121    11     0     0
    12  0.11111111E+00   100   130   123    11     0     0
    12  0.11111111E+00   100   132   125    11     0     0
      6.00000000     -0.18022604
     -0.62461883      0.46811512     -0.54221988      0.31099334
     -0.73911750     -0.61079299      0.22406907     -0.17444283
     -0.09897819      0.15685216      0.66458833      0.72382498
      0.23186165     -0.61902958     -0.46272269      0.59070325
     -0.84803247      0.52994424     -0.52994424     -0.84803247
     -0.65196025      0.75825310     -0.75825310     -0.65196025
      0.78484017     -1.02983105     -0.82984155
   4899.00000000      0.00000000      0.00000000
    160.00000000
    T
