#  ISAJET SUSY parameters in SUSY Les Houches Accord 2 format
#  Created by ISALHA 2.0 Last revision: C. Balazs 21 Apr 2009
Block SPINFO   # Program information
     1   ISASUGRA from ISAJET          # Spectrum Calculator
     2   7.80   29-OCT-2009 12:50:36   # Version number
Block MODSEL   # Model selection
     1     0   #   MsR(Q)          MbR(Q)                          
Block SMINPUTS   # Standard Model inputs
     1     1.27837601E+02   # alpha_em^(-1)
     2     1.16570000E-05   # G_Fermi
     3     1.17200002E-01   # alpha_s(M_Z)
     4     9.11699982E+01   # m_{Z}(pole)
     5     4.19999981E+00   # m_{b}(m_{b})
     6     1.72500000E+02   # m_{top}(pole)
     7     1.77699995E+00   # m_{tau}(pole)
Block MINPAR   # SUSY breaking input parameters
Block MASS   # Scalar and gaugino mass spectrum
#  PDG code   mass                 particle
        24     8.04229965E+01   #  W^+
        25     1.20300003E+02   #  h^0            
        35     1.51241333E+03   #  H^0            
        36     1.50000000E+03   #  A^0            
        37     1.53217200E+03   #  H^+            
   1000001     1.50070251E+03   #  dnl            
   1000002     1.49942578E+03   #  upl            
   1000003     1.50070251E+03   #  stl            
   1000004     1.49942639E+03   #  chl            
   1000005     1.50012537E+03   #  b1             
   1000006     1.50594250E+03   #  t1             
   1000011     1.50044543E+03   #  el-            
   1000012     1.49916858E+03   #  nuel           
   1000013     1.50044543E+03   #  mul-           
   1000014     1.49916858E+03   #  numl           
   1000015     1.50036975E+03   #  tau1           
   1000016     1.49916858E+03   #  nutl           
   1000021     4.00000000E+02   #  glss           
   1000022     4.89114990E+01   #  z1ss           
   1000023     1.42444861E+03   #  z2ss           
   1000024     1.42391968E+03   #  w1ss           
   1000025    -1.50034290E+03   #  z3ss           
   1000035     1.57698157E+03   #  z4ss           
   1000037     1.57651147E+03   #  w2ss           
   2000001     1.50012854E+03   #  dnr            
   2000002     1.49974292E+03   #  upr            
   2000003     1.50012854E+03   #  str            
   2000004     1.49974353E+03   #  chr            
   2000005     1.50071057E+03   #  b2             
   2000006     1.50628064E+03   #  t2             
   2000011     1.50038562E+03   #  er-            
   2000013     1.50038562E+03   #  mur-           
   2000015     1.50046326E+03   #  tau2           
Block ALPHA   # Effective Higgs mixing parameter
         -4.66351330E-01   # alpha
Block STOPMIX   # stop mixing matrix
  1  1     2.51487887E-04   # O_{11}
  1  2    -9.99999940E-01   # O_{12}
  2  1     9.99999940E-01   # O_{21}
  2  2     2.51487887E-04   # O_{22}
Block SBOTMIX   # sbottom mixing matrix
  1  1     4.33125763E-07   # O_{11}
  1  2     1.00000000E+00   # O_{12}
  2  1    -1.00000000E+00   # O_{21}
  2  2     4.33125763E-07   # O_{22}
Block STAUMIX   # stau mixing matrix
  1  1     1.86363741E-06   # O_{11}
  1  2     1.00000000E+00   # O_{12}
  2  1    -1.00000000E+00   # O_{21}
  2  2     1.86363741E-06   # O_{22}
Block NMIX   # neutralino mixing matrix
  1  1     9.99538839E-01   #
  1  2    -1.36401062E-03   #
  1  3     2.68694982E-02   #
  1  4    -1.40813366E-02   #
  2  1     2.14315690E-02   #
  2  2     7.09378779E-01   #
  2  3    -5.02429128E-01   #
  2  4     4.93849933E-01   #
  3  1    -9.02459025E-03   #
  3  2     8.48433655E-03   #
  3  3     7.06810951E-01   #
  3  4     7.07294405E-01   #
  4  1    -1.95284132E-02   #
  4  2     7.04775453E-01   #
  4  3     4.97254044E-01   #
  4  4    -5.05617559E-01   #
Block UMIX   # chargino U mixing matrix
  1  1    -7.01087475E-01   # U_{11}
  1  2     7.13075280E-01   # U_{12}
  2  1    -7.13075280E-01   # U_{21}
  2  2    -7.01087475E-01   # U_{22}
Block VMIX   # chargino V mixing matrix
  1  1    -7.13075101E-01   # V_{11}
  1  2     7.01087654E-01   # V_{12}
  2  1    -7.01087654E-01   # V_{21}
  2  2    -7.13075101E-01   # V_{22}
Block GAUGE Q=  0.00000000E+00   #
     1     0.00000000E+00   # g`
     2     0.00000000E+00   # g_2
     3     0.00000000E+00   # g_3
Block YU Q=  0.00000000E+00   #
  3  3     0.00000000E+00   # y_t
Block YD Q=  0.00000000E+00   #
  3  3     0.00000000E+00   # y_b
Block YE Q=  0.00000000E+00   #
  3  3     0.00000000E+00   # y_tau
Block HMIX Q=  0.00000000E+00   # Higgs mixing parameters
     1     0.00000000E+00   # mu(Q)
     2     0.00000000E+00   # tan(beta)(M_GUT)
     3     0.00000000E+00   # Higgs vev at Q
     4     2.25000000E+06   # m_A^2(Q)
Block MSOFT Q=  0.00000000E+00   # DRbar SUSY breaking parameters
     1     0.00000000E+00   # M_1(Q)          
     2     0.00000000E+00   # M_2(Q)          
     3     0.00000000E+00   # M_3(Q)          
    31     0.00000000E+00   # MeL(Q)          
    32     0.00000000E+00   # MmuL(Q)         
    33     0.00000000E+00   # MtauL(Q)        
    34     0.00000000E+00   # MeR(Q)          
    35     0.00000000E+00   # MmuR(Q)         
    36     0.00000000E+00   # MtauR(Q)        
    41     0.00000000E+00   # MqL1(Q)         
    42     0.00000000E+00   # MqL2(Q)         
    43     0.00000000E+00   # MqL3(Q)         
    44     0.00000000E+00   # MuR(Q)          
    45     0.00000000E+00   # McR(Q)          
    46     0.00000000E+00   # MtR(Q)          
    47     0.00000000E+00   # MdR(Q)          
    48     0.00000000E+00   # MsR(Q)          
    49     0.00000000E+00   # MbR(Q)          
Block AU Q=  0.00000000E+00   #
  1  1     0.00000000E+00   # A_u
  2  2     0.00000000E+00   # A_c
  3  3     0.00000000E+00   # A_t
Block AD Q=  0.00000000E+00   #
  1  1     0.00000000E+00   # A_d
  2  2     0.00000000E+00   # A_s
  3  3     0.00000000E+00   # A_b
Block AE Q=  0.00000000E+00   #
  1  1     0.00000000E+00   # A_e
  2  2     0.00000000E+00   # A_mu
  3  3     0.00000000E+00   # A_tau
#         PDG         Width
DECAY   1000021  1.07632331E-05   # GLSS  decays
#          BR          NDA       ID1       ID2       ID3       ID4
      4.30622778E-04    2      1000022        21                       # GLSS   -->  Z1SS   GL                 
      3.46233159E-01    3      1000022         2        -2             # GLSS   -->  Z1SS   UP     UB          
      1.02081195E-01    3      1000022         1        -1             # GLSS   -->  Z1SS   DN     DB          
      1.02081195E-01    3      1000022         3        -3             # GLSS   -->  Z1SS   ST     SB          
      3.46232533E-01    3      1000022         4        -4             # GLSS   -->  Z1SS   CH     CB          
      1.01789489E-01    3      1000022         5        -5             # GLSS   -->  Z1SS   BT     BB          
      5.64938782E-05    3      1000022         6        -6             # GLSS   -->  Z1SS   TP     TB          
      1.09532650E-03    2      1000039        21                       # GLSS   -->  GVSS   GL                 
#         PDG         Width
DECAY   1000002  7.65649109E+01   # UPL   decays
#          BR          NDA       ID1       ID2       ID3       ID4
      2.71751569E-03    2      1000022         2                       # UPL    -->  Z1SS   UP                 
      3.98780481E-04    2      1000023         2                       # UPL    -->  Z2SS   UP                 
      9.96075630E-01    2      1000021         2                       # UPL    -->  GLSS   UP                 
      8.08039738E-04    2      1000024         1                       # UPL    -->  W1SS+  DN                 
#         PDG         Width
DECAY   1000001  7.66499786E+01   # DNL   decays
#          BR          NDA       ID1       ID2       ID3       ID4
      2.79898662E-03    2      1000022         1                       # DNL    -->  Z1SS   DN                 
      4.02320322E-04    2      1000023         1                       # DNL    -->  Z2SS   DN                 
      1.94511941E-12    2      1000025         1                       # DNL    -->  Z3SS   DN                 
      9.95993316E-01    2      1000021         1                       # DNL    -->  GLSS   DN                 
      8.05486576E-04    2     -1000024         2                       # DNL    -->  W1SS-  UP                 
#         PDG         Width
DECAY   1000003  7.66499710E+01   # STL   decays
#          BR          NDA       ID1       ID2       ID3       ID4
      2.79898685E-03    2      1000022         3                       # STL    -->  Z1SS   ST                 
      4.02320351E-04    2      1000023         3                       # STL    -->  Z2SS   ST                 
      1.94511963E-12    2      1000025         3                       # STL    -->  Z3SS   ST                 
      9.95993376E-01    2      1000021         3                       # STL    -->  GLSS   ST                 
      8.05355550E-04    2     -1000024         4                       # STL    -->  W1SS-  CH                 
#         PDG         Width
DECAY   1000004  7.65647812E+01   # CHL   decays
#          BR          NDA       ID1       ID2       ID3       ID4
      2.71751685E-03    2      1000022         4                       # CHL    -->  Z1SS   CH                 
      3.98719159E-04    2      1000023         4                       # CHL    -->  Z2SS   CH                 
      9.96075749E-01    2      1000021         4                       # CHL    -->  GLSS   CH                 
      8.08052253E-04    2      1000024         3                       # CHL    -->  W1SS+  ST                 
#         PDG         Width
DECAY   1000005  7.71507568E+01   # BT1   decays
#          BR          NDA       ID1       ID2       ID3       ID4
      1.09552331E-02    2      1000022         5                       # BT1    -->  Z1SS   BT                 
      1.21802464E-06    2      1000023         5                       # BT1    -->  Z2SS   BT                 
      9.89043534E-01    2      1000021         5                       # BT1    -->  GLSS   BT                 
#         PDG         Width
DECAY   1000006  7.77886887E+01   # TP1   decays
#          BR          NDA       ID1       ID2       ID3       ID4
      9.55772996E-01    2      1000021         6                       # TP1    -->  GLSS   TP                 
      4.25256118E-02    2      1000022         6                       # TP1    -->  Z1SS   TP                 
      1.70134497E-03    2      1000024         5                       # TP1    -->  W1SS+  BT                 
#         PDG         Width
DECAY   2000002  7.96638641E+01   # UPR   decays
#          BR          NDA       ID1       ID2       ID3       ID4
      4.24274243E-02    2      1000022         2                       # UPR    -->  Z1SS   UP                 
      1.87304394E-07    2      1000023         2                       # UPR    -->  Z2SS   UP                 
      9.57572341E-01    2      1000021         2                       # UPR    -->  GLSS   UP                 
#         PDG         Width
DECAY   2000001  7.71528168E+01   # DNR   decays
#          BR          NDA       ID1       ID2       ID3       ID4
      1.09549006E-02    2      1000022         1                       # DNR    -->  Z1SS   DN                 
      4.88219136E-08    2      1000023         1                       # DNR    -->  Z2SS   DN                 
      9.89045024E-01    2      1000021         1                       # DNR    -->  GLSS   DN                 
#         PDG         Width
DECAY   2000003  7.71528168E+01   # STR   decays
#          BR          NDA       ID1       ID2       ID3       ID4
      1.09549006E-02    2      1000022         3                       # STR    -->  Z1SS   ST                 
      4.88219136E-08    2      1000023         3                       # STR    -->  Z2SS   ST                 
      9.89045024E-01    2      1000021         3                       # STR    -->  GLSS   ST                 
#         PDG         Width
DECAY   2000004  7.96637573E+01   # CHR   decays
#          BR          NDA       ID1       ID2       ID3       ID4
      4.24274281E-02    2      1000022         4                       # CHR    -->  Z1SS   CH                 
      1.87276029E-07    2      1000023         4                       # CHR    -->  Z2SS   CH                 
      9.57572401E-01    2      1000021         4                       # CHR    -->  GLSS   CH                 
#         PDG         Width
DECAY   2000005  7.65866165E+01   # BT2   decays
#          BR          NDA       ID1       ID2       ID3       ID4
      2.80158082E-03    2      1000022         5                       # BT2    -->  Z1SS   BT                 
      4.00223915E-04    2      1000023         5                       # BT2    -->  Z2SS   BT                 
      9.96798158E-01    2      1000021         5                       # BT2    -->  GLSS   BT                 
#         PDG         Width
DECAY   2000006  7.46559219E+01   # TP2   decays
#          BR          NDA       ID1       ID2       ID3       ID4
      9.96231794E-01    2      1000021         6                       # TP2    -->  GLSS   TP                 
      9.72555659E-04    2      1000024         5                       # TP2    -->  W1SS+  BT                 
      2.79561849E-03    2      1000022         6                       # TP2    -->  Z1SS   TP                 
#         PDG         Width
DECAY   1000011  1.98605025E+00   # EL-   decays
#          BR          NDA       ID1       ID2       ID3       ID4
      9.52983379E-01    2      1000022        11                       # EL-    -->  Z1SS   E-                 
      1.61225274E-02    2      1000023        11                       # EL-    -->  Z2SS   E-                 
      7.38041898E-13    2      1000025        11                       # EL-    -->  Z3SS   E-                 
      3.08897290E-02    2     -1000024        12                       # EL-    -->  W1SS-  NUE                
      4.40856456E-06    2           11   1000039                       # EL-    -->  E-     GVSS               
#         PDG         Width
DECAY   1000013  1.98605025E+00   # MUL-  decays
#          BR          NDA       ID1       ID2       ID3       ID4
      9.52983379E-01    2      1000022        13                       # MUL-   -->  Z1SS   MU-                
      1.61225107E-02    2      1000023        13                       # MUL-   -->  Z2SS   MU-                
      3.08897290E-02    2     -1000024        14                       # MUL-   -->  W1SS-  NUM                
      4.40856456E-06    2           13   1000039                       # MUL-   -->  MU-    GVSS               
#         PDG         Width
DECAY   1000015  7.60818624E+00   # TAU1- decays
#          BR          NDA       ID1       ID2       ID3       ID4
      9.99979496E-01    2      1000022        15                       # TAU1-  -->  Z1SS   TAU-               
      9.49909918E-06    2      1000023        15                       # TAU1-  -->  Z2SS   TAU-               
      9.81515495E-06    2     -1000024        16                       # TAU1-  -->  W1SS-  NUT                
      1.15052046E-06    2           15   1000039                       # TAU1-  -->  TAU-   GVSS               
#         PDG         Width
DECAY   1000012  2.00041938E+00   # NUEL  decays
#          BR          NDA       ID1       ID2       ID3       ID4
      9.54764962E-01    2      1000022        12                       # NUEL   -->  Z1SS   NUE                
      1.45032909E-02    2      1000023        12                       # NUEL   -->  Z2SS   NUE                
      3.07273138E-02    2      1000024        11                       # NUEL   -->  W1SS+  E-                 
      4.35830589E-06    2           12   1000039                       # NUEL   -->  NUE    GVSS               
#         PDG         Width
DECAY   1000014  2.00041938E+00   # NUML  decays
#          BR          NDA       ID1       ID2       ID3       ID4
      9.54764962E-01    2      1000022        14                       # NUML   -->  Z1SS   NUM                
      1.45032909E-02    2      1000023        14                       # NUML   -->  Z2SS   NUM                
      3.07272803E-02    2      1000024        13                       # NUML   -->  W1SS+  MU-                
      4.35830589E-06    2           14   1000039                       # NUML   -->  NUM    GVSS               
#         PDG         Width
DECAY   1000016  2.00037670E+00   # NUTL  decays
#          BR          NDA       ID1       ID2       ID3       ID4
      9.54785347E-01    2      1000022        16                       # NUTL   -->  Z1SS   NUT                
      1.45036001E-02    2      1000023        16                       # NUTL   -->  Z2SS   NUT                
      3.07066366E-02    2      1000024        15                       # NUTL   -->  W1SS+  TAU-               
      4.35839911E-06    2           16   1000039                       # NUTL   -->  NUT    GVSS               
#         PDG         Width
DECAY   2000011  7.60816669E+00   # ER-   decays
#          BR          NDA       ID1       ID2       ID3       ID4
      9.99994338E-01    2      1000022        11                       # ER-    -->  Z1SS   E-                 
      4.48463879E-06    2      1000023        11                       # ER-    -->  Z2SS   E-                 
      2.65123833E-13    2      1000025        11                       # ER-    -->  Z3SS   E-                 
      8.11381238E-40    3      1000015        12       -16             # ER-    -->  TAU1-  NUE    ANUT        
      1.15059072E-06    2           11   1000039                       # ER-    -->  E-     GVSS               
#         PDG         Width
DECAY   2000013  7.60816669E+00   # MUR-  decays
#          BR          NDA       ID1       ID2       ID3       ID4
      9.99994338E-01    2      1000022        13                       # MUR-   -->  Z1SS   MU-                
      4.48463334E-06    2      1000023        13                       # MUR-   -->  Z2SS   MU-                
      3.42245037E-35    3      1000015        14       -16             # MUR-   -->  TAU1-  NUM    ANUT        
      1.15059072E-06    2           13   1000039                       # MUR-   -->  MU-    GVSS               
#         PDG         Width
DECAY   2000015  1.98608994E+00   # TAU2- decays
#          BR          NDA       ID1       ID2       ID3       ID4
      9.52978790E-01    2      1000022        15                       # TAU2-  -->  Z1SS   TAU-               
      1.61183663E-02    2      1000023        15                       # TAU2-  -->  Z2SS   TAU-               
      3.09027731E-02    2     -1000024        16                       # TAU2-  -->  W1SS-  NUT                
#         PDG         Width
DECAY   1000022  2.51611476E-13   # Z1SS  decays
#          BR          NDA       ID1       ID2       ID3       ID4
      9.81340468E-01    2      1000039        22                       # Z1SS   -->  GVSS   GM                 
      1.86594985E-02    3      1000039        11       -11             # Z1SS   -->  GVSS   E-     E+          
#         PDG         Width
DECAY   1000023  5.10275960E-01   # Z2SS  decays
#          BR          NDA       ID1       ID2       ID3       ID4
      2.22526141E-05    2      1000022        22                       # Z2SS   -->  Z1SS   GM                 
      7.98003152E-02    2      1000022        23                       # Z2SS   -->  Z1SS   Z0                 
      1.97451474E-04    3      1000022         2        -2             # Z2SS   -->  Z1SS   UP     UB          
      1.95886561E-04    3      1000022         1        -1             # Z2SS   -->  Z1SS   DN     DB          
      1.95886561E-04    3      1000022         3        -3             # Z2SS   -->  Z1SS   ST     SB          
      1.97450718E-04    3      1000022         4        -4             # Z2SS   -->  Z1SS   CH     CB          
      2.04952725E-04    3      1000022         5        -5             # Z2SS   -->  Z1SS   BT     BB          
      6.05361944E-04    3      1000022        11       -11             # Z2SS   -->  Z1SS   E-     E+          
      6.05361944E-04    3      1000022        13       -13             # Z2SS   -->  Z1SS   MU-    MU+         
      6.10706978E-04    3      1000022        15       -15             # Z2SS   -->  Z1SS   TAU-   TAU+        
      5.74406178E-04    3      1000022        12       -12             # Z2SS   -->  Z1SS   NUE    ANUE        
      5.74406178E-04    3      1000022        14       -14             # Z2SS   -->  Z1SS   NUM    ANUM        
      5.74406178E-04    3      1000022        16       -16             # Z2SS   -->  Z1SS   NUT    ANUT        
      9.15631413E-01    2      1000022        25                       # Z2SS   -->  Z1SS   HL0                
      1.71924739E-06    2      1000039        22                       # Z2SS   -->  GVSS   GM                 
      4.23000728E-08    3      1000039        11       -11             # Z2SS   -->  GVSS   E-     E+          
      7.75494846E-06    2      1000039        23                       # Z2SS   -->  GVSS   Z0                 
      2.97757197E-07    2      1000039        25                       # Z2SS   -->  GVSS   HL0                
#         PDG         Width
DECAY   1000025  1.02754152E+00   # Z3SS  decays
#          BR          NDA       ID1       ID2       ID3       ID4
      1.58720632E-05    2      1000022        22                       # Z3SS   -->  Z1SS   GM                 
      1.02695663E-09    2      1000023        22                       # Z3SS   -->  Z2SS   GM                 
      1.33657700E-03    3     -1000024         2        -1             # Z3SS   -->  W1SS-  UP     DB          
      4.45525628E-04    3     -1000024        12       -11             # Z3SS   -->  W1SS-  NUE    E+          
      4.45525628E-04    3     -1000024        14       -13             # Z3SS   -->  W1SS-  NUM    MU+         
      1.33657700E-03    3      1000024         1        -2             # Z3SS   -->  W1SS+  DN     UB          
      4.45525628E-04    3      1000024        11       -12             # Z3SS   -->  W1SS+  E-     ANUE        
      4.45525628E-04    3      1000024        13       -14             # Z3SS   -->  W1SS+  MU-    ANUM        
      1.33657700E-03    3     -1000024         4        -3             # Z3SS   -->  W1SS-  CH     SB          
      4.45525628E-04    3     -1000024        16       -15             # Z3SS   -->  W1SS-  NUT    TAU+        
      1.33657700E-03    3      1000024         3        -4             # Z3SS   -->  W1SS+  ST     CB          
      4.45525628E-04    3      1000024        15       -16             # Z3SS   -->  W1SS+  TAU-   ANUT        
      9.04709220E-01    2      1000022        23                       # Z3SS   -->  Z1SS   Z0                 
      4.15368930E-08    3      1000022         1        -1             # Z3SS   -->  Z1SS   DN     DB          
      4.15368930E-08    3      1000022         3        -3             # Z3SS   -->  Z1SS   ST     SB          
      7.91126422E-06    3      1000022         5        -5             # Z3SS   -->  Z1SS   BT     BB          
      4.89952924E-07    3      1000022        11       -11             # Z3SS   -->  Z1SS   E-     E+          
      4.89952924E-07    3      1000022        13       -13             # Z3SS   -->  Z1SS   MU-    MU+         
      1.07158485E-05    3      1000022        15       -15             # Z3SS   -->  Z1SS   TAU-   TAU+        
      2.54720653E-04    3      1000023         2        -2             # Z3SS   -->  Z2SS   UP     UB          
      3.28078226E-04    3      1000023         1        -1             # Z3SS   -->  Z2SS   DN     DB          
      3.28078226E-04    3      1000023         3        -3             # Z3SS   -->  Z2SS   ST     SB          
      2.54720653E-04    3      1000023         4        -4             # Z3SS   -->  Z2SS   CH     CB          
      3.19979124E-04    3      1000023         5        -5             # Z3SS   -->  Z2SS   BT     BB          
      7.44848949E-05    3      1000023        11       -11             # Z3SS   -->  Z2SS   E-     E+          
      7.44848949E-05    3      1000023        13       -13             # Z3SS   -->  Z2SS   MU-    MU+         
      7.41626282E-05    3      1000023        15       -15             # Z3SS   -->  Z2SS   TAU-   TAU+        
      1.48255203E-04    3      1000023        12       -12             # Z3SS   -->  Z2SS   NUE    ANUE        
      1.48255203E-04    3      1000023        14       -14             # Z3SS   -->  Z2SS   NUM    ANUM        
      1.48255203E-04    3      1000023        16       -16             # Z3SS   -->  Z2SS   NUT    ANUT        
      8.50781649E-02    2      1000022        25                       # Z3SS   -->  Z1SS   HL0                
      6.42495501E-10    2      1000002        -2                       # Z3SS   -->  UPL    UB                 
      6.42495501E-10    2     -1000002         2                       # Z3SS   -->  UBL    UP                 
      2.57820570E-10    2      2000002        -2                       # Z3SS   -->  UPR    UB                 
      2.57820570E-10    2     -2000002         2                       # Z3SS   -->  UBR    UP                 
      8.21655070E-12    2      2000001        -1                       # Z3SS   -->  DNR    DB                 
      8.21655070E-12    2     -2000001         1                       # Z3SS   -->  DBR    DN                 
      3.05351014E-12    2      2000003        -3                       # Z3SS   -->  STR    SB                 
      3.05351014E-12    2     -2000003         3                       # Z3SS   -->  SBR    ST                 
      1.35999412E-09    2      1000012       -12                       # Z3SS   -->  NUEL   ANUE               
      1.35999412E-09    2     -1000012        12                       # Z3SS   -->  ANUEL  NUE                
      1.35999412E-09    2      1000014       -14                       # Z3SS   -->  NUML   ANUM               
      1.35999412E-09    2     -1000014        14                       # Z3SS   -->  ANUML  NUM                
      1.35999412E-09    2      1000016       -16                       # Z3SS   -->  NUTL   ANUT               
      1.35999412E-09    2     -1000016        16                       # Z3SS   -->  ANUTL  NUT                
      1.24439084E-10    2      1000039        22                       # Z3SS   -->  GVSS   GM                 
      3.07238696E-12    3      1000039        11       -11             # Z3SS   -->  GVSS   E-     E+          
      4.21608007E-07    2      1000039        23                       # Z3SS   -->  GVSS   Z0                 
      3.74247224E-06    2      1000039        25                       # Z3SS   -->  GVSS   HL0                
      1.67148231E-19    2      1000039        36                       # Z3SS   -->  GVSS   HA0                
#         PDG         Width
DECAY   1000035  3.55298471E+00   # Z4SS  decays
#          BR          NDA       ID1       ID2       ID3       ID4
      3.12377711E-06    2      1000022        22                       # Z4SS   -->  Z1SS   GM                 
      1.30714326E-07    2      1000023        22                       # Z4SS   -->  Z2SS   GM                 
      2.52614551E-08    2      1000025        22                       # Z4SS   -->  Z3SS   GM                 
      3.42528731E-01    2      1000024       -24                       # Z4SS   -->  W1SS+  W-                 
      3.42528731E-01    2     -1000024        24                       # Z4SS   -->  W1SS-  W+                 
      1.41429575E-02    2      1000022        23                       # Z4SS   -->  Z1SS   Z0                 
      5.74066910E-08    2      1000023        23                       # Z4SS   -->  Z2SS   Z0                 
      3.79344044E-14    3      1000023         5        -5             # Z4SS   -->  Z2SS   BT     BB          
      5.26734045E-15    3      1000023        15       -15             # Z4SS   -->  Z2SS   TAU-   TAU+        
      8.00759226E-05    3      1000025         2        -2             # Z4SS   -->  Z3SS   UP     UB          
      1.03258433E-04    3      1000025         1        -1             # Z4SS   -->  Z3SS   DN     DB          
      1.03258433E-04    3      1000025         3        -3             # Z4SS   -->  Z3SS   ST     SB          
      8.00759226E-05    3      1000025         4        -4             # Z4SS   -->  Z3SS   CH     CB          
      1.00877696E-04    3      1000025         5        -5             # Z4SS   -->  Z3SS   BT     BB          
      2.34241234E-05    3      1000025        11       -11             # Z4SS   -->  Z3SS   E-     E+          
      2.34241234E-05    3      1000025        13       -13             # Z4SS   -->  Z3SS   MU-    MU+         
      2.33249284E-05    3      1000025        15       -15             # Z4SS   -->  Z3SS   TAU-   TAU+        
      4.66066376E-05    3      1000025        12       -12             # Z4SS   -->  Z3SS   NUE    ANUE        
      4.66066376E-05    3      1000025        14       -14             # Z4SS   -->  Z3SS   NUM    ANUM        
      4.66066376E-05    3      1000025        16       -16             # Z4SS   -->  Z3SS   NUT    ANUT        
      1.23064190E-01    2      1000022        25                       # Z4SS   -->  Z1SS   HL0                
      7.98302499E-05    2      1000022        35                       # Z4SS   -->  Z1SS   HH0                
      2.83984729E-04    2      1000022        36                       # Z4SS   -->  Z1SS   HA0                
      1.48602667E-05    2      1000023        25                       # Z4SS   -->  Z2SS   HL0                
      1.26831327E-02    2      1000002        -2                       # Z4SS   -->  UPL    UB                 
      1.26831327E-02    2     -1000002         2                       # Z4SS   -->  UBL    UP                 
      1.25310719E-02    2      1000001        -1                       # Z4SS   -->  DNL    DB                 
      1.25310719E-02    2     -1000001         1                       # Z4SS   -->  DBL    DN                 
      1.25310309E-02    2      1000003        -3                       # Z4SS   -->  STL    SB                 
      1.25310309E-02    2     -1000003         3                       # Z4SS   -->  SBL    ST                 
      1.26811219E-02    2      1000004        -4                       # Z4SS   -->  CHL    CB                 
      1.26811219E-02    2     -1000004         4                       # Z4SS   -->  CBL    CH                 
      5.24100551E-06    2      2000002        -2                       # Z4SS   -->  UPR    UB                 
      5.24100551E-06    2     -2000002         2                       # Z4SS   -->  UBR    UP                 
      1.29752402E-06    2      2000001        -1                       # Z4SS   -->  DNR    DB                 
      1.29752402E-06    2     -2000001         1                       # Z4SS   -->  DBR    DN                 
      1.29751993E-06    2      2000003        -3                       # Z4SS   -->  STR    SB                 
      1.29751993E-06    2     -2000003         3                       # Z4SS   -->  SBR    ST                 
      5.24015695E-06    2      2000004        -4                       # Z4SS   -->  CHR    CB                 
      5.24015695E-06    2     -2000004         4                       # Z4SS   -->  CBR    CH                 
      3.61131060E-05    2      1000005        -5                       # Z4SS   -->  BT1    BB                 
      3.61131060E-05    2     -1000005         5                       # Z4SS   -->  BB1    BT                 
      1.24489293E-02    2      2000005        -5                       # Z4SS   -->  BT2    BB                 
      1.24489293E-02    2     -2000005         5                       # Z4SS   -->  BB2    BT                 
      4.03635064E-03    2      1000011       -11                       # Z4SS   -->  EL-    E+                 
      4.03635064E-03    2     -1000011        11                       # Z4SS   -->  EL+    E-                 
      4.03634692E-03    2      1000013       -13                       # Z4SS   -->  MUL-   MU+                
      4.03634692E-03    2     -1000013        13                       # Z4SS   -->  MUL+   MU-                
      3.86722468E-06    2      2000011       -11                       # Z4SS   -->  ER-    E+                 
      3.86722468E-06    2     -2000011        11                       # Z4SS   -->  ER+    E-                 
      3.86722104E-06    2      2000013       -13                       # Z4SS   -->  MUR-   MU+                
      3.86722104E-06    2     -2000013        13                       # Z4SS   -->  MUR+   MU-                
      8.55312373E-06    2      1000015       -15                       # Z4SS   -->  TAU1-  TAU+               
      8.55312373E-06    2     -1000015        15                       # Z4SS   -->  TAU1+  TAU-               
      4.03168611E-03    2      2000015       -15                       # Z4SS   -->  TAU2-  TAU+               
      4.03168611E-03    2     -2000015        15                       # Z4SS   -->  TAU2+  TAU-               
      4.43054689E-03    2      1000012       -12                       # Z4SS   -->  NUEL   ANUE               
      4.43054689E-03    2     -1000012        12                       # Z4SS   -->  ANUEL  NUE                
      4.43054689E-03    2      1000014       -14                       # Z4SS   -->  NUML   ANUM               
      4.43054689E-03    2     -1000014        14                       # Z4SS   -->  ANUML  NUM                
      4.43054689E-03    2      1000016       -16                       # Z4SS   -->  NUTL   ANUT               
      4.43054689E-03    2     -1000016        16                       # Z4SS   -->  ANUTL  NUT                
      3.28385511E-07    2      1000039        22                       # Z4SS   -->  GVSS   GM                 
      8.13492385E-09    3      1000039        11       -11             # Z4SS   -->  GVSS   E-     E+          
      1.93559868E-06    2      1000039        23                       # Z4SS   -->  GVSS   Z0                 
      8.02780988E-08    2      1000039        25                       # Z4SS   -->  GVSS   HL0                
      2.94943445E-11    2      1000039        35                       # Z4SS   -->  GVSS   HH0                
      6.21702039E-12    2      1000039        36                       # Z4SS   -->  GVSS   HA0                
#         PDG         Width
DECAY   1000024  5.14202833E-01   # W1SS+ decays
#          BR          NDA       ID1       ID2       ID3       ID4
      3.84658575E-04    3      1000022         2        -1             # W1SS+  -->  Z1SS   UP     DB          
      3.84657877E-04    3      1000022         4        -3             # W1SS+  -->  Z1SS   CH     SB          
      1.15631300E-03    3      1000022       -11        12             # W1SS+  -->  Z1SS   E+     NUE         
      1.15631300E-03    3      1000022       -13        14             # W1SS+  -->  Z1SS   MU+    NUM         
      1.16160128E-03    3      1000022       -15        16             # W1SS+  -->  Z1SS   TAU+   NUT         
      9.95756388E-01    2      1000022        24                       # W1SS+  -->  Z1SS   W+                 
#         PDG         Width
DECAY   1000037  3.52178001E+00   # W2SS+ decays
#          BR          NDA       ID1       ID2       ID3       ID4
      1.87766659E-07    3      1000022       -15        16             # W2SS+  -->  Z1SS   TAU+   NUT         
      1.37274534E-01    2      1000022        24                       # W2SS+  -->  Z1SS   W+                 
      4.34957365E-12    3      1000023       -15        16             # W2SS+  -->  Z2SS   TAU+   NUT         
      3.50062728E-01    2      1000023        24                       # W2SS+  -->  Z2SS   W+                 
      3.80477984E-04    3      1000025         2        -1             # W2SS+  -->  Z3SS   UP     DB          
      3.80477984E-04    3      1000025         4        -3             # W2SS+  -->  Z3SS   CH     SB          
      1.26825995E-04    3      1000025       -11        12             # W2SS+  -->  Z3SS   E+     NUE         
      1.26825995E-04    3      1000025       -13        14             # W2SS+  -->  Z3SS   MU+    NUM         
      1.26825995E-04    3      1000025       -15        16             # W2SS+  -->  Z3SS   TAU+   NUT         
      2.52887215E-02    2      1000002        -1                       # W2SS+  -->  UPL    DB                 
      2.53225528E-02    2     -1000001         2                       # W2SS+  -->  DBL    UP                 
      2.52882633E-02    2      1000004        -3                       # W2SS+  -->  CHL    SB                 
      2.61567179E-02    2     -1000003         4                       # W2SS+  -->  SBL    CH                 
      4.16564569E-02    2      1000006        -5                       # W2SS+  -->  TP1    BB                 
      2.09153164E-02    2      2000006        -5                       # W2SS+  -->  TP2    BB                 
      8.48450046E-03    2      1000012       -11                       # W2SS+  -->  NUEL   E+                 
      8.48449301E-03    2      1000014       -13                       # W2SS+  -->  NUML   MU+                
      8.47865175E-03    2      1000016       -15                       # W2SS+  -->  NUTL   TAU+               
      8.49677157E-03    2     -1000011        12                       # W2SS+  -->  EL+    NUE                
      8.49677157E-03    2     -1000013        14                       # W2SS+  -->  MUL+   NUM                
      9.69926714E-06    2     -1000015        16                       # W2SS+  -->  TAU1+  NUT                
      8.49288888E-03    2     -2000015        16                       # W2SS+  -->  TAU2+  NUT                
      2.95912147E-01    2      1000024        23                       # W2SS+  -->  W1SS+  Z0                 
      3.72060676E-05    2      1000024        25                       # W2SS+  -->  W1SS+  HL0                
#         PDG         Width
DECAY        25  4.53140028E-03   # HL0   decays
#          BR          NDA       ID1       ID2       ID3       ID4
      4.56044980E-09    2           11       -11                       # HL0    -->  E-     E+                 
      1.92549531E-04    2           13       -13                       # HL0    -->  MU-    MU+                
      5.50772063E-02    2           15       -15                       # HL0    -->  TAU-   TAU+               
      5.71998407E-06    2            1        -1                       # HL0    -->  DN     DB                 
      2.31116056E-03    2            3        -3                       # HL0    -->  ST     SB                 
      7.52823949E-01    2            5        -5                       # HL0    -->  BT     BB                 
      1.80568168E-06    2            2        -2                       # HL0    -->  UP     UB                 
      3.37581560E-02    2            4        -4                       # HL0    -->  CH     CB                 
      1.97091815E-03    2           22        22                       # HL0    -->  GM     GM                 
      4.00272310E-02    2           21        21                       # HL0    -->  GL     GL                 
      5.36051532E-03    3           24        11       -12             # HL0    -->  W+     E-     ANUE        
      5.36051532E-03    3           24        13       -14             # HL0    -->  W+     MU-    ANUM        
      5.36051532E-03    3           24        15       -16             # HL0    -->  W+     TAU-   ANUT        
      1.60815474E-02    3           24        -2         1             # HL0    -->  W+     UB     DN          
      1.60815474E-02    3           24        -4         3             # HL0    -->  W+     CB     ST          
      5.36051532E-03    3          -24       -11        12             # HL0    -->  W-     E+     NUE         
      5.36051532E-03    3          -24       -13        14             # HL0    -->  W-     MU+    NUM         
      5.36051532E-03    3          -24       -15        16             # HL0    -->  W-     TAU+   NUT         
      1.60815474E-02    3          -24         2        -1             # HL0    -->  W-     UP     DB          
      1.60815474E-02    3          -24         4        -3             # HL0    -->  W-     CH     SB          
      6.30176102E-04    3           23        12       -12             # HL0    -->  Z0     NUE    ANUE        
      6.30176102E-04    3           23        14       -14             # HL0    -->  Z0     NUM    ANUM        
      6.30176102E-04    3           23        16       -16             # HL0    -->  Z0     NUT    ANUT        
      3.17161292E-04    3           23        11       -11             # HL0    -->  Z0     E-     E+          
      3.17161292E-04    3           23        13       -13             # HL0    -->  Z0     MU-    MU+         
      3.17161292E-04    3           23        15       -15             # HL0    -->  Z0     TAU-   TAU+        
      1.08656776E-03    3           23         2        -2             # HL0    -->  Z0     UP     UB          
      1.08656776E-03    3           23         4        -4             # HL0    -->  Z0     CH     CB          
      1.39976689E-03    3           23         1        -1             # HL0    -->  Z0     DN     DB          
      1.39976689E-03    3           23         3        -3             # HL0    -->  Z0     ST     SB          
      1.39976689E-03    3           23         5        -5             # HL0    -->  Z0     BT     BB          
      8.12772661E-03    2      1000022   1000022                       # HL0    -->  Z1SS   Z1SS               
#         PDG         Width
DECAY        35  1.71623001E+01   # HH0   decays
#          BR          NDA       ID1       ID2       ID3       ID4
      5.97406985E-11    2           11       -11                       # HH0    -->  E-     E+                 
      2.52236009E-06    2           13       -13                       # HH0    -->  MU-    MU+                
      7.22436584E-04    2           15       -15                       # HH0    -->  TAU-   TAU+               
      7.29456957E-08    2            1        -1                       # HH0    -->  DN     DB                 
      2.94737529E-05    2            3        -3                       # HH0    -->  ST     SB                 
      6.93441415E-03    2            5        -5                       # HH0    -->  BT     BB                 
      1.47857848E-09    2            2        -2                       # HH0    -->  UP     UB                 
      1.98658308E-05    2            4        -4                       # HH0    -->  CH     CB                 
      9.86672699E-01    2            6        -6                       # HH0    -->  TP     TB                 
      2.93741709E-06    2           22        22                       # HH0    -->  GM     GM                 
      4.26176848E-04    2           21        21                       # HH0    -->  GL     GL                 
      4.71441774E-04    2           24       -24                       # HH0    -->  W+     W-                 
      2.40817622E-04    2           23        23                       # HH0    -->  Z0     Z0                 
      6.98074946E-05    2      1000022   1000022                       # HH0    -->  Z1SS   Z1SS               
      3.34048782E-05    2      1000022   1000023                       # HH0    -->  Z1SS   Z2SS               
      4.37390339E-03    2           25        25                       # HH0    -->  HL0    HL0                
#         PDG         Width
DECAY        36  1.75194454E+01   # HA0   decays
#          BR          NDA       ID1       ID2       ID3       ID4
      5.82001843E-11    2           11       -11                       # HA0    -->  E-     E+                 
      2.45731667E-06    2           13       -13                       # HA0    -->  MU-    MU+                
      7.03811238E-04    2           15       -15                       # HA0    -->  TAU-   TAU+               
      7.10691594E-08    2            1        -1                       # HA0    -->  DN     DB                 
      2.87155381E-05    2            3        -3                       # HA0    -->  ST     SB                 
      6.76246360E-03    2            5        -5                       # HA0    -->  BT     BB                 
      1.42123757E-09    2            2        -2                       # HA0    -->  UP     UB                 
      1.91132640E-05    2            4        -4                       # HA0    -->  CH     CB                 
      9.90751922E-01    2            6        -6                       # HA0    -->  TP     TB                 
      2.95797327E-06    2           22        22                       # HA0    -->  GM     GM                 
      4.24167985E-04    2           21        21                       # HA0    -->  GL     GL                 
      2.00686118E-04    2      1000022   1000022                       # HA0    -->  Z1SS   Z1SS               
      6.53436815E-04    2      1000022   1000023                       # HA0    -->  Z1SS   Z2SS               
      4.50282445E-04    2           25        23                       # HA0    -->  HL0    Z0                 
#         PDG         Width
DECAY        37  1.63056622E+01   # H+    decays
#          BR          NDA       ID1       ID2       ID3       ID4
      6.38737674E-11    2           12       -11                       # H+     -->  NUE    E+                 
      2.69686575E-06    2           14       -13                       # H+     -->  NUM    MU+                
      7.72421598E-04    2           16       -15                       # H+     -->  NUT    TAU+               
      7.33620880E-08    2            2        -1                       # H+     -->  UP     DB                 
      4.83574295E-05    2            4        -3                       # H+     -->  CH     SB                 
      9.97172594E-01    2            6        -5                       # H+     -->  TP     BB                 
      1.49310287E-03    2      1000024   1000022                       # H+     -->  W1SS+  Z1SS               
      5.10769896E-04    2           25        24                       # H+     -->  HL0    W+                 
