#  ISAJET SUSY parameters in Les Houches accord format
#  Created by ISALHA3. Last revision by C. Balazs on 2005 Jan. 10
Block SPINFO   # Program information
     1   ISASUGRA from ISAJET          # Spectrum Calculator
     2   7.79   16-DEC-2008 15:42:00   # Version number
Block MODSEL   # Model selection
     1     1   # Minimal supergravity (mSUGRA,CMSSM) model         
Block SMINPUTS   # Standard Model inputs
     1     1.27840698E+02   # alpha_em^(-1)
     2     1.16570000E-05   # G_Fermi
     3     1.17200002E-01   # alpha_s(M_Z)
     4     9.11699982E+01   # m_{Z}(pole)
     5     4.19999981E+00   # m_{b}(m_{b})
     6     1.72500000E+02   # m_{top}(pole)
     7     1.77699995E+00   # m_{tau}(pole)
Block MINPAR   # SUSY breaking input parameters
     1     4.80000000E+02   # m_0
     2     3.70000000E+02   # m_{1/2}
     3     3.00000000E+00   # tan(beta)
     4     1.00000000E+00   # sign(mu)
     5     0.00000000E+00   # A_0
#  
#  M_{GUT} =   0.20319170E+17
Block MASS   # Scalar and gaugino mass spectrum
#  PDG code   mass                 particle
        24     8.04229965E+01   #  W^+
        25     1.00706573E+02   #  h^0            
        35     8.41996216E+02   #  H^0            
        36     8.34595642E+02   #  A^0            
        37     8.43791138E+02   #  H^+            
   1000001     9.31397217E+02   #  dnl            
   1000002     9.28505066E+02   #  upl            
   1000003     9.31397278E+02   #  stl            
   1000004     9.28506104E+02   #  chl            
   1000005     8.31797668E+02   #  b1             
   1000006     6.42692566E+02   #  t1             
   1000011     5.41206360E+02   #  el-            
   1000012     5.35702332E+02   #  nuel           
   1000013     5.41206360E+02   #  mul-           
   1000014     5.35702332E+02   #  numl           
   1000015     4.99380157E+02   #  tau1           
   1000016     5.35170349E+02   #  nutl           
   1000021     8.91584167E+02   #  glss           
   1000022     1.49482712E+02   #  z1ss           
   1000023     2.81693970E+02   #  z2ss           
   1000024     2.81464142E+02   #  w1ss           
   1000025    -5.78796448E+02   #  z3ss           
   1000035     5.98176941E+02   #  z4ss           
   1000037     5.95348328E+02   #  w2ss           
   2000001     9.04985901E+02   #  dnr            
   2000002     9.06815918E+02   #  upr            
   2000003     9.04985901E+02   #  str            
   2000004     9.06817017E+02   #  chr            
   2000005     9.02280640E+02   #  b2             
   2000006     8.72641479E+02   #  t2             
   2000011     4.99839111E+02   #  er-            
   2000013     4.99839111E+02   #  mur-           
   2000015     5.41034851E+02   #  tau2           
#  Higgs mixing
Block ALPHA   # Effective Higgs mixing parameter
         -3.29104334E-01   # alpha
Block STOPMIX   # stop mixing matrix
  1  1     4.00086641E-01   # O_{11}
  1  2    -9.16477323E-01   # O_{12}
  2  1     9.16477323E-01   # O_{21}
  2  2     4.00086641E-01   # O_{22}
Block SBOTMIX   # sbottom mixing matrix
  1  1     9.98509705E-01   # O_{11}
  1  2    -5.45740873E-02   # O_{12}
  2  1     5.45740873E-02   # O_{21}
  2  2     9.98509705E-01   # O_{22}
Block STAUMIX   # stau mixing matrix
  1  1     8.03118125E-02   # O_{11}
  1  2    -9.96769786E-01   # O_{12}
  2  1     9.96769786E-01   # O_{21}
  2  2     8.03118125E-02   # O_{22}
Block NMIX   # neutralino mixing matrix
  1  1     9.94278431E-01   #
  1  2    -3.74930054E-02   #
  1  3     8.78018886E-02   #
  1  4    -4.79103252E-02   #
  2  1    -5.91753274E-02   #
  2  2    -9.72502768E-01   #
  2  3     1.83720991E-01   #
  2  4    -1.30319312E-01   #
  3  1    -2.65532155E-02   #
  3  2     3.97221148E-02   #
  3  3     7.04198122E-01   #
  3  4     7.08393931E-01   #
  4  1    -8.48735869E-02   #
  4  2     2.26394847E-01   #
  4  3     6.80178046E-01   #
  4  4    -6.92025423E-01   #
Block UMIX   # chargino U mixing matrix
  1  1    -9.63818371E-01   # U_{11}
  1  2     2.66559929E-01   # U_{12}
  2  1    -2.66559929E-01   # U_{21}
  2  2    -9.63818371E-01   # U_{22}
Block VMIX   # chargino V mixing matrix
  1  1    -9.81576145E-01   # V_{11}
  1  2     1.91071257E-01   # V_{12}
  2  1    -1.91071257E-01   # V_{21}
  2  2    -9.81576145E-01   # V_{22}
Block GAUGE Q=  7.15541138E+02   #
     1     3.57522428E-01   # g`
     2     6.52345002E-01   # g_2
     3     1.21930313E+00   # g_3
Block YU Q=  7.15541138E+02   #
  3  3     9.08497632E-01   # y_t
Block YD Q=  7.15541138E+02   #
  3  3     4.30371948E-02   # y_b
Block YE Q=  7.15541138E+02   #
  3  3     3.18134613E-02   # y_tau
Block HMIX Q=  7.15541138E+02   # Higgs mixing parameters
     1     5.76983337E+02   # mu(Q)
     2     3.00000000E+00   # tan(beta)(M_{GUT})
     3     2.50642563E+02   # Higgs vev at Q
     4     6.96549875E+05   # m_A^2(Q)
Block MSOFT Q=  7.15541138E+02   # DRbar SUSY breaking parameters
     1     1.53867920E+02   # M_1(Q)          
     2     2.87211670E+02   # M_2(Q)          
     3     8.33250854E+02   # M_3(Q)          
    31     5.37519531E+02   # MeL(Q)          
    32     5.37519531E+02   # MmuL(Q)         
    33     5.36997864E+02   # MtauL(Q)        
    34     4.97976807E+02   # MeR(Q)          
    35     4.97976807E+02   # MmuR(Q)         
    36     4.97464905E+02   # MtauR(Q)        
    41     8.86235840E+02   # MqL1(Q)         
    42     8.86235840E+02   # MqL2(Q)         
    43     7.93420654E+02   # MqL3(Q)         
    44     8.64028076E+02   # MuR(Q)          
    45     8.64028076E+02   # McR(Q)          
    46     6.45305969E+02   # MtR(Q)          
    47     8.61326477E+02   # MdR(Q)          
    48     8.61326477E+02   # MsR(Q)          
    49     8.66716736E+02   # MbR(Q)          
Block AU Q=  7.15541138E+02   #
  1  1    -6.28823425E+02   # A_u
  2  2    -6.28823425E+02   # A_c
  3  3    -6.28823425E+02   # A_t
Block AD Q=  7.15541138E+02   #
  1  1    -9.90261658E+02   # A_d
  2  2    -9.90261658E+02   # A_s
  3  3    -9.90261658E+02   # A_b
Block AE Q=  7.15541138E+02   #
  1  1    -2.28266296E+02   # A_e
  2  2    -2.28266296E+02   # A_mu
  3  3    -2.28266296E+02   # A_tau
#  ISAJET decay tables in SUSY Les Houches accord format
#  Created by ISALHD. Last revision: C. Balazs, 2005 May 25
Block DCINFO                           # Program information
     1   ISASUGRA from ISAJET          # Spectrum Calculator
     2   7.79   16-DEC-2008 15:42:00   # Version number
#         PDG         Width
DECAY         6  1.14680767E+00   # TP    decays
#          BR          NDA       ID1       ID2       ID3       ID4
      3.33333343E-01    3            2        -1         5             # TP     -->  UP     DB     BT          
      3.33333343E-01    3            4        -3         5             # TP     -->  CH     SB     BT          
      1.11111112E-01    3          -11        12         5             # TP     -->  E+     NUE    BT          
      1.11111112E-01    3          -13        14         5             # TP     -->  MU+    NUM    BT          
      1.11111112E-01    3          -15        16         5             # TP     -->  TAU+   NUT    BT          
#         PDG         Width
DECAY   1000021  2.10580730E+00   # GLSS  decays
#          BR          NDA       ID1       ID2       ID3       ID4
      5.07336855E-03    3      1000024         1        -2             # GLSS   -->  W1SS+  DN     UB          
      5.07336855E-03    3     -1000024         2        -1             # GLSS   -->  W1SS-  UP     DB          
      5.07333502E-03    3      1000024         3        -4             # GLSS   -->  W1SS+  ST     CB          
      5.07333502E-03    3     -1000024         4        -3             # GLSS   -->  W1SS-  CH     SB          
      1.26690837E-03    3      1000024         5        -6             # GLSS   -->  W1SS+  BT     TB          
      1.26690837E-03    3     -1000024         6        -5             # GLSS   -->  W1SS-  TP     BB          
      4.37040653E-05    3      1000037         1        -2             # GLSS   -->  W2SS+  DN     UB          
      4.37040653E-05    3     -1000037         2        -1             # GLSS   -->  W2SS-  UP     DB          
      4.37037525E-05    3      1000037         3        -4             # GLSS   -->  W2SS+  ST     CB          
      4.37037525E-05    3     -1000037         4        -3             # GLSS   -->  W2SS-  CH     SB          
      3.95063289E-05    3      1000037         5        -6             # GLSS   -->  W2SS+  BT     TB          
      3.95063289E-05    3     -1000037         6        -5             # GLSS   -->  W2SS-  TP     BB          
      4.52281085E-07    2      1000022        21                       # GLSS   -->  Z1SS   GL                 
      2.56888941E-03    3      1000022         2        -2             # GLSS   -->  Z1SS   UP     UB          
      8.07558012E-04    3      1000022         1        -1             # GLSS   -->  Z1SS   DN     DB          
      8.07557895E-04    3      1000022         3        -3             # GLSS   -->  Z1SS   ST     SB          
      2.56884610E-03    3      1000022         4        -4             # GLSS   -->  Z1SS   CH     CB          
      6.68282795E-04    3      1000022         5        -5             # GLSS   -->  Z1SS   BT     BB          
      1.08189437E-04    3      1000022         6        -6             # GLSS   -->  Z1SS   TP     TB          
      5.63870572E-06    2      1000023        21                       # GLSS   -->  Z2SS   GL                 
      2.64073303E-03    3      1000023         2        -2             # GLSS   -->  Z2SS   UP     UB          
      2.43683392E-03    3      1000023         1        -1             # GLSS   -->  Z2SS   DN     DB          
      2.43683229E-03    3      1000023         3        -3             # GLSS   -->  Z2SS   ST     SB          
      2.64070020E-03    3      1000023         4        -4             # GLSS   -->  Z2SS   CH     CB          
      5.91555954E-06    3      1000023         5        -5             # GLSS   -->  Z2SS   BT     BB          
      8.28836928E-04    3      1000023         6        -6             # GLSS   -->  Z2SS   TP     TB          
      6.35847318E-05    2      1000025        21                       # GLSS   -->  Z3SS   GL                 
      4.44412706E-07    3      1000025         2        -2             # GLSS   -->  Z3SS   UP     UB          
      4.92431639E-07    3      1000025         1        -1             # GLSS   -->  Z3SS   DN     DB          
      4.92431241E-07    3      1000025         3        -3             # GLSS   -->  Z3SS   ST     SB          
      4.44401934E-07    3      1000025         4        -4             # GLSS   -->  Z3SS   CH     CB          
      3.22235269E-06    3      1000025         5        -5             # GLSS   -->  Z3SS   BT     BB          
      3.68929468E-05    2      1000035        21                       # GLSS   -->  Z4SS   GL                 
      2.07482281E-05    3      1000035         2        -2             # GLSS   -->  Z4SS   UP     UB          
      2.36360556E-05    3      1000035         1        -1             # GLSS   -->  Z4SS   DN     DB          
      2.36360338E-05    3      1000035         3        -3             # GLSS   -->  Z4SS   ST     SB          
      2.07478461E-05    3      1000035         4        -4             # GLSS   -->  Z4SS   CH     CB          
      4.31209810E-06    3      1000035         5        -5             # GLSS   -->  Z4SS   BT     BB          
      8.18243995E-02    2     -1000005         5                       # GLSS   -->  BB1    BT                 
      8.18243995E-02    2      1000005        -5                       # GLSS   -->  BT1    BB                 
      3.97273123E-01    2     -1000006         6                       # GLSS   -->  TB1    TP                 
      3.97273123E-01    2      1000006        -6                       # GLSS   -->  TP1    TB                 
#         PDG         Width
DECAY   1000002  9.91326809E+00   # UPL   decays
#          BR          NDA       ID1       ID2       ID3       ID4
      7.82891456E-03    2      1000022         2                       # UPL    -->  Z1SS   UP                 
      3.14283818E-01    2      1000023         2                       # UPL    -->  Z2SS   UP                 
      1.79079070E-04    2      1000025         2                       # UPL    -->  Z3SS   UP                 
      5.99734439E-03    2      1000035         2                       # UPL    -->  Z4SS   UP                 
      3.52116935E-02    2      1000021         2                       # UPL    -->  GLSS   UP                 
      6.26516521E-01    2      1000024         1                       # UPL    -->  W1SS+  DN                 
      9.98266973E-03    2      1000037         1                       # UPL    -->  W2SS+  DN                 
#         PDG         Width
DECAY   1000001  9.86691284E+00   # DNL   decays
#          BR          NDA       ID1       ID2       ID3       ID4
      1.81957074E-02    2      1000022         1                       # DNL    -->  Z1SS   DN                 
      3.03310484E-01    2      1000023         1                       # DNL    -->  Z2SS   DN                 
      2.97626393E-04    2      1000025         1                       # DNL    -->  Z3SS   DN                 
      8.02898593E-03    2      1000035         1                       # DNL    -->  Z4SS   DN                 
      4.08711024E-02    2      1000021         1                       # DNL    -->  GLSS   DN                 
      6.09545350E-01    2     -1000024         2                       # DNL    -->  W1SS-  UP                 
      1.97507683E-02    2     -1000037         2                       # DNL    -->  W2SS-  UP                 
#         PDG         Width
DECAY   1000003  9.86688137E+00   # STL   decays
#          BR          NDA       ID1       ID2       ID3       ID4
      1.81957651E-02    2      1000022         3                       # STL    -->  Z1SS   ST                 
      3.03311437E-01    2      1000023         3                       # STL    -->  Z2SS   ST                 
      2.97627383E-04    2      1000025         3                       # STL    -->  Z3SS   ST                 
      8.02901294E-03    2      1000035         3                       # STL    -->  Z4SS   ST                 
      4.08713482E-02    2      1000021         3                       # STL    -->  GLSS   ST                 
      6.09544218E-01    2     -1000024         4                       # STL    -->  W1SS-  CH                 
      1.97505970E-02    2     -1000037         4                       # STL    -->  W2SS-  CH                 
#         PDG         Width
DECAY   1000004  9.91304207E+00   # CHL   decays
#          BR          NDA       ID1       ID2       ID3       ID4
      7.82906637E-03    2      1000022         4                       # CHL    -->  Z1SS   CH                 
      3.14289838E-01    2      1000023         4                       # CHL    -->  Z2SS   CH                 
      1.79081791E-04    2      1000025         4                       # CHL    -->  Z3SS   CH                 
      5.99743193E-03    2      1000035         4                       # CHL    -->  Z4SS   CH                 
      3.51898707E-02    2      1000021         4                       # CHL    -->  GLSS   CH                 
      6.26531780E-01    2      1000024         3                       # CHL    -->  W1SS+  ST                 
      9.98293888E-03    2      1000037         3                       # CHL    -->  W2SS+  ST                 
#         PDG         Width
DECAY   1000005  1.25388393E+01   # BT1   decays
#          BR          NDA       ID1       ID2       ID3       ID4
      1.28312055E-02    2      1000022         5                       # BT1    -->  Z1SS   BT                 
      2.02206105E-01    2      1000023         5                       # BT1    -->  Z2SS   BT                 
      4.45425365E-04    2      1000025         5                       # BT1    -->  Z3SS   BT                 
      3.98111250E-03    2      1000035         5                       # BT1    -->  Z4SS   BT                 
      3.56710255E-01    2     -1000024         6                       # BT1    -->  W1SS-  TP                 
      1.93532258E-01    2     -1000037         6                       # BT1    -->  W2SS-  TP                 
      2.30293646E-01    2          -24   1000006                       # BT1    -->  W-     TP1                
#         PDG         Width
DECAY   1000006  3.08229136E+00   # TP1   decays
#          BR          NDA       ID1       ID2       ID3       ID4
      3.26552868E-01    2      1000022         6                       # TP1    -->  Z1SS   TP                 
      1.66759834E-01    2      1000023         6                       # TP1    -->  Z2SS   TP                 
      4.59667325E-01    2      1000024         5                       # TP1    -->  W1SS+  BT                 
      4.70199771E-02    2      1000037         5                       # TP1    -->  W2SS+  BT                 
#         PDG         Width
DECAY   2000002  1.99138010E+00   # UPR   decays
#          BR          NDA       ID1       ID2       ID3       ID4
      9.63092864E-01    2      1000022         2                       # UPR    -->  Z1SS   UP                 
      2.94253184E-03    2      1000023         2                       # UPR    -->  Z2SS   UP                 
      2.54887913E-04    2      1000025         2                       # UPR    -->  Z3SS   UP                 
      2.36603012E-03    2      1000035         2                       # UPR    -->  Z4SS   UP                 
      3.13436911E-02    2      1000021         2                       # UPR    -->  GLSS   UP                 
#         PDG         Width
DECAY   2000001  5.29675007E-01   # DNR   decays
#          BR          NDA       ID1       ID2       ID3       ID4
      9.03186202E-01    2      1000022         1                       # DNR    -->  Z1SS   DN                 
      2.75773718E-03    2      1000023         1                       # DNR    -->  Z2SS   DN                 
      2.37758388E-04    2      1000025         1                       # DNR    -->  Z3SS   DN                 
      2.20553833E-03    2      1000035         1                       # DNR    -->  Z4SS   DN                 
      9.16127115E-02    2      1000021         1                       # DNR    -->  GLSS   DN                 
#         PDG         Width
DECAY   2000003  5.29675007E-01   # STR   decays
#          BR          NDA       ID1       ID2       ID3       ID4
      9.03186202E-01    2      1000022         3                       # STR    -->  Z1SS   ST                 
      2.75773718E-03    2      1000023         3                       # STR    -->  Z2SS   ST                 
      2.37758388E-04    2      1000025         3                       # STR    -->  Z3SS   ST                 
      2.20553833E-03    2      1000035         3                       # STR    -->  Z4SS   ST                 
      9.16127115E-02    2      1000021         3                       # STR    -->  GLSS   ST                 
#         PDG         Width
DECAY   2000004  1.99113274E+00   # CHR   decays
#          BR          NDA       ID1       ID2       ID3       ID4
      9.63209331E-01    2      1000022         4                       # CHR    -->  Z1SS   CH                 
      2.94288644E-03    2      1000023         4                       # CHR    -->  Z2SS   CH                 
      2.54917541E-04    2      1000025         4                       # CHR    -->  Z3SS   CH                 
      2.36630277E-03    2      1000035         4                       # CHR    -->  Z4SS   CH                 
      3.12265623E-02    2      1000021         4                       # CHR    -->  GLSS   CH                 
#         PDG         Width
DECAY   2000005  5.83621144E-01   # BT2   decays
#          BR          NDA       ID1       ID2       ID3       ID4
      8.12559187E-01    2      1000022         5                       # BT2    -->  Z1SS   BT                 
      9.17195156E-03    2      1000023         5                       # BT2    -->  Z2SS   BT                 
      1.12105133E-02    2      1000025         5                       # BT2    -->  Z3SS   BT                 
      1.49932122E-02    2      1000035         5                       # BT2    -->  Z4SS   BT                 
      4.46700454E-02    2      1000021         5                       # BT2    -->  GLSS   BT                 
      1.22865373E-02    2     -1000024         6                       # BT2    -->  W1SS-  TP                 
      5.51424660E-02    2     -1000037         6                       # BT2    -->  W2SS-  TP                 
      3.99660990E-02    2          -24   1000006                       # BT2    -->  W-     TP1                
#         PDG         Width
DECAY   2000006  1.36899166E+01   # TP2   decays
#          BR          NDA       ID1       ID2       ID3       ID4
      2.72034913E-01    2      1000024         5                       # TP2    -->  W1SS+  BT                 
      7.90031329E-02    2      1000037         5                       # TP2    -->  W2SS+  BT                 
      1.58637881E-01    2           23   1000006                       # TP2    -->  Z0     TP1                
      1.06396437E-01    2           25   1000006                       # TP2    -->  HL0    TP1                
      1.53916813E-02    2      1000022         6                       # TP2    -->  Z1SS   TP                 
      1.25147417E-01    2      1000023         6                       # TP2    -->  Z2SS   TP                 
      7.46084973E-02    2      1000025         6                       # TP2    -->  Z3SS   TP                 
      1.68780059E-01    2      1000035         6                       # TP2    -->  Z4SS   TP                 
#         PDG         Width
DECAY   1000011  3.97932434E+00   # EL-   decays
#          BR          NDA       ID1       ID2       ID3       ID4
      1.26545280E-01    2      1000022        11                       # EL-    -->  Z1SS   E-                 
      3.07383060E-01    2      1000023        11                       # EL-    -->  Z2SS   E-                 
      5.66071630E-01    2     -1000024        12                       # EL-    -->  W1SS-  NUE                
      3.89605882E-12    3      1000015        11       -15             # EL-    -->  TAU1-  E-     TAU+        
      3.41568267E-12    3     -1000015        11        15             # EL-    -->  TAU1+  E-     TAU-        
#         PDG         Width
DECAY   1000013  3.97932434E+00   # MUL-  decays
#          BR          NDA       ID1       ID2       ID3       ID4
      1.26545265E-01    2      1000022        13                       # MUL-   -->  Z1SS   MU-                
      3.07383060E-01    2      1000023        13                       # MUL-   -->  Z2SS   MU-                
      5.66071689E-01    2     -1000024        14                       # MUL-   -->  W1SS-  NUM                
      3.89605926E-12    3      1000015        13       -15             # MUL-   -->  TAU1-  MU-    TAU+        
      3.41568288E-12    3     -1000015        13        15             # MUL-   -->  TAU1+  MU-    TAU-        
#         PDG         Width
DECAY   1000015  2.10066724E+00   # TAU1- decays
#          BR          NDA       ID1       ID2       ID3       ID4
      9.86343861E-01    2      1000022        15                       # TAU1-  -->  Z1SS   TAU-               
      6.00197958E-03    2      1000023        15                       # TAU1-  -->  Z2SS   TAU-               
      7.65414583E-03    2     -1000024        16                       # TAU1-  -->  W1SS-  NUT                
#         PDG         Width
DECAY   1000012  3.97409320E+00   # NUEL  decays
#          BR          NDA       ID1       ID2       ID3       ID4
      1.64538667E-01    2      1000022        12                       # NUEL   -->  Z1SS   NUE                
      2.62422383E-01    2      1000023        12                       # NUEL   -->  Z2SS   NUE                
      5.73038936E-01    2      1000024        11                       # NUEL   -->  W1SS+  E-                 
      4.11144426E-12    3      1000015        12       -15             # NUEL   -->  TAU1-  NUE    TAU+        
      3.72511570E-12    3     -1000015        12        15             # NUEL   -->  TAU1+  NUE    TAU-        
      1.54081652E-12    3     -1000015        11        16             # NUEL   -->  TAU1+  E-     NUT         
#         PDG         Width
DECAY   1000014  3.97409272E+00   # NUML  decays
#          BR          NDA       ID1       ID2       ID3       ID4
      1.64538682E-01    2      1000022        14                       # NUML   -->  Z1SS   NUM                
      2.62422413E-01    2      1000023        14                       # NUML   -->  Z2SS   NUM                
      5.73038876E-01    2      1000024        13                       # NUML   -->  W1SS+  MU-                
      4.11144469E-12    3      1000015        14       -15             # NUML   -->  TAU1-  NUM    TAU+        
      3.72511614E-12    3     -1000015        14        15             # NUML   -->  TAU1+  NUM    TAU-        
      1.54094164E-12    3     -1000015        13        16             # NUML   -->  TAU1+  MU-    NUT         
#         PDG         Width
DECAY   1000016  3.96491742E+00   # NUTL  decays
#          BR          NDA       ID1       ID2       ID3       ID4
      1.64700314E-01    2      1000022        16                       # NUTL   -->  Z1SS   NUT                
      2.62369126E-01    2      1000023        16                       # NUTL   -->  Z2SS   NUT                
      5.72930336E-01    2      1000024        15                       # NUTL   -->  W1SS+  TAU-               
      3.83915469E-12    3     -1000015        16        15             # NUTL   -->  TAU1+  NUT    TAU-        
      2.80394268E-08    3      1000015        16       -15             # NUTL   -->  TAU1-  NUT    TAU+        
      2.80359824E-08    3      1000015        12       -11             # NUTL   -->  TAU1-  NUE    E+          
      2.80359824E-08    3      1000015        14       -13             # NUTL   -->  TAU1-  NUM    MU+         
      8.41079455E-08    3      1000015         2        -1             # NUTL   -->  TAU1-  UP     DB          
      8.41079455E-08    3      1000015         4        -3             # NUTL   -->  TAU1-  CH     SB          
#         PDG         Width
DECAY   2000011  2.08798480E+00   # ER-   decays
#          BR          NDA       ID1       ID2       ID3       ID4
      9.98014629E-01    2      1000022        11                       # ER-    -->  Z1SS   E-                 
      1.98539929E-03    2      1000023        11                       # ER-    -->  Z2SS   E-                 
      4.24207746E-31    3      1000015        12       -16             # ER-    -->  TAU1-  NUE    ANUT        
#         PDG         Width
DECAY   2000013  2.08798432E+00   # MUR-  decays
#          BR          NDA       ID1       ID2       ID3       ID4
      9.98014629E-01    2      1000022        13                       # MUR-   -->  Z1SS   MU-                
      1.98539952E-03    2      1000023        13                       # MUR-   -->  Z2SS   MU-                
      1.80659008E-26    3      1000015        14       -16             # MUR-   -->  TAU1-  NUM    ANUT        
#         PDG         Width
DECAY   2000015  3.95698500E+00   # TAU2- decays
#          BR          NDA       ID1       ID2       ID3       ID4
      1.29820466E-01    2      1000022        15                       # TAU2-  -->  Z1SS   TAU-               
      3.06282371E-01    2      1000023        15                       # TAU2-  -->  Z2SS   TAU-               
      5.63897192E-01    2     -1000024        16                       # TAU2-  -->  W1SS-  NUT                
#         PDG         Width
DECAY   1000023  1.87652390E-02   # Z2SS  decays
#          BR          NDA       ID1       ID2       ID3       ID4
      1.37544376E-08    2      1000022        22                       # Z2SS   -->  Z1SS   GM                 
      1.87802147E-02    2      1000022        23                       # Z2SS   -->  Z1SS   Z0                 
      7.85088332E-07    3      1000022         2        -2             # Z2SS   -->  Z1SS   UP     UB          
      1.62253104E-06    3      1000022         1        -1             # Z2SS   -->  Z1SS   DN     DB          
      1.62253025E-06    3      1000022         3        -3             # Z2SS   -->  Z1SS   ST     SB          
      7.85084524E-07    3      1000022         4        -4             # Z2SS   -->  Z1SS   CH     CB          
      2.61531204E-06    3      1000022         5        -5             # Z2SS   -->  Z1SS   BT     BB          
      3.65510714E-05    3      1000022        11       -11             # Z2SS   -->  Z1SS   E-     E+          
      3.65510714E-05    3      1000022        13       -13             # Z2SS   -->  Z1SS   MU-    MU+         
      3.68289293E-05    3      1000022        15       -15             # Z2SS   -->  Z1SS   TAU-   TAU+        
      4.29843276E-05    3      1000022        12       -12             # Z2SS   -->  Z1SS   NUE    ANUE        
      4.29843276E-05    3      1000022        14       -14             # Z2SS   -->  Z1SS   NUM    ANUM        
      4.31907320E-05    3      1000022        16       -16             # Z2SS   -->  Z1SS   NUT    ANUT        
      9.80973244E-01    2      1000022        25                       # Z2SS   -->  Z1SS   HL0                
#         PDG         Width
DECAY   1000025  4.52148962E+00   # Z3SS  decays
#          BR          NDA       ID1       ID2       ID3       ID4
      1.56275604E-07    2      1000022        22                       # Z3SS   -->  Z1SS   GM                 
      2.57057110E-07    2      1000023        22                       # Z3SS   -->  Z2SS   GM                 
      3.05764556E-01    2      1000024       -24                       # Z3SS   -->  W1SS+  W-                 
      3.05764556E-01    2     -1000024        24                       # Z3SS   -->  W1SS-  W+                 
      1.00656107E-01    2      1000022        23                       # Z3SS   -->  Z1SS   Z0                 
      2.70697892E-01    2      1000023        23                       # Z3SS   -->  Z2SS   Z0                 
      4.42193349E-09    3      1000022         2        -2             # Z3SS   -->  Z1SS   UP     UB          
      1.90464755E-09    3      1000022         1        -1             # Z3SS   -->  Z1SS   DN     DB          
      1.90464688E-09    3      1000022         3        -3             # Z3SS   -->  Z1SS   ST     SB          
      4.42190551E-09    3      1000022         4        -4             # Z3SS   -->  Z1SS   CH     CB          
      7.88605519E-08    3      1000022         5        -5             # Z3SS   -->  Z1SS   BT     BB          
      4.87216090E-09    3      1000022        15       -15             # Z3SS   -->  Z1SS   TAU-   TAU+        
      5.55240298E-09    3      1000023         2        -2             # Z3SS   -->  Z2SS   UP     UB          
      8.53896154E-09    3      1000023         1        -1             # Z3SS   -->  Z2SS   DN     DB          
      8.53895799E-09    3      1000023         3        -3             # Z3SS   -->  Z2SS   ST     SB          
      5.55236968E-09    3      1000023         4        -4             # Z3SS   -->  Z2SS   CH     CB          
      1.19352322E-07    3      1000023         5        -5             # Z3SS   -->  Z2SS   BT     BB          
      2.43671550E-09    3      1000023        15       -15             # Z3SS   -->  Z2SS   TAU-   TAU+        
      8.67741648E-03    2      1000022        25                       # Z3SS   -->  Z1SS   HL0                
      8.13520513E-03    2      1000023        25                       # Z3SS   -->  Z2SS   HL0                
      2.68670851E-06    2      1000011       -11                       # Z3SS   -->  EL-    E+                 
      2.68670851E-06    2     -1000011        11                       # Z3SS   -->  EL+    E-                 
      2.68669874E-06    2      1000013       -13                       # Z3SS   -->  MUL-   MU+                
      2.68669874E-06    2     -1000013        13                       # Z3SS   -->  MUL+   MU-                
      1.48346826E-05    2      2000011       -11                       # Z3SS   -->  ER-    E+                 
      1.48346826E-05    2     -2000011        11                       # Z3SS   -->  ER+    E-                 
      1.48346717E-05    2      2000013       -13                       # Z3SS   -->  MUR-   MU+                
      1.48346717E-05    2     -2000013        13                       # Z3SS   -->  MUR+   MU-                
      5.16532600E-05    2      1000015       -15                       # Z3SS   -->  TAU1-  TAU+               
      5.16532600E-05    2     -1000015        15                       # Z3SS   -->  TAU1+  TAU-               
      1.57342511E-05    2      2000015       -15                       # Z3SS   -->  TAU2-  TAU+               
      1.57342511E-05    2     -2000015        15                       # Z3SS   -->  TAU2+  TAU-               
      1.63372461E-05    2      1000012       -12                       # Z3SS   -->  NUEL   ANUE               
      1.63372461E-05    2     -1000012        12                       # Z3SS   -->  ANUEL  NUE                
      1.63372461E-05    2      1000014       -14                       # Z3SS   -->  NUML   ANUM               
      1.63372461E-05    2     -1000014        14                       # Z3SS   -->  ANUML  NUM                
      1.67271101E-05    2      1000016       -16                       # Z3SS   -->  NUTL   ANUT               
      1.67271101E-05    2     -1000016        16                       # Z3SS   -->  ANUTL  NUT                
#         PDG         Width
DECAY   1000035  4.70743656E+00   # Z4SS  decays
#          BR          NDA       ID1       ID2       ID3       ID4
      7.02806915E-07    2      1000022        22                       # Z4SS   -->  Z1SS   GM                 
      1.71895607E-07    2      1000023        22                       # Z4SS   -->  Z2SS   GM                 
      9.32349864E-10    2      1000025        22                       # Z4SS   -->  Z3SS   GM                 
      3.17359239E-01    2      1000024       -24                       # Z4SS   -->  W1SS+  W-                 
      3.17359239E-01    2     -1000024        24                       # Z4SS   -->  W1SS-  W+                 
      1.86488550E-11    3     -1000037         2        -1             # Z4SS   -->  W2SS-  UP     DB          
      6.21628487E-12    3     -1000037        12       -11             # Z4SS   -->  W2SS-  NUE    E+          
      6.21628487E-12    3     -1000037        14       -13             # Z4SS   -->  W2SS-  NUM    MU+         
      1.86488550E-11    3      1000037         1        -2             # Z4SS   -->  W2SS+  DN     UB          
      6.21628487E-12    3      1000037        11       -12             # Z4SS   -->  W2SS+  E-     ANUE        
      6.21628487E-12    3      1000037        13       -14             # Z4SS   -->  W2SS+  MU-    ANUM        
      1.86488550E-11    3     -1000037         4        -3             # Z4SS   -->  W2SS-  CH     SB          
      6.21628487E-12    3     -1000037        16       -15             # Z4SS   -->  W2SS-  NUT    TAU+        
      1.86488550E-11    3      1000037         3        -4             # Z4SS   -->  W2SS+  ST     CB          
      6.21628487E-12    3      1000037        15       -16             # Z4SS   -->  W2SS+  TAU-   ANUT        
      9.03634913E-03    2      1000022        23                       # Z4SS   -->  Z1SS   Z0                 
      9.38905962E-03    2      1000023        23                       # Z4SS   -->  Z2SS   Z0                 
      1.29204494E-07    3      1000022         2        -2             # Z4SS   -->  Z1SS   UP     UB          
      1.16546666E-07    3      1000022         1        -1             # Z4SS   -->  Z1SS   DN     DB          
      1.16546630E-07    3      1000022         3        -3             # Z4SS   -->  Z1SS   ST     SB          
      1.29203727E-07    3      1000022         4        -4             # Z4SS   -->  Z1SS   CH     CB          
      2.72831358E-07    3      1000022         5        -5             # Z4SS   -->  Z1SS   BT     BB          
      4.82856599E-09    3      1000022        15       -15             # Z4SS   -->  Z1SS   TAU-   TAU+        
      6.59333921E-07    3      1000023         2        -2             # Z4SS   -->  Z2SS   UP     UB          
      8.16602324E-07    3      1000023         1        -1             # Z4SS   -->  Z2SS   DN     DB          
      8.16602039E-07    3      1000023         3        -3             # Z4SS   -->  Z2SS   ST     SB          
      6.59329942E-07    3      1000023         4        -4             # Z4SS   -->  Z2SS   CH     CB          
      1.62454523E-06    3      1000023         5        -5             # Z4SS   -->  Z2SS   BT     BB          
      2.45592302E-09    3      1000023        15       -15             # Z4SS   -->  Z2SS   TAU-   TAU+        
      6.75839615E-08    3      1000025         2        -2             # Z4SS   -->  Z3SS   UP     UB          
      8.71980390E-08    3      1000025         1        -1             # Z4SS   -->  Z3SS   DN     DB          
      8.71980390E-08    3      1000025         3        -3             # Z4SS   -->  Z3SS   ST     SB          
      6.75839615E-08    3      1000025         4        -4             # Z4SS   -->  Z3SS   CH     CB          
      4.08890415E-08    3      1000025         5        -5             # Z4SS   -->  Z3SS   BT     BB          
      1.97746992E-08    3      1000025        11       -11             # Z4SS   -->  Z3SS   E-     E+          
      1.97746992E-08    3      1000025        13       -13             # Z4SS   -->  Z3SS   MU-    MU+         
      1.76388664E-08    3      1000025        15       -15             # Z4SS   -->  Z3SS   TAU-   TAU+        
      3.93454336E-08    3      1000025        12       -12             # Z4SS   -->  Z3SS   NUE    ANUE        
      3.93454336E-08    3      1000025        14       -14             # Z4SS   -->  Z3SS   NUM    ANUM        
      3.93454336E-08    3      1000025        16       -16             # Z4SS   -->  Z3SS   NUT    ANUT        
      8.94161239E-02    2      1000022        25                       # Z4SS   -->  Z1SS   HL0                
      2.49659732E-01    2      1000023        25                       # Z4SS   -->  Z2SS   HL0                
      2.84361449E-04    2      1000011       -11                       # Z4SS   -->  EL-    E+                 
      2.84361449E-04    2     -1000011        11                       # Z4SS   -->  EL+    E-                 
      2.84361042E-04    2      1000013       -13                       # Z4SS   -->  MUL-   MU+                
      2.84361042E-04    2     -1000013        13                       # Z4SS   -->  MUL+   MU-                
      2.11981969E-04    2      2000011       -11                       # Z4SS   -->  ER-    E+                 
      2.11981969E-04    2     -2000011        11                       # Z4SS   -->  ER+    E-                 
      2.11981867E-04    2      2000013       -13                       # Z4SS   -->  MUR-   MU+                
      2.11981867E-04    2     -2000013        13                       # Z4SS   -->  MUR+   MU-                
      2.19554713E-04    2      1000015       -15                       # Z4SS   -->  TAU1-  TAU+               
      2.19554713E-04    2     -1000015        15                       # Z4SS   -->  TAU1+  TAU-               
      3.17499449E-04    2      2000015       -15                       # Z4SS   -->  TAU2-  TAU+               
      3.17499449E-04    2     -2000015        15                       # Z4SS   -->  TAU2+  TAU-               
      7.81469105E-04    2      1000012       -12                       # Z4SS   -->  NUEL   ANUE               
      7.81469105E-04    2     -1000012        12                       # Z4SS   -->  ANUEL  NUE                
      7.81469105E-04    2      1000014       -14                       # Z4SS   -->  NUML   ANUM               
      7.81469105E-04    2     -1000014        14                       # Z4SS   -->  ANUML  NUM                
      7.94088875E-04    2      1000016       -16                       # Z4SS   -->  NUTL   ANUT               
      7.94088875E-04    2     -1000016        16                       # Z4SS   -->  ANUTL  NUT                
#         PDG         Width
DECAY   1000024  1.32686226E-02   # W1SS+ decays
#          BR          NDA       ID1       ID2       ID3       ID4
      3.24890721E-06    3      1000022         2        -1             # W1SS+  -->  Z1SS   UP     DB          
      3.24890107E-06    3      1000022         4        -3             # W1SS+  -->  Z1SS   CH     SB          
      1.11048801E-04    3      1000022       -11        12             # W1SS+  -->  Z1SS   E+     NUE         
      1.11048801E-04    3      1000022       -13        14             # W1SS+  -->  Z1SS   MU+    NUM         
      1.11840869E-04    3      1000022       -15        16             # W1SS+  -->  Z1SS   TAU+   NUT         
      9.99659598E-01    2      1000022        24                       # W1SS+  -->  Z1SS   W+                 
#         PDG         Width
DECAY   1000037  4.75527191E+00   # W2SS+ decays
#          BR          NDA       ID1       ID2       ID3       ID4
      1.49857897E-07    3      1000022         2        -1             # W2SS+  -->  Z1SS   UP     DB          
      1.49857669E-07    3      1000022         4        -3             # W2SS+  -->  Z1SS   CH     SB          
      3.42130702E-09    3      1000022       -15        16             # W2SS+  -->  Z1SS   TAU+   NUT         
      7.31990188E-02    2      1000022        24                       # W2SS+  -->  Z1SS   W+                 
      6.12393194E-07    3      1000023         2        -1             # W2SS+  -->  Z2SS   UP     DB          
      6.12392057E-07    3      1000023         4        -3             # W2SS+  -->  Z2SS   CH     SB          
      3.81195342E-09    3      1000023       -15        16             # W2SS+  -->  Z2SS   TAU+   NUT         
      3.35672468E-01    2      1000023        24                       # W2SS+  -->  Z2SS   W+                 
      1.05255943E-07    3      1000025         2        -1             # W2SS+  -->  Z3SS   UP     DB          
      1.05255943E-07    3      1000025         4        -3             # W2SS+  -->  Z3SS   CH     SB          
      3.50828842E-08    3      1000025       -11        12             # W2SS+  -->  Z3SS   E+     NUE         
      3.50828842E-08    3      1000025       -13        14             # W2SS+  -->  Z3SS   MU+    NUM         
      3.50828806E-08    3      1000025       -15        16             # W2SS+  -->  Z3SS   TAU+   NUT         
      6.97012525E-04    2      1000012       -11                       # W2SS+  -->  NUEL   E+                 
      6.97011594E-04    2      1000014       -13                       # W2SS+  -->  NUML   MU+                
      7.42186443E-04    2      1000016       -15                       # W2SS+  -->  NUTL   TAU+               
      1.12865644E-03    2     -1000011        12                       # W2SS+  -->  EL+    NUE                
      1.12865644E-03    2     -1000013        14                       # W2SS+  -->  MUL+   NUM                
      3.23374807E-05    2     -1000015        16                       # W2SS+  -->  TAU1+  NUT                
      1.16111897E-03    2     -2000015        16                       # W2SS+  -->  TAU2+  NUT                
      3.10218364E-01    2      1000024        23                       # W2SS+  -->  W1SS+  Z0                 
      7.21843207E-07    3      1000024         1        -1             # W2SS+  -->  W1SS+  DN     DB          
      7.21838944E-07    3      1000024         3        -3             # W2SS+  -->  W1SS+  ST     SB          
      1.33223296E-06    3      1000024         2        -2             # W2SS+  -->  W1SS+  UP     UB          
      1.33223239E-06    3      1000024         4        -4             # W2SS+  -->  W1SS+  CH     CB          
      2.75317162E-01    2      1000024        25                       # W2SS+  -->  W1SS+  HL0                
#         PDG         Width
DECAY        25  3.52072576E-03   # HL0   decays
#          BR          NDA       ID1       ID2       ID3       ID4
      5.07749442E-09    2           11       -11                       # HL0    -->  E-     E+                 
      2.14379586E-04    2           13       -13                       # HL0    -->  MU-    MU+                
      6.12873286E-02    2           15       -15                       # HL0    -->  TAU-   TAU+               
      6.38578149E-06    2            1        -1                       # HL0    -->  DN     DB                 
      2.58017471E-03    2            3        -3                       # HL0    -->  ST     SB                 
      8.61828208E-01    2            5        -5                       # HL0    -->  BT     BB                 
      1.94640779E-06    2            2        -2                       # HL0    -->  UP     UB                 
      3.74028273E-02    2            4        -4                       # HL0    -->  CH     CB                 
      1.31331047E-03    2           22        22                       # HL0    -->  GM     GM                 
      3.03653814E-02    2           21        21                       # HL0    -->  GL     GL                 
      2.77781277E-04    3           24        11       -12             # HL0    -->  W+     E-     ANUE        
      2.77781277E-04    3           24        13       -14             # HL0    -->  W+     MU-    ANUM        
      2.77781277E-04    3           24        15       -16             # HL0    -->  W+     TAU-   ANUT        
      8.33343831E-04    3           24        -2         1             # HL0    -->  W+     UB     DN          
      8.33343831E-04    3           24        -4         3             # HL0    -->  W+     CB     ST          
      2.77781277E-04    3          -24       -11        12             # HL0    -->  W-     E+     NUE         
      2.77781277E-04    3          -24       -13        14             # HL0    -->  W-     MU+    NUM         
      2.77781277E-04    3          -24       -15        16             # HL0    -->  W-     TAU+   NUT         
      8.33343831E-04    3          -24         2        -1             # HL0    -->  W-     UP     DB          
      8.33343831E-04    3          -24         4        -3             # HL0    -->  W-     CH     SB          
#         PDG         Width
DECAY        35  4.65610313E+00   # HH0   decays
#          BR          NDA       ID1       ID2       ID3       ID4
      2.75212381E-10    2           11       -11                       # HH0    -->  E-     E+                 
      1.16199626E-05    2           13       -13                       # HH0    -->  MU-    MU+                
      3.32804699E-03    2           15       -15                       # HH0    -->  TAU-   TAU+               
      3.37644678E-07    2            1        -1                       # HH0    -->  DN     DB                 
      1.36425544E-04    2            3        -3                       # HH0    -->  ST     SB                 
      1.96415242E-02    2            5        -5                       # HH0    -->  BT     BB                 
      1.40012446E-09    2            2        -2                       # HH0    -->  UP     UB                 
      2.01418843E-05    2            4        -4                       # HH0    -->  CH     CB                 
      8.54842961E-01    2            6        -6                       # HH0    -->  TP     TB                 
      7.61508363E-06    2           22        22                       # HH0    -->  GM     GM                 
      7.32315006E-04    2           21        21                       # HH0    -->  GL     GL                 
      2.13584886E-03    2           24       -24                       # HH0    -->  W+     W-                 
      1.07934256E-03    2           23        23                       # HH0    -->  Z0     Z0                 
      1.93858426E-03    2      1000022   1000022                       # HH0    -->  Z1SS   Z1SS               
      9.40138940E-03    2      1000022   1000023                       # HH0    -->  Z1SS   Z2SS               
      6.55556396E-02    2      1000022   1000025                       # HH0    -->  Z1SS   Z3SS               
      3.22372257E-03    2      1000022   1000035                       # HH0    -->  Z1SS   Z4SS               
      9.58231464E-03    2      1000023   1000023                       # HH0    -->  Z2SS   Z2SS               
      2.21495237E-02    2      1000024  -1000024                       # HH0    -->  W1SS+  W1SS-              
      6.21266942E-03    2           25        25                       # HH0    -->  HL0    HL0                
#         PDG         Width
DECAY        36  5.64328575E+00   # HA0   decays
#          BR          NDA       ID1       ID2       ID3       ID4
      2.26193314E-10    2           11       -11                       # HA0    -->  E-     E+                 
      9.55029009E-06    2           13       -13                       # HA0    -->  MU-    MU+                
      2.73532467E-03    2           15       -15                       # HA0    -->  TAU-   TAU+               
      2.77526624E-07    2            1        -1                       # HA0    -->  DN     DB                 
      1.12134803E-04    2            3        -3                       # HA0    -->  ST     SB                 
      1.61453821E-02    2            5        -5                       # HA0    -->  BT     BB                 
      1.09629006E-09    2            2        -2                       # HA0    -->  UP     UB                 
      1.57877948E-05    2            4        -4                       # HA0    -->  CH     CB                 
      7.84498692E-01    2            6        -6                       # HA0    -->  TP     TB                 
      1.78964149E-06    2           22        22                       # HA0    -->  GM     GM                 
      5.95210819E-04    2           21        21                       # HA0    -->  GL     GL                 
      3.84191726E-03    2      1000022   1000022                       # HA0    -->  Z1SS   Z1SS               
      2.44695861E-02    2      1000022   1000023                       # HA0    -->  Z1SS   Z2SS               
      4.01157700E-03    2      1000022   1000025                       # HA0    -->  Z1SS   Z3SS               
      3.78498584E-02    2      1000022   1000035                       # HA0    -->  Z1SS   Z4SS               
      3.76927033E-02    2      1000023   1000023                       # HA0    -->  Z2SS   Z2SS               
      8.63275975E-02    2      1000024  -1000024                       # HA0    -->  W1SS+  W1SS-              
      1.69262500E-03    2           25        23                       # HA0    -->  HL0    Z0                 
#         PDG         Width
DECAY        37  4.44651031E+00   # H+    decays
#          BR          NDA       ID1       ID2       ID3       ID4
      2.90236057E-10    2           12       -11                       # H+     -->  NUE    E+                 
      1.22542906E-05    2           14       -13                       # H+     -->  NUM    MU+                
      3.50978575E-03    2           16       -15                       # H+     -->  NUT    TAU+               
      3.28105443E-07    2            2        -1                       # H+     -->  UP     DB                 
      1.50615830E-04    2            4        -3                       # H+     -->  CH     SB                 
      9.13815737E-01    2            6        -5                       # H+     -->  TP     BB                 
      3.76977399E-02    2      1000024   1000022                       # H+     -->  W1SS+  Z1SS               
      1.48332110E-04    2      1000024   1000023                       # H+     -->  W1SS+  Z2SS               
      4.24520411E-02    2      1000037   1000022                       # H+     -->  W2SS+  Z1SS               
      2.21313117E-03    2           25        24                       # H+     -->  HL0    W+                 
