#  ISAJET SUSY parameters in SUSY Les Houches Accord 2 format
#  Created by ISALHA 2.0 Last revision: C. Balazs 21 Apr 2009
Block SPINFO   # Program information
     1   ISASUGRA from ISAJET          # Spectrum Calculator
     2   7.80   29-OCT-2009 12:50:36   # Version number
Block MODSEL   # Model selection
     1     1   # Minimal supergravity (mSUGRA) model               
Block SMINPUTS   # Standard Model inputs
     1     1.27837181E+02   # alpha_em^(-1)
     2     1.16570000E-05   # G_Fermi
     3     1.17200002E-01   # alpha_s(M_Z)
     4     9.11699982E+01   # m_{Z}(pole)
     5     4.19999981E+00   # m_{b}(m_{b})
     6     1.72500000E+02   # m_{top}(pole)
     7     1.77699995E+00   # m_{tau}(pole)
Block MINPAR   # SUSY breaking input parameters
     1     3.40000000E+02   # m_0
     2     6.90000000E+02   # m_{1/2}
     3     1.00000000E+01   # tan(beta)
     4     1.00000000E+00   # sign(mu)
     5     0.00000000E+00   # A_0
Block EXTPAR   # Non-universal SUSY breaking parameters
     0     1.59244073E+16   # Input scale
Block MASS   # Scalar and gaugino mass spectrum
#  PDG code   mass                 particle
        24     8.04229965E+01   #  W^+
        25     1.16019531E+02   #  h^0            
        35     1.00112451E+03   #  H^0            
        36     9.94438416E+02   #  A^0            
        37     1.00615771E+03   #  H^+            
   1000001     1.45617395E+03   #  dnl            
   1000002     1.45383777E+03   #  upl            
   1000003     1.45617395E+03   #  stl            
   1000004     1.45383838E+03   #  chl            
   1000005     1.33836499E+03   #  b1             
   1000006     1.10996582E+03   #  t1             
   1000011     5.75390259E+02   #  el-            
   1000012     5.67233765E+02   #  nuel           
   1000013     5.75390259E+02   #  mul-           
   1000014     5.67233765E+02   #  numl           
   1000015     4.21211334E+02   #  tau1           
   1000016     5.62521729E+02   #  nutl           
   1000021     1.55675073E+03   #  glss           
   1000022     2.88863312E+02   #  z1ss           
   1000023     5.44898193E+02   #  z2ss           
   1000024     5.45689880E+02   #  w1ss           
   1000025    -8.29243469E+02   #  z3ss           
   1000035     8.41830505E+02   #  z4ss           
   1000037     8.41594177E+02   #  w2ss           
   2000001     1.39674084E+03   #  dnr            
   2000002     1.40244177E+03   #  upr            
   2000003     1.39674084E+03   #  str            
   2000004     1.40244250E+03   #  chr            
   2000005     1.38863721E+03   #  b2             
   2000006     1.37197522E+03   #  t2             
   2000011     4.26022095E+02   #  er-            
   2000013     4.26022095E+02   #  mur-           
   2000015     5.72778137E+02   #  tau2           
Block ALPHA   # Effective Higgs mixing parameter
         -1.01545110E-01   # alpha
Block STOPMIX   # stop mixing matrix
  1  1     3.21907908E-01   # O_{11}
  1  2     9.46770966E-01   # O_{12}
  2  1    -9.46770966E-01   # O_{21}
  2  2     3.21907908E-01   # O_{22}
Block SBOTMIX   # sbottom mixing matrix
  1  1     9.83442485E-01   # O_{11}
  1  2     1.81220666E-01   # O_{12}
  2  1    -1.81220666E-01   # O_{21}
  2  2     9.83442485E-01   # O_{22}
Block STAUMIX   # stau mixing matrix
  1  1     9.84650925E-02   # O_{11}
  1  2     9.95140493E-01   # O_{12}
  2  1    -9.95140493E-01   # O_{21}
  2  2     9.84650925E-02   # O_{22}
Block NMIX   # neutralino mixing matrix
  1  1     9.97696757E-01   #
  1  2    -9.38433222E-03   #
  1  3     6.17830679E-02   #
  1  4    -2.63796449E-02   #
  2  1    -2.27531735E-02   #
  2  2    -9.78290319E-01   #
  2  3     1.67853773E-01   #
  2  4    -1.19396247E-01   #
  3  1     2.46333182E-02   #
  3  2    -3.52197811E-02   #
  3  3    -7.05274820E-01   #
  3  4    -7.07629740E-01   #
  4  1    -5.89627288E-02   #
  4  2     2.04008847E-01   #
  4  3     6.85999095E-01   #
  4  4    -6.95922852E-01   #
Block UMIX   # chargino U mixing matrix
  1  1    -9.71064627E-01   # U_{11}
  1  2     2.38816798E-01   # U_{12}
  2  1    -2.38816798E-01   # U_{21}
  2  2    -9.71064627E-01   # U_{22}
Block VMIX   # chargino V mixing matrix
  1  1    -9.85268891E-01   # V_{11}
  1  2     1.71012208E-01   # V_{12}
  2  1    -1.71012208E-01   # V_{21}
  2  2    -9.85268891E-01   # V_{22}
Block GAUGE Q=  1.18238110E+03   #
     1     3.57521206E-01   # g`
     2     6.52391374E-01   # g_2
     3     1.21947169E+00   # g_3
Block YU Q=  1.18238110E+03   #
  3  3     8.50088060E-01   # y_t
Block YD Q=  1.18238110E+03   #
  3  3     1.29746318E-01   # y_b
Block YE Q=  1.18238110E+03   #
  3  3     1.02310851E-01   # y_tau
Block HMIX Q=  1.18238110E+03   # Higgs mixing parameters
     1     8.23861084E+02   # mu(Q)
     2     1.00000000E+01   # tan(beta)(M_GUT)
     3     2.51071930E+02   # Higgs vev at Q
     4     9.88907750E+05   # m_A^2(Q)
Block MSOFT Q=  1.18238110E+03   # DRbar SUSY breaking parameters
     1     2.93835388E+02   # M_1(Q)          
     2     5.40837219E+02   # M_2(Q)          
     3     1.48393774E+03   # M_3(Q)          
    31     5.68954468E+02   # MeL(Q)          
    32     5.68954468E+02   # MmuL(Q)         
    33     5.64343018E+02   # MtauL(Q)        
    34     4.23671936E+02   # MeR(Q)          
    35     4.23671936E+02   # MmuR(Q)         
    36     4.17963623E+02   # MtauR(Q)        
    41     1.38192566E+03   # MqL1(Q)         
    42     1.38192566E+03   # MqL2(Q)         
    43     1.27860120E+03   # MqL3(Q)         
    44     1.33177649E+03   # MuR(Q)          
    45     1.33177649E+03   # McR(Q)          
    46     1.09340186E+03   # MtR(Q)          
    47     1.32558716E+03   # MdR(Q)          
    48     1.32558716E+03   # MsR(Q)          
    49     1.32626794E+03   # MbR(Q)          
Block AU Q=  1.18238110E+03   #
  1  1    -1.17780359E+03   # A_u
  2  2    -1.17780359E+03   # A_c
  3  3    -1.17780359E+03   # A_t
Block AD Q=  1.18238110E+03   #
  1  1    -1.72341687E+03   # A_d
  2  2    -1.72341687E+03   # A_s
  3  3    -1.72341687E+03   # A_b
Block AE Q=  1.18238110E+03   #
  1  1    -4.04194305E+02   # A_e
  2  2    -4.04194305E+02   # A_mu
  3  3    -4.04194305E+02   # A_tau
#  ISAJET decay tables in SUSY Les Houches accord format
#  Created by ISALHD. Last revision: C. Balazs, 2005 May 25
Block DCINFO                           # Program information
     1   ISASUGRA from ISAJET          # Spectrum Calculator
     2   7.80   29-OCT-2009 12:50:36   # Version number
#         PDG         Width
DECAY         6  1.14680779E+00   # TP    decays
#          BR          NDA       ID1       ID2       ID3       ID4
      3.33333343E-01    3            2        -1         5             # TP     -->  UP     DB     BT          
      3.33333343E-01    3            4        -3         5             # TP     -->  CH     SB     BT          
      1.11111112E-01    3          -11        12         5             # TP     -->  E+     NUE    BT          
      1.11111112E-01    3          -13        14         5             # TP     -->  MU+    NUM    BT          
      1.11111112E-01    3          -15        16         5             # TP     -->  TAU+   NUT    BT          
#         PDG         Width
DECAY   1000021  1.77343369E+01   # GLSS  decays
#          BR          NDA       ID1       ID2       ID3       ID4
      1.58012025E-02    2     -1000002         2                       # GLSS   -->  UBL    UP                 
      1.58012025E-02    2      1000002        -2                       # GLSS   -->  UPL    UB                 
      1.51153905E-02    2     -1000001         1                       # GLSS   -->  DBL    DN                 
      1.51153905E-02    2      1000001        -1                       # GLSS   -->  DNL    DB                 
      3.43222581E-02    2     -2000002         2                       # GLSS   -->  UBR    UP                 
      3.43222581E-02    2      2000002        -2                       # GLSS   -->  UPR    UB                 
      3.67630981E-02    2     -2000001         1                       # GLSS   -->  DBR    DN                 
      3.67630981E-02    2      2000001        -1                       # GLSS   -->  DNR    DB                 
      1.51153617E-02    2     -1000003         3                       # GLSS   -->  SBL    ST                 
      1.51153617E-02    2      1000003        -3                       # GLSS   -->  STL    SB                 
      3.67630720E-02    2     -2000003         3                       # GLSS   -->  SBR    ST                 
      3.67630720E-02    2      2000003        -3                       # GLSS   -->  STR    SB                 
      1.57997347E-02    2     -1000004         4                       # GLSS   -->  CBL    CH                 
      1.57997347E-02    2      1000004        -4                       # GLSS   -->  CHL    CB                 
      3.43207419E-02    2     -2000004         4                       # GLSS   -->  CBR    CH                 
      3.43207419E-02    2      2000004        -4                       # GLSS   -->  CHR    CB                 
      6.52081668E-02    2     -1000005         5                       # GLSS   -->  BB1    BT                 
      6.52081668E-02    2      1000005        -5                       # GLSS   -->  BT1    BB                 
      4.07949351E-02    2     -2000005         5                       # GLSS   -->  BB2    BT                 
      4.07949351E-02    2      2000005        -5                       # GLSS   -->  BT2    BB                 
      1.61367044E-01    2     -1000006         6                       # GLSS   -->  TB1    TP                 
      1.61367044E-01    2      1000006        -6                       # GLSS   -->  TP1    TB                 
      2.86290850E-02    2     -2000006         6                       # GLSS   -->  TB2    TP                 
      2.86290850E-02    2      2000006        -6                       # GLSS   -->  TP2    TB                 
#         PDG         Width
DECAY   1000002  1.35648975E+01   # UPL   decays
#          BR          NDA       ID1       ID2       ID3       ID4
      1.25149190E-02    2      1000022         2                       # UPL    -->  Z1SS   UP                 
      3.21704656E-01    2      1000023         2                       # UPL    -->  Z2SS   UP                 
      1.93622240E-04    2      1000025         2                       # UPL    -->  Z3SS   UP                 
      7.44084828E-03    2      1000035         2                       # UPL    -->  Z4SS   UP                 
      6.46480262E-01    2      1000024         1                       # UPL    -->  W1SS+  DN                 
      1.16656581E-02    2      1000037         1                       # UPL    -->  W2SS+  DN                 
#         PDG         Width
DECAY   1000001  1.34913969E+01   # DNL   decays
#          BR          NDA       ID1       ID2       ID3       ID4
      1.54833915E-02    2      1000022         1                       # DNL    -->  Z1SS   DN                 
      3.18835795E-01    2      1000023         1                       # DNL    -->  Z2SS   DN                 
      3.27478745E-04    2      1000025         1                       # DNL    -->  Z3SS   DN                 
      9.29294806E-03    2      1000035         1                       # DNL    -->  Z4SS   DN                 
      6.33075356E-01    2     -1000024         2                       # DNL    -->  W1SS-  UP                 
      2.29849778E-02    2     -1000037         2                       # DNL    -->  W2SS-  UP                 
#         PDG         Width
DECAY   1000003  1.34913769E+01   # STL   decays
#          BR          NDA       ID1       ID2       ID3       ID4
      1.54834148E-02    2      1000022         3                       # STL    -->  Z1SS   ST                 
      3.18836272E-01    2      1000023         3                       # STL    -->  Z2SS   ST                 
      3.27479240E-04    2      1000025         3                       # STL    -->  Z3SS   ST                 
      9.29296203E-03    2      1000035         3                       # STL    -->  Z4SS   ST                 
      6.33074880E-01    2     -1000024         4                       # STL    -->  W1SS-  CH                 
      2.29849257E-02    2     -1000037         4                       # STL    -->  W2SS-  CH                 
#         PDG         Width
DECAY   1000004  1.35648966E+01   # CHL   decays
#          BR          NDA       ID1       ID2       ID3       ID4
      1.25149041E-02    2      1000022         4                       # CHL    -->  Z1SS   CH                 
      3.21704209E-01    2      1000023         4                       # CHL    -->  Z2SS   CH                 
      1.93621760E-04    2      1000025         4                       # CHL    -->  Z3SS   CH                 
      7.44083012E-03    2      1000035         4                       # CHL    -->  Z4SS   CH                 
      6.46480739E-01    2      1000024         3                       # CHL    -->  W1SS+  ST                 
      1.16656749E-02    2      1000037         3                       # CHL    -->  W2SS+  ST                 
#         PDG         Width
DECAY   1000005  2.13477821E+01   # BT1   decays
#          BR          NDA       ID1       ID2       ID3       ID4
      1.05305221E-02    2      1000022         5                       # BT1    -->  Z1SS   BT                 
      1.71969295E-01    2      1000023         5                       # BT1    -->  Z2SS   BT                 
      3.92239541E-03    2      1000025         5                       # BT1    -->  Z3SS   BT                 
      6.50353823E-03    2      1000035         5                       # BT1    -->  Z4SS   BT                 
      3.22228402E-01    2     -1000024         6                       # BT1    -->  W1SS-  TP                 
      3.02416950E-01    2     -1000037         6                       # BT1    -->  W2SS-  TP                 
      1.82428926E-01    2          -24   1000006                       # BT1    -->  W-     TP1                
#         PDG         Width
DECAY   1000006  8.37493420E+00   # TP1   decays
#          BR          NDA       ID1       ID2       ID3       ID4
      2.30124518E-01    2      1000022         6                       # TP1    -->  Z1SS   TP                 
      7.75690675E-02    2      1000023         6                       # TP1    -->  Z2SS   TP                 
      1.84253722E-01    2      1000025         6                       # TP1    -->  Z3SS   TP                 
      6.74842745E-02    2      1000035         6                       # TP1    -->  Z4SS   TP                 
      1.76966280E-01    2      1000024         5                       # TP1    -->  W1SS+  BT                 
      2.63602108E-01    2      1000037         5                       # TP1    -->  W2SS+  BT                 
#         PDG         Width
DECAY   2000002  2.90014672E+00   # UPR   decays
#          BR          NDA       ID1       ID2       ID3       ID4
      9.97756243E-01    2      1000022         2                       # UPR    -->  Z1SS   UP                 
      4.07963787E-04    2      1000023         2                       # UPR    -->  Z2SS   UP                 
      2.80584180E-04    2      1000025         2                       # UPR    -->  Z3SS   UP                 
      1.55514735E-03    2      1000035         2                       # UPR    -->  Z4SS   UP                 
#         PDG         Width
DECAY   2000001  7.21554339E-01   # DNR   decays
#          BR          NDA       ID1       ID2       ID3       ID4
      9.97772634E-01    2      1000022         1                       # DNR    -->  Z1SS   DN                 
      4.07079729E-04    2      1000023         1                       # DNR    -->  Z2SS   DN                 
      2.78328283E-04    2      1000025         1                       # DNR    -->  Z3SS   DN                 
      1.54199300E-03    2      1000035         1                       # DNR    -->  Z4SS   DN                 
#         PDG         Width
DECAY   2000003  7.21554339E-01   # STR   decays
#          BR          NDA       ID1       ID2       ID3       ID4
      9.97772634E-01    2      1000022         3                       # STR    -->  Z1SS   ST                 
      4.07079729E-04    2      1000023         3                       # STR    -->  Z2SS   ST                 
      2.78328283E-04    2      1000025         3                       # STR    -->  Z3SS   ST                 
      1.54199300E-03    2      1000035         3                       # STR    -->  Z4SS   ST                 
#         PDG         Width
DECAY   2000004  2.90014219E+00   # CHR   decays
#          BR          NDA       ID1       ID2       ID3       ID4
      9.97756243E-01    2      1000022         4                       # CHR    -->  Z1SS   CH                 
      4.07963787E-04    2      1000023         4                       # CHR    -->  Z2SS   CH                 
      2.80583801E-04    2      1000025         4                       # CHR    -->  Z3SS   CH                 
      1.55514537E-03    2      1000035         4                       # CHR    -->  Z4SS   CH                 
#         PDG         Width
DECAY   2000005  1.95963049E+00   # BT2   decays
#          BR          NDA       ID1       ID2       ID3       ID4
      3.47462624E-01    2      1000022         5                       # BT2    -->  Z1SS   BT                 
      3.61329615E-02    2      1000023         5                       # BT2    -->  Z2SS   BT                 
      5.51830865E-02    2      1000025         5                       # BT2    -->  Z3SS   BT                 
      6.88747466E-02    2      1000035         5                       # BT2    -->  Z4SS   BT                 
      6.86676726E-02    2     -1000024         6                       # BT2    -->  W1SS-  TP                 
      2.98815995E-01    2     -1000037         6                       # BT2    -->  W2SS-  TP                 
      1.24862947E-01    2          -24   1000006                       # BT2    -->  W-     TP1                
#         PDG         Width
DECAY   2000006  2.32947731E+01   # TP2   decays
#          BR          NDA       ID1       ID2       ID3       ID4
      2.61794478E-01    2      1000024         5                       # TP2    -->  W1SS+  BT                 
      6.95234612E-02    2      1000037         5                       # TP2    -->  W2SS+  BT                 
      1.15117840E-01    2           23   1000006                       # TP2    -->  Z0     TP1                
      9.48013216E-02    2           25   1000006                       # TP2    -->  HL0    TP1                
      1.41049065E-02    2      1000022         6                       # TP2    -->  Z1SS   TP                 
      1.24521583E-01    2      1000023         6                       # TP2    -->  Z2SS   TP                 
      1.27502754E-01    2      1000025         6                       # TP2    -->  Z3SS   TP                 
      1.92633703E-01    2      1000035         6                       # TP2    -->  Z4SS   TP                 
#         PDG         Width
DECAY   1000011  4.65124637E-01   # EL-   decays
#          BR          NDA       ID1       ID2       ID3       ID4
      8.46250534E-01    2      1000022        11                       # EL-    -->  Z1SS   E-                 
      5.44198118E-02    2      1000023        11                       # EL-    -->  Z2SS   E-                 
      9.93296430E-02    2     -1000024        12                       # EL-    -->  W1SS-  NUE                
      1.59111657E-09    3      1000015        11       -15             # EL-    -->  TAU1-  E-     TAU+        
      2.10686446E-09    3     -1000015        11        15             # EL-    -->  TAU1+  E-     TAU-        
#         PDG         Width
DECAY   1000013  4.65124369E-01   # MUL-  decays
#          BR          NDA       ID1       ID2       ID3       ID4
      8.46250832E-01    2      1000022        13                       # MUL-   -->  Z1SS   MU-                
      5.44194989E-02    2      1000023        13                       # MUL-   -->  Z2SS   MU-                
      9.93296951E-02    2     -1000024        14                       # MUL-   -->  W1SS-  NUM                
      1.59111746E-09    3      1000015        13       -15             # MUL-   -->  TAU1-  MU-    TAU+        
      2.10686557E-09    3     -1000015        13        15             # MUL-   -->  TAU1+  MU-    TAU-        
#         PDG         Width
DECAY   1000015  5.95175922E-01   # TAU1- decays
#          BR          NDA       ID1       ID2       ID3       ID4
      1.00000000E+00    2      1000022        15                       # TAU1-  -->  Z1SS   TAU-               
#         PDG         Width
DECAY   1000012  4.46472138E-01   # NUEL  decays
#          BR          NDA       ID1       ID2       ID3       ID4
      9.12612855E-01    2      1000022        12                       # NUEL   -->  Z1SS   NUE                
      2.97303367E-02    2      1000023        12                       # NUEL   -->  Z2SS   NUE                
      5.76567985E-02    2      1000024        11                       # NUEL   -->  W1SS+  E-                 
      2.71296074E-09    3      1000015        12       -15             # NUEL   -->  TAU1-  NUE    TAU+        
      2.59393951E-09    3     -1000015        12        15             # NUEL   -->  TAU1+  NUE    TAU-        
      1.57304623E-08    3     -1000015        11        16             # NUEL   -->  TAU1+  E-     NUT         
#         PDG         Width
DECAY   1000014  4.46471840E-01   # NUML  decays
#          BR          NDA       ID1       ID2       ID3       ID4
      9.12613451E-01    2      1000022        14                       # NUML   -->  Z1SS   NUM                
      2.97303572E-02    2      1000023        14                       # NUML   -->  Z2SS   NUM                
      5.76561242E-02    2      1000024        13                       # NUML   -->  W1SS+  MU-                
      2.71296274E-09    3      1000015        14       -15             # NUML   -->  TAU1-  NUM    TAU+        
      2.59394128E-09    3     -1000015        14        15             # NUML   -->  TAU1+  NUM    TAU-        
      1.57379461E-08    3     -1000015        13        16             # NUML   -->  TAU1+  MU-    NUT         
#         PDG         Width
DECAY   1000016  4.75913584E-01   # NUTL  decays
#          BR          NDA       ID1       ID2       ID3       ID4
      8.39070559E-01    2      1000022        16                       # NUTL   -->  Z1SS   NUT                
      1.76537763E-02    2      1000023        16                       # NUTL   -->  Z2SS   NUT                
      3.31544615E-02    2      1000024        15                       # NUTL   -->  W1SS+  TAU-               
      1.10121243E-01    2           24   1000015                       # NUTL   -->  W+     TAU1-              
      4.01671718E-09    3     -1000015        16        15             # NUTL   -->  TAU1+  NUT    TAU-        
      2.08360018E-09    3      1000015        16       -15             # NUTL   -->  TAU1-  NUT    TAU+        
#         PDG         Width
DECAY   2000011  6.29534662E-01   # ER-   decays
#          BR          NDA       ID1       ID2       ID3       ID4
      1.00000000E+00    2      1000022        11                       # ER-    -->  Z1SS   E-                 
      1.46494530E-17    3      1000015        11       -15             # ER-    -->  TAU1-  E-     TAU+        
      1.31710232E-17    3     -1000015        11        15             # ER-    -->  TAU1+  E-     TAU-        
      1.30536436E-22    3      1000015        12       -16             # ER-    -->  TAU1-  NUE    ANUT        
#         PDG         Width
DECAY   2000013  6.29534364E-01   # MUR-  decays
#          BR          NDA       ID1       ID2       ID3       ID4
      1.00000000E+00    2      1000022        13                       # MUR-   -->  Z1SS   MU-                
      1.46494596E-17    3      1000015        13       -15             # MUR-   -->  TAU1-  MU-    TAU+        
      1.31710290E-17    3     -1000015        13        15             # MUR-   -->  TAU1+  MU-    TAU-        
      5.56631175E-18    3      1000015        14       -16             # MUR-   -->  TAU1-  NUM    ANUT        
#         PDG         Width
DECAY   2000015  5.24443924E-01   # TAU2- decays
#          BR          NDA       ID1       ID2       ID3       ID4
      7.60612965E-01    2      1000022        15                       # TAU2-  -->  Z1SS   TAU-               
      3.97906937E-02    2      1000023        15                       # TAU2-  -->  Z2SS   TAU-               
      7.26542175E-02    2     -1000024        16                       # TAU2-  -->  W1SS-  NUT                
      5.52914478E-02    2           23   1000015                       # TAU2-  -->  Z0     TAU1-              
      7.16507211E-02    2           25   1000015                       # TAU2-  -->  HL0    TAU1-              
#         PDG         Width
DECAY   1000023  2.81927828E-02   # Z2SS  decays
#          BR          NDA       ID1       ID2       ID3       ID4
      5.13821760E-06    2      1000022        22                       # Z2SS   -->  Z1SS   GM                 
      4.21808437E-02    2      1000022        23                       # Z2SS   -->  Z1SS   Z0                 
      3.44594173E-06    3      1000022         2        -2             # Z2SS   -->  Z1SS   UP     UB          
      4.10832899E-06    3      1000022         1        -1             # Z2SS   -->  Z1SS   DN     DB          
      4.10832899E-06    3      1000022         3        -3             # Z2SS   -->  Z1SS   ST     SB          
      3.44593582E-06    3      1000022         4        -4             # Z2SS   -->  Z1SS   CH     CB          
      7.05180901E-06    3      1000022         5        -5             # Z2SS   -->  Z1SS   BT     BB          
      2.29094597E-03    3      1000022        11       -11             # Z2SS   -->  Z1SS   E-     E+          
      2.29094597E-03    3      1000022        13       -13             # Z2SS   -->  Z1SS   MU-    MU+         
      2.40744115E-03    3      1000022        15       -15             # Z2SS   -->  Z1SS   TAU-   TAU+        
      2.77868845E-03    3      1000022        12       -12             # Z2SS   -->  Z1SS   NUE    ANUE        
      2.77868845E-03    3      1000022        14       -14             # Z2SS   -->  Z1SS   NUM    ANUM        
      3.11163231E-03    3      1000022        16       -16             # Z2SS   -->  Z1SS   NUT    ANUT        
      6.80344343E-01    2      1000022        25                       # Z2SS   -->  Z1SS   HL0                
      3.84525256E-03    2      2000011       -11                       # Z2SS   -->  ER-    E+                 
      3.84525256E-03    2     -2000011        11                       # Z2SS   -->  ER+    E-                 
      3.84525163E-03    2      2000013       -13                       # Z2SS   -->  MUR-   MU+                
      3.84525163E-03    2     -2000013        13                       # Z2SS   -->  MUR+   MU-                
      1.23204120E-01    2      1000015       -15                       # Z2SS   -->  TAU1-  TAU+               
      1.23204120E-01    2     -1000015        15                       # Z2SS   -->  TAU1+  TAU-               
#         PDG         Width
DECAY   1000025  4.50347090E+00   # Z3SS  decays
#          BR          NDA       ID1       ID2       ID3       ID4
      3.68209783E-08    2      1000022        22                       # Z3SS   -->  Z1SS   GM                 
      2.09032450E-07    2      1000023        22                       # Z3SS   -->  Z2SS   GM                 
      2.90551811E-01    2      1000024       -24                       # Z3SS   -->  W1SS+  W-                 
      2.90551811E-01    2     -1000024        24                       # Z3SS   -->  W1SS-  W+                 
      1.06096692E-01    2      1000022        23                       # Z3SS   -->  Z1SS   Z0                 
      2.69635439E-01    2      1000023        23                       # Z3SS   -->  Z2SS   Z0                 
      2.45961651E-09    3      1000022         2        -2             # Z3SS   -->  Z1SS   UP     UB          
      7.38844430E-10    3      1000022         1        -1             # Z3SS   -->  Z1SS   DN     DB          
      7.38844430E-10    3      1000022         3        -3             # Z3SS   -->  Z1SS   ST     SB          
      2.45961052E-09    3      1000022         4        -4             # Z3SS   -->  Z1SS   CH     CB          
      1.33423850E-06    3      1000022         5        -5             # Z3SS   -->  Z1SS   BT     BB          
      1.62799466E-07    3      1000022        15       -15             # Z3SS   -->  Z1SS   TAU-   TAU+        
      7.53500873E-10    3      1000023         2        -2             # Z3SS   -->  Z2SS   UP     UB          
      1.22968091E-09    3      1000023         1        -1             # Z3SS   -->  Z2SS   DN     DB          
      1.22968091E-09    3      1000023         3        -3             # Z3SS   -->  Z2SS   ST     SB          
      7.53499152E-10    3      1000023         4        -4             # Z3SS   -->  Z2SS   CH     CB          
      3.48743640E-07    3      1000023         5        -5             # Z3SS   -->  Z2SS   BT     BB          
      2.89552062E-08    3      1000023        15       -15             # Z3SS   -->  Z2SS   TAU-   TAU+        
      1.68244485E-02    2      1000022        25                       # Z3SS   -->  Z1SS   HL0                
      7.48529751E-03    2      1000023        25                       # Z3SS   -->  Z2SS   HL0                
      4.89813101E-05    2      1000011       -11                       # Z3SS   -->  EL-    E+                 
      4.89813101E-05    2     -1000011        11                       # Z3SS   -->  EL+    E-                 
      4.89813065E-05    2      1000013       -13                       # Z3SS   -->  MUL-   MU+                
      4.89813065E-05    2     -1000013        13                       # Z3SS   -->  MUL+   MU-                
      1.53949921E-04    2      2000011       -11                       # Z3SS   -->  ER-    E+                 
      1.53949921E-04    2     -2000011        11                       # Z3SS   -->  ER+    E-                 
      1.53949921E-04    2      2000013       -13                       # Z3SS   -->  MUR-   MU+                
      1.53949921E-04    2     -2000013        13                       # Z3SS   -->  MUR+   MU-                
      5.29511552E-03    2      1000015       -15                       # Z3SS   -->  TAU1-  TAU+               
      5.29511552E-03    2     -1000015        15                       # Z3SS   -->  TAU1+  TAU-               
      2.93471129E-03    2      2000015       -15                       # Z3SS   -->  TAU2-  TAU+               
      2.93471129E-03    2     -2000015        15                       # Z3SS   -->  TAU2+  TAU-               
      2.60853500E-04    2      1000012       -12                       # Z3SS   -->  NUEL   ANUE               
      2.60853500E-04    2     -1000012        12                       # Z3SS   -->  ANUEL  NUE                
      2.60853500E-04    2      1000014       -14                       # Z3SS   -->  NUML   ANUM               
      2.60853500E-04    2     -1000014        14                       # Z3SS   -->  ANUML  NUM                
      2.68499163E-04    2      1000016       -16                       # Z3SS   -->  NUTL   ANUT               
      2.68499163E-04    2     -1000016        16                       # Z3SS   -->  ANUTL  NUT                
#         PDG         Width
DECAY   1000035  5.00347805E+00   # Z4SS  decays
#          BR          NDA       ID1       ID2       ID3       ID4
      1.33233385E-07    2      1000022        22                       # Z4SS   -->  Z1SS   GM                 
      3.83473564E-09    2      1000023        22                       # Z4SS   -->  Z2SS   GM                 
      2.31749883E-10    2      1000025        22                       # Z4SS   -->  Z3SS   GM                 
      2.78569520E-01    2      1000024       -24                       # Z4SS   -->  W1SS+  W-                 
      2.78569520E-01    2     -1000024        24                       # Z4SS   -->  W1SS-  W+                 
      1.60467289E-02    2      1000022        23                       # Z4SS   -->  Z1SS   Z0                 
      8.90544802E-03    2      1000023        23                       # Z4SS   -->  Z2SS   Z0                 
      5.28247064E-08    3      1000022         2        -2             # Z4SS   -->  Z1SS   UP     UB          
      4.03682634E-08    3      1000022         1        -1             # Z4SS   -->  Z1SS   DN     DB          
      4.03682634E-08    3      1000022         3        -3             # Z4SS   -->  Z1SS   ST     SB          
      5.28245891E-08    3      1000022         4        -4             # Z4SS   -->  Z1SS   CH     CB          
      1.21210974E-06    3      1000022         5        -5             # Z4SS   -->  Z1SS   BT     BB          
      1.42378624E-07    3      1000022        15       -15             # Z4SS   -->  Z1SS   TAU-   TAU+        
      9.23622068E-08    3      1000023         2        -2             # Z4SS   -->  Z2SS   UP     UB          
      1.11304900E-07    3      1000023         1        -1             # Z4SS   -->  Z2SS   DN     DB          
      1.11304900E-07    3      1000023         3        -3             # Z4SS   -->  Z2SS   ST     SB          
      9.23620007E-08    3      1000023         4        -4             # Z4SS   -->  Z2SS   CH     CB          
      4.92761785E-07    3      1000023         5        -5             # Z4SS   -->  Z2SS   BT     BB          
      2.65483298E-08    3      1000023        15       -15             # Z4SS   -->  Z2SS   TAU-   TAU+        
      7.54378604E-09    3      1000025         2        -2             # Z4SS   -->  Z3SS   UP     UB          
      9.72931691E-09    3      1000025         1        -1             # Z4SS   -->  Z3SS   DN     DB          
      9.72931691E-09    3      1000025         3        -3             # Z4SS   -->  Z3SS   ST     SB          
      7.54378604E-09    3      1000025         4        -4             # Z4SS   -->  Z3SS   CH     CB          
      1.06135634E-09    3      1000025         5        -5             # Z4SS   -->  Z3SS   BT     BB          
      2.20689245E-09    3      1000025        11       -11             # Z4SS   -->  Z3SS   E-     E+          
      2.20689245E-09    3      1000025        13       -13             # Z4SS   -->  Z3SS   MU-    MU+         
      1.72378478E-09    3      1000025        15       -15             # Z4SS   -->  Z3SS   TAU-   TAU+        
      4.39102177E-09    3      1000025        12       -12             # Z4SS   -->  Z3SS   NUE    ANUE        
      4.39102177E-09    3      1000025        14       -14             # Z4SS   -->  Z3SS   NUM    ANUM        
      4.39102177E-09    3      1000025        16       -16             # Z4SS   -->  Z3SS   NUT    ANUT        
      9.44235846E-02    2      1000022        25                       # Z4SS   -->  Z1SS   HL0                
      2.51826465E-01    2      1000023        25                       # Z4SS   -->  Z2SS   HL0                
      2.96042440E-03    2      1000011       -11                       # Z4SS   -->  EL-    E+                 
      2.96042440E-03    2     -1000011        11                       # Z4SS   -->  EL+    E-                 
      2.96042417E-03    2      1000013       -13                       # Z4SS   -->  MUL-   MU+                
      2.96042417E-03    2     -1000013        13                       # Z4SS   -->  MUL+   MU-                
      8.23193812E-04    2      2000011       -11                       # Z4SS   -->  ER-    E+                 
      8.23193812E-04    2     -2000011        11                       # Z4SS   -->  ER+    E-                 
      8.23193812E-04    2      2000013       -13                       # Z4SS   -->  MUR-   MU+                
      8.23193812E-04    2     -2000013        13                       # Z4SS   -->  MUR+   MU-                
      4.25359653E-03    2      1000015       -15                       # Z4SS   -->  TAU1-  TAU+               
      4.25359653E-03    2     -1000015        15                       # Z4SS   -->  TAU1+  TAU-               
      6.14406029E-03    2      2000015       -15                       # Z4SS   -->  TAU2-  TAU+               
      6.14406029E-03    2     -2000015        15                       # Z4SS   -->  TAU2+  TAU-               
      5.89986704E-03    2      1000012       -12                       # Z4SS   -->  NUEL   ANUE               
      5.89986704E-03    2     -1000012        12                       # Z4SS   -->  ANUEL  NUE                
      5.89986704E-03    2      1000014       -14                       # Z4SS   -->  NUML   ANUM               
      5.89986704E-03    2     -1000014        14                       # Z4SS   -->  ANUML  NUM                
      6.06332952E-03    2      1000016       -16                       # Z4SS   -->  NUTL   ANUT               
      6.06332952E-03    2     -1000016        16                       # Z4SS   -->  ANUTL  NUT                
#         PDG         Width
DECAY   1000024  2.57975589E-02   # W1SS+ decays
#          BR          NDA       ID1       ID2       ID3       ID4
      8.33179820E-06    3      1000022         2        -1             # W1SS+  -->  Z1SS   UP     DB          
      8.33179092E-06    3      1000022         4        -3             # W1SS+  -->  Z1SS   CH     SB          
      5.69163077E-03    3      1000022       -11        12             # W1SS+  -->  Z1SS   E+     NUE         
      5.69163077E-03    3      1000022       -13        14             # W1SS+  -->  Z1SS   MU+    NUM         
      6.20783493E-03    3      1000022       -15        16             # W1SS+  -->  Z1SS   TAU+   NUT         
      7.22227335E-01    2      1000022        24                       # W1SS+  -->  Z1SS   W+                 
      8.40683512E-12    3      1000023       -11        12             # W1SS+  -->  Z2SS   E+     NUE         
      8.40683512E-12    3      1000023       -13        14             # W1SS+  -->  Z2SS   MU+    NUM         
      2.60164917E-01    2     -1000015        16                       # W1SS+  -->  TAU1+  NUT                
#         PDG         Width
DECAY   1000037  4.96672344E+00   # W2SS+ decays
#          BR          NDA       ID1       ID2       ID3       ID4
      6.66078392E-08    3      1000022         2        -1             # W2SS+  -->  Z1SS   UP     DB          
      6.66077966E-08    3      1000022         4        -3             # W2SS+  -->  Z1SS   CH     SB          
      1.30049870E-07    3      1000022       -15        16             # W2SS+  -->  Z1SS   TAU+   NUT         
      9.99062955E-02    2      1000022        24                       # W2SS+  -->  Z1SS   W+                 
      7.91717412E-08    3      1000023         2        -1             # W2SS+  -->  Z2SS   UP     DB          
      7.91716985E-08    3      1000023         4        -3             # W2SS+  -->  Z2SS   CH     SB          
      3.54080569E-08    3      1000023       -15        16             # W2SS+  -->  Z2SS   TAU+   NUT         
      2.91066408E-01    2      1000023        24                       # W2SS+  -->  Z2SS   W+                 
      2.37867450E-08    3      1000025         2        -1             # W2SS+  -->  Z3SS   UP     DB          
      2.37867450E-08    3      1000025         4        -3             # W2SS+  -->  Z3SS   CH     SB          
      7.92875188E-09    3      1000025       -11        12             # W2SS+  -->  Z3SS   E+     NUE         
      7.92875188E-09    3      1000025       -13        14             # W2SS+  -->  Z3SS   MU+    NUM         
      7.92875188E-09    3      1000025       -15        16             # W2SS+  -->  Z3SS   TAU+   NUT         
      6.21222192E-03    2      1000012       -11                       # W2SS+  -->  NUEL   E+                 
      6.21222192E-03    2      1000014       -13                       # W2SS+  -->  NUML   MU+                
      1.15920901E-02    2      1000016       -15                       # W2SS+  -->  NUTL   TAU+               
      1.15377940E-02    2     -1000011        12                       # W2SS+  -->  EL+    NUE                
      1.15377940E-02    2     -1000013        14                       # W2SS+  -->  MUL+   NUM                
      6.92743436E-03    2     -1000015        16                       # W2SS+  -->  TAU1+  NUT                
      1.31549640E-02    2     -2000015        16                       # W2SS+  -->  TAU2+  NUT                
      2.76278347E-01    2      1000024        23                       # W2SS+  -->  W1SS+  Z0                 
      9.82436319E-08    3      1000024         1        -1             # W2SS+  -->  W1SS+  DN     DB          
      9.82434258E-08    3      1000024         3        -3             # W2SS+  -->  W1SS+  ST     SB          
      1.84548412E-07    3      1000024         2        -2             # W2SS+  -->  W1SS+  UP     UB          
      1.84548412E-07    3      1000024         4        -4             # W2SS+  -->  W1SS+  CH     CB          
      2.65573382E-01    2      1000024        25                       # W2SS+  -->  W1SS+  HL0                
#         PDG         Width
DECAY        25  4.24789079E-03   # HL0   decays
#          BR          NDA       ID1       ID2       ID3       ID4
      4.81722440E-09    2           11       -11                       # HL0    -->  E-     E+                 
      2.03390897E-04    2           13       -13                       # HL0    -->  MU-    MU+                
      5.81725799E-02    2           15       -15                       # HL0    -->  TAU-   TAU+               
      6.04531988E-06    2            1        -1                       # HL0    -->  DN     DB                 
      2.44261208E-03    2            3        -3                       # HL0    -->  ST     SB                 
      7.99737811E-01    2            5        -5                       # HL0    -->  BT     BB                 
      1.86300758E-06    2            2        -2                       # HL0    -->  UP     UB                 
      3.50235365E-02    2            4        -4                       # HL0    -->  CH     CB                 
      1.81197410E-03    2           22        22                       # HL0    -->  GM     GM                 
      3.86416763E-02    2           21        21                       # HL0    -->  GL     GL                 
      3.29481252E-03    3           24        11       -12             # HL0    -->  W+     E-     ANUE        
      3.29481252E-03    3           24        13       -14             # HL0    -->  W+     MU-    ANUM        
      3.29481252E-03    3           24        15       -16             # HL0    -->  W+     TAU-   ANUT        
      9.88443755E-03    3           24        -2         1             # HL0    -->  W+     UB     DN          
      9.88443755E-03    3           24        -4         3             # HL0    -->  W+     CB     ST          
      3.29481252E-03    3          -24       -11        12             # HL0    -->  W-     E+     NUE         
      3.29481252E-03    3          -24       -13        14             # HL0    -->  W-     MU+    NUM         
      3.29481252E-03    3          -24       -15        16             # HL0    -->  W-     TAU+   NUT         
      9.88443755E-03    3          -24         2        -1             # HL0    -->  W-     UP     DB          
      9.88443755E-03    3          -24         4        -3             # HL0    -->  W-     CH     SB          
      3.18127451E-04    3           23        12       -12             # HL0    -->  Z0     NUE    ANUE        
      3.18127451E-04    3           23        14       -14             # HL0    -->  Z0     NUM    ANUM        
      3.18127451E-04    3           23        16       -16             # HL0    -->  Z0     NUT    ANUT        
      1.60110343E-04    3           23        11       -11             # HL0    -->  Z0     E-     E+          
      1.60110343E-04    3           23        13       -13             # HL0    -->  Z0     MU-    MU+         
      1.60110343E-04    3           23        15       -15             # HL0    -->  Z0     TAU-   TAU+        
      5.48524491E-04    3           23         2        -2             # HL0    -->  Z0     UP     UB          
      5.48524491E-04    3           23         4        -4             # HL0    -->  Z0     CH     CB          
      7.06634717E-04    3           23         1        -1             # HL0    -->  Z0     DN     DB          
      7.06634717E-04    3           23         3        -3             # HL0    -->  Z0     ST     SB          
      7.06634717E-04    3           23         5        -5             # HL0    -->  Z0     BT     BB          
#         PDG         Width
DECAY        35  1.94333482E+00   # HH0   decays
#          BR          NDA       ID1       ID2       ID3       ID4
      8.75122552E-09    2           11       -11                       # HH0    -->  E-     E+                 
      3.69492511E-04    2           13       -13                       # HH0    -->  MU-    MU+                
      1.05826333E-01    2           15       -15                       # HH0    -->  TAU-   TAU+               
      1.07207825E-05    2            1        -1                       # HH0    -->  DN     DB                 
      4.33173822E-03    2            3        -3                       # HH0    -->  ST     SB                 
      6.47322893E-01    2            5        -5                       # HH0    -->  BT     BB                 
      3.56158381E-10    2            2        -2                       # HH0    -->  UP     UB                 
      5.01904515E-06    2            4        -4                       # HH0    -->  CH     CB                 
      2.28546366E-01    2            6        -6                       # HH0    -->  TP     TB                 
      8.87821955E-07    2           22        22                       # HH0    -->  GM     GM                 
      1.37068142E-04    2           21        21                       # HH0    -->  GL     GL                 
      5.69089374E-04    2           24       -24                       # HH0    -->  W+     W-                 
      2.88900890E-04    2           23        23                       # HH0    -->  Z0     Z0                 
      2.53999513E-03    2      1000022   1000022                       # HH0    -->  Z1SS   Z1SS               
      7.28746830E-03    2      1000022   1000023                       # HH0    -->  Z1SS   Z2SS               
      1.12104672E-03    2           25        25                       # HH0    -->  HL0    HL0                
      5.35607178E-05    2      2000011  -2000011                       # HH0    -->  ER-    ER+                
      5.35304789E-05    2      2000013  -2000013                       # HH0    -->  MUR-   MUR+               
      3.03972512E-04    2      1000015  -1000015                       # HH0    -->  TAU1-  TAU1+              
      6.15974364E-04    2      1000015  -2000015                       # HH0    -->  TAU1-  TAU2+              
      6.15974364E-04    2      2000015  -1000015                       # HH0    -->  TAU2-  TAU1+              
#         PDG         Width
DECAY        36  2.00142217E+00   # HA0   decays
#          BR          NDA       ID1       ID2       ID3       ID4
      8.44368753E-09    2           11       -11                       # HA0    -->  E-     E+                 
      3.56507720E-04    2           13       -13                       # HA0    -->  MU-    MU+                
      1.02108628E-01    2           15       -15                       # HA0    -->  TAU-   TAU+               
      1.03446037E-05    2            1        -1                       # HA0    -->  DN     DB                 
      4.17974358E-03    2            3        -3                       # HA0    -->  ST     SB                 
      6.24637485E-01    2            5        -5                       # HA0    -->  BT     BB                 
      3.30994121E-10    2            2        -2                       # HA0    -->  UP     UB                 
      4.66812980E-06    2            4        -4                       # HA0    -->  CH     CB                 
      2.36416206E-01    2            6        -6                       # HA0    -->  TP     TB                 
      1.15922830E-06    2           22        22                       # HA0    -->  GM     GM                 
      1.96104666E-04    2           21        21                       # HA0    -->  GL     GL                 
      4.35178215E-03    2      1000022   1000022                       # HA0    -->  Z1SS   Z1SS               
      2.68867146E-02    2      1000022   1000023                       # HA0    -->  Z1SS   Z2SS               
      5.33151615E-04    2           25        23                       # HA0    -->  HL0    Z0                 
      1.58761366E-04    2      1000015  -2000015                       # HA0    -->  TAU1-  TAU2+              
      1.58761366E-04    2      2000015  -1000015                       # HA0    -->  TAU2-  TAU1+              
#         PDG         Width
DECAY        37  1.80954766E+00   # H+    decays
#          BR          NDA       ID1       ID2       ID3       ID4
      9.44906819E-09    2           12       -11                       # H+     -->  NUE    E+                 
      3.98956705E-04    2           14       -13                       # H+     -->  NUM    MU+                
      1.14266604E-01    2           16       -15                       # H+     -->  NUT    TAU+               
      1.06402722E-05    2            2        -1                       # H+     -->  UP     DB                 
      4.30384977E-03    2            4        -3                       # H+     -->  CH     SB                 
      8.40038955E-01    2            6        -5                       # H+     -->  TP     BB                 
      3.78622785E-02    2      1000024   1000022                       # H+     -->  W1SS+  Z1SS               
      6.07256661E-04    2           25        24                       # H+     -->  HL0    W+                 
      2.51138210E-03    2     -1000015   1000016                       # H+     -->  TAU1+  NUTL               
