  65
  401   3713.0225    0.21042E-25
  402   3712.1643    0.21020E-25
  403   3712.9722    0.21043E-25
  404   3712.1143    0.21020E-25
  405   3340.0354    0.16975E-25
  406   2946.7678    0.24304E-25
  407   3713.0225    0.21042E-25
  408   3712.1643    0.21020E-25
  409   3712.9722    0.21043E-25
  410   3712.1143    0.21020E-25
  411   3340.0354    0.16975E-25
  412   2946.7678    0.24304E-25
  413   3525.7910    0.37458E-24
  414   3545.2390    0.93000E-25
  415   3525.7012    0.37459E-24
  416   3545.2393    0.93000E-25
  417   3385.3325    0.17225E-25
  418   3374.8833    0.10703E-25
  419   3525.7910    0.37458E-24
  420   3545.2390    0.93000E-25
  421   3525.7012    0.37459E-24
  422   3545.2393    0.93000E-25
  423   3385.3325    0.17225E-25
  424   3374.8833    0.10703E-25
  425   1293.3098    0.12002E-23
  426   1290.8441    0.11984E-23
  427   1293.0701    0.12011E-23
  428   1290.6039    0.11993E-23
  429    583.4464    0.44711E-12
  430   1253.4663    0.96353E-25
  431   1293.3098    0.12002E-23
  432   1290.8441    0.11984E-23
  433   1293.0701    0.12011E-23
  434   1290.6039    0.11993E-23
  435    583.4464    0.44711E-12
  436   1253.4663    0.96353E-25
  437    734.5504    0.10326E-22
  438      0.0000    0.10000E+31
  439    736.4200    0.89682E-19
  440      0.0000    0.10000E+31
  441   1261.2440    0.94765E-25
  442      0.0000    0.10000E+31
  443    734.5504    0.10326E-22
  444      0.0000    0.10000E+31
  445    736.4200    0.89682E-19
  446      0.0000    0.10000E+31
  447   1261.2440    0.94765E-25
  448      0.0000    0.10000E+31
  449   4116.5400    0.81769E-26
  450    868.7890    0.32405E-24
  451   1605.9993    0.12060E-24
  452  -2042.6041    0.55386E-25
  453   2050.1189    0.53821E-25
  454   1606.1604    0.12051E-24
  455   2050.0720    0.54029E-25
  456   1606.1604    0.12051E-24
  457   2050.0720    0.54029E-25
  203    123.5759    0.11532E-21
  204   1738.4971    0.13305E-25
  205   1736.2900    0.13319E-25
  206   1740.7195    0.14766E-25
  207   1740.7195    0.14766E-25
  458      0.0000    0.10000E+31
    6    173.3000    0.56017E-24
   12    173.3000    0.56017E-24
   6
   401  0.15197944E-01     0   450     1     0     0     0
   401  0.32371736E+00     0   451     1     0     0     0
   401  0.69366761E-04     0   452     1     0     0     0
   401  0.45466213E-02     0   453     1     0     0     0
   401  0.64600402E+00     0   456     2     0     0     0
   401  0.10464676E-01     0   457     2     0     0     0
   6
   402  0.14727306E-01     0   450     2     0     0     0
   402  0.32445663E+00     0   451     2     0     0     0
   402  0.41651863E-04     0   452     2     0     0     0
   402  0.39097676E-02     0   453     2     0     0     0
   402  0.65021145E+00     0   454     1     0     0     0
   402  0.66532134E-02     0   455     1     0     0     0
   6
   403  0.15198091E-01     0   450     3     0     0     0
   403  0.32371747E+00     0   451     3     0     0     0
   403  0.69366019E-04     0   452     3     0     0     0
   403  0.45465720E-02     0   453     3     0     0     0
   403  0.64600396E+00     0   456     4     0     0     0
   403  0.10464558E-01     0   457     4     0     0     0
   6
   404  0.14727442E-01     0   450     4     0     0     0
   404  0.32445654E+00     0   451     4     0     0     0
   404  0.41651401E-04     0   452     4     0     0     0
   404  0.39097224E-02     0   453     4     0     0     0
   404  0.65021157E+00     0   454     3     0     0     0
   404  0.66531403E-02     0   455     3     0     0     0
   7
   405  0.31035546E-01     0   450     5     0     0     0
   405  0.14244933E+00     0   451     5     0     0     0
   405  0.97425997E-01     0   452     5     0     0     0
   405  0.80703728E-01     0   453     5     0     0     0
   405  0.27867389E+00     0   456     6     0     0     0
   405  0.26721197E+00     0   457     6     0     0     0
   405  0.10249947E+00     0   199   406     0     0     0
   6
   406  0.19946690E+00     0   450     6     0     0     0
   406  0.22066796E-01     0   451     6     0     0     0
   406  0.20222393E+00     0   452     6     0     0     0
   406  0.16899709E+00     0   453     6     0     0     0
   406  0.45384232E-01     0   454     5     0     0     0
   406  0.36186105E+00     0   455     5     0     0     0
   6
   407  0.15197944E-01     0   450     7     0     0     0
   407  0.32371736E+00     0   451     7     0     0     0
   407  0.69366761E-04     0   452     7     0     0     0
   407  0.45466213E-02     0   453     7     0     0     0
   407  0.64600402E+00     0   454     8     0     0     0
   407  0.10464676E-01     0   455     8     0     0     0
   6
   408  0.14727306E-01     0   450     8     0     0     0
   408  0.32445663E+00     0   451     8     0     0     0
   408  0.41651863E-04     0   452     8     0     0     0
   408  0.39097676E-02     0   453     8     0     0     0
   408  0.65021145E+00     0   456     7     0     0     0
   408  0.66532134E-02     0   457     7     0     0     0
   6
   409  0.15198091E-01     0   450     9     0     0     0
   409  0.32371747E+00     0   451     9     0     0     0
   409  0.69366019E-04     0   452     9     0     0     0
   409  0.45465720E-02     0   453     9     0     0     0
   409  0.64600396E+00     0   454    10     0     0     0
   409  0.10464558E-01     0   455    10     0     0     0
   6
   410  0.14727442E-01     0   450    10     0     0     0
   410  0.32445654E+00     0   451    10     0     0     0
   410  0.41651401E-04     0   452    10     0     0     0
   410  0.39097224E-02     0   453    10     0     0     0
   410  0.65021157E+00     0   456     9     0     0     0
   410  0.66531403E-02     0   457     9     0     0     0
   7
   411  0.31035546E-01     0   450    11     0     0     0
   411  0.14244933E+00     0   451    11     0     0     0
   411  0.97425997E-01     0   452    11     0     0     0
   411  0.80703728E-01     0   453    11     0     0     0
   411  0.27867389E+00     0   454    12     0     0     0
   411  0.26721197E+00     0   455    12     0     0     0
   411  0.10249947E+00     0   198   412     0     0     0
   6
   412  0.19946690E+00     0   450    12     0     0     0
   412  0.22066796E-01     0   451    12     0     0     0
   412  0.20222393E+00     0   452    12     0     0     0
   412  0.16899709E+00     0   453    12     0     0     0
   412  0.45384232E-01     0   456    11     0     0     0
   412  0.36186105E+00     0   457    11     0     0     0
   4
   413  0.99956757E+00     0   450     1     0     0     0
   413  0.18814846E-04     0   451     1     0     0     0
   413  0.53610911E-04     0   452     1     0     0     0
   413  0.36004808E-03     0   453     1     0     0     0
   4
   414  0.99956352E+00     0   450     2     0     0     0
   414  0.18895977E-04     0   451     2     0     0     0
   414  0.54128392E-04     0   452     2     0     0     0
   414  0.36356793E-03     0   453     2     0     0     0
   4
   415  0.99956757E+00     0   450     3     0     0     0
   415  0.18814473E-04     0   451     3     0     0     0
   415  0.53608521E-04     0   452     3     0     0     0
   415  0.36003173E-03     0   453     3     0     0     0
   4
   416  0.99956352E+00     0   450     4     0     0     0
   416  0.18895975E-04     0   451     4     0     0     0
   416  0.54128381E-04     0   452     4     0     0     0
   416  0.36356787E-03     0   453     4     0     0     0
   7
   417  0.23325697E-01     0   450     5     0     0     0
   417  0.77392675E-01     0   451     5     0     0     0
   417  0.10800933E+00     0   452     5     0     0     0
   417  0.12237693E+00     0   453     5     0     0     0
   417  0.15109204E+00     0   456     6     0     0     0
   417  0.39520442E+00     0   457     6     0     0     0
   417  0.12259893E+00     0   199   406     0     0     0
   8
   418  0.25499186E+00     0   454     5     0     0     0
   418  0.14284444E+00     0   455     5     0     0     0
   418  0.73703200E-01     0   200   406     0     0     0
   418  0.99440001E-01     0   203   406     0     0     0
   418  0.86591756E-02     0   450     6     0     0     0
   418  0.12467338E+00     0   451     6     0     0     0
   418  0.13954304E+00     0   452     6     0     0     0
   418  0.15614486E+00     0   453     6     0     0     0
   4
   419  0.99956757E+00     0   450     7     0     0     0
   419  0.18814846E-04     0   451     7     0     0     0
   419  0.53610911E-04     0   452     7     0     0     0
   419  0.36004808E-03     0   453     7     0     0     0
   4
   420  0.99956352E+00     0   450     8     0     0     0
   420  0.18895977E-04     0   451     8     0     0     0
   420  0.54128392E-04     0   452     8     0     0     0
   420  0.36356793E-03     0   453     8     0     0     0
   4
   421  0.99956757E+00     0   450     9     0     0     0
   421  0.18814473E-04     0   451     9     0     0     0
   421  0.53608521E-04     0   452     9     0     0     0
   421  0.36003173E-03     0   453     9     0     0     0
   4
   422  0.99956352E+00     0   450    10     0     0     0
   422  0.18895975E-04     0   451    10     0     0     0
   422  0.54128381E-04     0   452    10     0     0     0
   422  0.36356787E-03     0   453    10     0     0     0
   7
   423  0.23325697E-01     0   450    11     0     0     0
   423  0.77392675E-01     0   451    11     0     0     0
   423  0.10800933E+00     0   452    11     0     0     0
   423  0.12237693E+00     0   453    11     0     0     0
   423  0.15109204E+00     0   454    12     0     0     0
   423  0.39520442E+00     0   455    12     0     0     0
   423  0.12259893E+00     0   198   412     0     0     0
   8
   424  0.25499186E+00     0   456    11     0     0     0
   424  0.14284444E+00     0   457    11     0     0     0
   424  0.73703200E-01     0   200   412     0     0     0
   424  0.99440001E-01     0   203   412     0     0     0
   424  0.86591756E-02     0   450    12     0     0     0
   424  0.12467338E+00     0   451    12     0     0     0
   424  0.13954304E+00     0   452    12     0     0     0
   424  0.15614486E+00     0   453    12     0     0     0
   2
   425  0.89768994E+00     0   450   121     0     0     0
   425  0.10231009E+00     0   121   130     0     0     0
   3
   426  0.89798796E+00     0   450   122     0     0     0
   426  0.49286929E-04     0   435   121   126     0     0
   426  0.10196275E+00     0   129   121     0     0     0
   2
   427  0.89763391E+00     0   450   123     0     0     0
   427  0.10236613E+00     0   121   128     0     0     0
   3
   428  0.89793158E+00     0   450   124     0     0     0
   428  0.49279111E-04     0   435   123   126     0     0
   428  0.10201925E+00     0   127   121     0     0     0
   3
   429  0.52935691E-02     0   125   130     0     0     0
   429  0.49734864E+00     0   125   124     0     0     0
   429  0.49735782E+00     0   123   126     0     0     0
   2
   430  0.63254535E-01     0   450   126     0     0     0
   430  0.93674552E+00     0   198   429     0     0     0
   2
   431  0.89768994E+00     0   450   127     0     0     0
   431  0.10231009E+00     0   127   124     0     0     0
   3
   432  0.89798796E+00     0   450   128     0     0     0
   432  0.49286929E-04     0   429   127   132     0     0
   432  0.10196275E+00     0   123   127     0     0     0
   2
   433  0.89763391E+00     0   450   129     0     0     0
   433  0.10236613E+00     0   127   122     0     0     0
   3
   434  0.89793158E+00     0   450   130     0     0     0
   434  0.49279111E-04     0   429   129   132     0     0
   434  0.10201925E+00     0   121   127     0     0     0
   3
   435  0.52935691E-02     0   131   124     0     0     0
   435  0.49734864E+00     0   131   130     0     0     0
   435  0.49735782E+00     0   129   132     0     0     0
   2
   436  0.63254535E-01     0   450   132     0     0     0
   436  0.93674552E+00     0   199   435     0     0     0
   4
   437  0.39869061E-04     0   429   121   131     0     0
   437  0.67954847E-04     0   435   121   125     0     0
   437  0.49994612E+00     0   123   122     0     0     0
   437  0.49994612E+00     0   121   124     0     0     0
   0
   2
   439  0.37056249E+00     0   429   123   131     0     0
   439  0.62943769E+00     0   435   123   125     0     0
   0
   3
   441  0.64948075E-01     0   450   125     0     0     0
   441  0.46717238E+00     0   200   429     0     0     0
   441  0.46787956E+00     0   203   429     0     0     0
   0
   4
   443  0.39869061E-04     0   435   127   125     0     0
   443  0.67954847E-04     0   429   127   131     0     0
   443  0.49994612E+00     0   129   128     0     0     0
   443  0.49994612E+00     0   127   130     0     0     0
   0
   2
   445  0.37056249E+00     0   435   129   125     0     0
   445  0.62943769E+00     0   429   129   131     0     0
   0
   3
   447  0.64948075E-01     0   450   131     0     0     0
   447  0.46717238E+00     0   200   435     0     0     0
   447  0.46787956E+00     0   203   435     0     0     0
   0
  24
   449  0.17942594E-01     0   408     2     0     0     0
   449  0.17942594E-01     0   402     8     0     0     0
   449  0.17870432E-01     0   407     1     0     0     0
   449  0.17870432E-01     0   401     7     0     0     0
   449  0.34302402E-01     0   420     2     0     0     0
   449  0.34302402E-01     0   414     8     0     0     0
   449  0.36491618E-01     0   419     1     0     0     0
   449  0.36491618E-01     0   413     7     0     0     0
   449  0.17874669E-01     0   409     3     0     0     0
   449  0.17874669E-01     0   403     9     0     0     0
   449  0.36501851E-01     0   421     3     0     0     0
   449  0.36501851E-01     0   415     9     0     0     0
   449  0.17946718E-01     0   410     4     0     0     0
   449  0.17946718E-01     0   404    10     0     0     0
   449  0.34302302E-01     0   422     4     0     0     0
   449  0.34302302E-01     0   416    10     0     0     0
   449  0.59594437E-01     0   411     5     0     0     0
   449  0.59594437E-01     0   405    11     0     0     0
   449  0.54273121E-01     0   423     5     0     0     0
   449  0.54273121E-01     0   417    11     0     0     0
   449  0.11422098E+00     0   412     6     0     0     0
   449  0.11422098E+00     0   406    12     0     0     0
   449  0.58678944E-01     0   424     6     0     0     0
   449  0.58678944E-01     0   418    12     0     0     0
   6
   450  0.88371374E-01     0   437   127     0     0     0
   450  0.88371374E-01     0   443   121     0     0     0
   450  0.86127333E-01     0   439   129     0     0     0
   450  0.86127333E-01     0   445   123     0     0     0
   450  0.32550138E+00     0   429   131     0     0     0
   450  0.32550138E+00     0   435   125     0     0     0
  20
   451  0.28583244E-03     0   450   200     0     0     0
   451  0.36910658E-02     0   450   203     0     0     0
   451  0.75586885E-01     0   425   127     0     0     0
   451  0.75586885E-01     0   431   121     0     0     0
   451  0.75690307E-01     0   427   129     0     0     0
   451  0.75690307E-01     0   433   123     0     0     0
   451  0.12362932E-04     0   437   127     0     0     0
   451  0.12362932E-04     0   443   121     0     0     0
   451  0.12329616E-04     0   439   129     0     0     0
   451  0.12329616E-04     0   445   123     0     0     0
   451  0.14513898E-01     0   429   131     0     0     0
   451  0.14513898E-01     0   435   125     0     0     0
   451  0.88129461E-01     0   441   131     0     0     0
   451  0.88129461E-01     0   447   125     0     0     0
   451  0.75784139E-01     0   426   128     0     0     0
   451  0.75784139E-01     0   432   122     0     0     0
   451  0.75887136E-01     0   428   130     0     0     0
   451  0.75887136E-01     0   434   124     0     0     0
   451  0.92395052E-01     0   430   132     0     0     0
   451  0.92395052E-01     0   436   126     0     0     0
  25
   452  0.22151981E+00     0   454   199     0     0     0
   452  0.22151981E+00     0   456   198     0     0     0
   452  0.96488528E-01     0   450   200     0     0     0
   452  0.21528740E+00     0   451   200     0     0     0
   452  0.60519680E-04     0   450     5    11     0     0
   452  0.13714872E-01     0   450   203     0     0     0
   452  0.25655723E-02     0   451   203     0     0     0
   452  0.11257264E-04     0   425   127     0     0     0
   452  0.11257264E-04     0   431   121     0     0     0
   452  0.11262850E-04     0   427   129     0     0     0
   452  0.11262850E-04     0   433   123     0     0     0
   452  0.35492598E-04     0   437   127     0     0     0
   452  0.35492598E-04     0   443   121     0     0     0
   452  0.35438879E-04     0   439   129     0     0     0
   452  0.35438879E-04     0   445   123     0     0     0
   452  0.78090221E-01     0   429   131     0     0     0
   452  0.78090221E-01     0   435   125     0     0     0
   452  0.36066256E-01     0   441   131     0     0     0
   452  0.36066256E-01     0   447   125     0     0     0
   452  0.55853132E-04     0   426   128     0     0     0
   452  0.55853132E-04     0   432   122     0     0     0
   452  0.55880770E-04     0   428   130     0     0     0
   452  0.55880770E-04     0   434   124     0     0     0
   452  0.60172810E-04     0   430   132     0     0     0
   452  0.60172810E-04     0   436   126     0     0     0
  25
   453  0.22172025E+00     0   454   199     0     0     0
   453  0.22172025E+00     0   456   198     0     0     0
   453  0.13514993E-01     0   450   200     0     0     0
   453  0.29684126E-02     0   451   200     0     0     0
   453  0.58338777E-04     0   450     5    11     0     0
   453  0.91423087E-01     0   450   203     0     0     0
   453  0.20478949E+00     0   451   203     0     0     0
   453  0.17654496E-02     0   425   127     0     0     0
   453  0.17654496E-02     0   431   121     0     0     0
   453  0.17663151E-02     0   427   129     0     0     0
   453  0.17663151E-02     0   433   123     0     0     0
   453  0.23473521E-03     0   437   127     0     0     0
   453  0.23473521E-03     0   443   121     0     0     0
   453  0.23438291E-03     0   439   129     0     0     0
   453  0.23438291E-03     0   445   123     0     0     0
   453  0.71070887E-01     0   429   131     0     0     0
   453  0.71070887E-01     0   435   125     0     0     0
   453  0.38275044E-01     0   441   131     0     0     0
   453  0.38275044E-01     0   447   125     0     0     0
   453  0.27806659E-02     0   426   128     0     0     0
   453  0.27806659E-02     0   432   122     0     0     0
   453  0.27820254E-02     0   428   130     0     0     0
   453  0.27820254E-02     0   434   124     0     0     0
   453  0.29930673E-02     0   430   132     0     0     0
   453  0.29930673E-02     0   436   126     0     0     0
   8
   454  0.39615813E-02     0   450   198     0     0     0
   454  0.15306021E+00     0   426   127     0     0     0
   454  0.15326808E+00     0   428   129     0     0     0
   454  0.18780524E+00     0   430   131     0     0     0
   454  0.14972802E+00     0   431   122     0     0     0
   454  0.14993277E+00     0   433   124     0     0     0
   454  0.28865704E-01     0   435   126     0     0     0
   454  0.17337844E+00     0   447   126     0     0     0
  11
   455  0.10466505E+00     0   450   198     0     0     0
   455  0.22337542E+00     0   451   198     0     0     0
   455  0.35609365E-02     0   426   127     0     0     0
   455  0.35626774E-02     0   428   129     0     0     0
   455  0.73914096E-01     0   430   131     0     0     0
   455  0.55632722E-02     0   431   122     0     0     0
   455  0.55659995E-02     0   433   124     0     0     0
   455  0.14066431E+00     0   435   126     0     0     0
   455  0.10728478E-01     0   447   126     0     0     0
   455  0.21966968E+00     0   454   200     0     0     0
   455  0.20873016E+00     0   454   203     0     0     0
   8
   456  0.39615813E-02     0   450   199     0     0     0
   456  0.15306021E+00     0   432   121     0     0     0
   456  0.15326808E+00     0   434   123     0     0     0
   456  0.18780524E+00     0   436   125     0     0     0
   456  0.14972802E+00     0   425   128     0     0     0
   456  0.14993277E+00     0   427   130     0     0     0
   456  0.28865704E-01     0   429   132     0     0     0
   456  0.17337844E+00     0   441   132     0     0     0
  11
   457  0.10466505E+00     0   450   199     0     0     0
   457  0.22337542E+00     0   451   199     0     0     0
   457  0.35609365E-02     0   432   121     0     0     0
   457  0.35626774E-02     0   434   123     0     0     0
   457  0.73914096E-01     0   436   125     0     0     0
   457  0.55632722E-02     0   425   128     0     0     0
   457  0.55659995E-02     0   427   130     0     0     0
   457  0.14066431E+00     0   429   132     0     0     0
   457  0.10728478E-01     0   441   132     0     0     0
   457  0.21966968E+00     0   456   200     0     0     0
   457  0.20873016E+00     0   456   203     0     0     0
  28
   203  0.15873488E-03     0   123   129     0     0     0
   203  0.45407906E-01     0   125   131     0     0     0
   203  0.19045263E-02     0     3     9     0     0     0
   203  0.74551004E+00     0     5    11     0     0     0
   203  0.37056111E-01     0     4    10     0     0     0
   203  0.17717497E-02     0    59    59     0     0     0
   203  0.34651939E-01     0    13    13     0     0     0
   203  0.67468416E-02     0   198   121   128     0     0
   203  0.67468416E-02     0   198   123   130     0     0
   203  0.67468416E-02     0   198   125   132     0     0
   203  0.20240523E-01     0   198     8     1     0     0
   203  0.20240523E-01     0   198    10     3     0     0
   203  0.67468416E-02     0   199   127   122     0     0
   203  0.67468416E-02     0   199   129   124     0     0
   203  0.67468416E-02     0   199   131   126     0     0
   203  0.20240523E-01     0   199     2     7     0     0
   203  0.20240523E-01     0   199     4     9     0     0
   203  0.82722446E-03     0   200   122   128     0     0
   203  0.82722446E-03     0   200   124   130     0     0
   203  0.82722446E-03     0   200   126   132     0     0
   203  0.41633379E-03     0   200   121   127     0     0
   203  0.41633379E-03     0   200   123   129     0     0
   203  0.41633379E-03     0   200   125   131     0     0
   203  0.14263241E-02     0   200     2     8     0     0
   203  0.14263241E-02     0   200     4    10     0     0
   203  0.18374569E-02     0   200     1     7     0     0
   203  0.18374569E-02     0   200     3     9     0     0
   203  0.18374569E-02     0   200     5    11     0     0
   6
   204  0.27597536E-03     0   123   129     0     0     0
   204  0.79043083E-01     0   125   131     0     0     0
   204  0.32213647E-02     0     3     9     0     0     0
   204  0.90201980E+00     0     5    11     0     0     0
   204  0.16378756E-02     0     6    12     0     0     0
   204  0.13801986E-01     0   429   435     0     0     0
   6
   205  0.27592151E-03     0   123   129     0     0     0
   205  0.79027988E-01     0   125   131     0     0     0
   205  0.32207668E-02     0     3     9     0     0     0
   205  0.90199226E+00     0     5    11     0     0     0
   205  0.16726995E-02     0     6    12     0     0     0
   205  0.13810473E-01     0   429   435     0     0     0
   4
   206  0.30666325E-03     0   124   129     0     0     0
   206  0.87832876E-01     0   126   131     0     0     0
   206  0.33045723E-02     0     4     9     0     0     0
   206  0.90855592E+00     0     6    11     0     0     0
   4
   207  0.30666325E-03     0   130   123     0     0     0
   207  0.87832876E-01     0   132   125     0     0     0
   207  0.33045723E-02     0    10     3     0     0     0
   207  0.90855592E+00     0    12     5     0     0     0
   0
   5
     6  0.33333334E+00   100     2     7     5     0     0
     6  0.33333334E+00   100     4     9     5     0     0
     6  0.11111111E+00   100   122   127     5     0     0
     6  0.11111111E+00   100   124   129     5     0     0
     6  0.11111111E+00   100   126   131     5     0     0
   5
    12  0.33333334E+00   100     8     1    11     0     0
    12  0.33333334E+00   100    10     3    11     0     0
    12  0.11111111E+00   100   128   121    11     0     0
    12  0.11111111E+00   100   130   123    11     0     0
    12  0.11111111E+00   100   132   125    11     0     0
     32.90909958     -0.03054552
      0.99957067     -0.00137785      0.02668500     -0.01201178
     -0.00513977     -0.99109608      0.10399619     -0.08298881
      0.01034945     -0.01499971     -0.70678037     -0.70719796
     -0.02692101      0.13229473      0.69923788     -0.70202529
     -0.99307543      0.11747853     -0.11747853     -0.99307543
     -0.98910546      0.14720884     -0.14720884     -0.98910546
     -1.39831185     -0.74635017     -1.46799231
  -3155.13989258  14417.59960938  -5904.74023438
   2041.46997070
    F
  0.00000000E+00  0.00000000E+00  0.00000000E+00  0.46697401E-01 -0.23171600E-19  0.00000000E+00  0.00000000E+00  0.00000000E+00 -0.13604700E-18 -0.46697401E-01  0.23171600E-19 -0.00000000E+00  0.00000000E+00  0.00000000E+00  0.00000000E+00  0.00000000E+00  0.00000000E+00  0.25249099E-06 -0.00000000E+00 -0.00000000E+00  0.13604700E-18 -0.00000000E+00 -0.00000000E+00 -0.25249099E-06  0.00000000E+00  0.00000000E+00  0.00000000E+00
 -0.19894200E-21  0.36433760E-43  0.00000000E+00  0.14012985E-44 -0.43557800E-20  0.00000000E+00  0.00000000E+00  0.00000000E+00 -0.16999700E-18  0.36921799E-09 -0.66584202E-31  0.00000000E+00 -0.31275599E-32  0.80839300E-08  0.00000000E+00  0.00000000E+00  0.00000000E+00  0.31549999E-06  0.00000000E+00  0.00000000E+00  0.00000000E+00  0.00000000E+00  0.00000000E+00  0.00000000E+00  0.00000000E+00  0.00000000E+00  0.00000000E+00
  0.00000000E+00  0.00000000E+00  0.00000000E+00  0.00000000E+00  0.00000000E+00  0.00000000E+00  0.00000000E+00  0.00000000E+00  0.00000000E+00  0.00000000E+00  0.00000000E+00  0.00000000E+00  0.00000000E+00  0.00000000E+00  0.00000000E+00  0.00000000E+00  0.00000000E+00  0.00000000E+00  0.00000000E+00  0.00000000E+00  0.00000000E+00  0.00000000E+00  0.00000000E+00  0.00000000E+00  0.00000000E+00  0.00000000E+00  0.00000000E+00
