#  ISAJET SUSY parameters in SUSY Les Houches Accord 2 format
#  Created by ISALHA 2.0 Last revision: C. Balazs 21 Apr 2009
Block SPINFO   # Program information
     1   ISASUGRA from ISAJET          # Spectrum Calculator
     2   7.80   29-OCT-2009 12:50:36   # Version number
Block MODSEL   # Model selection
     1     0   #   MsR(Q)          MbR(Q)                          
Block SMINPUTS   # Standard Model inputs
     1     1.27837601E+02   # alpha_em^(-1)
     2     1.16570000E-05   # G_Fermi
     3     1.17200002E-01   # alpha_s(M_Z)
     4     9.11699982E+01   # m_{Z}(pole)
     5     4.19999981E+00   # m_{b}(m_{b})
     6     1.72500000E+02   # m_{top}(pole)
     7     1.77699995E+00   # m_{tau}(pole)
Block MINPAR   # SUSY breaking input parameters
Block MASS   # Scalar and gaugino mass spectrum
#  PDG code   mass                 particle
        24     8.04229965E+01   #  W^+
        25     1.20300003E+02   #  h^0            
        35     2.51769189E+03   #  H^0            
        36     2.50000000E+03   #  A^0            
        37     2.51649878E+03   #  H^+            
   1000001     1.10127673E+03   #  dnl            
   1000002     1.09895569E+03   #  upl            
   1000003     1.10127673E+03   #  stl            
   1000004     1.09895654E+03   #  chl            
   1000005     1.10022693E+03   #  b1             
   1000006     1.10814685E+03   #  t1             
   1000011     2.50035645E+03   #  el-            
   1000012     2.49933496E+03   #  nuel           
   1000013     2.50035645E+03   #  mul-           
   1000014     2.49933496E+03   #  numl           
   1000015     2.50029565E+03   #  tau1           
   1000016     2.49933496E+03   #  nutl           
   1000021     9.00000000E+02   #  glss           
   1000022     1.49481934E+02   #  z1ss           
   1000023     2.42853882E+03   #  z2ss           
   1000024     2.42832593E+03   #  w1ss           
   1000025    -2.50040601E+03   #  z3ss           
   1000035     2.57238525E+03   #  z4ss           
   1000037     2.57219092E+03   #  w2ss           
   2000001     1.10023376E+03   #  dnr            
   2000002     1.09953235E+03   #  upr            
   2000003     1.10023376E+03   #  str            
   2000004     1.09953320E+03   #  chr            
   2000005     1.10129041E+03   #  b2             
   2000006     1.10876074E+03   #  t2             
   2000011     2.50030859E+03   #  er-            
   2000013     2.50030859E+03   #  mur-           
   2000015     2.50037036E+03   #  tau2           
Block ALPHA   # Effective Higgs mixing parameter
         -3.22592527E-01   # alpha
Block STOPMIX   # stop mixing matrix
  1  1     7.15858817E-01   # O_{11}
  1  2     6.98245049E-01   # O_{12}
  2  1    -6.98245049E-01   # O_{21}
  2  2     7.15858817E-01   # O_{22}
Block SBOTMIX   # sbottom mixing matrix
  1  1     5.52335052E-07   # O_{11}
  1  2    -1.00000000E+00   # O_{12}
  2  1     1.00000000E+00   # O_{21}
  2  2     5.52335052E-07   # O_{22}
Block STAUMIX   # stau mixing matrix
  1  1     2.81731172E-06   # O_{11}
  1  2    -1.00000000E+00   # O_{12}
  2  1     1.00000000E+00   # O_{21}
  2  2     2.81731172E-06   # O_{22}
Block NMIX   # neutralino mixing matrix
  1  1     9.99830484E-01   #
  1  2    -4.00799792E-04   #
  1  3     1.71788409E-02   #
  1  4    -6.62148744E-03   #
  2  1     1.22056603E-02   #
  2  2     7.08085597E-01   #
  2  3    -5.02838492E-01   #
  2  4     4.95600075E-01   #
  3  1    -7.46043026E-03   #
  3  2     7.19459588E-03   #
  3  3     7.06954181E-01   #
  3  4     7.07183778E-01   #
  4  1     1.15966070E-02   #
  4  2    -7.06089973E-01   #
  4  3    -4.97065961E-01   #
  4  4     5.04210234E-01   #
Block UMIX   # chargino U mixing matrix
  1  1    -7.02002406E-01   # U_{11}
  1  2     7.12174535E-01   # U_{12}
  2  1    -7.12174535E-01   # U_{21}
  2  2    -7.02002406E-01   # U_{22}
Block VMIX   # chargino V mixing matrix
  1  1    -7.12174356E-01   # V_{11}
  1  2     7.02002585E-01   # V_{12}
  2  1    -7.02002585E-01   # V_{21}
  2  2    -7.12174356E-01   # V_{22}
Block GAUGE Q=  0.00000000E+00   #
     1     0.00000000E+00   # g`
     2     0.00000000E+00   # g_2
     3     0.00000000E+00   # g_3
Block YU Q=  0.00000000E+00   #
  3  3     0.00000000E+00   # y_t
Block YD Q=  0.00000000E+00   #
  3  3     0.00000000E+00   # y_b
Block YE Q=  0.00000000E+00   #
  3  3     0.00000000E+00   # y_tau
Block HMIX Q=  0.00000000E+00   # Higgs mixing parameters
     1     0.00000000E+00   # mu(Q)
     2     0.00000000E+00   # tan(beta)(M_GUT)
     3     0.00000000E+00   # Higgs vev at Q
     4     6.25000000E+06   # m_A^2(Q)
Block MSOFT Q=  0.00000000E+00   # DRbar SUSY breaking parameters
     1     0.00000000E+00   # M_1(Q)          
     2     0.00000000E+00   # M_2(Q)          
     3     0.00000000E+00   # M_3(Q)          
    31     0.00000000E+00   # MeL(Q)          
    32     0.00000000E+00   # MmuL(Q)         
    33     0.00000000E+00   # MtauL(Q)        
    34     0.00000000E+00   # MeR(Q)          
    35     0.00000000E+00   # MmuR(Q)         
    36     0.00000000E+00   # MtauR(Q)        
    41     0.00000000E+00   # MqL1(Q)         
    42     0.00000000E+00   # MqL2(Q)         
    43     0.00000000E+00   # MqL3(Q)         
    44     0.00000000E+00   # MuR(Q)          
    45     0.00000000E+00   # McR(Q)          
    46     0.00000000E+00   # MtR(Q)          
    47     0.00000000E+00   # MdR(Q)          
    48     0.00000000E+00   # MsR(Q)          
    49     0.00000000E+00   # MbR(Q)          
Block AU Q=  0.00000000E+00   #
  1  1     0.00000000E+00   # A_u
  2  2     0.00000000E+00   # A_c
  3  3     0.00000000E+00   # A_t
Block AD Q=  0.00000000E+00   #
  1  1     0.00000000E+00   # A_d
  2  2     0.00000000E+00   # A_s
  3  3     0.00000000E+00   # A_b
Block AE Q=  0.00000000E+00   #
  1  1     0.00000000E+00   # A_e
  2  2     0.00000000E+00   # A_mu
  3  3     0.00000000E+00   # A_tau
#         PDG         Width
DECAY   1000021  4.18927707E-03   # GLSS  decays
#          BR          NDA       ID1       ID2       ID3       ID4
      6.22916778E-05    2      1000022        21                       # GLSS   -->  Z1SS   GL                 
      3.06629777E-01    3      1000022         2        -2             # GLSS   -->  Z1SS   UP     UB          
      8.98107141E-02    3      1000022         1        -1             # GLSS   -->  Z1SS   DN     DB          
      8.98107141E-02    3      1000022         3        -3             # GLSS   -->  Z1SS   ST     SB          
      3.06628257E-01    3      1000022         4        -4             # GLSS   -->  Z1SS   CH     CB          
      8.97178948E-02    3      1000022         5        -5             # GLSS   -->  Z1SS   BT     BB          
      1.17295779E-01    3      1000022         6        -6             # GLSS   -->  Z1SS   TP     TB          
      4.44495381E-05    2      1000039        21                       # GLSS   -->  GVSS   GL                 
#         PDG         Width
DECAY   1000002  7.39659452E+00   # UPL   decays
#          BR          NDA       ID1       ID2       ID3       ID4
      2.01267544E-02    2      1000022         2                       # UPL    -->  Z1SS   UP                 
      9.79873240E-01    2      1000021         2                       # UPL    -->  GLSS   UP                 
#         PDG         Width
DECAY   1000001  7.53707790E+00   # DNL   decays
#          BR          NDA       ID1       ID2       ID3       ID4
      1.99704897E-02    2      1000022         1                       # DNL    -->  Z1SS   DN                 
      9.80029464E-01    2      1000021         1                       # DNL    -->  GLSS   DN                 
#         PDG         Width
DECAY   1000003  7.53707790E+00   # STL   decays
#          BR          NDA       ID1       ID2       ID3       ID4
      1.99704897E-02    2      1000022         3                       # STL    -->  Z1SS   ST                 
      9.80029464E-01    2      1000021         3                       # STL    -->  GLSS   ST                 
#         PDG         Width
DECAY   1000004  7.39644146E+00   # CHL   decays
#          BR          NDA       ID1       ID2       ID3       ID4
      2.01271269E-02    2      1000022         4                       # CHL    -->  Z1SS   CH                 
      9.79872882E-01    2      1000021         4                       # CHL    -->  GLSS   CH                 
#         PDG         Width
DECAY   1000005  7.91972446E+00   # BT1   decays
#          BR          NDA       ID1       ID2       ID3       ID4
      7.56110102E-02    2      1000022         5                       # BT1    -->  Z1SS   BT                 
      9.24389005E-01    2      1000021         5                       # BT1    -->  GLSS   BT                 
#         PDG         Width
DECAY   1000006  8.51581192E+00   # TP1   decays
#          BR          NDA       ID1       ID2       ID3       ID4
      3.76306595E-08    2      1000022         4                       # TP1    -->  Z1SS   CH                 
      8.53784859E-01    2      1000021         6                       # TP1    -->  GLSS   TP                 
      1.46215022E-01    2      1000022         6                       # TP1    -->  Z1SS   TP                 
#         PDG         Width
DECAY   2000002  9.67586517E+00   # UPR   decays
#          BR          NDA       ID1       ID2       ID3       ID4
      2.47390658E-01    2      1000022         2                       # UPR    -->  Z1SS   UP                 
      7.52609313E-01    2      1000021         2                       # UPR    -->  GLSS   UP                 
#         PDG         Width
DECAY   2000001  7.92292023E+00   # DNR   decays
#          BR          NDA       ID1       ID2       ID3       ID4
      7.55832642E-02    2      1000022         1                       # DNR    -->  Z1SS   DN                 
      9.24416721E-01    2      1000021         1                       # DNR    -->  GLSS   DN                 
#         PDG         Width
DECAY   2000003  7.92292023E+00   # STR   decays
#          BR          NDA       ID1       ID2       ID3       ID4
      7.55832642E-02    2      1000022         3                       # STR    -->  Z1SS   ST                 
      9.24416721E-01    2      1000021         3                       # STR    -->  GLSS   ST                 
#         PDG         Width
DECAY   2000004  9.67570972E+00   # CHR   decays
#          BR          NDA       ID1       ID2       ID3       ID4
      2.47394070E-01    2      1000022         4                       # CHR    -->  Z1SS   CH                 
      7.52605975E-01    2      1000021         4                       # CHR    -->  GLSS   CH                 
#         PDG         Width
DECAY   2000005  7.53514051E+00   # BT2   decays
#          BR          NDA       ID1       ID2       ID3       ID4
      1.99766029E-02    2      1000022         5                       # BT2    -->  Z1SS   BT                 
      9.80023384E-01    2      1000021         5                       # BT2    -->  GLSS   BT                 
#         PDG         Width
DECAY   2000006  2.02185726E+00   # TP2   decays
#          BR          NDA       ID1       ID2       ID3       ID4
      1.58495666E-07    2      1000022         4                       # TP2    -->  Z1SS   CH                 
      4.10856664E-01    2      1000021         6                       # TP2    -->  GLSS   TP                 
      5.89143157E-01    2      1000022         6                       # TP2    -->  Z1SS   TP                 
#         PDG         Width
DECAY   1000011  3.20173049E+00   # EL-   decays
#          BR          NDA       ID1       ID2       ID3       ID4
      9.84158218E-01    2      1000022        11                       # EL-    -->  Z1SS   E-                 
      5.38449083E-03    2      1000023        11                       # EL-    -->  Z2SS   E-                 
      1.04477694E-02    2     -1000024        12                       # EL-    -->  W1SS-  NUE                
      9.62539798E-06    2           11   1000039                       # EL-    -->  E-     GVSS               
#         PDG         Width
DECAY   1000013  3.20173049E+00   # MUL-  decays
#          BR          NDA       ID1       ID2       ID3       ID4
      9.84158218E-01    2      1000022        13                       # MUL-   -->  Z1SS   MU-                
      5.38448477E-03    2      1000023        13                       # MUL-   -->  Z2SS   MU-                
      1.04477694E-02    2     -1000024        14                       # MUL-   -->  W1SS-  NUM                
      9.62539798E-06    2           13   1000039                       # MUL-   -->  MU-    GVSS               
#         PDG         Width
DECAY   1000015  1.26222897E+01   # TAU1- decays
#          BR          NDA       ID1       ID2       ID3       ID4
      9.99987483E-01    2      1000022        15                       # TAU1-  -->  Z1SS   TAU-               
      3.72085310E-06    2      1000023        15                       # TAU1-  -->  Z2SS   TAU-               
      6.41875067E-06    2     -1000024        16                       # TAU1-  -->  W1SS-  NUT                
      2.44124658E-06    2           15   1000039                       # TAU1-  -->  TAU-   GVSS               
#         PDG         Width
DECAY   1000012  3.20856476E+00   # NUEL  decays
#          BR          NDA       ID1       ID2       ID3       ID4
      9.84523118E-01    2      1000022        12                       # NUEL   -->  Z1SS   NUE                
      5.03116241E-03    2      1000023        12                       # NUEL   -->  Z2SS   NUE                
      1.04361018E-02    2      1000024        11                       # NUEL   -->  W1SS+  E-                 
      9.58528926E-06    2           12   1000039                       # NUEL   -->  NUE    GVSS               
#         PDG         Width
DECAY   1000014  3.20856476E+00   # NUML  decays
#          BR          NDA       ID1       ID2       ID3       ID4
      9.84523118E-01    2      1000022        14                       # NUML   -->  Z1SS   NUM                
      5.03116241E-03    2      1000023        14                       # NUML   -->  Z2SS   NUM                
      1.04360916E-02    2      1000024        13                       # NUML   -->  W1SS+  MU-                
      9.58528926E-06    2           14   1000039                       # NUML   -->  NUM    GVSS               
#         PDG         Width
DECAY   1000016  3.20855260E+00   # NUTL  decays
#          BR          NDA       ID1       ID2       ID3       ID4
      9.84526873E-01    2      1000022        16                       # NUTL   -->  Z1SS   NUT                
      5.03118150E-03    2      1000023        16                       # NUTL   -->  Z2SS   NUT                
      1.04323858E-02    2      1000024        15                       # NUTL   -->  W1SS+  TAU-               
      9.58532564E-06    2           16   1000039                       # NUTL   -->  NUT    GVSS               
#         PDG         Width
DECAY   2000011  1.26222334E+01   # ER-   decays
#          BR          NDA       ID1       ID2       ID3       ID4
      9.99997139E-01    2      1000022        11                       # ER-    -->  Z1SS   E-                 
      4.80593144E-07    2      1000023        11                       # ER-    -->  Z2SS   E-                 
      2.83869438E-40    3      1000015        12       -16             # ER-    -->  TAU1-  NUE    ANUT        
      2.44132502E-06    2           11   1000039                       # ER-    -->  E-     GVSS               
#         PDG         Width
DECAY   2000013  1.26222334E+01   # MUR-  decays
#          BR          NDA       ID1       ID2       ID3       ID4
      9.99997139E-01    2      1000022        13                       # MUR-   -->  Z1SS   MU-                
      4.80592632E-07    2      1000023        13                       # MUR-   -->  Z2SS   MU-                
      1.21620574E-35    3      1000015        14       -16             # MUR-   -->  TAU1-  NUM    ANUT        
      2.44132502E-06    2           13   1000039                       # MUR-   -->  MU-    GVSS               
#         PDG         Width
DECAY   2000015  3.20174360E+00   # TAU2- decays
#          BR          NDA       ID1       ID2       ID3       ID4
      9.84163702E-01    2      1000022        15                       # TAU2-  -->  Z1SS   TAU-               
      5.38468268E-03    2      1000023        15                       # TAU2-  -->  Z2SS   TAU-               
      1.04516475E-02    2     -1000024        16                       # TAU2-  -->  W1SS-  NUT                
#         PDG         Width
DECAY   1000022  1.92892213E-11   # Z1SS  decays
#          BR          NDA       ID1       ID2       ID3       ID4
      9.36365068E-01    2      1000039        22                       # Z1SS   -->  GVSS   GM                 
      1.95385683E-02    3      1000039        11       -11             # Z1SS   -->  GVSS   E-     E+          
      4.40963209E-02    2      1000039        23                       # Z1SS   -->  GVSS   Z0                 
      6.53576926E-09    2      1000039        25                       # Z1SS   -->  GVSS   HL0                
#         PDG         Width
DECAY   1000023  9.64555969E+01   # Z2SS  decays
#          BR          NDA       ID1       ID2       ID3       ID4
      1.15451328E-07    2      1000022        22                       # Z2SS   -->  Z1SS   GM                 
      1.38956215E-03    2      1000022        23                       # Z2SS   -->  Z1SS   Z0                 
      7.62109025E-08    3      1000022         5        -5             # Z2SS   -->  Z1SS   BT     BB          
      6.92353387E-06    3      1000022        11       -11             # Z2SS   -->  Z1SS   E-     E+          
      6.92353387E-06    3      1000022        13       -13             # Z2SS   -->  Z1SS   MU-    MU+         
      7.04363129E-06    3      1000022        15       -15             # Z2SS   -->  Z1SS   TAU-   TAU+        
      6.70827876E-06    3      1000022        12       -12             # Z2SS   -->  Z1SS   NUE    ANUE        
      6.70827876E-06    3      1000022        14       -14             # Z2SS   -->  Z1SS   NUM    ANUM        
      6.70827876E-06    3      1000022        16       -16             # Z2SS   -->  Z1SS   NUT    ANUT        
      7.43595883E-03    2      1000022        25                       # Z2SS   -->  Z1SS   HL0                
      5.07241562E-02    2      1000002        -2                       # Z2SS   -->  UPL    UB                 
      5.07241562E-02    2     -1000002         2                       # Z2SS   -->  UBL    UP                 
      4.99784052E-02    2      1000001        -1                       # Z2SS   -->  DNL    DB                 
      4.99784052E-02    2     -1000001         1                       # Z2SS   -->  DBL    DN                 
      4.99784052E-02    2      1000003        -3                       # Z2SS   -->  STL    SB                 
      4.99784052E-02    2     -1000003         3                       # Z2SS   -->  SBL    ST                 
      5.07241003E-02    2      1000004        -4                       # Z2SS   -->  CHL    CB                 
      5.07241003E-02    2     -1000004         4                       # Z2SS   -->  CBL    CH                 
      8.03889452E-06    2      2000002        -2                       # Z2SS   -->  UPR    UB                 
      8.03889452E-06    2     -2000002         2                       # Z2SS   -->  UBR    UP                 
      2.00840100E-06    2      2000001        -1                       # Z2SS   -->  DNR    DB                 
      2.00840100E-06    2     -2000001         1                       # Z2SS   -->  DBR    DN                 
      2.00840100E-06    2      2000003        -3                       # Z2SS   -->  STR    SB                 
      2.00840100E-06    2     -2000003         3                       # Z2SS   -->  SBR    ST                 
      8.03888724E-06    2      2000004        -4                       # Z2SS   -->  CHR    CB                 
      8.03888724E-06    2     -2000004         4                       # Z2SS   -->  CBR    CH                 
      3.02359462E-04    2      1000005        -5                       # Z2SS   -->  BT1    BB                 
      3.02359462E-04    2     -1000005         5                       # Z2SS   -->  BB1    BT                 
      5.03180996E-02    2      2000005        -5                       # Z2SS   -->  BT2    BB                 
      5.03180996E-02    2     -2000005         5                       # Z2SS   -->  BB2    BT                 
      2.02268288E-01    2      1000006        -6                       # Z2SS   -->  TP1    TB                 
      2.02268288E-01    2     -1000006         6                       # Z2SS   -->  TB1    TP                 
      4.12526280E-02    2      2000006        -6                       # Z2SS   -->  TP2    TB                 
      4.12526280E-02    2     -2000006         6                       # Z2SS   -->  TB2    TP                 
      3.41722703E-08    2      1000039        22                       # Z2SS   -->  GVSS   GM                 
      8.70993278E-10    3      1000039        11       -11             # Z2SS   -->  GVSS   E-     E+          
      1.58111845E-07    2      1000039        23                       # Z2SS   -->  GVSS   Z0                 
      1.31934721E-08    2      1000039        25                       # Z2SS   -->  GVSS   HL0                
#         PDG         Width
DECAY   1000025  7.28777313E+01   # Z3SS  decays
#          BR          NDA       ID1       ID2       ID3       ID4
      1.99816395E-08    2      1000022        22                       # Z3SS   -->  Z1SS   GM                 
      7.23220303E-11    2      1000023        22                       # Z3SS   -->  Z2SS   GM                 
      1.16554766E-05    3     -1000024         2        -1             # Z3SS   -->  W1SS-  UP     DB          
      3.88515900E-06    3     -1000024        12       -11             # Z3SS   -->  W1SS-  NUE    E+          
      3.88515900E-06    3     -1000024        14       -13             # Z3SS   -->  W1SS-  NUM    MU+         
      1.16554766E-05    3      1000024         1        -2             # Z3SS   -->  W1SS+  DN     UB          
      3.88515900E-06    3      1000024        11       -12             # Z3SS   -->  W1SS+  E-     ANUE        
      3.88515900E-06    3      1000024        13       -14             # Z3SS   -->  W1SS+  MU-    ANUM        
      1.16554766E-05    3     -1000024         4        -3             # Z3SS   -->  W1SS-  CH     SB          
      3.88515900E-06    3     -1000024        16       -15             # Z3SS   -->  W1SS-  NUT    TAU+        
      1.16554766E-05    3      1000024         3        -4             # Z3SS   -->  W1SS+  ST     CB          
      3.88515900E-06    3      1000024        15       -16             # Z3SS   -->  W1SS+  TAU-   ANUT        
      1.98018141E-02    2      1000022        23                       # Z3SS   -->  Z1SS   Z0                 
      2.49643108E-07    3      1000022         5        -5             # Z3SS   -->  Z1SS   BT     BB          
      3.31382779E-08    3      1000022        15       -15             # Z3SS   -->  Z1SS   TAU-   TAU+        
      2.59685953E-06    3      1000023         2        -2             # Z3SS   -->  Z2SS   UP     UB          
      3.34866763E-06    3      1000023         1        -1             # Z3SS   -->  Z2SS   DN     DB          
      3.34866763E-06    3      1000023         3        -3             # Z3SS   -->  Z2SS   ST     SB          
      2.59685953E-06    3      1000023         4        -4             # Z3SS   -->  Z2SS   CH     CB          
      3.23733639E-06    3      1000023         5        -5             # Z3SS   -->  Z2SS   BT     BB          
      7.59643626E-07    3      1000023        11       -11             # Z3SS   -->  Z2SS   E-     E+          
      7.59643626E-07    3      1000023        13       -13             # Z3SS   -->  Z2SS   MU-    MU+         
      7.55127019E-07    3      1000023        15       -15             # Z3SS   -->  Z2SS   TAU-   TAU+        
      1.51145184E-06    3      1000023        12       -12             # Z3SS   -->  Z2SS   NUE    ANUE        
      1.51145184E-06    3      1000023        14       -14             # Z3SS   -->  Z2SS   NUM    ANUM        
      1.51145184E-06    3      1000023        16       -16             # Z3SS   -->  Z2SS   NUT    ANUT        
      3.82142980E-03    2      1000022        25                       # Z3SS   -->  Z1SS   HL0                
      4.78951506E-06    2      1000002        -2                       # Z3SS   -->  UPL    UB                 
      4.78951506E-06    2     -1000002         2                       # Z3SS   -->  UBL    UP                 
      1.03155617E-05    2      1000001        -1                       # Z3SS   -->  DNL    DB                 
      1.03155617E-05    2     -1000001         1                       # Z3SS   -->  DBL    DN                 
      1.03155617E-05    2      1000003        -3                       # Z3SS   -->  STL    SB                 
      1.03155617E-05    2     -1000003         3                       # Z3SS   -->  SBL    ST                 
      4.78951006E-06    2      1000004        -4                       # Z3SS   -->  CHL    CB                 
      4.78951006E-06    2     -1000004         4                       # Z3SS   -->  CBL    CH                 
      4.21305140E-06    2      2000002        -2                       # Z3SS   -->  UPR    UB                 
      4.21305140E-06    2     -2000002         2                       # Z3SS   -->  UBR    UP                 
      1.05261859E-06    2      2000001        -1                       # Z3SS   -->  DNR    DB                 
      1.05261859E-06    2     -2000001         1                       # Z3SS   -->  DBR    DN                 
      1.05261859E-06    2      2000003        -3                       # Z3SS   -->  STR    SB                 
      1.05261859E-06    2     -2000003         3                       # Z3SS   -->  SBR    ST                 
      4.21304821E-06    2      2000004        -4                       # Z3SS   -->  CHR    CB                 
      4.21304821E-06    2     -2000004         4                       # Z3SS   -->  CBR    CH                 
      8.34920793E-04    2      1000005        -5                       # Z3SS   -->  BT1    BB                 
      8.34920793E-04    2     -1000005         5                       # Z3SS   -->  BB1    BT                 
      8.44035181E-04    2      2000005        -5                       # Z3SS   -->  BT2    BB                 
      8.44035181E-04    2     -2000005         5                       # Z3SS   -->  BB2    BT                 
      2.03790084E-01    2      1000006        -6                       # Z3SS   -->  TP1    TB                 
      2.03790084E-01    2     -1000006         6                       # Z3SS   -->  TB1    TP                 
      2.82632411E-01    2      2000006        -6                       # Z3SS   -->  TP2    TB                 
      2.82632411E-01    2     -2000006         6                       # Z3SS   -->  TB2    TP                 
      1.08336742E-15    2      1000011       -11                       # Z3SS   -->  EL-    E+                 
      1.08336742E-15    2     -1000011        11                       # Z3SS   -->  EL+    E-                 
      2.94660604E-14    2      2000011       -11                       # Z3SS   -->  ER-    E+                 
      2.94660604E-14    2     -2000011        11                       # Z3SS   -->  ER+    E-                 
      6.75845621E-12    2      1000012       -12                       # Z3SS   -->  NUEL   ANUE               
      6.75845621E-12    2     -1000012        12                       # Z3SS   -->  ANUEL  NUE                
      6.75845621E-12    2      1000014       -14                       # Z3SS   -->  NUML   ANUM               
      6.75845621E-12    2     -1000014        14                       # Z3SS   -->  ANUML  NUM                
      6.75845621E-12    2      1000016       -16                       # Z3SS   -->  NUTL   ANUT               
      6.75845621E-12    2     -1000016        16                       # Z3SS   -->  ANUTL  NUT                
      3.99271805E-12    2      1000039        22                       # Z3SS   -->  GVSS   GM                 
      1.01960676E-13    3      1000039        11       -11             # Z3SS   -->  GVSS   E-     E+          
      4.21309281E-08    2      1000039        23                       # Z3SS   -->  GVSS   Z0                 
      1.67754791E-07    2      1000039        25                       # Z3SS   -->  GVSS   HL0                
      1.87972594E-21    2      1000039        36                       # Z3SS   -->  GVSS   HA0                
#         PDG         Width
DECAY   1000035  1.01295456E+02   # Z4SS  decays
#          BR          NDA       ID1       ID2       ID3       ID4
      6.40982556E-09    2      1000022        22                       # Z4SS   -->  Z1SS   GM                 
      4.07662543E-10    2      1000023        22                       # Z4SS   -->  Z2SS   GM                 
      1.37158718E-09    2      1000025        22                       # Z4SS   -->  Z3SS   GM                 
      9.99955274E-03    2      1000024       -24                       # Z4SS   -->  W1SS+  W-                 
      9.99955274E-03    2     -1000024        24                       # Z4SS   -->  W1SS-  W+                 
      1.48384960E-03    2      1000022        23                       # Z4SS   -->  Z1SS   Z0                 
      3.25447669E-10    2      1000023        23                       # Z4SS   -->  Z2SS   Z0                 
      1.21971013E-07    3      1000022         5        -5             # Z4SS   -->  Z1SS   BT     BB          
      1.61906684E-08    3      1000022        15       -15             # Z4SS   -->  Z1SS   TAU-   TAU+        
      2.29030112E-16    3      1000023         5        -5             # Z4SS   -->  Z2SS   BT     BB          
      3.07231390E-17    3      1000023        15       -15             # Z4SS   -->  Z2SS   TAU-   TAU+        
      1.90078811E-06    3      1000025         2        -2             # Z4SS   -->  Z3SS   UP     UB          
      2.45107890E-06    3      1000025         1        -1             # Z4SS   -->  Z3SS   DN     DB          
      2.45107890E-06    3      1000025         3        -3             # Z4SS   -->  Z3SS   ST     SB          
      1.90078811E-06    3      1000025         4        -4             # Z4SS   -->  Z3SS   CH     CB          
      2.36966207E-06    3      1000025         5        -5             # Z4SS   -->  Z3SS   BT     BB          
      5.56026009E-07    3      1000025        11       -11             # Z4SS   -->  Z3SS   E-     E+          
      5.56026009E-07    3      1000025        13       -13             # Z4SS   -->  Z3SS   MU-    MU+         
      5.52640927E-07    3      1000025        15       -15             # Z4SS   -->  Z3SS   TAU-   TAU+        
      1.10631697E-06    3      1000025        12       -12             # Z4SS   -->  Z3SS   NUE    ANUE        
      1.10631697E-06    3      1000025        14       -14             # Z4SS   -->  Z3SS   NUM    ANUM        
      1.10631697E-06    3      1000025        16       -16             # Z4SS   -->  Z3SS   NUT    ANUT        
      6.91730995E-03    2      1000022        25                       # Z4SS   -->  Z1SS   HL0                
      7.72725670E-08    2      1000023        25                       # Z4SS   -->  Z2SS   HL0                
      5.31026423E-02    2      1000002        -2                       # Z4SS   -->  UPL    UB                 
      5.31026423E-02    2     -1000002         2                       # Z4SS   -->  UBL    UP                 
      5.36442138E-02    2      1000001        -1                       # Z4SS   -->  DNL    DB                 
      5.36442138E-02    2     -1000001         1                       # Z4SS   -->  DBL    DN                 
      5.36442138E-02    2      1000003        -3                       # Z4SS   -->  STL    SB                 
      5.36442138E-02    2     -1000003         3                       # Z4SS   -->  SBL    ST                 
      5.31025901E-02    2      1000004        -4                       # Z4SS   -->  CHL    CB                 
      5.31025901E-02    2     -1000004         4                       # Z4SS   -->  CBL    CH                 
      7.73527790E-06    2      2000002        -2                       # Z4SS   -->  UPR    UB                 
      7.73527790E-06    2     -2000002         2                       # Z4SS   -->  UBR    UP                 
      1.93271603E-06    2      2000001        -1                       # Z4SS   -->  DNR    DB                 
      1.93271603E-06    2     -2000001         1                       # Z4SS   -->  DBR    DN                 
      1.93271603E-06    2      2000003        -3                       # Z4SS   -->  STR    SB                 
      1.93271603E-06    2     -2000003         3                       # Z4SS   -->  SBR    ST                 
      7.73527245E-06    2      2000004        -4                       # Z4SS   -->  CHR    CB                 
      7.73527245E-06    2     -2000004         4                       # Z4SS   -->  CBR    CH                 
      3.14853329E-04    2      1000005        -5                       # Z4SS   -->  BT1    BB                 
      3.14853329E-04    2     -1000005         5                       # Z4SS   -->  BB1    BT                 
      5.39173856E-02    2      2000005        -5                       # Z4SS   -->  BT2    BB                 
      5.39173856E-02    2     -2000005         5                       # Z4SS   -->  BB2    BT                 
      5.35213314E-02    2      1000006        -6                       # Z4SS   -->  TP1    TB                 
      5.35213314E-02    2     -1000006         6                       # Z4SS   -->  TB1    TP                 
      1.64030448E-01    2      2000006        -6                       # Z4SS   -->  TP2    TB                 
      1.64030448E-01    2     -2000006         6                       # Z4SS   -->  TB2    TP                 
      7.97858447E-05    2      1000011       -11                       # Z4SS   -->  EL-    E+                 
      7.97858447E-05    2     -1000011        11                       # Z4SS   -->  EL+    E-                 
      7.97857647E-05    2      1000013       -13                       # Z4SS   -->  MUL-   MU+                
      7.97857647E-05    2     -1000013        13                       # Z4SS   -->  MUL+   MU-                
      2.65154920E-08    2      2000011       -11                       # Z4SS   -->  ER-    E+                 
      2.65154920E-08    2     -2000011        11                       # Z4SS   -->  ER+    E-                 
      2.65154654E-08    2      2000013       -13                       # Z4SS   -->  MUR-   MU+                
      2.65154654E-08    2     -2000013        13                       # Z4SS   -->  MUR+   MU-                
      2.13088668E-07    2      1000015       -15                       # Z4SS   -->  TAU1-  TAU+               
      2.13088668E-07    2     -1000015        15                       # Z4SS   -->  TAU1+  TAU-               
      7.97269313E-05    2      2000015       -15                       # Z4SS   -->  TAU2-  TAU+               
      7.97269313E-05    2     -2000015        15                       # Z4SS   -->  TAU2+  TAU-               
      8.50481447E-05    2      1000012       -12                       # Z4SS   -->  NUEL   ANUE               
      8.50481447E-05    2     -1000012        12                       # Z4SS   -->  ANUEL  NUE                
      8.50481447E-05    2      1000014       -14                       # Z4SS   -->  NUML   ANUM               
      8.50481447E-05    2     -1000014        14                       # Z4SS   -->  ANUML  NUM                
      8.50481447E-05    2      1000016       -16                       # Z4SS   -->  NUTL   ANUT               
      8.50481447E-05    2     -1000016        16                       # Z4SS   -->  ANUTL  NUT                
      3.81716703E-08    2      1000039        22                       # Z4SS   -->  GVSS   GM                 
      9.76572934E-10    3      1000039        11       -11             # Z4SS   -->  GVSS   E-     E+          
      2.06473317E-07    2      1000039        23                       # Z4SS   -->  GVSS   Z0                 
      1.78659985E-08    2      1000039        25                       # Z4SS   -->  GVSS   HL0                
      2.18895811E-13    2      1000039        35                       # Z4SS   -->  GVSS   HH0                
      1.61897053E-13    2      1000039        36                       # Z4SS   -->  GVSS   HA0                
#         PDG         Width
DECAY   1000024  9.65951843E+01   # W1SS+ decays
#          BR          NDA       ID1       ID2       ID3       ID4
      1.35500595E-05    3      1000022       -11        12             # W1SS+  -->  Z1SS   E+     NUE         
      1.35500595E-05    3      1000022       -13        14             # W1SS+  -->  Z1SS   MU+    NUM         
      1.36701965E-05    3      1000022       -15        16             # W1SS+  -->  Z1SS   TAU+   NUT         
      8.82497896E-03    2      1000022        24                       # W1SS+  -->  Z1SS   W+                 
      1.01812661E-01    2      1000002        -1                       # W1SS+  -->  UPL    DB                 
      9.87097025E-02    2     -1000001         2                       # W1SS+  -->  DBL    UP                 
      1.01812586E-01    2      1000004        -3                       # W1SS+  -->  CHL    SB                 
      9.89249647E-02    2     -1000003         4                       # W1SS+  -->  SBL    CH                 
      2.67067909E-01    2      1000006        -5                       # W1SS+  -->  TP1    BB                 
      5.81414532E-03    2      2000006        -5                       # W1SS+  -->  TP2    BB                 
      5.99987456E-04    2     -1000005         6                       # W1SS+  -->  BB1    TP                 
      3.16392422E-01    2     -2000005         6                       # W1SS+  -->  BB2    TP                 
#         PDG         Width
DECAY   1000037  1.01364464E+02   # W2SS+ decays
#          BR          NDA       ID1       ID2       ID3       ID4
      1.52521533E-08    3      1000022       -15        16             # W2SS+  -->  Z1SS   TAU+   NUT         
      8.35367013E-03    2      1000022        24                       # W2SS+  -->  Z1SS   W+                 
      7.25710521E-14    3      1000023       -15        16             # W2SS+  -->  Z2SS   TAU+   NUT         
      1.00411912E-02    2      1000023        24                       # W2SS+  -->  Z2SS   W+                 
      8.14771647E-06    3      1000025         2        -1             # W2SS+  -->  Z3SS   UP     DB          
      8.14771647E-06    3      1000025         4        -3             # W2SS+  -->  Z3SS   CH     SB          
      2.71590557E-06    3      1000025       -11        12             # W2SS+  -->  Z3SS   E+     NUE         
      2.71590557E-06    3      1000025       -13        14             # W2SS+  -->  Z3SS   MU+    NUM         
      2.71590557E-06    3      1000025       -15        16             # W2SS+  -->  Z3SS   TAU+   NUT         
      1.05526887E-01    2      1000002        -1                       # W2SS+  -->  UPL    DB                 
      1.08402185E-01    2     -1000001         2                       # W2SS+  -->  DBL    UP                 
      1.05526790E-01    2      1000004        -3                       # W2SS+  -->  CHL    SB                 
      1.08607091E-01    2     -1000003         4                       # W2SS+  -->  SBL    CH                 
      5.41113783E-03    2      1000006        -5                       # W2SS+  -->  TP1    BB                 
      2.87977159E-01    2      2000006        -5                       # W2SS+  -->  TP2    BB                 
      6.22517022E-04    2     -1000005         6                       # W2SS+  -->  BB1    TP                 
      2.50283390E-01    2     -2000005         6                       # W2SS+  -->  BB2    TP                 
      1.64173063E-04    2      1000012       -11                       # W2SS+  -->  NUEL   E+                 
      1.64172889E-04    2      1000014       -13                       # W2SS+  -->  NUML   MU+                
      1.64118217E-04    2      1000016       -15                       # W2SS+  -->  NUTL   TAU+               
      1.64326309E-04    2     -1000011        12                       # W2SS+  -->  EL+    NUE                
      1.64326309E-04    2     -1000013        14                       # W2SS+  -->  MUL+   NUM                
      3.77080511E-07    2     -1000015        16                       # W2SS+  -->  TAU1+  NUT                
      1.64263576E-04    2     -2000015        16                       # W2SS+  -->  TAU2+  NUT                
      8.23729765E-03    2      1000024        23                       # W2SS+  -->  W1SS+  Z0                 
      5.97077815E-07    2      1000024        25                       # W2SS+  -->  W1SS+  HL0                
#         PDG         Width
DECAY        25  4.47505387E-03   # HL0   decays
#          BR          NDA       ID1       ID2       ID3       ID4
      4.59146721E-09    2           11       -11                       # HL0    -->  E-     E+                 
      1.93859145E-04    2           13       -13                       # HL0    -->  MU-    MU+                
      5.54518066E-02    2           15       -15                       # HL0    -->  TAU-   TAU+               
      5.75888816E-06    2            1        -1                       # HL0    -->  DN     DB                 
      2.32687942E-03    2            3        -3                       # HL0    -->  ST     SB                 
      7.57944226E-01    2            5        -5                       # HL0    -->  BT     BB                 
      1.83235409E-06    2            2        -2                       # HL0    -->  UP     UB                 
      3.42568122E-02    2            4        -4                       # HL0    -->  CH     CB                 
      1.99485500E-03    2           22        22                       # HL0    -->  GM     GM                 
      4.07890007E-02    2           21        21                       # HL0    -->  GL     GL                 
      5.42804645E-03    3           24        11       -12             # HL0    -->  W+     E-     ANUE        
      5.42804645E-03    3           24        13       -14             # HL0    -->  W+     MU-    ANUM        
      5.42804645E-03    3           24        15       -16             # HL0    -->  W+     TAU-   ANUT        
      1.62841398E-02    3           24        -2         1             # HL0    -->  W+     UB     DN          
      1.62841398E-02    3           24        -4         3             # HL0    -->  W+     CB     ST          
      5.42804645E-03    3          -24       -11        12             # HL0    -->  W-     E+     NUE         
      5.42804645E-03    3          -24       -13        14             # HL0    -->  W-     MU+    NUM         
      5.42804645E-03    3          -24       -15        16             # HL0    -->  W-     TAU+   NUT         
      1.62841398E-02    3          -24         2        -1             # HL0    -->  W-     UP     DB          
      1.62841398E-02    3          -24         4        -3             # HL0    -->  W-     CH     SB          
      6.38114929E-04    3           23        12       -12             # HL0    -->  Z0     NUE    ANUE        
      6.38114929E-04    3           23        14       -14             # HL0    -->  Z0     NUM    ANUM        
      6.38114929E-04    3           23        16       -16             # HL0    -->  Z0     NUT    ANUT        
      3.21156840E-04    3           23        11       -11             # HL0    -->  Z0     E-     E+          
      3.21156840E-04    3           23        13       -13             # HL0    -->  Z0     MU-    MU+         
      3.21156840E-04    3           23        15       -15             # HL0    -->  Z0     TAU-   TAU+        
      1.10025611E-03    3           23         2        -2             # HL0    -->  Z0     UP     UB          
      1.10025611E-03    3           23         4        -4             # HL0    -->  Z0     CH     CB          
      1.41740090E-03    3           23         1        -1             # HL0    -->  Z0     DN     DB          
      1.41740090E-03    3           23         3        -3             # HL0    -->  Z0     ST     SB          
      1.41740090E-03    3           23         5        -5             # HL0    -->  Z0     BT     BB          
#         PDG         Width
DECAY        35  7.43571320E+01   # HH0   decays
#          BR          NDA       ID1       ID2       ID3       ID4
      5.17572964E-11    2           11       -11                       # HH0    -->  E-     E+                 
      2.18528635E-06    2           13       -13                       # HH0    -->  MU-    MU+                
      6.25897665E-04    2           15       -15                       # HH0    -->  TAU-   TAU+               
      6.29627550E-08    2            1        -1                       # HH0    -->  DN     DB                 
      2.54401366E-05    2            3        -3                       # HH0    -->  ST     SB                 
      5.65783307E-03    2            5        -5                       # HH0    -->  BT     BB                 
      2.50114790E-10    2            2        -2                       # HH0    -->  UP     UB                 
      3.17651984E-06    2            4        -4                       # HH0    -->  CH     CB                 
      1.64043561E-01    2            6        -6                       # HH0    -->  TP     TB                 
      3.64110406E-07    2           22        22                       # HH0    -->  GM     GM                 
      4.83607437E-05    2           21        21                       # HH0    -->  GL     GL                 
      4.92038671E-05    2           24       -24                       # HH0    -->  W+     W-                 
      2.52116897E-05    2           23        23                       # HH0    -->  Z0     Z0                 
      1.70005751E-05    2      1000022   1000022                       # HH0    -->  Z1SS   Z1SS               
      2.89562941E-02    2           25        25                       # HH0    -->  HL0    HL0                
      3.10471733E-05    2      1000002  -1000002                       # HH0    -->  UPL    UBL                
      6.21737308E-06    2      2000002  -2000002                       # HH0    -->  UPR    UBR                
      3.10254472E-05    2      1000004  -1000004                       # HH0    -->  CHL    CBL                
      6.20768287E-06    2      2000004  -2000004                       # HH0    -->  CHR    CBR                
      4.61933450E-05    2      1000001  -1000001                       # HH0    -->  DNL    DBL                
      1.55114594E-06    2      2000001  -2000001                       # HH0    -->  DNR    DBR                
      4.61984673E-05    2      1000003  -1000003                       # HH0    -->  STL    SBL                
      1.55020655E-06    2      2000003  -2000003                       # HH0    -->  STR    SBR                
      1.37467032E-06    2      1000005  -1000005                       # HH0    -->  BT1    BB1                
      4.71908461E-05    2      2000005  -2000005                       # HH0    -->  BT2    BB2                
      1.21091697E-02    2      1000005  -2000005                       # HH0    -->  BT1    BB2                
      1.21091697E-02    2      2000005  -1000005                       # HH0    -->  BT2    BB1                
      4.09780532E-01    2      1000006  -1000006                       # HH0    -->  TP1    TB1                
      3.65748316E-01    2      2000006  -2000006                       # HH0    -->  TP2    TB2                
      2.89864460E-04    2      1000006  -2000006                       # HH0    -->  TP1    TB2                
      2.89864460E-04    2      2000006  -1000006                       # HH0    -->  TP2    TB1                
#         PDG         Width
DECAY        36  7.11147766E+01   # HA0   decays
#          BR          NDA       ID1       ID2       ID3       ID4
      5.37670117E-11    2           11       -11                       # HA0    -->  E-     E+                 
      2.27014039E-06    2           13       -13                       # HA0    -->  MU-    MU+                
      6.50202332E-04    2           15       -15                       # HA0    -->  TAU-   TAU+               
      6.54107879E-08    2            1        -1                       # HA0    -->  DN     DB                 
      2.64292667E-05    2            3        -3                       # HA0    -->  ST     SB                 
      5.88232279E-03    2            5        -5                       # HA0    -->  BT     BB                 
      2.58386729E-10    2            2        -2                       # HA0    -->  UP     UB                 
      3.28407259E-06    2            4        -4                       # HA0    -->  CH     CB                 
      1.72048256E-01    2            6        -6                       # HA0    -->  TP     TB                 
      3.83193793E-07    2           22        22                       # HA0    -->  GM     GM                 
      5.00795941E-05    2           21        21                       # HA0    -->  GL     GL                 
      3.00556603E-05    2      1000022   1000022                       # HA0    -->  Z1SS   Z1SS               
      5.07881196E-05    2           25        23                       # HA0    -->  HL0    Z0                 
      5.12377696E-10    2      1000002  -2000002                       # HA0    -->  UPL    UBR                
      5.12377696E-10    2      2000002  -1000002                       # HA0    -->  UPR    UBL                
      2.97769766E-05    2      1000004  -2000004                       # HA0    -->  CHL    CBR                
      2.97769766E-05    2      2000004  -1000004                       # HA0    -->  CHR    CBL                
      1.59380997E-09    2      1000001  -2000001                       # HA0    -->  DNL    DBR                
      1.59380997E-09    2      2000001  -1000001                       # HA0    -->  DNR    DBL                
      6.43979831E-07    2      1000003  -2000003                       # HA0    -->  STL    SBR                
      6.43979831E-07    2      2000003  -1000003                       # HA0    -->  STR    SBL                
      1.24532636E-02    2      1000005  -2000005                       # HA0    -->  BT1    BB2                
      1.24532636E-02    2      2000005  -1000005                       # HA0    -->  BT2    BB1                
      3.98144275E-01    2      1000006  -2000006                       # HA0    -->  TP1    TB2                
      3.98144275E-01    2      2000006  -1000006                       # HA0    -->  TP2    TB1                
#         PDG         Width
DECAY        37  7.18096161E+01   # H+    decays
#          BR          NDA       ID1       ID2       ID3       ID4
      5.35981572E-11    2           12       -11                       # H+     -->  NUE    E+                 
      2.26301086E-06    2           14       -13                       # H+     -->  NUM    MU+                
      6.48160349E-04    2           16       -15                       # H+     -->  NUT    TAU+               
      6.05915247E-08    2            2        -1                       # H+     -->  UP     DB                 
      2.74136910E-05    2            4        -3                       # H+     -->  CH     SB                 
      1.63331032E-01    2            6        -5                       # H+     -->  TP     BB                 
      5.06826291E-05    2           25        24                       # H+     -->  HL0    W+                 
      7.89709084E-05    2      1000002  -1000001                       # H+     -->  UPL    DBL                
      3.21707438E-09    2      2000002  -2000001                       # H+     -->  UPR    DBR                
      7.89412807E-05    2      1000004  -1000003                       # H+     -->  CHL    SBL                
      1.29985904E-06    2      2000004  -2000003                       # H+     -->  CHR    SBR                
      1.31815569E-02    2      1000006  -1000005                       # H+     -->  TP1    BB1                
      4.01561439E-01    2      1000006  -2000005                       # H+     -->  TP1    BB2                
      1.16110258E-02    2      2000006  -1000005                       # H+     -->  TP2    BB1                
      4.09427196E-01    2      2000006  -2000005                       # H+     -->  TP2    BB2                
