#
#                              ======================
#                              | THE SUSYHIT OUTPUT |
#                              ======================
#
#
#              ------------------------------------------------------
#              |     This is the output of the SUSY-HIT package     |
#              |  created by A.Djouadi, M.Muehlleitner and M.Spira. |
#              |  In case of problems with SUSY-HIT email to        |
#              |           margarete.muehlleitner@cern.ch           |
#              |           michael.spira@psi.ch                     |
#              |           abdelhak.djouadi@cern.ch                 |
#              ------------------------------------------------------
#
#              ------------------------------------------------------
#              |  SUSY Les Houches Accord - MSSM Spectrum + Decays  |
#              |              based on the decay programs           |
#              |                                                    |
#              |                     SDECAY 1.3b                    |
#              |                                                    |
#              |  Authors: M.Muhlleitner, A.Djouadi and Y.Mambrini  |
#              |  Ref.:    Comput.Phys.Commun.168(2005)46           |
#              |           [hep-ph/0311167]                         |
#              |                                                    |
#              |                     HDECAY 3.4                     |
#              |                                                    |
#              |  By: A.Djouadi,J.Kalinowski,M.Muhlleitner,M.Spira  |
#              |  Ref.:    Comput.Phys.Commun.108(1998)56           |
#              |           [hep-ph/9704448]                         |
#              |                                                    |
#              |                                                    |
#              |  If not stated otherwise all DRbar couplings and   |
#              |  soft SUSY breaking masses are given at the scale  |
#              |  Q=  0.91187600E+02
#              |                                                    |
#              ------------------------------------------------------
#
#
BLOCK DCINFO  # Decay Program information
     1   SDECAY/HDECAY # decay calculator
     2   1.3b  /3.4    # version number
#
BLOCK SPINFO  # Spectrum calculator information
     1   SuSpect     # RGE +Spectrum calculator            
     2   2.41         # version number                     
#
BLOCK MODSEL  # Model selection
     1     0   # #general MSSM low scale                           
#
BLOCK SMINPUTS  # Standard Model inputs
         1     1.27934000E+02   # alpha_em^-1(M_Z)^MSbar
         2     1.16639000E-05   # G_F [GeV^-2]
         3     1.17200000E-01   # alpha_S(M_Z)^MSbar
         4     9.11870000E+01   # M_Z pole mass
         5     4.25000000E+00   # mb(mb)^MSbar
         6     1.75000000E+02   # mt pole mass
         7     1.77700000E+00   # mtau pole mass
#
BLOCK MINPAR  # Input parameters - minimal models
#
BLOCK EXTPAR  # Input parameters - non-minimal models
         0     9.11876000E+01   # EWSB                
         1     3.61000000E+02   # M_1                 
         2     2.50000000E+03   # M_2                 
         3     6.00000000E+02   # M_3                 
        11     0.00000000E+00   # A_t                 
        12     0.00000000E+00   # A_b                 
        13     0.00000000E+00   # A_tau               
        14     0.00000000E+00   # A_u                 
        15     0.00000000E+00   # A_d                 
        16     0.00000000E+00   # A_e                 
        23    -3.50000000E+02   # mu(EWSB)            
        25     1.50000000E+00   # tanbeta(in)         
        26     2.00000000E+03   # MA_pole             
        31     2.50000000E+03   # M_eL                
        32     2.50000000E+03   # M_muL               
        33     2.50000000E+03   # M_tauL              
        34     2.50000000E+03   # M_eR                
        35     2.50000000E+03   # M_muR               
        36     2.50000000E+03   # M_tauR              
        41     2.50000000E+03   # M_q1L               
        42     2.50000000E+03   # M_q2L               
        43     2.50000000E+03   # M_q3L               
        44     2.50000000E+03   # M_uR                
        45     2.50000000E+03   # M_cR                
        46     2.50000000E+03   # M_tR                
        47     2.50000000E+03   # M_dR                
        48     2.50000000E+03   # M_sR                
        49     2.50000000E+03   # M_bR                
#
BLOCK MASS  # Mass Spectrum
# PDG code           mass       particle
        24     8.05496401E+01   # W+
        25     1.15000000E+02   # h
        35     2.00411709E+03   # H
        36     2.00000000E+03   # A
        37     2.00195946E+03   # H+
         5     4.87877839E+00   # b-quark pole mass calculated from mb(mb)_Msbar
   1000001     2.50026821E+03   # ~d_L
   2000001     2.50005077E+03   # ~d_R
   1000002     2.49978254E+03   # ~u_L
   2000002     2.49989845E+03   # ~u_R
   1000003     2.50026821E+03   # ~s_L
   2000003     2.50005077E+03   # ~s_R
   1000004     2.49978254E+03   # ~c_L
   2000004     2.49989845E+03   # ~c_R
   1000005     2.49985550E+03   # ~b_1
   2000005     2.50046640E+03   # ~b_2
   1000006     2.49743293E+03   # ~t_1
   2000006     2.51200586E+03   # ~t_2
   1000011     2.50016667E+03   # ~e_L
   2000011     2.50015232E+03   # ~e_R
   1000012     2.49968098E+03   # ~nu_eL
   1000013     2.50016667E+03   # ~mu_L
   2000013     2.50015232E+03   # ~mu_R
   1000014     2.49968098E+03   # ~nu_muL
   1000015     2.49997352E+03   # ~tau_1
   2000015     2.50034672E+03   # ~tau_2
   1000016     2.49968098E+03   # ~nu_tauL
   1000021     6.00000000E+02   # ~g
   1000022     3.45697273E+02   # ~chi_10
   1000023    -3.54787932E+02   # ~chi_20
   1000025     3.67848613E+02   # ~chi_30
   1000035     2.50224205E+03   # ~chi_40
   1000024     3.52015623E+02   # ~chi_1+
   1000037     2.50224151E+03   # ~chi_2+
   1000039     3.02600000E-08   # ~gravitino
#
BLOCK NMIX  # Neutralino Mixing Matrix
  1  1     4.34103651E-01   # N_11
  1  2    -5.50612991E-03   # N_12
  1  3    -6.56378943E-01   # N_13
  1  4    -6.17001123E-01   # N_14
  2  1     6.08419570E-02   # N_21
  2  2    -2.72398440E-02   # N_22
  2  3     7.04574678E-01   # N_23
  2  4    -7.06491876E-01   # N_24
  3  1     8.98805837E-01   # N_31
  3  2     5.15515095E-03   # N_32
  3  3     2.69331934E-01   # N_33
  3  4     3.45806017E-01   # N_34
  4  1     5.86157437E-04   # N_41
  4  2    -9.99600469E-01   # N_42
  4  3    -1.41956214E-02   # N_43
  4  4     2.44344613E-02   # N_44
#
BLOCK UMIX  # Chargino Mixing Matrix U
  1  1    -2.00629760E-02   # U_11
  1  2     9.99798718E-01   # U_12
  2  1     9.99798718E-01   # U_21
  2  2     2.00629760E-02   # U_22
#
BLOCK VMIX  # Chargino Mixing Matrix V
  1  1     3.45524673E-02   # V_11
  1  2    -9.99402885E-01   # V_12
  2  1     9.99402885E-01   # V_21
  2  2     3.45524673E-02   # V_22
#
BLOCK STOPMIX  # Stop Mixing Matrix
  1  1     7.09907832E-01   # cos(theta_t)
  1  2    -7.04294590E-01   # sin(theta_t)
  2  1     7.04294590E-01   # -sin(theta_t)
  2  2     7.09907832E-01   # cos(theta_t)
#
BLOCK SBOTMIX  # Sbottom Mixing Matrix
  1  1    -5.67482257E-01   # cos(theta_b)
  1  2     8.23385625E-01   # sin(theta_b)
  2  1    -8.23385625E-01   # -sin(theta_b)
  2  2    -5.67482257E-01   # cos(theta_b)
#
BLOCK STAUMIX  # Stau Mixing Matrix
  1  1    -6.93376061E-01   # cos(theta_tau)
  1  2     7.20575907E-01   # sin(theta_tau)
  2  1    -7.20575907E-01   # -sin(theta_tau)
  2  2    -6.93376061E-01   # cos(theta_tau)
#
BLOCK ALPHA  # Higgs mixing
          -5.89967143E-01   # Mixing angle in the neutral Higgs boson sector
#
BLOCK HMIX Q=  9.11876000E+01  # DRbar Higgs Parameters
         1    -3.50000000E+02   # mu(Q)               
         2     1.49999979E+00   # tanbeta(Q)          
         3     2.51696998E+02   # vev(Q)              
         4     4.02283617E+06   # MA^2(Q)             
#
BLOCK GAUGE Q=  9.11876000E+01  # The gauge couplings
     1     3.53594640E-01   # gprime(Q) DRbar
     2     6.31388393E-01   # g(Q) DRbar
     3     1.11192342E+00   # g3(Q) DRbar
#
BLOCK AU Q=  9.11876000E+01  # The trilinear couplings
  1  1     0.00000000E+00   # A_u(Q) DRbar
  2  2     0.00000000E+00   # A_c(Q) DRbar
  3  3     0.00000000E+00   # A_t(Q) DRbar
#
BLOCK AD Q=  9.11876000E+01  # The trilinear couplings
  1  1     0.00000000E+00   # A_d(Q) DRbar
  2  2     0.00000000E+00   # A_s(Q) DRbar
  3  3     0.00000000E+00   # A_b(Q) DRbar
#
BLOCK AE Q=  9.11876000E+01  # The trilinear couplings
  1  1     0.00000000E+00   # A_e(Q) DRbar
  2  2     0.00000000E+00   # A_mu(Q) DRbar
  3  3     0.00000000E+00   # A_tau(Q) DRbar
#
BLOCK Yu Q=  9.11876000E+01  # The Yukawa couplings
  1  1     0.00000000E+00   # y_u(Q) DRbar
  2  2     0.00000000E+00   # y_c(Q) DRbar
  3  3     1.05633816E+00   # y_t(Q) DRbar
#
BLOCK Yd Q=  9.11876000E+01  # The Yukawa couplings
  1  1     0.00000000E+00   # y_d(Q) DRbar
  2  2     0.00000000E+00   # y_s(Q) DRbar
  3  3     2.75386940E-02   # y_b(Q) DRbar
#
BLOCK Ye Q=  9.11876000E+01  # The Yukawa couplings
  1  1     0.00000000E+00   # y_e(Q) DRbar
  2  2     0.00000000E+00   # y_mu(Q) DRbar
  3  3     1.79889025E-02   # y_tau(Q) DRbar
#
BLOCK MSOFT Q=  9.11876000E+01  # The soft SUSY breaking masses at the scale Q
         1     3.61000000E+02   # M_1                 
         2     2.50000000E+03   # M_2                 
         3     6.00000000E+02   # M_3                 
        14     0.00000000E+00   # A_u                 
        15     0.00000000E+00   # A_d                 
        16     0.00000000E+00   # A_e                 
        21     2.79699681E+06   # M^2_Hd              
        22    -1.59158071E+05   # M^2_Hu              
        31     2.50000000E+03   # M_eL                
        32     2.50000000E+03   # M_muL               
        33     2.50000000E+03   # M_tauL              
        34     2.50000000E+03   # M_eR                
        35     2.50000000E+03   # M_muR               
        36     2.50000000E+03   # M_tauR              
        41     2.50000000E+03   # M_q1L               
        42     2.50000000E+03   # M_q2L               
        43     2.50000000E+03   # M_q3L               
        44     2.50000000E+03   # M_uR                
        45     2.50000000E+03   # M_cR                
        46     2.50000000E+03   # M_tR                
        47     2.50000000E+03   # M_dR                
        48     2.50000000E+03   # M_sR                
        49     2.50000000E+03   # M_bR                
#
#
#
#                             =================
#                             |The decay table|
#                             =================
#
# - The QCD corrections to the decays gluino -> squark  + quark
#                                     squark -> gaugino + quark_prime
#                                     squark -> squark_prime + Higgs
#                                     squark -> gluino  + quark
#   are included.
#
# - The multi-body decays for the inos, stops and sbottoms are included.
#
# - The loop induced decays for the gluino, neutralinos and stops
#   are included.
#
# - The SUSY decays of the top quark are included.
#
# - Possible decays of the NLSP in GMSB models are included.
#
#
#         PDG            Width
DECAY         6     1.44837523E+00   # top decays
#          BR         NDA      ID1       ID2
     1.00000000E+00    2           5        24   # BR(t ->  b    W+)
#
#         PDG            Width
DECAY   1000021     6.44535849E-06   # gluino decays
#          BR         NDA      ID1       ID2
     3.25747325E-01    2     1000022        21   # BR(~g -> ~chi_10 g)
     3.92384243E-01    2     1000023        21   # BR(~g -> ~chi_20 g)
     8.35703815E-02    2     1000025        21   # BR(~g -> ~chi_30 g)
#          BR         NDA      ID1       ID2
     1.51690273E-05    2     1000039        21   # BR(~g -> ~G      g)
#           BR         NDA      ID1       ID2       ID3
     3.54350981E-03    3     1000022         1        -1   # BR(~g -> ~chi_10 d  db)
     6.55100563E-05    3     1000023         1        -1   # BR(~g -> ~chi_20 d  db)
     1.00611803E-02    3     1000025         1        -1   # BR(~g -> ~chi_30 d  db)
     1.16321154E-02    3     1000022         2        -2   # BR(~g -> ~chi_10 u  ub)
     7.56905330E-05    3     1000023         2        -2   # BR(~g -> ~chi_20 u  ub)
     3.47657413E-02    3     1000025         2        -2   # BR(~g -> ~chi_30 u  ub)
     3.54350981E-03    3     1000022         3        -3   # BR(~g -> ~chi_10 s  sb)
     6.55100563E-05    3     1000023         3        -3   # BR(~g -> ~chi_20 s  sb)
     1.00611803E-02    3     1000025         3        -3   # BR(~g -> ~chi_30 s  sb)
     1.16321154E-02    3     1000022         4        -4   # BR(~g -> ~chi_10 c  cb)
     7.56905330E-05    3     1000023         4        -4   # BR(~g -> ~chi_20 c  cb)
     3.47657413E-02    3     1000025         4        -4   # BR(~g -> ~chi_30 c  cb)
     4.04455154E-03    3     1000022         5        -5   # BR(~g -> ~chi_10 b  bb)
     3.94679801E-04    3     1000023         5        -5   # BR(~g -> ~chi_20 b  bb)
     9.96184797E-03    3     1000025         5        -5   # BR(~g -> ~chi_30 b  bb)
     6.10936009E-05    3     1000024         1        -2   # BR(~g -> ~chi_1+ d  ub)
     6.10936009E-05    3    -1000024         2        -1   # BR(~g -> ~chi_1- u  db)
     6.10936009E-05    3     1000024         3        -4   # BR(~g -> ~chi_1+ s  cb)
     6.10936009E-05    3    -1000024         4        -3   # BR(~g -> ~chi_1- c  sb)
     3.16749667E-02    3     1000024         5        -6   # BR(~g -> ~chi_1+ b  tb)
     3.16749667E-02    3    -1000024         6        -5   # BR(~g -> ~chi_1- t  bb)
#
#         PDG            Width
DECAY   1000006     1.85076351E+02   # stop1 decays
#          BR         NDA      ID1       ID2
     6.81403776E-02    2     1000022         6   # BR(~t_1 -> ~chi_10 t )
     9.87080312E-02    2     1000023         6   # BR(~t_1 -> ~chi_20 t )
     5.50430022E-02    2     1000025         6   # BR(~t_1 -> ~chi_30 t )
     1.00348952E-01    2     1000024         5   # BR(~t_1 -> ~chi_1+ b )
     6.77759637E-01    2     1000021         6   # BR(~t_1 -> ~g      t )
#
#         PDG            Width
DECAY   2000006     1.95945684E+02   # stop2 decays
#          BR         NDA      ID1       ID2
     9.25942923E-02    2     1000022         6   # BR(~t_2 -> ~chi_10 t )
     1.06134961E-01    2     1000023         6   # BR(~t_2 -> ~chi_20 t )
     1.83553803E-02    2     1000025         6   # BR(~t_2 -> ~chi_30 t )
     1.06152737E-01    2     1000024         5   # BR(~t_2 -> ~chi_1+ b )
     2.82266036E-06    2     1000037         5   # BR(~t_2 -> ~chi_2+ b )
     6.76759807E-01    2     1000021         6   # BR(~t_2 -> ~g      t )
#
#         PDG            Width
DECAY   1000005     1.44905976E+02   # sbottom1 decays
#          BR         NDA      ID1       ID2
     1.86488546E-03    2     1000022         5   # BR(~b_1 -> ~chi_10 b )
     2.29940331E-06    2     1000023         5   # BR(~b_1 -> ~chi_20 b )
     4.72360295E-03    2     1000025         5   # BR(~b_1 -> ~chi_30 b )
     1.00100224E-01    2    -1000024         6   # BR(~b_1 -> ~chi_1- t )
     8.93308988E-01    2     1000021         5   # BR(~b_1 -> ~g      b )
#
#         PDG            Width
DECAY   2000005     1.54833496E+02   # sbottom2 decays
#          BR         NDA      ID1       ID2
     4.11602365E-04    2     1000022         5   # BR(~b_2 -> ~chi_10 b )
     2.87919756E-04    2     1000023         5   # BR(~b_2 -> ~chi_20 b )
     3.83244720E-03    2     1000025         5   # BR(~b_2 -> ~chi_30 b )
     1.58494426E-01    2    -1000024         6   # BR(~b_2 -> ~chi_1- t )
     8.36973605E-01    2     1000021         5   # BR(~b_2 -> ~g      b )
#
#         PDG            Width
DECAY   1000002     1.29849682E+02   # sup_L decays
#          BR         NDA      ID1       ID2
     4.07304858E-04    2     1000022         2   # BR(~u_L -> ~chi_10 u)
     1.79768197E-05    2     1000023         2   # BR(~u_L -> ~chi_20 u)
     2.12582608E-03    2     1000025         2   # BR(~u_L -> ~chi_30 u)
     1.70264378E-04    2     1000024         1   # BR(~u_L -> ~chi_1+ d)
     9.97278628E-01    2     1000021         2   # BR(~u_L -> ~g      u)
#
#         PDG            Width
DECAY   2000002     1.34654454E+02   # sup_R decays
#          BR         NDA      ID1       ID2
     7.23434701E-03    2     1000022         2   # BR(~u_R -> ~chi_10 u)
     1.41853238E-04    2     1000023         2   # BR(~u_R -> ~chi_20 u)
     3.08748076E-02    2     1000025         2   # BR(~u_R -> ~chi_30 u)
     9.61748992E-01    2     1000021         2   # BR(~u_R -> ~g      u)
#
#         PDG            Width
DECAY   1000001     1.29862475E+02   # sdown_L decays
#          BR         NDA      ID1       ID2
     5.34790785E-04    2     1000022         1   # BR(~d_L -> ~chi_10 d)
     1.06184964E-04    2     1000023         1   # BR(~d_L -> ~chi_20 d)
     1.88011746E-03    2     1000025         1   # BR(~d_L -> ~chi_30 d)
     5.74121921E-05    2    -1000024         2   # BR(~d_L -> ~chi_1- u)
     9.97421495E-01    2     1000021         1   # BR(~d_L -> ~g      d)
#
#         PDG            Width
DECAY   2000001     1.30801357E+02   # sdown_R decays
#          BR         NDA      ID1       ID2
     1.86198486E-03    2     1000022         1   # BR(~d_R -> ~chi_10 d)
     3.65103640E-05    2     1000023         1   # BR(~d_R -> ~chi_20 d)
     7.94659937E-03    2     1000025         1   # BR(~d_R -> ~chi_30 d)
     9.90154905E-01    2     1000021         1   # BR(~d_R -> ~g      d)
#
#         PDG            Width
DECAY   1000004     1.29849682E+02   # scharm_L decays
#          BR         NDA      ID1       ID2
     4.07304858E-04    2     1000022         4   # BR(~c_L -> ~chi_10 c)
     1.79768197E-05    2     1000023         4   # BR(~c_L -> ~chi_20 c)
     2.12582608E-03    2     1000025         4   # BR(~c_L -> ~chi_30 c)
     1.70264378E-04    2     1000024         3   # BR(~c_L -> ~chi_1+ s)
     9.97278628E-01    2     1000021         4   # BR(~c_L -> ~g      c)
#
#         PDG            Width
DECAY   2000004     1.34654454E+02   # scharm_R decays
#          BR         NDA      ID1       ID2
     7.23434701E-03    2     1000022         4   # BR(~c_R -> ~chi_10 c)
     1.41853238E-04    2     1000023         4   # BR(~c_R -> ~chi_20 c)
     3.08748076E-02    2     1000025         4   # BR(~c_R -> ~chi_30 c)
     9.61748992E-01    2     1000021         4   # BR(~c_R -> ~g      c)
#
#         PDG            Width
DECAY   1000003     1.29862475E+02   # sstrange_L decays
#          BR         NDA      ID1       ID2
     5.34790785E-04    2     1000022         3   # BR(~s_L -> ~chi_10 s)
     1.06184964E-04    2     1000023         3   # BR(~s_L -> ~chi_20 s)
     1.88011746E-03    2     1000025         3   # BR(~s_L -> ~chi_30 s)
     5.74121921E-05    2    -1000024         4   # BR(~s_L -> ~chi_1- c)
     9.97421495E-01    2     1000021         3   # BR(~s_L -> ~g      s)
#
#         PDG            Width
DECAY   2000003     1.30801357E+02   # sstrange_R decays
#          BR         NDA      ID1       ID2
     1.86198486E-03    2     1000022         3   # BR(~s_R -> ~chi_10 s)
     3.65103640E-05    2     1000023         3   # BR(~s_R -> ~chi_20 s)
     7.94659937E-03    2     1000025         3   # BR(~s_R -> ~chi_30 s)
     9.90154905E-01    2     1000021         3   # BR(~s_R -> ~g      s)
#
#         PDG            Width
DECAY   1000011     3.00051493E+00   # selectron_L decays
#          BR         NDA      ID1       ID2
     1.79475834E-01    2     1000022        11   # BR(~e_L -> ~chi_10 e-)
     1.48135261E-04    2     1000023        11   # BR(~e_L -> ~chi_20 e-)
     8.17820415E-01    2     1000025        11   # BR(~e_L -> ~chi_30 e-)
     2.55561573E-03    2    -1000024        12   # BR(~e_L -> ~chi_1- nu_e)
#
#         PDG            Width
DECAY   2000011     1.19167269E+01   # selectron_R decays
#          BR         NDA      ID1       ID2
     1.89234681E-01    2     1000022        11   # BR(~e_R -> ~chi_10 e-)
     3.70951922E-03    2     1000023        11   # BR(~e_R -> ~chi_20 e-)
     8.07055800E-01    2     1000025        11   # BR(~e_R -> ~chi_30 e-)
#
#         PDG            Width
DECAY   1000013     3.00051493E+00   # smuon_L decays
#          BR         NDA      ID1       ID2
     1.79475834E-01    2     1000022        13   # BR(~mu_L -> ~chi_10 mu-)
     1.48135261E-04    2     1000023        13   # BR(~mu_L -> ~chi_20 mu-)
     8.17820415E-01    2     1000025        13   # BR(~mu_L -> ~chi_30 mu-)
     2.55561573E-03    2    -1000024        14   # BR(~mu_L -> ~chi_1- nu_mu)
#
#         PDG            Width
DECAY   2000013     1.19167269E+01   # smuon_R decays
#          BR         NDA      ID1       ID2
     1.89234681E-01    2     1000022        13   # BR(~mu_R -> ~chi_10 mu-)
     3.70951922E-03    2     1000023        13   # BR(~mu_R -> ~chi_20 mu-)
     8.07055800E-01    2     1000025        13   # BR(~mu_R -> ~chi_30 mu-)
#
#         PDG            Width
DECAY   1000015     7.63567012E+00   # stau_1 decays
#          BR         NDA      ID1       ID2
     1.96291584E-01    2     1000022        15   # BR(~tau_1 -> ~chi_10  tau-)
     1.87059749E-03    2     1000023        15   # BR(~tau_1 -> ~chi_20  tau-)
     8.01728652E-01    2     1000025        15   # BR(~tau_1 -> ~chi_30  tau-)
     1.09151041E-04    2    -1000024        16   # BR(~tau_1 -> ~chi_1-  nu_tau)
     1.60797186E-08    2     1000039        15   # BR(~tau_1 -> ~G       tau-)
#
#         PDG            Width
DECAY   2000015     7.32795249E+00   # stau_2 decays
#          BR         NDA      ID1       ID2
     1.78510543E-01    2     1000022        15   # BR(~tau_2 -> ~chi_10  tau-)
     6.23904096E-03    2     1000023        15   # BR(~tau_2 -> ~chi_20  tau-)
     8.12208095E-01    2     1000025        15   # BR(~tau_2 -> ~chi_30  tau-)
     3.04232089E-03    2    -1000024        16   # BR(~tau_2 -> ~chi_1-  nu_tau)
#
#         PDG            Width
DECAY   1000012     3.00287278E+00   # snu_eL decays
#          BR         NDA      ID1       ID2
     1.96302349E-01    2     1000022        12   # BR(~nu_eL -> ~chi_10 nu_e)
     1.19143287E-02    2     1000023        12   # BR(~nu_eL -> ~chi_20 nu_e)
     7.84210973E-01    2     1000025        12   # BR(~nu_eL -> ~chi_30 nu_e)
     7.57234917E-03    2     1000024        11   # BR(~nu_eL -> ~chi_1+ e-)
#
#         PDG            Width
DECAY   1000014     3.00287278E+00   # snu_muL decays
#          BR         NDA      ID1       ID2
     1.96302349E-01    2     1000022        14   # BR(~nu_muL -> ~chi_10 nu_mu)
     1.19143287E-02    2     1000023        14   # BR(~nu_muL -> ~chi_20 nu_mu)
     7.84210973E-01    2     1000025        14   # BR(~nu_muL -> ~chi_30 nu_mu)
     7.57234917E-03    2     1000024        13   # BR(~nu_muL -> ~chi_1+ mu-)
#
#         PDG            Width
DECAY   1000016     3.01833475E+00   # snu_tauL decays
#          BR         NDA      ID1       ID2
     1.95296754E-01    2     1000022        16   # BR(~nu_tauL -> ~chi_10 nu_tau)
     1.18532954E-02    2     1000023        16   # BR(~nu_tauL -> ~chi_20 nu_tau)
     7.80193710E-01    2     1000025        16   # BR(~nu_tauL -> ~chi_30 nu_tau)
     1.26562401E-02    2     1000024        15   # BR(~nu_tauL -> ~chi_1+ tau-)
#
#         PDG            Width
DECAY   1000024     8.80634325E-09   # chargino1+ decays
#          BR         NDA      ID1       ID2
     3.13231145E-04    2     1000039        24   # BR(~chi_1+ -> ~G       W+)
#           BR         NDA      ID1       ID2       ID3
     3.45311186E-01    3     1000022         2        -1   # BR(~chi_1+ -> ~chi_10 u    db)
     3.45311186E-01    3     1000022         4        -3   # BR(~chi_1+ -> ~chi_10 c    sb)
     1.15106056E-01    3     1000022       -11        12   # BR(~chi_1+ -> ~chi_10 e+   nu_e)
     1.15106056E-01    3     1000022       -13        14   # BR(~chi_1+ -> ~chi_10 mu+  nu_mu)
     7.88522851E-02    3     1000022       -15        16   # BR(~chi_1+ -> ~chi_10 tau+ nu_tau)
#
#         PDG            Width
DECAY   1000037     1.78087669E+01   # chargino2+ decays
#          BR         NDA      ID1       ID2
     2.81761084E-04    2     1000002        -1   # BR(~chi_2+ -> ~u_L     db)
     2.25121721E-04    2    -1000001         2   # BR(~chi_2+ -> ~d_L*    u )
     2.81761084E-04    2     1000004        -3   # BR(~chi_2+ -> ~c_L     sb)
     2.25121721E-04    2    -1000003         4   # BR(~chi_2+ -> ~s_L*    c )
     2.32855587E-06    2     1000012       -11   # BR(~chi_2+ -> ~nu_eL   e+  )
     2.32855587E-06    2     1000014       -13   # BR(~chi_2+ -> ~nu_muL  mu+ )
     1.67559104E-06    2     1000016       -15   # BR(~chi_2+ -> ~nu_tau1 tau+)
     1.53046865E-06    2    -1000011        12   # BR(~chi_2+ -> ~e_L+    nu_e)
     1.53046865E-06    2    -1000013        14   # BR(~chi_2+ -> ~mu_L+   nu_mu)
     8.80151756E-07    2    -1000015        16   # BR(~chi_2+ -> ~tau_1+  nu_tau)
     6.62049002E-07    2    -2000015        16   # BR(~chi_2+ -> ~tau_2+  nu_tau)
     2.07155319E-01    2     1000024        23   # BR(~chi_2+ -> ~chi_1+  Z )
     1.58032864E-01    2     1000022        24   # BR(~chi_2+ -> ~chi_10  W+)
     2.00707878E-01    2     1000023        24   # BR(~chi_2+ -> ~chi_20  W+)
     4.60639811E-02    2     1000025        24   # BR(~chi_2+ -> ~chi_30  W+)
     2.05820599E-01    2     1000024        25   # BR(~chi_2+ -> ~chi_1+  h )
     4.49681765E-02    2     1000024        35   # BR(~chi_2+ -> ~chi_1+  H )
     4.56981490E-02    2     1000024        36   # BR(~chi_2+ -> ~chi_1+  A )
     3.76373331E-02    2     1000022        37   # BR(~chi_2+ -> ~chi_10  H+)
     4.49467683E-02    2     1000023        37   # BR(~chi_2+ -> ~chi_20  H+)
     7.94422372E-03    2     1000025        37   # BR(~chi_2+ -> ~chi_30  H+)
     6.89553362E-09    2     1000039        24   # BR(~chi_2+ -> ~G       W+)
     3.75293121E-14    2     1000039        37   # BR(~chi_2+ -> ~G       H+)
#
#         PDG            Width
DECAY   1000022     2.64495101E-12   # neutralino1 decays
#          BR         NDA      ID1       ID2
     3.31919286E-01    2     1000039        22   # BR(~chi_10 -> ~G        gam)
     1.02357156E-01    2     1000039        23   # BR(~chi_10 -> ~G        Z)
     5.65723558E-01    2     1000039        25   # BR(~chi_10 -> ~G        h)
#
#         PDG            Width
DECAY   1000023     4.04592668E-08   # neutralino2 decays
#          BR         NDA      ID1       ID2
     1.88072013E-02    2     1000022        22   # BR(~chi_20 -> ~chi_10 gam)
#          BR         NDA      ID1       ID2
     2.76364190E-07    2     1000039        22   # BR(~chi_20 -> ~G        gam)
     6.40293047E-05    2     1000039        23   # BR(~chi_20 -> ~G        Z)
     2.13239604E-06    2     1000039        25   # BR(~chi_20 -> ~G        h)
#           BR         NDA      ID1       ID2       ID3
     1.35574939E-01    3     1000022        -2         2   # BR(~chi_20 -> ~chi_10 ub      u)
     1.75411112E-01    3     1000022        -1         1   # BR(~chi_20 -> ~chi_10 db      d)
     1.35574939E-01    3     1000022        -4         4   # BR(~chi_20 -> ~chi_10 cb      c)
     1.75411112E-01    3     1000022        -3         3   # BR(~chi_20 -> ~chi_10 sb      s)
     3.99987665E-02    3     1000022       -11        11   # BR(~chi_20 -> ~chi_10 e+      e-)
     3.99987665E-02    3     1000022       -13        13   # BR(~chi_20 -> ~chi_10 mu+     mu-)
     3.14018990E-02    3     1000022       -15        15   # BR(~chi_20 -> ~chi_10 tau+    tau-)
     7.98447733E-02    3     1000022       -12        12   # BR(~chi_20 -> ~chi_10 nu_eb   nu_e)
     7.98447733E-02    3     1000022       -14        14   # BR(~chi_20 -> ~chi_10 nu_mub  nu_mu)
     7.98447733E-02    3     1000022       -16        16   # BR(~chi_20 -> ~chi_10 nu_taub nu_tau)
     1.51962185E-03    3     1000024        -2         1   # BR(~chi_20 -> ~chi_1+ ub      d)
     1.51962185E-03    3    -1000024        -1         2   # BR(~chi_20 -> ~chi_1- db      u)
     1.51962185E-03    3     1000024        -4         3   # BR(~chi_20 -> ~chi_1+ cb      s)
     1.51962185E-03    3    -1000024        -3         4   # BR(~chi_20 -> ~chi_1- sb      c)
     5.06540976E-04    3     1000024       -12        11   # BR(~chi_20 -> ~chi_1+ nu_eb   e-)
     5.06540976E-04    3    -1000024        12       -11   # BR(~chi_20 -> ~chi_1- nu_e    e+)
     5.06540976E-04    3     1000024       -14        13   # BR(~chi_20 -> ~chi_1+ nu_mub  mu-)
     5.06540976E-04    3    -1000024        14       -13   # BR(~chi_20 -> ~chi_1- nu_mu   mu+)
     5.79280346E-05    3     1000024       -16        15   # BR(~chi_20 -> ~chi_1+ nu_taub tau-)
     5.79280346E-05    3    -1000024        16       -15   # BR(~chi_20 -> ~chi_1- nu_tau  tau+)
#
#         PDG            Width
DECAY   1000025     2.58826317E-06   # neutralino3 decays
#          BR         NDA      ID1       ID2
     7.81843914E-01    2     1000022        22   # BR(~chi_30 -> ~chi_10 gam)
     2.31311776E-02    2     1000023        22   # BR(~chi_30 -> ~chi_20 gam)
#          BR         NDA      ID1       ID2
     2.02502231E-06    2     1000039        22   # BR(~chi_30 -> ~G        gam)
     5.03966392E-07    2     1000039        23   # BR(~chi_30 -> ~G        Z)
     2.07218039E-07    2     1000039        25   # BR(~chi_30 -> ~G        h)
#           BR         NDA      ID1       ID2       ID3
     8.97104428E-04    3     1000022        -2         2   # BR(~chi_30 -> ~chi_10 ub      u)
     1.17132731E-03    3     1000022        -1         1   # BR(~chi_30 -> ~chi_10 db      d)
     8.97104428E-04    3     1000022        -4         4   # BR(~chi_30 -> ~chi_10 cb      c)
     1.17132731E-03    3     1000022        -3         3   # BR(~chi_30 -> ~chi_10 sb      s)
     6.55387102E-04    3     1000022        -5         5   # BR(~chi_30 -> ~chi_10 bb      b)
     2.75481345E-04    3     1000022       -11        11   # BR(~chi_30 -> ~chi_10 e+      e-)
     2.75481345E-04    3     1000022       -13        13   # BR(~chi_30 -> ~chi_10 mu+     mu-)
     2.50658474E-04    3     1000022       -15        15   # BR(~chi_30 -> ~chi_10 tau+    tau-)
     5.28713363E-04    3     1000022       -12        12   # BR(~chi_30 -> ~chi_10 nu_eb   nu_e)
     5.28713363E-04    3     1000022       -14        14   # BR(~chi_30 -> ~chi_10 nu_mub  nu_mu)
     5.28713363E-04    3     1000022       -16        16   # BR(~chi_30 -> ~chi_10 nu_taub nu_tau)
     3.00168700E-03    3     1000023        -2         2   # BR(~chi_30 -> ~chi_20 ub      u)
     3.88419680E-03    3     1000023        -1         1   # BR(~chi_30 -> ~chi_20 db      d)
     3.00168700E-03    3     1000023        -4         4   # BR(~chi_30 -> ~chi_20 cb      c)
     3.88419680E-03    3     1000023        -3         3   # BR(~chi_30 -> ~chi_20 sb      s)
     7.51959824E-04    3     1000023        -5         5   # BR(~chi_30 -> ~chi_20 bb      b)
     8.86018889E-04    3     1000023       -11        11   # BR(~chi_30 -> ~chi_20 e+      e-)
     8.86018889E-04    3     1000023       -13        13   # BR(~chi_30 -> ~chi_20 mu+     mu-)
     7.95295816E-04    3     1000023       -15        15   # BR(~chi_30 -> ~chi_20 tau+    tau-)
     1.76762327E-03    3     1000023       -12        12   # BR(~chi_30 -> ~chi_20 nu_eb   nu_e)
     1.76762327E-03    3     1000023       -14        14   # BR(~chi_30 -> ~chi_20 nu_mub  nu_mu)
     1.76762327E-03    3     1000023       -16        16   # BR(~chi_30 -> ~chi_20 nu_taub nu_tau)
     2.77602530E-02    3     1000024        -2         1   # BR(~chi_30 -> ~chi_1+ ub      d)
     2.77602530E-02    3    -1000024        -1         2   # BR(~chi_30 -> ~chi_1- db      u)
     2.77602530E-02    3     1000024        -4         3   # BR(~chi_30 -> ~chi_1+ cb      s)
     2.77602530E-02    3    -1000024        -3         4   # BR(~chi_30 -> ~chi_1- sb      c)
     9.25255887E-03    3     1000024       -12        11   # BR(~chi_30 -> ~chi_1+ nu_eb   e-)
     9.25255887E-03    3    -1000024        12       -11   # BR(~chi_30 -> ~chi_1- nu_e    e+)
     9.25255887E-03    3     1000024       -14        13   # BR(~chi_30 -> ~chi_1+ nu_mub  mu-)
     9.25255887E-03    3    -1000024        14       -13   # BR(~chi_30 -> ~chi_1- nu_mu   mu+)
     8.69849110E-03    3     1000024       -16        15   # BR(~chi_30 -> ~chi_1+ nu_taub tau-)
     8.69849110E-03    3    -1000024        16       -15   # BR(~chi_30 -> ~chi_1- nu_tau  tau+)
#
#         PDG            Width
DECAY   1000035     1.78092104E+01   # neutralino4 decays
#          BR         NDA      ID1       ID2
     1.54937991E-01    2     1000022        23   # BR(~chi_40 -> ~chi_10   Z )
     1.36527060E-02    2     1000023        23   # BR(~chi_40 -> ~chi_20   Z )
     3.89199127E-02    2     1000025        23   # BR(~chi_40 -> ~chi_30   Z )
     2.02036216E-01    2     1000024       -24   # BR(~chi_40 -> ~chi_1+   W-)
     2.02036216E-01    2    -1000024        24   # BR(~chi_40 -> ~chi_1-   W+)
     6.96218166E-03    2     1000022        25   # BR(~chi_40 -> ~chi_10   h )
     3.69831103E-02    2     1000022        35   # BR(~chi_40 -> ~chi_10   H )
     3.34069094E-04    2     1000022        36   # BR(~chi_40 -> ~chi_10   A )
     1.91030001E-01    2     1000023        25   # BR(~chi_40 -> ~chi_20   h )
     2.46194338E-04    2     1000023        35   # BR(~chi_40 -> ~chi_20   H )
     4.50040533E-02    2     1000023        36   # BR(~chi_40 -> ~chi_20   A )
     8.20426388E-03    2     1000025        25   # BR(~chi_40 -> ~chi_30   h )
     7.87012594E-03    2     1000025        35   # BR(~chi_40 -> ~chi_30   H )
     2.33688465E-06    2     1000025        36   # BR(~chi_40 -> ~chi_30   A )
     4.53778859E-02    2     1000024       -37   # BR(~chi_40 -> ~chi_1+   H-)
     4.53778859E-02    2    -1000024        37   # BR(~chi_40 -> ~chi_1-   H+)
     2.78643986E-04    2     1000002        -2   # BR(~chi_40 -> ~u_L      ub)
     2.78643986E-04    2    -1000002         2   # BR(~chi_40 -> ~u_L*     u )
     5.08801852E-11    2     2000002        -2   # BR(~chi_40 -> ~u_R      ub)
     5.08801852E-11    2    -2000002         2   # BR(~chi_40 -> ~u_R*     u )
     2.23061711E-04    2     1000001        -1   # BR(~chi_40 -> ~d_L      db)
     2.23061711E-04    2    -1000001         1   # BR(~chi_40 -> ~d_L*     d )
     1.18823761E-11    2     2000001        -1   # BR(~chi_40 -> ~d_R      db)
     1.18823761E-11    2    -2000001         1   # BR(~chi_40 -> ~d_R*     d )
     2.78643986E-04    2     1000004        -4   # BR(~chi_40 -> ~c_L      cb)
     2.78643986E-04    2    -1000004         4   # BR(~chi_40 -> ~c_L*     c )
     5.08801852E-11    2     2000004        -4   # BR(~chi_40 -> ~c_R      cb)
     5.08801852E-11    2    -2000004         4   # BR(~chi_40 -> ~c_R*     c )
     2.23061711E-04    2     1000003        -3   # BR(~chi_40 -> ~s_L      sb)
     2.23061711E-04    2    -1000003         3   # BR(~chi_40 -> ~s_L*     s )
     1.18823761E-11    2     2000003        -3   # BR(~chi_40 -> ~s_R      sb)
     1.18823761E-11    2    -2000003         3   # BR(~chi_40 -> ~s_R*     s )
     7.64807140E-07    2     1000011       -11   # BR(~chi_40 -> ~e_L-     e+)
     7.64807140E-07    2    -1000011        11   # BR(~chi_40 -> ~e_L+     e-)
     3.34713814E-13    2     2000011       -11   # BR(~chi_40 -> ~e_R-     e+)
     3.34713814E-13    2    -2000011        11   # BR(~chi_40 -> ~e_R+     e-)
     7.64807140E-07    2     1000013       -13   # BR(~chi_40 -> ~mu_L-    mu+)
     7.64807140E-07    2    -1000013        13   # BR(~chi_40 -> ~mu_L+    mu-)
     3.34713814E-13    2     2000013       -13   # BR(~chi_40 -> ~mu_R-    mu+)
     3.34713814E-13    2    -2000013        13   # BR(~chi_40 -> ~mu_R+    mu-)
     2.72930211E-07    2     1000015       -15   # BR(~chi_40 -> ~tau_1-   tau+)
     2.72930211E-07    2    -1000015        15   # BR(~chi_40 -> ~tau_1+   tau-)
     1.15123854E-07    2     2000015       -15   # BR(~chi_40 -> ~tau_2-   tau+)
     1.15123854E-07    2    -2000015        15   # BR(~chi_40 -> ~tau_2+   tau-)
     1.16596556E-06    2     1000012       -12   # BR(~chi_40 -> ~nu_eL    nu_eb)
     1.16596556E-06    2    -1000012        12   # BR(~chi_40 -> ~nu_eL*   nu_e )
     1.16596556E-06    2     1000014       -14   # BR(~chi_40 -> ~nu_muL   nu_mub)
     1.16596556E-06    2    -1000014        14   # BR(~chi_40 -> ~nu_muL*  nu_mu )
     1.16596556E-06    2     1000016       -16   # BR(~chi_40 -> ~nu_tau1  nu_taub)
     1.16596556E-06    2    -1000016        16   # BR(~chi_40 -> ~nu_tau1* nu_tau )
     1.64868769E-09    2     1000039        22   # BR(~chi_40 -> ~G        gam)
     5.24606574E-09    2     1000039        23   # BR(~chi_40 -> ~G        Z)
     5.28503780E-13    2     1000039        25   # BR(~chi_40 -> ~G        h)
     3.68771438E-14    2     1000039        35   # BR(~chi_40 -> ~G        H)
     1.78819584E-16    2     1000039        36   # BR(~chi_40 -> ~G        A)
#
#         PDG            Width
DECAY        25     3.17551304E-03   # h decays
#          BR         NDA      ID1       ID2
     7.40937769E-01    2           5        -5   # BR(h -> b       bb     )
     7.53892270E-02    2         -15        15   # BR(h -> tau+    tau-   )
     2.66908669E-04    2         -13        13   # BR(h -> mu+     mu-    )
     5.74954312E-04    2           3        -3   # BR(h -> s       sb     )
     2.48308570E-02    2           4        -4   # BR(h -> c       cb     )
     6.77213767E-02    2          21        21   # BR(h -> g       g      )
     2.10627712E-03    2          22        22   # BR(h -> gam     gam    )
     6.99452461E-04    2          22        23   # BR(h -> Z       gam    )
     7.91867053E-02    2          24       -24   # BR(h -> W+      W-     )
     8.28647281E-03    2          23        23   # BR(h -> Z       Z      )
#
#         PDG            Width
DECAY        35     4.07416753E+01   # H decays
#          BR         NDA      ID1       ID2
     1.37265096E-03    2           5        -5   # BR(H -> b       bb     )
     2.28780164E-04    2         -15        15   # BR(H -> tau+    tau-   )
     8.08823055E-07    2         -13        13   # BR(H -> mu+     mu-    )
     1.03577817E-06    2           3        -3   # BR(H -> s       sb     )
     9.33817461E-06    2           4        -4   # BR(H -> c       cb     )
     9.47825268E-01    2           6        -6   # BR(H -> t       tb     )
     7.62182268E-04    2          21        21   # BR(H -> g       g      )
     2.51903613E-06    2          22        22   # BR(H -> gam     gam    )
     1.11520791E-06    2          23        22   # BR(H -> Z       gam    )
     2.47800608E-04    2          24       -24   # BR(H -> W+      W-     )
     1.23562652E-04    2          23        23   # BR(H -> Z       Z      )
     8.13895018E-04    2          25        25   # BR(H -> h       h      )
     9.68395903E-24    2          36        36   # BR(H -> A       A      )
     3.13346115E-11    2          23        36   # BR(H -> Z       A      )
     3.01793589E-12    2          24       -37   # BR(H -> W+      H-     )
     3.01793589E-12    2         -24        37   # BR(H -> W-      H+     )
     1.05914271E-04    2     1000024  -1000024   # BR(H -> ~chi_1+ ~chi_1-)
     1.52187996E-02    2     1000022   1000022   # BR(H -> ~chi_10 ~chi_10)
     4.49595911E-05    2     1000023   1000023   # BR(H -> ~chi_20 ~chi_20)
     1.29988999E-02    2     1000025   1000025   # BR(H -> ~chi_30 ~chi_30)
     1.10797097E-05    2     1000022   1000023   # BR(H -> ~chi_10 ~chi_20)
     1.76226348E-02    2     1000022   1000025   # BR(H -> ~chi_10 ~chi_30)
     2.60875586E-03    2     1000023   1000025   # BR(H -> ~chi_20 ~chi_30)
#
#         PDG            Width
DECAY        36     4.12501253E+01   # A decays
#          BR         NDA      ID1       ID2
     1.37323685E-03    2           5        -5   # BR(A -> b       bb     )
     2.26089407E-04    2         -15        15   # BR(A -> tau+    tau-   )
     7.99307729E-07    2         -13        13   # BR(A -> mu+     mu-    )
     1.05397588E-06    2           3        -3   # BR(A -> s       sb     )
     9.23625457E-06    2           4        -4   # BR(A -> c       cb     )
     9.48773493E-01    2           6        -6   # BR(A -> t       tb     )
     9.04843554E-04    2          21        21   # BR(A -> g       g      )
     3.18970792E-06    2          22        22   # BR(A -> gam     gam    )
     1.29960554E-06    2          23        22   # BR(A -> Z       gam    )
     2.41653402E-04    2          23        25   # BR(A -> Z       h      )
     6.14266762E-04    2     1000024  -1000024   # BR(A -> ~chi_1+ ~chi_1-)
     8.96001776E-04    2     1000022   1000022   # BR(A -> ~chi_10 ~chi_10)
     1.30871777E-03    2     1000023   1000023   # BR(A -> ~chi_20 ~chi_20)
     8.90456498E-05    2     1000025   1000025   # BR(A -> ~chi_30 ~chi_30)
     8.10440047E-03    2     1000022   1000023   # BR(A -> ~chi_10 ~chi_20)
     1.51300170E-03    2     1000022   1000025   # BR(A -> ~chi_10 ~chi_30)
     3.59396710E-02    2     1000023   1000025   # BR(A -> ~chi_20 ~chi_30)
#
#         PDG            Width
DECAY        37     4.04200684E+01   # H+ decays
#          BR         NDA      ID1       ID2
     2.20585972E-06    2           4        -5   # BR(H+ -> c       bb     )
     2.30958382E-04    2         -15        16   # BR(H+ -> tau+    nu_tau )
     8.16521309E-07    2         -13        14   # BR(H+ -> mu+     nu_mu  )
     1.40249268E-08    2           2        -5   # BR(H+ -> u       bb     )
     5.05752478E-08    2           2        -3   # BR(H+ -> u       sb     )
     1.00773094E-05    2           4        -3   # BR(H+ -> c       sb     )
     9.50615845E-01    2           6        -5   # BR(H+ -> t       bb     )
     2.47691887E-04    2          24        25   # BR(H+ -> W+      h      )
     9.39622499E-13    2          24        36   # BR(H+ -> W+      A      )
     8.59265378E-03    2     1000024   1000022   # BR(H+ -> ~chi_1+ ~chi_10)
     1.80641922E-04    2     1000024   1000023   # BR(H+ -> ~chi_1+ ~chi_20)
     4.01190447E-02    2     1000024   1000025   # BR(H+ -> ~chi_1+ ~chi_30)
