#  ISAJET SUSY parameters in SUSY Les Houches Accord 2 format
#  Created by ISALHA 2.0 Last revision: C. Balazs 21 Apr 2009
Block SPINFO   # Program information
     1   ISASUGRA from ISAJET          # Spectrum Calculator
     2   7.80   29-OCT-2009 12:50:36   # Version number
Block MODSEL   # Model selection
     1     0   #   MsR(Q)          MbR(Q)                          
Block SMINPUTS   # Standard Model inputs
     1     1.27837601E+02   # alpha_em^(-1)
     2     1.16570000E-05   # G_Fermi
     3     1.17200002E-01   # alpha_s(M_Z)
     4     9.11699982E+01   # m_{Z}(pole)
     5     4.19999981E+00   # m_{b}(m_{b})
     6     1.72500000E+02   # m_{top}(pole)
     7     1.77699995E+00   # m_{tau}(pole)
Block MINPAR   # SUSY breaking input parameters
Block MASS   # Scalar and gaugino mass spectrum
#  PDG code   mass                 particle
        24     8.04229965E+01   #  W^+
        25     1.20300003E+02   #  h^0            
        35     2.51779834E+03   #  H^0            
        36     2.50000000E+03   #  A^0            
        37     2.51582983E+03   #  H^+            
   1000001     5.02802704E+02   #  dnl            
   1000002     4.97698395E+02   #  upl            
   1000003     5.02802734E+02   #  stl            
   1000004     4.97700226E+02   #  chl            
   1000005     5.00499939E+02   #  b1             
   1000006     5.19654236E+02   #  t1             
   1000011     2.50035645E+03   #  el-            
   1000012     2.49933496E+03   #  nuel           
   1000013     2.50035645E+03   #  mul-           
   1000014     2.49933496E+03   #  numl           
   1000015     2.50029565E+03   #  tau1           
   1000016     2.49933496E+03   #  nutl           
   1000021     7.00000000E+02   #  glss           
   1000022     4.95151367E+01   #  z1ss           
   1000023     2.42852466E+03   #  z2ss           
   1000024     2.42832593E+03   #  w1ss           
   1000025    -2.50041187E+03   #  z3ss           
   1000035     2.57237256E+03   #  z4ss           
   1000037     2.57219092E+03   #  w2ss           
   2000001     5.00513977E+02   #  dnr            
   2000002     4.98970459E+02   #  upr            
   2000003     5.00514008E+02   #  str            
   2000004     4.98972290E+02   #  chr            
   2000005     5.02833435E+02   #  b2             
   2000006     5.20962463E+02   #  t2             
   2000011     2.50030859E+03   #  er-            
   2000013     2.50030859E+03   #  mur-           
   2000015     2.50037036E+03   #  tau2           
Block ALPHA   # Effective Higgs mixing parameter
         -3.22530687E-01   # alpha
Block STOPMIX   # stop mixing matrix
  1  1     7.29895413E-01   # O_{11}
  1  2     6.83558881E-01   # O_{12}
  2  1    -6.83558881E-01   # O_{21}
  2  2     7.29895413E-01   # O_{22}
Block SBOTMIX   # sbottom mixing matrix
  1  1     5.52335052E-07   # O_{11}
  1  2    -1.00000000E+00   # O_{12}
  2  1     1.00000000E+00   # O_{21}
  2  2     5.52335052E-07   # O_{22}
Block STAUMIX   # stau mixing matrix
  1  1     2.81731172E-06   # O_{11}
  1  2    -1.00000000E+00   # O_{12}
  2  1     1.00000000E+00   # O_{21}
  2  2     2.81731172E-06   # O_{22}
Block NMIX   # neutralino mixing matrix
  1  1     9.99839604E-01   #
  1  2    -3.59976722E-04   #
  1  3     1.68992430E-02   #
  1  4    -5.92865795E-03   #
  2  1     1.16938101E-02   #
  2  2     7.08019316E-01   #
  2  3    -5.02892852E-01   #
  2  4     4.95652080E-01   #
  3  1    -7.75294006E-03   #
  3  2     7.19459541E-03   #
  3  3     7.06950903E-01   #
  3  4     7.07183957E-01   #
  4  1     1.11359842E-02   #
  4  2    -7.06156433E-01   #
  4  3    -4.97025281E-01   #
  4  4     5.04167676E-01   #
Block UMIX   # chargino U mixing matrix
  1  1    -7.02002406E-01   # U_{11}
  1  2     7.12174535E-01   # U_{12}
  2  1    -7.12174535E-01   # U_{21}
  2  2    -7.02002406E-01   # U_{22}
Block VMIX   # chargino V mixing matrix
  1  1    -7.12174356E-01   # V_{11}
  1  2     7.02002585E-01   # V_{12}
  2  1    -7.02002585E-01   # V_{21}
  2  2    -7.12174356E-01   # V_{22}
Block GAUGE Q=  0.00000000E+00   #
     1     0.00000000E+00   # g`
     2     0.00000000E+00   # g_2
     3     0.00000000E+00   # g_3
Block YU Q=  0.00000000E+00   #
  3  3     0.00000000E+00   # y_t
Block YD Q=  0.00000000E+00   #
  3  3     0.00000000E+00   # y_b
Block YE Q=  0.00000000E+00   #
  3  3     0.00000000E+00   # y_tau
Block HMIX Q=  0.00000000E+00   # Higgs mixing parameters
     1     0.00000000E+00   # mu(Q)
     2     0.00000000E+00   # tan(beta)(M_GUT)
     3     0.00000000E+00   # Higgs vev at Q
     4     6.25000000E+06   # m_A^2(Q)
Block MSOFT Q=  0.00000000E+00   # DRbar SUSY breaking parameters
     1     0.00000000E+00   # M_1(Q)          
     2     0.00000000E+00   # M_2(Q)          
     3     0.00000000E+00   # M_3(Q)          
    31     0.00000000E+00   # MeL(Q)          
    32     0.00000000E+00   # MmuL(Q)         
    33     0.00000000E+00   # MtauL(Q)        
    34     0.00000000E+00   # MeR(Q)          
    35     0.00000000E+00   # MmuR(Q)         
    36     0.00000000E+00   # MtauR(Q)        
    41     0.00000000E+00   # MqL1(Q)         
    42     0.00000000E+00   # MqL2(Q)         
    43     0.00000000E+00   # MqL3(Q)         
    44     0.00000000E+00   # MuR(Q)          
    45     0.00000000E+00   # McR(Q)          
    46     0.00000000E+00   # MtR(Q)          
    47     0.00000000E+00   # MdR(Q)          
    48     0.00000000E+00   # MsR(Q)          
    49     0.00000000E+00   # MbR(Q)          
Block AU Q=  0.00000000E+00   #
  1  1     0.00000000E+00   # A_u
  2  2     0.00000000E+00   # A_c
  3  3     0.00000000E+00   # A_t
Block AD Q=  0.00000000E+00   #
  1  1     0.00000000E+00   # A_d
  2  2     0.00000000E+00   # A_s
  3  3     0.00000000E+00   # A_b
Block AE Q=  0.00000000E+00   #
  1  1     0.00000000E+00   # A_e
  2  2     0.00000000E+00   # A_mu
  3  3     0.00000000E+00   # A_tau
#         PDG         Width
DECAY   1000021  4.20419044E+01   # GLSS  decays
#          BR          NDA       ID1       ID2       ID3       ID4
      4.86541949E-02    2     -1000002         2                       # GLSS   -->  UBL    UP                 
      4.86541949E-02    2      1000002        -2                       # GLSS   -->  UPL    UB                 
      4.66248319E-02    2     -1000001         1                       # GLSS   -->  DBL    DN                 
      4.66248319E-02    2      1000001        -1                       # GLSS   -->  DNL    DB                 
      4.81463447E-02    2     -2000002         2                       # GLSS   -->  UBR    UP                 
      4.81463447E-02    2      2000002        -2                       # GLSS   -->  UPR    UB                 
      4.75319996E-02    2     -2000001         1                       # GLSS   -->  DBR    DN                 
      4.75319996E-02    2      2000001        -1                       # GLSS   -->  DNR    DB                 
      4.66248095E-02    2     -1000003         3                       # GLSS   -->  SBL    ST                 
      4.66248095E-02    2      1000003        -3                       # GLSS   -->  STL    SB                 
      4.75319736E-02    2     -2000003         3                       # GLSS   -->  SBR    ST                 
      4.75319736E-02    2      2000003        -3                       # GLSS   -->  STR    SB                 
      4.86527085E-02    2     -1000004         4                       # GLSS   -->  CBL    CH                 
      4.86527085E-02    2      1000004        -4                       # GLSS   -->  CHL    CB                 
      4.81448695E-02    2     -2000004         4                       # GLSS   -->  CBR    CH                 
      4.81448695E-02    2      2000004        -4                       # GLSS   -->  CHR    CB                 
      4.75271903E-02    2     -1000005         5                       # GLSS   -->  BB1    BT                 
      4.75271903E-02    2      1000005        -5                       # GLSS   -->  BT1    BB                 
      4.66022007E-02    2     -2000005         5                       # GLSS   -->  BB2    BT                 
      4.66022007E-02    2      2000005        -5                       # GLSS   -->  BT2    BB                 
      4.59843402E-04    2     -1000006         6                       # GLSS   -->  TB1    TP                 
      4.59843402E-04    2      1000006        -6                       # GLSS   -->  TP1    TB                 
      2.34990586E-02    2     -2000006         6                       # GLSS   -->  TB2    TP                 
      2.34990586E-02    2      2000006        -6                       # GLSS   -->  TP2    TB                 
      1.26067057E-09    2      1000039        21                       # GLSS   -->  GVSS   GL                 
#         PDG         Width
DECAY   1000002  6.86395690E-02   # UPL   decays
#          BR          NDA       ID1       ID2       ID3       ID4
      1.00000000E+00    2      1000022         2                       # UPL    -->  Z1SS   UP                 
#         PDG         Width
DECAY   1000001  6.99189827E-02   # DNL   decays
#          BR          NDA       ID1       ID2       ID3       ID4
      1.00000000E+00    2      1000022         1                       # DNL    -->  Z1SS   DN                 
#         PDG         Width
DECAY   1000003  6.99189901E-02   # STL   decays
#          BR          NDA       ID1       ID2       ID3       ID4
      1.00000000E+00    2      1000022         3                       # STL    -->  Z1SS   ST                 
#         PDG         Width
DECAY   1000004  6.86388016E-02   # CHL   decays
#          BR          NDA       ID1       ID2       ID3       ID4
      1.00000000E+00    2      1000022         4                       # CHL    -->  Z1SS   CH                 
#         PDG         Width
DECAY   1000005  2.77199477E-01   # BT1   decays
#          BR          NDA       ID1       ID2       ID3       ID4
      1.00000000E+00    2      1000022         5                       # BT1    -->  Z1SS   BT                 
#         PDG         Width
DECAY   1000006  4.81223136E-01   # TP1   decays
#          BR          NDA       ID1       ID2       ID3       ID4
      3.18102508E-07    2      1000022         4                       # TP1    -->  Z1SS   CH                 
      9.99999702E-01    2      1000022         6                       # TP1    -->  Z1SS   TP                 
#         PDG         Width
DECAY   2000002  1.10549295E+00   # UPR   decays
#          BR          NDA       ID1       ID2       ID3       ID4
      1.00000000E+00    2      1000022         2                       # UPR    -->  Z1SS   UP                 
#         PDG         Width
DECAY   2000001  2.77262151E-01   # DNR   decays
#          BR          NDA       ID1       ID2       ID3       ID4
      1.00000000E+00    2      1000022         1                       # DNR    -->  Z1SS   DN                 
#         PDG         Width
DECAY   2000003  2.77262181E-01   # STR   decays
#          BR          NDA       ID1       ID2       ID3       ID4
      1.00000000E+00    2      1000022         3                       # STR    -->  Z1SS   ST                 
#         PDG         Width
DECAY   2000004  1.10548067E+00   # CHR   decays
#          BR          NDA       ID1       ID2       ID3       ID4
      1.00000000E+00    2      1000022         4                       # CHR    -->  Z1SS   CH                 
#         PDG         Width
DECAY   2000005  6.99141547E-02   # BT2   decays
#          BR          NDA       ID1       ID2       ID3       ID4
      1.00000000E+00    2      1000022         5                       # BT2    -->  Z1SS   BT                 
#         PDG         Width
DECAY   2000006  4.84786063E-01   # TP2   decays
#          BR          NDA       ID1       ID2       ID3       ID4
      3.15764623E-07    2      1000022         4                       # TP2    -->  Z1SS   CH                 
      9.99999702E-01    2      1000022         6                       # TP2    -->  Z1SS   TP                 
#         PDG         Width
DECAY   1000011  3.22240710E+00   # EL-   decays
#          BR          NDA       ID1       ID2       ID3       ID4
      9.84262943E-01    2      1000022        11                       # EL-    -->  Z1SS   E-                 
      5.34682302E-03    2      1000023        11                       # EL-    -->  Z2SS   E-                 
      1.03807310E-02    2     -1000024        12                       # EL-    -->  W1SS-  NUE                
      9.56363601E-06    2           11   1000039                       # EL-    -->  E-     GVSS               
#         PDG         Width
DECAY   1000013  3.22240710E+00   # MUL-  decays
#          BR          NDA       ID1       ID2       ID3       ID4
      9.84262943E-01    2      1000022        13                       # MUL-   -->  Z1SS   MU-                
      5.34681790E-03    2      1000023        13                       # MUL-   -->  Z2SS   MU-                
      1.03807310E-02    2     -1000024        14                       # MUL-   -->  W1SS-  NUM                
      9.56363601E-06    2           13   1000039                       # MUL-   -->  MU-    GVSS               
#         PDG         Width
DECAY   1000015  1.27032700E+01   # TAU1- decays
#          BR          NDA       ID1       ID2       ID3       ID4
      9.99987543E-01    2      1000022        15                       # TAU1-  -->  Z1SS   TAU-               
      3.65754045E-06    2      1000023        15                       # TAU1-  -->  Z2SS   TAU-               
      6.37783251E-06    2     -1000024        16                       # TAU1-  -->  W1SS-  NUT                
      2.42568422E-06    2           15   1000039                       # TAU1-  -->  TAU-   GVSS               
#         PDG         Width
DECAY   1000012  3.22839093E+00   # NUEL  decays
#          BR          NDA       ID1       ID2       ID3       ID4
      9.84613180E-01    2      1000022        12                       # NUEL   -->  Z1SS   NUE                
      5.00530750E-03    2      1000023        12                       # NUEL   -->  Z2SS   NUE                
      1.03720119E-02    2      1000024        11                       # NUEL   -->  W1SS+  E-                 
      9.52642404E-06    2           12   1000039                       # NUEL   -->  NUE    GVSS               
#         PDG         Width
DECAY   1000014  3.22839093E+00   # NUML  decays
#          BR          NDA       ID1       ID2       ID3       ID4
      9.84613180E-01    2      1000022        14                       # NUML   -->  Z1SS   NUM                
      5.00530750E-03    2      1000023        14                       # NUML   -->  Z2SS   NUM                
      1.03720017E-02    2      1000024        13                       # NUML   -->  W1SS+  MU-                
      9.52642404E-06    2           14   1000039                       # NUML   -->  NUM    GVSS               
#         PDG         Width
DECAY   1000016  3.22837877E+00   # NUTL  decays
#          BR          NDA       ID1       ID2       ID3       ID4
      9.84616876E-01    2      1000022        16                       # NUTL   -->  Z1SS   NUT                
      5.00532612E-03    2      1000023        16                       # NUTL   -->  Z2SS   NUT                
      1.03683183E-02    2      1000024        15                       # NUTL   -->  W1SS+  TAU-               
      9.52646042E-06    2           16   1000039                       # NUTL   -->  NUT    GVSS               
#         PDG         Width
DECAY   2000011  1.27032137E+01   # ER-   decays
#          BR          NDA       ID1       ID2       ID3       ID4
      9.99997139E-01    2      1000022        11                       # ER-    -->  Z1SS   E-                 
      4.38489423E-07    2      1000023        11                       # ER-    -->  Z2SS   E-                 
      2.82060361E-40    3      1000015        12       -16             # ER-    -->  TAU1-  NUE    ANUT        
      2.42576220E-06    2           11   1000039                       # ER-    -->  E-     GVSS               
#         PDG         Width
DECAY   2000013  1.27032137E+01   # MUR-  decays
#          BR          NDA       ID1       ID2       ID3       ID4
      9.99997139E-01    2      1000022        13                       # MUR-   -->  Z1SS   MU-                
      4.38488968E-07    2      1000023        13                       # MUR-   -->  Z2SS   MU-                
      1.20845268E-35    3      1000015        14       -16             # MUR-   -->  TAU1-  NUM    ANUT        
      2.42576220E-06    2           13   1000039                       # MUR-   -->  MU-    GVSS               
#         PDG         Width
DECAY   2000015  3.22241831E+00   # TAU2- decays
#          BR          NDA       ID1       ID2       ID3       ID4
      9.84268427E-01    2      1000022        15                       # TAU2-  -->  Z1SS   TAU-               
      5.34702651E-03    2      1000023        15                       # TAU2-  -->  Z2SS   TAU-               
      1.03845913E-02    2     -1000024        16                       # TAU2-  -->  W1SS-  NUT                
#         PDG         Width
DECAY   1000022  7.34044918E-14   # Z1SS  decays
#          BR          NDA       ID1       ID2       ID3       ID4
      9.81320918E-01    2      1000039        22                       # Z1SS   -->  GVSS   GM                 
      1.86790824E-02    3      1000039        11       -11             # Z1SS   -->  GVSS   E-     E+          
#         PDG         Width
DECAY   1000023  1.43832840E+02   # Z2SS  decays
#          BR          NDA       ID1       ID2       ID3       ID4
      8.13658616E-08    2      1000022        22                       # Z2SS   -->  Z1SS   GM                 
      1.01381750E-03    2      1000022        23                       # Z2SS   -->  Z1SS   Z0                 
      7.35741850E-08    3      1000022         5        -5             # Z2SS   -->  Z1SS   BT     BB          
      4.54516476E-06    3      1000022        11       -11             # Z2SS   -->  Z1SS   E-     E+          
      4.54516476E-06    3      1000022        13       -13             # Z2SS   -->  Z1SS   MU-    MU+         
      4.62946127E-06    3      1000022        15       -15             # Z2SS   -->  Z1SS   TAU-   TAU+        
      4.41029897E-06    3      1000022        12       -12             # Z2SS   -->  Z1SS   NUE    ANUE        
      4.41029897E-06    3      1000022        14       -14             # Z2SS   -->  Z1SS   NUM    ANUM        
      4.41029897E-06    3      1000022        16       -16             # Z2SS   -->  Z1SS   NUT    ANUT        
      4.60874476E-03    2      1000022        25                       # Z2SS   -->  Z1SS   HL0                
      4.93439138E-02    2      1000002        -2                       # Z2SS   -->  UPL    UB                 
      4.93439138E-02    2     -1000002         2                       # Z2SS   -->  UBL    UP                 
      4.86621782E-02    2      1000001        -1                       # Z2SS   -->  DNL    DB                 
      4.86621782E-02    2     -1000001         1                       # Z2SS   -->  DBL    DN                 
      4.86621782E-02    2      1000003        -3                       # Z2SS   -->  STL    SB                 
      4.86621782E-02    2     -1000003         3                       # Z2SS   -->  SBL    ST                 
      4.93438803E-02    2      1000004        -4                       # Z2SS   -->  CHL    CB                 
      4.93438803E-02    2     -1000004         4                       # Z2SS   -->  CBL    CH                 
      7.18191541E-06    2      2000002        -2                       # Z2SS   -->  UPR    UB                 
      7.18191541E-06    2     -2000002         2                       # Z2SS   -->  UBR    UP                 
      1.79449853E-06    2      2000001        -1                       # Z2SS   -->  DNR    DB                 
      1.79449853E-06    2     -2000001         1                       # Z2SS   -->  DBR    DN                 
      1.79449808E-06    2      2000003        -3                       # Z2SS   -->  STR    SB                 
      1.79449808E-06    2     -2000003         3                       # Z2SS   -->  SBR    ST                 
      7.18191041E-06    2      2000004        -4                       # Z2SS   -->  CHR    CB                 
      7.18191041E-06    2     -2000004         4                       # Z2SS   -->  CBR    CH                 
      3.23798333E-04    2      1000005        -5                       # Z2SS   -->  BT1    BB                 
      3.23798333E-04    2     -1000005         5                       # Z2SS   -->  BB1    BT                 
      4.90176417E-02    2      2000005        -5                       # Z2SS   -->  BT2    BB                 
      4.90176417E-02    2     -2000005         5                       # Z2SS   -->  BB2    BT                 
      2.07642496E-01    2      1000006        -6                       # Z2SS   -->  TP1    TB                 
      2.07642496E-01    2     -1000006         6                       # Z2SS   -->  TB1    TP                 
      4.41610850E-02    2      2000006        -6                       # Z2SS   -->  TP2    TB                 
      4.41610850E-02    2     -2000006         6                       # Z2SS   -->  TB2    TP                 
      2.28530048E-08    2      1000039        22                       # Z2SS   -->  GVSS   GM                 
      5.82484228E-10    3      1000039        11       -11             # Z2SS   -->  GVSS   E-     E+          
      1.06078524E-07    2      1000039        23                       # Z2SS   -->  GVSS   Z0                 
      8.85146179E-09    2      1000039        25                       # Z2SS   -->  GVSS   HL0                
#         PDG         Width
DECAY   1000025  1.13008453E+02   # Z3SS  decays
#          BR          NDA       ID1       ID2       ID3       ID4
      1.30370257E-08    2      1000022        22                       # Z3SS   -->  Z1SS   GM                 
      4.67309628E-11    2      1000023        22                       # Z3SS   -->  Z2SS   GM                 
      7.52237975E-06    3     -1000024         2        -1             # Z3SS   -->  W1SS-  UP     DB          
      2.50746007E-06    3     -1000024        12       -11             # Z3SS   -->  W1SS-  NUE    E+          
      2.50746007E-06    3     -1000024        14       -13             # Z3SS   -->  W1SS-  NUM    MU+         
      7.52237975E-06    3      1000024         1        -2             # Z3SS   -->  W1SS+  DN     UB          
      2.50746007E-06    3      1000024        11       -12             # Z3SS   -->  W1SS+  E-     ANUE        
      2.50746007E-06    3      1000024        13       -14             # Z3SS   -->  W1SS+  MU-    ANUM        
      7.52237975E-06    3     -1000024         4        -3             # Z3SS   -->  W1SS-  CH     SB          
      2.50746007E-06    3     -1000024        16       -15             # Z3SS   -->  W1SS-  NUT    TAU+        
      7.52237975E-06    3      1000024         3        -4             # Z3SS   -->  W1SS+  ST     CB          
      2.50746007E-06    3      1000024        15       -16             # Z3SS   -->  W1SS+  TAU-   ANUT        
      1.18643437E-02    2      1000022        23                       # Z3SS   -->  Z1SS   Z0                 
      2.45216313E-07    3      1000022         5        -5             # Z3SS   -->  Z1SS   BT     BB          
      2.95673850E-08    3      1000022        15       -15             # Z3SS   -->  Z1SS   TAU-   TAU+        
      1.67870121E-06    3      1000023         2        -2             # Z3SS   -->  Z2SS   UP     UB          
      2.16469630E-06    3      1000023         1        -1             # Z3SS   -->  Z2SS   DN     DB          
      2.16469630E-06    3      1000023         3        -3             # Z3SS   -->  Z2SS   ST     SB          
      1.67870121E-06    3      1000023         4        -4             # Z3SS   -->  Z2SS   CH     CB          
      2.09204086E-06    3      1000023         5        -5             # Z3SS   -->  Z2SS   BT     BB          
      4.91060291E-07    3      1000023        11       -11             # Z3SS   -->  Z2SS   E-     E+          
      4.91060291E-07    3      1000023        13       -13             # Z3SS   -->  Z2SS   MU-    MU+         
      4.87846194E-07    3      1000023        15       -15             # Z3SS   -->  Z2SS   TAU-   TAU+        
      9.77055493E-07    3      1000023        12       -12             # Z3SS   -->  Z2SS   NUE    ANUE        
      9.77055493E-07    3      1000023        14       -14             # Z3SS   -->  Z2SS   NUM    ANUM        
      9.77055493E-07    3      1000023        16       -16             # Z3SS   -->  Z2SS   NUT    ANUT        
      2.68779951E-03    2      1000022        25                       # Z3SS   -->  Z1SS   HL0                
      4.29610327E-06    2      1000002        -2                       # Z3SS   -->  UPL    UB                 
      4.29610327E-06    2     -1000002         2                       # Z3SS   -->  UBL    UP                 
      9.54686857E-06    2      1000001        -1                       # Z3SS   -->  DNL    DB                 
      9.54686857E-06    2     -1000001         1                       # Z3SS   -->  DBL    DN                 
      9.54686857E-06    2      1000003        -3                       # Z3SS   -->  STL    SB                 
      9.54686857E-06    2     -1000003         3                       # Z3SS   -->  SBL    ST                 
      4.29610009E-06    2      1000004        -4                       # Z3SS   -->  CHL    CB                 
      4.29610009E-06    2     -1000004         4                       # Z3SS   -->  CBL    CH                 
      4.15761406E-06    2      2000002        -2                       # Z3SS   -->  UPR    UB                 
      4.15761406E-06    2     -2000002         2                       # Z3SS   -->  UBR    UP                 
      1.03886941E-06    2      2000001        -1                       # Z3SS   -->  DNR    DB                 
      1.03886941E-06    2     -2000001         1                       # Z3SS   -->  DBR    DN                 
      1.03886919E-06    2      2000003        -3                       # Z3SS   -->  STR    SB                 
      1.03886919E-06    2     -2000003         3                       # Z3SS   -->  SBR    ST                 
      4.15761087E-06    2      2000004        -4                       # Z3SS   -->  CHR    CB                 
      4.15761087E-06    2     -2000004         4                       # Z3SS   -->  CBR    CH                 
      8.39914894E-04    2      1000005        -5                       # Z3SS   -->  BT1    BB                 
      8.39914894E-04    2     -1000005         5                       # Z3SS   -->  BB1    BT                 
      8.48267809E-04    2      2000005        -5                       # Z3SS   -->  BT2    BB                 
      8.48267809E-04    2     -2000005         5                       # Z3SS   -->  BB2    BT                 
      2.12370381E-01    2      1000006        -6                       # Z3SS   -->  TP1    TB                 
      2.12370381E-01    2     -1000006         6                       # Z3SS   -->  TB1    TP                 
      2.78597414E-01    2      2000006        -6                       # Z3SS   -->  TP2    TB                 
      2.78597414E-01    2     -2000006         6                       # Z3SS   -->  TB2    TP                 
      7.86547701E-16    2      1000011       -11                       # Z3SS   -->  EL-    E+                 
      7.86547701E-16    2     -1000011        11                       # Z3SS   -->  EL+    E-                 
      2.30829556E-14    2      2000011       -11                       # Z3SS   -->  ER-    E+                 
      2.30829556E-14    2     -2000011        11                       # Z3SS   -->  ER+    E-                 
      4.53290053E-12    2      1000012       -12                       # Z3SS   -->  NUEL   ANUE               
      4.53290053E-12    2     -1000012        12                       # Z3SS   -->  ANUEL  NUE                
      4.53290053E-12    2      1000014       -14                       # Z3SS   -->  NUML   ANUM               
      4.53290053E-12    2     -1000014        14                       # Z3SS   -->  ANUML  NUM                
      4.53290053E-12    2      1000016       -16                       # Z3SS   -->  NUTL   ANUT               
      4.53290053E-12    2     -1000016        16                       # Z3SS   -->  ANUTL  NUT                
      3.02244189E-12    2      1000039        22                       # Z3SS   -->  GVSS   GM                 
      7.71830787E-14    3      1000039        11       -11             # Z3SS   -->  GVSS   E-     E+          
      2.71709393E-08    2      1000039        23                       # Z3SS   -->  GVSS   Z0                 
      1.08177332E-07    2      1000039        25                       # Z3SS   -->  GVSS   HL0                
      1.28420770E-21    2      1000039        36                       # Z3SS   -->  GVSS   HA0                
#         PDG         Width
DECAY   1000035  1.45524170E+02   # Z4SS  decays
#          BR          NDA       ID1       ID2       ID3       ID4
      4.48317339E-09    2      1000022        22                       # Z4SS   -->  Z1SS   GM                 
      2.83597784E-10    2      1000023        22                       # Z4SS   -->  Z2SS   GM                 
      9.54287649E-10    2      1000025        22                       # Z4SS   -->  Z3SS   GM                 
      6.96157571E-03    2      1000024       -24                       # Z4SS   -->  W1SS+  W-                 
      6.96157571E-03    2     -1000024        24                       # Z4SS   -->  W1SS-  W+                 
      1.12773292E-03    2      1000022        23                       # Z4SS   -->  Z1SS   Z0                 
      2.38002368E-10    2      1000023        23                       # Z4SS   -->  Z2SS   Z0                 
      1.72335391E-16    3      1000023         5        -5             # Z4SS   -->  Z2SS   BT     BB          
      2.09991594E-17    3      1000023        15       -15             # Z4SS   -->  Z2SS   TAU-   TAU+        
      1.32027367E-06    3      1000025         2        -2             # Z4SS   -->  Z3SS   UP     UB          
      1.70250166E-06    3      1000025         1        -1             # Z4SS   -->  Z3SS   DN     DB          
      1.70250166E-06    3      1000025         3        -3             # Z4SS   -->  Z3SS   ST     SB          
      1.32027367E-06    3      1000025         4        -4             # Z4SS   -->  Z3SS   CH     CB          
      1.64626999E-06    3      1000025         5        -5             # Z4SS   -->  Z3SS   BT     BB          
      3.86211639E-07    3      1000025        11       -11             # Z4SS   -->  Z3SS   E-     E+          
      3.86211639E-07    3      1000025        13       -13             # Z4SS   -->  Z3SS   MU-    MU+         
      3.83900385E-07    3      1000025        15       -15             # Z4SS   -->  Z3SS   TAU-   TAU+        
      7.68439577E-07    3      1000025        12       -12             # Z4SS   -->  Z3SS   NUE    ANUE        
      7.68439577E-07    3      1000025        14       -14             # Z4SS   -->  Z3SS   NUM    ANUM        
      7.68439577E-07    3      1000025        16       -16             # Z4SS   -->  Z3SS   NUT    ANUT        
      4.49301442E-03    2      1000022        25                       # Z4SS   -->  Z1SS   HL0                
      1.38035477E-06    2      1000022        35                       # Z4SS   -->  Z1SS   HH0                
      2.91677793E-06    2      1000022        36                       # Z4SS   -->  Z1SS   HA0                
      4.68171137E-08    2      1000023        25                       # Z4SS   -->  Z2SS   HL0                
      5.12686670E-02    2      1000002        -2                       # Z4SS   -->  UPL    UB                 
      5.12686670E-02    2     -1000002         2                       # Z4SS   -->  UBL    UP                 
      5.17814569E-02    2      1000001        -1                       # Z4SS   -->  DNL    DB                 
      5.17814569E-02    2     -1000001         1                       # Z4SS   -->  DBL    DN                 
      5.17814569E-02    2      1000003        -3                       # Z4SS   -->  STL    SB                 
      5.17814569E-02    2     -1000003         3                       # Z4SS   -->  SBL    ST                 
      5.12686372E-02    2      1000004        -4                       # Z4SS   -->  CHL    CB                 
      5.12686372E-02    2     -1000004         4                       # Z4SS   -->  CBL    CH                 
      6.88417049E-06    2      2000002        -2                       # Z4SS   -->  UPR    UB                 
      6.88417049E-06    2     -2000002         2                       # Z4SS   -->  UBR    UP                 
      1.72020930E-06    2      2000001        -1                       # Z4SS   -->  DNR    DB                 
      1.72020930E-06    2     -2000001         1                       # Z4SS   -->  DBR    DN                 
      1.72020907E-06    2      2000003        -3                       # Z4SS   -->  STR    SB                 
      1.72020907E-06    2     -2000003         3                       # Z4SS   -->  SBR    ST                 
      6.88416685E-06    2      2000004        -4                       # Z4SS   -->  CHR    CB                 
      6.88416685E-06    2     -2000004         4                       # Z4SS   -->  CBR    CH                 
      3.34225188E-04    2      1000005        -5                       # Z4SS   -->  BT1    BB                 
      3.34225188E-04    2     -1000005         5                       # Z4SS   -->  BB1    BT                 
      5.20798452E-02    2      2000005        -5                       # Z4SS   -->  BT2    BB                 
      5.20798452E-02    2     -2000005         5                       # Z4SS   -->  BB2    BT                 
      5.86243756E-02    2      1000006        -6                       # Z4SS   -->  TP1    TB                 
      5.86243756E-02    2     -1000006         6                       # Z4SS   -->  TB1    TP                 
      1.72720090E-01    2      2000006        -6                       # Z4SS   -->  TP2    TB                 
      1.72720090E-01    2     -2000006         6                       # Z4SS   -->  TB2    TP                 
      5.55684273E-05    2      1000011       -11                       # Z4SS   -->  EL-    E+                 
      5.55684273E-05    2     -1000011        11                       # Z4SS   -->  EL+    E-                 
      5.55683691E-05    2      1000013       -13                       # Z4SS   -->  MUL-   MU+                
      5.55683691E-05    2     -1000013        13                       # Z4SS   -->  MUL+   MU-                
      1.70137735E-08    2      2000011       -11                       # Z4SS   -->  ER-    E+                 
      1.70137735E-08    2     -2000011        11                       # Z4SS   -->  ER+    E-                 
      1.70137557E-08    2      2000013       -13                       # Z4SS   -->  MUR-   MU+                
      1.70137557E-08    2     -2000013        13                       # Z4SS   -->  MUR+   MU-                
      1.46913919E-07    2      1000015       -15                       # Z4SS   -->  TAU1-  TAU+               
      1.46913919E-07    2     -1000015        15                       # Z4SS   -->  TAU1+  TAU-               
      5.55272964E-05    2      2000015       -15                       # Z4SS   -->  TAU2-  TAU+               
      5.55272964E-05    2     -2000015        15                       # Z4SS   -->  TAU2+  TAU-               
      5.91486751E-05    2      1000012       -12                       # Z4SS   -->  NUEL   ANUE               
      5.91486751E-05    2     -1000012        12                       # Z4SS   -->  ANUEL  NUE                
      5.91486751E-05    2      1000014       -14                       # Z4SS   -->  NUML   ANUM               
      5.91486751E-05    2     -1000014        14                       # Z4SS   -->  ANUML  NUM                
      5.91486751E-05    2      1000016       -16                       # Z4SS   -->  NUTL   ANUT               
      5.91486751E-05    2     -1000016        16                       # Z4SS   -->  ANUTL  NUT                
      2.66398246E-08    2      1000039        22                       # Z4SS   -->  GVSS   GM                 
      6.81545320E-10    3      1000039        11       -11             # Z4SS   -->  GVSS   E-     E+          
      1.43659094E-07    2      1000039        23                       # Z4SS   -->  GVSS   Z0                 
      1.24366286E-08    2      1000039        25                       # Z4SS   -->  GVSS   HL0                
      1.51022735E-13    2      1000039        35                       # Z4SS   -->  GVSS   HH0                
      1.12595297E-13    2      1000039        36                       # Z4SS   -->  GVSS   HA0                
#         PDG         Width
DECAY   1000024  1.43989380E+02   # W1SS+ decays
#          BR          NDA       ID1       ID2       ID3       ID4
      8.90760657E-06    3      1000022       -11        12             # W1SS+  -->  Z1SS   E+     NUE         
      8.90760657E-06    3      1000022       -13        14             # W1SS+  -->  Z1SS   MU+    NUM         
      8.99182305E-06    3      1000022       -15        16             # W1SS+  -->  Z1SS   TAU+   NUT         
      5.62468730E-03    2      1000022        24                       # W1SS+  -->  Z1SS   W+                 
      9.91305485E-02    2      1000002        -1                       # W1SS+  -->  UPL    DB                 
      9.61449444E-02    2     -1000001         2                       # W1SS+  -->  DBL    UP                 
      9.91304740E-02    2      1000004        -3                       # W1SS+  -->  CHL    SB                 
      9.63189602E-02    2     -1000003         4                       # W1SS+  -->  SBL    CH                 
      2.72797436E-01    2      1000006        -5                       # W1SS+  -->  TP1    BB                 
      9.97988973E-03    2      2000006        -5                       # W1SS+  -->  TP2    BB                 
      6.45103224E-04    2     -1000005         6                       # W1SS+  -->  BB1    TP                 
      3.20201129E-01    2     -2000005         6                       # W1SS+  -->  BB2    TP                 
#         PDG         Width
DECAY   1000037  1.45625137E+02   # W2SS+ decays
#          BR          NDA       ID1       ID2       ID3       ID4
      5.59116108E-03    2      1000022        24                       # W2SS+  -->  Z1SS   W+                 
      2.08745382E-06    2      1000022        37                       # W2SS+  -->  Z1SS   H+                 
      5.05721834E-14    3      1000023       -15        16             # W2SS+  -->  Z2SS   TAU+   NUT         
      6.98818639E-03    2      1000023        24                       # W2SS+  -->  Z2SS   W+                 
      5.66881226E-06    3      1000025         2        -1             # W2SS+  -->  Z3SS   UP     DB          
      5.66881226E-06    3      1000025         4        -3             # W2SS+  -->  Z3SS   CH     SB          
      1.88960394E-06    3      1000025       -11        12             # W2SS+  -->  Z3SS   E+     NUE         
      1.88960394E-06    3      1000025       -13        14             # W2SS+  -->  Z3SS   MU+    NUM         
      1.88960394E-06    3      1000025       -15        16             # W2SS+  -->  Z3SS   TAU+   NUT         
      1.01843663E-01    2      1000002        -1                       # W2SS+  -->  UPL    DB                 
      1.04648419E-01    2     -1000001         2                       # W2SS+  -->  DBL    UP                 
      1.01843588E-01    2      1000004        -3                       # W2SS+  -->  CHL    SB                 
      1.04816377E-01    2     -1000003         4                       # W2SS+  -->  SBL    CH                 
      5.78936143E-03    2      1000006        -5                       # W2SS+  -->  TP1    BB                 
      2.95919180E-01    2      2000006        -5                       # W2SS+  -->  TP2    BB                 
      6.62921811E-04    2     -1000005         6                       # W2SS+  -->  BB1    TP                 
      2.65457630E-01    2     -2000005         6                       # W2SS+  -->  BB2    TP                 
      1.14275019E-04    2      1000012       -11                       # W2SS+  -->  NUEL   E+                 
      1.14274888E-04    2      1000014       -13                       # W2SS+  -->  NUML   MU+                
      1.14236835E-04    2      1000016       -15                       # W2SS+  -->  NUTL   TAU+               
      1.14381677E-04    2     -1000011        12                       # W2SS+  -->  EL+    NUE                
      1.14381677E-04    2     -1000013        14                       # W2SS+  -->  MUL+   NUM                
      2.62472298E-07    2     -1000015        16                       # W2SS+  -->  TAU1+  NUT                
      1.14338014E-04    2     -2000015        16                       # W2SS+  -->  TAU2+  NUT                
      5.73368883E-03    2      1000024        23                       # W2SS+  -->  W1SS+  Z0                 
      4.15604546E-07    2      1000024        25                       # W2SS+  -->  W1SS+  HL0                
#         PDG         Width
DECAY        25  4.48549027E-03   # HL0   decays
#          BR          NDA       ID1       ID2       ID3       ID4
      4.57908955E-09    2           11       -11                       # HL0    -->  E-     E+                 
      1.93336542E-04    2           13       -13                       # HL0    -->  MU-    MU+                
      5.53023219E-02    2           15       -15                       # HL0    -->  TAU-   TAU+               
      5.74336309E-06    2            1        -1                       # HL0    -->  DN     DB                 
      2.32060696E-03    2            3        -3                       # HL0    -->  ST     SB                 
      7.55900979E-01    2            5        -5                       # HL0    -->  BT     BB                 
      1.82816643E-06    2            2        -2                       # HL0    -->  UP     UB                 
      3.41785178E-02    2            4        -4                       # HL0    -->  CH     CB                 
      1.99956773E-03    2           22        22                       # HL0    -->  GM     GM                 
      4.18050028E-02    2           21        21                       # HL0    -->  GL     GL                 
      5.41541772E-03    3           24        11       -12             # HL0    -->  W+     E-     ANUE        
      5.41541772E-03    3           24        13       -14             # HL0    -->  W+     MU-    ANUM        
      5.41541772E-03    3           24        15       -16             # HL0    -->  W+     TAU-   ANUT        
      1.62462518E-02    3           24        -2         1             # HL0    -->  W+     UB     DN          
      1.62462518E-02    3           24        -4         3             # HL0    -->  W+     CB     ST          
      5.41541772E-03    3          -24       -11        12             # HL0    -->  W-     E+     NUE         
      5.41541772E-03    3          -24       -13        14             # HL0    -->  W-     MU+    NUM         
      5.41541772E-03    3          -24       -15        16             # HL0    -->  W-     TAU+   NUT         
      1.62462518E-02    3          -24         2        -1             # HL0    -->  W-     UP     DB          
      1.62462518E-02    3          -24         4        -3             # HL0    -->  W-     CH     SB          
      6.36630284E-04    3           23        12       -12             # HL0    -->  Z0     NUE    ANUE        
      6.36630284E-04    3           23        14       -14             # HL0    -->  Z0     NUM    ANUM        
      6.36630284E-04    3           23        16       -16             # HL0    -->  Z0     NUT    ANUT        
      3.20409628E-04    3           23        11       -11             # HL0    -->  Z0     E-     E+          
      3.20409628E-04    3           23        13       -13             # HL0    -->  Z0     MU-    MU+         
      3.20409628E-04    3           23        15       -15             # HL0    -->  Z0     TAU-   TAU+        
      1.09769613E-03    3           23         2        -2             # HL0    -->  Z0     UP     UB          
      1.09769613E-03    3           23         4        -4             # HL0    -->  Z0     CH     CB          
      1.41410320E-03    3           23         1        -1             # HL0    -->  Z0     DN     DB          
      1.41410320E-03    3           23         3        -3             # HL0    -->  Z0     ST     SB          
      1.41410320E-03    3           23         5        -5             # HL0    -->  Z0     BT     BB          
      1.50629715E-03    2      1000022   1000022                       # HL0    -->  Z1SS   Z1SS               
#         PDG         Width
DECAY        35  1.42205536E+02   # HH0   decays
#          BR          NDA       ID1       ID2       ID3       ID4
      2.70653742E-11    2           11       -11                       # HH0    -->  E-     E+                 
      1.14274894E-06    2           13       -13                       # HH0    -->  MU-    MU+                
      3.27299844E-04    2           15       -15                       # HH0    -->  TAU-   TAU+               
      3.29250156E-08    2            1        -1                       # HH0    -->  DN     DB                 
      1.33033727E-05    2            3        -3                       # HH0    -->  ST     SB                 
      2.95862881E-03    2            5        -5                       # HH0    -->  BT     BB                 
      1.30738392E-10    2            2        -2                       # HH0    -->  UP     UB                 
      1.66040206E-06    2            4        -4                       # HH0    -->  CH     CB                 
      8.57475325E-02    2            6        -6                       # HH0    -->  TP     TB                 
      2.20445997E-07    2           22        22                       # HH0    -->  GM     GM                 
      3.02508706E-05    2           21        21                       # HH0    -->  GL     GL                 
      2.20901311E-05    2           24       -24                       # HH0    -->  W+     W-                 
      1.13188180E-05    2           23        23                       # HH0    -->  Z0     Z0                 
      9.00170744E-06    2      1000022   1000022                       # HH0    -->  Z1SS   Z1SS               
      4.67280688E-06    2      1000022   1000023                       # HH0    -->  Z1SS   Z2SS               
      2.59895436E-02    2           25        25                       # HH0    -->  HL0    HL0                
      3.05661742E-05    2      1000002  -1000002                       # HH0    -->  UPL    UBL                
      6.12846179E-06    2      2000002  -2000002                       # HH0    -->  UPR    UBR                
      3.05448448E-05    2      1000004  -1000004                       # HH0    -->  CHL    CBL                
      6.11892074E-06    2      2000004  -2000004                       # HH0    -->  CHR    CBR                
      4.57013703E-05    2      1000001  -1000001                       # HH0    -->  DNL    DBL                
      1.53122824E-06    2      2000001  -2000001                       # HH0    -->  DNR    DBR                
      4.57064416E-05    2      1000003  -1000003                       # HH0    -->  STL    SBL                
      1.53030078E-06    2      2000003  -2000003                       # HH0    -->  STR    SBR                
      1.33996957E-06    2      1000005  -1000005                       # HH0    -->  BT1    BB1                
      4.67899590E-05    2      2000005  -2000005                       # HH0    -->  BT2    BB2                
      1.31765371E-02    2      1000005  -2000005                       # HH0    -->  BT1    BB2                
      1.31765371E-02    2      2000005  -1000005                       # HH0    -->  BT2    BB1                
      4.52882707E-01    2      1000006  -1000006                       # HH0    -->  TP1    TB1                
      4.01488394E-01    2      2000006  -2000006                       # HH0    -->  TP2    TB2                
      1.97156589E-03    2      1000006  -2000006                       # HH0    -->  TP1    TB2                
      1.97156589E-03    2      2000006  -1000006                       # HH0    -->  TP2    TB1                
#         PDG         Width
DECAY        36  1.39126755E+02   # HA0   decays
#          BR          NDA       ID1       ID2       ID3       ID4
      2.74830610E-11    2           11       -11                       # HA0    -->  E-     E+                 
      1.16038439E-06    2           13       -13                       # HA0    -->  MU-    MU+                
      3.32351541E-04    2           15       -15                       # HA0    -->  TAU-   TAU+               
      3.34347874E-08    2            1        -1                       # HA0    -->  DN     DB                 
      1.35093451E-05    2            3        -3                       # HA0    -->  ST     SB                 
      3.00675491E-03    2            5        -5                       # HA0    -->  BT     BB                 
      1.32074629E-10    2            2        -2                       # HA0    -->  UP     UB                 
      1.67865687E-06    2            4        -4                       # HA0    -->  CH     CB                 
      8.79426301E-02    2            6        -6                       # HA0    -->  TP     TB                 
      2.24184447E-07    2           22        22                       # HA0    -->  GM     GM                 
      2.93545163E-05    2           21        21                       # HA0    -->  GL     GL                 
      1.46563007E-05    2      1000022   1000022                       # HA0    -->  Z1SS   Z1SS               
      3.78622135E-05    2      1000022   1000023                       # HA0    -->  Z1SS   Z2SS               
      2.22868639E-05    2           25        23                       # HA0    -->  HL0    Z0                 
      5.04501774E-10    2      1000002  -2000002                       # HA0    -->  UPL    UBR                
      5.04501774E-10    2      2000002  -1000002                       # HA0    -->  UPR    UBL                
      2.93193152E-05    2      1000004  -2000004                       # HA0    -->  CHL    CBR                
      2.93193152E-05    2      2000004  -1000004                       # HA0    -->  CHR    CBL                
      1.57473357E-09    2      1000001  -2000001                       # HA0    -->  DNL    DBR                
      1.57473357E-09    2      2000001  -1000001                       # HA0    -->  DNR    DBL                
      6.36271977E-07    2      1000003  -2000003                       # HA0    -->  STL    SBR                
      6.36271977E-07    2      2000003  -1000003                       # HA0    -->  STR    SBL                
      1.35457078E-02    2      1000005  -2000005                       # HA0    -->  BT1    BB2                
      1.35457078E-02    2      2000005  -1000005                       # HA0    -->  BT2    BB1                
      4.40723091E-01    2      1000006  -2000006                       # HA0    -->  TP1    TB2                
      4.40723091E-01    2      2000006  -1000006                       # HA0    -->  TP2    TB1                
#         PDG         Width
DECAY        37  1.37992462E+02   # H+    decays
#          BR          NDA       ID1       ID2       ID3       ID4
      2.78844205E-11    2           12       -11                       # H+     -->  NUE    E+                 
      1.17733055E-06    2           14       -13                       # H+     -->  NUM    MU+                
      3.37205187E-04    2           16       -15                       # H+     -->  NUT    TAU+               
      3.15227204E-08    2            2        -1                       # H+     -->  UP     DB                 
      1.42620065E-05    2            4        -3                       # H+     -->  CH     SB                 
      8.49749073E-02    2            6        -5                       # H+     -->  TP     BB                 
      6.42598388E-05    2      1000024   1000022                       # H+     -->  W1SS+  Z1SS               
      2.26243064E-05    2           25        24                       # H+     -->  HL0    W+                 
      7.77098103E-05    2      1000002  -1000001                       # H+     -->  UPL    DBL                
      3.16220339E-09    2      2000002  -2000001                       # H+     -->  UPR    DBR                
      7.76807137E-05    2      1000004  -1000003                       # H+     -->  CHL    SBL                
      1.27768953E-06    2      2000004  -2000003                       # H+     -->  CHR    SBR                
      1.49747189E-02    2      1000006  -1000005                       # H+     -->  TP1    BB1                
      4.22352523E-01    2      1000006  -2000005                       # H+     -->  TP1    BB2                
      1.21200662E-02    2      2000006  -1000005                       # H+     -->  TP2    BB1                
      4.64981496E-01    2      2000006  -2000005                       # H+     -->  TP2    BB2                
