  65
  401    403.8563    0.64697E-24
  402    396.8215    0.70716E-24
  403    403.8563    0.64702E-24
  404    396.8238    0.70716E-24
  405   3000.0916    0.47283E-26
  406   3002.5991    0.31030E-26
  407    403.8563    0.64697E-24
  408    396.8215    0.70716E-24
  409    403.8563    0.64702E-24
  410    396.8238    0.70716E-24
  411   3000.0916    0.47283E-26
  412   3002.5991    0.31030E-26
  413    400.7083    0.33297E-23
  414    398.5796    0.83807E-24
  415    400.7084    0.33297E-23
  416    398.5818    0.83808E-24
  417   3000.5220    0.31457E-26
  418   3002.8484    0.31584E-26
  419    400.7083    0.33297E-23
  420    398.5796    0.83807E-24
  421    400.7084    0.33297E-23
  422    398.5818    0.83808E-24
  423   3000.5220    0.31457E-26
  424   3002.8484    0.31584E-26
  425    200.0027    0.49704E-23
  426    185.3874    0.52323E-23
  427    200.0027    0.49704E-23
  428    185.3874    0.52323E-23
  429    199.8226    0.11619E-23
  430    185.3874    0.52323E-23
  431    200.0027    0.49704E-23
  432    185.3874    0.52323E-23
  433    200.0027    0.49704E-23
  434    185.3874    0.52323E-23
  435    199.8226    0.11619E-23
  436    185.3874    0.52323E-23
  437    200.0010    0.11591E-23
  438      0.0000    0.10000E+31
  439    200.0010    0.11591E-23
  440      0.0000    0.10000E+31
  441    200.1961    0.49582E-23
  442      0.0000    0.10000E+31
  443    200.0010    0.11591E-23
  444      0.0000    0.10000E+31
  445    200.0010    0.11591E-23
  446      0.0000    0.10000E+31
  447    200.1961    0.49582E-23
  448      0.0000    0.10000E+31
  449    900.0000    0.60983E-26
  450     99.9996    0.10000E+31
  451    299.9675    0.26449E-24
  452   -602.6180    0.13876E-24
  453    618.4830    0.11041E-24
  454    299.7536    0.26376E-24
  455    617.6116    0.11047E-24
  456    299.7536    0.26376E-24
  457    617.6116    0.11047E-24
  203    106.8536    0.17587E-21
  204   1007.7263    0.84370E-25
  205   1000.0000    0.85269E-25
  206   1012.7043    0.86798E-25
  207   1012.7043    0.86798E-25
  458      0.0000    0.10000E+31
    6    172.5000    0.57395E-24
   12    172.5000    0.57395E-24
   3
   401  0.59625976E-01     0   450     1     0     0     0
   401  0.31417069E+00     0   451     1     0     0     0
   401  0.62620330E+00     0   456     2     0     0     0
   3
   402  0.42218905E-01     0   450     2     0     0     0
   402  0.31706432E+00     0   451     2     0     0     0
   402  0.64071679E+00     0   454     1     0     0     0
   3
   403  0.59630066E-01     0   450     3     0     0     0
   403  0.31419250E+00     0   451     3     0     0     0
   403  0.62617737E+00     0   456     4     0     0     0
   3
   404  0.42218350E-01     0   450     4     0     0     0
   404  0.31703779E+00     0   451     4     0     0     0
   404  0.64074385E+00     0   454     3     0     0     0
   7
   405  0.12070411E-01     0   450     5     0     0     0
   405  0.71711780E-04     0   451     5     0     0     0
   405  0.75582747E-03     0   452     5     0     0     0
   405  0.75304363E-03     0   453     5     0     0     0
   405  0.98485494E+00     0   449     5     0     0     0
   405  0.11277366E-03     0   456     6     0     0     0
   405  0.13813076E-02     0   457     6     0     0     0
   7
   406  0.64188409E+00     0   449     6     0     0     0
   406  0.31634044E-01     0   450     6     0     0     0
   406  0.27134784E-02     0   451     6     0     0     0
   406  0.81822917E-01     0   452     6     0     0     0
   406  0.78348652E-01     0   453     6     0     0     0
   406  0.55435863E-02     0   454     5     0     0     0
   406  0.15805325E+00     0   455     5     0     0     0
   3
   407  0.59625976E-01     0   450     7     0     0     0
   407  0.31417069E+00     0   451     7     0     0     0
   407  0.62620330E+00     0   454     8     0     0     0
   3
   408  0.42218905E-01     0   450     8     0     0     0
   408  0.31706432E+00     0   451     8     0     0     0
   408  0.64071679E+00     0   456     7     0     0     0
   3
   409  0.59630066E-01     0   450     9     0     0     0
   409  0.31419250E+00     0   451     9     0     0     0
   409  0.62617737E+00     0   454    10     0     0     0
   3
   410  0.42218350E-01     0   450    10     0     0     0
   410  0.31703779E+00     0   451    10     0     0     0
   410  0.64074385E+00     0   456     9     0     0     0
   7
   411  0.12070411E-01     0   450    11     0     0     0
   411  0.71711780E-04     0   451    11     0     0     0
   411  0.75582747E-03     0   452    11     0     0     0
   411  0.75304363E-03     0   453    11     0     0     0
   411  0.98485494E+00     0   449    11     0     0     0
   411  0.11277366E-03     0   454    12     0     0     0
   411  0.13813076E-02     0   455    12     0     0     0
   7
   412  0.64188409E+00     0   449    12     0     0     0
   412  0.31634044E-01     0   450    12     0     0     0
   412  0.27134784E-02     0   451    12     0     0     0
   412  0.81822917E-01     0   452    12     0     0     0
   412  0.78348652E-01     0   453    12     0     0     0
   412  0.55435863E-02     0   456    11     0     0     0
   412  0.15805325E+00     0   457    11     0     0     0
   2
   413  0.99969745E+00     0   450     1     0     0     0
   413  0.30259069E-03     0   451     1     0     0     0
   2
   414  0.99970514E+00     0   450     2     0     0     0
   414  0.29480612E-03     0   451     2     0     0     0
   2
   415  0.99969745E+00     0   450     3     0     0     0
   415  0.30259092E-03     0   451     3     0     0     0
   2
   416  0.99970526E+00     0   450     4     0     0     0
   416  0.29478615E-03     0   451     4     0     0     0
   7
   417  0.24458154E-02     0   450     5     0     0     0
   417  0.55381663E-01     0   451     5     0     0     0
   417  0.64110011E-03     0   452     5     0     0     0
   417  0.35037152E-02     0   453     5     0     0     0
   417  0.65534246E+00     0   449     5     0     0     0
   417  0.11419794E+00     0   456     6     0     0     0
   417  0.16848728E+00     0   457     6     0     0     0
   7
   418  0.65341985E+00     0   449     6     0     0     0
   418  0.11519486E+00     0   454     5     0     0     0
   418  0.44677760E-02     0   455     5     0     0     0
   418  0.17957856E-02     0   450     6     0     0     0
   418  0.59222717E-01     0   451     6     0     0     0
   418  0.83399206E-01     0   452     6     0     0     0
   418  0.82499802E-01     0   453     6     0     0     0
   2
   419  0.99969745E+00     0   450     7     0     0     0
   419  0.30259069E-03     0   451     7     0     0     0
   2
   420  0.99970514E+00     0   450     8     0     0     0
   420  0.29480612E-03     0   451     8     0     0     0
   2
   421  0.99969745E+00     0   450     9     0     0     0
   421  0.30259092E-03     0   451     9     0     0     0
   2
   422  0.99970526E+00     0   450    10     0     0     0
   422  0.29478615E-03     0   451    10     0     0     0
   7
   423  0.24458154E-02     0   450    11     0     0     0
   423  0.55381663E-01     0   451    11     0     0     0
   423  0.64110011E-03     0   452    11     0     0     0
   423  0.35037152E-02     0   453    11     0     0     0
   423  0.65534246E+00     0   449    11     0     0     0
   423  0.11419794E+00     0   454    12     0     0     0
   423  0.16848728E+00     0   455    12     0     0     0
   7
   424  0.65341985E+00     0   449    12     0     0     0
   424  0.11519486E+00     0   456    11     0     0     0
   424  0.44677760E-02     0   457    11     0     0     0
   424  0.17957856E-02     0   450    12     0     0     0
   424  0.59222717E-01     0   451    12     0     0     0
   424  0.83399206E-01     0   452    12     0     0     0
   424  0.82499802E-01     0   453    12     0     0     0
   1
   425  0.10000000E+01     0   450   121     0     0     0
   1
   426  0.10000000E+01     0   450   122     0     0     0
   1
   427  0.10000000E+01     0   450   123     0     0     0
   1
   428  0.10000000E+01     0   450   124     0     0     0
   1
   429  0.10000000E+01     0   450   125     0     0     0
   1
   430  0.10000000E+01     0   450   126     0     0     0
   1
   431  0.10000000E+01     0   450   127     0     0     0
   1
   432  0.10000000E+01     0   450   128     0     0     0
   1
   433  0.10000000E+01     0   450   129     0     0     0
   1
   434  0.10000000E+01     0   450   130     0     0     0
   1
   435  0.10000000E+01     0   450   131     0     0     0
   1
   436  0.10000000E+01     0   450   132     0     0     0
   1
   437  0.10000000E+01     0   450   121     0     0     0
   0
   1
   439  0.10000000E+01     0   450   123     0     0     0
   0
   1
   441  0.10000000E+01     0   450   125     0     0     0
   0
   1
   443  0.10000000E+01     0   450   127     0     0     0
   0
   1
   445  0.10000000E+01     0   450   129     0     0     0
   0
   1
   447  0.10000000E+01     0   450   131     0     0     0
   0
  16
   449  0.62987469E-01     0   408     2     0     0     0
   449  0.62987469E-01     0   402     8     0     0     0
   449  0.61904773E-01     0   407     1     0     0     0
   449  0.61904773E-01     0   401     7     0     0     0
   449  0.62717803E-01     0   420     2     0     0     0
   449  0.62717803E-01     0   414     8     0     0     0
   449  0.62390447E-01     0   419     1     0     0     0
   449  0.62390447E-01     0   413     7     0     0     0
   449  0.61904747E-01     0   409     3     0     0     0
   449  0.61904747E-01     0   403     9     0     0     0
   449  0.62390432E-01     0   421     3     0     0     0
   449  0.62390432E-01     0   415     9     0     0     0
   449  0.62987044E-01     0   410     4     0     0     0
   449  0.62987044E-01     0   404    10     0     0     0
   449  0.62717371E-01     0   422     4     0     0     0
   449  0.62717371E-01     0   416    10     0     0     0
   0
  20
   451  0.33827772E-03     0   450   200     0     0     0
   451  0.60984106E-02     0   450   203     0     0     0
   451  0.77381037E-01     0   425   127     0     0     0
   451  0.77381037E-01     0   431   121     0     0     0
   451  0.77380970E-01     0   427   129     0     0     0
   451  0.77380970E-01     0   433   123     0     0     0
   451  0.12926737E-03     0   437   127     0     0     0
   451  0.12926737E-03     0   443   121     0     0     0
   451  0.12926725E-03     0   439   129     0     0     0
   451  0.12926725E-03     0   445   123     0     0     0
   451  0.14915275E-03     0   429   131     0     0     0
   451  0.14915275E-03     0   435   125     0     0     0
   451  0.77210493E-01     0   441   131     0     0     0
   451  0.77210493E-01     0   447   125     0     0     0
   451  0.88133827E-01     0   426   128     0     0     0
   451  0.88133827E-01     0   432   122     0     0     0
   451  0.88133827E-01     0   428   130     0     0     0
   451  0.88133827E-01     0   434   124     0     0     0
   451  0.88133827E-01     0   430   132     0     0     0
   451  0.88133827E-01     0   436   126     0     0     0
  40
   452  0.30201867E+00     0   454   199     0     0     0
   452  0.30201867E+00     0   456   198     0     0     0
   452  0.82657725E-01     0   450   200     0     0     0
   452  0.27255660E+00     0   451   200     0     0     0
   452  0.14372608E-01     0   450   203     0     0     0
   452  0.10294840E-01     0   451   203     0     0     0
   452  0.39994155E-03     0   402     8     0     0     0
   452  0.39994155E-03     0   408     2     0     0     0
   452  0.64059667E-03     0   401     7     0     0     0
   452  0.64059667E-03     0   407     1     0     0     0
   452  0.64059603E-03     0   403     9     0     0     0
   452  0.64059603E-03     0   409     3     0     0     0
   452  0.39992906E-03     0   404    10     0     0     0
   452  0.39992906E-03     0   410     4     0     0     0
   452  0.14319208E-03     0   414     8     0     0     0
   452  0.14319208E-03     0   420     2     0     0     0
   452  0.35204168E-04     0   413     7     0     0     0
   452  0.35204168E-04     0   419     1     0     0     0
   452  0.35204139E-04     0   415     9     0     0     0
   452  0.35204139E-04     0   421     3     0     0     0
   452  0.14318756E-03     0   416    10     0     0     0
   452  0.14318756E-03     0   422     4     0     0     0
   452  0.16067924E-03     0   425   127     0     0     0
   452  0.16067924E-03     0   431   121     0     0     0
   452  0.16067924E-03     0   427   129     0     0     0
   452  0.16067924E-03     0   433   123     0     0     0
   452  0.26873226E-03     0   437   127     0     0     0
   452  0.26873226E-03     0   443   121     0     0     0
   452  0.26873223E-03     0   439   129     0     0     0
   452  0.26873223E-03     0   445   123     0     0     0
   452  0.11152402E-02     0   429   131     0     0     0
   452  0.11152402E-02     0   435   125     0     0     0
   452  0.10048238E-02     0   441   131     0     0     0
   452  0.10048238E-02     0   447   125     0     0     0
   452  0.87471824E-03     0   426   128     0     0     0
   452  0.87471824E-03     0   432   122     0     0     0
   452  0.87471824E-03     0   428   130     0     0     0
   452  0.87471824E-03     0   434   124     0     0     0
   452  0.87471824E-03     0   430   132     0     0     0
   452  0.87471824E-03     0   436   126     0     0     0
  40
   453  0.25791326E+00     0   454   199     0     0     0
   453  0.25791326E+00     0   456   198     0     0     0
   453  0.12515474E-01     0   450   200     0     0     0
   453  0.10652964E-01     0   451   200     0     0     0
   453  0.58226161E-01     0   450   203     0     0     0
   453  0.19557361E+00     0   451   203     0     0     0
   453  0.98146293E-02     0   402     8     0     0     0
   453  0.98146293E-02     0   408     2     0     0     0
   453  0.11837834E-01     0   401     7     0     0     0
   453  0.11837834E-01     0   407     1     0     0     0
   453  0.11837824E-01     0   403     9     0     0     0
   453  0.11837824E-01     0   409     3     0     0     0
   453  0.98143602E-02     0   404    10     0     0     0
   453  0.98143602E-02     0   410     4     0     0     0
   453  0.61982189E-03     0   414     8     0     0     0
   453  0.61982189E-03     0   420     2     0     0     0
   453  0.15260674E-03     0   413     7     0     0     0
   453  0.15260674E-03     0   419     1     0     0     0
   453  0.15260663E-03     0   415     9     0     0     0
   453  0.15260663E-03     0   421     3     0     0     0
   453  0.61980466E-03     0   416    10     0     0     0
   453  0.61980466E-03     0   422     4     0     0     0
   453  0.57828315E-02     0   425   127     0     0     0
   453  0.57828315E-02     0   431   121     0     0     0
   453  0.57828315E-02     0   427   129     0     0     0
   453  0.57828315E-02     0   433   123     0     0     0
   453  0.10902924E-02     0   437   127     0     0     0
   453  0.10902924E-02     0   443   121     0     0     0
   453  0.10902921E-02     0   439   129     0     0     0
   453  0.10902921E-02     0   445   123     0     0     0
   453  0.17317539E-02     0   429   131     0     0     0
   453  0.17317539E-02     0   435   125     0     0     0
   453  0.64066849E-02     0   441   131     0     0     0
   453  0.64066849E-02     0   447   125     0     0     0
   453  0.12289487E-01     0   426   128     0     0     0
   453  0.12289487E-01     0   432   122     0     0     0
   453  0.12289487E-01     0   428   130     0     0     0
   453  0.12289487E-01     0   434   124     0     0     0
   453  0.12289487E-01     0   430   132     0     0     0
   453  0.12289487E-01     0   436   126     0     0     0
   8
   454  0.64362437E-02     0   450   198     0     0     0
   454  0.18666832E+00     0   426   127     0     0     0
   454  0.18666828E+00     0   428   129     0     0     0
   454  0.18683279E+00     0   430   131     0     0     0
   454  0.14459959E+00     0   431   122     0     0     0
   454  0.14459953E+00     0   433   124     0     0     0
   454  0.44430180E-04     0   435   126     0     0     0
   454  0.14415090E+00     0   447   126     0     0     0
  15
   455  0.63985117E-01     0   450   198     0     0     0
   455  0.26712286E+00     0   451   198     0     0     0
   455  0.14346159E-01     0   402     7     0     0     0
   455  0.30421559E-01     0   407     2     0     0     0
   455  0.14345923E-01     0   404     9     0     0     0
   455  0.32010473E-01     0   409     4     0     0     0
   455  0.11483031E-01     0   426   127     0     0     0
   455  0.11483031E-01     0   428   129     0     0     0
   455  0.12778309E-01     0   430   131     0     0     0
   455  0.24797807E-01     0   431   122     0     0     0
   455  0.24797807E-01     0   433   124     0     0     0
   455  0.13021276E-02     0   435   126     0     0     0
   455  0.24786692E-01     0   447   126     0     0     0
   455  0.25311014E+00     0   454   200     0     0     0
   455  0.21322908E+00     0   454   203     0     0     0
   8
   456  0.64362437E-02     0   450   199     0     0     0
   456  0.18666832E+00     0   432   121     0     0     0
   456  0.18666828E+00     0   434   123     0     0     0
   456  0.18683279E+00     0   436   125     0     0     0
   456  0.14459959E+00     0   425   128     0     0     0
   456  0.14459953E+00     0   427   130     0     0     0
   456  0.44430180E-04     0   429   132     0     0     0
   456  0.14415090E+00     0   441   132     0     0     0
  15
   457  0.63985117E-01     0   450   199     0     0     0
   457  0.26712286E+00     0   451   199     0     0     0
   457  0.14346159E-01     0   408     1     0     0     0
   457  0.30421559E-01     0   401     8     0     0     0
   457  0.14345923E-01     0   410     3     0     0     0
   457  0.32010473E-01     0   403    10     0     0     0
   457  0.11483031E-01     0   432   121     0     0     0
   457  0.11483031E-01     0   434   123     0     0     0
   457  0.12778309E-01     0   436   125     0     0     0
   457  0.24797807E-01     0   425   128     0     0     0
   457  0.24797807E-01     0   427   130     0     0     0
   457  0.13021276E-02     0   429   132     0     0     0
   457  0.24786692E-01     0   441   132     0     0     0
   457  0.25311014E+00     0   456   200     0     0     0
   457  0.21322908E+00     0   456   203     0     0     0
  28
   203  0.21258497E-03     0   123   129     0     0     0
   203  0.60786940E-01     0   125   131     0     0     0
   203  0.25562251E-02     0     3     9     0     0     0
   203  0.84673393E+00     0     5    11     0     0     0
   203  0.37053622E-01     0     4    10     0     0     0
   203  0.15089648E-02     0    59    59     0     0     0
   203  0.34190033E-01     0    13    13     0     0     0
   203  0.90874347E-03     0   198   121   128     0     0
   203  0.90874347E-03     0   198   123   130     0     0
   203  0.90874347E-03     0   198   125   132     0     0
   203  0.27262308E-02     0   198     8     1     0     0
   203  0.27262308E-02     0   198    10     3     0     0
   203  0.90874347E-03     0   199   127   122     0     0
   203  0.90874347E-03     0   199   129   124     0     0
   203  0.90874347E-03     0   199   131   126     0     0
   203  0.27262308E-02     0   199     2     7     0     0
   203  0.27262308E-02     0   199     4     9     0     0
   203  0.41068321E-04     0   200   122   128     0     0
   203  0.41068321E-04     0   200   124   130     0     0
   203  0.41068321E-04     0   200   126   132     0     0
   203  0.20669273E-04     0   200   121   127     0     0
   203  0.20669273E-04     0   200   123   129     0     0
   203  0.20669273E-04     0   200   125   131     0     0
   203  0.70811184E-04     0   200     2     8     0     0
   203  0.70811184E-04     0   200     4    10     0     0
   203  0.91222253E-04     0   200     1     7     0     0
   203  0.91222253E-04     0   200     3     9     0     0
   203  0.91222253E-04     0   200     5    11     0     0
  38
   204  0.14794374E-04     0   123   129     0     0     0
   204  0.42372565E-02     0   125   131     0     0     0
   204  0.17343211E-03     0     3     9     0     0     0
   204  0.42763080E-01     0     5    11     0     0     0
   204  0.35857454E+00     0     6    12     0     0     0
   204  0.19821858E-03     0    13    13     0     0     0
   204  0.89697621E-03     0   198   199     0     0     0
   204  0.45541968E-03     0   200   200     0     0     0
   204  0.15473306E-02     0   450   450     0     0     0
   204  0.92949979E-02     0   450   451     0     0     0
   204  0.58663055E-01     0   450   452     0     0     0
   204  0.10776405E-01     0   450   453     0     0     0
   204  0.11481657E-01     0   451   451     0     0     0
   204  0.13684963E+00     0   451   452     0     0     0
   204  0.65604765E-02     0   451   453     0     0     0
   204  0.25257001E-01     0   454   456     0     0     0
   204  0.14877187E+00     0   454   457     0     0     0
   204  0.14877187E+00     0   456   455     0     0     0
   204  0.38449455E-02     0   203   203     0     0     0
   204  0.17444318E-03     0   425   431     0     0     0
   204  0.13072573E-03     0   437   443     0     0     0
   204  0.17442883E-03     0   427   433     0     0     0
   204  0.13071332E-03     0   439   445     0     0     0
   204  0.12715733E-03     0   429   435     0     0     0
   204  0.17039488E-03     0   441   447     0     0     0
   204  0.12480724E-01     0   429   447     0     0     0
   204  0.12480724E-01     0   441   435     0     0     0
   204  0.58339594E-03     0   402   408     0     0     0
   204  0.11617353E-03     0   414   420     0     0     0
   204  0.58299821E-03     0   404   410     0     0     0
   204  0.11599809E-03     0   416   422     0     0     0
   204  0.84802875E-03     0   401   407     0     0     0
   204  0.28782073E-04     0   413   419     0     0     0
   204  0.84818690E-03     0   403   409     0     0     0
   204  0.28752689E-04     0   415   421     0     0     0
   204  0.61513303E-03     0   426   432     0     0     0
   204  0.61513303E-03     0   428   434     0     0     0
   204  0.61513303E-03     0   430   436     0     0     0
  21
   205  0.14872332E-04     0   123   129     0     0     0
   205  0.42596371E-02     0   125   131     0     0     0
   205  0.17435712E-03     0     3     9     0     0     0
   205  0.43032154E-01     0     5    11     0     0     0
   205  0.38516822E+00     0     6    12     0     0     0
   205  0.21293375E-03     0    13    13     0     0     0
   205  0.24288481E-02     0   450   450     0     0     0
   205  0.18711407E-01     0   450   451     0     0     0
   205  0.13680710E-01     0   450   452     0     0     0
   205  0.47532972E-01     0   450   453     0     0     0
   205  0.35170704E-01     0   451   451     0     0     0
   205  0.93028033E-02     0   451   452     0     0     0
   205  0.99542394E-01     0   451   453     0     0     0
   205  0.76438047E-01     0   454   456     0     0     0
   205  0.11898280E+00     0   454   457     0     0     0
   205  0.11898280E+00     0   456   455     0     0     0
   205  0.87785657E-03     0   203   200     0     0     0
   205  0.12692912E-01     0   429   447     0     0     0
   205  0.12692912E-01     0   441   435     0     0     0
   205  0.50288545E-04     0   404   422     0     0     0
   205  0.50288545E-04     0   416   410     0     0     0
  17
   206  0.15331174E-04     0   124   129     0     0     0
   206  0.43910565E-02     0   126   131     0     0     0
   206  0.17239660E-03     0     4     9     0     0     0
   206  0.39477029E+00     0     6    11     0     0     0
   206  0.27529204E-01     0   454   450     0     0     0
   206  0.47138037E-04     0   454   451     0     0     0
   206  0.16539462E+00     0   454   452     0     0     0
   206  0.15356447E+00     0   454   453     0     0     0
   206  0.53715888E-01     0   455   450     0     0     0
   206  0.16867609E+00     0   455   451     0     0     0
   206  0.92256680E-03     0   203   198     0     0     0
   206  0.14420563E-02     0   402   407     0     0     0
   206  0.14414678E-02     0   404   409     0     0     0
   206  0.72593440E-03     0   431   426     0     0     0
   206  0.72591321E-03     0   433   428     0     0     0
   206  0.25745619E-01     0   435   430     0     0     0
   206  0.71995670E-03     0   447   430     0     0     0
  17
   207  0.15331174E-04     0   130   123     0     0     0
   207  0.43910565E-02     0   132   125     0     0     0
   207  0.17239660E-03     0    10     3     0     0     0
   207  0.39477029E+00     0    12     5     0     0     0
   207  0.27529204E-01     0   456   450     0     0     0
   207  0.47138037E-04     0   456   451     0     0     0
   207  0.16539462E+00     0   456   452     0     0     0
   207  0.15356447E+00     0   456   453     0     0     0
   207  0.53715888E-01     0   457   450     0     0     0
   207  0.16867609E+00     0   457   451     0     0     0
   207  0.92256680E-03     0   203   199     0     0     0
   207  0.14420563E-02     0   408   401     0     0     0
   207  0.14414678E-02     0   410   403     0     0     0
   207  0.72593440E-03     0   425   432     0     0     0
   207  0.72591321E-03     0   427   434     0     0     0
   207  0.25745619E-01     0   429   436     0     0     0
   207  0.71995670E-03     0   441   436     0     0     0
   0
   5
     6  0.33333334E+00   100     2     7     5     0     0
     6  0.33333334E+00   100     4     9     5     0     0
     6  0.11111111E+00   100   122   127     5     0     0
     6  0.11111111E+00   100   124   129     5     0     0
     6  0.11111111E+00   100   126   131     5     0     0
   5
    12  0.33333334E+00   100     8     1    11     0     0
    12  0.33333334E+00   100    10     3    11     0     0
    12  0.11111111E+00   100   128   121    11     0     0
    12  0.11111111E+00   100   130   123    11     0     0
    12  0.11111111E+00   100   132   125    11     0     0
      4.00000000     -0.24965113
     -0.99620706      0.01872936     -0.07889482      0.03155782
     -0.03697012     -0.97399265      0.18600248     -0.12399424
      0.03241037     -0.04536194     -0.70344061     -0.70856375
      0.07179026     -0.22120078     -0.68143213      0.69394988
     -0.98397720      0.17829427     -0.17829427     -0.98397720
     -0.96388167      0.26633093     -0.26633093     -0.96388167
      1.57075512     -1.57079577     -1.57078493
    150.00000000   2400.00000000   2400.00000000
    600.00000000
    T
