  65
  401    602.5777    0.24516E-25
  402    597.8857    0.24744E-25
  403    602.5777    0.24516E-25
  404    597.8872    0.24744E-25
  405   2000.1373    0.59320E-26
  406   2004.0999    0.41291E-26
  407    602.5777    0.24516E-25
  408    597.8857    0.24744E-25
  409    602.5777    0.24516E-25
  410    597.8872    0.24744E-25
  411   2000.1373    0.59320E-26
  412   2004.0999    0.41291E-26
  413   2000.1418    0.59471E-26
  414   1999.7164    0.57737E-26
  415   2000.1418    0.59471E-26
  416   1999.7168    0.57737E-26
  417   2000.7828    0.41787E-26
  418   2004.4734    0.42139E-26
  419   2000.1418    0.59471E-26
  420   1999.7164    0.57737E-26
  421   2000.1418    0.59471E-26
  422   1999.7168    0.57737E-26
  423   2000.7828    0.41787E-26
  424   2004.4734    0.42139E-26
  425    204.8549    0.15592E-22
  426    190.6121    0.15236E-22
  427    204.8549    0.15592E-22
  428    190.6121    0.15236E-22
  429   2000.4075    0.64747E-25
  430   1999.0830    0.24507E-25
  431    204.8549    0.15592E-22
  432    190.6121    0.15236E-22
  433    204.8549    0.15592E-22
  434    190.6121    0.15236E-22
  435   2000.4075    0.64747E-25
  436   1999.0830    0.24507E-25
  437   2000.4253    0.65530E-25
  438      0.0000    0.10000E+31
  439   2000.4253    0.65530E-25
  440      0.0000    0.10000E+31
  441   2000.5106    0.24544E-25
  442      0.0000    0.10000E+31
  443   2000.4253    0.65530E-25
  444      0.0000    0.10000E+31
  445   2000.4253    0.65530E-25
  446      0.0000    0.10000E+31
  447   2000.5106    0.24544E-25
  448      0.0000    0.10000E+31
  449    300.0000    0.13837E-18
  450    149.9293    0.10000E+31
  451    249.7446    0.12789E-23
  452   -453.2516    0.22556E-24
  453    477.6109    0.17993E-24
  454    248.7191    0.12512E-23
  455    475.7236    0.17939E-24
  456    248.7191    0.12512E-23
  457    475.7236    0.17939E-24
  203    105.4010    0.17894E-21
  204   1007.6904    0.58177E-25
  205   1000.0000    0.59359E-25
  206   1007.8588    0.61351E-25
  207   1007.8588    0.61351E-25
  458      0.0000    0.10000E+31
    6    172.5000    0.57395E-24
   12    172.5000    0.57395E-24
   7
   401  0.50665648E-02     0   450     1     0     0     0
   401  0.55430438E-01     0   451     1     0     0     0
   401  0.74278847E-04     0   452     1     0     0     0
   401  0.14765214E-02     0   453     1     0     0     0
   401  0.82237571E+00     0   449     1     0     0     0
   401  0.11181773E+00     0   456     2     0     0     0
   401  0.37587064E-02     0   457     2     0     0     0
   7
   402  0.10952313E-02     0   450     2     0     0     0
   402  0.59997495E-01     0   451     2     0     0     0
   402  0.44089913E-04     0   452     2     0     0     0
   402  0.10808802E-02     0   453     2     0     0     0
   402  0.81574070E+00     0   449     2     0     0     0
   402  0.12023897E+00     0   454     1     0     0     0
   402  0.18026221E-02     0   455     1     0     0     0
   7
   403  0.50665746E-02     0   450     3     0     0     0
   403  0.55430543E-01     0   451     3     0     0     0
   403  0.74278993E-04     0   452     3     0     0     0
   403  0.14765242E-02     0   453     3     0     0     0
   403  0.82237732E+00     0   449     3     0     0     0
   403  0.11181631E+00     0   456     4     0     0     0
   403  0.37584477E-02     0   457     4     0     0     0
   7
   404  0.10952334E-02     0   450     4     0     0     0
   404  0.59997495E-01     0   451     4     0     0     0
   404  0.44088600E-04     0   452     4     0     0     0
   404  0.10808293E-02     0   453     4     0     0     0
   404  0.81573886E+00     0   449     4     0     0     0
   404  0.12024076E+00     0   454     3     0     0     0
   404  0.18026769E-02     0   455     3     0     0     0
   7
   405  0.98371282E-02     0   450     5     0     0     0
   405  0.20475850E-03     0   451     5     0     0     0
   405  0.64423919E-03     0   452     5     0     0     0
   405  0.65669633E-03     0   453     5     0     0     0
   405  0.98739225E+00     0   449     5     0     0     0
   405  0.19094055E-03     0   456     6     0     0     0
   405  0.10739579E-02     0   457     6     0     0     0
   7
   406  0.67802006E+00     0   449     6     0     0     0
   406  0.27623732E-01     0   450     6     0     0     0
   406  0.53977836E-02     0   451     6     0     0     0
   406  0.73825084E-01     0   452     6     0     0     0
   406  0.67140289E-01     0   453     6     0     0     0
   406  0.11328341E-01     0   454     5     0     0     0
   406  0.13666470E+00     0   455     5     0     0     0
   7
   407  0.50665648E-02     0   450     7     0     0     0
   407  0.55430438E-01     0   451     7     0     0     0
   407  0.74278847E-04     0   452     7     0     0     0
   407  0.14765214E-02     0   453     7     0     0     0
   407  0.82237571E+00     0   449     7     0     0     0
   407  0.11181773E+00     0   454     8     0     0     0
   407  0.37587064E-02     0   455     8     0     0     0
   7
   408  0.10952313E-02     0   450     8     0     0     0
   408  0.59997495E-01     0   451     8     0     0     0
   408  0.44089913E-04     0   452     8     0     0     0
   408  0.10808802E-02     0   453     8     0     0     0
   408  0.81574070E+00     0   449     8     0     0     0
   408  0.12023897E+00     0   456     7     0     0     0
   408  0.18026221E-02     0   457     7     0     0     0
   7
   409  0.50665746E-02     0   450     9     0     0     0
   409  0.55430543E-01     0   451     9     0     0     0
   409  0.74278993E-04     0   452     9     0     0     0
   409  0.14765242E-02     0   453     9     0     0     0
   409  0.82237732E+00     0   449     9     0     0     0
   409  0.11181631E+00     0   454    10     0     0     0
   409  0.37584477E-02     0   455    10     0     0     0
   7
   410  0.10952334E-02     0   450    10     0     0     0
   410  0.59997495E-01     0   451    10     0     0     0
   410  0.44088600E-04     0   452    10     0     0     0
   410  0.10808293E-02     0   453    10     0     0     0
   410  0.81573886E+00     0   449    10     0     0     0
   410  0.12024076E+00     0   456     9     0     0     0
   410  0.18026769E-02     0   457     9     0     0     0
   7
   411  0.98371282E-02     0   450    11     0     0     0
   411  0.20475850E-03     0   451    11     0     0     0
   411  0.64423919E-03     0   452    11     0     0     0
   411  0.65669633E-03     0   453    11     0     0     0
   411  0.98739225E+00     0   449    11     0     0     0
   411  0.19094055E-03     0   454    12     0     0     0
   411  0.10739579E-02     0   455    12     0     0     0
   7
   412  0.67802006E+00     0   449    12     0     0     0
   412  0.27623732E-01     0   450    12     0     0     0
   412  0.53977836E-02     0   451    12     0     0     0
   412  0.73825084E-01     0   452    12     0     0     0
   412  0.67140289E-01     0   453    12     0     0     0
   412  0.11328341E-01     0   456    11     0     0     0
   412  0.13666470E+00     0   457    11     0     0     0
   5
   413  0.98392600E-02     0   450     1     0     0     0
   413  0.11673841E-03     0   451     1     0     0     0
   413  0.13072638E-04     0   452     1     0     0     0
   413  0.11318413E-03     0   453     1     0     0     0
   413  0.98991776E+00     0   449     1     0     0     0
   5
   414  0.38201366E-01     0   450     2     0     0     0
   414  0.45323806E-03     0   451     2     0     0     0
   414  0.50752999E-04     0   452     2     0     0     0
   414  0.43942188E-03     0   453     2     0     0     0
   414  0.96085525E+00     0   449     2     0     0     0
   5
   415  0.98392600E-02     0   450     3     0     0     0
   415  0.11673841E-03     0   451     3     0     0     0
   415  0.13072638E-04     0   452     3     0     0     0
   415  0.11318413E-03     0   453     3     0     0     0
   415  0.98991776E+00     0   449     3     0     0     0
   5
   416  0.38201366E-01     0   450     4     0     0     0
   416  0.45323806E-03     0   451     4     0     0     0
   416  0.50752999E-04     0   452     4     0     0     0
   416  0.43942188E-03     0   453     4     0     0     0
   416  0.96085525E+00     0   449     4     0     0     0
   7
   417  0.32381651E-02     0   450     5     0     0     0
   417  0.44379529E-01     0   451     5     0     0     0
   417  0.64492092E-03     0   452     5     0     0     0
   417  0.57631936E-02     0   453     5     0     0     0
   417  0.69577545E+00     0   449     5     0     0     0
   417  0.97655423E-01     0   456     6     0     0     0
   417  0.15254334E+00     0   457     6     0     0     0
   7
   418  0.69207972E+00     0   449     6     0     0     0
   418  0.97455584E-01     0   454     5     0     0     0
   418  0.75896429E-02     0   455     5     0     0     0
   418  0.14998674E-02     0   450     6     0     0     0
   418  0.52415792E-01     0   451     6     0     0     0
   418  0.75561285E-01     0   452     6     0     0     0
   418  0.73398113E-01     0   453     6     0     0     0
   5
   419  0.98392600E-02     0   450     7     0     0     0
   419  0.11673841E-03     0   451     7     0     0     0
   419  0.13072638E-04     0   452     7     0     0     0
   419  0.11318413E-03     0   453     7     0     0     0
   419  0.98991776E+00     0   449     7     0     0     0
   5
   420  0.38201366E-01     0   450     8     0     0     0
   420  0.45323806E-03     0   451     8     0     0     0
   420  0.50752999E-04     0   452     8     0     0     0
   420  0.43942188E-03     0   453     8     0     0     0
   420  0.96085525E+00     0   449     8     0     0     0
   5
   421  0.98392600E-02     0   450     9     0     0     0
   421  0.11673841E-03     0   451     9     0     0     0
   421  0.13072638E-04     0   452     9     0     0     0
   421  0.11318413E-03     0   453     9     0     0     0
   421  0.98991776E+00     0   449     9     0     0     0
   5
   422  0.38201366E-01     0   450    10     0     0     0
   422  0.45323806E-03     0   451    10     0     0     0
   422  0.50752999E-04     0   452    10     0     0     0
   422  0.43942188E-03     0   453    10     0     0     0
   422  0.96085525E+00     0   449    10     0     0     0
   7
   423  0.32381651E-02     0   450    11     0     0     0
   423  0.44379529E-01     0   451    11     0     0     0
   423  0.64492092E-03     0   452    11     0     0     0
   423  0.57631936E-02     0   453    11     0     0     0
   423  0.69577545E+00     0   449    11     0     0     0
   423  0.97655423E-01     0   454    12     0     0     0
   423  0.15254334E+00     0   455    12     0     0     0
   7
   424  0.69207972E+00     0   449    12     0     0     0
   424  0.97455584E-01     0   456    11     0     0     0
   424  0.75896429E-02     0   457    11     0     0     0
   424  0.14998674E-02     0   450    12     0     0     0
   424  0.52415792E-01     0   451    12     0     0     0
   424  0.75561285E-01     0   452    12     0     0     0
   424  0.73398113E-01     0   453    12     0     0     0
   1
   425  0.10000000E+01     0   450   121     0     0     0
   1
   426  0.10000000E+01     0   450   122     0     0     0
   1
   427  0.10000000E+01     0   450   123     0     0     0
   1
   428  0.10000000E+01     0   450   124     0     0     0
   6
   429  0.96432465E+00     0   450   125     0     0     0
   429  0.11851377E-01     0   451   125     0     0     0
   429  0.42170407E-02     0   452   125     0     0     0
   429  0.13623822E-01     0   453   125     0     0     0
   429  0.90216118E-03     0   456   126     0     0     0
   429  0.50809439E-02     0   457   126     0     0     0
   6
   430  0.11472154E+00     0   450   126     0     0     0
   430  0.23782000E+00     0   451   126     0     0     0
   430  0.17326378E-02     0   452   126     0     0     0
   430  0.39629653E-01     0   453   126     0     0     0
   430  0.56470311E+00     0   454   125     0     0     0
   430  0.41393071E-01     0   455   125     0     0     0
   1
   431  0.10000000E+01     0   450   127     0     0     0
   1
   432  0.10000000E+01     0   450   128     0     0     0
   1
   433  0.10000000E+01     0   450   129     0     0     0
   1
   434  0.10000000E+01     0   450   130     0     0     0
   6
   435  0.96432465E+00     0   450   131     0     0     0
   435  0.11851377E-01     0   451   131     0     0     0
   435  0.42170407E-02     0   452   131     0     0     0
   435  0.13623822E-01     0   453   131     0     0     0
   435  0.90216118E-03     0   454   132     0     0     0
   435  0.50809439E-02     0   455   132     0     0     0
   6
   436  0.11472154E+00     0   450   132     0     0     0
   436  0.23782000E+00     0   451   132     0     0     0
   436  0.17326378E-02     0   452   132     0     0     0
   436  0.39629653E-01     0   453   132     0     0     0
   436  0.56470311E+00     0   456   131     0     0     0
   436  0.41393071E-01     0   457   131     0     0     0
   4
   437  0.97589833E+00     0   450   121     0     0     0
   437  0.11578662E-01     0   451   121     0     0     0
   437  0.12966337E-02     0   452   121     0     0     0
   437  0.11226417E-01     0   453   121     0     0     0
   0
   4
   439  0.97589833E+00     0   450   123     0     0     0
   439  0.11578662E-01     0   451   123     0     0     0
   439  0.12966336E-02     0   452   123     0     0     0
   439  0.11226417E-01     0   453   123     0     0     0
   0
   6
   441  0.70535220E-01     0   450   125     0     0     0
   441  0.30715746E+00     0   451   125     0     0     0
   441  0.14986952E-02     0   452   125     0     0     0
   441  0.19042864E-01     0   453   125     0     0     0
   441  0.52340996E+00     0   456   126     0     0     0
   441  0.78355819E-01     0   457   126     0     0     0
   0
   4
   443  0.97589833E+00     0   450   127     0     0     0
   443  0.11578662E-01     0   451   127     0     0     0
   443  0.12966337E-02     0   452   127     0     0     0
   443  0.11226417E-01     0   453   127     0     0     0
   0
   4
   445  0.97589833E+00     0   450   129     0     0     0
   445  0.11578662E-01     0   451   129     0     0     0
   445  0.12966336E-02     0   452   129     0     0     0
   445  0.11226417E-01     0   453   129     0     0     0
   0
   6
   447  0.70535220E-01     0   450   131     0     0     0
   447  0.30715746E+00     0   451   131     0     0     0
   447  0.14986952E-02     0   452   131     0     0     0
   447  0.19042864E-01     0   453   131     0     0     0
   447  0.52340996E+00     0   454   132     0     0     0
   447  0.78355819E-01     0   455   132     0     0     0
   0
  16
   449  0.70574485E-01     0   454     1     8     0     0
   449  0.70574485E-01     0   456     2     7     0     0
   449  0.70574008E-01     0   454     3    10     0     0
   449  0.70574008E-01     0   456     4     9     0     0
   449  0.11178948E-01     0   450    13     0     0     0
   449  0.61611403E-01     0   450     2     8     0     0
   449  0.22498503E+00     0   450     1     7     0     0
   449  0.22498503E+00     0   450     3     9     0     0
   449  0.61610807E-01     0   450     4    10     0     0
   449  0.42214016E-02     0   450     5    11     0     0
   449  0.52411715E-03     0   451    13     0     0     0
   449  0.34098126E-01     0   451     2     8     0     0
   449  0.30124631E-01     0   451     1     7     0     0
   449  0.30124631E-01     0   451     3     9     0     0
   449  0.34097683E-01     0   451     4    10     0     0
   449  0.14117346E-03     0   451     5    11     0     0
   0
   9
   451  0.10589398E-02     0   450   200     0     0     0
   451  0.11029882E+00     0   425   127     0     0     0
   451  0.11029882E+00     0   431   121     0     0     0
   451  0.11029851E+00     0   427   129     0     0     0
   451  0.11029851E+00     0   433   123     0     0     0
   451  0.13943659E+00     0   426   128     0     0     0
   451  0.13943659E+00     0   432   122     0     0     0
   451  0.13943659E+00     0   428   130     0     0     0
   451  0.13943659E+00     0   434   124     0     0     0
  14
   452  0.30340159E+00     0   454   199     0     0     0
   452  0.30340159E+00     0   456   198     0     0     0
   452  0.12926112E+00     0   450   200     0     0     0
   452  0.24009006E+00     0   451   200     0     0     0
   452  0.10894539E-01     0   450   203     0     0     0
   452  0.63760481E-02     0   451   203     0     0     0
   452  0.28244278E-03     0   425   127     0     0     0
   452  0.28244278E-03     0   431   121     0     0     0
   452  0.28244275E-03     0   427   129     0     0     0
   452  0.28244275E-03     0   433   123     0     0     0
   452  0.13613190E-02     0   426   128     0     0     0
   452  0.13613190E-02     0   432   122     0     0     0
   452  0.13613190E-02     0   428   130     0     0     0
   452  0.13613190E-02     0   434   124     0     0     0
  14
   453  0.28978685E+00     0   454   199     0     0     0
   453  0.28978685E+00     0   456   198     0     0     0
   453  0.10686089E-01     0   450   200     0     0     0
   453  0.86839218E-02     0   451   200     0     0     0
   453  0.82398929E-01     0   450   203     0     0     0
   453  0.16073567E+00     0   451   203     0     0     0
   453  0.11848736E-01     0   425   127     0     0     0
   453  0.11848736E-01     0   431   121     0     0     0
   453  0.11848735E-01     0   427   129     0     0     0
   453  0.11848735E-01     0   433   123     0     0     0
   453  0.27631681E-01     0   426   128     0     0     0
   453  0.27631681E-01     0   432   122     0     0     0
   453  0.27631681E-01     0   428   130     0     0     0
   453  0.27631681E-01     0   434   124     0     0     0
   5
   454  0.16136410E-01     0   450   198     0     0     0
   454  0.31493071E+00     0   426   127     0     0     0
   454  0.31493029E+00     0   428   129     0     0     0
   454  0.17700137E+00     0   431   122     0     0     0
   454  0.17700125E+00     0   433   124     0     0     0
   8
   455  0.58384813E-01     0   450   198     0     0     0
   455  0.31890562E+00     0   451   198     0     0     0
   455  0.27217086E-01     0   426   127     0     0     0
   455  0.27217085E-01     0   428   129     0     0     0
   455  0.50760463E-01     0   431   122     0     0     0
   455  0.50760459E-01     0   433   124     0     0     0
   455  0.27482268E+00     0   454   200     0     0     0
   455  0.19193180E+00     0   454   203     0     0     0
   5
   456  0.16136410E-01     0   450   199     0     0     0
   456  0.31493071E+00     0   432   121     0     0     0
   456  0.31493029E+00     0   434   123     0     0     0
   456  0.17700137E+00     0   425   128     0     0     0
   456  0.17700125E+00     0   427   130     0     0     0
   8
   457  0.58384813E-01     0   450   199     0     0     0
   457  0.31890562E+00     0   451   199     0     0     0
   457  0.27217086E-01     0   432   121     0     0     0
   457  0.27217085E-01     0   434   123     0     0     0
   457  0.50760463E-01     0   425   128     0     0     0
   457  0.50760459E-01     0   427   130     0     0     0
   457  0.27482268E+00     0   456   200     0     0     0
   457  0.19193180E+00     0   456   203     0     0     0
  28
   203  0.21321842E-03     0   123   129     0     0     0
   203  0.60965266E-01     0   125   131     0     0     0
   203  0.25643827E-02     0     3     9     0     0     0
   203  0.85107785E+00     0     5    11     0     0     0
   203  0.37275899E-01     0     4    10     0     0     0
   203  0.14856322E-02     0    59    59     0     0     0
   203  0.33281688E-01     0    13    13     0     0     0
   203  0.70840219E-03     0   198   121   128     0     0
   203  0.70840219E-03     0   198   123   130     0     0
   203  0.70840219E-03     0   198   125   132     0     0
   203  0.21252069E-02     0   198     8     1     0     0
   203  0.21252069E-02     0   198    10     3     0     0
   203  0.70840219E-03     0   199   127   122     0     0
   203  0.70840219E-03     0   199   129   124     0     0
   203  0.70840219E-03     0   199   131   126     0     0
   203  0.21252069E-02     0   199     2     7     0     0
   203  0.21252069E-02     0   199     4     9     0     0
   203  0.26317794E-04     0   200   122   128     0     0
   203  0.26317794E-04     0   200   124   130     0     0
   203  0.26317794E-04     0   200   126   132     0     0
   203  0.13245481E-04     0   200   121   127     0     0
   203  0.13245481E-04     0   200   123   129     0     0
   203  0.13245481E-04     0   200   125   131     0     0
   203  0.45377896E-04     0   200     2     8     0     0
   203  0.45377896E-04     0   200     4    10     0     0
   203  0.58457907E-04     0   200     1     7     0     0
   203  0.58457907E-04     0   200     3     9     0     0
   203  0.58457907E-04     0   200     5    11     0     0
  27
   204  0.10201460E-04     0   123   129     0     0     0
   204  0.29217999E-02     0   125   131     0     0     0
   204  0.11959014E-03     0     3     9     0     0     0
   204  0.29487411E-01     0     5    11     0     0     0
   204  0.24708815E+00     0     6    12     0     0     0
   204  0.14469543E-03     0    13    13     0     0     0
   204  0.59744593E-03     0   198   199     0     0     0
   204  0.30333965E-03     0   200   200     0     0     0
   204  0.27919177E-02     0   450   450     0     0     0
   204  0.13617249E-01     0   450   451     0     0     0
   204  0.68199925E-01     0   450   452     0     0     0
   204  0.10056359E-01     0   450   453     0     0     0
   204  0.15486320E-01     0   451   451     0     0     0
   204  0.13847083E+00     0   451   452     0     0     0
   204  0.13768196E-01     0   451   453     0     0     0
   204  0.28047437E-03     0   452   452     0     0     0
   204  0.18485306E-01     0   452   453     0     0     0
   204  0.74992364E-03     0   453   453     0     0     0
   204  0.41135181E-01     0   454   456     0     0     0
   204  0.60221116E-03     0   455   457     0     0     0
   204  0.19604112E+00     0   454   457     0     0     0
   204  0.19604112E+00     0   456   455     0     0     0
   204  0.25175393E-02     0   203   203     0     0     0
   204  0.11970093E-03     0   425   431     0     0     0
   204  0.11969107E-03     0   427   433     0     0     0
   204  0.42214798E-03     0   426   432     0     0     0
   204  0.42214798E-03     0   428   434     0     0     0
  21
   205  0.10353246E-04     0   123   129     0     0     0
   205  0.29653094E-02     0   125   131     0     0     0
   205  0.12137720E-03     0     3     9     0     0     0
   205  0.29956462E-01     0     5    11     0     0     0
   205  0.26813152E+00     0     6    12     0     0     0
   205  0.15659283E-03     0    13    13     0     0     0
   205  0.53718532E-02     0   450   450     0     0     0
   205  0.30992074E-01     0   450   451     0     0     0
   205  0.16313313E-01     0   450   452     0     0     0
   205  0.46722069E-01     0   450   453     0     0     0
   205  0.42818885E-01     0   451   451     0     0     0
   205  0.24391394E-01     0   451   452     0     0     0
   205  0.86166225E-01     0   451   453     0     0     0
   205  0.50865638E-03     0   452   452     0     0     0
   205  0.11971217E-02     0   452   453     0     0     0
   205  0.20412013E-01     0   453   453     0     0     0
   205  0.11069316E+00     0   454   456     0     0     0
   205  0.24965227E-01     0   455   457     0     0     0
   205  0.14375772E+00     0   454   457     0     0     0
   205  0.14375772E+00     0   456   455     0     0     0
   205  0.59093494E-03     0   203   200     0     0     0
  15
   206  0.10784568E-04     0   124   129     0     0     0
   206  0.30888466E-02     0   126   131     0     0     0
   206  0.12127362E-03     0     4     9     0     0     0
   206  0.25068969E+00     0     6    11     0     0     0
   206  0.39469879E-01     0   454   450     0     0     0
   206  0.60397055E-03     0   454   451     0     0     0
   206  0.20482653E+00     0   454   452     0     0     0
   206  0.20197199E+00     0   454   453     0     0     0
   206  0.34710016E-01     0   455   450     0     0     0
   206  0.24899520E+00     0   455   451     0     0     0
   206  0.13021307E-01     0   455   452     0     0     0
   206  0.84372360E-03     0   455   453     0     0     0
   206  0.62121556E-03     0   203   198     0     0     0
   206  0.51281252E-03     0   431   426     0     0     0
   206  0.51279750E-03     0   433   428     0     0     0
  15
   207  0.10784568E-04     0   130   123     0     0     0
   207  0.30888466E-02     0   132   125     0     0     0
   207  0.12127362E-03     0    10     3     0     0     0
   207  0.25068969E+00     0    12     5     0     0     0
   207  0.39469879E-01     0   456   450     0     0     0
   207  0.60397055E-03     0   456   451     0     0     0
   207  0.20482653E+00     0   456   452     0     0     0
   207  0.20197199E+00     0   456   453     0     0     0
   207  0.34710016E-01     0   457   450     0     0     0
   207  0.24899520E+00     0   457   451     0     0     0
   207  0.13021307E-01     0   457   452     0     0     0
   207  0.84372360E-03     0   457   453     0     0     0
   207  0.62121556E-03     0   203   199     0     0     0
   207  0.51281252E-03     0   425   432     0     0     0
   207  0.51279750E-03     0   427   434     0     0     0
   0
   5
     6  0.33333334E+00   100     2     7     5     0     0
     6  0.33333334E+00   100     4     9     5     0     0
     6  0.11111111E+00   100   122   127     5     0     0
     6  0.11111111E+00   100   124   129     5     0     0
     6  0.11111111E+00   100   126   131     5     0     0
   5
    12  0.33333334E+00   100     8     1    11     0     0
    12  0.33333334E+00   100    10     3    11     0     0
    12  0.11111111E+00   100   128   121    11     0     0
    12  0.11111111E+00   100   130   123    11     0     0
    12  0.11111111E+00   100   132   125    11     0     0
      4.00000000     -0.24957114
      0.98707622     -0.06602642      0.12857100     -0.06921446
     -0.10860594     -0.94475836      0.25252676     -0.17851286
     -0.03771367      0.05766772      0.70118123      0.70964593
     -0.11163814      0.31582719      0.65425146     -0.67804527
     -0.96396619      0.26602480     -0.26602480     -0.96396619
     -0.92726761      0.37439924     -0.37439924     -0.92726761
      1.57075787     -1.57079613     -1.57079518
    112.50000000   1800.00000000   1800.00000000
    450.00000000
    T
