#  ISAJET SUSY parameters in SUSY Les Houches Accord 2 format
#  Created by ISALHA 2.0 Last revision: C. Balazs 21 Apr 2009
Block SPINFO   # Program information
     1   ISASUGRA from ISAJET          # Spectrum Calculator
     2   7.80   29-OCT-2009 12:50:36   # Version number
Block MODSEL   # Model selection
     1     1   # Minimal supergravity (mSUGRA) model               
Block SMINPUTS   # Standard Model inputs
     1     1.27847221E+02   # alpha_em^(-1)
     2     1.16570000E-05   # G_Fermi
     3     1.17200002E-01   # alpha_s(M_Z)
     4     9.11699982E+01   # m_{Z}(pole)
     5     4.19999981E+00   # m_{b}(m_{b})
     6     1.72500000E+02   # m_{top}(pole)
     7     1.77699995E+00   # m_{tau}(pole)
Block MINPAR   # SUSY breaking input parameters
     1     5.00000000E+02   # m_0
     2     4.50000000E+02   # m_{1/2}
     3     1.00000000E+01   # tan(beta)
     4     1.00000000E+00   # sign(mu)
     5     0.00000000E+00   # A_0
Block EXTPAR   # Non-universal SUSY breaking parameters
     0     1.94170854E+16   # Input scale
Block MASS   # Scalar and gaugino mass spectrum
#  PDG code   mass                 particle
        24     8.04229965E+01   #  W^+
        25     1.13581467E+02   #  h^0            
        35     8.06411499E+02   #  H^0            
        36     8.00961548E+02   #  A^0            
        37     8.11350037E+02   #  H^+            
   1000001     1.07895862E+03   #  dnl            
   1000002     1.07586865E+03   #  upl            
   1000003     1.07895862E+03   #  stl            
   1000004     1.07586963E+03   #  chl            
   1000005     9.73454468E+02   #  b1             
   1000006     7.88077515E+02   #  t1             
   1000011     5.85012695E+02   #  el-            
   1000012     5.78631897E+02   #  nuel           
   1000013     5.85012695E+02   #  mul-           
   1000014     5.78631897E+02   #  numl           
   1000015     5.21547485E+02   #  tau1           
   1000016     5.75697876E+02   #  nutl           
   1000021     1.06328528E+03   #  glss           
   1000022     1.84702881E+02   #  z1ss           
   1000023     3.47627289E+02   #  z2ss           
   1000024     3.48172943E+02   #  w1ss           
   1000025    -5.68293579E+02   #  z3ss           
   1000035     5.84780823E+02   #  z4ss           
   1000037     5.84274475E+02   #  w2ss           
   2000001     1.04481091E+03   #  dnr            
   2000002     1.04743909E+03   #  upr            
   2000003     1.04481104E+03   #  str            
   2000004     1.04744006E+03   #  chr            
   2000005     1.03800659E+03   #  b2             
   2000006     1.00871918E+03   #  t2             
   2000011     5.27964783E+02   #  er-            
   2000013     5.27964783E+02   #  mur-           
   2000015     5.83705688E+02   #  tau2           
Block ALPHA   # Effective Higgs mixing parameter
         -1.02503441E-01   # alpha
Block STOPMIX   # stop mixing matrix
  1  1     3.59826237E-01   # O_{11}
  1  2     9.33019340E-01   # O_{12}
  2  1    -9.33019340E-01   # O_{21}
  2  2     3.59826237E-01   # O_{22}
Block SBOTMIX   # sbottom mixing matrix
  1  1     9.91499305E-01   # O_{11}
  1  2     1.30111963E-01   # O_{12}
  2  1    -1.30111963E-01   # O_{21}
  2  2     9.91499305E-01   # O_{22}
Block STAUMIX   # stau mixing matrix
  1  1     1.54162243E-01   # O_{11}
  1  2     9.88045573E-01   # O_{12}
  2  1    -9.88045573E-01   # O_{21}
  2  2     1.54162243E-01   # O_{22}
Block NMIX   # neutralino mixing matrix
  1  1     9.94968235E-01   #
  1  2    -2.04416905E-02   #
  1  3     9.07784030E-02   #
  1  4    -3.71485651E-02   #
  2  1    -4.52866256E-02   #
  2  2    -9.63406265E-01   #
  2  3     2.18862504E-01   #
  2  4    -1.47975639E-01   #
  3  1     3.66192609E-02   #
  3  2    -5.26530929E-02   #
  3  3    -7.03047931E-01   #
  3  4    -7.08244443E-01   #
  4  1    -8.15277100E-02   #
  4  2     2.62027115E-01   #
  4  3     6.70508862E-01   #
  4  4    -6.89284444E-01   #
Block UMIX   # chargino U mixing matrix
  1  1    -9.50009048E-01   # U_{11}
  1  2     3.12222421E-01   # U_{12}
  2  1    -3.12222421E-01   # U_{21}
  2  2    -9.50009048E-01   # U_{22}
Block VMIX   # chargino V mixing matrix
  1  1    -9.77211356E-01   # V_{11}
  1  2     2.12268561E-01   # V_{12}
  2  1    -2.12268561E-01   # V_{21}
  2  2    -9.77211356E-01   # V_{22}
Block GAUGE Q=  8.51077698E+02   #
     1     3.57489496E-01   # g`
     2     6.52473330E-01   # g_2
     3     1.22107685E+00   # g_3
Block YU Q=  8.51077698E+02   #
  3  3     8.61788273E-01   # y_t
Block YD Q=  8.51077698E+02   #
  3  3     1.33163795E-01   # y_b
Block YE Q=  8.51077698E+02   #
  3  3     1.02018692E-01   # y_tau
Block HMIX Q=  8.51077698E+02   # Higgs mixing parameters
     1     5.62623352E+02   # mu(Q)
     2     1.00000000E+01   # tan(beta)(M_GUT)
     3     2.50781754E+02   # Higgs vev at Q
     4     6.41539375E+05   # m_A^2(Q)
Block MSOFT Q=  8.51077698E+02   # DRbar SUSY breaking parameters
     1     1.88222626E+02   # M_1(Q)          
     2     3.50056152E+02   # M_2(Q)          
     3     9.97996277E+02   # M_3(Q)          
    31     5.80625549E+02   # MeL(Q)          
    32     5.80625549E+02   # MmuL(Q)         
    33     5.77749817E+02   # MtauL(Q)        
    34     5.25695496E+02   # MeR(Q)          
    35     5.25695496E+02   # MmuR(Q)         
    36     5.20460510E+02   # MtauR(Q)        
    41     1.02557349E+03   # MqL1(Q)         
    42     1.02557349E+03   # MqL2(Q)         
    43     9.29861328E+02   # MqL3(Q)         
    44     9.96872986E+02   # MuR(Q)          
    45     9.96872986E+02   # McR(Q)          
    46     7.78969116E+02   # MtR(Q)          
    47     9.93347961E+02   # MdR(Q)          
    48     9.93347961E+02   # MsR(Q)          
    49     9.94238220E+02   # MbR(Q)          
Block AU Q=  8.51077698E+02   #
  1  1    -7.95789612E+02   # A_u
  2  2    -7.95789612E+02   # A_c
  3  3    -7.95789612E+02   # A_t
Block AD Q=  8.51077698E+02   #
  1  1    -1.17557410E+03   # A_d
  2  2    -1.17557410E+03   # A_s
  3  3    -1.17557410E+03   # A_b
Block AE Q=  8.51077698E+02   #
  1  1    -2.68405396E+02   # A_e
  2  2    -2.68405396E+02   # A_mu
  3  3    -2.68405396E+02   # A_tau
#  ISAJET decay tables in SUSY Les Houches accord format
#  Created by ISALHD. Last revision: C. Balazs, 2005 May 25
Block DCINFO                           # Program information
     1   ISASUGRA from ISAJET          # Spectrum Calculator
     2   7.80   29-OCT-2009 12:50:36   # Version number
#         PDG         Width
DECAY         6  1.14680779E+00   # TP    decays
#          BR          NDA       ID1       ID2       ID3       ID4
      3.33333343E-01    3            2        -1         5             # TP     -->  UP     DB     BT          
      3.33333343E-01    3            4        -3         5             # TP     -->  CH     SB     BT          
      1.11111112E-01    3          -11        12         5             # TP     -->  E+     NUE    BT          
      1.11111112E-01    3          -13        14         5             # TP     -->  MU+    NUM    BT          
      1.11111112E-01    3          -15        16         5             # TP     -->  TAU+   NUT    BT          
#         PDG         Width
DECAY   1000021  3.13078213E+00   # GLSS  decays
#          BR          NDA       ID1       ID2       ID3       ID4
      5.52477920E-03    3      1000024         1        -2             # GLSS   -->  W1SS+  DN     UB          
      5.52477920E-03    3     -1000024         2        -1             # GLSS   -->  W1SS-  UP     DB          
      5.52473543E-03    3      1000024         3        -4             # GLSS   -->  W1SS+  ST     CB          
      5.52473543E-03    3     -1000024         4        -3             # GLSS   -->  W1SS-  CH     SB          
      1.65697082E-03    3      1000024         5        -6             # GLSS   -->  W1SS+  BT     TB          
      1.65697082E-03    3     -1000024         6        -5             # GLSS   -->  W1SS-  TP     BB          
      1.73792112E-04    3      1000037         1        -2             # GLSS   -->  W2SS+  DN     UB          
      1.73792112E-04    3     -1000037         2        -1             # GLSS   -->  W2SS-  UP     DB          
      1.73791006E-04    3      1000037         3        -4             # GLSS   -->  W2SS+  ST     CB          
      1.73791006E-04    3     -1000037         4        -3             # GLSS   -->  W2SS-  CH     SB          
      3.08021583E-04    3      1000037         5        -6             # GLSS   -->  W2SS+  BT     TB          
      3.08021583E-04    3     -1000037         6        -5             # GLSS   -->  W2SS-  TP     BB          
      6.70894588E-06    2      1000022        21                       # GLSS   -->  Z1SS   GL                 
      1.05247054E-04    3      1000022         2        -2             # GLSS   -->  Z1SS   UP     UB          
      1.57931645E-04    3      1000022         1        -1             # GLSS   -->  Z1SS   DN     DB          
      1.57931645E-04    3      1000022         3        -3             # GLSS   -->  Z1SS   ST     SB          
      1.05245505E-04    3      1000022         4        -4             # GLSS   -->  Z1SS   CH     CB          
      1.58767114E-04    3      1000022         6        -6             # GLSS   -->  Z1SS   TP     TB          
      5.49978358E-06    2      1000023        21                       # GLSS   -->  Z2SS   GL                 
      3.74407321E-03    3      1000023         2        -2             # GLSS   -->  Z2SS   UP     UB          
      3.45797394E-03    3      1000023         1        -1             # GLSS   -->  Z2SS   DN     DB          
      3.45797394E-03    3      1000023         3        -3             # GLSS   -->  Z2SS   ST     SB          
      3.74401780E-03    3      1000023         4        -4             # GLSS   -->  Z2SS   CH     CB          
      1.28306670E-03    3      1000023         6        -6             # GLSS   -->  Z2SS   TP     TB          
      8.71341545E-05    2      1000025        21                       # GLSS   -->  Z3SS   GL                 
      7.63281878E-06    3      1000025         2        -2             # GLSS   -->  Z3SS   UP     UB          
      1.21444473E-05    3      1000025         1        -1             # GLSS   -->  Z3SS   DN     DB          
      1.21444473E-05    3      1000025         3        -3             # GLSS   -->  Z3SS   ST     SB          
      7.63269873E-06    3      1000025         4        -4             # GLSS   -->  Z3SS   CH     CB          
      3.80279816E-04    3      1000025         6        -6             # GLSS   -->  Z3SS   TP     TB          
      6.30522845E-05    2      1000035        21                       # GLSS   -->  Z4SS   GL                 
      2.18051442E-04    3      1000035         2        -2             # GLSS   -->  Z4SS   UP     UB          
      2.61006062E-04    3      1000035         1        -1             # GLSS   -->  Z4SS   DN     DB          
      2.61006062E-04    3      1000035         3        -3             # GLSS   -->  Z4SS   ST     SB          
      2.18048008E-04    3      1000035         4        -4             # GLSS   -->  Z4SS   CH     CB          
      1.39192585E-03    3      1000035         6        -6             # GLSS   -->  Z4SS   TP     TB          
      3.40091297E-03    2     -2000002         2                       # GLSS   -->  UBR    UP                 
      3.40091297E-03    2      2000002        -2                       # GLSS   -->  UPR    UB                 
      4.61106701E-03    2     -2000001         1                       # GLSS   -->  DBR    DN                 
      4.61106701E-03    2      2000001        -1                       # GLSS   -->  DNR    DB                 
      4.61073266E-03    2     -2000003         3                       # GLSS   -->  SBR    ST                 
      4.61073266E-03    2      2000003        -3                       # GLSS   -->  STR    SB                 
      3.38832848E-03    2     -2000004         4                       # GLSS   -->  CBR    CH                 
      3.38832848E-03    2      2000004        -4                       # GLSS   -->  CHR    CB                 
      1.00098267E-01    2     -1000005         5                       # GLSS   -->  BB1    BT                 
      1.00098267E-01    2      1000005        -5                       # GLSS   -->  BT1    BB                 
      8.84628017E-03    2     -2000005         5                       # GLSS   -->  BB2    BT                 
      8.84628017E-03    2      2000005        -5                       # GLSS   -->  BT2    BB                 
      3.52030069E-01    2     -1000006         6                       # GLSS   -->  TB1    TP                 
      3.52030069E-01    2      1000006        -6                       # GLSS   -->  TP1    TB                 
#         PDG         Width
DECAY   1000002  1.08545065E+01   # UPL   decays
#          BR          NDA       ID1       ID2       ID3       ID4
      1.02935834E-02    2      1000022         2                       # UPL    -->  Z1SS   UP                 
      3.15976351E-01    2      1000023         2                       # UPL    -->  Z2SS   UP                 
      4.57799528E-04    2      1000025         2                       # UPL    -->  Z3SS   UP                 
      1.26447780E-02    2      1000035         2                       # UPL    -->  Z4SS   UP                 
      3.26701952E-03    2      1000021         2                       # UPL    -->  GLSS   UP                 
      6.38669550E-01    2      1000024         1                       # UPL    -->  W1SS+  DN                 
      1.86908953E-02    2      1000037         1                       # UPL    -->  W2SS+  DN                 
#         PDG         Width
DECAY   1000001  1.07620449E+01   # DNL   decays
#          BR          NDA       ID1       ID2       ID3       ID4
      1.63421966E-02    2      1000022         1                       # DNL    -->  Z1SS   DN                 
      3.09195697E-01    2      1000023         1                       # DNL    -->  Z2SS   DN                 
      7.76447880E-04    2      1000025         1                       # DNL    -->  Z3SS   DN                 
      1.61467567E-02    2      1000035         1                       # DNL    -->  Z4SS   DN                 
      5.08144451E-03    2      1000021         1                       # DNL    -->  GLSS   DN                 
      6.11359239E-01    2     -1000024         2                       # DNL    -->  W1SS-  UP                 
      4.10982519E-02    2     -1000037         2                       # DNL    -->  W2SS-  UP                 
#         PDG         Width
DECAY   1000003  1.07620182E+01   # STL   decays
#          BR          NDA       ID1       ID2       ID3       ID4
      1.63422376E-02    2      1000022         3                       # STL    -->  Z1SS   ST                 
      3.09196442E-01    2      1000023         3                       # STL    -->  Z2SS   ST                 
      7.76449800E-04    2      1000025         3                       # STL    -->  Z3SS   ST                 
      1.61467958E-02    2      1000035         3                       # STL    -->  Z4SS   ST                 
      5.08145755E-03    2      1000021         3                       # STL    -->  GLSS   ST                 
      6.11358464E-01    2     -1000024         4                       # STL    -->  W1SS-  CH                 
      4.10980992E-02    2     -1000037         4                       # STL    -->  W2SS-  CH                 
#         PDG         Width
DECAY   1000004  1.08543053E+01   # CHL   decays
#          BR          NDA       ID1       ID2       ID3       ID4
      1.02937501E-02    2      1000022         4                       # CHL    -->  Z1SS   CH                 
      3.15981418E-01    2      1000023         4                       # CHL    -->  Z2SS   CH                 
      4.57806338E-04    2      1000025         4                       # CHL    -->  Z3SS   CH                 
      1.26449643E-02    2      1000035         4                       # CHL    -->  Z4SS   CH                 
      3.24850832E-03    2      1000021         4                       # CHL    -->  GLSS   CH                 
      6.38682246E-01    2      1000024         3                       # CHL    -->  W1SS+  ST                 
      1.86912864E-02    2      1000037         3                       # CHL    -->  W2SS+  ST                 
#         PDG         Width
DECAY   1000005  1.61991539E+01   # BT1   decays
#          BR          NDA       ID1       ID2       ID3       ID4
      1.10999318E-02    2      1000022         5                       # BT1    -->  Z1SS   BT                 
      1.76377922E-01    2      1000023         5                       # BT1    -->  Z2SS   BT                 
      4.65914235E-03    2      1000025         5                       # BT1    -->  Z3SS   BT                 
      1.03061385E-02    2      1000035         5                       # BT1    -->  Z4SS   BT                 
      3.18099886E-01    2     -1000024         6                       # BT1    -->  W1SS-  TP                 
      3.38714391E-01    2     -1000037         6                       # BT1    -->  W2SS-  TP                 
      1.40742630E-01    2          -24   1000006                       # BT1    -->  W-     TP1                
#         PDG         Width
DECAY   1000006  6.56428242E+00   # TP1   decays
#          BR          NDA       ID1       ID2       ID3       ID4
      2.00466499E-01    2      1000022         6                       # TP1    -->  Z1SS   TP                 
      9.79183614E-02    2      1000023         6                       # TP1    -->  Z2SS   TP                 
      1.71943128E-01    2      1000025         6                       # TP1    -->  Z3SS   TP                 
      3.12649496E-02    2      1000035         6                       # TP1    -->  Z4SS   TP                 
      2.43905112E-01    2      1000024         5                       # TP1    -->  W1SS+  BT                 
      2.54501998E-01    2      1000037         5                       # TP1    -->  W2SS+  BT                 
#         PDG         Width
DECAY   2000002  2.21340537E+00   # UPR   decays
#          BR          NDA       ID1       ID2       ID3       ID4
      9.94179785E-01    2      1000022         2                       # UPR    -->  Z1SS   UP                 
      1.73724582E-03    2      1000023         2                       # UPR    -->  Z2SS   UP                 
      7.14269292E-04    2      1000025         2                       # UPR    -->  Z3SS   UP                 
      3.36866151E-03    2      1000035         2                       # UPR    -->  Z4SS   UP                 
#         PDG         Width
DECAY   2000001  5.51774204E-01   # DNR   decays
#          BR          NDA       ID1       ID2       ID3       ID4
      9.94198263E-01    2      1000022         1                       # DNR    -->  Z1SS   DN                 
      1.73567352E-03    2      1000023         1                       # DNR    -->  Z2SS   DN                 
      7.11513974E-04    2      1000025         1                       # DNR    -->  Z3SS   DN                 
      3.35445767E-03    2      1000035         1                       # DNR    -->  Z4SS   DN                 
#         PDG         Width
DECAY   2000003  5.51774263E-01   # STR   decays
#          BR          NDA       ID1       ID2       ID3       ID4
      9.94198263E-01    2      1000022         3                       # STR    -->  Z1SS   ST                 
      1.73567364E-03    2      1000023         3                       # STR    -->  Z2SS   ST                 
      7.11514149E-04    2      1000025         3                       # STR    -->  Z3SS   ST                 
      3.35445837E-03    2      1000035         3                       # STR    -->  Z4SS   ST                 
#         PDG         Width
DECAY   2000004  2.21339965E+00   # CHR   decays
#          BR          NDA       ID1       ID2       ID3       ID4
      9.94179904E-01    2      1000022         4                       # CHR    -->  Z1SS   CH                 
      1.73724547E-03    2      1000023         4                       # CHR    -->  Z2SS   CH                 
      7.14268244E-04    2      1000025         4                       # CHR    -->  Z3SS   CH                 
      3.36865522E-03    2      1000035         4                       # CHR    -->  Z4SS   CH                 
#         PDG         Width
DECAY   2000005  1.26811886E+00   # BT2   decays
#          BR          NDA       ID1       ID2       ID3       ID4
      4.14023906E-01    2      1000022         5                       # BT2    -->  Z1SS   BT                 
      1.15263788E-02    2      1000023         5                       # BT2    -->  Z2SS   BT                 
      7.92902112E-02    2      1000025         5                       # BT2    -->  Z3SS   BT                 
      9.16292444E-02    2      1000035         5                       # BT2    -->  Z4SS   BT                 
      2.14159228E-02    2     -1000024         6                       # BT2    -->  W1SS-  TP                 
      3.01194996E-01    2     -1000037         6                       # BT2    -->  W2SS-  TP                 
      8.09193254E-02    2          -24   1000006                       # BT2    -->  W-     TP1                
#         PDG         Width
DECAY   2000006  1.77087231E+01   # TP2   decays
#          BR          NDA       ID1       ID2       ID3       ID4
      2.46581286E-01    2      1000024         5                       # TP2    -->  W1SS+  BT                 
      9.90639701E-02    2      1000037         5                       # TP2    -->  W2SS+  BT                 
      9.58304778E-02    2           23   1000006                       # TP2    -->  Z0     TP1                
      7.36802742E-02    2           25   1000006                       # TP2    -->  HL0    TP1                
      1.37771508E-02    2      1000022         6                       # TP2    -->  Z1SS   TP                 
      1.14612266E-01    2      1000023         6                       # TP2    -->  Z2SS   TP                 
      1.31255493E-01    2      1000025         6                       # TP2    -->  Z3SS   TP                 
      2.25199014E-01    2      1000035         6                       # TP2    -->  Z4SS   TP                 
#         PDG         Width
DECAY   1000011  3.41339970E+00   # EL-   decays
#          BR          NDA       ID1       ID2       ID3       ID4
      1.62045360E-01    2      1000022        11                       # EL-    -->  Z1SS   E-                 
      2.94876277E-01    2      1000023        11                       # EL-    -->  Z2SS   E-                 
      2.42279020E-06    2      1000025        11                       # EL-    -->  Z3SS   E-                 
      2.13775575E-08    2      1000035        11                       # EL-    -->  Z4SS   E-                 
      5.43075025E-01    2     -1000024        12                       # EL-    -->  W1SS-  NUE                
      8.94740822E-07    2     -1000037        12                       # EL-    -->  W2SS-  NUE                
#         PDG         Width
DECAY   1000013  3.41339970E+00   # MUL-  decays
#          BR          NDA       ID1       ID2       ID3       ID4
      1.62045360E-01    2      1000022        13                       # MUL-   -->  Z1SS   MU-                
      2.94876248E-01    2      1000023        13                       # MUL-   -->  Z2SS   MU-                
      2.42274155E-06    2      1000025        13                       # MUL-   -->  Z3SS   MU-                
      1.90589411E-08    2      1000035        13                       # MUL-   -->  Z4SS   MU-                
      5.43075025E-01    2     -1000024        14                       # MUL-   -->  W1SS-  NUM                
      8.94740822E-07    2     -1000037        14                       # MUL-   -->  W2SS-  NUM                
#         PDG         Width
DECAY   1000015  2.05959797E+00   # TAU1- decays
#          BR          NDA       ID1       ID2       ID3       ID4
      9.60970640E-01    2      1000022        15                       # TAU1-  -->  Z1SS   TAU-               
      1.39374640E-02    2      1000023        15                       # TAU1-  -->  Z2SS   TAU-               
      2.50919219E-02    2     -1000024        16                       # TAU1-  -->  W1SS-  NUT                
#         PDG         Width
DECAY   1000012  3.40156317E+00   # NUEL  decays
#          BR          NDA       ID1       ID2       ID3       ID4
      1.85871899E-01    2      1000022        12                       # NUEL   -->  Z1SS   NUE                
      2.57582277E-01    2      1000023        12                       # NUEL   -->  Z2SS   NUE                
      4.75684510E-06    2      1000025        12                       # NUEL   -->  Z3SS   NUE                
      5.56541026E-01    2      1000024        11                       # NUEL   -->  W1SS+  E-                 
      7.17294224E-10    3      1000015        12       -15             # NUEL   -->  TAU1-  NUE    TAU+        
      7.54686535E-10    3     -1000015        12        15             # NUEL   -->  TAU1+  NUE    TAU-        
      2.05373007E-09    3     -1000015        11        16             # NUEL   -->  TAU1+  E-     NUT         
#         PDG         Width
DECAY   1000014  3.40156269E+00   # NUML  decays
#          BR          NDA       ID1       ID2       ID3       ID4
      1.85871929E-01    2      1000022        14                       # NUML   -->  Z1SS   NUM                
      2.57582337E-01    2      1000023        14                       # NUML   -->  Z2SS   NUM                
      4.75684601E-06    2      1000025        14                       # NUML   -->  Z3SS   NUM                
      5.56540966E-01    2      1000024        13                       # NUML   -->  W1SS+  MU-                
      7.17294335E-10    3      1000015        14       -15             # NUML   -->  TAU1-  NUM    TAU+        
      7.54686647E-10    3     -1000015        14        15             # NUML   -->  TAU1+  NUM    TAU-        
      2.05516293E-09    3     -1000015        13        16             # NUML   -->  TAU1+  MU-    NUT         
#         PDG         Width
DECAY   1000016  3.35470390E+00   # NUTL  decays
#          BR          NDA       ID1       ID2       ID3       ID4
      1.87077999E-01    2      1000022        16                       # NUTL   -->  Z1SS   NUT                
      2.56865084E-01    2      1000023        16                       # NUTL   -->  Z2SS   NUT                
      2.49923846E-06    2      1000025        16                       # NUTL   -->  Z3SS   NUT                
      5.56044221E-01    2      1000024        15                       # NUTL   -->  W1SS+  TAU-               
      7.62196029E-10    3     -1000015        16        15             # NUTL   -->  TAU1+  NUT    TAU-        
      1.12996838E-06    3      1000015        16       -15             # NUTL   -->  TAU1-  NUT    TAU+        
      1.12946861E-06    3      1000015        12       -11             # NUTL   -->  TAU1-  NUE    E+          
      1.12946861E-06    3      1000015        14       -13             # NUTL   -->  TAU1-  NUM    MU+         
      3.38840573E-06    3      1000015         2        -1             # NUTL   -->  TAU1-  UP     DB          
      3.38840573E-06    3      1000015         4        -3             # NUTL   -->  TAU1-  CH     SB          
#         PDG         Width
DECAY   2000011  2.04928493E+00   # ER-   decays
#          BR          NDA       ID1       ID2       ID3       ID4
      9.99137700E-01    2      1000022        11                       # ER-    -->  Z1SS   E-                 
      8.62377114E-04    2      1000023        11                       # ER-    -->  Z2SS   E-                 
      8.52756706E-17    3      1000015        11       -15             # ER-    -->  TAU1-  E-     TAU+        
      7.02997959E-16    3     -1000015        11        15             # ER-    -->  TAU1+  E-     TAU-        
      1.15969836E-22    3      1000015        12       -16             # ER-    -->  TAU1-  NUE    ANUT        
#         PDG         Width
DECAY   2000013  2.04928470E+00   # MUR-  decays
#          BR          NDA       ID1       ID2       ID3       ID4
      9.99137700E-01    2      1000022        13                       # MUR-   -->  Z1SS   MU-                
      8.62376881E-04    2      1000023        13                       # MUR-   -->  Z2SS   MU-                
      8.52756772E-17    3      1000015        13       -15             # MUR-   -->  TAU1-  MU-    TAU+        
      7.02998065E-16    3     -1000015        13        15             # MUR-   -->  TAU1+  MU-    TAU-        
      4.93008496E-18    3      1000015        14       -16             # MUR-   -->  TAU1-  NUM    ANUT        
#         PDG         Width
DECAY   2000015  3.31861281E+00   # TAU2- decays
#          BR          NDA       ID1       ID2       ID3       ID4
      1.77156672E-01    2      1000022        15                       # TAU2-  -->  Z1SS   TAU-               
      2.90197134E-01    2      1000023        15                       # TAU2-  -->  Z2SS   TAU-               
      5.52914607E-05    2      1000025        15                       # TAU2-  -->  Z3SS   TAU-               
      5.32590926E-01    2     -1000024        16                       # TAU2-  -->  W1SS-  NUT                
#         PDG         Width
DECAY   1000023  1.74182355E-02   # Z2SS  decays
#          BR          NDA       ID1       ID2       ID3       ID4
      1.74076899E-06    2      1000022        22                       # Z2SS   -->  Z1SS   GM                 
      7.82484263E-02    2      1000022        23                       # Z2SS   -->  Z1SS   Z0                 
      1.61442620E-06    3      1000022         2        -2             # Z2SS   -->  Z1SS   UP     UB          
      2.35764378E-06    3      1000022         1        -1             # Z2SS   -->  Z1SS   DN     DB          
      2.35764378E-06    3      1000022         3        -3             # Z2SS   -->  Z1SS   ST     SB          
      1.61442006E-06    3      1000022         4        -4             # Z2SS   -->  Z1SS   CH     CB          
      4.60433739E-06    3      1000022         5        -5             # Z2SS   -->  Z1SS   BT     BB          
      9.54483767E-05    3      1000022        11       -11             # Z2SS   -->  Z1SS   E-     E+          
      9.54483767E-05    3      1000022        13       -13             # Z2SS   -->  Z1SS   MU-    MU+         
      1.04817191E-04    3      1000022        15       -15             # Z2SS   -->  Z1SS   TAU-   TAU+        
      1.03804654E-04    3      1000022        12       -12             # Z2SS   -->  Z1SS   NUE    ANUE        
      1.03804654E-04    3      1000022        14       -14             # Z2SS   -->  Z1SS   NUM    ANUM        
      1.06567270E-04    3      1000022        16       -16             # Z2SS   -->  Z1SS   NUT    ANUT        
      9.21127379E-01    2      1000022        25                       # Z2SS   -->  Z1SS   HL0                
#         PDG         Width
DECAY   1000025  2.90843034E+00   # Z3SS  decays
#          BR          NDA       ID1       ID2       ID3       ID4
      6.78153143E-08    2      1000022        22                       # Z3SS   -->  Z1SS   GM                 
      2.70259505E-07    2      1000023        22                       # Z3SS   -->  Z2SS   GM                 
      2.98447669E-01    2      1000024       -24                       # Z3SS   -->  W1SS+  W-                 
      2.98447669E-01    2     -1000024        24                       # Z3SS   -->  W1SS-  W+                 
      1.13225125E-01    2      1000022        23                       # Z3SS   -->  Z1SS   Z0                 
      2.61489540E-01    2      1000023        23                       # Z3SS   -->  Z2SS   Z0                 
      4.21950608E-09    3      1000022         2        -2             # Z3SS   -->  Z1SS   UP     UB          
      1.46591028E-09    3      1000022         1        -1             # Z3SS   -->  Z1SS   DN     DB          
      1.46591017E-09    3      1000022         3        -3             # Z3SS   -->  Z1SS   ST     SB          
      4.21948743E-09    3      1000022         4        -4             # Z3SS   -->  Z1SS   CH     CB          
      8.74566183E-07    3      1000022         5        -5             # Z3SS   -->  Z1SS   BT     BB          
      4.74733852E-08    3      1000022        11       -11             # Z3SS   -->  Z1SS   E-     E+          
      4.74733852E-08    3      1000022        13       -13             # Z3SS   -->  Z1SS   MU-    MU+         
      1.71502370E-06    3      1000022        15       -15             # Z3SS   -->  Z1SS   TAU-   TAU+        
      3.29803299E-07    3      1000022        12       -12             # Z3SS   -->  Z1SS   NUE    ANUE        
      3.29803299E-07    3      1000022        14       -14             # Z3SS   -->  Z1SS   NUM    ANUM        
      3.62797977E-07    3      1000022        16       -16             # Z3SS   -->  Z1SS   NUT    ANUT        
      1.99547223E-09    3      1000023         2        -2             # Z3SS   -->  Z2SS   UP     UB          
      3.17137872E-09    3      1000023         1        -1             # Z3SS   -->  Z2SS   DN     DB          
      3.17137872E-09    3      1000023         3        -3             # Z3SS   -->  Z2SS   ST     SB          
      1.99546335E-09    3      1000023         4        -4             # Z3SS   -->  Z2SS   CH     CB          
      3.70561168E-07    3      1000023         5        -5             # Z3SS   -->  Z2SS   BT     BB          
      3.57783563E-08    3      1000023        11       -11             # Z3SS   -->  Z2SS   E-     E+          
      3.57783563E-08    3      1000023        13       -13             # Z3SS   -->  Z2SS   MU-    MU+         
      1.64078699E-06    3      1000023        15       -15             # Z3SS   -->  Z2SS   TAU-   TAU+        
      2.05926995E-07    3      1000023        12       -12             # Z3SS   -->  Z2SS   NUE    ANUE        
      2.05926995E-07    3      1000023        14       -14             # Z3SS   -->  Z2SS   NUM    ANUM        
      2.35121661E-07    3      1000023        16       -16             # Z3SS   -->  Z2SS   NUT    ANUT        
      1.89408697E-02    2      1000022        25                       # Z3SS   -->  Z1SS   HL0                
      8.91231745E-03    2      1000023        25                       # Z3SS   -->  Z2SS   HL0                
      1.24872686E-05    2      2000011       -11                       # Z3SS   -->  ER-    E+                 
      1.24872686E-05    2     -2000011        11                       # Z3SS   -->  ER+    E-                 
      1.24872286E-05    2      2000013       -13                       # Z3SS   -->  MUR-   MU+                
      1.24872286E-05    2     -2000013        13                       # Z3SS   -->  MUR+   MU-                
      2.40039939E-04    2      1000015       -15                       # Z3SS   -->  TAU1-  TAU+               
      2.40039939E-04    2     -1000015        15                       # Z3SS   -->  TAU1+  TAU-               
#         PDG         Width
DECAY   1000035  3.15929222E+00   # Z4SS  decays
#          BR          NDA       ID1       ID2       ID3       ID4
      2.74681355E-07    2      1000022        22                       # Z4SS   -->  Z1SS   GM                 
      1.32847355E-09    2      1000023        22                       # Z4SS   -->  Z2SS   GM                 
      1.09913934E-09    2      1000025        22                       # Z4SS   -->  Z3SS   GM                 
      3.16362351E-01    2      1000024       -24                       # Z4SS   -->  W1SS+  W-                 
      3.16362351E-01    2     -1000024        24                       # Z4SS   -->  W1SS-  W+                 
      1.99210867E-02    2      1000022        23                       # Z4SS   -->  Z1SS   Z0                 
      1.33216409E-02    2      1000023        23                       # Z4SS   -->  Z2SS   Z0                 
      7.76887958E-08    3      1000022         2        -2             # Z4SS   -->  Z1SS   UP     UB          
      6.72220040E-08    3      1000022         1        -1             # Z4SS   -->  Z1SS   DN     DB          
      6.72220040E-08    3      1000022         3        -3             # Z4SS   -->  Z1SS   ST     SB          
      7.76884548E-08    3      1000022         4        -4             # Z4SS   -->  Z1SS   CH     CB          
      8.55183885E-07    3      1000022         5        -5             # Z4SS   -->  Z1SS   BT     BB          
      5.25255791E-06    3      1000022        11       -11             # Z4SS   -->  Z1SS   E-     E+          
      5.25255791E-06    3      1000022        13       -13             # Z4SS   -->  Z1SS   MU-    MU+         
      8.21448509E-08    3      1000022        15       -15             # Z4SS   -->  Z1SS   TAU-   TAU+        
      2.05275200E-07    3      1000023         2        -2             # Z4SS   -->  Z2SS   UP     UB          
      2.45636386E-07    3      1000023         1        -1             # Z4SS   -->  Z2SS   DN     DB          
      2.45636386E-07    3      1000023         3        -3             # Z4SS   -->  Z2SS   ST     SB          
      2.05274247E-07    3      1000023         4        -4             # Z4SS   -->  Z2SS   CH     CB          
      7.60559885E-07    3      1000023         5        -5             # Z4SS   -->  Z2SS   BT     BB          
      6.30223394E-06    3      1000023        11       -11             # Z4SS   -->  Z2SS   E-     E+          
      6.30223394E-06    3      1000023        13       -13             # Z4SS   -->  Z2SS   MU-    MU+         
      2.33685036E-08    3      1000023        15       -15             # Z4SS   -->  Z2SS   TAU-   TAU+        
      4.39546213E-08    3      1000025         2        -2             # Z4SS   -->  Z3SS   UP     UB          
      5.67100145E-08    3      1000025         1        -1             # Z4SS   -->  Z3SS   DN     DB          
      5.67100145E-08    3      1000025         3        -3             # Z4SS   -->  Z3SS   ST     SB          
      4.39546213E-08    3      1000025         4        -4             # Z4SS   -->  Z3SS   CH     CB          
      1.92113170E-08    3      1000025         5        -5             # Z4SS   -->  Z3SS   BT     BB          
      1.30220013E-08    3      1000025        11       -11             # Z4SS   -->  Z3SS   E-     E+          
      1.30220013E-08    3      1000025        13       -13             # Z4SS   -->  Z3SS   MU-    MU+         
      1.10336842E-08    3      1000025        15       -15             # Z4SS   -->  Z3SS   TAU-   TAU+        
      2.55889141E-08    3      1000025        12       -12             # Z4SS   -->  Z3SS   NUE    ANUE        
      2.55889141E-08    3      1000025        14       -14             # Z4SS   -->  Z3SS   NUM    ANUM        
      2.55889141E-08    3      1000025        16       -16             # Z4SS   -->  Z3SS   NUT    ANUT        
      9.64160189E-02    2      1000022        25                       # Z4SS   -->  Z1SS   HL0                
      2.36464843E-01    2      1000023        25                       # Z4SS   -->  Z2SS   HL0                
      1.06940948E-04    2      2000011       -11                       # Z4SS   -->  ER-    E+                 
      1.06940948E-04    2     -2000011        11                       # Z4SS   -->  ER+    E-                 
      1.06940781E-04    2      2000013       -13                       # Z4SS   -->  MUR-   MU+                
      1.06940781E-04    2     -2000013        13                       # Z4SS   -->  MUR+   MU-                
      2.81653134E-04    2      1000015       -15                       # Z4SS   -->  TAU1-  TAU+               
      2.81653134E-04    2     -1000015        15                       # Z4SS   -->  TAU1+  TAU-               
      1.60507170E-05    2      1000012       -12                       # Z4SS   -->  NUEL   ANUE               
      1.60507170E-05    2     -1000012        12                       # Z4SS   -->  ANUEL  NUE                
      1.60507170E-05    2      1000014       -14                       # Z4SS   -->  NUML   ANUM               
      1.60507170E-05    2     -1000014        14                       # Z4SS   -->  ANUML  NUM                
      3.48463327E-05    2      1000016       -16                       # Z4SS   -->  NUTL   ANUT               
      3.48463327E-05    2     -1000016        16                       # Z4SS   -->  ANUTL  NUT                
#         PDG         Width
DECAY   1000024  1.59323420E-02   # W1SS+ decays
#          BR          NDA       ID1       ID2       ID3       ID4
      4.32669776E-06    3      1000022         2        -1             # W1SS+  -->  Z1SS   UP     DB          
      4.32669049E-06    3      1000022         4        -3             # W1SS+  -->  Z1SS   CH     SB          
      2.20619258E-04    3      1000022       -11        12             # W1SS+  -->  Z1SS   E+     NUE         
      2.20619258E-04    3      1000022       -13        14             # W1SS+  -->  Z1SS   MU+    NUM         
      2.34299907E-04    3      1000022       -15        16             # W1SS+  -->  Z1SS   TAU+   NUT         
      9.99315858E-01    2      1000022        24                       # W1SS+  -->  Z1SS   W+                 
      1.97321890E-12    3      1000023       -11        12             # W1SS+  -->  Z2SS   E+     NUE         
      1.97321890E-12    3      1000023       -13        14             # W1SS+  -->  Z2SS   MU+    NUM         
#         PDG         Width
DECAY   1000037  3.07622766E+00   # W2SS+ decays
#          BR          NDA       ID1       ID2       ID3       ID4
      1.03968979E-07    3      1000022         2        -1             # W2SS+  -->  Z1SS   UP     DB          
      1.03968844E-07    3      1000022         4        -3             # W2SS+  -->  Z1SS   CH     SB          
      9.27167457E-06    3      1000022       -11        12             # W2SS+  -->  Z1SS   E+     NUE         
      9.27167457E-06    3      1000022       -13        14             # W2SS+  -->  Z1SS   MU+    NUM         
      6.92984159E-08    3      1000022       -15        16             # W2SS+  -->  Z1SS   TAU+   NUT         
      1.02450468E-01    2      1000022        24                       # W2SS+  -->  Z1SS   W+                 
      1.82632007E-07    3      1000023         2        -1             # W2SS+  -->  Z2SS   UP     DB          
      1.82631894E-07    3      1000023         4        -3             # W2SS+  -->  Z2SS   CH     SB          
      1.04015435E-05    3      1000023       -11        12             # W2SS+  -->  Z2SS   E+     NUE         
      1.04015435E-05    3      1000023       -13        14             # W2SS+  -->  Z2SS   MU+    NUM         
      4.03466807E-08    3      1000023       -15        16             # W2SS+  -->  Z2SS   TAU+   NUT         
      3.30890834E-01    2      1000023        24                       # W2SS+  -->  Z2SS   W+                 
      1.34232863E-07    3      1000025         2        -1             # W2SS+  -->  Z3SS   UP     DB          
      1.34232863E-07    3      1000025         4        -3             # W2SS+  -->  Z3SS   CH     SB          
      4.51068303E-08    3      1000025       -11        12             # W2SS+  -->  Z3SS   E+     NUE         
      4.51068303E-08    3      1000025       -13        14             # W2SS+  -->  Z3SS   MU+    NUM         
      4.47408617E-08    3      1000025       -15        16             # W2SS+  -->  Z3SS   TAU+   NUT         
      1.33093772E-05    2      1000012       -11                       # W2SS+  -->  NUEL   E+                 
      1.33070953E-05    2      1000014       -13                       # W2SS+  -->  NUML   MU+                
      3.62994724E-05    2      1000016       -15                       # W2SS+  -->  NUTL   TAU+               
      3.41636100E-04    2     -1000015        16                       # W2SS+  -->  TAU1+  NUT                
      3.33451680E-07    2     -2000015        16                       # W2SS+  -->  TAU2+  NUT                
      3.03355545E-01    2      1000024        23                       # W2SS+  -->  W1SS+  Z0                 
      2.11116685E-07    3      1000024         1        -1             # W2SS+  -->  W1SS+  DN     DB          
      2.11115733E-07    3      1000024         3        -3             # W2SS+  -->  W1SS+  ST     SB          
      4.25549757E-07    3      1000024         2        -2             # W2SS+  -->  W1SS+  UP     UB          
      4.25549757E-07    3      1000024         4        -4             # W2SS+  -->  W1SS+  CH     CB          
      1.91121162E-05    3      1000024        12       -12             # W2SS+  -->  W1SS+  NUE    ANUE        
      1.91121162E-05    3      1000024        14       -14             # W2SS+  -->  W1SS+  NUM    ANUM        
      2.62818336E-01    2      1000024        25                       # W2SS+  -->  W1SS+  HL0                
#         PDG         Width
DECAY        25  4.15599206E-03   # HL0   decays
#          BR          NDA       ID1       ID2       ID3       ID4
      4.91136776E-09    2           11       -11                       # HL0    -->  E-     E+                 
      2.07365738E-04    2           13       -13                       # HL0    -->  MU-    MU+                
      5.93058281E-02    2           15       -15                       # HL0    -->  TAU-   TAU+               
      6.16543684E-06    2            1        -1                       # HL0    -->  DN     DB                 
      2.49114539E-03    2            3        -3                       # HL0    -->  ST     SB                 
      8.18084717E-01    2            5        -5                       # HL0    -->  BT     BB                 
      1.86441855E-06    2            2        -2                       # HL0    -->  UP     UB                 
      3.51646207E-02    2            4        -4                       # HL0    -->  CH     CB                 
      1.70859788E-03    2           22        22                       # HL0    -->  GM     GM                 
      3.69636118E-02    2           21        21                       # HL0    -->  GL     GL                 
      2.39681546E-03    3           24        11       -12             # HL0    -->  W+     E-     ANUE        
      2.39681546E-03    3           24        13       -14             # HL0    -->  W+     MU-    ANUM        
      2.39681546E-03    3           24        15       -16             # HL0    -->  W+     TAU-   ANUT        
      7.19044590E-03    3           24        -2         1             # HL0    -->  W+     UB     DN          
      7.19044590E-03    3           24        -4         3             # HL0    -->  W+     CB     ST          
      2.39681546E-03    3          -24       -11        12             # HL0    -->  W-     E+     NUE         
      2.39681546E-03    3          -24       -13        14             # HL0    -->  W-     MU+    NUM         
      2.39681546E-03    3          -24       -15        16             # HL0    -->  W-     TAU+   NUT         
      7.19044590E-03    3          -24         2        -1             # HL0    -->  W-     UP     DB          
      7.19044590E-03    3          -24         4        -3             # HL0    -->  W-     CH     SB          
      1.99964197E-04    3           23        12       -12             # HL0    -->  Z0     NUE    ANUE        
      1.99964197E-04    3           23        14       -14             # HL0    -->  Z0     NUM    ANUM        
      1.99964197E-04    3           23        16       -16             # HL0    -->  Z0     NUT    ANUT        
      1.00639969E-04    3           23        11       -11             # HL0    -->  Z0     E-     E+          
      1.00639969E-04    3           23        13       -13             # HL0    -->  Z0     MU-    MU+         
      1.00639969E-04    3           23        15       -15             # HL0    -->  Z0     TAU-   TAU+        
      3.44783999E-04    3           23         2        -2             # HL0    -->  Z0     UP     UB          
      3.44783999E-04    3           23         4        -4             # HL0    -->  Z0     CH     CB          
      4.44166741E-04    3           23         1        -1             # HL0    -->  Z0     DN     DB          
      4.44166741E-04    3           23         3        -3             # HL0    -->  Z0     ST     SB          
      4.44166741E-04    3           23         5        -5             # HL0    -->  Z0     BT     BB          
#         PDG         Width
DECAY        35  1.88975763E+00   # HH0   decays
#          BR          NDA       ID1       ID2       ID3       ID4
      7.24759319E-09    2           11       -11                       # HH0    -->  E-     E+                 
      3.06006434E-04    2           13       -13                       # HH0    -->  MU-    MU+                
      8.76423791E-02    2           15       -15                       # HH0    -->  TAU-   TAU+               
      8.89503008E-06    2            1        -1                       # HH0    -->  DN     DB                 
      3.59404227E-03    2            3        -3                       # HH0    -->  ST     SB                 
      5.51200390E-01    2            5        -5                       # HH0    -->  BT     BB                 
      3.01147968E-10    2            2        -2                       # HH0    -->  UP     UB                 
      4.35484526E-06    2            4        -4                       # HH0    -->  CH     CB                 
      1.80657372E-01    2            6        -6                       # HH0    -->  TP     TB                 
      1.92632274E-06    2           22        22                       # HH0    -->  GM     GM                 
      1.45565544E-04    2           21        21                       # HH0    -->  GL     GL                 
      6.83600083E-04    2           24       -24                       # HH0    -->  W+     W-                 
      3.44970002E-04    2           23        23                       # HH0    -->  Z0     Z0                 
      6.07608398E-03    2      1000022   1000022                       # HH0    -->  Z1SS   Z1SS               
      2.86725760E-02    2      1000022   1000023                       # HH0    -->  Z1SS   Z2SS               
      8.14867243E-02    2      1000022   1000025                       # HH0    -->  Z1SS   Z3SS               
      4.05966491E-03    2      1000022   1000035                       # HH0    -->  Z1SS   Z4SS               
      1.68861430E-02    2      1000023   1000023                       # HH0    -->  Z2SS   Z2SS               
      3.68732661E-02    2      1000024  -1000024                       # HH0    -->  W1SS+  W1SS-              
      1.35580439E-03    2           25        25                       # HH0    -->  HL0    HL0                
#         PDG         Width
DECAY        36  2.33736300E+00   # HA0   decays
#          BR          NDA       ID1       ID2       ID3       ID4
      5.82342485E-09    2           11       -11                       # HA0    -->  E-     E+                 
      2.45875475E-04    2           13       -13                       # HA0    -->  MU-    MU+                
      7.04218224E-02    2           15       -15                       # HA0    -->  TAU-   TAU+               
      7.14755606E-06    2            1        -1                       # HA0    -->  DN     DB                 
      2.88797473E-03    2            3        -3                       # HA0    -->  ST     SB                 
      4.42946136E-01    2            5        -5                       # HA0    -->  BT     BB                 
      2.28698879E-10    2            2        -2                       # HA0    -->  UP     UB                 
      3.30989451E-06    2            4        -4                       # HA0    -->  CH     CB                 
      1.63521022E-01    2            6        -6                       # HA0    -->  TP     TB                 
      5.93223774E-07    2           22        22                       # HA0    -->  GM     GM                 
      1.57504051E-04    2           21        21                       # HA0    -->  GL     GL                 
      7.28277722E-03    2      1000022   1000022                       # HA0    -->  Z1SS   Z1SS               
      4.90227677E-02    2      1000022   1000023                       # HA0    -->  Z1SS   Z2SS               
      6.14412734E-03    2      1000022   1000025                       # HA0    -->  Z1SS   Z3SS               
      3.93024273E-02    2      1000022   1000035                       # HA0    -->  Z1SS   Z4SS               
      6.82017803E-02    2      1000023   1000023                       # HA0    -->  Z2SS   Z2SS               
      1.49329096E-01    2      1000024  -1000024                       # HA0    -->  W1SS+  W1SS-              
      5.25674724E-04    2           25        23                       # HA0    -->  HL0    Z0                 
#         PDG         Width
DECAY        37  1.65213037E+00   # H+    decays
#          BR          NDA       ID1       ID2       ID3       ID4
      8.34558733E-09    2           12       -11                       # H+     -->  NUE    E+                 
      3.52365751E-04    2           14       -13                       # H+     -->  NUM    MU+                
      1.00921981E-01    2           16       -15                       # H+     -->  NUT    TAU+               
      9.39768051E-06    2            2        -1                       # H+     -->  UP     DB                 
      3.80133977E-03    2            4        -3                       # H+     -->  CH     SB                 
      7.35354304E-01    2            6        -5                       # H+     -->  TP     BB                 
      9.77520794E-02    2      1000024   1000022                       # H+     -->  W1SS+  Z1SS               
      1.46518621E-04    2      1000024   1000023                       # H+     -->  W1SS+  Z2SS               
      6.08900785E-02    2      1000037   1000022                       # H+     -->  W2SS+  Z1SS               
      7.71944528E-04    2           25        24                       # H+     -->  HL0    W+                 
