#  ISAJET SUSY parameters in Les Houches accord format
#  Created by ISALHA3. Last revision by C. Balazs on 2005 Jan. 10
Block SPINFO   # Program information
     1   ISASUGRA from ISAJET          # Spectrum Calculator
     2   7.79   16-DEC-2008 15:42:00   # Version number
Block MODSEL   # Model selection
     1     1   # Minimal supergravity (mSUGRA,CMSSM) model         
Block SMINPUTS   # Standard Model inputs
     1     1.27837868E+02   # alpha_em^(-1)
     2     1.16570000E-05   # G_Fermi
     3     1.17200002E-01   # alpha_s(M_Z)
     4     9.11699982E+01   # m_{Z}(pole)
     5     4.19999981E+00   # m_{b}(m_{b})
     6     1.72500000E+02   # m_{top}(pole)
     7     1.77699995E+00   # m_{tau}(pole)
Block MINPAR   # SUSY breaking input parameters
     1     1.00000000E+03   # m_0
     2     3.10000000E+02   # m_{1/2}
     3     3.00000000E+00   # tan(beta)
     4     1.00000000E+00   # sign(mu)
     5     0.00000000E+00   # A_0
#  
#  M_{GUT} =   0.21751510E+17
Block MASS   # Scalar and gaugino mass spectrum
#  PDG code   mass                 particle
        24     8.04229965E+01   #  W^+
        25     9.99840088E+01   #  h^0            
        35     1.28908545E+03   #  H^0            
        36     1.27940320E+03   #  A^0            
        37     1.29024731E+03   #  H^+            
   1000001     1.19226013E+03   #  dnl            
   1000002     1.19007190E+03   #  upl            
   1000003     1.19226013E+03   #  stl            
   1000004     1.19007263E+03   #  chl            
   1000005     1.00368695E+03   #  b1             
   1000006     7.34149597E+02   #  t1             
   1000011     1.01952161E+03   #  el-            
   1000012     1.01701831E+03   #  nuel           
   1000013     1.01952161E+03   #  mul-           
   1000014     1.01701831E+03   #  numl           
   1000015     1.00461420E+03   #  tau1           
   1000016     1.01663458E+03   #  nutl           
   1000021     7.94672180E+02   #  glss           
   1000022     1.26602295E+02   #  z1ss           
   1000023     2.42182068E+02   #  z2ss           
   1000024     2.41936859E+02   #  w1ss           
   1000025    -6.58451660E+02   #  z3ss           
   1000035     6.72511658E+02   #  z4ss           
   1000037     6.70861755E+02   #  w2ss           
   2000001     1.18128918E+03   #  dnr            
   2000002     1.18162476E+03   #  upr            
   2000003     1.18128918E+03   #  str            
   2000004     1.18162561E+03   #  chr            
   2000005     1.17648730E+03   #  b2             
   2000006     1.02274652E+03   #  t2             
   2000011     1.00593921E+03   #  er-            
   2000013     1.00593927E+03   #  mur-           
   2000015     1.01925464E+03   #  tau2           
#  Higgs mixing
Block ALPHA   # Effective Higgs mixing parameter
         -3.24877650E-01   # alpha
Block STOPMIX   # stop mixing matrix
  1  1     2.14192748E-01   # O_{11}
  1  2    -9.76791441E-01   # O_{12}
  2  1     9.76791441E-01   # O_{21}
  2  2     2.14192748E-01   # O_{22}
Block SBOTMIX   # sbottom mixing matrix
  1  1     9.99846160E-01   # O_{11}
  1  2    -1.75397564E-02   # O_{12}
  2  1     1.75397564E-02   # O_{21}
  2  2     9.99846160E-01   # O_{22}
Block STAUMIX   # stau mixing matrix
  1  1     1.35592595E-01   # O_{11}
  1  2    -9.90764678E-01   # O_{12}
  2  1     9.90764678E-01   # O_{21}
  2  2     1.35592595E-01   # O_{22}
Block NMIX   # neutralino mixing matrix
  1  1     9.96150196E-01   #
  1  2    -3.27548198E-02   #
  1  3     7.28828385E-02   #
  1  4    -3.60550173E-02   #
  2  1    -4.59682122E-02   #
  2  2    -9.84832346E-01   #
  2  3     1.41598612E-01   #
  2  4    -8.91178176E-02   #
  3  1    -2.46508494E-02   #
  3  2     3.83586101E-02   #
  3  3     7.04517603E-01   #
  3  4     7.08220482E-01   #
  4  1     7.04557896E-02   #
  4  2    -1.66014880E-01   #
  4  3    -6.91587448E-01   #
  4  4     6.99415386E-01   #
Block UMIX   # chargino U mixing matrix
  1  1    -9.79259551E-01   # U_{11}
  1  2     2.02609748E-01   # U_{12}
  2  1    -2.02609748E-01   # U_{21}
  2  2    -9.79259551E-01   # U_{22}
Block VMIX   # chargino V mixing matrix
  1  1    -9.91575301E-01   # V_{11}
  1  2     1.29531696E-01   # V_{12}
  2  1    -1.29531696E-01   # V_{21}
  2  2    -9.91575301E-01   # V_{22}
Block GAUGE Q=  8.30177185E+02   #
     1     3.57521504E-01   # g`
     2     6.52382016E-01   # g_2
     3     1.21943712E+00   # g_3
Block YU Q=  8.30177185E+02   #
  3  3     9.06568229E-01   # y_t
Block YD Q=  8.30177185E+02   #
  3  3     4.28381152E-02   # y_b
Block YE Q=  8.30177185E+02   #
  3  3     3.17897350E-02   # y_tau
Block HMIX Q=  8.30177185E+02   # Higgs mixing parameters
     1     6.55335999E+02   # mu(Q)
     2     3.00000000E+00   # tan(beta)(M_{GUT})
     3     2.50901901E+02   # Higgs vev at Q
     4     1.63687250E+06   # m_A^2(Q)
Block MSOFT Q=  8.30177185E+02   # DRbar SUSY breaking parameters
     1     1.29563614E+02   # M_1(Q)          
     2     2.41508026E+02   # M_2(Q)          
     3     7.10035278E+02   # M_3(Q)          
    31     1.01562830E+03   # MeL(Q)          
    32     1.01562830E+03   # MmuL(Q)         
    33     1.01525220E+03   # MtauL(Q)        
    34     1.00433704E+03   # MeR(Q)          
    35     1.00433704E+03   # MmuR(Q)         
    36     1.00345599E+03   # MtauR(Q)        
    41     1.15666943E+03   # MqL1(Q)         
    42     1.15666943E+03   # MqL2(Q)         
    43     9.70744263E+02   # MqL3(Q)         
    44     1.14760168E+03   # MuR(Q)          
    45     1.14760168E+03   # McR(Q)          
    46     7.09964783E+02   # MtR(Q)          
    47     1.14659058E+03   # MdR(Q)          
    48     1.14659058E+03   # MsR(Q)          
    49     1.15050403E+03   # MbR(Q)          
Block AU Q=  8.30177185E+02   #
  1  1    -5.18808472E+02   # A_u
  2  2    -5.18808472E+02   # A_c
  3  3    -5.18808472E+02   # A_t
Block AD Q=  8.30177185E+02   #
  1  1    -8.19348389E+02   # A_d
  2  2    -8.19348389E+02   # A_s
  3  3    -8.19348389E+02   # A_b
Block AE Q=  8.30177185E+02   #
  1  1    -1.90432800E+02   # A_e
  2  2    -1.90432800E+02   # A_mu
  3  3    -1.90432800E+02   # A_tau
#  ISAJET decay tables in SUSY Les Houches accord format
#  Created by ISALHD. Last revision: C. Balazs, 2005 May 25
Block DCINFO                           # Program information
     1   ISASUGRA from ISAJET          # Spectrum Calculator
     2   7.79   16-DEC-2008 15:42:00   # Version number
#         PDG         Width
DECAY         6  1.14680767E+00   # TP    decays
#          BR          NDA       ID1       ID2       ID3       ID4
      3.33333343E-01    3            2        -1         5             # TP     -->  UP     DB     BT          
      3.33333343E-01    3            4        -3         5             # TP     -->  CH     SB     BT          
      1.11111112E-01    3          -11        12         5             # TP     -->  E+     NUE    BT          
      1.11111112E-01    3          -13        14         5             # TP     -->  MU+    NUM    BT          
      1.11111112E-01    3          -15        16         5             # TP     -->  TAU+   NUT    BT          
#         PDG         Width
DECAY   1000021  1.19156595E-02   # GLSS  decays
#          BR          NDA       ID1       ID2       ID3       ID4
      7.70079643E-02    3      1000024         1        -2             # GLSS   -->  W1SS+  DN     UB          
      7.70079643E-02    3     -1000024         2        -1             # GLSS   -->  W1SS-  UP     DB          
      7.70078376E-02    3      1000024         3        -4             # GLSS   -->  W1SS+  ST     CB          
      7.70078376E-02    3     -1000024         4        -3             # GLSS   -->  W1SS-  CH     SB          
      8.90632495E-02    3      1000024         5        -6             # GLSS   -->  W1SS+  BT     TB          
      8.90632495E-02    3     -1000024         6        -5             # GLSS   -->  W1SS-  TP     BB          
      6.96818370E-06    3      1000037         1        -2             # GLSS   -->  W2SS+  DN     UB          
      6.96818370E-06    3     -1000037         2        -1             # GLSS   -->  W2SS-  UP     DB          
      6.96817369E-06    3      1000037         3        -4             # GLSS   -->  W2SS+  ST     CB          
      6.96817369E-06    3     -1000037         4        -3             # GLSS   -->  W2SS-  CH     SB          
      1.17963154E-05    2      1000022        21                       # GLSS   -->  Z1SS   GL                 
      3.18940282E-02    3      1000022         2        -2             # GLSS   -->  Z1SS   UP     UB          
      1.02203349E-02    3      1000022         1        -1             # GLSS   -->  Z1SS   DN     DB          
      1.02203349E-02    3      1000022         3        -3             # GLSS   -->  Z1SS   ST     SB          
      3.18939127E-02    3      1000022         4        -4             # GLSS   -->  Z1SS   CH     CB          
      1.42695727E-02    3      1000022         5        -5             # GLSS   -->  Z1SS   BT     BB          
      1.45372897E-01    3      1000022         6        -6             # GLSS   -->  Z1SS   TP     TB          
      1.38888869E-03    2      1000023        21                       # GLSS   -->  Z2SS   GL                 
      3.93087305E-02    3      1000023         2        -2             # GLSS   -->  Z2SS   UP     UB          
      3.75937223E-02    3      1000023         1        -1             # GLSS   -->  Z2SS   DN     DB          
      3.75937223E-02    3      1000023         3        -3             # GLSS   -->  Z2SS   ST     SB          
      3.93086076E-02    3      1000023         4        -4             # GLSS   -->  Z2SS   CH     CB          
      9.79232341E-02    3      1000023         5        -5             # GLSS   -->  Z2SS   BT     BB          
      1.31139653E-02    3      1000023         6        -6             # GLSS   -->  Z2SS   TP     TB          
      1.87372416E-03    2      1000025        21                       # GLSS   -->  Z3SS   GL                 
      9.77539756E-08    3      1000025         2        -2             # GLSS   -->  Z3SS   UP     UB          
      1.25038511E-07    3      1000025         1        -1             # GLSS   -->  Z3SS   DN     DB          
      1.25038511E-07    3      1000025         3        -3             # GLSS   -->  Z3SS   ST     SB          
      9.77535493E-08    3      1000025         4        -4             # GLSS   -->  Z3SS   CH     CB          
      4.08174947E-06    3      1000025         5        -5             # GLSS   -->  Z3SS   BT     BB          
      1.79131748E-03    2      1000035        21                       # GLSS   -->  Z4SS   GL                 
      3.09134748E-06    3      1000035         2        -2             # GLSS   -->  Z4SS   UP     UB          
      3.81017935E-06    3      1000035         1        -1             # GLSS   -->  Z4SS   DN     DB          
      3.81017935E-06    3      1000035         3        -3             # GLSS   -->  Z4SS   ST     SB          
      3.09133429E-06    3      1000035         4        -4             # GLSS   -->  Z4SS   CH     CB          
      1.68644001E-05    3      1000035         5        -5             # GLSS   -->  Z4SS   BT     BB          
#         PDG         Width
DECAY   1000002  3.58833237E+01   # UPL   decays
#          BR          NDA       ID1       ID2       ID3       ID4
      3.06000561E-03    2      1000022         2                       # UPL    -->  Z1SS   UP                 
      1.26554132E-01    2      1000023         2                       # UPL    -->  Z2SS   UP                 
      7.69795224E-05    2      1000025         2                       # UPL    -->  Z3SS   UP                 
      1.51615159E-03    2      1000035         2                       # UPL    -->  Z4SS   UP                 
      6.14314854E-01    2      1000021         2                       # UPL    -->  GLSS   UP                 
      2.52297521E-01    2      1000024         1                       # UPL    -->  W1SS+  DN                 
      2.18036934E-03    2      1000037         1                       # UPL    -->  W2SS+  DN                 
#         PDG         Width
DECAY   1000001  3.59562645E+01   # DNL   decays
#          BR          NDA       ID1       ID2       ID3       ID4
      6.32225070E-03    2      1000022         1                       # DNL    -->  Z1SS   DN                 
      1.22313440E-01    2      1000023         1                       # DNL    -->  Z2SS   DN                 
      1.23930309E-04    2      1000025         1                       # DNL    -->  Z3SS   DN                 
      2.07727542E-03    2      1000035         1                       # DNL    -->  Z4SS   DN                 
      6.17712021E-01    2      1000021         1                       # DNL    -->  GLSS   DN                 
      2.46099338E-01    2     -1000024         2                       # DNL    -->  W1SS-  UP                 
      5.35176462E-03    2     -1000037         2                       # DNL    -->  W2SS-  UP                 
#         PDG         Width
DECAY   1000003  3.59562416E+01   # STL   decays
#          BR          NDA       ID1       ID2       ID3       ID4
      6.32225443E-03    2      1000022         3                       # STL    -->  Z1SS   ST                 
      1.22313522E-01    2      1000023         3                       # STL    -->  Z2SS   ST                 
      1.23930397E-04    2      1000025         3                       # STL    -->  Z3SS   ST                 
      2.07727682E-03    2      1000035         3                       # STL    -->  Z4SS   ST                 
      6.17712438E-01    2      1000021         3                       # STL    -->  GLSS   ST                 
      2.46098816E-01    2     -1000024         4                       # STL    -->  W1SS-  CH                 
      5.35173900E-03    2     -1000037         4                       # STL    -->  W2SS-  CH                 
#         PDG         Width
DECAY   1000004  3.58831940E+01   # CHL   decays
#          BR          NDA       ID1       ID2       ID3       ID4
      3.06001049E-03    2      1000022         4                       # CHL    -->  Z1SS   CH                 
      1.26554325E-01    2      1000023         4                       # CHL    -->  Z2SS   CH                 
      7.69795224E-05    2      1000025         4                       # CHL    -->  Z3SS   CH                 
      1.51615147E-03    2      1000035         4                       # CHL    -->  Z4SS   CH                 
      6.14313543E-01    2      1000021         4                       # CHL    -->  GLSS   CH                 
      2.52298594E-01    2      1000024         3                       # CHL    -->  W1SS+  ST                 
      2.18038121E-03    2      1000037         3                       # CHL    -->  W2SS+  ST                 
#         PDG         Width
DECAY   1000005  2.61688519E+01   # BT1   decays
#          BR          NDA       ID1       ID2       ID3       ID4
      7.27665285E-03    2      1000022         5                       # BT1    -->  Z1SS   BT                 
      1.36548996E-01    2      1000023         5                       # BT1    -->  Z2SS   BT                 
      3.20895488E-04    2      1000025         5                       # BT1    -->  Z3SS   BT                 
      1.77066412E-03    2      1000035         5                       # BT1    -->  Z4SS   BT                 
      3.27897906E-01    2      1000021         5                       # BT1    -->  GLSS   BT                 
      2.56695867E-01    2     -1000024         6                       # BT1    -->  W1SS-  TP                 
      1.69005886E-01    2     -1000037         6                       # BT1    -->  W2SS-  TP                 
      1.00483127E-01    2          -24   1000006                       # BT1    -->  W-     TP1                
#         PDG         Width
DECAY   1000006  2.67737937E+00   # TP1   decays
#          BR          NDA       ID1       ID2       ID3       ID4
      5.06990194E-01    2      1000022         6                       # TP1    -->  Z1SS   TP                 
      1.14814050E-01    2      1000023         6                       # TP1    -->  Z2SS   TP                 
      2.72763789E-01    2      1000024         5                       # TP1    -->  W1SS+  BT                 
      1.05432011E-01    2      1000037         5                       # TP1    -->  W2SS+  BT                 
#         PDG         Width
DECAY   2000002  2.40021572E+01   # UPR   decays
#          BR          NDA       ID1       ID2       ID3       ID4
      1.07911207E-01    2      1000022         2                       # UPR    -->  Z1SS   UP                 
      2.15816777E-04    2      1000023         2                       # UPR    -->  Z2SS   UP                 
      3.21479711E-05    2      1000025         2                       # UPR    -->  Z3SS   UP                 
      2.52506492E-04    2      1000035         2                       # UPR    -->  Z4SS   UP                 
      8.91588330E-01    2      1000021         2                       # UPR    -->  GLSS   UP                 
#         PDG         Width
DECAY   2000001  2.20248413E+01   # DNR   decays
#          BR          NDA       ID1       ID2       ID3       ID4
      2.93910466E-02    2      1000022         1                       # DNR    -->  Z1SS   DN                 
      5.87783943E-05    2      1000023         1                       # DNR    -->  Z2SS   DN                 
      8.75155911E-06    2      1000025         1                       # DNR    -->  Z3SS   DN                 
      6.87369466E-05    2      1000035         1                       # DNR    -->  Z4SS   DN                 
      9.70472753E-01    2      1000021         1                       # DNR    -->  GLSS   DN                 
#         PDG         Width
DECAY   2000003  2.20248413E+01   # STR   decays
#          BR          NDA       ID1       ID2       ID3       ID4
      2.93910466E-02    2      1000022         3                       # STR    -->  Z1SS   ST                 
      5.87783943E-05    2      1000023         3                       # STR    -->  Z2SS   ST                 
      8.75155911E-06    2      1000025         3                       # STR    -->  Z3SS   ST                 
      6.87369466E-05    2      1000035         3                       # STR    -->  Z4SS   ST                 
      9.70472753E-01    2      1000021         3                       # STR    -->  GLSS   ST                 
#         PDG         Width
DECAY   2000004  2.40020332E+01   # CHR   decays
#          BR          NDA       ID1       ID2       ID3       ID4
      1.07911557E-01    2      1000022         4                       # CHR    -->  Z1SS   CH                 
      2.15817447E-04    2      1000023         4                       # CHR    -->  Z2SS   CH                 
      3.21480220E-05    2      1000025         4                       # CHR    -->  Z3SS   CH                 
      2.52506870E-04    2      1000035         4                       # CHR    -->  Z4SS   CH                 
      8.91587913E-01    2      1000021         4                       # CHR    -->  GLSS   CH                 
#         PDG         Width
DECAY   2000005  2.17132797E+01   # BT2   decays
#          BR          NDA       ID1       ID2       ID3       ID4
      2.96577029E-02    2      1000022         5                       # BT2    -->  Z1SS   BT                 
      6.37785561E-05    2      1000023         5                       # BT2    -->  Z2SS   BT                 
      5.02208073E-04    2      1000025         5                       # BT2    -->  Z3SS   BT                 
      5.67113690E-04    2      1000035         5                       # BT2    -->  Z4SS   BT                 
      9.67104018E-01    2      1000021         5                       # BT2    -->  GLSS   BT                 
      8.38943834E-06    2     -1000024         6                       # BT2    -->  W1SS-  TP                 
      1.16945745E-03    2     -1000037         6                       # BT2    -->  W2SS-  TP                 
      1.48718187E-04    2          -24   1000006                       # BT2    -->  W-     TP1                
      1.29018314E-04    2          -24   2000006                       # BT2    -->  W-     TP2                
      9.37533841E-05    2           23   1000005                       # BT2    -->  Z0     BT1                
      5.55862149E-04    2           25   1000005                       # BT2    -->  HL0    BT1                
#         PDG         Width
DECAY   2000006  2.27812214E+01   # TP2   decays
#          BR          NDA       ID1       ID2       ID3       ID4
      1.83233634E-01    2      1000021         6                       # TP2    -->  GLSS   TP                 
      2.91707337E-01    2      1000024         5                       # TP2    -->  W1SS+  BT                 
      2.19475403E-02    2      1000037         5                       # TP2    -->  W2SS+  BT                 
      6.56623021E-02    2           23   1000006                       # TP2    -->  Z0     TP1                
      8.57257470E-02    2           25   1000006                       # TP2    -->  HL0    TP1                
      5.61472075E-03    2      1000022         6                       # TP2    -->  Z1SS   TP                 
      1.37770846E-01    2      1000023         6                       # TP2    -->  Z2SS   TP                 
      8.53714347E-02    2      1000025         6                       # TP2    -->  Z3SS   TP                 
      1.22966424E-01    2      1000035         6                       # TP2    -->  Z4SS   TP                 
#         PDG         Width
DECAY   1000011  1.24668264E+01   # EL-   decays
#          BR          NDA       ID1       ID2       ID3       ID4
      8.84194225E-02    2      1000022        11                       # EL-    -->  Z1SS   E-                 
      3.12701255E-01    2      1000023        11                       # EL-    -->  Z2SS   E-                 
      7.19900709E-05    2      1000025        11                       # EL-    -->  Z3SS   E-                 
      1.77976710E-03    2      1000035        11                       # EL-    -->  Z4SS   E-                 
      5.87941170E-01    2     -1000024        12                       # EL-    -->  W1SS-  NUE                
      9.08640027E-03    2     -1000037        12                       # EL-    -->  W2SS-  NUE                
#         PDG         Width
DECAY   1000013  1.24668264E+01   # MUL-  decays
#          BR          NDA       ID1       ID2       ID3       ID4
      8.84194225E-02    2      1000022        13                       # MUL-   -->  Z1SS   MU-                
      3.12701255E-01    2      1000023        13                       # MUL-   -->  Z2SS   MU-                
      7.19900709E-05    2      1000025        13                       # MUL-   -->  Z3SS   MU-                
      1.77976687E-03    2      1000035        13                       # MUL-   -->  Z4SS   MU-                
      5.87941170E-01    2     -1000024        14                       # MUL-   -->  W1SS-  NUM                
      9.08640027E-03    2     -1000037        14                       # MUL-   -->  W2SS-  NUM                
#         PDG         Width
DECAY   1000015  5.09898376E+00   # TAU1- decays
#          BR          NDA       ID1       ID2       ID3       ID4
      9.49988246E-01    2      1000022        15                       # TAU1-  -->  Z1SS   TAU-               
      1.76205691E-02    2      1000023        15                       # TAU1-  -->  Z2SS   TAU-               
      6.73642964E-04    2      1000025        15                       # TAU1-  -->  Z3SS   TAU-               
      1.48983009E-03    2      1000035        15                       # TAU1-  -->  Z4SS   TAU-               
      3.00059933E-02    2     -1000024        16                       # TAU1-  -->  W1SS-  NUT                
      2.21719150E-04    2     -1000037        16                       # TAU1-  -->  W2SS-  NUT                
#         PDG         Width
DECAY   1000012  1.25034685E+01   # NUEL  decays
#          BR          NDA       ID1       ID2       ID3       ID4
      1.11735277E-01    2      1000022        12                       # NUEL   -->  Z1SS   NUE                
      2.80514717E-01    2      1000023        12                       # NUEL   -->  Z2SS   NUE                
      3.11217620E-04    2      1000025        12                       # NUEL   -->  Z3SS   NUE                
      4.54488490E-03    2      1000035        12                       # NUEL   -->  Z4SS   NUE                
      5.99227786E-01    2      1000024        11                       # NUEL   -->  W1SS+  E-                 
      3.66611150E-03    2      1000037        11                       # NUEL   -->  W2SS+  E-                 
#         PDG         Width
DECAY   1000014  1.25034685E+01   # NUML  decays
#          BR          NDA       ID1       ID2       ID3       ID4
      1.11735277E-01    2      1000022        14                       # NUML   -->  Z1SS   NUM                
      2.80514717E-01    2      1000023        14                       # NUML   -->  Z2SS   NUM                
      3.11217620E-04    2      1000025        14                       # NUML   -->  Z3SS   NUM                
      4.54488490E-03    2      1000035        14                       # NUML   -->  Z4SS   NUM                
      5.99227786E-01    2      1000024        13                       # NUML   -->  W1SS+  MU-                
      3.66611080E-03    2      1000037        13                       # NUML   -->  W2SS+  MU-                
#         PDG         Width
DECAY   1000016  1.25048199E+01   # NUTL  decays
#          BR          NDA       ID1       ID2       ID3       ID4
      1.11678399E-01    2      1000022        16                       # NUTL   -->  Z1SS   NUT                
      2.80353129E-01    2      1000023        16                       # NUTL   -->  Z2SS   NUT                
      3.10727657E-04    2      1000025        16                       # NUTL   -->  Z3SS   NUT                
      4.53735050E-03    2      1000035        16                       # NUTL   -->  Z4SS   NUT                
      5.98929882E-01    2      1000024        15                       # NUTL   -->  W1SS+  TAU-               
      4.19053249E-03    2      1000037        15                       # NUTL   -->  W2SS+  TAU-               
      1.05545614E-10    3      1000015        16       -15             # NUTL   -->  TAU1-  NUT    TAU+        
      1.05545628E-10    3      1000015        12       -11             # NUTL   -->  TAU1-  NUE    E+          
      1.05545628E-10    3      1000015        14       -13             # NUTL   -->  TAU1-  NUM    MU+         
      3.16636856E-10    3      1000015         2        -1             # NUTL   -->  TAU1-  UP     DB          
      3.16636856E-10    3      1000015         4        -3             # NUTL   -->  TAU1-  CH     SB          
#         PDG         Width
DECAY   2000011  4.93596506E+00   # ER-   decays
#          BR          NDA       ID1       ID2       ID3       ID4
      9.96276557E-01    2      1000022        11                       # ER-    -->  Z1SS   E-                 
      1.94379676E-03    2      1000023        11                       # ER-    -->  Z2SS   E-                 
      2.05761651E-04    2      1000025        11                       # ER-    -->  Z3SS   E-                 
      1.57385634E-03    2      1000035        11                       # ER-    -->  Z4SS   E-                 
#         PDG         Width
DECAY   2000013  4.93596601E+00   # MUR-  decays
#          BR          NDA       ID1       ID2       ID3       ID4
      9.96276557E-01    2      1000022        13                       # MUR-   -->  Z1SS   MU-                
      1.94379629E-03    2      1000023        13                       # MUR-   -->  Z2SS   MU-                
      2.05761637E-04    2      1000025        13                       # MUR-   -->  Z3SS   MU-                
      1.57385645E-03    2      1000035        13                       # MUR-   -->  Z4SS   MU-                
#         PDG         Width
DECAY   2000015  1.23112993E+01   # TAU2- decays
#          BR          NDA       ID1       ID2       ID3       ID4
      9.50290859E-02    2      1000022        15                       # TAU2-  -->  Z1SS   TAU-               
      3.09965134E-01    2      1000023        15                       # TAU2-  -->  Z2SS   TAU-               
      4.45020094E-04    2      1000025        15                       # TAU2-  -->  Z3SS   TAU-               
      2.34818272E-03    2      1000035        15                       # TAU2-  -->  Z4SS   TAU-               
      5.82585633E-01    2     -1000024        16                       # TAU2-  -->  W1SS-  NUT                
      9.62691847E-03    2     -1000037        16                       # TAU2-  -->  W2SS-  NUT                
#         PDG         Width
DECAY   1000023  6.64248271E-03   # Z2SS  decays
#          BR          NDA       ID1       ID2       ID3       ID4
      6.95891234E-10    2      1000022        22                       # Z2SS   -->  Z1SS   GM                 
      1.71529129E-02    2      1000022        23                       # Z2SS   -->  Z1SS   Z0                 
      4.11717139E-07    3      1000022         2        -2             # Z2SS   -->  Z1SS   UP     UB          
      7.94326695E-07    3      1000022         1        -1             # Z2SS   -->  Z1SS   DN     DB          
      7.94326695E-07    3      1000022         3        -3             # Z2SS   -->  Z1SS   ST     SB          
      4.11716059E-07    3      1000022         4        -4             # Z2SS   -->  Z1SS   CH     CB          
      1.59094952E-06    3      1000022         5        -5             # Z2SS   -->  Z1SS   BT     BB          
      3.12176189E-06    3      1000022        11       -11             # Z2SS   -->  Z1SS   E-     E+          
      3.12176189E-06    3      1000022        13       -13             # Z2SS   -->  Z1SS   MU-    MU+         
      3.12565044E-06    3      1000022        15       -15             # Z2SS   -->  Z1SS   TAU-   TAU+        
      3.57378008E-06    3      1000022        12       -12             # Z2SS   -->  Z1SS   NUE    ANUE        
      3.57378008E-06    3      1000022        14       -14             # Z2SS   -->  Z1SS   NUM    ANUM        
      3.57936869E-06    3      1000022        16       -16             # Z2SS   -->  Z1SS   NUT    ANUT        
      9.82822955E-01    2      1000022        25                       # Z2SS   -->  Z1SS   HL0                
#         PDG         Width
DECAY   1000025  5.51906347E+00   # Z3SS  decays
#          BR          NDA       ID1       ID2       ID3       ID4
      2.28291668E-07    2      1000022        22                       # Z3SS   -->  Z1SS   GM                 
      2.49159626E-07    2      1000023        22                       # Z3SS   -->  Z2SS   GM                 
      3.05607319E-01    2      1000024       -24                       # Z3SS   -->  W1SS+  W-                 
      3.05607319E-01    2     -1000024        24                       # Z3SS   -->  W1SS-  W+                 
      8.78165513E-02    2      1000022        23                       # Z3SS   -->  Z1SS   Z0                 
      2.75868416E-01    2      1000023        23                       # Z3SS   -->  Z2SS   Z0                 
      2.44641107E-09    3      1000022         2        -2             # Z3SS   -->  Z1SS   UP     UB          
      1.13872611E-09    3      1000022         1        -1             # Z3SS   -->  Z1SS   DN     DB          
      1.13872611E-09    3      1000022         3        -3             # Z3SS   -->  Z1SS   ST     SB          
      2.44640264E-09    3      1000022         4        -4             # Z3SS   -->  Z1SS   CH     CB          
      3.71517110E-08    3      1000022         5        -5             # Z3SS   -->  Z1SS   BT     BB          
      9.41853529E-09    3      1000022        11       -11             # Z3SS   -->  Z1SS   E-     E+          
      9.41853173E-09    3      1000022        13       -13             # Z3SS   -->  Z1SS   MU-    MU+         
      7.44330535E-08    3      1000022        15       -15             # Z3SS   -->  Z1SS   TAU-   TAU+        
      7.81841614E-09    3      1000022        12       -12             # Z3SS   -->  Z1SS   NUE    ANUE        
      7.81841614E-09    3      1000022        14       -14             # Z3SS   -->  Z1SS   NUM    ANUM        
      7.83366350E-09    3      1000022        16       -16             # Z3SS   -->  Z1SS   NUT    ANUT        
      5.87647531E-09    3      1000023         2        -2             # Z3SS   -->  Z2SS   UP     UB          
      9.03039421E-09    3      1000023         1        -1             # Z3SS   -->  Z2SS   DN     DB          
      9.03039421E-09    3      1000023         3        -3             # Z3SS   -->  Z2SS   ST     SB          
      5.87645710E-09    3      1000023         4        -4             # Z3SS   -->  Z2SS   CH     CB          
      1.42178919E-07    3      1000023         5        -5             # Z3SS   -->  Z2SS   BT     BB          
      2.40357045E-09    3      1000023        11       -11             # Z3SS   -->  Z2SS   E-     E+          
      2.40357045E-09    3      1000023        13       -13             # Z3SS   -->  Z2SS   MU-    MU+         
      2.45597001E-08    3      1000023        15       -15             # Z3SS   -->  Z2SS   TAU-   TAU+        
      9.59009316E-09    3      1000023        12       -12             # Z3SS   -->  Z2SS   NUE    ANUE        
      9.59009316E-09    3      1000023        14       -14             # Z3SS   -->  Z2SS   NUM    ANUM        
      9.60955759E-09    3      1000023        16       -16             # Z3SS   -->  Z2SS   NUT    ANUT        
      1.01731019E-02    2      1000022        25                       # Z3SS   -->  Z1SS   HL0                
      1.49264056E-02    2      1000023        25                       # Z3SS   -->  Z2SS   HL0                
#         PDG         Width
DECAY   1000035  5.63635063E+00   # Z4SS  decays
#          BR          NDA       ID1       ID2       ID3       ID4
      8.19452794E-07    2      1000022        22                       # Z4SS   -->  Z1SS   GM                 
      1.73517478E-07    2      1000023        22                       # Z4SS   -->  Z2SS   GM                 
      1.87577134E-10    2      1000025        22                       # Z4SS   -->  Z3SS   GM                 
      3.15569609E-01    2      1000024       -24                       # Z4SS   -->  W1SS+  W-                 
      3.15569609E-01    2     -1000024        24                       # Z4SS   -->  W1SS-  W+                 
      9.65952578E-13    3     -1000037         2        -1             # Z4SS   -->  W2SS-  UP     DB          
      3.21984193E-13    3     -1000037        12       -11             # Z4SS   -->  W2SS-  NUE    E+          
      3.21984193E-13    3     -1000037        14       -13             # Z4SS   -->  W2SS-  NUM    MU+         
      9.65952578E-13    3      1000037         1        -2             # Z4SS   -->  W2SS+  DN     UB          
      3.21984193E-13    3      1000037        11       -12             # Z4SS   -->  W2SS+  E-     ANUE        
      3.21984193E-13    3      1000037        13       -14             # Z4SS   -->  W2SS+  MU-    ANUM        
      1.03388317E-02    2      1000022        23                       # Z4SS   -->  Z1SS   Z0                 
      1.55936042E-02    2      1000023        23                       # Z4SS   -->  Z2SS   Z0                 
      4.52640023E-08    3      1000022         2        -2             # Z4SS   -->  Z1SS   UP     UB          
      3.54621257E-08    3      1000022         1        -1             # Z4SS   -->  Z1SS   DN     DB          
      3.54621257E-08    3      1000022         3        -3             # Z4SS   -->  Z1SS   ST     SB          
      4.52638496E-08    3      1000022         4        -4             # Z4SS   -->  Z1SS   CH     CB          
      1.11784331E-07    3      1000022         5        -5             # Z4SS   -->  Z1SS   BT     BB          
      1.91702028E-07    3      1000022        11       -11             # Z4SS   -->  Z1SS   E-     E+          
      1.91702000E-07    3      1000022        13       -13             # Z4SS   -->  Z1SS   MU-    MU+         
      2.59821007E-07    3      1000022        15       -15             # Z4SS   -->  Z1SS   TAU-   TAU+        
      2.28474065E-07    3      1000022        12       -12             # Z4SS   -->  Z1SS   NUE    ANUE        
      2.28474065E-07    3      1000022        14       -14             # Z4SS   -->  Z1SS   NUM    ANUM        
      2.28909201E-07    3      1000022        16       -16             # Z4SS   -->  Z1SS   NUT    ANUT        
      3.10035375E-07    3      1000023         2        -2             # Z4SS   -->  Z2SS   UP     UB          
      4.05522684E-07    3      1000023         1        -1             # Z4SS   -->  Z2SS   DN     DB          
      4.05522684E-07    3      1000023         3        -3             # Z4SS   -->  Z2SS   ST     SB          
      3.10034494E-07    3      1000023         4        -4             # Z4SS   -->  Z2SS   CH     CB          
      1.08289828E-06    3      1000023         5        -5             # Z4SS   -->  Z2SS   BT     BB          
      1.59948698E-07    3      1000023        11       -11             # Z4SS   -->  Z2SS   E-     E+          
      1.59948698E-07    3      1000023        13       -13             # Z4SS   -->  Z2SS   MU-    MU+         
      1.82588380E-07    3      1000023        15       -15             # Z4SS   -->  Z2SS   TAU-   TAU+        
      3.77879530E-07    3      1000023        12       -12             # Z4SS   -->  Z2SS   NUE    ANUE        
      3.77879530E-07    3      1000023        14       -14             # Z4SS   -->  Z2SS   NUM    ANUM        
      3.78625430E-07    3      1000023        16       -16             # Z4SS   -->  Z2SS   NUT    ANUT        
      1.17158079E-08    3      1000025         2        -2             # Z4SS   -->  Z3SS   UP     UB          
      1.51107304E-08    3      1000025         1        -1             # Z4SS   -->  Z3SS   DN     DB          
      1.51107304E-08    3      1000025         3        -3             # Z4SS   -->  Z3SS   ST     SB          
      1.17158079E-08    3      1000025         4        -4             # Z4SS   -->  Z3SS   CH     CB          
      3.03344083E-09    3      1000025         5        -5             # Z4SS   -->  Z3SS   BT     BB          
      3.42786266E-09    3      1000025        11       -11             # Z4SS   -->  Z3SS   E-     E+          
      3.42786266E-09    3      1000025        13       -13             # Z4SS   -->  Z3SS   MU-    MU+         
      2.79737877E-09    3      1000025        15       -15             # Z4SS   -->  Z3SS   TAU-   TAU+        
      6.81798840E-09    3      1000025        12       -12             # Z4SS   -->  Z3SS   NUE    ANUE        
      6.81798840E-09    3      1000025        14       -14             # Z4SS   -->  Z3SS   NUM    ANUM        
      6.81798662E-09    3      1000025        16       -16             # Z4SS   -->  Z3SS   NUT    ANUT        
      8.23998228E-02    2      1000022        25                       # Z4SS   -->  Z1SS   HL0                
      2.60521710E-01    2      1000023        25                       # Z4SS   -->  Z2SS   HL0                
#         PDG         Width
DECAY   1000024  4.36348282E-03   # W1SS+ decays
#          BR          NDA       ID1       ID2       ID3       ID4
      1.77325853E-06    3      1000022         2        -1             # W1SS+  -->  Z1SS   UP     DB          
      1.77325671E-06    3      1000022         4        -3             # W1SS+  -->  Z1SS   CH     SB          
      1.00970383E-05    3      1000022       -11        12             # W1SS+  -->  Z1SS   E+     NUE         
      1.00970383E-05    3      1000022       -13        14             # W1SS+  -->  Z1SS   MU+    NUM         
      1.01228452E-05    3      1000022       -15        16             # W1SS+  -->  Z1SS   TAU+   NUT         
      9.99966145E-01    2      1000022        24                       # W1SS+  -->  Z1SS   W+                 
#         PDG         Width
DECAY   1000037  5.60579872E+00   # W2SS+ decays
#          BR          NDA       ID1       ID2       ID3       ID4
      4.81870082E-08    3      1000022         2        -1             # W2SS+  -->  Z1SS   UP     DB          
      4.81869762E-08    3      1000022         4        -3             # W2SS+  -->  Z1SS   CH     SB          
      2.60089934E-07    3      1000022       -11        12             # W2SS+  -->  Z1SS   E+     NUE         
      2.60089934E-07    3      1000022       -13        14             # W2SS+  -->  Z1SS   MU+    NUM         
      3.30580946E-07    3      1000022       -15        16             # W2SS+  -->  Z1SS   TAU+   NUT         
      7.32605532E-02    2      1000022        24                       # W2SS+  -->  Z1SS   W+                 
      3.45707718E-07    3      1000023         2        -1             # W2SS+  -->  Z2SS   UP     DB          
      3.45707491E-07    3      1000023         4        -3             # W2SS+  -->  Z2SS   CH     SB          
      2.69104419E-07    3      1000023       -11        12             # W2SS+  -->  Z2SS   E+     NUE         
      2.69104419E-07    3      1000023       -13        14             # W2SS+  -->  Z2SS   MU+    NUM         
      2.90857741E-07    3      1000023       -15        16             # W2SS+  -->  Z2SS   TAU+   NUT         
      3.22502226E-01    2      1000023        24                       # W2SS+  -->  Z2SS   W+                 
      2.17648779E-08    3      1000025         2        -1             # W2SS+  -->  Z3SS   UP     DB          
      2.17648779E-08    3      1000025         4        -3             # W2SS+  -->  Z3SS   CH     SB          
      7.25461780E-09    3      1000025       -11        12             # W2SS+  -->  Z3SS   E+     NUE         
      7.25461780E-09    3      1000025       -13        14             # W2SS+  -->  Z3SS   MU+    NUM         
      7.25481542E-09    3      1000025       -15        16             # W2SS+  -->  Z3SS   TAU+   NUT         
      3.10658544E-01    2      1000024        23                       # W2SS+  -->  W1SS+  Z0                 
      3.16874122E-07    3      1000024         1        -1             # W2SS+  -->  W1SS+  DN     DB          
      3.16873212E-07    3      1000024         3        -3             # W2SS+  -->  W1SS+  ST     SB          
      7.49453193E-07    3      1000024         2        -2             # W2SS+  -->  W1SS+  UP     UB          
      7.49453193E-07    3      1000024         4        -4             # W2SS+  -->  W1SS+  CH     CB          
      5.49247488E-07    3      1000024        12       -12             # W2SS+  -->  W1SS+  NUE    ANUE        
      5.49247488E-07    3      1000024        14       -14             # W2SS+  -->  W1SS+  NUM    ANUM        
      5.93906861E-07    3      1000024        16       -16             # W2SS+  -->  W1SS+  NUT    ANUT        
      2.33182575E-07    3      1000024        11       -11             # W2SS+  -->  W1SS+  E-     E+          
      2.33182575E-07    3      1000024        13       -13             # W2SS+  -->  W1SS+  MU-    MU+         
      2.33648407E-07    3      1000024        15       -15             # W2SS+  -->  W1SS+  TAU-   TAU+        
      2.93571591E-01    2      1000024        25                       # W2SS+  -->  W1SS+  HL0                
#         PDG         Width
DECAY        25  3.41504836E-03   # HL0   decays
#          BR          NDA       ID1       ID2       ID3       ID4
      5.06912734E-09    2           11       -11                       # HL0    -->  E-     E+                 
      2.14026295E-04    2           13       -13                       # HL0    -->  MU-    MU+                
      6.11846708E-02    2           15       -15                       # HL0    -->  TAU-   TAU+               
      6.37597714E-06    2            1        -1                       # HL0    -->  DN     DB                 
      2.57621310E-03    2            3        -3                       # HL0    -->  ST     SB                 
      8.61375630E-01    2            5        -5                       # HL0    -->  BT     BB                 
      1.99818714E-06    2            2        -2                       # HL0    -->  UP     UB                 
      3.84411514E-02    2            4        -4                       # HL0    -->  CH     CB                 
      1.32567866E-03    2           22        22                       # HL0    -->  GM     GM                 
      3.05288769E-02    2           21        21                       # HL0    -->  GL     GL                 
      2.41411268E-04    3           24        11       -12             # HL0    -->  W+     E-     ANUE        
      2.41411268E-04    3           24        13       -14             # HL0    -->  W+     MU-    ANUM        
      2.41411268E-04    3           24        15       -16             # HL0    -->  W+     TAU-   ANUT        
      7.24233803E-04    3           24        -2         1             # HL0    -->  W+     UB     DN          
      7.24233803E-04    3           24        -4         3             # HL0    -->  W+     CB     ST          
      2.41411268E-04    3          -24       -11        12             # HL0    -->  W-     E+     NUE         
      2.41411268E-04    3          -24       -13        14             # HL0    -->  W-     MU+    NUM         
      2.41411268E-04    3          -24       -15        16             # HL0    -->  W-     TAU+   NUT         
      7.24233803E-04    3          -24         2        -1             # HL0    -->  W-     UP     DB          
      7.24233803E-04    3          -24         4        -3             # HL0    -->  W-     CH     SB          
#         PDG         Width
DECAY        35  1.64185944E+01   # HH0   decays
#          BR          NDA       ID1       ID2       ID3       ID4
      1.19831589E-10    2           11       -11                       # HH0    -->  E-     E+                 
      5.05950538E-06    2           13       -13                       # HH0    -->  MU-    MU+                
      1.44910347E-03    2           15       -15                       # HH0    -->  TAU-   TAU+               
      1.46500923E-07    2            1        -1                       # HH0    -->  DN     DB                 
      5.91937824E-05    2            3        -3                       # HH0    -->  ST     SB                 
      8.27464927E-03    2            5        -5                       # HH0    -->  BT     BB                 
      5.90850369E-10    2            2        -2                       # HH0    -->  UP     UB                 
      8.08462300E-06    2            4        -4                       # HH0    -->  CH     CB                 
      3.91851962E-01    2            6        -6                       # HH0    -->  TP     TB                 
      2.83164309E-06    2           22        22                       # HH0    -->  GM     GM                 
      2.25114622E-04    2           21        21                       # HH0    -->  GL     GL                 
      4.05562459E-04    2           24       -24                       # HH0    -->  W+     W-                 
      2.06788915E-04    2           23        23                       # HH0    -->  Z0     Z0                 
      6.95137423E-04    2      1000022   1000022                       # HH0    -->  Z1SS   Z1SS               
      3.93673778E-03    2      1000022   1000023                       # HH0    -->  Z1SS   Z2SS               
      5.26743941E-02    2      1000022   1000025                       # HH0    -->  Z1SS   Z3SS               
      8.26105755E-03    2      1000022   1000035                       # HH0    -->  Z1SS   Z4SS               
      5.41646732E-03    2      1000023   1000023                       # HH0    -->  Z2SS   Z2SS               
      1.45538971E-01    2      1000023   1000025                       # HH0    -->  Z2SS   Z3SS               
      1.68370940E-02    2      1000023   1000035                       # HH0    -->  Z2SS   Z4SS               
      1.18274456E-02    2      1000024  -1000024                       # HH0    -->  W1SS+  W1SS-              
      1.75531983E-01    2      1000024  -1000037                       # HH0    -->  W1SS+  W2SS-              
      1.75531983E-01    2     -1000024   1000037                       # HH0    -->  W1SS-  W2SS+              
      1.26026047E-03    2           25        25                       # HH0    -->  HL0    HL0                
#         PDG         Width
DECAY        36  1.62670250E+01   # HA0   decays
#          BR          NDA       ID1       ID2       ID3       ID4
      1.20291541E-10    2           11       -11                       # HA0    -->  E-     E+                 
      5.07892582E-06    2           13       -13                       # HA0    -->  MU-    MU+                
      1.45467662E-03    2           15       -15                       # HA0    -->  TAU-   TAU+               
      1.47072001E-07    2            1        -1                       # HA0    -->  DN     DB                 
      5.94245321E-05    2            3        -3                       # HA0    -->  ST     SB                 
      8.30712449E-03    2            5        -5                       # HA0    -->  BT     BB                 
      5.80966275E-10    2            2        -2                       # HA0    -->  UP     UB                 
      7.95629057E-06    2            4        -4                       # HA0    -->  CH     CB                 
      4.09722567E-01    2            6        -6                       # HA0    -->  TP     TB                 
      6.18800300E-07    2           22        22                       # HA0    -->  GM     GM                 
      2.31902945E-04    2           21        21                       # HA0    -->  GL     GL                 
      1.41768705E-03    2      1000022   1000022                       # HA0    -->  Z1SS   Z1SS               
      9.21957288E-03    2      1000022   1000023                       # HA0    -->  Z1SS   Z2SS               
      9.54020023E-03    2      1000022   1000025                       # HA0    -->  Z1SS   Z3SS               
      4.64002639E-02    2      1000022   1000035                       # HA0    -->  Z1SS   Z4SS               
      1.49032166E-02    2      1000023   1000023                       # HA0    -->  Z2SS   Z2SS               
      1.95976682E-02    2      1000023   1000025                       # HA0    -->  Z2SS   Z3SS               
      1.26381725E-01    2      1000023   1000035                       # HA0    -->  Z2SS   Z4SS               
      3.26239727E-02    2      1000024  -1000024                       # HA0    -->  W1SS+  W1SS-              
      1.59862489E-01    2      1000024  -1000037                       # HA0    -->  W1SS+  W2SS-              
      1.59862489E-01    2     -1000024   1000037                       # HA0    -->  W1SS-  W2SS+              
      4.01201250E-04    2           25        23                       # HA0    -->  HL0    Z0                 
#         PDG         Width
DECAY        37  1.60179539E+01   # H+    decays
#          BR          NDA       ID1       ID2       ID3       ID4
      1.23197438E-10    2           12       -11                       # H+     -->  NUE    E+                 
      5.20161802E-06    2           14       -13                       # H+     -->  NUM    MU+                
      1.48981751E-03    2           16       -15                       # H+     -->  NUT    TAU+               
      1.39271961E-07    2            2        -1                       # H+     -->  UP     DB                 
      6.35487304E-05    2            4        -3                       # H+     -->  CH     SB                 
      3.88172537E-01    2            6        -5                       # H+     -->  TP     BB                 
      1.23152137E-02    2      1000024   1000022                       # H+     -->  W1SS+  Z1SS               
      2.09325808E-05    2      1000024   1000023                       # H+     -->  W1SS+  Z2SS               
      1.81636795E-01    2      1000024   1000025                       # H+     -->  W1SS+  Z3SS               
      1.77565202E-01    2      1000024   1000035                       # H+     -->  W1SS+  Z4SS               
      4.45820726E-02    2      1000037   1000022                       # H+     -->  W2SS+  Z1SS               
      1.93734467E-01    2      1000037   1000023                       # H+     -->  W2SS+  Z2SS               
      4.14085807E-04    2           25        24                       # H+     -->  HL0    W+                 
