  65
  401   2376.9666    0.31637E-25
  402   2375.6279    0.31557E-25
  403   2376.9465    0.31638E-25
  404   2375.6084    0.31558E-25
  405   2161.7400    0.20618E-25
  406   1876.0360    0.40272E-25
  407   2376.9666    0.31637E-25
  408   2375.6279    0.31557E-25
  409   2376.9465    0.31638E-25
  410   2375.6084    0.31558E-25
  411   2161.7400    0.20618E-25
  412   1876.0360    0.40272E-25
  413   2264.1614    0.57479E-24
  414   2275.2686    0.14284E-24
  415   2264.1216    0.57480E-24
  416   2275.2690    0.14284E-24
  417   2210.9702    0.55532E-25
  418   2189.9736    0.17237E-25
  419   2264.1614    0.57479E-24
  420   2275.2686    0.14284E-24
  421   2264.1216    0.57480E-24
  422   2275.2690    0.14284E-24
  423   2210.9702    0.55532E-25
  424   2189.9736    0.17237E-25
  425    805.5581    0.17696E-23
  426    801.5997    0.17645E-23
  427    805.4772    0.17702E-23
  428    801.5185    0.17652E-23
  429    398.6389    0.23758E-11
  430    788.2542    0.27877E-24
  431    805.5581    0.17696E-23
  432    801.5997    0.17645E-23
  433    805.4772    0.17702E-23
  434    801.5185    0.17652E-23
  435    398.6389    0.23758E-11
  436    788.2542    0.27877E-24
  437    455.9264    0.16446E-22
  438      0.0000    0.10000E+31
  439    457.2453    0.87284E-18
  440      0.0000    0.10000E+31
  441    797.2531    0.27066E-24
  442      0.0000    0.10000E+31
  443    455.9264    0.16446E-22
  444      0.0000    0.10000E+31
  445    457.2453    0.87284E-18
  446      0.0000    0.10000E+31
  447    797.2531    0.27066E-24
  448      0.0000    0.10000E+31
  449   2621.3000    0.13795E-25
  450    523.8593    0.85123E-24
  451    977.6506    0.23982E-24
  452  -1345.4052    0.83910E-25
  453   1354.3685    0.79620E-25
  454    977.8016    0.23951E-24
  455   1354.3628    0.80206E-25
  456    977.8016    0.23951E-24
  457   1354.3628    0.80206E-25
  203    122.1185    0.11821E-21
  204   1304.7513    0.29461E-25
  205   1303.0800    0.29495E-25
  206   1307.4063    0.32344E-25
  207   1307.4063    0.32344E-25
  458      0.0000    0.10000E+31
    6    173.3000    0.56017E-24
   12    173.3000    0.56017E-24
   6
   401  0.15095083E-01     0   450     1     0     0     0
   401  0.32231107E+00     0   451     1     0     0     0
   401  0.15208864E-03     0   452     1     0     0     0
   401  0.59845801E-02     0   453     1     0     0     0
   401  0.64206272E+00     0   456     2     0     0     0
   401  0.14394394E-01     0   457     2     0     0     0
   6
   402  0.14038359E-01     0   450     2     0     0     0
   402  0.32350594E+00     0   451     2     0     0     0
   402  0.91427428E-04     0   452     2     0     0     0
   402  0.49827015E-02     0   453     2     0     0     0
   402  0.64939016E+00     0   454     1     0     0     0
   402  0.79914480E-02     0   455     1     0     0     0
   6
   403  0.15095173E-01     0   450     3     0     0     0
   403  0.32231128E+00     0   451     3     0     0     0
   403  0.15208739E-03     0   452     3     0     0     0
   403  0.59845280E-02     0   453     3     0     0     0
   403  0.64206260E+00     0   456     4     0     0     0
   403  0.14394250E-01     0   457     4     0     0     0
   6
   404  0.14038423E-01     0   450     4     0     0     0
   404  0.32350573E+00     0   451     4     0     0     0
   404  0.91426518E-04     0   452     4     0     0     0
   404  0.49826503E-02     0   453     4     0     0     0
   404  0.64939040E+00     0   454     3     0     0     0
   404  0.79913791E-02     0   455     3     0     0     0
   7
   405  0.16082307E-01     0   450     5     0     0     0
   405  0.16630185E+00     0   451     5     0     0     0
   405  0.40905047E-01     0   452     5     0     0     0
   405  0.34439016E-01     0   453     5     0     0     0
   405  0.32026681E+00     0   456     6     0     0     0
   405  0.27889255E+00     0   457     6     0     0     0
   405  0.14311236E+00     0   199   406     0     0     0
   6
   406  0.20761611E+00     0   450     6     0     0     0
   406  0.41375514E-01     0   451     6     0     0     0
   406  0.20179823E+00     0   452     6     0     0     0
   406  0.13592491E+00     0   453     6     0     0     0
   406  0.87532118E-01     0   454     5     0     0     0
   406  0.32575309E+00     0   455     5     0     0     0
   6
   407  0.15095083E-01     0   450     7     0     0     0
   407  0.32231107E+00     0   451     7     0     0     0
   407  0.15208864E-03     0   452     7     0     0     0
   407  0.59845801E-02     0   453     7     0     0     0
   407  0.64206272E+00     0   454     8     0     0     0
   407  0.14394394E-01     0   455     8     0     0     0
   6
   408  0.14038359E-01     0   450     8     0     0     0
   408  0.32350594E+00     0   451     8     0     0     0
   408  0.91427428E-04     0   452     8     0     0     0
   408  0.49827015E-02     0   453     8     0     0     0
   408  0.64939016E+00     0   456     7     0     0     0
   408  0.79914480E-02     0   457     7     0     0     0
   6
   409  0.15095173E-01     0   450     9     0     0     0
   409  0.32231128E+00     0   451     9     0     0     0
   409  0.15208739E-03     0   452     9     0     0     0
   409  0.59845280E-02     0   453     9     0     0     0
   409  0.64206260E+00     0   454    10     0     0     0
   409  0.14394250E-01     0   455    10     0     0     0
   6
   410  0.14038423E-01     0   450    10     0     0     0
   410  0.32350573E+00     0   451    10     0     0     0
   410  0.91426518E-04     0   452    10     0     0     0
   410  0.49826503E-02     0   453    10     0     0     0
   410  0.64939040E+00     0   456     9     0     0     0
   410  0.79913791E-02     0   457     9     0     0     0
   7
   411  0.16082307E-01     0   450    11     0     0     0
   411  0.16630185E+00     0   451    11     0     0     0
   411  0.40905047E-01     0   452    11     0     0     0
   411  0.34439016E-01     0   453    11     0     0     0
   411  0.32026681E+00     0   454    12     0     0     0
   411  0.27889255E+00     0   455    12     0     0     0
   411  0.14311236E+00     0   198   412     0     0     0
   6
   412  0.20761611E+00     0   450    12     0     0     0
   412  0.41375514E-01     0   451    12     0     0     0
   412  0.20179823E+00     0   452    12     0     0     0
   412  0.13592491E+00     0   453    12     0     0     0
   412  0.87532118E-01     0   456    11     0     0     0
   412  0.32575309E+00     0   457    11     0     0     0
   4
   413  0.99912411E+00     0   450     1     0     0     0
   413  0.70596463E-04     0   451     1     0     0     0
   413  0.11864396E-03     0   452     1     0     0     0
   413  0.68665529E-03     0   453     1     0     0     0
   4
   414  0.99911588E+00     0   450     2     0     0     0
   414  0.70833325E-04     0   451     2     0     0     0
   414  0.11977577E-03     0   452     2     0     0     0
   414  0.69335842E-03     0   453     2     0     0     0
   4
   415  0.99912405E+00     0   450     3     0     0     0
   415  0.70595604E-04     0   451     3     0     0     0
   415  0.11863989E-03     0   452     3     0     0     0
   415  0.68663131E-03     0   453     3     0     0     0
   4
   416  0.99911588E+00     0   450     4     0     0     0
   416  0.70833325E-04     0   451     4     0     0     0
   416  0.11977570E-03     0   452     4     0     0     0
   416  0.69335802E-03     0   453     4     0     0     0
   7
   417  0.75132445E-01     0   450     5     0     0     0
   417  0.37680395E-01     0   451     5     0     0     0
   417  0.12692995E+00     0   452     5     0     0     0
   417  0.14268635E+00     0   453     5     0     0     0
   417  0.72637796E-01     0   456     6     0     0     0
   417  0.44030032E+00     0   457     6     0     0     0
   417  0.10463274E+00     0   199   406     0     0     0
   8
   418  0.26421246E+00     0   454     5     0     0     0
   418  0.10306290E+00     0   455     5     0     0     0
   418  0.84923461E-01     0   200   406     0     0     0
   418  0.98012917E-01     0   203   406     0     0     0
   418  0.11311376E-01     0   450     6     0     0     0
   418  0.12749228E+00     0   451     6     0     0     0
   418  0.13810025E+00     0   452     6     0     0     0
   418  0.17288432E+00     0   453     6     0     0     0
   4
   419  0.99912411E+00     0   450     7     0     0     0
   419  0.70596463E-04     0   451     7     0     0     0
   419  0.11864396E-03     0   452     7     0     0     0
   419  0.68665529E-03     0   453     7     0     0     0
   4
   420  0.99911588E+00     0   450     8     0     0     0
   420  0.70833325E-04     0   451     8     0     0     0
   420  0.11977577E-03     0   452     8     0     0     0
   420  0.69335842E-03     0   453     8     0     0     0
   4
   421  0.99912405E+00     0   450     9     0     0     0
   421  0.70595604E-04     0   451     9     0     0     0
   421  0.11863989E-03     0   452     9     0     0     0
   421  0.68663131E-03     0   453     9     0     0     0
   4
   422  0.99911588E+00     0   450    10     0     0     0
   422  0.70833325E-04     0   451    10     0     0     0
   422  0.11977570E-03     0   452    10     0     0     0
   422  0.69335802E-03     0   453    10     0     0     0
   7
   423  0.75132445E-01     0   450    11     0     0     0
   423  0.37680395E-01     0   451    11     0     0     0
   423  0.12692995E+00     0   452    11     0     0     0
   423  0.14268635E+00     0   453    11     0     0     0
   423  0.72637796E-01     0   454    12     0     0     0
   423  0.44030032E+00     0   455    12     0     0     0
   423  0.10463274E+00     0   198   412     0     0     0
   8
   424  0.26421246E+00     0   456    11     0     0     0
   424  0.10306290E+00     0   457    11     0     0     0
   424  0.84923461E-01     0   200   412     0     0     0
   424  0.98012917E-01     0   203   412     0     0     0
   424  0.11311376E-01     0   450    12     0     0     0
   424  0.12749228E+00     0   451    12     0     0     0
   424  0.13810025E+00     0   452    12     0     0     0
   424  0.17288432E+00     0   453    12     0     0     0
   2
   425  0.90494233E+00     0   450   121     0     0     0
   425  0.95057845E-01     0   121   130     0     0     0
   3
   426  0.90563834E+00     0   450   122     0     0     0
   426  0.41241794E-04     0   435   121   126     0     0
   426  0.94320402E-01     0   129   121     0     0     0
   2
   427  0.90491694E+00     0   450   123     0     0     0
   427  0.95083185E-01     0   121   128     0     0     0
   3
   428  0.90561259E+00     0   450   124     0     0     0
   428  0.41222745E-04     0   435   123   126     0     0
   428  0.94346218E-01     0   127   121     0     0     0
   3
   429  0.83415946E-02     0   125   130     0     0     0
   429  0.49581939E+00     0   125   124     0     0     0
   429  0.49583894E+00     0   123   126     0     0     0
   2
   430  0.13362110E+00     0   450   126     0     0     0
   430  0.86637896E+00     0   198   429     0     0     0
   2
   431  0.90494233E+00     0   450   127     0     0     0
   431  0.95057845E-01     0   127   124     0     0     0
   3
   432  0.90563834E+00     0   450   128     0     0     0
   432  0.41241794E-04     0   429   127   132     0     0
   432  0.94320402E-01     0   123   127     0     0     0
   2
   433  0.90491694E+00     0   450   129     0     0     0
   433  0.95083185E-01     0   127   122     0     0     0
   3
   434  0.90561259E+00     0   450   130     0     0     0
   434  0.41222745E-04     0   429   129   132     0     0
   434  0.94346218E-01     0   121   127     0     0     0
   3
   435  0.83415946E-02     0   131   124     0     0     0
   435  0.49581939E+00     0   131   130     0     0     0
   435  0.49583894E+00     0   129   132     0     0     0
   2
   436  0.13362110E+00     0   450   132     0     0     0
   436  0.86637896E+00     0   199   435     0     0     0
   2
   437  0.50000000E+00     0   123   122     0     0     0
   437  0.50000006E+00     0   121   124     0     0     0
   0
   2
   439  0.40254411E+00     0   429   123   131     0     0
   439  0.59745586E+00     0   435   123   125     0     0
   0
   3
   441  0.13808762E+00     0   450   125     0     0     0
   441  0.43127558E+00     0   200   429     0     0     0
   441  0.43063685E+00     0   203   429     0     0     0
   0
   2
   443  0.50000000E+00     0   129   128     0     0     0
   443  0.50000006E+00     0   127   130     0     0     0
   0
   2
   445  0.40254411E+00     0   435   129   125     0     0
   445  0.59745586E+00     0   429   129   131     0     0
   0
   3
   447  0.13808762E+00     0   450   131     0     0     0
   447  0.43127558E+00     0   200   435     0     0     0
   447  0.43063685E+00     0   203   435     0     0     0
   0
  24
   449  0.18372415E-01     0   408     2     0     0     0
   449  0.18372415E-01     0   402     8     0     0     0
   449  0.18182479E-01     0   407     1     0     0     0
   449  0.18182479E-01     0   401     7     0     0     0
   449  0.34999613E-01     0   420     2     0     0     0
   449  0.34999613E-01     0   414     8     0     0     0
   449  0.37113622E-01     0   419     1     0     0     0
   449  0.37113622E-01     0   413     7     0     0     0
   449  0.18185304E-01     0   409     3     0     0     0
   449  0.18185304E-01     0   403     9     0     0     0
   449  0.37121266E-01     0   421     3     0     0     0
   449  0.37121266E-01     0   415     9     0     0     0
   449  0.18374935E-01     0   410     4     0     0     0
   449  0.18374935E-01     0   404    10     0     0     0
   449  0.34999300E-01     0   422     4     0     0     0
   449  0.34999300E-01     0   416    10     0     0     0
   449  0.58407679E-01     0   411     5     0     0     0
   449  0.58407679E-01     0   405    11     0     0     0
   449  0.48372708E-01     0   423     5     0     0     0
   449  0.48372708E-01     0   417    11     0     0     0
   449  0.11710773E+00     0   412     6     0     0     0
   449  0.11710773E+00     0   406    12     0     0     0
   449  0.58763009E-01     0   424     6     0     0     0
   449  0.58763009E-01     0   418    12     0     0     0
   6
   450  0.10116475E+00     0   437   127     0     0     0
   450  0.10116475E+00     0   443   121     0     0     0
   450  0.97536638E-01     0   439   129     0     0     0
   450  0.97536638E-01     0   445   123     0     0     0
   450  0.30129865E+00     0   429   131     0     0     0
   450  0.30129865E+00     0   435   125     0     0     0
  20
   451  0.50615205E-03     0   450   200     0     0     0
   451  0.65164166E-02     0   450   203     0     0     0
   451  0.76128148E-01     0   425   127     0     0     0
   451  0.76128148E-01     0   431   121     0     0     0
   451  0.76192796E-01     0   427   129     0     0     0
   451  0.76192796E-01     0   433   123     0     0     0
   451  0.52949086E-04     0   437   127     0     0     0
   451  0.52949086E-04     0   443   121     0     0     0
   451  0.52778691E-04     0   439   129     0     0     0
   451  0.52778691E-04     0   445   123     0     0     0
   451  0.19712433E-01     0   429   131     0     0     0
   451  0.19712433E-01     0   435   125     0     0     0
   451  0.80585144E-01     0   441   131     0     0     0
   451  0.80585144E-01     0   447   125     0     0     0
   451  0.77609971E-01     0   426   128     0     0     0
   451  0.77609971E-01     0   432   122     0     0     0
   451  0.77674530E-01     0   428   130     0     0     0
   451  0.77674530E-01     0   434   124     0     0     0
   451  0.88479981E-01     0   430   132     0     0     0
   451  0.88479981E-01     0   436   126     0     0     0
  25
   452  0.25633514E+00     0   454   199     0     0     0
   452  0.25633514E+00     0   456   198     0     0     0
   452  0.96690521E-01     0   450   200     0     0     0
   452  0.24423325E+00     0   451   200     0     0     0
   452  0.24128552E-04     0   450     5    11     0     0
   452  0.15460866E-01     0   450   203     0     0     0
   452  0.47610183E-02     0   451   203     0     0     0
   452  0.31205585E-04     0   425   127     0     0     0
   452  0.31205585E-04     0   431   121     0     0     0
   452  0.31212592E-04     0   427   129     0     0     0
   452  0.31212592E-04     0   433   123     0     0     0
   452  0.86711188E-04     0   437   127     0     0     0
   452  0.86711188E-04     0   443   121     0     0     0
   452  0.86580883E-04     0   439   129     0     0     0
   452  0.86580883E-04     0   445   123     0     0     0
   452  0.40790930E-01     0   429   131     0     0     0
   452  0.40790930E-01     0   435   125     0     0     0
   452  0.21586321E-01     0   441   131     0     0     0
   452  0.21586321E-01     0   447   125     0     0     0
   452  0.15381824E-03     0   426   128     0     0     0
   452  0.15381824E-03     0   432   122     0     0     0
   452  0.15385255E-03     0   428   130     0     0     0
   452  0.15385255E-03     0   434   124     0     0     0
   452  0.15945955E-03     0   430   132     0     0     0
   452  0.15945955E-03     0   436   126     0     0     0
  25
   453  0.25339222E+00     0   454   199     0     0     0
   453  0.25339222E+00     0   456   198     0     0     0
   453  0.15167018E-01     0   450   200     0     0     0
   453  0.57175574E-02     0   451   200     0     0     0
   453  0.22672119E-04     0   450     5    11     0     0
   453  0.88306785E-01     0   450   203     0     0     0
   453  0.22430357E+00     0   451   203     0     0     0
   453  0.26984562E-02     0   425   127     0     0     0
   453  0.26984562E-02     0   431   121     0     0     0
   453  0.26990492E-02     0   427   129     0     0     0
   453  0.26990492E-02     0   433   123     0     0     0
   453  0.48810017E-03     0   437   127     0     0     0
   453  0.48810017E-03     0   443   121     0     0     0
   453  0.48737752E-03     0   439   129     0     0     0
   453  0.48737752E-03     0   445   123     0     0     0
   453  0.34393016E-01     0   429   131     0     0     0
   453  0.34393016E-01     0   435   125     0     0     0
   453  0.24872545E-01     0   441   131     0     0     0
   453  0.24872545E-01     0   447   125     0     0     0
   453  0.46804408E-02     0   426   128     0     0     0
   453  0.46804408E-02     0   432   122     0     0     0
   453  0.46814634E-02     0   428   130     0     0     0
   453  0.46814634E-02     0   434   124     0     0     0
   453  0.48485813E-02     0   430   132     0     0     0
   453  0.48485813E-02     0   436   126     0     0     0
   8
   454  0.69634453E-02     0   450   198     0     0     0
   454  0.15811372E+00     0   426   127     0     0     0
   454  0.15824510E+00     0   428   129     0     0     0
   454  0.18132299E+00     0   430   131     0     0     0
   454  0.14951782E+00     0   431   122     0     0     0
   454  0.14964470E+00     0   433   124     0     0     0
   454  0.38965587E-01     0   435   126     0     0     0
   454  0.15722673E+00     0   447   126     0     0     0
  11
   455  0.10270533E+00     0   450   198     0     0     0
   455  0.25685054E+00     0   451   198     0     0     0
   455  0.53641587E-02     0   426   127     0     0     0
   455  0.53653307E-02     0   428   129     0     0     0
   455  0.46246003E-01     0   430   131     0     0     0
   455  0.95193218E-02     0   431   122     0     0     0
   455  0.95214145E-02     0   433   124     0     0     0
   455  0.67066409E-01     0   435   126     0     0     0
   455  0.15257691E-01     0   447   126     0     0     0
   455  0.25003666E+00     0   454   200     0     0     0
   455  0.23206724E+00     0   454   203     0     0     0
   8
   456  0.69634453E-02     0   450   199     0     0     0
   456  0.15811372E+00     0   432   121     0     0     0
   456  0.15824510E+00     0   434   123     0     0     0
   456  0.18132299E+00     0   436   125     0     0     0
   456  0.14951782E+00     0   425   128     0     0     0
   456  0.14964470E+00     0   427   130     0     0     0
   456  0.38965587E-01     0   429   132     0     0     0
   456  0.15722673E+00     0   441   132     0     0     0
  11
   457  0.10270533E+00     0   450   199     0     0     0
   457  0.25685054E+00     0   451   199     0     0     0
   457  0.53641587E-02     0   432   121     0     0     0
   457  0.53653307E-02     0   434   123     0     0     0
   457  0.46246003E-01     0   436   125     0     0     0
   457  0.95193218E-02     0   425   128     0     0     0
   457  0.95214145E-02     0   427   130     0     0     0
   457  0.67066409E-01     0   429   132     0     0     0
   457  0.15257691E-01     0   441   132     0     0     0
   457  0.25003666E+00     0   456   200     0     0     0
   457  0.23206724E+00     0   456   203     0     0     0
  28
   203  0.16218409E-03     0   123   129     0     0     0
   203  0.46393212E-01     0   125   131     0     0     0
   203  0.19462523E-02     0     3     9     0     0     0
   203  0.76311380E+00     0     5    11     0     0     0
   203  0.37609518E-01     0     4    10     0     0     0
   203  0.17286935E-02     0    59    59     0     0     0
   203  0.34044392E-01     0    13    13     0     0     0
   203  0.58347094E-02     0   198   121   128     0     0
   203  0.58347094E-02     0   198   123   130     0     0
   203  0.58347094E-02     0   198   125   132     0     0
   203  0.17504128E-01     0   198     8     1     0     0
   203  0.17504128E-01     0   198    10     3     0     0
   203  0.58347094E-02     0   199   127   122     0     0
   203  0.58347094E-02     0   199   129   124     0     0
   203  0.58347094E-02     0   199   131   126     0     0
   203  0.17504128E-01     0   199     2     7     0     0
   203  0.17504128E-01     0   199     4     9     0     0
   203  0.68231532E-03     0   200   122   128     0     0
   203  0.68231532E-03     0   200   124   130     0     0
   203  0.68231532E-03     0   200   126   132     0     0
   203  0.34340247E-03     0   200   121   127     0     0
   203  0.34340247E-03     0   200   123   129     0     0
   203  0.34340247E-03     0   200   125   131     0     0
   203  0.11764676E-02     0   200     2     8     0     0
   203  0.11764676E-02     0   200     4    10     0     0
   203  0.15155802E-02     0   200     1     7     0     0
   203  0.15155802E-02     0   200     3     9     0     0
   203  0.15155802E-02     0   200     5    11     0     0
   9
   204  0.24645857E-03     0   123   129     0     0     0
   204  0.70588730E-01     0   125   131     0     0     0
   204  0.28831619E-02     0     3     9     0     0     0
   204  0.83381093E+00     0     5    11     0     0     0
   204  0.50913747E-02     0     6    12     0     0     0
   204  0.47386788E-04     0   450   450     0     0     0
   204  0.59656706E-02     0   429   435     0     0     0
   204  0.40683240E-01     0   429   447     0     0     0
   204  0.40683240E-01     0   441   435     0     0     0
  10
   205  0.24643817E-03     0   123   129     0     0     0
   205  0.70583411E-01     0   125   131     0     0     0
   205  0.28829526E-02     0     3     9     0     0     0
   205  0.83389395E+00     0     5    11     0     0     0
   205  0.53007933E-02     0     6    12     0     0     0
   205  0.15913369E-04     0    13    13     0     0     0
   205  0.14284714E-03     0   450   450     0     0     0
   205  0.59003169E-02     0   429   435     0     0     0
   205  0.40516779E-01     0   429   447     0     0     0
   205  0.40516779E-01     0   441   435     0     0     0
   5
   206  0.27113402E-03     0   124   129     0     0     0
   206  0.77656657E-01     0   126   131     0     0     0
   206  0.29217999E-02     0     4     9     0     0     0
   206  0.82041115E+00     0     6    11     0     0     0
   206  0.98739289E-01     0   435   430     0     0     0
   5
   207  0.27113402E-03     0   130   123     0     0     0
   207  0.77656657E-01     0   132   125     0     0     0
   207  0.29217999E-02     0    10     3     0     0     0
   207  0.82041115E+00     0    12     5     0     0     0
   207  0.98739289E-01     0   429   436     0     0     0
   0
   5
     6  0.33333334E+00   100     2     7     5     0     0
     6  0.33333334E+00   100     4     9     5     0     0
     6  0.11111111E+00   100   122   127     5     0     0
     6  0.11111111E+00   100   124   129     5     0     0
     6  0.11111111E+00   100   126   131     5     0     0
   5
    12  0.33333334E+00   100     8     1    11     0     0
    12  0.33333334E+00   100    10     3    11     0     0
    12  0.11111111E+00   100   128   121    11     0     0
    12  0.11111111E+00   100   130   123    11     0     0
    12  0.11111111E+00   100   132   125    11     0     0
     24.12500000     -0.04183641
      0.99908006     -0.00317387      0.03936927     -0.01671088
     -0.00977016     -0.98714286      0.12784581     -0.09544129
      0.01592864     -0.02324831     -0.70633042     -0.70732129
     -0.03860166      0.15810908      0.69512796     -0.70022041
     -0.99081111      0.13525300     -0.13525300     -0.99081111
     -0.98345661      0.18114388     -0.18114388     -0.98345661
     -1.32253814     -0.38894382     -1.44180965
  -2031.72998047   6780.79980469  -2403.92993164
   1343.67004395
    F
  0.00000000E+00  0.00000000E+00  0.00000000E+00  0.46970300E-01 -0.49750199E-23  0.00000000E+00  0.00000000E+00  0.00000000E+00 -0.29101899E-22 -0.46970300E-01  0.49750199E-23 -0.00000000E+00  0.00000000E+00  0.00000000E+00  0.00000000E+00  0.00000000E+00  0.00000000E+00  0.13271500E-06 -0.00000000E+00 -0.00000000E+00  0.29101899E-22 -0.00000000E+00 -0.00000000E+00 -0.13271500E-06  0.00000000E+00  0.00000000E+00  0.00000000E+00
 -0.43256799E-25  0.00000000E+00  0.00000000E+00  0.00000000E+00 -0.94709704E-24  0.00000000E+00  0.00000000E+00  0.00000000E+00 -0.38137301E-22  0.19726600E-09 -0.80480999E-37  0.00000000E+00  0.17015603E-38  0.43190900E-08  0.00000000E+00  0.00000000E+00  0.00000000E+00  0.17392000E-06  0.00000000E+00  0.00000000E+00  0.00000000E+00  0.00000000E+00  0.00000000E+00  0.00000000E+00  0.00000000E+00  0.00000000E+00  0.00000000E+00
  0.00000000E+00  0.00000000E+00  0.00000000E+00  0.00000000E+00  0.00000000E+00  0.00000000E+00  0.00000000E+00  0.00000000E+00  0.00000000E+00  0.00000000E+00  0.00000000E+00  0.00000000E+00  0.00000000E+00  0.00000000E+00  0.00000000E+00  0.00000000E+00  0.00000000E+00  0.00000000E+00  0.00000000E+00  0.00000000E+00  0.00000000E+00  0.00000000E+00  0.00000000E+00  0.00000000E+00  0.00000000E+00  0.00000000E+00  0.00000000E+00
