  65
  401   1834.2764    0.40227E-25
  402   1832.5381    0.40058E-25
  403   1834.2465    0.40228E-25
  404   1832.5087    0.40060E-25
  405   1626.0144    0.34261E-25
  406   1440.2534    0.51890E-25
  407   1834.2764    0.40227E-25
  408   1832.5381    0.40058E-25
  409   1834.2465    0.40228E-25
  410   1832.5087    0.40060E-25
  411   1626.0144    0.34261E-25
  412   1440.2534    0.51890E-25
  413   1750.2334    0.73805E-24
  414   1758.1550    0.18351E-24
  415   1750.1733    0.73808E-24
  416   1758.1555    0.18351E-24
  417   1677.5729    0.33229E-25
  418   1677.8164    0.22035E-25
  419   1750.2334    0.73805E-24
  420   1758.1550    0.18351E-24
  421   1750.1733    0.73808E-24
  422   1758.1555    0.18351E-24
  423   1677.5729    0.33229E-25
  424   1677.8164    0.22035E-25
  425    611.8572    0.22304E-23
  426    606.6263    0.22259E-23
  427    611.7994    0.22311E-23
  428    606.5681    0.22267E-23
  429    229.8958    0.77890E-12
  430    585.2274    0.15509E-24
  431    611.8572    0.22304E-23
  432    606.6263    0.22259E-23
  433    611.7994    0.22311E-23
  434    606.5681    0.22267E-23
  435    229.8958    0.77890E-12
  436    585.2274    0.15509E-24
  437    345.6723    0.21531E-22
  438      0.0000    0.10000E+31
  439    346.6008    0.19092E-19
  440      0.0000    0.10000E+31
  441    605.1235    0.15462E-24
  442      0.0000    0.10000E+31
  443    345.6723    0.21531E-22
  444      0.0000    0.10000E+31
  445    346.6008    0.19092E-19
  446      0.0000    0.10000E+31
  447    605.1235    0.15462E-24
  448      0.0000    0.10000E+31
  449   2015.8700    0.17582E-25
  450    390.3158    0.66097E-24
  451    731.5137    0.31486E-24
  452  -1046.2998    0.92418E-25
  453   1056.2655    0.87543E-25
  454    731.6566    0.31449E-24
  455   1056.4120    0.88433E-25
  456    731.6566    0.31449E-24
  457   1056.4120    0.88433E-25
  203    121.0454    0.11850E-21
  204    817.8860    0.19896E-25
  205    816.9900    0.19906E-25
  206    822.8038    0.22110E-25
  207    822.8038    0.22110E-25
  458      0.0000    0.10000E+31
    6    173.3000    0.56017E-24
   12    173.3000    0.56017E-24
   6
   401  0.15166046E-01     0   450     1     0     0     0
   401  0.32064965E+00     0   451     1     0     0     0
   401  0.25768197E-03     0   452     1     0     0     0
   401  0.76447208E-02     0   453     1     0     0     0
   401  0.63732725E+00     0   456     2     0     0     0
   401  0.18954687E-01     0   457     2     0     0     0
   6
   402  0.13571274E-01     0   450     2     0     0     0
   402  0.32219967E+00     0   451     2     0     0     0
   402  0.15469542E-03     0   452     2     0     0     0
   402  0.62689763E-02     0   453     2     0     0     0
   402  0.64819181E+00     0   454     1     0     0     0
   402  0.96135717E-02     0   455     1     0     0     0
   6
   403  0.15166206E-01     0   450     3     0     0     0
   403  0.32065010E+00     0   451     3     0     0     0
   403  0.25767743E-03     0   452     3     0     0     0
   403  0.76445783E-02     0   453     3     0     0     0
   403  0.63732708E+00     0   456     4     0     0     0
   403  0.18954288E-01     0   457     4     0     0     0
   6
   404  0.13571394E-01     0   450     4     0     0     0
   404  0.32219940E+00     0   451     4     0     0     0
   404  0.15469224E-03     0   452     4     0     0     0
   404  0.62688426E-02     0   453     4     0     0     0
   404  0.64819223E+00     0   454     3     0     0     0
   404  0.96133901E-02     0   455     3     0     0     0
   7
   405  0.37862208E-01     0   450     5     0     0     0
   405  0.17572322E+00     0   451     5     0     0     0
   405  0.10675576E+00     0   452     5     0     0     0
   405  0.82350045E-01     0   453     5     0     0     0
   405  0.32421511E+00     0   456     6     0     0     0
   405  0.20651740E+00     0   457     6     0     0     0
   405  0.66576302E-01     0   199   406     0     0     0
   6
   406  0.19699417E+00     0   450     6     0     0     0
   406  0.63911520E-01     0   451     6     0     0     0
   406  0.20080419E+00     0   452     6     0     0     0
   406  0.10052305E+00     0   453     6     0     0     0
   406  0.14123034E+00     0   454     5     0     0     0
   406  0.29653665E+00     0   455     5     0     0     0
   6
   407  0.15166046E-01     0   450     7     0     0     0
   407  0.32064965E+00     0   451     7     0     0     0
   407  0.25768197E-03     0   452     7     0     0     0
   407  0.76447208E-02     0   453     7     0     0     0
   407  0.63732725E+00     0   454     8     0     0     0
   407  0.18954687E-01     0   455     8     0     0     0
   6
   408  0.13571274E-01     0   450     8     0     0     0
   408  0.32219967E+00     0   451     8     0     0     0
   408  0.15469542E-03     0   452     8     0     0     0
   408  0.62689763E-02     0   453     8     0     0     0
   408  0.64819181E+00     0   456     7     0     0     0
   408  0.96135717E-02     0   457     7     0     0     0
   6
   409  0.15166206E-01     0   450     9     0     0     0
   409  0.32065010E+00     0   451     9     0     0     0
   409  0.25767743E-03     0   452     9     0     0     0
   409  0.76445783E-02     0   453     9     0     0     0
   409  0.63732708E+00     0   454    10     0     0     0
   409  0.18954288E-01     0   455    10     0     0     0
   6
   410  0.13571394E-01     0   450    10     0     0     0
   410  0.32219940E+00     0   451    10     0     0     0
   410  0.15469224E-03     0   452    10     0     0     0
   410  0.62688426E-02     0   453    10     0     0     0
   410  0.64819223E+00     0   456     9     0     0     0
   410  0.96133901E-02     0   457     9     0     0     0
   7
   411  0.37862208E-01     0   450    11     0     0     0
   411  0.17572322E+00     0   451    11     0     0     0
   411  0.10675576E+00     0   452    11     0     0     0
   411  0.82350045E-01     0   453    11     0     0     0
   411  0.32421511E+00     0   454    12     0     0     0
   411  0.20651740E+00     0   455    12     0     0     0
   411  0.66576302E-01     0   198   412     0     0     0
   6
   412  0.19699417E+00     0   450    12     0     0     0
   412  0.63911520E-01     0   451    12     0     0     0
   412  0.20080419E+00     0   452    12     0     0     0
   412  0.10052305E+00     0   453    12     0     0     0
   412  0.14123034E+00     0   456    11     0     0     0
   412  0.29653665E+00     0   457    11     0     0     0
   4
   413  0.99863380E+00     0   450     1     0     0     0
   413  0.15537599E-03     0   451     1     0     0     0
   413  0.20260285E-03     0   452     1     0     0     0
   413  0.10082268E-02     0   453     1     0     0     0
   4
   414  0.99862206E+00     0   450     2     0     0     0
   414  0.15581941E-03     0   451     2     0     0     0
   414  0.20443906E-03     0   452     2     0     0     0
   414  0.10176693E-02     0   453     2     0     0     0
   4
   415  0.99863386E+00     0   450     3     0     0     0
   415  0.15537259E-03     0   451     3     0     0     0
   415  0.20258884E-03     0   452     3     0     0     0
   415  0.10081548E-02     0   453     3     0     0     0
   4
   416  0.99862206E+00     0   450     4     0     0     0
   416  0.15581938E-03     0   451     4     0     0     0
   416  0.20443888E-03     0   452     4     0     0     0
   416  0.10176684E-02     0   453     4     0     0     0
   7
   417  0.18615521E-01     0   450     5     0     0     0
   417  0.62100265E-01     0   451     5     0     0     0
   417  0.12525842E+00     0   452     5     0     0     0
   417  0.14057428E+00     0   453     5     0     0     0
   417  0.11191643E+00     0   456     6     0     0     0
   417  0.42766798E+00     0   457     6     0     0     0
   417  0.11386719E+00     0   199   406     0     0     0
   8
   418  0.24417265E+00     0   454     5     0     0     0
   418  0.19042432E+00     0   455     5     0     0     0
   418  0.72860129E-01     0   200   406     0     0     0
   418  0.67279458E-01     0   203   406     0     0     0
   418  0.14816161E-01     0   450     6     0     0     0
   418  0.11202761E+00     0   451     6     0     0     0
   418  0.12165507E+00     0   452     6     0     0     0
   418  0.17676456E+00     0   453     6     0     0     0
   4
   419  0.99863380E+00     0   450     7     0     0     0
   419  0.15537599E-03     0   451     7     0     0     0
   419  0.20260285E-03     0   452     7     0     0     0
   419  0.10082268E-02     0   453     7     0     0     0
   4
   420  0.99862206E+00     0   450     8     0     0     0
   420  0.15581941E-03     0   451     8     0     0     0
   420  0.20443906E-03     0   452     8     0     0     0
   420  0.10176693E-02     0   453     8     0     0     0
   4
   421  0.99863386E+00     0   450     9     0     0     0
   421  0.15537259E-03     0   451     9     0     0     0
   421  0.20258884E-03     0   452     9     0     0     0
   421  0.10081548E-02     0   453     9     0     0     0
   4
   422  0.99862206E+00     0   450    10     0     0     0
   422  0.15581938E-03     0   451    10     0     0     0
   422  0.20443888E-03     0   452    10     0     0     0
   422  0.10176684E-02     0   453    10     0     0     0
   7
   423  0.18615521E-01     0   450    11     0     0     0
   423  0.62100265E-01     0   451    11     0     0     0
   423  0.12525842E+00     0   452    11     0     0     0
   423  0.14057428E+00     0   453    11     0     0     0
   423  0.11191643E+00     0   454    12     0     0     0
   423  0.42766798E+00     0   455    12     0     0     0
   423  0.11386719E+00     0   198   412     0     0     0
   8
   424  0.24417265E+00     0   456    11     0     0     0
   424  0.19042432E+00     0   457    11     0     0     0
   424  0.72860129E-01     0   200   412     0     0     0
   424  0.67279458E-01     0   203   412     0     0     0
   424  0.14816161E-01     0   450    12     0     0     0
   424  0.11202761E+00     0   451    12     0     0     0
   424  0.12165507E+00     0   452    12     0     0     0
   424  0.17676456E+00     0   453    12     0     0     0
   4
   425  0.90833455E+00     0   450   121     0     0     0
   425  0.23381981E-04     0   429   121   131     0     0
   425  0.61639119E-04     0   435   121   125     0     0
   425  0.91580413E-01     0   121   130     0     0     0
   5
   426  0.90903103E+00     0   450   122     0     0     0
   426  0.18919434E-04     0   429   122   131     0     0
   426  0.52968950E-04     0   435   122   125     0     0
   426  0.27962352E-03     0   435   121   126     0     0
   426  0.90617411E-01     0   129   121     0     0     0
   4
   427  0.90831310E+00     0   450   123     0     0     0
   427  0.23367813E-04     0   429   123   131     0     0
   427  0.61613639E-04     0   435   123   125     0     0
   427  0.91602013E-01     0   121   128     0     0     0
   5
   428  0.90900886E+00     0   450   124     0     0     0
   428  0.18907846E-04     0   429   124   131     0     0
   428  0.52947034E-04     0   435   124   125     0     0
   428  0.27956825E-03     0   435   123   126     0     0
   428  0.90639777E-01     0   127   121     0     0     0
   3
   429  0.28375931E-01     0   125   130     0     0     0
   429  0.48578313E+00     0   125   124     0     0     0
   429  0.48584095E+00     0   123   126     0     0     0
   2
   430  0.54841466E-01     0   450   126     0     0     0
   430  0.94515860E+00     0   198   429     0     0     0
   4
   431  0.90833455E+00     0   450   127     0     0     0
   431  0.23381981E-04     0   435   127   125     0     0
   431  0.61639119E-04     0   429   127   131     0     0
   431  0.91580413E-01     0   127   124     0     0     0
   5
   432  0.90903103E+00     0   450   128     0     0     0
   432  0.18919434E-04     0   435   128   125     0     0
   432  0.52968950E-04     0   429   128   131     0     0
   432  0.27962352E-03     0   429   127   132     0     0
   432  0.90617411E-01     0   123   127     0     0     0
   4
   433  0.90831310E+00     0   450   129     0     0     0
   433  0.23367813E-04     0   435   129   125     0     0
   433  0.61613639E-04     0   429   129   131     0     0
   433  0.91602013E-01     0   127   122     0     0     0
   5
   434  0.90900886E+00     0   450   130     0     0     0
   434  0.18907846E-04     0   435   130   125     0     0
   434  0.52947034E-04     0   429   130   131     0     0
   434  0.27956825E-03     0   429   129   132     0     0
   434  0.90639777E-01     0   121   127     0     0     0
   3
   435  0.28375931E-01     0   131   124     0     0     0
   435  0.48578313E+00     0   131   130     0     0     0
   435  0.48584095E+00     0   129   132     0     0     0
   2
   436  0.54841466E-01     0   450   132     0     0     0
   436  0.94515860E+00     0   199   435     0     0     0
   4
   437  0.39415952E-03     0   429   121   131     0     0
   437  0.68288186E-03     0   435   121   125     0     0
   437  0.49946141E+00     0   123   122     0     0     0
   437  0.49946150E+00     0   121   124     0     0     0
   0
   2
   439  0.36700952E+00     0   429   123   131     0     0
   439  0.63299036E+00     0   435   123   125     0     0
   0
   3
   441  0.68589829E-01     0   450   125     0     0     0
   441  0.50259465E+00     0   200   429     0     0     0
   441  0.42881551E+00     0   203   429     0     0     0
   0
   4
   443  0.39415952E-03     0   435   127   125     0     0
   443  0.68288186E-03     0   429   127   131     0     0
   443  0.49946141E+00     0   129   128     0     0     0
   443  0.49946150E+00     0   127   130     0     0     0
   0
   2
   445  0.36700952E+00     0   435   129   125     0     0
   445  0.63299036E+00     0   429   129   131     0     0
   0
   3
   447  0.68589829E-01     0   450   131     0     0     0
   447  0.50259465E+00     0   200   435     0     0     0
   447  0.42881551E+00     0   203   435     0     0     0
   0
  24
   449  0.17432915E-01     0   408     2     0     0     0
   449  0.17432915E-01     0   402     8     0     0     0
   449  0.17119342E-01     0   407     1     0     0     0
   449  0.17119342E-01     0   401     7     0     0     0
   449  0.33129923E-01     0   420     2     0     0     0
   449  0.33129923E-01     0   414     8     0     0     0
   449  0.35050303E-01     0   419     1     0     0     0
   449  0.35050303E-01     0   413     7     0     0     0
   449  0.17124718E-01     0   409     3     0     0     0
   449  0.17124718E-01     0   403     9     0     0     0
   449  0.35065029E-01     0   421     3     0     0     0
   449  0.35065029E-01     0   415     9     0     0     0
   449  0.17437801E-01     0   410     4     0     0     0
   449  0.17437801E-01     0   404    10     0     0     0
   449  0.33129416E-01     0   422     4     0     0     0
   449  0.33129416E-01     0   416    10     0     0     0
   449  0.69598772E-01     0   411     5     0     0     0
   449  0.69598772E-01     0   405    11     0     0     0
   449  0.55545464E-01     0   423     5     0     0     0
   449  0.55545464E-01     0   417    11     0     0     0
   449  0.10503982E+00     0   412     6     0     0     0
   449  0.10503982E+00     0   406    12     0     0     0
   449  0.64326517E-01     0   424     6     0     0     0
   449  0.64326517E-01     0   418    12     0     0     0
   6
   450  0.46230767E-01     0   437   127     0     0     0
   450  0.46230767E-01     0   443   121     0     0     0
   450  0.44439550E-01     0   439   129     0     0     0
   450  0.44439550E-01     0   445   123     0     0     0
   450  0.40932974E+00     0   429   131     0     0     0
   450  0.40932974E+00     0   435   125     0     0     0
  20
   451  0.70109800E-03     0   450   200     0     0     0
   451  0.76844548E-02     0   450   203     0     0     0
   451  0.65230228E-01     0   425   127     0     0     0
   451  0.65230228E-01     0   431   121     0     0     0
   451  0.65287605E-01     0   427   129     0     0     0
   451  0.65287605E-01     0   433   123     0     0     0
   451  0.11041395E-03     0   437   127     0     0     0
   451  0.11041395E-03     0   443   121     0     0     0
   451  0.11007272E-03     0   439   129     0     0     0
   451  0.11007272E-03     0   445   123     0     0     0
   451  0.72252087E-01     0   429   131     0     0     0
   451  0.72252087E-01     0   435   125     0     0     0
   451  0.65488070E-01     0   441   131     0     0     0
   451  0.65488070E-01     0   447   125     0     0     0
   451  0.68279877E-01     0   426   128     0     0     0
   451  0.68279877E-01     0   432   122     0     0     0
   451  0.68337686E-01     0   428   130     0     0     0
   451  0.68337686E-01     0   434   124     0     0     0
   451  0.90711169E-01     0   430   132     0     0     0
   451  0.90711169E-01     0   436   126     0     0     0
  27
   452  0.21922933E+00     0   454   199     0     0     0
   452  0.21922933E+00     0   456   198     0     0     0
   452  0.79883471E-01     0   450   200     0     0     0
   452  0.20468032E+00     0   451   200     0     0     0
   452  0.17964543E-03     0   450     5    11     0     0
   452  0.17061437E-04     0   450   125   131     0     0
   452  0.14748072E-04     0   451     5    11     0     0
   452  0.14393983E-01     0   450   203     0     0     0
   452  0.51107607E-02     0   451   203     0     0     0
   452  0.49488553E-04     0   425   127     0     0     0
   452  0.49488553E-04     0   431   121     0     0     0
   452  0.49498263E-04     0   427   129     0     0     0
   452  0.49498263E-04     0   433   123     0     0     0
   452  0.13115282E-03     0   437   127     0     0     0
   452  0.13115282E-03     0   443   121     0     0     0
   452  0.13098000E-03     0   439   129     0     0     0
   452  0.13098000E-03     0   445   123     0     0     0
   452  0.83563276E-01     0   429   131     0     0     0
   452  0.83563276E-01     0   435   125     0     0     0
   452  0.43955933E-01     0   441   131     0     0     0
   452  0.43955933E-01     0   447   125     0     0     0
   452  0.24433114E-03     0   426   128     0     0     0
   452  0.24433114E-03     0   432   122     0     0     0
   452  0.24437869E-03     0   428   130     0     0     0
   452  0.24437869E-03     0   434   124     0     0     0
   452  0.26178110E-03     0   430   132     0     0     0
   452  0.26178110E-03     0   436   126     0     0     0
  27
   453  0.21932165E+00     0   454   199     0     0     0
   453  0.21932165E+00     0   456   198     0     0     0
   453  0.14389781E-01     0   450   200     0     0     0
   453  0.66228020E-02     0   451   200     0     0     0
   453  0.17301021E-03     0   450     5    11     0     0
   453  0.16498776E-04     0   450   125   131     0     0
   453  0.14568005E-04     0   451     5    11     0     0
   453  0.71932584E-01     0   450   203     0     0     0
   453  0.18594867E+00     0   451   203     0     0     0
   453  0.31635717E-02     0   425   127     0     0     0
   453  0.31635717E-02     0   431   121     0     0     0
   453  0.31641750E-02     0   427   129     0     0     0
   453  0.31641750E-02     0   433   123     0     0     0
   453  0.64056454E-03     0   437   127     0     0     0
   453  0.64056454E-03     0   443   121     0     0     0
   453  0.63973828E-03     0   439   129     0     0     0
   453  0.63973828E-03     0   445   123     0     0     0
   453  0.66669464E-01     0   429   131     0     0     0
   453  0.66669464E-01     0   435   125     0     0     0
   453  0.49250111E-01     0   441   131     0     0     0
   453  0.49250111E-01     0   447   125     0     0     0
   453  0.57342942E-02     0   426   128     0     0     0
   453  0.57342942E-02     0   432   122     0     0     0
   453  0.57353787E-02     0   428   130     0     0     0
   453  0.57353787E-02     0   434   124     0     0     0
   453  0.61321636E-02     0   430   132     0     0     0
   453  0.61321636E-02     0   436   126     0     0     0
   8
   454  0.82844039E-02     0   450   198     0     0     0
   454  0.14046241E+00     0   426   127     0     0     0
   454  0.14058115E+00     0   428   129     0     0     0
   454  0.18979853E+00     0   430   131     0     0     0
   454  0.12703888E+00     0   431   122     0     0     0
   454  0.12715054E+00     0   433   124     0     0     0
   454  0.14175364E+00     0   435   126     0     0     0
   454  0.12493055E+00     0   447   126     0     0     0
  12
   455  0.15397478E-04     0   450   131   126     0     0
   455  0.85324749E-01     0   450   198     0     0     0
   455  0.22324628E+00     0   451   198     0     0     0
   455  0.61646113E-02     0   426   127     0     0     0
   455  0.61657764E-02     0   428   129     0     0     0
   455  0.91383331E-01     0   430   131     0     0     0
   455  0.11864466E-01     0   431   122     0     0     0
   455  0.11866728E-01     0   433   124     0     0     0
   455  0.12451608E+00     0   435   126     0     0     0
   455  0.30084303E-01     0   447   126     0     0     0
   455  0.21480918E+00     0   454   200     0     0     0
   455  0.19455908E+00     0   454   203     0     0     0
   8
   456  0.82844039E-02     0   450   199     0     0     0
   456  0.14046241E+00     0   432   121     0     0     0
   456  0.14058115E+00     0   434   123     0     0     0
   456  0.18979853E+00     0   436   125     0     0     0
   456  0.12703888E+00     0   425   128     0     0     0
   456  0.12715054E+00     0   427   130     0     0     0
   456  0.14175364E+00     0   429   132     0     0     0
   456  0.12493055E+00     0   441   132     0     0     0
  12
   457  0.15397478E-04     0   450   125   132     0     0
   457  0.85324749E-01     0   450   199     0     0     0
   457  0.22324628E+00     0   451   199     0     0     0
   457  0.61646113E-02     0   432   121     0     0     0
   457  0.61657764E-02     0   434   123     0     0     0
   457  0.91383331E-01     0   436   125     0     0     0
   457  0.11864466E-01     0   425   128     0     0     0
   457  0.11866728E-01     0   427   130     0     0     0
   457  0.12451608E+00     0   429   132     0     0     0
   457  0.30084303E-01     0   441   132     0     0     0
   457  0.21480918E+00     0   456   200     0     0     0
   457  0.19455908E+00     0   456   203     0     0     0
  28
   203  0.16498214E-03     0   123   129     0     0     0
   203  0.47192540E-01     0   125   131     0     0     0
   203  0.19800889E-02     0     3     9     0     0     0
   203  0.77734393E+00     0     5    11     0     0     0
   203  0.37425905E-01     0     4    10     0     0     0
   203  0.16715352E-02     0    59    59     0     0     0
   203  0.33113752E-01     0    13    13     0     0     0
   203  0.51466255E-02     0   198   121   128     0     0
   203  0.51466255E-02     0   198   123   130     0     0
   203  0.51466255E-02     0   198   125   132     0     0
   203  0.15439877E-01     0   198     8     1     0     0
   203  0.15439877E-01     0   198    10     3     0     0
   203  0.51466255E-02     0   199   127   122     0     0
   203  0.51466255E-02     0   199   129   124     0     0
   203  0.51466255E-02     0   199   131   126     0     0
   203  0.15439877E-01     0   199     2     7     0     0
   203  0.15439877E-01     0   199     4     9     0     0
   203  0.57912350E-03     0   200   122   128     0     0
   203  0.57912350E-03     0   200   124   130     0     0
   203  0.57912350E-03     0   200   126   132     0     0
   203  0.29146703E-03     0   200   121   127     0     0
   203  0.29146703E-03     0   200   123   129     0     0
   203  0.29146703E-03     0   200   125   131     0     0
   203  0.99854136E-03     0   200     2     8     0     0
   203  0.99854136E-03     0   200     4    10     0     0
   203  0.12863673E-02     0   200     1     7     0     0
   203  0.12863673E-02     0   200     3     9     0     0
   203  0.12863673E-02     0   200     5    11     0     0
   6
   204  0.23320971E-03     0   123   129     0     0     0
   204  0.66792950E-01     0   125   131     0     0     0
   204  0.27387005E-02     0     3     9     0     0     0
   204  0.83643270E+00     0     5    11     0     0     0
   204  0.89925731E-03     0     6    12     0     0     0
   204  0.92903242E-01     0   429   435     0     0     0
   8
   205  0.23307491E-03     0   123   129     0     0     0
   205  0.66755600E-01     0   125   131     0     0     0
   205  0.27371433E-02     0     3     9     0     0     0
   205  0.83612525E+00     0     5    11     0     0     0
   205  0.10221658E-02     0     6    12     0     0     0
   205  0.19304349E-04     0    13    13     0     0     0
   205  0.47673064E-04     0   450   450     0     0     0
   205  0.93059927E-01     0   429   435     0     0     0
   5
   206  0.26073074E-03     0   124   129     0     0     0
   206  0.74676588E-01     0   126   131     0     0     0
   206  0.28095876E-02     0     4     9     0     0     0
   206  0.78386801E+00     0     6    11     0     0     0
   206  0.13838515E+00     0   435   430     0     0     0
   5
   207  0.26073074E-03     0   130   123     0     0     0
   207  0.74676588E-01     0   132   125     0     0     0
   207  0.28095876E-02     0    10     3     0     0     0
   207  0.78386801E+00     0    12     5     0     0     0
   207  0.13838515E+00     0   429   436     0     0     0
   0
   5
     6  0.33333334E+00   100     2     7     5     0     0
     6  0.33333334E+00   100     4     9     5     0     0
     6  0.11111111E+00   100   122   127     5     0     0
     6  0.11111111E+00   100   124   129     5     0     0
     6  0.11111111E+00   100   126   131     5     0     0
   5
    12  0.33333334E+00   100     8     1    11     0     0
    12  0.33333334E+00   100    10     3    11     0     0
    12  0.11111111E+00   100   128   121    11     0     0
    12  0.11111111E+00   100   130   123    11     0     0
    12  0.11111111E+00   100   132   125    11     0     0
     36.06819916     -0.02832234
      0.99855047     -0.00483635      0.04981380     -0.01980007
     -0.01434116     -0.98285288      0.14957286     -0.10687682
      0.02103177     -0.03078565     -0.70578188     -0.70744717
     -0.04742197      0.18173948      0.69066483     -0.69835806
     -0.98844916      0.15155289     -0.15155289     -0.98844916
     -0.97725737      0.21205665     -0.21205665     -0.97725737
     -1.23345661     -0.72286874     -1.33365655
  -1536.20996094   9400.46972656  -3314.36010742
   1043.96997070
    F
  0.00000000E+00  0.00000000E+00  0.00000000E+00  0.47120102E-01  0.22020601E-24  0.00000000E+00  0.00000000E+00  0.00000000E+00  0.12863500E-23 -0.47120102E-01 -0.22020601E-24 -0.00000000E+00  0.00000000E+00  0.00000000E+00  0.00000000E+00  0.00000000E+00  0.00000000E+00  0.30823799E-06 -0.00000000E+00 -0.00000000E+00 -0.12863500E-23 -0.00000000E+00 -0.00000000E+00 -0.30823799E-06  0.00000000E+00  0.00000000E+00  0.00000000E+00
  0.18797400E-26  0.00000000E+00  0.00000000E+00  0.00000000E+00  0.41156500E-25  0.00000000E+00  0.00000000E+00  0.00000000E+00  0.15879000E-23  0.45043000E-09 -0.10241100E-33  0.00000000E+00 -0.47171399E-35  0.98620498E-08  0.00000000E+00  0.00000000E+00  0.00000000E+00  0.38049899E-06  0.00000000E+00  0.00000000E+00  0.00000000E+00  0.00000000E+00  0.00000000E+00  0.00000000E+00  0.00000000E+00  0.00000000E+00  0.00000000E+00
  0.00000000E+00  0.00000000E+00  0.00000000E+00  0.00000000E+00  0.00000000E+00  0.00000000E+00  0.00000000E+00  0.00000000E+00  0.00000000E+00  0.00000000E+00  0.00000000E+00  0.00000000E+00  0.00000000E+00  0.00000000E+00  0.00000000E+00  0.00000000E+00  0.00000000E+00  0.00000000E+00  0.00000000E+00  0.00000000E+00  0.00000000E+00  0.00000000E+00  0.00000000E+00  0.00000000E+00  0.00000000E+00  0.00000000E+00  0.00000000E+00
