#  ISAJET SUSY parameters in SUSY Les Houches Accord 2 format
#  Created by ISALHA 2.0 Last revision: C. Balazs 21 Apr 2009
Block SPINFO   # Program information
     1   ISASUGRA from ISAJET          # Spectrum Calculator
     2   7.80   29-OCT-2009 12:50:36   # Version number
Block MODSEL   # Model selection
     1     1   # Minimal supergravity (mSUGRA) model               
Block SMINPUTS   # Standard Model inputs
     1     1.27838310E+02   # alpha_em^(-1)
     2     1.16570000E-05   # G_Fermi
     3     1.17200002E-01   # alpha_s(M_Z)
     4     9.11699982E+01   # m_{Z}(pole)
     5     4.19999981E+00   # m_{b}(m_{b})
     6     1.72500000E+02   # m_{top}(pole)
     7     1.77699995E+00   # m_{tau}(pole)
Block MINPAR   # SUSY breaking input parameters
     1     3.38000000E+03   # m_0
     2     3.60000000E+02   # m_{1/2}
     3     1.00000000E+01   # tan(beta)
     4     1.00000000E+00   # sign(mu)
     5     0.00000000E+00   # A_0
Block EXTPAR   # Non-universal SUSY breaking parameters
     0     2.10550915E+16   # Input scale
Block MASS   # Scalar and gaugino mass spectrum
#  PDG code   mass                 particle
        24     8.04229965E+01   #  W^+
        25     1.17586136E+02   #  h^0            
        35     3.36920190E+03   #  H^0            
        36     3.34712573E+03   #  A^0            
        37     3.37020776E+03   #  H^+            
   1000001     3.42493945E+03   #  dnl            
   1000002     3.42400195E+03   #  upl            
   1000003     3.42493945E+03   #  stl            
   1000004     3.42400220E+03   #  chl            
   1000005     2.80980103E+03   #  b1             
   1000006     2.01515637E+03   #  t1             
   1000011     3.38194385E+03   #  el-            
   1000012     3.38225537E+03   #  nuel           
   1000013     3.38194385E+03   #  mul-           
   1000014     3.38225537E+03   #  numl           
   1000015     3.34845850E+03   #  tau1           
   1000016     3.36700293E+03   #  nutl           
   1000021     9.90442444E+02   #  glss           
   1000022     1.49195053E+02   #  z1ss           
   1000023     2.53179672E+02   #  z2ss           
   1000024     2.55180908E+02   #  w1ss           
   1000025    -3.16606537E+02   #  z3ss           
   1000035     3.74669556E+02   #  z4ss           
   1000037     3.69362762E+02   #  w2ss           
   2000001     3.43356445E+03   #  dnr            
   2000002     3.43199023E+03   #  upr            
   2000003     3.43356445E+03   #  str            
   2000004     3.43199048E+03   #  chr            
   2000005     3.40101147E+03   #  b2             
   2000006     2.82049609E+03   #  t2             
   2000011     3.37921680E+03   #  er-            
   2000013     3.37921680E+03   #  mur-           
   2000015     3.36609912E+03   #  tau2           
Block ALPHA   # Effective Higgs mixing parameter
         -9.98609588E-02   # alpha
Block STOPMIX   # stop mixing matrix
  1  1     1.89744327E-02   # O_{11}
  1  2     9.99819994E-01   # O_{12}
  2  1    -9.99819994E-01   # O_{21}
  2  2     1.89744327E-02   # O_{22}
Block SBOTMIX   # sbottom mixing matrix
  1  1     9.99989450E-01   # O_{11}
  1  2     4.59436141E-03   # O_{12}
  2  1    -4.59436141E-03   # O_{21}
  2  2     9.99989450E-01   # O_{22}
Block STAUMIX   # stau mixing matrix
  1  1     1.01656914E-01   # O_{11}
  1  2     9.94819522E-01   # O_{12}
  2  1    -9.94819522E-01   # O_{21}
  2  2     1.01656914E-01   # O_{22}
Block NMIX   # neutralino mixing matrix
  1  1     9.70111907E-01   #
  1  2    -6.87008351E-02   #
  1  3     2.03529656E-01   #
  1  4    -1.12866983E-01   #
  2  1     2.05237985E-01   #
  2  2     7.28215873E-01   #
  2  3    -4.96433049E-01   #
  2  4     4.25597429E-01   #
  3  1     5.80035448E-02   #
  3  2    -7.53356963E-02   #
  3  3    -6.96377158E-01   #
  3  4    -7.11350024E-01   #
  4  1     1.15741290E-01   #
  4  2    -6.77721500E-01   #
  4  3    -4.76642758E-01   #
  4  4     5.47822177E-01   #
Block UMIX   # chargino U mixing matrix
  1  1    -6.93392336E-01   # U_{11}
  1  2     7.20560253E-01   # U_{12}
  2  1    -7.20560253E-01   # U_{21}
  2  2    -6.93392336E-01   # U_{22}
Block VMIX   # chargino V mixing matrix
  1  1    -7.91493416E-01   # V_{11}
  1  2     6.11177683E-01   # V_{12}
  2  1    -6.11177683E-01   # V_{21}
  2  2    -7.91493416E-01   # V_{22}
Block GAUGE Q=  2.37303052E+03   #
     1     3.57517511E-01   # g`
     2     6.52401447E-01   # g_2
     3     1.21965075E+00   # g_3
Block YU Q=  2.37303052E+03   #
  3  3     8.44868779E-01   # y_t
Block YD Q=  2.37303052E+03   #
  3  3     1.29101247E-01   # y_b
Block YE Q=  2.37303052E+03   #
  3  3     1.02010533E-01   # y_tau
Block HMIX Q=  2.37303052E+03   # Higgs mixing parameters
     1     3.04726990E+02   # mu(Q)
     2     1.00000000E+01   # tan(beta)(M_GUT)
     3     2.51871597E+02   # Higgs vev at Q
     4     1.12032510E+07   # m_A^2(Q)
Block MSOFT Q=  2.37303052E+03   # DRbar SUSY breaking parameters
     1     1.55335358E+02   # M_1(Q)          
     2     2.84504181E+02   # M_2(Q)          
     3     8.24069885E+02   # M_3(Q)          
    31     3.37065015E+03   # MeL(Q)          
    32     3.37065015E+03   # MmuL(Q)         
    33     3.35580664E+03   # MtauL(Q)        
    34     3.37563306E+03   # MeR(Q)          
    35     3.37563306E+03   # MmuR(Q)         
    36     3.34590186E+03   # MtauR(Q)        
    41     3.37232446E+03   # MqL1(Q)         
    42     3.37232446E+03   # MqL2(Q)         
    43     2.77194556E+03   # MqL3(Q)         
    44     3.38000000E+03   # MuR(Q)          
    45     3.38000000E+03   # McR(Q)          
    46     2.03152393E+03   # MtR(Q)          
    47     3.38127856E+03   # MdR(Q)          
    48     3.38127856E+03   # MsR(Q)          
    49     3.35579321E+03   # MbR(Q)          
Block AU Q=  2.37303052E+03   #
  1  1    -5.84187134E+02   # A_u
  2  2    -5.84187134E+02   # A_c
  3  3    -5.84187134E+02   # A_t
Block AD Q=  2.37303052E+03   #
  1  1    -8.57621643E+02   # A_d
  2  2    -8.57621643E+02   # A_s
  3  3    -8.57621643E+02   # A_b
Block AE Q=  2.37303052E+03   #
  1  1    -2.08420959E+02   # A_e
  2  2    -2.08420959E+02   # A_mu
  3  3    -2.08420959E+02   # A_tau
#  ISAJET decay tables in SUSY Les Houches accord format
#  Created by ISALHD. Last revision: C. Balazs, 2005 May 25
Block DCINFO                           # Program information
     1   ISASUGRA from ISAJET          # Spectrum Calculator
     2   7.80   29-OCT-2009 12:50:36   # Version number
#         PDG         Width
DECAY         6  1.14680779E+00   # TP    decays
#          BR          NDA       ID1       ID2       ID3       ID4
      3.33333343E-01    3            2        -1         5             # TP     -->  UP     DB     BT          
      3.33333343E-01    3            4        -3         5             # TP     -->  CH     SB     BT          
      1.11111112E-01    3          -11        12         5             # TP     -->  E+     NUE    BT          
      1.11111112E-01    3          -13        14         5             # TP     -->  MU+    NUM    BT          
      1.11111112E-01    3          -15        16         5             # TP     -->  TAU+   NUT    BT          
#         PDG         Width
DECAY   1000021  9.33877483E-04   # GLSS  decays
#          BR          NDA       ID1       ID2       ID3       ID4
      1.87500585E-02    3      1000024         1        -2             # GLSS   -->  W1SS+  DN     UB          
      1.87500585E-02    3     -1000024         2        -1             # GLSS   -->  W1SS-  UP     DB          
      1.87500566E-02    3      1000024         3        -4             # GLSS   -->  W1SS+  ST     CB          
      1.87500566E-02    3     -1000024         4        -3             # GLSS   -->  W1SS-  CH     SB          
      7.58395717E-02    3      1000024         5        -6             # GLSS   -->  W1SS+  BT     TB          
      7.58395717E-02    3     -1000024         6        -5             # GLSS   -->  W1SS-  TP     BB          
      9.54025798E-03    3      1000037         1        -2             # GLSS   -->  W2SS+  DN     UB          
      9.54025798E-03    3     -1000037         2        -1             # GLSS   -->  W2SS-  UP     DB          
      9.54025798E-03    3      1000037         3        -4             # GLSS   -->  W2SS+  ST     CB          
      9.54025798E-03    3     -1000037         4        -3             # GLSS   -->  W2SS-  CH     SB          
      1.35132387E-01    3      1000037         5        -6             # GLSS   -->  W2SS+  BT     TB          
      1.35132387E-01    3     -1000037         6        -5             # GLSS   -->  W2SS-  TP     BB          
      2.98846775E-04    2      1000022        21                       # GLSS   -->  Z1SS   GL                 
      1.09628057E-02    3      1000022         2        -2             # GLSS   -->  Z1SS   UP     UB          
      3.96974385E-03    3      1000022         1        -1             # GLSS   -->  Z1SS   DN     DB          
      3.96974385E-03    3      1000022         3        -3             # GLSS   -->  Z1SS   ST     SB          
      1.09628011E-02    3      1000022         4        -4             # GLSS   -->  Z1SS   CH     CB          
      5.96614461E-03    3      1000022         5        -5             # GLSS   -->  Z1SS   BT     BB          
      4.61026430E-02    3      1000022         6        -6             # GLSS   -->  Z1SS   TP     TB          
      9.94156022E-03    2      1000023        21                       # GLSS   -->  Z2SS   GL                 
      1.04018841E-02    3      1000023         2        -2             # GLSS   -->  Z2SS   UP     UB          
      8.23426992E-03    3      1000023         1        -1             # GLSS   -->  Z2SS   DN     DB          
      8.23426992E-03    3      1000023         3        -3             # GLSS   -->  Z2SS   ST     SB          
      1.04018822E-02    3      1000023         4        -4             # GLSS   -->  Z2SS   CH     CB          
      1.98377538E-02    3      1000023         5        -5             # GLSS   -->  Z2SS   BT     BB          
      6.08740561E-02    3      1000023         6        -6             # GLSS   -->  Z2SS   TP     TB          
      2.31369063E-02    2      1000025        21                       # GLSS   -->  Z3SS   GL                 
      3.70184753E-05    3      1000025         2        -2             # GLSS   -->  Z3SS   UP     UB          
      4.84835000E-05    3      1000025         1        -1             # GLSS   -->  Z3SS   DN     DB          
      4.84835000E-05    3      1000025         3        -3             # GLSS   -->  Z3SS   ST     SB          
      3.70184680E-05    3      1000025         4        -4             # GLSS   -->  Z3SS   CH     CB          
      2.05111341E-03    3      1000025         5        -5             # GLSS   -->  Z3SS   BT     BB          
      9.45943967E-02    3      1000025         6        -6             # GLSS   -->  Z3SS   TP     TB          
      1.22075789E-02    2      1000035        21                       # GLSS   -->  Z4SS   GL                 
      4.57933173E-03    3      1000035         2        -2             # GLSS   -->  Z4SS   UP     UB          
      5.11841429E-03    3      1000035         1        -1             # GLSS   -->  Z4SS   DN     DB          
      5.11841429E-03    3      1000035         3        -3             # GLSS   -->  Z4SS   ST     SB          
      4.57932986E-03    3      1000035         4        -4             # GLSS   -->  Z4SS   CH     CB          
      1.26030780E-02    3      1000035         5        -5             # GLSS   -->  Z4SS   BT     BB          
      9.05768797E-02    3      1000035         6        -6             # GLSS   -->  Z4SS   TP     TB          
#         PDG         Width
DECAY   1000002  1.99773788E+02   # UPL   decays
#          BR          NDA       ID1       ID2       ID3       ID4
      8.54382990E-04    2      1000022         2                       # UPL    -->  Z1SS   UP                 
      4.18499969E-02    2      1000023         2                       # UPL    -->  Z2SS   UP                 
      2.96947022E-04    2      1000025         2                       # UPL    -->  Z3SS   UP                 
      3.03554311E-02    2      1000035         2                       # UPL    -->  Z4SS   UP                 
      7.84601271E-01    2      1000021         2                       # UPL    -->  GLSS   UP                 
      8.93911272E-02    2      1000024         1                       # UPL    -->  W1SS+  DN                 
      5.26508763E-02    2      1000037         1                       # UPL    -->  W2SS+  DN                 
#         PDG         Width
DECAY   1000001  1.99784042E+02   # DNL   decays
#          BR          NDA       ID1       ID2       ID3       ID4
      4.36565187E-03    2      1000022         1                       # DNL    -->  Z1SS   DN                 
      3.40421200E-02    2      1000023         1                       # DNL    -->  Z2SS   DN                 
      5.24163013E-04    2      1000025         1                       # DNL    -->  Z3SS   DN                 
      3.44119705E-02    2      1000035         1                       # DNL    -->  Z4SS   DN                 
      7.84834743E-01    2      1000021         1                       # DNL    -->  GLSS   DN                 
      6.86210170E-02    2     -1000024         2                       # DNL    -->  W1SS-  UP                 
      7.32003897E-02    2     -1000037         2                       # DNL    -->  W2SS-  UP                 
#         PDG         Width
DECAY   1000003  1.99784042E+02   # STL   decays
#          BR          NDA       ID1       ID2       ID3       ID4
      4.36565187E-03    2      1000022         3                       # STL    -->  Z1SS   ST                 
      3.40421200E-02    2      1000023         3                       # STL    -->  Z2SS   ST                 
      5.24163013E-04    2      1000025         3                       # STL    -->  Z3SS   ST                 
      3.44119705E-02    2      1000035         3                       # STL    -->  Z4SS   ST                 
      7.84834743E-01    2      1000021         3                       # STL    -->  GLSS   ST                 
      6.86209947E-02    2     -1000024         4                       # STL    -->  W1SS-  CH                 
      7.32003748E-02    2     -1000037         4                       # STL    -->  W2SS-  CH                 
#         PDG         Width
DECAY   1000004  1.99773743E+02   # CHL   decays
#          BR          NDA       ID1       ID2       ID3       ID4
      8.54382932E-04    2      1000022         4                       # CHL    -->  Z1SS   CH                 
      4.18499932E-02    2      1000023         4                       # CHL    -->  Z2SS   CH                 
      2.96947052E-04    2      1000025         4                       # CHL    -->  Z3SS   CH                 
      3.03554311E-02    2      1000035         4                       # CHL    -->  Z4SS   CH                 
      7.84601212E-01    2      1000021         4                       # CHL    -->  GLSS   CH                 
      8.93911421E-02    2      1000024         3                       # CHL    -->  W1SS+  ST                 
      5.26508875E-02    2      1000037         3                       # CHL    -->  W2SS+  ST                 
#         PDG         Width
DECAY   1000005  1.93095078E+02   # BT1   decays
#          BR          NDA       ID1       ID2       ID3       ID4
      3.92677030E-03    2      1000022         5                       # BT1    -->  Z1SS   BT                 
      3.00130025E-02    2      1000023         5                       # BT1    -->  Z2SS   BT                 
      2.82197678E-03    2      1000025         5                       # BT1    -->  Z3SS   BT                 
      2.99258828E-02    2      1000035         5                       # BT1    -->  Z4SS   BT                 
      6.19599342E-01    2      1000021         5                       # BT1    -->  GLSS   BT                 
      1.28276065E-01    2     -1000024         6                       # BT1    -->  W1SS-  TP                 
      1.82402432E-01    2     -1000037         6                       # BT1    -->  W2SS-  TP                 
      3.03454488E-03    2          -24   1000006                       # BT1    -->  W-     TP1                
#         PDG         Width
DECAY   1000006  1.21066360E+02   # TP1   decays
#          BR          NDA       ID1       ID2       ID3       ID4
      5.36830425E-01    2      1000021         6                       # TP1    -->  GLSS   TP                 
      3.73694226E-02    2      1000022         6                       # TP1    -->  Z1SS   TP                 
      4.21423130E-02    2      1000023         6                       # TP1    -->  Z2SS   TP                 
      1.08035862E-01    2      1000025         6                       # TP1    -->  Z3SS   TP                 
      6.12799525E-02    2      1000035         6                       # TP1    -->  Z4SS   TP                 
      8.50137994E-02    2      1000024         5                       # TP1    -->  W1SS+  BT                 
      1.29328266E-01    2      1000037         5                       # TP1    -->  W2SS+  BT                 
#         PDG         Width
DECAY   2000002  1.64932724E+02   # UPR   decays
#          BR          NDA       ID1       ID2       ID3       ID4
      4.41017821E-02    2      1000022         2                       # UPR    -->  Z1SS   UP                 
      1.95988733E-03    2      1000023         2                       # UPR    -->  Z2SS   UP                 
      1.55575399E-04    2      1000025         2                       # UPR    -->  Z3SS   UP                 
      6.15202473E-04    2      1000035         2                       # UPR    -->  Z4SS   UP                 
      9.53167558E-01    2      1000021         2                       # UPR    -->  GLSS   UP                 
#         PDG         Width
DECAY   2000001  1.59232224E+02   # DNR   decays
#          BR          NDA       ID1       ID2       ID3       ID4
      1.14254337E-02    2      1000022         1                       # DNR    -->  Z1SS   DN                 
      5.07750665E-04    2      1000023         1                       # DNR    -->  Z2SS   DN                 
      4.03053637E-05    2      1000025         1                       # DNR    -->  Z3SS   DN                 
      1.59383271E-04    2      1000035         1                       # DNR    -->  Z4SS   DN                 
      9.87867117E-01    2      1000021         1                       # DNR    -->  GLSS   DN                 
#         PDG         Width
DECAY   2000003  1.59232224E+02   # STR   decays
#          BR          NDA       ID1       ID2       ID3       ID4
      1.14254337E-02    2      1000022         3                       # STR    -->  Z1SS   ST                 
      5.07750665E-04    2      1000023         3                       # STR    -->  Z2SS   ST                 
      4.03053637E-05    2      1000025         3                       # STR    -->  Z3SS   ST                 
      1.59383271E-04    2      1000035         3                       # STR    -->  Z4SS   ST                 
      9.87867117E-01    2      1000021         3                       # STR    -->  GLSS   ST                 
#         PDG         Width
DECAY   2000004  1.64932678E+02   # CHR   decays
#          BR          NDA       ID1       ID2       ID3       ID4
      4.41017859E-02    2      1000022         4                       # CHR    -->  Z1SS   CH                 
      1.95988710E-03    2      1000023         4                       # CHR    -->  Z2SS   CH                 
      1.55575399E-04    2      1000025         4                       # CHR    -->  Z3SS   CH                 
      6.15202473E-04    2      1000035         4                       # CHR    -->  Z4SS   CH                 
      9.53167558E-01    2      1000021         4                       # CHR    -->  GLSS   CH                 
#         PDG         Width
DECAY   2000005  1.59669952E+02   # BT2   decays
#          BR          NDA       ID1       ID2       ID3       ID4
      1.15615521E-02    2      1000022         5                       # BT2    -->  Z1SS   BT                 
      2.23752111E-03    2      1000023         5                       # BT2    -->  Z2SS   BT                 
      3.58908344E-03    2      1000025         5                       # BT2    -->  Z3SS   BT                 
      1.88346813E-03    2      1000035         5                       # BT2    -->  Z4SS   BT                 
      9.73245859E-01    2      1000021         5                       # BT2    -->  GLSS   BT                 
      3.62584577E-03    2     -1000024         6                       # BT2    -->  W1SS-  TP                 
      3.63226235E-03    2     -1000037         6                       # BT2    -->  W2SS-  TP                 
      3.31192666E-07    2          -24   1000006                       # BT2    -->  W-     TP1                
      1.00021403E-04    2          -24   2000006                       # BT2    -->  W-     TP2                
      5.28887031E-05    2           23   1000005                       # BT2    -->  Z0     BT1                
      7.12953479E-05    2           25   1000005                       # BT2    -->  HL0    BT1                
#         PDG         Width
DECAY   2000006  1.93068253E+02   # TP2   decays
#          BR          NDA       ID1       ID2       ID3       ID4
      6.15951657E-01    2      1000021         6                       # TP2    -->  GLSS   TP                 
      7.55529776E-02    2      1000024         5                       # TP2    -->  W1SS+  BT                 
      4.95459847E-02    2      1000037         5                       # TP2    -->  W2SS+  BT                 
      1.58591208E-03    2           23   1000006                       # TP2    -->  Z0     TP1                
      3.25191463E-03    2           25   1000006                       # TP2    -->  HL0    TP1                
      2.96530244E-03    2      1000022         6                       # TP2    -->  Z1SS   TP                 
      6.84944913E-02    2      1000023         6                       # TP2    -->  Z2SS   TP                 
      9.72687081E-02    2      1000025         6                       # TP2    -->  Z3SS   TP                 
      8.53831619E-02    2      1000035         6                       # TP2    -->  Z4SS   TP                 
#         PDG         Width
DECAY   1000011  4.62455177E+01   # EL-   decays
#          BR          NDA       ID1       ID2       ID3       ID4
      6.61569163E-02    2      1000022        11                       # EL-    -->  Z1SS   E-                 
      2.15297431E-01    2      1000023        11                       # EL-    -->  Z2SS   E-                 
      5.71158656E-04    2      1000025        11                       # EL-    -->  Z3SS   E-                 
      1.13258667E-01    2      1000035        11                       # EL-    -->  Z4SS   E-                 
      2.92642623E-01    2     -1000024        12                       # EL-    -->  W1SS-  NUE                
      3.12073231E-01    2     -1000037        12                       # EL-    -->  W2SS-  NUE                
#         PDG         Width
DECAY   1000013  4.62455177E+01   # MUL-  decays
#          BR          NDA       ID1       ID2       ID3       ID4
      6.61569163E-02    2      1000022        13                       # MUL-   -->  Z1SS   MU-                
      2.15297431E-01    2      1000023        13                       # MUL-   -->  Z2SS   MU-                
      5.71158656E-04    2      1000025        13                       # MUL-   -->  Z3SS   MU-                
      1.13258667E-01    2      1000035        13                       # MUL-   -->  Z4SS   MU-                
      2.92642623E-01    2     -1000024        14                       # MUL-   -->  W1SS-  NUM                
      3.12073231E-01    2     -1000037        14                       # MUL-   -->  W2SS-  NUM                
#         PDG         Width
DECAY   1000015  1.86824532E+01   # TAU1- decays
#          BR          NDA       ID1       ID2       ID3       ID4
      8.53210688E-01    2      1000022        15                       # TAU1-  -->  Z1SS   TAU-               
      6.29826188E-02    2      1000023        15                       # TAU1-  -->  Z2SS   TAU-               
      1.89985186E-02    2      1000025        15                       # TAU1-  -->  Z3SS   TAU-               
      1.13344751E-02    2      1000035        15                       # TAU1-  -->  Z4SS   TAU-               
      5.13966233E-02    2     -1000024        16                       # TAU1-  -->  W1SS-  NUT                
      2.07714015E-03    2     -1000037        16                       # TAU1-  -->  W2SS-  NUT                
#         PDG         Width
DECAY   1000012  4.62830696E+01   # NUEL  decays
#          BR          NDA       ID1       ID2       ID3       ID4
      1.11005805E-01    2      1000022        12                       # NUEL   -->  Z1SS   NUE                
      1.15198985E-01    2      1000023        12                       # NUEL   -->  Z2SS   NUE                
      3.47430794E-03    2      1000025        12                       # NUEL   -->  Z3SS   NUE                
      1.64930597E-01    2      1000035        12                       # NUEL   -->  Z4SS   NUE                
      3.81032944E-01    2      1000024        11                       # NUEL   -->  W1SS+  E-                 
      2.24357322E-01    2      1000037        11                       # NUEL   -->  W2SS+  E-                 
#         PDG         Width
DECAY   1000014  4.62830696E+01   # NUML  decays
#          BR          NDA       ID1       ID2       ID3       ID4
      1.11005805E-01    2      1000022        14                       # NUML   -->  Z1SS   NUM                
      1.15198985E-01    2      1000023        14                       # NUML   -->  Z2SS   NUM                
      3.47430794E-03    2      1000025        14                       # NUML   -->  Z3SS   NUM                
      1.64930597E-01    2      1000035        14                       # NUML   -->  Z4SS   NUM                
      3.81032944E-01    2      1000024        13                       # NUML   -->  W1SS+  MU-                
      2.24357322E-01    2      1000037        13                       # NUML   -->  W2SS+  MU-                
#         PDG         Width
DECAY   1000016  4.67865143E+01   # NUTL  decays
#          BR          NDA       ID1       ID2       ID3       ID4
      1.09312266E-01    2      1000022        16                       # NUTL   -->  Z1SS   NUT                
      1.13433868E-01    2      1000023        16                       # NUTL   -->  Z2SS   NUT                
      3.42087448E-03    2      1000025        16                       # NUTL   -->  Z3SS   NUT                
      1.62383467E-01    2      1000035        16                       # NUTL   -->  Z4SS   NUT                
      3.83209437E-01    2      1000024        15                       # NUTL   -->  W1SS+  TAU-               
      2.28240132E-01    2      1000037        15                       # NUTL   -->  W2SS+  TAU-               
      1.43769302E-10    3      1000015        16       -15             # NUTL   -->  TAU1-  NUT    TAU+        
      1.43769302E-10    3      1000015        12       -11             # NUTL   -->  TAU1-  NUE    E+          
      1.43769302E-10    3      1000015        14       -13             # NUTL   -->  TAU1-  NUM    MU+         
      4.31307878E-10    3      1000015         2        -1             # NUTL   -->  TAU1-  UP     DB          
      4.31307878E-10    3      1000015         4        -3             # NUTL   -->  TAU1-  CH     SB          
#         PDG         Width
DECAY   2000011  1.71098461E+01   # ER-   decays
#          BR          NDA       ID1       ID2       ID3       ID4
      9.41710949E-01    2      1000022        11                       # ER-    -->  Z1SS   E-                 
      4.18402962E-02    2      1000023        11                       # ER-    -->  Z2SS   E-                 
      3.32062203E-03    2      1000025        11                       # ER-    -->  Z3SS   E-                 
      1.31280879E-02    2      1000035        11                       # ER-    -->  Z4SS   E-                 
#         PDG         Width
DECAY   2000013  1.71098461E+01   # MUR-  decays
#          BR          NDA       ID1       ID2       ID3       ID4
      9.41710949E-01    2      1000022        13                       # MUR-   -->  Z1SS   MU-                
      4.18402962E-02    2      1000023        13                       # MUR-   -->  Z2SS   MU-                
      3.32062203E-03    2      1000025        13                       # MUR-   -->  Z3SS   MU-                
      1.31280879E-02    2      1000035        13                       # MUR-   -->  Z4SS   MU-                
#         PDG         Width
DECAY   2000015  4.64386826E+01   # TAU2- decays
#          BR          NDA       ID1       ID2       ID3       ID4
      6.74027428E-02    2      1000022        15                       # TAU2-  -->  Z1SS   TAU-               
      2.10924998E-01    2      1000023        15                       # TAU2-  -->  Z2SS   TAU-               
      9.10234638E-03    2      1000025        15                       # TAU2-  -->  Z3SS   TAU-               
      1.19449362E-01    2      1000035        15                       # TAU2-  -->  Z4SS   TAU-               
      2.77322382E-01    2     -1000024        16                       # TAU2-  -->  W1SS-  NUT                
      3.15798193E-01    2     -1000037        16                       # TAU2-  -->  W2SS-  NUT                
#         PDG         Width
DECAY   1000023  4.71416954E-03   # Z2SS  decays
#          BR          NDA       ID1       ID2       ID3       ID4
      2.21351766E-05    2      1000022        22                       # Z2SS   -->  Z1SS   GM                 
      9.99905884E-01    2      1000022        23                       # Z2SS   -->  Z1SS   Z0                 
      4.47514914E-09    3      1000022         2        -2             # Z2SS   -->  Z1SS   UP     UB          
      7.24868743E-09    3      1000022         1        -1             # Z2SS   -->  Z1SS   DN     DB          
      7.24868743E-09    3      1000022         3        -3             # Z2SS   -->  Z1SS   ST     SB          
      4.47514825E-09    3      1000022         4        -4             # Z2SS   -->  Z1SS   CH     CB          
      5.95123529E-05    3      1000022         5        -5             # Z2SS   -->  Z1SS   BT     BB          
      1.80479134E-08    3      1000022        11       -11             # Z2SS   -->  Z1SS   E-     E+          
      1.80479134E-08    3      1000022        13       -13             # Z2SS   -->  Z1SS   MU-    MU+         
      1.25522329E-05    3      1000022        15       -15             # Z2SS   -->  Z1SS   TAU-   TAU+        
      1.17497887E-08    3      1000022        12       -12             # Z2SS   -->  Z1SS   NUE    ANUE        
      1.17497887E-08    3      1000022        14       -14             # Z2SS   -->  Z1SS   NUM    ANUM        
      1.19649295E-08    3      1000022        16       -16             # Z2SS   -->  Z1SS   NUT    ANUT        
#         PDG         Width
DECAY   1000025  1.60985902E-01   # Z3SS  decays
#          BR          NDA       ID1       ID2       ID3       ID4
      1.20438972E-06    2      1000022        22                       # Z3SS   -->  Z1SS   GM                 
      9.55926680E-07    2      1000023        22                       # Z3SS   -->  Z2SS   GM                 
      1.26449880E-03    3     -1000024         2        -1             # Z3SS   -->  W1SS-  UP     DB          
      4.21499601E-04    3     -1000024        12       -11             # Z3SS   -->  W1SS-  NUE    E+          
      4.21499601E-04    3     -1000024        14       -13             # Z3SS   -->  W1SS-  NUM    MU+         
      1.26449880E-03    3      1000024         1        -2             # Z3SS   -->  W1SS+  DN     UB          
      4.21499601E-04    3      1000024        11       -12             # Z3SS   -->  W1SS+  E-     ANUE        
      4.21499601E-04    3      1000024        13       -14             # Z3SS   -->  W1SS+  MU-    ANUM        
      1.26449880E-03    3     -1000024         4        -3             # Z3SS   -->  W1SS-  CH     SB          
      4.21499601E-04    3     -1000024        16       -15             # Z3SS   -->  W1SS-  NUT    TAU+        
      1.26449880E-03    3      1000024         3        -4             # Z3SS   -->  W1SS+  ST     CB          
      4.21499601E-04    3      1000024        15       -16             # Z3SS   -->  W1SS+  TAU-   ANUT        
      9.39559877E-01    2      1000022        23                       # Z3SS   -->  Z1SS   Z0                 
      2.16773960E-11    3      1000022         2        -2             # Z3SS   -->  Z1SS   UP     UB          
      1.14627353E-11    3      1000022         1        -1             # Z3SS   -->  Z1SS   DN     DB          
      1.14627353E-11    3      1000022         3        -3             # Z3SS   -->  Z1SS   ST     SB          
      2.16773873E-11    3      1000022         4        -4             # Z3SS   -->  Z1SS   CH     CB          
      1.24583743E-09    3      1000022         5        -5             # Z3SS   -->  Z1SS   BT     BB          
      4.01437772E-11    3      1000022        11       -11             # Z3SS   -->  Z1SS   E-     E+          
      4.01437772E-11    3      1000022        13       -13             # Z3SS   -->  Z1SS   MU-    MU+         
      9.25265975E-10    3      1000022        15       -15             # Z3SS   -->  Z1SS   TAU-   TAU+        
      3.31217276E-11    3      1000022        12       -12             # Z3SS   -->  Z1SS   NUE    ANUE        
      3.31217276E-11    3      1000022        14       -14             # Z3SS   -->  Z1SS   NUM    ANUM        
      3.37292486E-11    3      1000022        16       -16             # Z3SS   -->  Z1SS   NUT    ANUT        
      3.52814328E-04    3      1000023         2        -2             # Z3SS   -->  Z2SS   UP     UB          
      4.54877038E-04    3      1000023         1        -1             # Z3SS   -->  Z2SS   DN     DB          
      4.54877038E-04    3      1000023         3        -3             # Z3SS   -->  Z2SS   ST     SB          
      3.52814328E-04    3      1000023         4        -4             # Z3SS   -->  Z2SS   CH     CB          
      4.30260494E-04    3      1000023         5        -5             # Z3SS   -->  Z2SS   BT     BB          
      1.03194630E-04    3      1000023        11       -11             # Z3SS   -->  Z2SS   E-     E+          
      1.03194630E-04    3      1000023        13       -13             # Z3SS   -->  Z2SS   MU-    MU+         
      1.02218961E-04    3      1000023        15       -15             # Z3SS   -->  Z2SS   TAU-   TAU+        
      2.05352058E-04    3      1000023        12       -12             # Z3SS   -->  Z2SS   NUE    ANUE        
      2.05352058E-04    3      1000023        14       -14             # Z3SS   -->  Z2SS   NUM    ANUM        
      2.05352233E-04    3      1000023        16       -16             # Z3SS   -->  Z2SS   NUT    ANUT        
      4.98806015E-02    2      1000022        25                       # Z3SS   -->  Z1SS   HL0                
#         PDG         Width
DECAY   1000035  7.28248179E-01   # Z4SS  decays
#          BR          NDA       ID1       ID2       ID3       ID4
      2.57194756E-07    2      1000022        22                       # Z4SS   -->  Z1SS   GM                 
      1.04067567E-06    2      1000023        22                       # Z4SS   -->  Z2SS   GM                 
      6.75371382E-07    2      1000025        22                       # Z4SS   -->  Z3SS   GM                 
      4.42543447E-01    2      1000024       -24                       # Z4SS   -->  W1SS+  W-                 
      4.42543447E-01    2     -1000024        24                       # Z4SS   -->  W1SS-  W+                 
      5.08126519E-09    3     -1000037         2        -1             # Z4SS   -->  W2SS-  UP     DB          
      1.69375503E-09    3     -1000037        12       -11             # Z4SS   -->  W2SS-  NUE    E+          
      1.69375503E-09    3     -1000037        14       -13             # Z4SS   -->  W2SS-  NUM    MU+         
      5.08126519E-09    3      1000037         1        -2             # Z4SS   -->  W2SS+  DN     UB          
      1.69375503E-09    3      1000037        11       -12             # Z4SS   -->  W2SS+  E-     ANUE        
      1.69375503E-09    3      1000037        13       -14             # Z4SS   -->  W2SS+  MU-    ANUM        
      5.08126519E-09    3     -1000037         4        -3             # Z4SS   -->  W2SS-  CH     SB          
      1.69375503E-09    3     -1000037        16       -15             # Z4SS   -->  W2SS-  NUT    TAU+        
      5.08126519E-09    3      1000037         3        -4             # Z4SS   -->  W2SS+  ST     CB          
      1.69375503E-09    3      1000037        15       -16             # Z4SS   -->  W2SS+  TAU-   ANUT        
      2.03468855E-02    2      1000022        23                       # Z4SS   -->  Z1SS   Z0                 
      6.25926114E-05    2      1000023        23                       # Z4SS   -->  Z2SS   Z0                 
      4.14660722E-10    3      1000022         2        -2             # Z4SS   -->  Z1SS   UP     UB          
      1.41887846E-09    3      1000022         1        -1             # Z4SS   -->  Z1SS   DN     DB          
      1.41887846E-09    3      1000022         3        -3             # Z4SS   -->  Z1SS   ST     SB          
      4.14660611E-10    3      1000022         4        -4             # Z4SS   -->  Z1SS   CH     CB          
      3.09733839E-09    3      1000022         5        -5             # Z4SS   -->  Z1SS   BT     BB          
      1.66206859E-09    3      1000022        11       -11             # Z4SS   -->  Z1SS   E-     E+          
      1.66206859E-09    3      1000022        13       -13             # Z4SS   -->  Z1SS   MU-    MU+         
      1.92998217E-09    3      1000022        15       -15             # Z4SS   -->  Z1SS   TAU-   TAU+        
      3.31344063E-09    3      1000022        12       -12             # Z4SS   -->  Z1SS   NUE    ANUE        
      3.31344063E-09    3      1000022        14       -14             # Z4SS   -->  Z1SS   NUM    ANUM        
      3.37427886E-09    3      1000022        16       -16             # Z4SS   -->  Z1SS   NUT    ANUT        
      1.05450415E-09    3      1000023         2        -2             # Z4SS   -->  Z2SS   UP     UB          
      9.70293623E-10    3      1000023         1        -1             # Z4SS   -->  Z2SS   DN     DB          
      9.70293623E-10    3      1000023         3        -3             # Z4SS   -->  Z2SS   ST     SB          
      1.05450393E-09    3      1000023         4        -4             # Z4SS   -->  Z2SS   CH     CB          
      2.19448237E-09    3      1000023         5        -5             # Z4SS   -->  Z2SS   BT     BB          
      3.90849270E-10    3      1000023        11       -11             # Z4SS   -->  Z2SS   E-     E+          
      3.90849270E-10    3      1000023        13       -13             # Z4SS   -->  Z2SS   MU-    MU+         
      4.02532341E-10    3      1000023        15       -15             # Z4SS   -->  Z2SS   TAU-   TAU+        
      3.03924663E-10    3      1000023        12       -12             # Z4SS   -->  Z2SS   NUE    ANUE        
      3.03924663E-10    3      1000023        14       -14             # Z4SS   -->  Z2SS   NUM    ANUM        
      3.09518605E-10    3      1000023        16       -16             # Z4SS   -->  Z2SS   NUT    ANUT        
      6.22398875E-05    3      1000025         2        -2             # Z4SS   -->  Z3SS   UP     UB          
      8.02716822E-05    3      1000025         1        -1             # Z4SS   -->  Z3SS   DN     DB          
      8.02716822E-05    3      1000025         3        -3             # Z4SS   -->  Z3SS   ST     SB          
      6.22398875E-05    3      1000025         4        -4             # Z4SS   -->  Z3SS   CH     CB          
      7.46856895E-05    3      1000025         5        -5             # Z4SS   -->  Z3SS   BT     BB          
      1.82088206E-05    3      1000025        11       -11             # Z4SS   -->  Z3SS   E-     E+          
      1.82088206E-05    3      1000025        13       -13             # Z4SS   -->  Z3SS   MU-    MU+         
      1.79868020E-05    3      1000025        15       -15             # Z4SS   -->  Z3SS   TAU-   TAU+        
      3.62241663E-05    3      1000025        12       -12             # Z4SS   -->  Z3SS   NUE    ANUE        
      3.62241663E-05    3      1000025        14       -14             # Z4SS   -->  Z3SS   NUM    ANUM        
      3.62241299E-05    3      1000025        16       -16             # Z4SS   -->  Z3SS   NUT    ANUT        
      9.39008594E-02    2      1000022        25                       # Z4SS   -->  Z1SS   HL0                
      7.79823167E-05    2      1000023        25                       # Z4SS   -->  Z2SS   HL0                
#         PDG         Width
DECAY   1000024  3.38949561E-02   # W1SS+ decays
#          BR          NDA       ID1       ID2       ID3       ID4
      1.27165722E-09    3      1000022         2        -1             # W1SS+  -->  Z1SS   UP     DB          
      1.27165722E-09    3      1000022         4        -3             # W1SS+  -->  Z1SS   CH     SB          
      4.19090584E-09    3      1000022       -11        12             # W1SS+  -->  Z1SS   E+     NUE         
      4.19090584E-09    3      1000022       -13        14             # W1SS+  -->  Z1SS   MU+    NUM         
      4.69955275E-09    3      1000022       -15        16             # W1SS+  -->  Z1SS   TAU+   NUT         
      1.00000000E+00    2      1000022        24                       # W1SS+  -->  Z1SS   W+                 
      9.30147181E-10    3      1000023         2        -1             # W1SS+  -->  Z2SS   UP     DB          
      3.10051235E-10    3      1000023       -11        12             # W1SS+  -->  Z2SS   E+     NUE         
      3.10051235E-10    3      1000023       -13        14             # W1SS+  -->  Z2SS   MU+    NUM         
      3.10055981E-10    3      1000023       -15        16             # W1SS+  -->  Z2SS   TAU+   NUT         
#         PDG         Width
DECAY   1000037  4.22860384E-01   # W2SS+ decays
#          BR          NDA       ID1       ID2       ID3       ID4
      2.38461539E-09    3      1000022         2        -1             # W2SS+  -->  Z1SS   UP     DB          
      2.38461539E-09    3      1000022         4        -3             # W2SS+  -->  Z1SS   CH     SB          
      6.38625686E-09    3      1000022       -11        12             # W2SS+  -->  Z1SS   E+     NUE         
      6.38625686E-09    3      1000022       -13        14             # W2SS+  -->  Z1SS   MU+    NUM         
      6.93592961E-09    3      1000022       -15        16             # W2SS+  -->  Z1SS   TAU+   NUT         
      1.18846968E-01    2      1000022        24                       # W2SS+  -->  Z1SS   W+                 
      9.48836121E-10    3      1000023         2        -1             # W2SS+  -->  Z2SS   UP     DB          
      9.48836010E-10    3      1000023         4        -3             # W2SS+  -->  Z2SS   CH     SB          
      3.97324257E-10    3      1000023       -11        12             # W2SS+  -->  Z2SS   E+     NUE         
      3.97324257E-10    3      1000023       -13        14             # W2SS+  -->  Z2SS   MU+    NUM         
      4.74777995E-10    3      1000023       -15        16             # W2SS+  -->  Z2SS   TAU+   NUT         
      5.74599445E-01    2      1000023        24                       # W2SS+  -->  Z2SS   W+                 
      2.55931751E-04    3      1000025         2        -1             # W2SS+  -->  Z3SS   UP     DB          
      2.55931751E-04    3      1000025         4        -3             # W2SS+  -->  Z3SS   CH     SB          
      8.53074744E-05    3      1000025       -11        12             # W2SS+  -->  Z3SS   E+     NUE         
      8.53074744E-05    3      1000025       -13        14             # W2SS+  -->  Z3SS   MU+    NUM         
      8.53086385E-05    3      1000025       -15        16             # W2SS+  -->  Z3SS   TAU+   NUT         
      3.05785924E-01    2      1000024        23                       # W2SS+  -->  W1SS+  Z0                 
      1.70881354E-09    3      1000024         1        -1             # W2SS+  -->  W1SS+  DN     DB          
      1.70881309E-09    3      1000024         3        -3             # W2SS+  -->  W1SS+  ST     SB          
      1.82089188E-09    3      1000024         2        -2             # W2SS+  -->  W1SS+  UP     UB          
      1.82089188E-09    3      1000024         4        -4             # W2SS+  -->  W1SS+  CH     CB          
      6.38701647E-10    3      1000024        12       -12             # W2SS+  -->  W1SS+  NUE    ANUE        
      6.38701647E-10    3      1000024        14       -14             # W2SS+  -->  W1SS+  NUM    ANUM        
      6.64869271E-10    3      1000024        16       -16             # W2SS+  -->  W1SS+  NUT    ANUT        
      5.98504579E-10    3      1000024        11       -11             # W2SS+  -->  W1SS+  E-     E+          
      5.98504579E-10    3      1000024        13       -13             # W2SS+  -->  W1SS+  MU-    MU+         
      6.09519990E-10    3      1000024        15       -15             # W2SS+  -->  W1SS+  TAU-   TAU+        
#         PDG         Width
DECAY        25  4.24256315E-03   # HL0   decays
#          BR          NDA       ID1       ID2       ID3       ID4
      4.72813122E-09    2           11       -11                       # HL0    -->  E-     E+                 
      1.99629285E-04    2           13       -13                       # HL0    -->  MU-    MU+                
      5.70988245E-02    2           15       -15                       # HL0    -->  TAU-   TAU+               
      5.93232016E-06    2            1        -1                       # HL0    -->  DN     DB                 
      2.39695469E-03    2            3        -3                       # HL0    -->  ST     SB                 
      7.83299148E-01    2            5        -5                       # HL0    -->  BT     BB                 
      1.89079810E-06    2            2        -2                       # HL0    -->  UP     UB                 
      3.54729816E-02    2            4        -4                       # HL0    -->  CH     CB                 
      1.93878170E-03    2           22        22                       # HL0    -->  GM     GM                 
      4.02703844E-02    2           21        21                       # HL0    -->  GL     GL                 
      4.06138925E-03    3           24        11       -12             # HL0    -->  W+     E-     ANUE        
      4.06138925E-03    3           24        13       -14             # HL0    -->  W+     MU-    ANUM        
      4.06138925E-03    3           24        15       -16             # HL0    -->  W+     TAU-   ANUT        
      1.21841682E-02    3           24        -2         1             # HL0    -->  W+     UB     DN          
      1.21841682E-02    3           24        -4         3             # HL0    -->  W+     CB     ST          
      4.06138925E-03    3          -24       -11        12             # HL0    -->  W-     E+     NUE         
      4.06138925E-03    3          -24       -13        14             # HL0    -->  W-     MU+    NUM         
      4.06138925E-03    3          -24       -15        16             # HL0    -->  W-     TAU+   NUT         
      1.21841682E-02    3          -24         2        -1             # HL0    -->  W-     UP     DB          
      1.21841682E-02    3          -24         4        -3             # HL0    -->  W-     CH     SB          
      4.24716971E-04    3           23        12       -12             # HL0    -->  Z0     NUE    ANUE        
      4.24716971E-04    3           23        14       -14             # HL0    -->  Z0     NUM    ANUM        
      4.24716971E-04    3           23        16       -16             # HL0    -->  Z0     NUT    ANUT        
      2.13755775E-04    3           23        11       -11             # HL0    -->  Z0     E-     E+          
      2.13755775E-04    3           23        13       -13             # HL0    -->  Z0     MU-    MU+         
      2.13755775E-04    3           23        15       -15             # HL0    -->  Z0     TAU-   TAU+        
      7.32309127E-04    3           23         2        -2             # HL0    -->  Z0     UP     UB          
      7.32309127E-04    3           23         4        -4             # HL0    -->  Z0     CH     CB          
      9.43394552E-04    3           23         1        -1             # HL0    -->  Z0     DN     DB          
      9.43394552E-04    3           23         3        -3             # HL0    -->  Z0     ST     SB          
      9.43394552E-04    3           23         5        -5             # HL0    -->  Z0     BT     BB          
#         PDG         Width
DECAY        35  5.11928520E+01   # HH0   decays
#          BR          NDA       ID1       ID2       ID3       ID4
      1.11839182E-09    2           11       -11                       # HH0    -->  E-     E+                 
      4.72205174E-05    2           13       -13                       # HH0    -->  MU-    MU+                
      1.35246580E-02    2           15       -15                       # HH0    -->  TAU-   TAU+               
      1.35783398E-06    2            1        -1                       # HH0    -->  DN     DB                 
      5.48633630E-04    2            3        -3                       # HH0    -->  ST     SB                 
      7.03293607E-02    2            5        -5                       # HH0    -->  BT     BB                 
      4.36152260E-11    2            2        -2                       # HH0    -->  UP     UB                 
      5.37026779E-07    2            4        -4                       # HH0    -->  CH     CB                 
      2.79864129E-02    2            6        -6                       # HH0    -->  TP     TB                 
      7.97030779E-08    2           22        22                       # HH0    -->  GM     GM                 
      4.96591610E-06    2           21        21                       # HH0    -->  GL     GL                 
      8.95554695E-06    2           24       -24                       # HH0    -->  W+     W-                 
      4.59229295E-06    2           23        23                       # HH0    -->  Z0     Z0                 
      7.25662848E-03    2      1000022   1000022                       # HH0    -->  Z1SS   Z1SS               
      4.11086790E-02    2      1000022   1000023                       # HH0    -->  Z1SS   Z2SS               
      5.27382083E-02    2      1000022   1000025                       # HH0    -->  Z1SS   Z3SS               
      3.27088544E-03    2      1000022   1000035                       # HH0    -->  Z1SS   Z4SS               
      4.13411707E-02    2      1000023   1000023                       # HH0    -->  Z2SS   Z2SS               
      4.85195518E-02    2      1000023   1000025                       # HH0    -->  Z2SS   Z3SS               
      1.53555395E-03    2      1000023   1000035                       # HH0    -->  Z2SS   Z4SS               
      3.52077768E-03    2      1000025   1000025                       # HH0    -->  Z3SS   Z3SS               
      1.01257466E-01    2      1000025   1000035                       # HH0    -->  Z3SS   Z4SS               
      4.96960208E-02    2      1000035   1000035                       # HH0    -->  Z4SS   Z4SS               
      1.47616044E-01    2      1000024  -1000024                       # HH0    -->  W1SS+  W1SS-              
      6.84878901E-02    2      1000037  -1000037                       # HH0    -->  W2SS+  W2SS-              
      1.60580695E-01    2      1000024  -1000037                       # HH0    -->  W1SS+  W2SS-              
      1.60580695E-01    2     -1000024   1000037                       # HH0    -->  W1SS-  W2SS+              
      3.28870265E-05    2           25        25                       # HH0    -->  HL0    HL0                
#         PDG         Width
DECAY        36  5.08460655E+01   # HA0   decays
#          BR          NDA       ID1       ID2       ID3       ID4
      1.11868459E-09    2           11       -11                       # HA0    -->  E-     E+                 
      4.72328757E-05    2           13       -13                       # HA0    -->  MU-    MU+                
      1.35282129E-02    2           15       -15                       # HA0    -->  TAU-   TAU+               
      1.35824882E-06    2            1        -1                       # HA0    -->  DN     DB                 
      5.48801152E-04    2            3        -3                       # HA0    -->  ST     SB                 
      7.03510717E-02    2            5        -5                       # HA0    -->  BT     BB                 
      4.34596040E-11    2            2        -2                       # HA0    -->  UP     UB                 
      5.35479842E-07    2            4        -4                       # HA0    -->  CH     CB                 
      2.81225927E-02    2            6        -6                       # HA0    -->  TP     TB                 
      3.58437831E-07    2           22        22                       # HA0    -->  GM     GM                 
      7.98831934E-06    2           21        21                       # HA0    -->  GL     GL                 
      9.13647283E-03    2      1000022   1000022                       # HA0    -->  Z1SS   Z1SS               
      5.67049198E-02    2      1000022   1000023                       # HA0    -->  Z1SS   Z2SS               
      3.32127176E-02    2      1000022   1000025                       # HA0    -->  Z1SS   Z3SS               
      6.94236532E-03    2      1000022   1000035                       # HA0    -->  Z1SS   Z4SS               
      5.96769862E-02    2      1000023   1000023                       # HA0    -->  Z2SS   Z2SS               
      2.80639436E-02    2      1000023   1000025                       # HA0    -->  Z2SS   Z3SS               
      1.41477783E-03    2      1000023   1000035                       # HA0    -->  Z2SS   Z4SS               
      2.42122007E-03    2      1000025   1000025                       # HA0    -->  Z3SS   Z3SS               
      6.96097687E-02    2      1000025   1000035                       # HA0    -->  Z3SS   Z4SS               
      8.30009580E-02    2      1000035   1000035                       # HA0    -->  Z4SS   Z4SS               
      2.03572512E-01    2      1000024  -1000024                       # HA0    -->  W1SS+  W1SS-              
      1.23723686E-01    2      1000037  -1000037                       # HA0    -->  W2SS+  W2SS-              
      1.04951292E-01    2      1000024  -1000037                       # HA0    -->  W1SS+  W2SS-              
      1.04951292E-01    2     -1000024   1000037                       # HA0    -->  W1SS-  W2SS+              
      8.93469132E-06    2           25        23                       # HA0    -->  HL0    Z0                 
#         PDG         Width
DECAY        37  5.07929077E+01   # H+    decays
#          BR          NDA       ID1       ID2       ID3       ID4
      1.12757792E-09    2           12       -11                       # H+     -->  NUE    E+                 
      4.76083733E-05    2           14       -13                       # H+     -->  NUM    MU+                
      1.36357602E-02    2           16       -15                       # H+     -->  NUT    TAU+               
      1.26972691E-06    2            2        -1                       # H+     -->  UP     DB                 
      5.13517531E-04    2            4        -3                       # H+     -->  CH     SB                 
      9.15938988E-02    2            6        -5                       # H+     -->  TP     BB                 
      7.82637820E-02    2      1000024   1000022                       # H+     -->  W1SS+  Z1SS               
      3.84661532E-03    2      1000024   1000023                       # H+     -->  W1SS+  Z2SS               
      1.38972610E-01    2      1000024   1000025                       # H+     -->  W1SS+  Z3SS               
      2.24130616E-01    2      1000024   1000035                       # H+     -->  W1SS+  Z4SS               
      3.74785229E-03    2      1000037   1000022                       # H+     -->  W2SS+  Z1SS               
      3.20299208E-01    2      1000037   1000023                       # H+     -->  W2SS+  Z2SS               
      1.23994805E-01    2      1000037   1000025                       # H+     -->  W2SS+  Z3SS               
      9.43363470E-04    2      1000037   1000035                       # H+     -->  W2SS+  Z4SS               
      9.01654585E-06    2           25        24                       # H+     -->  HL0    W+                 
