  65
  401   2000.8307    0.26158E-25
  402   1999.3210    0.26062E-25
  403   2000.8307    0.26158E-25
  404   1999.3215    0.26062E-25
  405   1999.4320    0.31920E-25
  406   1829.6234    0.14203E-25
  407   2000.8307    0.26158E-25
  408   1999.3210    0.26062E-25
  409   2000.8307    0.26158E-25
  410   1999.3215    0.26062E-25
  411   1999.4320    0.31920E-25
  412   1829.6234    0.14203E-25
  413   2000.1520    0.58862E-24
  414   1999.6959    0.14719E-24
  415   2000.1520    0.58862E-24
  416   1999.6964    0.14719E-24
  417   2001.5537    0.16969E-25
  418   2164.8425    0.81822E-26
  419   2000.1520    0.58862E-24
  420   1999.6959    0.14719E-24
  421   2000.1520    0.58862E-24
  422   1999.6964    0.14719E-24
  423   2001.5537    0.16969E-25
  424   2164.8425    0.81822E-26
  425   2000.5267    0.24007E-25
  426   1999.0170    0.23965E-25
  427   2000.5267    0.24007E-25
  428   1999.0170    0.23965E-25
  429    124.2362    0.10499E-21
  430   1999.0170    0.23839E-25
  431   2000.5267    0.24007E-25
  432   1999.0170    0.23965E-25
  433   2000.5267    0.24007E-25
  434   1999.0170    0.23965E-25
  435    124.2362    0.10499E-21
  436   1999.0170    0.23839E-25
  437    124.2700    0.10358E-21
  438      0.0000    0.10000E+31
  439    124.2700    0.10358E-21
  440      0.0000    0.10000E+31
  441   2000.5479    0.23881E-25
  442      0.0000    0.10000E+31
  443    124.2700    0.10358E-21
  444      0.0000    0.10000E+31
  445    124.2700    0.10358E-21
  446      0.0000    0.10000E+31
  447   2000.5479    0.23881E-25
  448      0.0000    0.10000E+31
  449   2000.0000    0.24892E-24
  450    108.5202    0.10000E+31
  451    140.0000    0.89225E-23
  452   -257.3637    0.60223E-24
  453    288.8437    0.44689E-24
  454    115.0390    0.18462E-16
  455    286.0101    0.53023E-24
  456    115.0390    0.18462E-16
  457    286.0101    0.53023E-24
  203    119.0366    0.13104E-21
  204    504.3696    0.15829E-24
  205    500.0000    0.15951E-24
  206    509.4127    0.16678E-24
  207    509.4127    0.16678E-24
  458      0.0000    0.10000E+31
    6    172.5000    0.57395E-24
   12    172.5000    0.57395E-24
   6
   401  0.23801759E+00     0   450     1     0     0     0
   401  0.34174595E-01     0   451     1     0     0     0
   401  0.56309700E-02     0   452     1     0     0     0
   401  0.63450612E-01     0   453     1     0     0     0
   401  0.48118621E+00     0   456     2     0     0     0
   401  0.17754006E+00     0   457     2     0     0     0
   6
   402  0.15818161E+00     0   450     2     0     0     0
   402  0.13609006E+00     0   451     2     0     0     0
   402  0.37420678E-02     0   452     2     0     0     0
   402  0.42165652E-01     0   453     2     0     0     0
   402  0.59719270E+00     0   454     1     0     0     0
   402  0.62627949E-01     0   455     1     0     0     0
   6
   403  0.23801777E+00     0   450     3     0     0     0
   403  0.34174621E-01     0   451     3     0     0     0
   403  0.56309742E-02     0   452     3     0     0     0
   403  0.63450657E-01     0   453     3     0     0     0
   403  0.48118606E+00     0   456     4     0     0     0
   403  0.17754003E+00     0   457     4     0     0     0
   6
   404  0.15818149E+00     0   450     4     0     0     0
   404  0.13608995E+00     0   451     4     0     0     0
   404  0.37420650E-02     0   452     4     0     0     0
   404  0.42165622E-01     0   453     4     0     0     0
   404  0.59719282E+00     0   454     3     0     0     0
   404  0.62627971E-01     0   455     3     0     0     0
   7
   405  0.14035378E+00     0   450     5     0     0     0
   405  0.41686743E-01     0   451     5     0     0     0
   405  0.19932843E-02     0   452     5     0     0     0
   405  0.10168279E-01     0   453     5     0     0     0
   405  0.28539976E+00     0   456     6     0     0     0
   405  0.39463046E+00     0   457     6     0     0     0
   405  0.12576765E+00     0   199   406     0     0     0
   6
   406  0.72511742E-02     0   450     6     0     0     0
   406  0.65555386E-01     0   451     6     0     0     0
   406  0.20653866E+00     0   452     6     0     0     0
   406  0.31836605E+00     0   453     6     0     0     0
   406  0.53749636E-01     0   454     5     0     0     0
   406  0.34853908E+00     0   455     5     0     0     0
   6
   407  0.23801759E+00     0   450     7     0     0     0
   407  0.34174595E-01     0   451     7     0     0     0
   407  0.56309700E-02     0   452     7     0     0     0
   407  0.63450612E-01     0   453     7     0     0     0
   407  0.48118621E+00     0   454     8     0     0     0
   407  0.17754006E+00     0   455     8     0     0     0
   6
   408  0.15818161E+00     0   450     8     0     0     0
   408  0.13609006E+00     0   451     8     0     0     0
   408  0.37420678E-02     0   452     8     0     0     0
   408  0.42165652E-01     0   453     8     0     0     0
   408  0.59719270E+00     0   456     7     0     0     0
   408  0.62627949E-01     0   457     7     0     0     0
   6
   409  0.23801777E+00     0   450     9     0     0     0
   409  0.34174621E-01     0   451     9     0     0     0
   409  0.56309742E-02     0   452     9     0     0     0
   409  0.63450657E-01     0   453     9     0     0     0
   409  0.48118606E+00     0   454    10     0     0     0
   409  0.17754003E+00     0   455    10     0     0     0
   6
   410  0.15818149E+00     0   450    10     0     0     0
   410  0.13608995E+00     0   451    10     0     0     0
   410  0.37420650E-02     0   452    10     0     0     0
   410  0.42165622E-01     0   453    10     0     0     0
   410  0.59719282E+00     0   456     9     0     0     0
   410  0.62627971E-01     0   457     9     0     0     0
   7
   411  0.14035378E+00     0   450    11     0     0     0
   411  0.41686743E-01     0   451    11     0     0     0
   411  0.19932843E-02     0   452    11     0     0     0
   411  0.10168279E-01     0   453    11     0     0     0
   411  0.28539976E+00     0   454    12     0     0     0
   411  0.39463046E+00     0   455    12     0     0     0
   411  0.12576765E+00     0   198   412     0     0     0
   6
   412  0.72511742E-02     0   450    12     0     0     0
   412  0.65555386E-01     0   451    12     0     0     0
   412  0.20653866E+00     0   452    12     0     0     0
   412  0.31836605E+00     0   453    12     0     0     0
   412  0.53749636E-01     0   456    11     0     0     0
   412  0.34853908E+00     0   457    11     0     0     0
   4
   413  0.17923655E+00     0   450     1     0     0     0
   413  0.76874387E+00     0   451     1     0     0     0
   413  0.42402628E-02     0   452     1     0     0     0
   413  0.47779433E-01     0   453     1     0     0     0
   4
   414  0.17923690E+00     0   450     2     0     0     0
   414  0.76874405E+00     0   451     2     0     0     0
   414  0.42402176E-02     0   452     2     0     0     0
   414  0.47778726E-01     0   453     2     0     0     0
   4
   415  0.17923655E+00     0   450     3     0     0     0
   415  0.76874387E+00     0   451     3     0     0     0
   415  0.42402628E-02     0   452     3     0     0     0
   415  0.47779433E-01     0   453     3     0     0     0
   4
   416  0.17923693E+00     0   450     4     0     0     0
   416  0.76874417E+00     0   451     4     0     0     0
   416  0.42402181E-02     0   452     4     0     0     0
   416  0.47778733E-01     0   453     4     0     0     0
   7
   417  0.88038608E-01     0   450     5     0     0     0
   417  0.22169996E-01     0   451     5     0     0     0
   417  0.10805865E-01     0   452     5     0     0     0
   417  0.43186627E-01     0   453     5     0     0     0
   417  0.21819372E+00     0   456     6     0     0     0
   417  0.48109478E+00     0   457     6     0     0     0
   417  0.13651037E+00     0   199   406     0     0     0
   9
   418  0.20106080E+00     0   454     5     0     0     0
   418  0.81501722E-01     0   455     5     0     0     0
   418  0.21589561E+00     0   200   406     0     0     0
   418  0.29431071E-01     0   198   405     0     0     0
   418  0.54605968E-01     0   198   417     0     0     0
   418  0.95178939E-01     0   450     6     0     0     0
   418  0.46215642E-01     0   451     6     0     0     0
   418  0.19296157E+00     0   452     6     0     0     0
   418  0.83148748E-01     0   453     6     0     0     0
   4
   419  0.17923655E+00     0   450     7     0     0     0
   419  0.76874387E+00     0   451     7     0     0     0
   419  0.42402628E-02     0   452     7     0     0     0
   419  0.47779433E-01     0   453     7     0     0     0
   4
   420  0.17923690E+00     0   450     8     0     0     0
   420  0.76874405E+00     0   451     8     0     0     0
   420  0.42402176E-02     0   452     8     0     0     0
   420  0.47778726E-01     0   453     8     0     0     0
   4
   421  0.17923655E+00     0   450     9     0     0     0
   421  0.76874387E+00     0   451     9     0     0     0
   421  0.42402628E-02     0   452     9     0     0     0
   421  0.47779433E-01     0   453     9     0     0     0
   4
   422  0.17923693E+00     0   450    10     0     0     0
   422  0.76874417E+00     0   451    10     0     0     0
   422  0.42402181E-02     0   452    10     0     0     0
   422  0.47778733E-01     0   453    10     0     0     0
   7
   423  0.88038608E-01     0   450    11     0     0     0
   423  0.22169996E-01     0   451    11     0     0     0
   423  0.10805865E-01     0   452    11     0     0     0
   423  0.43186627E-01     0   453    11     0     0     0
   423  0.21819372E+00     0   454    12     0     0     0
   423  0.48109478E+00     0   455    12     0     0     0
   423  0.13651037E+00     0   198   412     0     0     0
   9
   424  0.20106080E+00     0   456    11     0     0     0
   424  0.81501722E-01     0   457    11     0     0     0
   424  0.21589561E+00     0   200   412     0     0     0
   424  0.29431071E-01     0   199   411     0     0     0
   424  0.54605968E-01     0   199   423     0     0     0
   424  0.95178939E-01     0   450    12     0     0     0
   424  0.46215642E-01     0   451    12     0     0     0
   424  0.19296157E+00     0   452    12     0     0     0
   424  0.83148748E-01     0   453    12     0     0     0
   6
   425  0.87811403E-01     0   450   121     0     0     0
   425  0.28223667E+00     0   451   121     0     0     0
   425  0.20774053E-02     0   452   121     0     0     0
   425  0.23408502E-01     0   453   121     0     0     0
   425  0.44155145E+00     0   456   122     0     0     0
   425  0.16291459E+00     0   457   122     0     0     0
   5
   426  0.30487764E+00     0   450   122     0     0     0
   426  0.72123669E-02     0   452   122     0     0     0
   426  0.81268668E-01     0   453   122     0     0     0
   426  0.54906148E+00     0   454   121     0     0     0
   426  0.57579786E-01     0   455   121     0     0     0
   6
   427  0.87811403E-01     0   450   123     0     0     0
   427  0.28223667E+00     0   451   123     0     0     0
   427  0.20774053E-02     0   452   123     0     0     0
   427  0.23408502E-01     0   453   123     0     0     0
   427  0.44155145E+00     0   456   124     0     0     0
   427  0.16291459E+00     0   457   124     0     0     0
   5
   428  0.30487764E+00     0   450   124     0     0     0
   428  0.72123669E-02     0   452   124     0     0     0
   428  0.81268668E-01     0   453   124     0     0     0
   428  0.54906148E+00     0   454   123     0     0     0
   428  0.57579786E-01     0   455   123     0     0     0
   2
   429  0.99163604E+00     0   450   125     0     0     0
   429  0.83639342E-02     0   456   126     0     0     0
   6
   430  0.30328262E+00     0   450   126     0     0     0
   430  0.71746344E-02     0   452   126     0     0     0
   430  0.80843493E-01     0   453   126     0     0     0
   430  0.54764205E+00     0   454   125     0     0     0
   430  0.60977239E-01     0   455   125     0     0     0
   430  0.79953163E-04     0   198   429     0     0     0
   6
   431  0.87811403E-01     0   450   127     0     0     0
   431  0.28223667E+00     0   451   127     0     0     0
   431  0.20774053E-02     0   452   127     0     0     0
   431  0.23408502E-01     0   453   127     0     0     0
   431  0.44155145E+00     0   454   128     0     0     0
   431  0.16291459E+00     0   455   128     0     0     0
   5
   432  0.30487764E+00     0   450   128     0     0     0
   432  0.72123669E-02     0   452   128     0     0     0
   432  0.81268668E-01     0   453   128     0     0     0
   432  0.54906148E+00     0   456   127     0     0     0
   432  0.57579786E-01     0   457   127     0     0     0
   6
   433  0.87811403E-01     0   450   129     0     0     0
   433  0.28223667E+00     0   451   129     0     0     0
   433  0.20774053E-02     0   452   129     0     0     0
   433  0.23408502E-01     0   453   129     0     0     0
   433  0.44155145E+00     0   454   130     0     0     0
   433  0.16291459E+00     0   455   130     0     0     0
   5
   434  0.30487764E+00     0   450   130     0     0     0
   434  0.72123669E-02     0   452   130     0     0     0
   434  0.81268668E-01     0   453   130     0     0     0
   434  0.54906148E+00     0   456   129     0     0     0
   434  0.57579786E-01     0   457   129     0     0     0
   2
   435  0.99163604E+00     0   450   131     0     0     0
   435  0.83639342E-02     0   454   132     0     0     0
   6
   436  0.30328262E+00     0   450   132     0     0     0
   436  0.71746344E-02     0   452   132     0     0     0
   436  0.80843493E-01     0   453   132     0     0     0
   436  0.54764205E+00     0   456   131     0     0     0
   436  0.60977239E-01     0   457   131     0     0     0
   436  0.79953163E-04     0   199   435     0     0     0
   1
   437  0.10000000E+01     0   450   121     0     0     0
   0
   1
   439  0.10000000E+01     0   450   123     0     0     0
   0
   8
   441  0.88259302E-01     0   450   125     0     0     0
   441  0.28075600E+00     0   451   125     0     0     0
   441  0.44975239E-02     0   452   125     0     0     0
   441  0.25110425E-01     0   453   125     0     0     0
   441  0.43920225E+00     0   456   126     0     0     0
   441  0.16209240E+00     0   457   126     0     0     0
   441  0.40612027E-04     0   200   429     0     0     0
   441  0.41387855E-04     0   203   429     0     0     0
   0
   1
   443  0.10000000E+01     0   450   127     0     0     0
   0
   1
   445  0.10000000E+01     0   450   129     0     0     0
   0
   8
   447  0.88259302E-01     0   450   131     0     0     0
   447  0.28075600E+00     0   451   131     0     0     0
   447  0.44975239E-02     0   452   131     0     0     0
   447  0.25110425E-01     0   453   131     0     0     0
   447  0.43920225E+00     0   454   132     0     0     0
   447  0.16209240E+00     0   455   132     0     0     0
   447  0.40612027E-04     0   200   435     0     0     0
   447  0.41387855E-04     0   203   435     0     0     0
   0
  31
   449  0.76337270E-02     0   454     1     8     0     0
   449  0.76337270E-02     0   456     2     7     0     0
   449  0.76337270E-02     0   454     3    10     0     0
   449  0.76337270E-02     0   456     4     9     0     0
   449  0.32538574E-01     0   454     5    12     0     0
   449  0.32538574E-01     0   456     6    11     0     0
   449  0.27247828E-02     0   455     1     8     0     0
   449  0.27247828E-02     0   457     2     7     0     0
   449  0.27247828E-02     0   455     3    10     0     0
   449  0.27247828E-02     0   457     4     9     0     0
   449  0.16947782E+00     0   455     5    12     0     0
   449  0.16947782E+00     0   457     6    11     0     0
   449  0.20409946E-03     0   450    13     0     0     0
   449  0.81102205E-02     0   450     1     7     0     0
   449  0.81102205E-02     0   450     3     9     0     0
   449  0.81638983E-02     0   450     5    11     0     0
   449  0.75573628E-02     0   450     6    12     0     0
   449  0.22818062E-02     0   451     1     7     0     0
   449  0.22818062E-02     0   451     3     9     0     0
   449  0.22518716E-02     0   451     5    11     0     0
   449  0.52996803E-01     0   451     6    12     0     0
   449  0.10659045E-02     0   452    13     0     0     0
   449  0.16511393E-03     0   452     1     7     0     0
   449  0.16511393E-03     0   452     3     9     0     0
   449  0.67005347E-03     0   452     5    11     0     0
   449  0.17971212E+00     0   452     6    12     0     0
   449  0.72755333E-03     0   453    13     0     0     0
   449  0.21959376E-02     0   453     1     7     0     0
   449  0.21959376E-02     0   453     3     9     0     0
   449  0.25735996E-02     0   453     5    11     0     0
   449  0.27310368E+00     0   453     6    12     0     0
   0
  16
   451  0.34538112E-04     0   456     2     7     0     0
   451  0.11512704E-04     0   456   122   127     0     0
   451  0.11512704E-04     0   456   124   129     0     0
   451  0.34538112E-04     0   454     1     8     0     0
   451  0.11512704E-04     0   454   121   128     0     0
   451  0.11512704E-04     0   454   123   130     0     0
   451  0.34538112E-04     0   456     4     9     0     0
   451  0.11512704E-04     0   456   126   131     0     0
   451  0.34538112E-04     0   454     3    10     0     0
   451  0.11512704E-04     0   454   125   132     0     0
   451  0.16673218E+00     0   437   127     0     0     0
   451  0.16673218E+00     0   443   121     0     0     0
   451  0.16672795E+00     0   439   129     0     0     0
   451  0.16672795E+00     0   445   123     0     0     0
   451  0.16643627E+00     0   429   131     0     0     0
   451  0.16643627E+00     0   435   125     0     0     0
  10
   452  0.32786092E+00     0   454   199     0     0     0
   452  0.32786092E+00     0   456   198     0     0     0
   452  0.31919739E+00     0   450   200     0     0     0
   452  0.11001303E-01     0   450   203     0     0     0
   452  0.15273553E-02     0   437   127     0     0     0
   452  0.15273553E-02     0   443   121     0     0     0
   452  0.15273544E-02     0   439   129     0     0     0
   452  0.15273544E-02     0   445   123     0     0     0
   452  0.39851069E-02     0   429   131     0     0     0
   452  0.39851069E-02     0   435   125     0     0     0
  10
   453  0.35393694E+00     0   454   199     0     0     0
   453  0.35393694E+00     0   456   198     0     0     0
   453  0.36684059E-01     0   450   200     0     0     0
   453  0.15443116E+00     0   450   203     0     0     0
   453  0.16328398E-01     0   437   127     0     0     0
   453  0.16328398E-01     0   443   121     0     0     0
   453  0.16328393E-01     0   439   129     0     0     0
   453  0.16328393E-01     0   445   123     0     0     0
   453  0.17848767E-01     0   429   131     0     0     0
   453  0.17848767E-01     0   435   125     0     0     0
   5
   454  0.33314317E+00     0   450     2     7     0     0
   454  0.33314317E+00     0   450     4     9     0     0
   454  0.11104801E+00     0   450   127   122     0     0
   454  0.11104801E+00     0   450   129   124     0     0
   454  0.11161766E+00     0   450   131   126     0     0
   5
   455  0.18026631E+00     0   450   198     0     0     0
   455  0.30512238E+00     0   451   198     0     0     0
   455  0.39943154E-02     0   435   126     0     0     0
   455  0.35505539E+00     0   454   200     0     0     0
   455  0.15556189E+00     0   454   203     0     0     0
   5
   456  0.33314317E+00     0   450     8     1     0     0
   456  0.33314317E+00     0   450    10     3     0     0
   456  0.11104801E+00     0   450   121   128     0     0
   456  0.11104801E+00     0   450   123   130     0     0
   456  0.11161766E+00     0   450   125   132     0     0
   5
   457  0.18026631E+00     0   450   199     0     0     0
   457  0.30512238E+00     0   451   199     0     0     0
   457  0.39943154E-02     0   429   132     0     0     0
   457  0.35505539E+00     0   456   200     0     0     0
   457  0.15556189E+00     0   456   203     0     0     0
  28
   203  0.20212700E-03     0   123   129     0     0     0
   203  0.57815149E-01     0   125   131     0     0     0
   203  0.24265002E-02     0     3     9     0     0     0
   203  0.79157782E+00     0     5    11     0     0     0
   203  0.30111801E-01     0     4    10     0     0     0
   203  0.17880432E-02     0    59    59     0     0     0
   203  0.34980375E-01     0    13    13     0     0     0
   203  0.41307374E-02     0   198   121   128     0     0
   203  0.41307374E-02     0   198   123   130     0     0
   203  0.41307374E-02     0   198   125   132     0     0
   203  0.12392213E-01     0   198     8     1     0     0
   203  0.12392213E-01     0   198    10     3     0     0
   203  0.41307374E-02     0   199   127   122     0     0
   203  0.41307374E-02     0   199   129   124     0     0
   203  0.41307374E-02     0   199   131   126     0     0
   203  0.12392213E-01     0   199     2     7     0     0
   203  0.12392213E-01     0   199     4     9     0     0
   203  0.46126143E-03     0   200   122   128     0     0
   203  0.46126143E-03     0   200   124   130     0     0
   203  0.46126143E-03     0   200   126   132     0     0
   203  0.23214823E-03     0   200   121   127     0     0
   203  0.23214823E-03     0   200   123   129     0     0
   203  0.23214823E-03     0   200   125   131     0     0
   203  0.79532014E-03     0   200     2     8     0     0
   203  0.79532014E-03     0   200     4    10     0     0
   203  0.10245683E-02     0   200     1     7     0     0
   203  0.10245683E-02     0   200     3     9     0     0
   203  0.10245683E-02     0   200     5    11     0     0
  18
   204  0.31166866E-04     0   123   129     0     0     0
   204  0.89260060E-02     0   125   131     0     0     0
   204  0.36761916E-03     0     3     9     0     0     0
   204  0.98639317E-01     0     5    11     0     0     0
   204  0.98353617E-01     0     6    12     0     0     0
   204  0.14854567E-03     0    13    13     0     0     0
   204  0.19566889E-02     0   198   199     0     0     0
   204  0.96189330E-03     0   200   200     0     0     0
   204  0.10324930E+00     0   450   450     0     0     0
   204  0.17043246E+00     0   450   452     0     0     0
   204  0.82393168E-02     0   450   453     0     0     0
   204  0.14155847E+00     0   454   456     0     0     0
   204  0.17924520E+00     0   454   457     0     0     0
   204  0.17924520E+00     0   456   455     0     0     0
   204  0.79499995E-02     0   203   203     0     0     0
   204  0.23627219E-03     0   437   443     0     0     0
   204  0.23622502E-03     0   439   445     0     0     0
   204  0.22276369E-03     0   429   435     0     0     0
  13
   205  0.31298525E-04     0   123   129     0     0     0
   205  0.89641521E-02     0   125   131     0     0     0
   205  0.36920275E-03     0     3     9     0     0     0
   205  0.99193148E-01     0     5    11     0     0     0
   205  0.14774098E+00     0     6    12     0     0     0
   205  0.12773275E-03     0    13    13     0     0     0
   205  0.18829155E+00     0   450   450     0     0     0
   205  0.36859848E-01     0   450   452     0     0     0
   205  0.52462991E-01     0   450   453     0     0     0
   205  0.26048508E+00     0   454   456     0     0     0
   205  0.10189452E+00     0   454   457     0     0     0
   205  0.10189452E+00     0   456   455     0     0     0
   205  0.16850579E-02     0   203   200     0     0     0
  11
   206  0.33341039E-04     0   124   129     0     0     0
   206  0.95491530E-02     0   126   131     0     0     0
   206  0.36263067E-03     0     4     9     0     0     0
   206  0.21160106E+00     0     6    11     0     0     0
   206  0.22049146E-01     0   454   450     0     0     0
   206  0.10629869E+00     0   454   451     0     0     0
   206  0.20878465E+00     0   454   452     0     0     0
   206  0.16834395E+00     0   454   453     0     0     0
   206  0.13210842E+00     0   455   450     0     0     0
   206  0.13895854E+00     0   455   451     0     0     0
   206  0.19104427E-02     0   203   198     0     0     0
  11
   207  0.33341039E-04     0   130   123     0     0     0
   207  0.95491530E-02     0   132   125     0     0     0
   207  0.36263067E-03     0    10     3     0     0     0
   207  0.21160106E+00     0    12     5     0     0     0
   207  0.22049146E-01     0   456   450     0     0     0
   207  0.10629869E+00     0   456   451     0     0     0
   207  0.20878465E+00     0   456   452     0     0     0
   207  0.16834395E+00     0   456   453     0     0     0
   207  0.13210842E+00     0   457   450     0     0     0
   207  0.13895854E+00     0   457   451     0     0     0
   207  0.19104427E-02     0   203   199     0     0     0
   0
   5
     6  0.33333334E+00   100     2     7     5     0     0
     6  0.33333334E+00   100     4     9     5     0     0
     6  0.11111111E+00   100   122   127     5     0     0
     6  0.11111111E+00   100   124   129     5     0     0
     6  0.11111111E+00   100   126   131     5     0     0
   5
    12  0.33333334E+00   100     8     1    11     0     0
    12  0.33333334E+00   100    10     3    11     0     0
    12  0.11111111E+00   100   128   121    11     0     0
    12  0.11111111E+00   100   130   123    11     0     0
    12  0.11111111E+00   100   132   125    11     0     0
      6.00000000     -0.18021348
      0.42232850     -0.76839924      0.41949189     -0.23500670
     -0.87635607     -0.48166385      0.00000019     -0.00000014
     -0.06585728      0.11982298      0.68609130      0.71455145
     -0.22203942      0.40398699      0.59439480     -0.65892947
     -0.94976753      0.31295630     -0.31295630     -0.94976753
     -0.85064685      0.52573752     -0.52573752     -0.85064685
      0.78483868     -0.94925612     -1.57013929
   4899.00000000      0.00000000      0.00000000
    250.00000000
    T
