  65
  401    403.8563    0.64536E-24
  402    396.8215    0.70524E-24
  403    403.8563    0.64540E-24
  404    396.8238    0.70524E-24
  405   2000.1373    0.73398E-26
  406   2004.0999    0.48982E-26
  407    403.8563    0.64536E-24
  408    396.8215    0.70524E-24
  409    403.8563    0.64540E-24
  410    396.8238    0.70524E-24
  411   2000.1373    0.73398E-26
  412   2004.0999    0.48982E-26
  413    400.7083    0.33294E-23
  414    398.5796    0.83799E-24
  415    400.7084    0.33294E-23
  416    398.5818    0.83800E-24
  417   2000.7828    0.49121E-26
  418   2004.4734    0.49590E-26
  419    400.7083    0.33294E-23
  420    398.5796    0.83799E-24
  421    400.7084    0.33294E-23
  422    398.5818    0.83800E-24
  423   2000.7828    0.49121E-26
  424   2004.4734    0.49590E-26
  425    204.8549    0.47029E-23
  426    190.6121    0.48677E-23
  427    204.8549    0.47029E-23
  428    190.6121    0.48677E-23
  429    204.0348    0.11070E-23
  430   1999.0830    0.24712E-25
  431    204.8549    0.47029E-23
  432    190.6121    0.48677E-23
  433    204.8549    0.47029E-23
  434    190.6121    0.48677E-23
  435    204.0348    0.11070E-23
  436   1999.0830    0.24712E-25
  437    204.2095    0.11045E-23
  438      0.0000    0.10000E+31
  439    204.2095    0.11045E-23
  440      0.0000    0.10000E+31
  441   2000.5107    0.24748E-25
  442      0.0000    0.10000E+31
  443    204.2095    0.11045E-23
  444      0.0000    0.10000E+31
  445    204.2095    0.11045E-23
  446      0.0000    0.10000E+31
  447   2000.5107    0.24748E-25
  448      0.0000    0.10000E+31
  449    700.0000    0.10842E-25
  450     99.9661    0.10000E+31
  451    299.8095    0.42681E-24
  452   -602.6185    0.13925E-24
  453    618.4748    0.11475E-24
  454    299.5957    0.42583E-24
  455    617.6038    0.11482E-24
  456    299.5957    0.42583E-24
  457    617.6038    0.11482E-24
  203    105.4011    0.17896E-21
  204   1007.7203    0.86610E-25
  205   1000.0000    0.87460E-25
  206   1006.3818    0.95103E-25
  207   1006.3818    0.95103E-25
  458      0.0000    0.10000E+31
    6    172.5000    0.57395E-24
   12    172.5000    0.57395E-24
   3
   401  0.59488643E-01     0   450     1     0     0     0
   401  0.31421638E+00     0   451     1     0     0     0
   401  0.62629497E+00     0   456     2     0     0     0
   3
   402  0.42102747E-01     0   450     2     0     0     0
   402  0.31710586E+00     0   451     2     0     0     0
   402  0.64079142E+00     0   454     1     0     0     0
   3
   403  0.59492741E-01     0   450     3     0     0     0
   403  0.31423813E+00     0   451     3     0     0     0
   403  0.62626916E+00     0   456     4     0     0     0
   3
   404  0.42102184E-01     0   450     4     0     0     0
   404  0.31707940E+00     0   451     4     0     0     0
   404  0.64081842E+00     0   454     3     0     0     0
   7
   405  0.12457581E-01     0   450     5     0     0     0
   405  0.74842967E-04     0   451     5     0     0     0
   405  0.73296885E-03     0   452     5     0     0     0
   405  0.72444527E-03     0   453     5     0     0     0
   405  0.98457402E+00     0   449     5     0     0     0
   405  0.11775004E-03     0   456     6     0     0     0
   405  0.13183686E-02     0   457     6     0     0     0
   7
   406  0.64633387E+00     0   449     6     0     0     0
   406  0.32945618E-01     0   450     6     0     0     0
   406  0.28913112E-02     0   451     6     0     0     0
   406  0.80132082E-01     0   452     6     0     0     0
   406  0.76372251E-01     0   453     6     0     0     0
   406  0.59421444E-02     0   454     5     0     0     0
   406  0.15538274E+00     0   455     5     0     0     0
   3
   407  0.59488643E-01     0   450     7     0     0     0
   407  0.31421638E+00     0   451     7     0     0     0
   407  0.62629497E+00     0   454     8     0     0     0
   3
   408  0.42102747E-01     0   450     8     0     0     0
   408  0.31710586E+00     0   451     8     0     0     0
   408  0.64079142E+00     0   456     7     0     0     0
   3
   409  0.59492741E-01     0   450     9     0     0     0
   409  0.31423813E+00     0   451     9     0     0     0
   409  0.62626916E+00     0   454    10     0     0     0
   3
   410  0.42102184E-01     0   450    10     0     0     0
   410  0.31707940E+00     0   451    10     0     0     0
   410  0.64081842E+00     0   456     9     0     0     0
   7
   411  0.12457581E-01     0   450    11     0     0     0
   411  0.74842967E-04     0   451    11     0     0     0
   411  0.73296885E-03     0   452    11     0     0     0
   411  0.72444527E-03     0   453    11     0     0     0
   411  0.98457402E+00     0   449    11     0     0     0
   411  0.11775004E-03     0   454    12     0     0     0
   411  0.13183686E-02     0   455    12     0     0     0
   7
   412  0.64633387E+00     0   449    12     0     0     0
   412  0.32945618E-01     0   450    12     0     0     0
   412  0.28913112E-02     0   451    12     0     0     0
   412  0.80132082E-01     0   452    12     0     0     0
   412  0.76372251E-01     0   453    12     0     0     0
   412  0.59421444E-02     0   456    11     0     0     0
   412  0.15538274E+00     0   457    11     0     0     0
   2
   413  0.99969661E+00     0   450     1     0     0     0
   413  0.30339501E-03     0   451     1     0     0     0
   2
   414  0.99970442E+00     0   450     2     0     0     0
   414  0.29560894E-03     0   451     2     0     0     0
   2
   415  0.99969661E+00     0   450     3     0     0     0
   415  0.30339515E-03     0   451     3     0     0     0
   2
   416  0.99970442E+00     0   450     4     0     0     0
   416  0.29558913E-03     0   451     4     0     0     0
   7
   417  0.25401246E-02     0   450     5     0     0     0
   417  0.56225814E-01     0   451     5     0     0     0
   417  0.61956287E-03     0   452     5     0     0     0
   417  0.32738999E-02     0   453     5     0     0     0
   417  0.65922159E+00     0   449     5     0     0     0
   417  0.11439188E+00     0   456     6     0     0     0
   417  0.16372715E+00     0   457     6     0     0     0
   7
   418  0.65455949E+00     0   449     6     0     0     0
   418  0.11774049E+00     0   454     5     0     0     0
   418  0.42196200E-02     0   455     5     0     0     0
   418  0.18750863E-02     0   450     6     0     0     0
   418  0.59728388E-01     0   451     6     0     0     0
   418  0.81318893E-01     0   452     6     0     0     0
   418  0.80558009E-01     0   453     6     0     0     0
   2
   419  0.99969661E+00     0   450     7     0     0     0
   419  0.30339501E-03     0   451     7     0     0     0
   2
   420  0.99970442E+00     0   450     8     0     0     0
   420  0.29560894E-03     0   451     8     0     0     0
   2
   421  0.99969661E+00     0   450     9     0     0     0
   421  0.30339515E-03     0   451     9     0     0     0
   2
   422  0.99970442E+00     0   450    10     0     0     0
   422  0.29558913E-03     0   451    10     0     0     0
   7
   423  0.25401246E-02     0   450    11     0     0     0
   423  0.56225814E-01     0   451    11     0     0     0
   423  0.61956287E-03     0   452    11     0     0     0
   423  0.32738999E-02     0   453    11     0     0     0
   423  0.65922159E+00     0   449    11     0     0     0
   423  0.11439188E+00     0   454    12     0     0     0
   423  0.16372715E+00     0   455    12     0     0     0
   7
   424  0.65455949E+00     0   449    12     0     0     0
   424  0.11774049E+00     0   456    11     0     0     0
   424  0.42196200E-02     0   457    11     0     0     0
   424  0.18750863E-02     0   450    12     0     0     0
   424  0.59728388E-01     0   451    12     0     0     0
   424  0.81318893E-01     0   452    12     0     0     0
   424  0.80558009E-01     0   453    12     0     0     0
   1
   425  0.10000000E+01     0   450   121     0     0     0
   1
   426  0.10000000E+01     0   450   122     0     0     0
   1
   427  0.10000000E+01     0   450   123     0     0     0
   1
   428  0.10000000E+01     0   450   124     0     0     0
   1
   429  0.10000000E+01     0   450   125     0     0     0
   7
   430  0.10080107E+00     0   450   126     0     0     0
   430  0.27456480E+00     0   451   126     0     0     0
   430  0.10424457E-02     0   452   126     0     0     0
   430  0.17537510E-01     0   453   126     0     0     0
   430  0.58478284E+00     0   454   125     0     0     0
   430  0.18344318E-01     0   455   125     0     0     0
   430  0.29270449E-02     0   206   429     0     0     0
   1
   431  0.10000000E+01     0   450   127     0     0     0
   1
   432  0.10000000E+01     0   450   128     0     0     0
   1
   433  0.10000000E+01     0   450   129     0     0     0
   1
   434  0.10000000E+01     0   450   130     0     0     0
   1
   435  0.10000000E+01     0   450   131     0     0     0
   7
   436  0.10080107E+00     0   450   132     0     0     0
   436  0.27456480E+00     0   451   132     0     0     0
   436  0.10424457E-02     0   452   132     0     0     0
   436  0.17537510E-01     0   453   132     0     0     0
   436  0.58478284E+00     0   456   131     0     0     0
   436  0.18344318E-01     0   457   131     0     0     0
   436  0.29270449E-02     0   207   435     0     0     0
   1
   437  0.10000000E+01     0   450   121     0     0     0
   0
   1
   439  0.10000000E+01     0   450   123     0     0     0
   0
   8
   441  0.88108480E-01     0   450   125     0     0     0
   441  0.29921734E+00     0   451   125     0     0     0
   441  0.12364454E-02     0   452   125     0     0     0
   441  0.95116748E-02     0   453   125     0     0     0
   441  0.56225532E+00     0   456   126     0     0     0
   441  0.36734555E-01     0   457   126     0     0     0
   441  0.14721132E-02     0   205   429     0     0     0
   441  0.14640031E-02     0   204   429     0     0     0
   0
   1
   443  0.10000000E+01     0   450   127     0     0     0
   0
   1
   445  0.10000000E+01     0   450   129     0     0     0
   0
   8
   447  0.88108480E-01     0   450   131     0     0     0
   447  0.29921734E+00     0   451   131     0     0     0
   447  0.12364454E-02     0   452   131     0     0     0
   447  0.95116748E-02     0   453   131     0     0     0
   447  0.56225532E+00     0   454   132     0     0     0
   447  0.36734555E-01     0   455   132     0     0     0
   447  0.14721132E-02     0   205   435     0     0     0
   447  0.14640031E-02     0   204   435     0     0     0
   0
  16
   449  0.63460737E-01     0   408     2     0     0     0
   449  0.63460737E-01     0   402     8     0     0     0
   449  0.61329097E-01     0   407     1     0     0     0
   449  0.61329097E-01     0   401     7     0     0     0
   449  0.62928125E-01     0   420     2     0     0     0
   449  0.62928125E-01     0   414     8     0     0     0
   449  0.62283088E-01     0   419     1     0     0     0
   449  0.62283088E-01     0   413     7     0     0     0
   449  0.61329078E-01     0   409     3     0     0     0
   449  0.61329078E-01     0   403     9     0     0     0
   449  0.62283069E-01     0   421     3     0     0     0
   449  0.62283069E-01     0   415     9     0     0     0
   449  0.63459709E-01     0   410     4     0     0     0
   449  0.63459709E-01     0   404    10     0     0     0
   449  0.62927097E-01     0   422     4     0     0     0
   449  0.62927097E-01     0   416    10     0     0     0
   0
  16
   451  0.54473634E-03     0   450   200     0     0     0
   451  0.99069523E-02     0   450   203     0     0     0
   451  0.11498050E+00     0   425   127     0     0     0
   451  0.11498050E+00     0   431   121     0     0     0
   451  0.11498044E+00     0   427   129     0     0     0
   451  0.11498044E+00     0   433   123     0     0     0
   451  0.19419806E-03     0   437   127     0     0     0
   451  0.19419806E-03     0   443   121     0     0     0
   451  0.19419788E-03     0   439   129     0     0     0
   451  0.19419788E-03     0   445   123     0     0     0
   451  0.22390192E-03     0   429   131     0     0     0
   451  0.22390192E-03     0   435   125     0     0     0
   451  0.13210046E+00     0   426   128     0     0     0
   451  0.13210046E+00     0   432   122     0     0     0
   451  0.13210046E+00     0   428   130     0     0     0
   451  0.13210046E+00     0   434   124     0     0     0
  36
   452  0.30315727E+00     0   454   199     0     0     0
   452  0.30315727E+00     0   456   198     0     0     0
   452  0.82947940E-01     0   450   200     0     0     0
   452  0.27357727E+00     0   451   200     0     0     0
   452  0.14462512E-01     0   450   203     0     0     0
   452  0.10412696E-01     0   451   203     0     0     0
   452  0.40152008E-03     0   402     8     0     0     0
   452  0.40152008E-03     0   408     2     0     0     0
   452  0.64307934E-03     0   401     7     0     0     0
   452  0.64307934E-03     0   407     1     0     0     0
   452  0.64307899E-03     0   403     9     0     0     0
   452  0.64307899E-03     0   409     3     0     0     0
   452  0.40150757E-03     0   404    10     0     0     0
   452  0.40150757E-03     0   410     4     0     0     0
   452  0.14371316E-03     0   414     8     0     0     0
   452  0.14371316E-03     0   420     2     0     0     0
   452  0.35332279E-04     0   413     7     0     0     0
   452  0.35332279E-04     0   419     1     0     0     0
   452  0.35332258E-04     0   415     9     0     0     0
   452  0.35332258E-04     0   421     3     0     0     0
   452  0.14370860E-03     0   416    10     0     0     0
   452  0.14370860E-03     0   422     4     0     0     0
   452  0.15937883E-03     0   425   127     0     0     0
   452  0.15937883E-03     0   431   121     0     0     0
   452  0.15937882E-03     0   427   129     0     0     0
   452  0.15937882E-03     0   433   123     0     0     0
   452  0.26687753E-03     0   437   127     0     0     0
   452  0.26687753E-03     0   443   121     0     0     0
   452  0.26687750E-03     0   439   129     0     0     0
   452  0.26687750E-03     0   445   123     0     0     0
   452  0.11075201E-02     0   429   131     0     0     0
   452  0.11075201E-02     0   435   125     0     0     0
   452  0.86760591E-03     0   426   128     0     0     0
   452  0.86760591E-03     0   432   122     0     0     0
   452  0.86760591E-03     0   428   130     0     0     0
   452  0.86760591E-03     0   434   124     0     0     0
  36
   453  0.26808175E+00     0   454   199     0     0     0
   453  0.26808175E+00     0   456   198     0     0     0
   453  0.13009937E-01     0   450   200     0     0     0
   453  0.11086815E-01     0   451   200     0     0     0
   453  0.60602110E-01     0   450   203     0     0     0
   453  0.20374939E+00     0   451   203     0     0     0
   453  0.10189070E-01     0   402     8     0     0     0
   453  0.10189070E-01     0   408     2     0     0     0
   453  0.12290814E-01     0   401     7     0     0     0
   453  0.12290814E-01     0   407     1     0     0     0
   453  0.12290807E-01     0   403     9     0     0     0
   453  0.12290807E-01     0   409     3     0     0     0
   453  0.10188791E-01     0   404    10     0     0     0
   453  0.10188791E-01     0   410     4     0     0     0
   453  0.64411300E-03     0   414     8     0     0     0
   453  0.64411300E-03     0   420     2     0     0     0
   453  0.15858734E-03     0   413     7     0     0     0
   453  0.15858734E-03     0   419     1     0     0     0
   453  0.15858727E-03     0   415     9     0     0     0
   453  0.15858727E-03     0   421     3     0     0     0
   453  0.64409507E-03     0   416    10     0     0     0
   453  0.64409507E-03     0   422     4     0     0     0
   453  0.59341090E-02     0   425   127     0     0     0
   453  0.59341090E-02     0   431   121     0     0     0
   453  0.59341090E-02     0   427   129     0     0     0
   453  0.59341090E-02     0   433   123     0     0     0
   453  0.11218297E-02     0   437   127     0     0     0
   453  0.11218297E-02     0   443   121     0     0     0
   453  0.11218296E-02     0   439   129     0     0     0
   453  0.11218296E-02     0   445   123     0     0     0
   453  0.17819321E-02     0   429   131     0     0     0
   453  0.17819321E-02     0   435   125     0     0     0
   453  0.12617718E-01     0   426   128     0     0     0
   453  0.12617718E-01     0   432   122     0     0     0
   453  0.12617718E-01     0   428   130     0     0     0
   453  0.12617718E-01     0   434   124     0     0     0
   6
   454  0.10373844E-01     0   450   198     0     0     0
   454  0.27986673E+00     0   426   127     0     0     0
   454  0.27986661E+00     0   428   129     0     0     0
   454  0.21491311E+00     0   431   122     0     0     0
   454  0.21491306E+00     0   433   124     0     0     0
   454  0.66629917E-04     0   435   126     0     0     0
  13
   455  0.66507168E-01     0   450   198     0     0     0
   455  0.27769148E+00     0   451   198     0     0     0
   455  0.14891047E-01     0   402     7     0     0     0
   455  0.31595334E-01     0   407     2     0     0     0
   455  0.14890803E-01     0   404     9     0     0     0
   455  0.33245627E-01     0   409     4     0     0     0
   455  0.11784987E-01     0   426   127     0     0     0
   455  0.11784987E-01     0   428   129     0     0     0
   455  0.25459904E-01     0   431   122     0     0     0
   455  0.25459900E-01     0   433   124     0     0     0
   455  0.13402059E-02     0   435   126     0     0     0
   455  0.26312995E+00     0   454   200     0     0     0
   455  0.22221865E+00     0   454   203     0     0     0
   6
   456  0.10373844E-01     0   450   199     0     0     0
   456  0.27986673E+00     0   432   121     0     0     0
   456  0.27986661E+00     0   434   123     0     0     0
   456  0.21491311E+00     0   425   128     0     0     0
   456  0.21491306E+00     0   427   130     0     0     0
   456  0.66629917E-04     0   429   132     0     0     0
  13
   457  0.66507168E-01     0   450   199     0     0     0
   457  0.27769148E+00     0   451   199     0     0     0
   457  0.14891047E-01     0   408     1     0     0     0
   457  0.31595334E-01     0   401     8     0     0     0
   457  0.14890803E-01     0   410     3     0     0     0
   457  0.33245627E-01     0   403    10     0     0     0
   457  0.11784987E-01     0   432   121     0     0     0
   457  0.11784987E-01     0   434   123     0     0     0
   457  0.25459904E-01     0   425   128     0     0     0
   457  0.25459900E-01     0   427   130     0     0     0
   457  0.13402059E-02     0   429   132     0     0     0
   457  0.26312995E+00     0   456   200     0     0     0
   457  0.22221865E+00     0   456   203     0     0     0
  28
   203  0.21323594E-03     0   123   129     0     0     0
   203  0.60970277E-01     0   125   131     0     0     0
   203  0.25645935E-02     0     3     9     0     0     0
   203  0.85114759E+00     0     5    11     0     0     0
   203  0.37279014E-01     0     4    10     0     0     0
   203  0.14717740E-02     0    59    59     0     0     0
   203  0.33216052E-01     0    13    13     0     0     0
   203  0.70847798E-03     0   198   121   128     0     0
   203  0.70847798E-03     0   198   123   130     0     0
   203  0.70847798E-03     0   198   125   132     0     0
   203  0.21254339E-02     0   198     8     1     0     0
   203  0.21254339E-02     0   198    10     3     0     0
   203  0.70847798E-03     0   199   127   122     0     0
   203  0.70847798E-03     0   199   129   124     0     0
   203  0.70847798E-03     0   199   131   126     0     0
   203  0.21254339E-02     0   199     2     7     0     0
   203  0.21254339E-02     0   199     4     9     0     0
   203  0.26321104E-04     0   200   122   128     0     0
   203  0.26321104E-04     0   200   124   130     0     0
   203  0.26321104E-04     0   200   126   132     0     0
   203  0.13247148E-04     0   200   121   127     0     0
   203  0.13247148E-04     0   200   123   129     0     0
   203  0.13247148E-04     0   200   125   131     0     0
   203  0.45383607E-04     0   200     2     8     0     0
   203  0.45383607E-04     0   200     4    10     0     0
   203  0.58465263E-04     0   200     1     7     0     0
   203  0.58465263E-04     0   200     3     9     0     0
   203  0.58465263E-04     0   200     5    11     0     0
  34
   204  0.15187619E-04     0   123   129     0     0     0
   204  0.43498860E-02     0   125   131     0     0     0
   204  0.17804207E-03     0     3     9     0     0     0
   204  0.43899789E-01     0     5    11     0     0     0
   204  0.36785907E+00     0     6    12     0     0     0
   204  0.21518928E-03     0    13    13     0     0     0
   204  0.88944094E-03     0   198   199     0     0     0
   204  0.45159378E-03     0   200   200     0     0     0
   204  0.15886921E-02     0   450   450     0     0     0
   204  0.95427716E-02     0   450   451     0     0     0
   204  0.60213972E-01     0   450   452     0     0     0
   204  0.11069003E-01     0   450   453     0     0     0
   204  0.11791500E-01     0   451   451     0     0     0
   204  0.14054900E+00     0   451   452     0     0     0
   204  0.67552705E-02     0   451   453     0     0     0
   204  0.25938343E-01     0   454   456     0     0     0
   204  0.15282895E+00     0   454   457     0     0     0
   204  0.15282895E+00     0   456   455     0     0     0
   204  0.37897562E-02     0   203   203     0     0     0
   204  0.17819744E-03     0   425   431     0     0     0
   204  0.13362206E-03     0   437   443     0     0     0
   204  0.17818280E-03     0   427   433     0     0     0
   204  0.13360936E-03     0   439   445     0     0     0
   204  0.13003312E-03     0   429   435     0     0     0
   204  0.59870223E-03     0   402   408     0     0     0
   204  0.11922150E-03     0   414   420     0     0     0
   204  0.59829414E-03     0   404   410     0     0     0
   204  0.11904147E-03     0   416   422     0     0     0
   204  0.87027741E-03     0   401   407     0     0     0
   204  0.29537205E-04     0   413   419     0     0     0
   204  0.87043981E-03     0   403   409     0     0     0
   204  0.29507044E-04     0   415   421     0     0     0
   204  0.62844640E-03     0   426   432     0     0     0
   204  0.62844640E-03     0   428   434     0     0     0
  19
   205  0.15254545E-04     0   123   129     0     0     0
   205  0.43691080E-02     0   125   131     0     0     0
   205  0.17883802E-03     0     3     9     0     0     0
   205  0.44138059E-01     0     5    11     0     0     0
   205  0.39506713E+00     0     6    12     0     0     0
   205  0.23072511E-03     0    13    13     0     0     0
   205  0.24912572E-02     0   450   450     0     0     0
   205  0.19186115E-01     0   450   451     0     0     0
   205  0.14034342E-01     0   450   452     0     0     0
   205  0.48761867E-01     0   450   453     0     0     0
   205  0.36056269E-01     0   451   451     0     0     0
   205  0.95639685E-02     0   451   452     0     0     0
   205  0.10220853E+00     0   451   453     0     0     0
   205  0.78363039E-01     0   454   456     0     0     0
   205  0.12218086E+00     0   454   457     0     0     0
   205  0.12218086E+00     0   456   455     0     0     0
   205  0.87061600E-03     0   203   200     0     0     0
   205  0.51580962E-04     0   404   422     0     0     0
   205  0.51580962E-04     0   416   410     0     0     0
  15
   206  0.16693375E-04     0   124   129     0     0     0
   206  0.47812089E-02     0   126   131     0     0     0
   206  0.18772011E-03     0     4     9     0     0     0
   206  0.38803747E+00     0     6    11     0     0     0
   206  0.29891806E-01     0   454   450     0     0     0
   206  0.51033159E-04     0   454   451     0     0     0
   206  0.17484567E+00     0   454   452     0     0     0
   206  0.16146944E+00     0   454   453     0     0     0
   206  0.57645340E-01     0   455   450     0     0     0
   206  0.17737760E+00     0   455   451     0     0     0
   206  0.95852982E-03     0   203   198     0     0     0
   206  0.15731802E-02     0   402   407     0     0     0
   206  0.15725381E-02     0   404   409     0     0     0
   206  0.79589849E-03     0   431   426     0     0     0
   206  0.79587550E-03     0   433   428     0     0     0
  15
   207  0.16693375E-04     0   130   123     0     0     0
   207  0.47812089E-02     0   132   125     0     0     0
   207  0.18772011E-03     0    10     3     0     0     0
   207  0.38803747E+00     0    12     5     0     0     0
   207  0.29891806E-01     0   456   450     0     0     0
   207  0.51033159E-04     0   456   451     0     0     0
   207  0.17484567E+00     0   456   452     0     0     0
   207  0.16146944E+00     0   456   453     0     0     0
   207  0.57645340E-01     0   457   450     0     0     0
   207  0.17737760E+00     0   457   451     0     0     0
   207  0.95852982E-03     0   203   199     0     0     0
   207  0.15731802E-02     0   408   401     0     0     0
   207  0.15725381E-02     0   410   403     0     0     0
   207  0.79589849E-03     0   425   432     0     0     0
   207  0.79587550E-03     0   427   434     0     0     0
   0
   5
     6  0.33333334E+00   100     2     7     5     0     0
     6  0.33333334E+00   100     4     9     5     0     0
     6  0.11111111E+00   100   122   127     5     0     0
     6  0.11111111E+00   100   124   129     5     0     0
     6  0.11111111E+00   100   126   131     5     0     0
   5
    12  0.33333334E+00   100     8     1    11     0     0
    12  0.33333334E+00   100    10     3    11     0     0
    12  0.11111111E+00   100   128   121    11     0     0
    12  0.11111111E+00   100   130   123    11     0     0
    12  0.11111111E+00   100   132   125    11     0     0
      4.00000000     -0.24957100
     -0.99620736      0.01873939     -0.07889351      0.03155358
     -0.03697127     -0.97401696      0.18593091     -0.12391016
      0.03241185     -0.04537006     -0.70344019     -0.70856410
      0.07178845     -0.22109115     -0.68145263      0.69396520
     -0.98399895      0.17817439     -0.17817439     -0.98399895
     -0.96390969      0.26622936     -0.26622936     -0.96390969
      1.57074499     -1.57079601     -1.57079637
    150.00000000   2400.00000000   2400.00000000
    600.00000000
    T
