  65
  401    702.2107    0.25232E-25
  402    698.1886    0.25465E-25
  403    702.2108    0.25232E-25
  404    698.1899    0.25465E-25
  405   2000.1373    0.61483E-26
  406   2004.0999    0.43381E-26
  407    702.2107    0.25232E-25
  408    698.1886    0.25465E-25
  409    702.2108    0.25232E-25
  410    698.1899    0.25465E-25
  411   2000.1373    0.61483E-26
  412   2004.0999    0.43381E-26
  413   2000.1418    0.61631E-26
  414   1999.7164    0.59759E-26
  415   2000.1418    0.61631E-26
  416   1999.7168    0.59759E-26
  417   2000.7828    0.43483E-26
  418   2004.4734    0.43859E-26
  419   2000.1418    0.61631E-26
  420   1999.7164    0.59759E-26
  421   2000.1418    0.61631E-26
  422   1999.7168    0.59759E-26
  423   2000.7828    0.43483E-26
  424   2004.4734    0.43859E-26
  425    204.8549    0.47029E-23
  426    190.6121    0.48677E-23
  427    204.8549    0.47029E-23
  428    190.6121    0.48677E-23
  429   2000.4075    0.64379E-25
  430   1999.0830    0.24784E-25
  431    204.8549    0.47029E-23
  432    190.6121    0.48677E-23
  433    204.8549    0.47029E-23
  434    190.6121    0.48677E-23
  435   2000.4075    0.64379E-25
  436   1999.0830    0.24784E-25
  437   2000.4253    0.65090E-25
  438      0.0000    0.10000E+31
  439   2000.4253    0.65090E-25
  440      0.0000    0.10000E+31
  441   2000.5106    0.24821E-25
  442      0.0000    0.10000E+31
  443   2000.4253    0.65090E-25
  444      0.0000    0.10000E+31
  445   2000.4253    0.65090E-25
  446      0.0000    0.10000E+31
  447   2000.5106    0.24821E-25
  448      0.0000    0.10000E+31
  449    400.0000    0.12533E-19
  450     99.9661    0.10000E+31
  451    299.8095    0.42734E-24
  452   -602.6185    0.14040E-24
  453    618.4748    0.12767E-24
  454    299.5957    0.42586E-24
  455    617.6038    0.12701E-24
  456    299.5957    0.42586E-24
  457    617.6038    0.12701E-24
  203    105.4011    0.17895E-21
  204   1007.7203    0.86926E-25
  205   1000.0000    0.87469E-25
  206   1006.3818    0.95404E-25
  207   1006.3818    0.95404E-25
  458      0.0000    0.10000E+31
    6    172.5000    0.57395E-24
   12    172.5000    0.57395E-24
   7
   401  0.44050966E-02     0   450     1     0     0     0
   401  0.70881665E-01     0   451     1     0     0     0
   401  0.20716749E-04     0   452     1     0     0     0
   401  0.31271399E-03     0   453     1     0     0     0
   401  0.78267884E+00     0   449     1     0     0     0
   401  0.14087728E+00     0   456     2     0     0     0
   401  0.82370237E-03     0   457     2     0     0     0
   7
   402  0.29258716E-02     0   450     2     0     0     0
   402  0.72757371E-01     0   451     2     0     0     0
   402  0.11498455E-04     0   452     2     0     0     0
   402  0.22790855E-03     0   453     2     0     0     0
   402  0.77717298E+00     0   449     2     0     0     0
   402  0.14656280E+00     0   454     1     0     0     0
   402  0.34156552E-03     0   455     1     0     0     0
   7
   403  0.44051032E-02     0   450     3     0     0     0
   403  0.70881777E-01     0   451     3     0     0     0
   403  0.20716800E-04     0   452     3     0     0     0
   403  0.31271481E-03     0   453     3     0     0     0
   403  0.78268015E+00     0   449     3     0     0     0
   403  0.14087595E+00     0   456     4     0     0     0
   403  0.82358596E-03     0   457     4     0     0     0
   7
   404  0.29258810E-02     0   450     4     0     0     0
   404  0.72757453E-01     0   451     4     0     0     0
   404  0.11497503E-04     0   452     4     0     0     0
   404  0.22788033E-03     0   453     4     0     0     0
   404  0.77717108E+00     0   449     4     0     0     0
   404  0.14656463E+00     0   454     3     0     0     0
   404  0.34157824E-03     0   455     3     0     0     0
   7
   405  0.10435163E-01     0   450     5     0     0     0
   405  0.62692634E-04     0   451     5     0     0     0
   405  0.61397551E-03     0   452     5     0     0     0
   405  0.60683570E-03     0   453     5     0     0     0
   405  0.98707837E+00     0   449     5     0     0     0
   405  0.98633987E-04     0   456     6     0     0     0
   405  0.11043389E-02     0   457     6     0     0     0
   7
   406  0.68677276E+00     0   449     6     0     0     0
   406  0.29178549E-01     0   450     6     0     0     0
   406  0.25607129E-02     0   451     6     0     0     0
   406  0.70969619E-01     0   452     6     0     0     0
   406  0.67639694E-01     0   453     6     0     0     0
   406  0.52627078E-02     0   454     5     0     0     0
   406  0.13761596E+00     0   455     5     0     0     0
   7
   407  0.44050966E-02     0   450     7     0     0     0
   407  0.70881665E-01     0   451     7     0     0     0
   407  0.20716749E-04     0   452     7     0     0     0
   407  0.31271399E-03     0   453     7     0     0     0
   407  0.78267884E+00     0   449     7     0     0     0
   407  0.14087728E+00     0   454     8     0     0     0
   407  0.82370237E-03     0   455     8     0     0     0
   7
   408  0.29258716E-02     0   450     8     0     0     0
   408  0.72757371E-01     0   451     8     0     0     0
   408  0.11498455E-04     0   452     8     0     0     0
   408  0.22790855E-03     0   453     8     0     0     0
   408  0.77717298E+00     0   449     8     0     0     0
   408  0.14656280E+00     0   456     7     0     0     0
   408  0.34156552E-03     0   457     7     0     0     0
   7
   409  0.44051032E-02     0   450     9     0     0     0
   409  0.70881777E-01     0   451     9     0     0     0
   409  0.20716800E-04     0   452     9     0     0     0
   409  0.31271481E-03     0   453     9     0     0     0
   409  0.78268015E+00     0   449     9     0     0     0
   409  0.14087595E+00     0   454    10     0     0     0
   409  0.82358596E-03     0   455    10     0     0     0
   7
   410  0.29258810E-02     0   450    10     0     0     0
   410  0.72757453E-01     0   451    10     0     0     0
   410  0.11497503E-04     0   452    10     0     0     0
   410  0.22788033E-03     0   453    10     0     0     0
   410  0.77717108E+00     0   449    10     0     0     0
   410  0.14656463E+00     0   456     9     0     0     0
   410  0.34157824E-03     0   457     9     0     0     0
   7
   411  0.10435163E-01     0   450    11     0     0     0
   411  0.62692634E-04     0   451    11     0     0     0
   411  0.61397551E-03     0   452    11     0     0     0
   411  0.60683570E-03     0   453    11     0     0     0
   411  0.98707837E+00     0   449    11     0     0     0
   411  0.98633987E-04     0   454    12     0     0     0
   411  0.11043389E-02     0   455    12     0     0     0
   7
   412  0.68677276E+00     0   449    12     0     0     0
   412  0.29178549E-01     0   450    12     0     0     0
   412  0.25607129E-02     0   451    12     0     0     0
   412  0.70969619E-01     0   452    12     0     0     0
   412  0.67639694E-01     0   453    12     0     0     0
   412  0.52627078E-02     0   456    11     0     0     0
   412  0.13761596E+00     0   457    11     0     0     0
   4
   413  0.10451618E-01     0   450     1     0     0     0
   413  0.13824420E-04     0   451     1     0     0     0
   413  0.44614197E-04     0   453     1     0     0     0
   413  0.98948997E+00     0   449     1     0     0     0
   5
   414  0.40527660E-01     0   450     2     0     0     0
   414  0.53605254E-04     0   451     2     0     0     0
   414  0.35640158E-04     0   452     2     0     0     0
   414  0.17298282E-03     0   453     2     0     0     0
   414  0.95921010E+00     0   449     2     0     0     0
   4
   415  0.10451618E-01     0   450     3     0     0     0
   415  0.13824420E-04     0   451     3     0     0     0
   415  0.44614197E-04     0   453     3     0     0     0
   415  0.98948997E+00     0   449     3     0     0     0
   5
   416  0.40527664E-01     0   450     4     0     0     0
   416  0.53605258E-04     0   451     4     0     0     0
   416  0.35640154E-04     0   452     4     0     0     0
   416  0.17298281E-03     0   453     4     0     0     0
   416  0.95921010E+00     0   449     4     0     0     0
   7
   417  0.22485657E-02     0   450     5     0     0     0
   417  0.49772140E-01     0   451     5     0     0     0
   417  0.54844859E-03     0   452     5     0     0     0
   417  0.28981173E-02     0   453     5     0     0     0
   417  0.69833660E+00     0   449     5     0     0     0
   417  0.10126182E+00     0   456     6     0     0     0
   417  0.14493433E+00     0   457     6     0     0     0
   7
   418  0.69448501E+00     0   449     6     0     0     0
   418  0.10413222E+00     0   454     5     0     0     0
   418  0.37319227E-02     0   455     5     0     0     0
   418  0.16583666E-02     0   450     6     0     0     0
   418  0.52825071E-01     0   451     6     0     0     0
   418  0.71920179E-01     0   452     6     0     0     0
   418  0.71247235E-01     0   453     6     0     0     0
   4
   419  0.10451618E-01     0   450     7     0     0     0
   419  0.13824420E-04     0   451     7     0     0     0
   419  0.44614197E-04     0   453     7     0     0     0
   419  0.98948997E+00     0   449     7     0     0     0
   5
   420  0.40527660E-01     0   450     8     0     0     0
   420  0.53605254E-04     0   451     8     0     0     0
   420  0.35640158E-04     0   452     8     0     0     0
   420  0.17298282E-03     0   453     8     0     0     0
   420  0.95921010E+00     0   449     8     0     0     0
   4
   421  0.10451618E-01     0   450     9     0     0     0
   421  0.13824420E-04     0   451     9     0     0     0
   421  0.44614197E-04     0   453     9     0     0     0
   421  0.98948997E+00     0   449     9     0     0     0
   5
   422  0.40527664E-01     0   450    10     0     0     0
   422  0.53605258E-04     0   451    10     0     0     0
   422  0.35640154E-04     0   452    10     0     0     0
   422  0.17298281E-03     0   453    10     0     0     0
   422  0.95921010E+00     0   449    10     0     0     0
   7
   423  0.22485657E-02     0   450    11     0     0     0
   423  0.49772140E-01     0   451    11     0     0     0
   423  0.54844859E-03     0   452    11     0     0     0
   423  0.28981173E-02     0   453    11     0     0     0
   423  0.69833660E+00     0   449    11     0     0     0
   423  0.10126182E+00     0   454    12     0     0     0
   423  0.14493433E+00     0   455    12     0     0     0
   7
   424  0.69448501E+00     0   449    12     0     0     0
   424  0.10413222E+00     0   456    11     0     0     0
   424  0.37319227E-02     0   457    11     0     0     0
   424  0.16583666E-02     0   450    12     0     0     0
   424  0.52825071E-01     0   451    12     0     0     0
   424  0.71920179E-01     0   452    12     0     0     0
   424  0.71247235E-01     0   453    12     0     0     0
   1
   425  0.10000000E+01     0   450   121     0     0     0
   1
   426  0.10000000E+01     0   450   122     0     0     0
   1
   427  0.10000000E+01     0   450   123     0     0     0
   1
   428  0.10000000E+01     0   450   124     0     0     0
   6
   429  0.98274517E+00     0   450   125     0     0     0
   429  0.15182473E-02     0   451   125     0     0     0
   429  0.35630763E-02     0   452   125     0     0     0
   429  0.67064371E-02     0   453   125     0     0     0
   429  0.44721688E-03     0   456   126     0     0     0
   429  0.50198776E-02     0   457   126     0     0     0
   6
   430  0.10109698E+00     0   450   126     0     0     0
   430  0.27537084E+00     0   451   126     0     0     0
   430  0.10455060E-02     0   452   126     0     0     0
   430  0.17588994E-01     0   453   126     0     0     0
   430  0.58649951E+00     0   454   125     0     0     0
   430  0.18398171E-01     0   455   125     0     0     0
   1
   431  0.10000000E+01     0   450   127     0     0     0
   1
   432  0.10000000E+01     0   450   128     0     0     0
   1
   433  0.10000000E+01     0   450   129     0     0     0
   1
   434  0.10000000E+01     0   450   130     0     0     0
   6
   435  0.98274517E+00     0   450   131     0     0     0
   435  0.15182473E-02     0   451   131     0     0     0
   435  0.35630763E-02     0   452   131     0     0     0
   435  0.67064371E-02     0   453   131     0     0     0
   435  0.44721688E-03     0   454   132     0     0     0
   435  0.50198776E-02     0   455   132     0     0     0
   6
   436  0.10109698E+00     0   450   132     0     0     0
   436  0.27537084E+00     0   451   132     0     0     0
   436  0.10455060E-02     0   452   132     0     0     0
   436  0.17588994E-01     0   453   132     0     0     0
   436  0.58649951E+00     0   456   131     0     0     0
   436  0.18398171E-01     0   457   131     0     0     0
   4
   437  0.99357045E+00     0   450   121     0     0     0
   437  0.13142172E-02     0   451   121     0     0     0
   437  0.87386969E-03     0   452   121     0     0     0
   437  0.42414437E-02     0   453   121     0     0     0
   0
   4
   439  0.99357045E+00     0   450   123     0     0     0
   439  0.13142172E-02     0   451   123     0     0     0
   439  0.87386969E-03     0   452   123     0     0     0
   439  0.42414437E-02     0   453   123     0     0     0
   0
   6
   441  0.88367939E-01     0   450   125     0     0     0
   441  0.30009848E+00     0   451   125     0     0     0
   441  0.12400897E-02     0   452   125     0     0     0
   441  0.95396964E-02     0   453   125     0     0     0
   441  0.56391102E+00     0   456   126     0     0     0
   441  0.36842756E-01     0   457   126     0     0     0
   0
   4
   443  0.99357045E+00     0   450   127     0     0     0
   443  0.13142172E-02     0   451   127     0     0     0
   443  0.87386969E-03     0   452   127     0     0     0
   443  0.42414437E-02     0   453   127     0     0     0
   0
   4
   445  0.99357045E+00     0   450   129     0     0     0
   445  0.13142172E-02     0   451   129     0     0     0
   445  0.87386969E-03     0   452   129     0     0     0
   445  0.42414437E-02     0   453   129     0     0     0
   0
   6
   447  0.88367939E-01     0   450   131     0     0     0
   447  0.30009848E+00     0   451   131     0     0     0
   447  0.12400897E-02     0   452   131     0     0     0
   447  0.95396964E-02     0   453   131     0     0     0
   447  0.56391102E+00     0   454   132     0     0     0
   447  0.36842756E-01     0   455   132     0     0     0
   0
  16
   449  0.98437861E-01     0   454     1     8     0     0
   449  0.98437861E-01     0   456     2     7     0     0
   449  0.98437332E-01     0   454     3    10     0     0
   449  0.98437332E-01     0   456     4     9     0     0
   449  0.55434359E-02     0   450    13     0     0     0
   449  0.88912539E-01     0   450     2     8     0     0
   449  0.11100797E+00     0   450     1     7     0     0
   449  0.11100794E+00     0   450     3     9     0     0
   449  0.88911876E-01     0   450     4    10     0     0
   449  0.52119363E-02     0   450     5    11     0     0
   449  0.14907301E-03     0   451    13     0     0     0
   449  0.50201323E-01     0   451     2     8     0     0
   449  0.47344379E-01     0   451     1     7     0     0
   449  0.47344361E-01     0   451     3     9     0     0
   449  0.50200824E-01     0   451     4    10     0     0
   449  0.41395525E-03     0   451     5    11     0     0
   0
  10
   451  0.54540421E-03     0   450   200     0     0     0
   451  0.99190986E-02     0   450   203     0     0     0
   451  0.11512148E+00     0   425   127     0     0     0
   451  0.11512148E+00     0   431   121     0     0     0
   451  0.11512141E+00     0   427   129     0     0     0
   451  0.11512141E+00     0   433   123     0     0     0
   451  0.13226242E+00     0   426   128     0     0     0
   451  0.13226244E+00     0   432   122     0     0     0
   451  0.13226242E+00     0   428   130     0     0     0
   451  0.13226244E+00     0   434   124     0     0     0
  14
   452  0.30565667E+00     0   454   199     0     0     0
   452  0.30565667E+00     0   456   198     0     0     0
   452  0.83631799E-01     0   450   200     0     0     0
   452  0.27583277E+00     0   451   200     0     0     0
   452  0.14581749E-01     0   450   203     0     0     0
   452  0.10498543E-01     0   451   203     0     0     0
   452  0.16069283E-03     0   425   127     0     0     0
   452  0.16069283E-03     0   431   121     0     0     0
   452  0.16069281E-03     0   427   129     0     0     0
   452  0.16069281E-03     0   433   123     0     0     0
   452  0.87475887E-03     0   426   128     0     0     0
   452  0.87475887E-03     0   432   122     0     0     0
   452  0.87475887E-03     0   428   130     0     0     0
   452  0.87475887E-03     0   434   124     0     0     0
  14
   453  0.29825997E+00     0   454   199     0     0     0
   453  0.29825997E+00     0   456   198     0     0     0
   453  0.14474477E-01     0   450   200     0     0     0
   453  0.12334869E-01     0   451   200     0     0     0
   453  0.67424148E-01     0   450   203     0     0     0
   453  0.22668566E+00     0   451   203     0     0     0
   453  0.66021173E-02     0   425   127     0     0     0
   453  0.66021173E-02     0   431   121     0     0     0
   453  0.66021173E-02     0   427   129     0     0     0
   453  0.66021173E-02     0   433   123     0     0     0
   453  0.14038107E-01     0   426   128     0     0     0
   453  0.14038107E-01     0   432   122     0     0     0
   453  0.14038107E-01     0   428   130     0     0     0
   453  0.14038107E-01     0   434   124     0     0     0
   5
   454  0.10374536E-01     0   450   198     0     0     0
   454  0.27988538E+00     0   426   127     0     0     0
   454  0.27988526E+00     0   428   129     0     0     0
   454  0.21492745E+00     0   431   122     0     0     0
   454  0.21492739E+00     0   433   124     0     0     0
   8
   455  0.73566869E-01     0   450   198     0     0     0
   455  0.30716825E+00     0   451   198     0     0     0
   455  0.13035957E-01     0   426   127     0     0     0
   455  0.13035957E-01     0   428   129     0     0     0
   455  0.28162457E-01     0   431   122     0     0     0
   455  0.28162453E-01     0   433   124     0     0     0
   455  0.29106104E+00     0   454   200     0     0     0
   455  0.24580702E+00     0   454   203     0     0     0
   5
   456  0.10374536E-01     0   450   199     0     0     0
   456  0.27988538E+00     0   432   121     0     0     0
   456  0.27988526E+00     0   434   123     0     0     0
   456  0.21492745E+00     0   425   128     0     0     0
   456  0.21492739E+00     0   427   130     0     0     0
   8
   457  0.73566869E-01     0   450   199     0     0     0
   457  0.30716825E+00     0   451   199     0     0     0
   457  0.13035957E-01     0   432   121     0     0     0
   457  0.13035957E-01     0   434   123     0     0     0
   457  0.28162457E-01     0   425   128     0     0     0
   457  0.28162453E-01     0   427   130     0     0     0
   457  0.29106104E+00     0   456   200     0     0     0
   457  0.24580702E+00     0   456   203     0     0     0
  28
   203  0.21322382E-03     0   123   129     0     0     0
   203  0.60966812E-01     0   125   131     0     0     0
   203  0.25644477E-02     0     3     9     0     0     0
   203  0.85109925E+00     0     5    11     0     0     0
   203  0.37276894E-01     0     4    10     0     0     0
   203  0.14724594E-02     0    59    59     0     0     0
   203  0.33270221E-01     0    13    13     0     0     0
   203  0.70843770E-03     0   198   121   128     0     0
   203  0.70843770E-03     0   198   123   130     0     0
   203  0.70843770E-03     0   198   125   132     0     0
   203  0.21253133E-02     0   198     8     1     0     0
   203  0.21253133E-02     0   198    10     3     0     0
   203  0.70843770E-03     0   199   127   122     0     0
   203  0.70843770E-03     0   199   129   124     0     0
   203  0.70843770E-03     0   199   131   126     0     0
   203  0.21253133E-02     0   199     2     7     0     0
   203  0.21253133E-02     0   199     4     9     0     0
   203  0.26319609E-04     0   200   122   128     0     0
   203  0.26319609E-04     0   200   124   130     0     0
   203  0.26319609E-04     0   200   126   132     0     0
   203  0.13246396E-04     0   200   121   127     0     0
   203  0.13246396E-04     0   200   123   129     0     0
   203  0.13246396E-04     0   200   125   131     0     0
   203  0.45381028E-04     0   200     2     8     0     0
   203  0.45381028E-04     0   200     4    10     0     0
   203  0.58461941E-04     0   200     1     7     0     0
   203  0.58461941E-04     0   200     3     9     0     0
   203  0.58461941E-04     0   200     5    11     0     0
  23
   204  0.15242983E-04     0   123   129     0     0     0
   204  0.43657431E-02     0   125   131     0     0     0
   204  0.17869110E-03     0     3     9     0     0     0
   204  0.44059817E-01     0     5    11     0     0     0
   204  0.36920002E+00     0     6    12     0     0     0
   204  0.21620898E-03     0    13    13     0     0     0
   204  0.89268322E-03     0   198   199     0     0     0
   204  0.45323995E-03     0   200   200     0     0     0
   204  0.15944833E-02     0   450   450     0     0     0
   204  0.95775574E-02     0   450   451     0     0     0
   204  0.60433470E-01     0   450   452     0     0     0
   204  0.11109353E-01     0   450   453     0     0     0
   204  0.11834484E-01     0   451   451     0     0     0
   204  0.14106137E+00     0   451   452     0     0     0
   204  0.67798952E-02     0   451   453     0     0     0
   204  0.26032897E-01     0   454   456     0     0     0
   204  0.15338606E+00     0   454   457     0     0     0
   204  0.15338606E+00     0   456   455     0     0     0
   204  0.38035710E-02     0   203   203     0     0     0
   204  0.17884703E-03     0   425   431     0     0     0
   204  0.17883234E-03     0   427   433     0     0     0
   204  0.63073728E-03     0   426   432     0     0     0
   204  0.63073728E-03     0   428   434     0     0     0
  17
   205  0.15256118E-04     0   123   129     0     0     0
   205  0.43695583E-02     0   125   131     0     0     0
   205  0.17885647E-03     0     3     9     0     0     0
   205  0.44142615E-01     0     5    11     0     0     0
   205  0.39510790E+00     0     6    12     0     0     0
   205  0.23074892E-03     0    13    13     0     0     0
   205  0.24915142E-02     0   450   450     0     0     0
   205  0.19188095E-01     0   450   451     0     0     0
   205  0.14035790E-01     0   450   452     0     0     0
   205  0.48766896E-01     0   450   453     0     0     0
   205  0.36059991E-01     0   451   451     0     0     0
   205  0.95649548E-02     0   451   452     0     0     0
   205  0.10221908E+00     0   451   453     0     0     0
   205  0.78371115E-01     0   454   456     0     0     0
   205  0.12219346E+00     0   454   457     0     0     0
   205  0.12219346E+00     0   456   455     0     0     0
   205  0.87070587E-03     0   203   200     0     0     0
  13
   206  0.16746053E-04     0   124   129     0     0     0
   206  0.47962968E-02     0   126   131     0     0     0
   206  0.18831251E-03     0     4     9     0     0     0
   206  0.38926196E+00     0     6    11     0     0     0
   206  0.29986134E-01     0   454   450     0     0     0
   206  0.51194198E-04     0   454   451     0     0     0
   206  0.17539741E+00     0   454   452     0     0     0
   206  0.16197899E+00     0   454   453     0     0     0
   206  0.57827245E-01     0   455   450     0     0     0
   206  0.17793734E+00     0   455   451     0     0     0
   206  0.96155459E-03     0   203   198     0     0     0
   206  0.79841004E-03     0   431   426     0     0     0
   206  0.79838693E-03     0   433   428     0     0     0
  13
   207  0.16746053E-04     0   130   123     0     0     0
   207  0.47962968E-02     0   132   125     0     0     0
   207  0.18831251E-03     0    10     3     0     0     0
   207  0.38926196E+00     0    12     5     0     0     0
   207  0.29986134E-01     0   456   450     0     0     0
   207  0.51194198E-04     0   456   451     0     0     0
   207  0.17539741E+00     0   456   452     0     0     0
   207  0.16197899E+00     0   456   453     0     0     0
   207  0.57827245E-01     0   457   450     0     0     0
   207  0.17793734E+00     0   457   451     0     0     0
   207  0.96155459E-03     0   203   199     0     0     0
   207  0.79841004E-03     0   425   432     0     0     0
   207  0.79838693E-03     0   427   434     0     0     0
   0
   5
     6  0.33333334E+00   100     2     7     5     0     0
     6  0.33333334E+00   100     4     9     5     0     0
     6  0.11111111E+00   100   122   127     5     0     0
     6  0.11111111E+00   100   124   129     5     0     0
     6  0.11111111E+00   100   126   131     5     0     0
   5
    12  0.33333334E+00   100     8     1    11     0     0
    12  0.33333334E+00   100    10     3    11     0     0
    12  0.11111111E+00   100   128   121    11     0     0
    12  0.11111111E+00   100   130   123    11     0     0
    12  0.11111111E+00   100   132   125    11     0     0
      4.00000000     -0.24957100
     -0.99620736      0.01873939     -0.07889351      0.03155358
     -0.03697127     -0.97401696      0.18593091     -0.12391016
      0.03241185     -0.04537006     -0.70344019     -0.70856410
      0.07178845     -0.22109115     -0.68145263      0.69396520
     -0.98399895      0.17817439     -0.17817439     -0.98399895
     -0.96390969      0.26622936     -0.26622936     -0.96390969
      1.57074499     -1.57079601     -1.57079482
    150.00000000   2400.00000000   2400.00000000
    600.00000000
    T
