  65
  401   3470.2539    0.22341E-25
  402   3469.3745    0.22316E-25
  403   3470.2539    0.22341E-25
  404   3469.3748    0.22316E-25
  405   3205.3398    0.12460E-25
  406   2739.0225    0.29114E-25
  407   3470.2539    0.22341E-25
  408   3469.3745    0.22316E-25
  409   3470.2539    0.22341E-25
  410   3469.3748    0.22316E-25
  411   3205.3398    0.12460E-25
  412   2739.0225    0.29114E-25
  413   3296.9731    0.39950E-24
  414   3314.7947    0.99204E-25
  415   3296.9634    0.39950E-24
  416   3314.7849    0.99204E-25
  417   3289.7390    0.25235E-24
  418   3220.2168    0.11804E-25
  419   3296.9731    0.39950E-24
  420   3314.7947    0.99204E-25
  421   3296.9634    0.39950E-24
  422   3314.7849    0.99204E-25
  423   3289.7390    0.25235E-24
  424   3220.2168    0.11804E-25
  425   1203.4053    0.12706E-23
  426   1200.8667    0.12631E-23
  427   1203.2854    0.12711E-23
  428   1200.7466    0.12636E-23
  429    679.5778    0.24860E-09
  430   1199.8453    0.94632E-24
  431   1203.4053    0.12706E-23
  432   1200.8667    0.12631E-23
  433   1203.2854    0.12711E-23
  434   1200.7466    0.12636E-23
  435    679.5778    0.24860E-09
  436   1199.8453    0.94632E-24
  437    683.4880    0.11073E-22
  438      0.0000    0.10000E+31
  439    685.5590    0.41160E-12
  440      0.0000    0.10000E+31
  441   1202.6667    0.93996E-24
  442      0.0000    0.10000E+31
  443    683.4880    0.11073E-22
  444      0.0000    0.10000E+31
  445    685.5590    0.41160E-12
  446      0.0000    0.10000E+31
  447   1202.6667    0.93996E-24
  448      0.0000    0.10000E+31
  449   3845.8999    0.94243E-26
  450    803.5620    0.69617E-24
  451   1486.8918    0.14723E-24
  452  -1977.6077    0.55599E-25
  453   1986.1979    0.53645E-25
  454   1487.0433    0.14712E-24
  455   1985.7977    0.53774E-25
  456   1487.0433    0.14712E-24
  457   1985.7977    0.53774E-25
  203    121.1641    0.12166E-21
  204   2274.7026    0.12859E-24
  205   2271.6201    0.12815E-24
  206   2275.9209    0.13905E-24
  207   2275.9209    0.13905E-24
  458      0.0000    0.10000E+31
    6    173.3000    0.56017E-24
   12    173.3000    0.56017E-24
   6
   401  0.15244155E-01     0   450     1     0     0     0
   401  0.32409146E+00     0   451     1     0     0     0
   401  0.53777523E-04     0   452     1     0     0     0
   401  0.41043172E-02     0   453     1     0     0     0
   401  0.64725685E+00     0   456     2     0     0     0
   401  0.92495102E-02     0   457     2     0     0     0
   6
   402  0.14518651E-01     0   450     2     0     0     0
   402  0.32505074E+00     0   451     2     0     0     0
   402  0.32381155E-04     0   452     2     0     0     0
   402  0.34643440E-02     0   453     2     0     0     0
   402  0.65086401E+00     0   454     1     0     0     0
   402  0.60699051E-02     0   455     1     0     0     0
   6
   403  0.15244159E-01     0   450     3     0     0     0
   403  0.32409155E+00     0   451     3     0     0     0
   403  0.53777534E-04     0   452     3     0     0     0
   403  0.41043181E-02     0   453     3     0     0     0
   403  0.64725673E+00     0   456     4     0     0     0
   403  0.92495056E-02     0   457     4     0     0     0
   6
   404  0.14518647E-01     0   450     4     0     0     0
   404  0.32505065E+00     0   451     4     0     0     0
   404  0.32381140E-04     0   452     4     0     0     0
   404  0.34643419E-02     0   453     4     0     0     0
   404  0.65086412E+00     0   454     3     0     0     0
   404  0.60699065E-02     0   455     3     0     0     0
   7
   405  0.79385657E-02     0   450     5     0     0     0
   405  0.15413347E+00     0   451     5     0     0     0
   405  0.28811914E-02     0   452     5     0     0     0
   405  0.42527770E-02     0   453     5     0     0     0
   405  0.30572826E+00     0   456     6     0     0     0
   405  0.31505209E+00     0   457     6     0     0     0
   405  0.21001361E+00     0   199   406     0     0     0
   6
   406  0.22292128E+00     0   450     6     0     0     0
   406  0.23858441E-01     0   451     6     0     0     0
   406  0.19627161E+00     0   452     6     0     0     0
   406  0.16068128E+00     0   453     6     0     0     0
   406  0.49040947E-01     0   454     5     0     0     0
   406  0.34722647E+00     0   455     5     0     0     0
   6
   407  0.15244155E-01     0   450     7     0     0     0
   407  0.32409146E+00     0   451     7     0     0     0
   407  0.53777523E-04     0   452     7     0     0     0
   407  0.41043172E-02     0   453     7     0     0     0
   407  0.64725685E+00     0   454     8     0     0     0
   407  0.92495102E-02     0   455     8     0     0     0
   6
   408  0.14518651E-01     0   450     8     0     0     0
   408  0.32505074E+00     0   451     8     0     0     0
   408  0.32381155E-04     0   452     8     0     0     0
   408  0.34643440E-02     0   453     8     0     0     0
   408  0.65086401E+00     0   456     7     0     0     0
   408  0.60699051E-02     0   457     7     0     0     0
   6
   409  0.15244159E-01     0   450     9     0     0     0
   409  0.32409155E+00     0   451     9     0     0     0
   409  0.53777534E-04     0   452     9     0     0     0
   409  0.41043181E-02     0   453     9     0     0     0
   409  0.64725673E+00     0   454    10     0     0     0
   409  0.92495056E-02     0   455    10     0     0     0
   6
   410  0.14518647E-01     0   450    10     0     0     0
   410  0.32505065E+00     0   451    10     0     0     0
   410  0.32381140E-04     0   452    10     0     0     0
   410  0.34643419E-02     0   453    10     0     0     0
   410  0.65086412E+00     0   456     9     0     0     0
   410  0.60699065E-02     0   457     9     0     0     0
   7
   411  0.79385657E-02     0   450    11     0     0     0
   411  0.15413347E+00     0   451    11     0     0     0
   411  0.28811914E-02     0   452    11     0     0     0
   411  0.42527770E-02     0   453    11     0     0     0
   411  0.30572826E+00     0   454    12     0     0     0
   411  0.31505209E+00     0   455    12     0     0     0
   411  0.21001361E+00     0   198   412     0     0     0
   6
   412  0.22292128E+00     0   450    12     0     0     0
   412  0.23858441E-01     0   451    12     0     0     0
   412  0.19627161E+00     0   452    12     0     0     0
   412  0.16068128E+00     0   453    12     0     0     0
   412  0.49040947E-01     0   456    11     0     0     0
   412  0.34722647E+00     0   457    11     0     0     0
   4
   413  0.99952698E+00     0   450     1     0     0     0
   413  0.27602850E-04     0   451     1     0     0     0
   413  0.40949828E-04     0   452     1     0     0     0
   413  0.40454965E-03     0   453     1     0     0     0
   4
   414  0.99952191E+00     0   450     2     0     0     0
   414  0.27716515E-04     0   451     2     0     0     0
   414  0.41388608E-04     0   452     2     0     0     0
   414  0.40895143E-03     0   453     2     0     0     0
   4
   415  0.99952692E+00     0   450     3     0     0     0
   415  0.27602786E-04     0   451     3     0     0     0
   415  0.40949588E-04     0   452     3     0     0     0
   415  0.40454717E-03     0   453     3     0     0     0
   4
   416  0.99952191E+00     0   450     4     0     0     0
   416  0.27716449E-04     0   451     4     0     0     0
   416  0.41388364E-04     0   452     4     0     0     0
   416  0.40894884E-03     0   453     4     0     0     0
   7
   417  0.62505531E+00     0   450     5     0     0     0
   417  0.69027417E-02     0   451     5     0     0     0
   417  0.65142475E-01     0   452     5     0     0     0
   417  0.70238836E-01     0   453     5     0     0     0
   417  0.13875349E-01     0   456     6     0     0     0
   417  0.18462946E+00     0   457     6     0     0     0
   417  0.34155857E-01     0   199   406     0     0     0
   8
   418  0.27456003E+00     0   454     5     0     0     0
   418  0.25008105E-01     0   455     5     0     0     0
   418  0.10536405E+00     0   200   406     0     0     0
   418  0.14194033E+00     0   203   406     0     0     0
   418  0.88086892E-02     0   450     6     0     0     0
   418  0.13634284E+00     0   451     6     0     0     0
   418  0.14545703E+00     0   452     6     0     0     0
   418  0.16251892E+00     0   453     6     0     0     0
   4
   419  0.99952698E+00     0   450     7     0     0     0
   419  0.27602850E-04     0   451     7     0     0     0
   419  0.40949828E-04     0   452     7     0     0     0
   419  0.40454965E-03     0   453     7     0     0     0
   4
   420  0.99952191E+00     0   450     8     0     0     0
   420  0.27716515E-04     0   451     8     0     0     0
   420  0.41388608E-04     0   452     8     0     0     0
   420  0.40895143E-03     0   453     8     0     0     0
   4
   421  0.99952692E+00     0   450     9     0     0     0
   421  0.27602786E-04     0   451     9     0     0     0
   421  0.40949588E-04     0   452     9     0     0     0
   421  0.40454717E-03     0   453     9     0     0     0
   4
   422  0.99952191E+00     0   450    10     0     0     0
   422  0.27716449E-04     0   451    10     0     0     0
   422  0.41388364E-04     0   452    10     0     0     0
   422  0.40894884E-03     0   453    10     0     0     0
   7
   423  0.62505531E+00     0   450    11     0     0     0
   423  0.69027417E-02     0   451    11     0     0     0
   423  0.65142475E-01     0   452    11     0     0     0
   423  0.70238836E-01     0   453    11     0     0     0
   423  0.13875349E-01     0   454    12     0     0     0
   423  0.18462946E+00     0   455    12     0     0     0
   423  0.34155857E-01     0   198   412     0     0     0
   8
   424  0.27456003E+00     0   456    11     0     0     0
   424  0.25008105E-01     0   457    11     0     0     0
   424  0.10536405E+00     0   200   412     0     0     0
   424  0.14194033E+00     0   203   412     0     0     0
   424  0.88086892E-02     0   450    12     0     0     0
   424  0.13634284E+00     0   451    12     0     0     0
   424  0.14545703E+00     0   452    12     0     0     0
   424  0.16251892E+00     0   453    12     0     0     0
   2
   425  0.89898247E+00     0   450   121     0     0     0
   425  0.10101766E+00     0   121   130     0     0     0
   2
   426  0.89979178E+00     0   450   122     0     0     0
   426  0.10020826E+00     0   129   121     0     0     0
   2
   427  0.89895338E+00     0   450   123     0     0     0
   427  0.10104679E+00     0   121   128     0     0     0
   2
   428  0.89976251E+00     0   450   124     0     0     0
   428  0.10023750E+00     0   127   121     0     0     0
   3
   429  0.33349649E-03     0   125   130     0     0     0
   429  0.49982983E+00     0   125   124     0     0     0
   429  0.49983668E+00     0   123   126     0     0     0
   2
   430  0.67168349E+00     0   450   126     0     0     0
   430  0.32831657E+00     0   198   429     0     0     0
   2
   431  0.89898247E+00     0   450   127     0     0     0
   431  0.10101766E+00     0   127   124     0     0     0
   2
   432  0.89979178E+00     0   450   128     0     0     0
   432  0.10020826E+00     0   123   127     0     0     0
   2
   433  0.89895338E+00     0   450   129     0     0     0
   433  0.10104679E+00     0   127   122     0     0     0
   2
   434  0.89976251E+00     0   450   130     0     0     0
   434  0.10023750E+00     0   121   127     0     0     0
   3
   435  0.33349649E-03     0   131   124     0     0     0
   435  0.49982983E+00     0   131   130     0     0     0
   435  0.49983668E+00     0   129   132     0     0     0
   2
   436  0.67168349E+00     0   450   132     0     0     0
   436  0.32831657E+00     0   199   435     0     0     0
   2
   437  0.50000000E+00     0   123   122     0     0     0
   437  0.50000000E+00     0   121   124     0     0     0
   0
   2
   439  0.41862741E+00     0   429   123   131     0     0
   439  0.58137262E+00     0   435   123   125     0     0
   0
   3
   441  0.66420043E+00     0   450   125     0     0     0
   441  0.16377264E+00     0   200   429     0     0     0
   441  0.17202696E+00     0   203   429     0     0     0
   0
   2
   443  0.50000000E+00     0   129   128     0     0     0
   443  0.50000000E+00     0   127   130     0     0     0
   0
   2
   445  0.41862741E+00     0   435   129   125     0     0
   445  0.58137262E+00     0   429   129   131     0     0
   0
   3
   447  0.66420043E+00     0   450   131     0     0     0
   447  0.16377264E+00     0   200   435     0     0     0
   447  0.17202696E+00     0   203   435     0     0     0
   0
  24
   449  0.19315403E-01     0   408     2     0     0     0
   449  0.19315403E-01     0   402     8     0     0     0
   449  0.19229921E-01     0   407     1     0     0     0
   449  0.19229921E-01     0   401     7     0     0     0
   449  0.36823541E-01     0   420     2     0     0     0
   449  0.36823541E-01     0   414     8     0     0     0
   449  0.39140727E-01     0   419     1     0     0     0
   449  0.39140727E-01     0   413     7     0     0     0
   449  0.19229921E-01     0   409     3     0     0     0
   449  0.19229921E-01     0   403     9     0     0     0
   449  0.39142009E-01     0   421     3     0     0     0
   449  0.39142009E-01     0   415     9     0     0     0
   449  0.19315278E-01     0   410     4     0     0     0
   449  0.19315278E-01     0   404    10     0     0     0
   449  0.36824703E-01     0   422     4     0     0     0
   449  0.36824703E-01     0   416    10     0     0     0
   449  0.51876873E-01     0   411     5     0     0     0
   449  0.51876873E-01     0   405    11     0     0     0
   449  0.40151063E-01     0   423     5     0     0     0
   449  0.40151063E-01     0   417    11     0     0     0
   449  0.12611480E+00     0   412     6     0     0     0
   449  0.12611480E+00     0   406    12     0     0     0
   449  0.52835789E-01     0   424     6     0     0     0
   449  0.52835789E-01     0   418    12     0     0     0
   6
   450  0.16511014E+00     0   437   127     0     0     0
   450  0.16511014E+00     0   443   121     0     0     0
   450  0.15990835E+00     0   439   129     0     0     0
   450  0.15990835E+00     0   445   123     0     0     0
   450  0.17498153E+00     0   429   131     0     0     0
   450  0.17498153E+00     0   435   125     0     0     0
  20
   451  0.23527951E-03     0   450   200     0     0     0
   451  0.59109018E-02     0   450   203     0     0     0
   451  0.82441948E-01     0   425   127     0     0     0
   451  0.82441948E-01     0   431   121     0     0     0
   451  0.82504340E-01     0   427   129     0     0     0
   451  0.82504340E-01     0   433   123     0     0     0
   451  0.20236550E-04     0   437   127     0     0     0
   451  0.20236550E-04     0   443   121     0     0     0
   451  0.20170790E-04     0   439   129     0     0     0
   451  0.20170790E-04     0   445   123     0     0     0
   451  0.74002636E-03     0   429   131     0     0     0
   451  0.74002636E-03     0   435   125     0     0     0
   451  0.82742363E-01     0   441   131     0     0     0
   451  0.82742363E-01     0   447   125     0     0     0
   451  0.82622647E-01     0   426   128     0     0     0
   451  0.82622647E-01     0   432   122     0     0     0
   451  0.82684681E-01     0   428   130     0     0     0
   451  0.82684681E-01     0   434   124     0     0     0
   451  0.83150543E-01     0   430   132     0     0     0
   451  0.83150543E-01     0   436   126     0     0     0
  24
   452  0.29004908E+00     0   454   199     0     0     0
   452  0.29004908E+00     0   456   198     0     0     0
   452  0.11372771E+00     0   450   200     0     0     0
   452  0.28279200E+00     0   451   200     0     0     0
   452  0.10946475E-01     0   450   203     0     0     0
   452  0.29678659E-02     0   451   203     0     0     0
   452  0.10156869E-04     0   425   127     0     0     0
   452  0.10156869E-04     0   431   121     0     0     0
   452  0.10159249E-04     0   427   129     0     0     0
   452  0.10159249E-04     0   433   123     0     0     0
   452  0.29100504E-04     0   437   127     0     0     0
   452  0.29100504E-04     0   443   121     0     0     0
   452  0.29052610E-04     0   439   129     0     0     0
   452  0.29052610E-04     0   445   123     0     0     0
   452  0.29669036E-02     0   429   131     0     0     0
   452  0.29669036E-02     0   435   125     0     0     0
   452  0.15388778E-02     0   441   131     0     0     0
   452  0.15388778E-02     0   447   125     0     0     0
   452  0.49874729E-04     0   426   128     0     0     0
   452  0.49874729E-04     0   432   122     0     0     0
   452  0.49886381E-04     0   428   130     0     0     0
   452  0.49886381E-04     0   434   124     0     0     0
   452  0.49973842E-04     0   430   132     0     0     0
   452  0.49973842E-04     0   436   126     0     0     0
  24
   453  0.28749213E+00     0   454   199     0     0     0
   453  0.28749213E+00     0   456   198     0     0     0
   453  0.10723821E-01     0   450   200     0     0     0
   453  0.32739085E-02     0   451   200     0     0     0
   453  0.10674165E+00     0   450   203     0     0     0
   453  0.26610124E+00     0   451   203     0     0     0
   453  0.17596942E-02     0   425   127     0     0     0
   453  0.17596942E-02     0   431   121     0     0     0
   453  0.17601007E-02     0   427   129     0     0     0
   453  0.17601007E-02     0   433   123     0     0     0
   453  0.28199566E-03     0   437   127     0     0     0
   453  0.28199566E-03     0   443   121     0     0     0
   453  0.28153611E-03     0   439   129     0     0     0
   453  0.28153611E-03     0   445   123     0     0     0
   453  0.28959953E-02     0   429   131     0     0     0
   453  0.28959953E-02     0   435   125     0     0     0
   453  0.33096010E-02     0   441   131     0     0     0
   453  0.33096010E-02     0   447   125     0     0     0
   453  0.29307648E-02     0   426   128     0     0     0
   453  0.29307648E-02     0   432   122     0     0     0
   453  0.29314407E-02     0   428   130     0     0     0
   453  0.29314407E-02     0   434   124     0     0     0
   453  0.29365101E-02     0   430   132     0     0     0
   453  0.29365101E-02     0   436   126     0     0     0
   8
   454  0.61060293E-02     0   450   198     0     0     0
   454  0.16699959E+00     0   426   127     0     0     0
   454  0.16712487E+00     0   428   129     0     0     0
   454  0.16813619E+00     0   430   131     0     0     0
   454  0.16318309E+00     0   431   122     0     0     0
   454  0.16330649E+00     0   433   124     0     0     0
   454  0.14369723E-02     0   435   126     0     0     0
   454  0.16370672E+00     0   447   126     0     0     0
  11
   455  0.11632056E+00     0   450   198     0     0     0
   455  0.29013783E+00     0   451   198     0     0     0
   455  0.37253289E-02     0   426   127     0     0     0
   455  0.37261886E-02     0   428   129     0     0     0
   455  0.66396664E-02     0   430   131     0     0     0
   455  0.56384117E-02     0   431   122     0     0     0
   455  0.56397151E-02     0   433   124     0     0     0
   455  0.52537392E-02     0   435   126     0     0     0
   455  0.58538867E-02     0   447   126     0     0     0
   455  0.28572088E+00     0   454   200     0     0     0
   455  0.27134404E+00     0   454   203     0     0     0
   8
   456  0.61060293E-02     0   450   199     0     0     0
   456  0.16699959E+00     0   432   121     0     0     0
   456  0.16712487E+00     0   434   123     0     0     0
   456  0.16813619E+00     0   436   125     0     0     0
   456  0.16318309E+00     0   425   128     0     0     0
   456  0.16330649E+00     0   427   130     0     0     0
   456  0.14369723E-02     0   429   132     0     0     0
   456  0.16370672E+00     0   441   132     0     0     0
  11
   457  0.11632056E+00     0   450   199     0     0     0
   457  0.29013783E+00     0   451   199     0     0     0
   457  0.37253289E-02     0   432   121     0     0     0
   457  0.37261886E-02     0   434   123     0     0     0
   457  0.66396664E-02     0   436   125     0     0     0
   457  0.56384117E-02     0   425   128     0     0     0
   457  0.56397151E-02     0   427   130     0     0     0
   457  0.52537392E-02     0   429   132     0     0     0
   457  0.58538867E-02     0   441   132     0     0     0
   457  0.28572088E+00     0   456   200     0     0     0
   457  0.27134404E+00     0   456   203     0     0     0
  28
   203  0.16369094E-03     0   123   129     0     0     0
   203  0.46823315E-01     0   125   131     0     0     0
   203  0.19645635E-02     0     3     9     0     0     0
   203  0.77114284E+00     0     5    11     0     0     0
   203  0.38448941E-01     0     4    10     0     0     0
   203  0.17239781E-02     0    59    59     0     0     0
   203  0.34399744E-01     0    13    13     0     0     0
   203  0.53597325E-02     0   198   121   128     0     0
   203  0.53597325E-02     0   198   123   130     0     0
   203  0.53597325E-02     0   198   125   132     0     0
   203  0.16079199E-01     0   198     8     1     0     0
   203  0.16079199E-01     0   198    10     3     0     0
   203  0.53597325E-02     0   199   127   122     0     0
   203  0.53597325E-02     0   199   129   124     0     0
   203  0.53597325E-02     0   199   131   126     0     0
   203  0.16079199E-01     0   199     2     7     0     0
   203  0.16079199E-01     0   199     4     9     0     0
   203  0.60577394E-03     0   200   122   128     0     0
   203  0.60577394E-03     0   200   124   130     0     0
   203  0.60577394E-03     0   200   126   132     0     0
   203  0.30487991E-03     0   200   121   127     0     0
   203  0.30487991E-03     0   200   123   129     0     0
   203  0.30487991E-03     0   200   125   131     0     0
   203  0.10444928E-02     0   200     2     8     0     0
   203  0.10444928E-02     0   200     4    10     0     0
   203  0.13455640E-02     0   200     1     7     0     0
   203  0.13455640E-02     0   200     3     9     0     0
   203  0.13455640E-02     0   200     5    11     0     0
  16
   204  0.14351592E-03     0   123   129     0     0     0
   204  0.41105013E-01     0   125   131     0     0     0
   204  0.16719371E-02     0     3     9     0     0     0
   204  0.45457911E+00     0     5    11     0     0     0
   204  0.11552664E-04     0     4    10     0     0     0
   204  0.49592870E+00     0     6    12     0     0     0
   204  0.12072440E-03     0    13    13     0     0     0
   204  0.26950304E-03     0   198   199     0     0     0
   204  0.13514519E-03     0   200   200     0     0     0
   204  0.26336362E-03     0   450   450     0     0     0
   204  0.74684439E-03     0   203   203     0     0     0
   204  0.29104656E-04     0   437   443     0     0     0
   204  0.29047156E-04     0   439   445     0     0     0
   204  0.68911024E-04     0   429   435     0     0     0
   204  0.24488040E-02     0   429   447     0     0     0
   204  0.24488040E-02     0   441   435     0     0     0
  11
   205  0.14286098E-03     0   123   129     0     0     0
   205  0.40917527E-01     0   125   131     0     0     0
   205  0.16643232E-02     0     3     9     0     0     0
   205  0.45257896E+00     0     5    11     0     0     0
   205  0.11408246E-04     0     4    10     0     0     0
   205  0.49865627E+00     0     6    12     0     0     0
   205  0.16403498E-03     0    13    13     0     0     0
   205  0.71674987E-03     0   450   450     0     0     0
   205  0.26658076E-03     0   203   200     0     0     0
   205  0.24406363E-02     0   429   447     0     0     0
   205  0.24406363E-02     0   441   435     0     0     0
   6
   206  0.15530692E-03     0   124   129     0     0     0
   206  0.44482227E-01     0   126   131     0     0     0
   206  0.16850213E-02     0     4     9     0     0     0
   206  0.94800794E+00     0     6    11     0     0     0
   206  0.29049715E-03     0   203   198     0     0     0
   206  0.53789145E-02     0   435   430     0     0     0
   6
   207  0.15530692E-03     0   130   123     0     0     0
   207  0.44482227E-01     0   132   125     0     0     0
   207  0.16850213E-02     0    10     3     0     0     0
   207  0.94800794E+00     0    12     5     0     0     0
   207  0.29049715E-03     0   203   199     0     0     0
   207  0.53789145E-02     0   429   436     0     0     0
   0
   5
     6  0.33333334E+00   100     2     7     5     0     0
     6  0.33333334E+00   100     4     9     5     0     0
     6  0.11111111E+00   100   122   127     5     0     0
     6  0.11111111E+00   100   124   129     5     0     0
     6  0.11111111E+00   100   126   131     5     0     0
   5
    12  0.33333334E+00   100     8     1    11     0     0
    12  0.33333334E+00   100    10     3    11     0     0
    12  0.11111111E+00   100   128   121    11     0     0
    12  0.11111111E+00   100   130   123    11     0     0
    12  0.11111111E+00   100   132   125    11     0     0
      6.67424011     -0.14932266
      0.99949586     -0.00216542      0.02805462     -0.01471184
     -0.00620181     -0.99143392      0.10134334     -0.08215617
      0.00939921     -0.01370151     -0.70679229     -0.70722610
     -0.02968802      0.12986958      0.69956231     -0.70204341
     -0.99319756      0.11644131     -0.11644131     -0.99319756
     -0.98963535      0.14360322     -0.14360322     -0.98963535
     -1.40444136     -0.07050765     -1.54497147
  -2985.65991211   -176.48199463  -1360.56994629
   1976.70996094
    F
  0.00000000E+00  0.00000000E+00  0.00000000E+00  0.46751902E-01 -0.15647401E-21  0.00000000E+00  0.00000000E+00  0.00000000E+00 -0.90463701E-21 -0.46751902E-01  0.15647401E-21 -0.00000000E+00  0.00000000E+00  0.00000000E+00  0.00000000E+00  0.00000000E+00  0.00000000E+00  0.98969704E-08 -0.00000000E+00 -0.00000000E+00  0.90463701E-21 -0.00000000E+00 -0.00000000E+00 -0.98969704E-08  0.00000000E+00  0.00000000E+00  0.00000000E+00
 -0.13827100E-23  0.00000000E+00  0.00000000E+00  0.00000000E+00 -0.30274001E-22  0.00000000E+00  0.00000000E+00  0.00000000E+00 -0.12856200E-20  0.15127200E-10 -0.48146700E-35  0.00000000E+00 -0.22615000E-36  0.33120601E-09  0.00000000E+00  0.00000000E+00  0.00000000E+00  0.14065100E-07  0.00000000E+00  0.00000000E+00  0.00000000E+00  0.00000000E+00  0.00000000E+00  0.00000000E+00  0.00000000E+00  0.00000000E+00  0.00000000E+00
  0.00000000E+00  0.00000000E+00  0.00000000E+00  0.00000000E+00  0.00000000E+00  0.00000000E+00  0.00000000E+00  0.00000000E+00  0.00000000E+00  0.00000000E+00  0.00000000E+00  0.00000000E+00  0.00000000E+00  0.00000000E+00  0.00000000E+00  0.00000000E+00  0.00000000E+00  0.00000000E+00  0.00000000E+00  0.00000000E+00  0.00000000E+00  0.00000000E+00  0.00000000E+00  0.00000000E+00  0.00000000E+00  0.00000000E+00  0.00000000E+00
