  65
  401    305.1227    0.55379E-24
  402    295.7487    0.61043E-24
  403    305.1228    0.55383E-24
  404    295.7518    0.61043E-24
  405   3000.0916    0.30995E-24
  406   3002.5991    0.83831E-26
  407    305.1227    0.55379E-24
  408    295.7487    0.61043E-24
  409    305.1228    0.55383E-24
  410    295.7518    0.61043E-24
  411   3000.0916    0.30995E-24
  412   3002.5991    0.83831E-26
  413    300.9438    0.49701E-23
  414    298.1035    0.12604E-23
  415    300.9439    0.49701E-23
  416    298.1065    0.12605E-23
  417   3000.5220    0.89141E-26
  418   3002.8484    0.89011E-26
  419    300.9438    0.49701E-23
  420    298.1035    0.12604E-23
  421    300.9439    0.49701E-23
  422    298.1065    0.12605E-23
  423   3000.5220    0.89141E-26
  424   3002.8484    0.89011E-26
  425    150.0129    0.14057E-22
  426    129.8895    0.20250E-22
  427    150.0120    0.14057E-22
  428    129.8884    0.20252E-22
  429    149.7700    0.28717E-23
  430    129.8895    0.20250E-22
  431    150.0129    0.14057E-22
  432    129.8895    0.20250E-22
  433    150.0120    0.14057E-22
  434    129.8884    0.20252E-22
  435    149.7700    0.28717E-23
  436    129.8895    0.20250E-22
  437    150.0079    0.28486E-23
  438      0.0000    0.10000E+31
  439    150.0079    0.28486E-23
  440      0.0000    0.10000E+31
  441    150.2706    0.13946E-22
  442      0.0000    0.10000E+31
  443    150.0079    0.28486E-23
  444      0.0000    0.10000E+31
  445    150.0079    0.28486E-23
  446      0.0000    0.10000E+31
  447    150.2706    0.13946E-22
  448      0.0000    0.10000E+31
  449   3000.0000    0.13502E-26
  450    100.0020    0.10000E+31
  451    199.9255    0.54831E-24
  452   -453.5255    0.19133E-24
  453    472.5888    0.13765E-24
  454    199.2941    0.53666E-24
  455    471.3403    0.13825E-24
  456    199.2941    0.53666E-24
  457    471.3403    0.13825E-24
  203    106.8545    0.17588E-21
  204   1007.6987    0.55059E-25
  205   1000.0000    0.55928E-25
  206   1011.4158    0.56093E-25
  207   1011.4158    0.56093E-25
  458      0.0000    0.10000E+31
    6    172.5000    0.57395E-24
   12    172.5000    0.57395E-24
   3
   401  0.47853664E-01     0   450     1     0     0     0
   401  0.31522736E+00     0   451     1     0     0     0
   401  0.63691902E+00     0   456     2     0     0     0
   3
   402  0.14646483E-01     0   450     2     0     0     0
   402  0.32545882E+00     0   451     2     0     0     0
   402  0.65989459E+00     0   454     1     0     0     0
   3
   403  0.47857273E-01     0   450     3     0     0     0
   403  0.31525138E+00     0   451     3     0     0     0
   403  0.63689137E+00     0   456     4     0     0     0
   3
   404  0.14645970E-01     0   450     4     0     0     0
   404  0.32542831E+00     0   451     4     0     0     0
   404  0.65992576E+00     0   454     3     0     0     0
   6
   405  0.78297800E+00     0   450     5     0     0     0
   405  0.10897973E-01     0   451     5     0     0     0
   405  0.51442739E-01     0   452     5     0     0     0
   405  0.53114902E-01     0   453     5     0     0     0
   405  0.10919372E-01     0   456     6     0     0     0
   405  0.90646997E-01     0   457     6     0     0     0
   6
   406  0.85254669E-01     0   450     6     0     0     0
   406  0.95728841E-02     0   451     6     0     0     0
   406  0.23000672E+00     0   452     6     0     0     0
   406  0.21694505E+00     0   453     6     0     0     0
   406  0.19552298E-01     0   454     5     0     0     0
   406  0.43866840E+00     0   455     5     0     0     0
   3
   407  0.47853664E-01     0   450     7     0     0     0
   407  0.31522736E+00     0   451     7     0     0     0
   407  0.63691902E+00     0   454     8     0     0     0
   3
   408  0.14646483E-01     0   450     8     0     0     0
   408  0.32545882E+00     0   451     8     0     0     0
   408  0.65989459E+00     0   456     7     0     0     0
   3
   409  0.47857273E-01     0   450     9     0     0     0
   409  0.31525138E+00     0   451     9     0     0     0
   409  0.63689137E+00     0   454    10     0     0     0
   3
   410  0.14645970E-01     0   450    10     0     0     0
   410  0.32542831E+00     0   451    10     0     0     0
   410  0.65992576E+00     0   456     9     0     0     0
   6
   411  0.78297800E+00     0   450    11     0     0     0
   411  0.10897973E-01     0   451    11     0     0     0
   411  0.51442739E-01     0   452    11     0     0     0
   411  0.53114902E-01     0   453    11     0     0     0
   411  0.10919372E-01     0   454    12     0     0     0
   411  0.90646997E-01     0   455    12     0     0     0
   6
   412  0.85254669E-01     0   450    12     0     0     0
   412  0.95728841E-02     0   451    12     0     0     0
   412  0.23000672E+00     0   452    12     0     0     0
   412  0.21694505E+00     0   453    12     0     0     0
   412  0.19552298E-01     0   456    11     0     0     0
   412  0.43866840E+00     0   457    11     0     0     0
   2
   413  0.99707389E+00     0   450     1     0     0     0
   413  0.29261068E-02     0   451     1     0     0     0
   2
   414  0.99714798E+00     0   450     2     0     0     0
   414  0.28520105E-02     0   451     2     0     0     0
   2
   415  0.99707389E+00     0   450     3     0     0     0
   415  0.29261096E-02     0   451     3     0     0     0
   2
   416  0.99714810E+00     0   450     4     0     0     0
   416  0.28518534E-02     0   451     4     0     0     0
   6
   417  0.95271859E-02     0   450     5     0     0     0
   417  0.15200317E+00     0   451     5     0     0     0
   417  0.22392583E-02     0   452     5     0     0     0
   417  0.13898370E-01     0   453     5     0     0     0
   417  0.32136399E+00     0   456     6     0     0     0
   417  0.50096804E+00     0   457     6     0     0     0
   6
   418  0.32527104E+00     0   454     5     0     0     0
   418  0.15970103E-01     0   455     5     0     0     0
   418  0.41013774E-02     0   450     6     0     0     0
   418  0.16975795E+00     0   451     6     0     0     0
   418  0.24475975E+00     0   452     6     0     0     0
   418  0.24013986E+00     0   453     6     0     0     0
   2
   419  0.99707389E+00     0   450     7     0     0     0
   419  0.29261068E-02     0   451     7     0     0     0
   2
   420  0.99714798E+00     0   450     8     0     0     0
   420  0.28520105E-02     0   451     8     0     0     0
   2
   421  0.99707389E+00     0   450     9     0     0     0
   421  0.29261096E-02     0   451     9     0     0     0
   2
   422  0.99714810E+00     0   450    10     0     0     0
   422  0.28518534E-02     0   451    10     0     0     0
   6
   423  0.95271859E-02     0   450    11     0     0     0
   423  0.15200317E+00     0   451    11     0     0     0
   423  0.22392583E-02     0   452    11     0     0     0
   423  0.13898370E-01     0   453    11     0     0     0
   423  0.32136399E+00     0   454    12     0     0     0
   423  0.50096804E+00     0   455    12     0     0     0
   6
   424  0.32527104E+00     0   456    11     0     0     0
   424  0.15970103E-01     0   457    11     0     0     0
   424  0.41013774E-02     0   450    12     0     0     0
   424  0.16975795E+00     0   451    12     0     0     0
   424  0.24475975E+00     0   452    12     0     0     0
   424  0.24013986E+00     0   453    12     0     0     0
   1
   425  0.10000000E+01     0   450   121     0     0     0
   1
   426  0.10000000E+01     0   450   122     0     0     0
   1
   427  0.10000000E+01     0   450   123     0     0     0
   1
   428  0.10000000E+01     0   450   124     0     0     0
   1
   429  0.10000000E+01     0   450   125     0     0     0
   1
   430  0.10000000E+01     0   450   126     0     0     0
   1
   431  0.10000000E+01     0   450   127     0     0     0
   1
   432  0.10000000E+01     0   450   128     0     0     0
   1
   433  0.10000000E+01     0   450   129     0     0     0
   1
   434  0.10000000E+01     0   450   130     0     0     0
   1
   435  0.10000000E+01     0   450   131     0     0     0
   1
   436  0.10000000E+01     0   450   132     0     0     0
   1
   437  0.10000000E+01     0   450   121     0     0     0
   0
   1
   439  0.10000000E+01     0   450   123     0     0     0
   0
   1
   441  0.10000000E+01     0   450   125     0     0     0
   0
   1
   443  0.10000000E+01     0   450   127     0     0     0
   0
   1
   445  0.10000000E+01     0   450   129     0     0     0
   0
   1
   447  0.10000000E+01     0   450   131     0     0     0
   0
  26
   449  0.13530314E-03     0   454     5    12     0     0
   449  0.13530314E-03     0   456     6    11     0     0
   449  0.27132547E-03     0   455     5    12     0     0
   449  0.27132547E-03     0   457     6    11     0     0
   449  0.16078682E-04     0   450     5    11     0     0
   449  0.31567924E-04     0   450     6    12     0     0
   449  0.77375145E-04     0   451     5    11     0     0
   449  0.56806490E-04     0   451     6    12     0     0
   449  0.21369332E-03     0   452     6    12     0     0
   449  0.23131659E-03     0   453     6    12     0     0
   449  0.62445492E-01     0   408     2     0     0     0
   449  0.62445492E-01     0   402     8     0     0     0
   449  0.62366582E-01     0   407     1     0     0     0
   449  0.62366582E-01     0   401     7     0     0     0
   449  0.62425893E-01     0   420     2     0     0     0
   449  0.62425893E-01     0   414     8     0     0     0
   449  0.62402066E-01     0   419     1     0     0     0
   449  0.62402066E-01     0   413     7     0     0     0
   449  0.62366582E-01     0   409     3     0     0     0
   449  0.62366582E-01     0   403     9     0     0     0
   449  0.62402062E-01     0   421     3     0     0     0
   449  0.62402062E-01     0   415     9     0     0     0
   449  0.62445473E-01     0   410     4     0     0     0
   449  0.62445473E-01     0   404    10     0     0     0
   449  0.62425874E-01     0   422     4     0     0     0
   449  0.62425874E-01     0   416    10     0     0     0
   0
  19
   451  0.29028160E-03     0   450   200     0     0     0
   451  0.68150334E-01     0   425   127     0     0     0
   451  0.68150334E-01     0   431   121     0     0     0
   451  0.68152331E-01     0   427   129     0     0     0
   451  0.68152331E-01     0   433   123     0     0     0
   451  0.59053459E-03     0   437   127     0     0     0
   451  0.59053459E-03     0   443   121     0     0     0
   451  0.59053290E-03     0   439   129     0     0     0
   451  0.59053290E-03     0   445   123     0     0     0
   451  0.61109546E-03     0   429   131     0     0     0
   451  0.61109546E-03     0   435   125     0     0     0
   451  0.67648903E-01     0   441   131     0     0     0
   451  0.67648903E-01     0   447   125     0     0     0
   451  0.98036237E-01     0   426   128     0     0     0
   451  0.98036237E-01     0   432   122     0     0     0
   451  0.98038658E-01     0   428   130     0     0     0
   451  0.98038658E-01     0   434   124     0     0     0
   451  0.98036237E-01     0   430   132     0     0     0
   451  0.98036237E-01     0   436   126     0     0     0
  40
   452  0.30016395E+00     0   454   199     0     0     0
   452  0.30016395E+00     0   456   198     0     0     0
   452  0.99412411E-01     0   450   200     0     0     0
   452  0.24675889E+00     0   451   200     0     0     0
   452  0.13505551E-01     0   450   203     0     0     0
   452  0.12191144E-01     0   451   203     0     0     0
   452  0.82575885E-03     0   402     8     0     0     0
   452  0.82575885E-03     0   408     2     0     0     0
   452  0.12178373E-02     0   401     7     0     0     0
   452  0.12178373E-02     0   407     1     0     0     0
   452  0.12178357E-02     0   403     9     0     0     0
   452  0.12178357E-02     0   409     3     0     0     0
   452  0.82571473E-03     0   404    10     0     0     0
   452  0.82571473E-03     0   410     4     0     0     0
   452  0.24422604E-03     0   414     8     0     0     0
   452  0.24422604E-03     0   420     2     0     0     0
   452  0.59290876E-04     0   413     7     0     0     0
   452  0.59290876E-04     0   419     1     0     0     0
   452  0.59290793E-04     0   415     9     0     0     0
   452  0.59290793E-04     0   421     3     0     0     0
   452  0.24421266E-03     0   416    10     0     0     0
   452  0.24421266E-03     0   422     4     0     0     0
   452  0.34721222E-03     0   425   127     0     0     0
   452  0.34721222E-03     0   431   121     0     0     0
   452  0.34721324E-03     0   427   129     0     0     0
   452  0.34721324E-03     0   433   123     0     0     0
   452  0.45039281E-03     0   437   127     0     0     0
   452  0.45039281E-03     0   443   121     0     0     0
   452  0.45039275E-03     0   439   129     0     0     0
   452  0.45039275E-03     0   445   123     0     0     0
   452  0.13280426E-02     0   429   131     0     0     0
   452  0.13280426E-02     0   435   125     0     0     0
   452  0.12214767E-02     0   441   131     0     0     0
   452  0.12214767E-02     0   447   125     0     0     0
   452  0.16876841E-02     0   426   128     0     0     0
   452  0.16876841E-02     0   432   122     0     0     0
   452  0.16876891E-02     0   428   130     0     0     0
   452  0.16876891E-02     0   434   124     0     0     0
   452  0.16876841E-02     0   430   132     0     0     0
   452  0.16876841E-02     0   436   126     0     0     0
  40
   453  0.23852769E+00     0   454   199     0     0     0
   453  0.23852769E+00     0   456   198     0     0     0
   453  0.11463427E-01     0   450   200     0     0     0
   453  0.12400270E-01     0   451   200     0     0     0
   453  0.59544869E-01     0   450   203     0     0     0
   453  0.15151274E+00     0   451   203     0     0     0
   453  0.13489057E-01     0   402     8     0     0     0
   453  0.13489057E-01     0   408     2     0     0     0
   453  0.16414985E-01     0   401     7     0     0     0
   453  0.16414985E-01     0   407     1     0     0     0
   453  0.16414968E-01     0   403     9     0     0     0
   453  0.16414968E-01     0   409     3     0     0     0
   453  0.13488465E-01     0   404    10     0     0     0
   453  0.13488465E-01     0   410     4     0     0     0
   453  0.12025894E-02     0   414     8     0     0     0
   453  0.12025894E-02     0   420     2     0     0     0
   453  0.29308733E-03     0   413     7     0     0     0
   453  0.29308733E-03     0   419     1     0     0     0
   453  0.29308698E-03     0   415     9     0     0     0
   453  0.29308698E-03     0   421     3     0     0     0
   453  0.12025352E-02     0   416    10     0     0     0
   453  0.12025352E-02     0   422     4     0     0     0
   453  0.70835892E-02     0   425   127     0     0     0
   453  0.70835892E-02     0   431   121     0     0     0
   453  0.70836088E-02     0   427   129     0     0     0
   453  0.70836088E-02     0   433   123     0     0     0
   453  0.20118230E-02     0   437   127     0     0     0
   453  0.20118230E-02     0   443   121     0     0     0
   453  0.20118225E-02     0   439   129     0     0     0
   453  0.20118225E-02     0   445   123     0     0     0
   453  0.25988377E-02     0   429   131     0     0     0
   453  0.25988377E-02     0   435   125     0     0     0
   453  0.76467325E-02     0   441   131     0     0     0
   453  0.76467325E-02     0   447   125     0     0     0
   453  0.17592162E-01     0   426   128     0     0     0
   453  0.17592162E-01     0   432   122     0     0     0
   453  0.17592210E-01     0   428   130     0     0     0
   453  0.17592210E-01     0   434   124     0     0     0
   453  0.17592162E-01     0   430   132     0     0     0
   453  0.17592162E-01     0   436   126     0     0     0
   8
   454  0.40467381E-02     0   450   198     0     0     0
   454  0.21702777E+00     0   426   127     0     0     0
   454  0.21703301E+00     0   428   129     0     0     0
   454  0.21735728E+00     0   430   131     0     0     0
   454  0.11517040E+00     0   431   122     0     0     0
   454  0.11517400E+00     0   433   124     0     0     0
   454  0.53824631E-04     0   435   126     0     0     0
   454  0.11413698E+00     0   447   126     0     0     0
  15
   455  0.50424844E-01     0   450   198     0     0     0
   455  0.25904760E+00     0   451   198     0     0     0
   455  0.18857639E-01     0   402     7     0     0     0
   455  0.43708064E-01     0   407     2     0     0     0
   455  0.18857125E-01     0   404     9     0     0     0
   455  0.47604252E-01     0   409     4     0     0     0
   455  0.14601731E-01     0   426   127     0     0     0
   455  0.14601772E-01     0   428   129     0     0     0
   455  0.15809476E-01     0   430   131     0     0     0
   455  0.34867227E-01     0   431   122     0     0     0
   455  0.34867320E-01     0   433   124     0     0     0
   455  0.12099149E-02     0   435   126     0     0     0
   455  0.34840271E-01     0   447   126     0     0     0
   455  0.23109701E+00     0   454   200     0     0     0
   455  0.17960568E+00     0   454   203     0     0     0
   8
   456  0.40467381E-02     0   450   199     0     0     0
   456  0.21702777E+00     0   432   121     0     0     0
   456  0.21703301E+00     0   434   123     0     0     0
   456  0.21735728E+00     0   436   125     0     0     0
   456  0.11517040E+00     0   425   128     0     0     0
   456  0.11517400E+00     0   427   130     0     0     0
   456  0.53824631E-04     0   429   132     0     0     0
   456  0.11413698E+00     0   441   132     0     0     0
  15
   457  0.50424844E-01     0   450   199     0     0     0
   457  0.25904760E+00     0   451   199     0     0     0
   457  0.18857639E-01     0   408     1     0     0     0
   457  0.43708064E-01     0   401     8     0     0     0
   457  0.18857125E-01     0   410     3     0     0     0
   457  0.47604252E-01     0   403    10     0     0     0
   457  0.14601731E-01     0   432   121     0     0     0
   457  0.14601772E-01     0   434   123     0     0     0
   457  0.15809476E-01     0   436   125     0     0     0
   457  0.34867227E-01     0   425   128     0     0     0
   457  0.34867320E-01     0   427   130     0     0     0
   457  0.12099149E-02     0   429   132     0     0     0
   457  0.34840271E-01     0   441   132     0     0     0
   457  0.23109701E+00     0   456   200     0     0     0
   457  0.17960568E+00     0   456   203     0     0     0
  28
   203  0.21259545E-03     0   123   129     0     0     0
   203  0.60789939E-01     0   125   131     0     0     0
   203  0.25563508E-02     0     3     9     0     0     0
   203  0.84677458E+00     0     5    11     0     0     0
   203  0.37055511E-01     0     4    10     0     0     0
   203  0.15108485E-02     0    59    59     0     0     0
   203  0.34138929E-01     0    13    13     0     0     0
   203  0.90892555E-03     0   198   121   128     0     0
   203  0.90892555E-03     0   198   123   130     0     0
   203  0.90892555E-03     0   198   125   132     0     0
   203  0.27267765E-02     0   198     8     1     0     0
   203  0.27267765E-02     0   198    10     3     0     0
   203  0.90892555E-03     0   199   127   122     0     0
   203  0.90892555E-03     0   199   129   124     0     0
   203  0.90892555E-03     0   199   131   126     0     0
   203  0.27267765E-02     0   199     2     7     0     0
   203  0.27267765E-02     0   199     4     9     0     0
   203  0.41081039E-04     0   200   122   128     0     0
   203  0.41081039E-04     0   200   124   130     0     0
   203  0.41081039E-04     0   200   126   132     0     0
   203  0.20675676E-04     0   200   121   127     0     0
   203  0.20675676E-04     0   200   123   129     0     0
   203  0.20675676E-04     0   200   125   131     0     0
   203  0.70833106E-04     0   200     2     8     0     0
   203  0.70833106E-04     0   200     4    10     0     0
   203  0.91250491E-04     0   200     1     7     0     0
   203  0.91250491E-04     0   200     3     9     0     0
   203  0.91250491E-04     0   200     5    11     0     0
  41
   204  0.27651293E-02     0   125   131     0     0     0
   204  0.11317754E-03     0     3     9     0     0     0
   204  0.27906226E-01     0     5    11     0     0     0
   204  0.23399495E+00     0     6    12     0     0     0
   204  0.13006310E-03     0    13    13     0     0     0
   204  0.58522151E-03     0   198   199     0     0     0
   204  0.29713303E-03     0   200   200     0     0     0
   204  0.23448055E-02     0   450   450     0     0     0
   204  0.12004366E-01     0   450   451     0     0     0
   204  0.61597623E-01     0   450   452     0     0     0
   204  0.11957147E-01     0   450   453     0     0     0
   204  0.14714546E-01     0   451   451     0     0     0
   204  0.14384682E+00     0   451   452     0     0     0
   204  0.20509023E-01     0   451   453     0     0     0
   204  0.30898041E-03     0   452   452     0     0     0
   204  0.13374744E-01     0   452   453     0     0     0
   204  0.66936965E-03     0   453   453     0     0     0
   204  0.36607184E-01     0   454   456     0     0     0
   204  0.36512152E-03     0   455   457     0     0     0
   204  0.19965176E+00     0   454   457     0     0     0
   204  0.19965176E+00     0   456   455     0     0     0
   204  0.24842354E-02     0   203   203     0     0     0
   204  0.11840834E-03     0   425   431     0     0     0
   204  0.88733977E-04     0   437   443     0     0     0
   204  0.11839864E-03     0   427   433     0     0     0
   204  0.88725552E-04     0   439   445     0     0     0
   204  0.86335174E-04     0   429   435     0     0     0
   204  0.11563372E-03     0   441   447     0     0     0
   204  0.47653150E-02     0   429   447     0     0     0
   204  0.47653150E-02     0   441   435     0     0     0
   204  0.50019473E-03     0   402   408     0     0     0
   204  0.99913195E-04     0   414   420     0     0     0
   204  0.49985573E-03     0   404   410     0     0     0
   204  0.99762714E-04     0   416   422     0     0     0
   204  0.73651294E-03     0   401   407     0     0     0
   204  0.24849112E-04     0   413   419     0     0     0
   204  0.73665060E-03     0   403   409     0     0     0
   204  0.24823743E-04     0   415   421     0     0     0
   204  0.41713417E-03     0   426   432     0     0     0
   204  0.41713449E-03     0   428   434     0     0     0
   204  0.41713417E-03     0   430   436     0     0     0
  24
   205  0.27939221E-02     0   125   131     0     0     0
   205  0.11436192E-03     0     3     9     0     0     0
   205  0.28225055E-01     0     5    11     0     0     0
   205  0.25263420E+00     0     6    12     0     0     0
   205  0.13966457E-03     0    13    13     0     0     0
   205  0.38833083E-02     0   450   450     0     0     0
   205  0.22945050E-01     0   450   451     0     0     0
   205  0.16622499E-01     0   450   452     0     0     0
   205  0.47368277E-01     0   450   453     0     0     0
   205  0.33330221E-01     0   451   451     0     0     0
   205  0.29514764E-01     0   451   452     0     0     0
   205  0.10566381E+00     0   451   453     0     0     0
   205  0.55988255E-03     0   452   452     0     0     0
   205  0.10067536E-02     0   452   453     0     0     0
   205  0.15402960E-01     0   453   453     0     0     0
   205  0.81426859E-01     0   454   456     0     0     0
   205  0.16450178E-01     0   455   457     0     0     0
   205  0.16577236E+00     0   454   457     0     0     0
   205  0.16577236E+00     0   456   455     0     0     0
   205  0.57570304E-03     0   203   200     0     0     0
   205  0.48742141E-02     0   429   447     0     0     0
   205  0.48742141E-02     0   441   435     0     0     0
   205  0.24630219E-04     0   404   422     0     0     0
   205  0.24630219E-04     0   416   410     0     0     0
  18
   206  0.28341636E-02     0   126   131     0     0     0
   206  0.11127238E-03     0     4     9     0     0     0
   206  0.25479886E+00     0     6    11     0     0     0
   206  0.30978069E-01     0   454   450     0     0     0
   206  0.28151870E-03     0   454   451     0     0     0
   206  0.20552671E+00     0   454   452     0     0     0
   206  0.20192854E+00     0   454   453     0     0     0
   206  0.39371789E-01     0   455   450     0     0     0
   206  0.24047343E+00     0   455   451     0     0     0
   206  0.86222049E-02     0   455   452     0     0     0
   206  0.83162903E-03     0   455   453     0     0     0
   206  0.59377414E-03     0   203   198     0     0     0
   206  0.12258865E-02     0   402   407     0     0     0
   206  0.12253887E-02     0   404   409     0     0     0
   206  0.48807691E-03     0   431   426     0     0     0
   206  0.48806294E-03     0   433   428     0     0     0
   206  0.97367754E-02     0   435   430     0     0     0
   206  0.48401943E-03     0   447   430     0     0     0
  18
   207  0.28341636E-02     0   132   125     0     0     0
   207  0.11127238E-03     0    10     3     0     0     0
   207  0.25479886E+00     0    12     5     0     0     0
   207  0.30978069E-01     0   456   450     0     0     0
   207  0.28151870E-03     0   456   451     0     0     0
   207  0.20552671E+00     0   456   452     0     0     0
   207  0.20192854E+00     0   456   453     0     0     0
   207  0.39371789E-01     0   457   450     0     0     0
   207  0.24047343E+00     0   457   451     0     0     0
   207  0.86222049E-02     0   457   452     0     0     0
   207  0.83162903E-03     0   457   453     0     0     0
   207  0.59377414E-03     0   203   199     0     0     0
   207  0.12258865E-02     0   408   401     0     0     0
   207  0.12253887E-02     0   410   403     0     0     0
   207  0.48807691E-03     0   425   432     0     0     0
   207  0.48806294E-03     0   427   434     0     0     0
   207  0.97367754E-02     0   429   436     0     0     0
   207  0.48401943E-03     0   441   436     0     0     0
   0
   5
     6  0.33333334E+00   100     2     7     5     0     0
     6  0.33333334E+00   100     4     9     5     0     0
     6  0.11111111E+00   100   122   127     5     0     0
     6  0.11111111E+00   100   124   129     5     0     0
     6  0.11111111E+00   100   126   131     5     0     0
   5
    12  0.33333334E+00   100     8     1    11     0     0
    12  0.33333334E+00   100    10     3    11     0     0
    12  0.11111111E+00   100   128   121    11     0     0
    12  0.11111111E+00   100   130   123    11     0     0
    12  0.11111111E+00   100   132   125    11     0     0
      4.00000000     -0.24965078
      0.99050903     -0.05429518      0.11526270     -0.05156542
     -0.08544197     -0.96209073      0.21964395     -0.13724999
     -0.04115489      0.06234059      0.70053118      0.70970166
     -0.09949071      0.25989807      0.66912466     -0.68907714
     -0.97926664      0.20257555     -0.20257555     -0.97926664
     -0.94678503      0.32186657     -0.32186657     -0.94678503
      1.57075512     -1.57079613     -1.57079065
    112.50000000   1800.00000000   1800.00000000
    450.00000000
    T
