#  ISAJET SUSY parameters in SUSY Les Houches Accord 2 format
#  Created by ISALHA 2.0 Last revision: C. Balazs 21 Apr 2009
Block SPINFO   # Program information
     1   ISASUGRA from ISAJET          # Spectrum Calculator
     2   7.80   29-OCT-2009 12:50:36   # Version number
Block MODSEL   # Model selection
     1     1   # Minimal supergravity (mSUGRA) model               
Block SMINPUTS   # Standard Model inputs
     1     1.27841522E+02   # alpha_em^(-1)
     2     1.16570000E-05   # G_Fermi
     3     1.17200002E-01   # alpha_s(M_Z)
     4     9.11699982E+01   # m_{Z}(pole)
     5     4.19999981E+00   # m_{b}(m_{b})
     6     1.72500000E+02   # m_{top}(pole)
     7     1.77699995E+00   # m_{tau}(pole)
Block MINPAR   # SUSY breaking input parameters
     1     1.70000000E+03   # m_0
     2     3.30000000E+02   # m_{1/2}
     3     1.00000000E+01   # tan(beta)
     4     1.00000000E+00   # sign(mu)
     5     0.00000000E+00   # A_0
Block EXTPAR   # Non-universal SUSY breaking parameters
     0     2.16125138E+16   # Input scale
Block MASS   # Scalar and gaugino mass spectrum
#  PDG code   mass                 particle
        24     8.04229965E+01   #  W^+
        25     1.14002739E+02   #  h^0            
        35     1.74915222E+03   #  H^0            
        36     1.73761743E+03   #  A^0            
        37     1.75116699E+03   #  H^+            
   1000001     1.81711560E+03   #  dnl            
   1000002     1.81535229E+03   #  upl            
   1000003     1.81711560E+03   #  stl            
   1000004     1.81535278E+03   #  chl            
   1000005     1.50829529E+03   #  b1             
   1000006     1.11481909E+03   #  t1             
   1000011     1.71071240E+03   #  el-            
   1000012     1.70923364E+03   #  nuel           
   1000013     1.71071240E+03   #  mul-           
   1000014     1.70923364E+03   #  numl           
   1000015     1.68682947E+03   #  tau1           
   1000016     1.70159241E+03   #  nutl           
   1000021     8.72331726E+02   #  glss           
   1000022     1.36719116E+02   #  z1ss           
   1000023     2.56182434E+02   #  z2ss           
   1000024     2.57091278E+02   #  w1ss           
   1000025    -4.34914490E+02   #  z3ss           
   1000035     4.55260132E+02   #  z4ss           
   1000037     4.54391083E+02   #  w2ss           
   2000001     1.81359924E+03   #  dnr            
   2000002     1.81321375E+03   #  upr            
   2000003     1.81359924E+03   #  str            
   2000004     1.81321436E+03   #  chr            
   2000005     1.79507104E+03   #  b2             
   2000006     1.51953271E+03   #  t2             
   2000011     1.70291528E+03   #  er-            
   2000013     1.70291528E+03   #  mur-           
   2000015     1.70322058E+03   #  tau2           
Block ALPHA   # Effective Higgs mixing parameter
         -1.00335509E-01   # alpha
Block STOPMIX   # stop mixing matrix
  1  1     6.92975968E-02   # O_{11}
  1  2     9.97596025E-01   # O_{12}
  2  1    -9.97596025E-01   # O_{21}
  2  2     6.92975968E-02   # O_{22}
Block SBOTMIX   # sbottom mixing matrix
  1  1     9.99896109E-01   # O_{11}
  1  2     1.44147957E-02   # O_{12}
  2  1    -1.44147957E-02   # O_{21}
  2  2     9.99896109E-01   # O_{22}
Block STAUMIX   # stau mixing matrix
  1  1     1.74764216E-01   # O_{11}
  1  2     9.84610319E-01   # O_{12}
  2  1    -9.84610319E-01   # O_{21}
  2  2     1.74764216E-01   # O_{22}
Block NMIX   # neutralino mixing matrix
  1  1     9.90872860E-01   #
  1  2    -3.53798009E-02   #
  1  3     1.20638058E-01   #
  1  4    -4.86385114E-02   #
  2  1    -7.52079934E-02   #
  2  2    -9.43346024E-01   #
  2  3     2.68638998E-01   #
  2  4    -1.79652840E-01   #
  3  1     4.79657352E-02   #
  3  2    -6.80530369E-02   #
  3  3    -6.99922919E-01   #
  3  4    -7.09348798E-01   #
  4  1    -1.01064429E-01   #
  4  2     3.22823912E-01   #
  4  3     6.50682151E-01   #
  4  4    -6.79840684E-01   #
Block UMIX   # chargino U mixing matrix
  1  1    -9.25810158E-01   # U_{11}
  1  2     3.77988845E-01   # U_{12}
  2  1    -3.77988845E-01   # U_{21}
  2  2    -9.25810158E-01   # U_{22}
Block VMIX   # chargino V mixing matrix
  1  1    -9.67765331E-01   # V_{11}
  1  2     2.51853555E-01   # V_{12}
  2  1    -2.51853555E-01   # V_{21}
  2  2    -9.67765331E-01   # V_{22}
Block GAUGE Q=  1.27289221E+03   #
     1     3.57503355E-01   # g`
     2     6.52451932E-01   # g_2
     3     1.22054744E+00   # g_3
Block YU Q=  1.27289221E+03   #
  3  3     8.58155966E-01   # y_t
Block YD Q=  1.27289221E+03   #
  3  3     1.33050784E-01   # y_b
Block YE Q=  1.27289221E+03   #
  3  3     1.01754561E-01   # y_tau
Block HMIX Q=  1.27289221E+03   # Higgs mixing parameters
     1     4.25170319E+02   # mu(Q)
     2     1.00000000E+01   # tan(beta)(M_GUT)
     3     2.51296295E+02   # Higgs vev at Q
     4     3.01931425E+06   # m_A^2(Q)
Block MSOFT Q=  1.27289221E+03   # DRbar SUSY breaking parameters
     1     1.39623657E+02   # M_1(Q)          
     2     2.58432983E+02   # M_2(Q)          
     3     7.55995300E+02   # M_3(Q)          
    31     1.70479993E+03   # MeL(Q)          
    32     1.70479993E+03   # MmuL(Q)         
    33     1.69733008E+03   # MtauL(Q)        
    34     1.70072583E+03   # MeR(Q)          
    35     1.70072583E+03   # MmuR(Q)         
    36     1.68557947E+03   # MtauR(Q)        
    41     1.77944189E+03   # MqL1(Q)         
    42     1.77944189E+03   # MqL2(Q)         
    43     1.47735352E+03   # MqL3(Q)         
    44     1.77687354E+03   # MuR(Q)          
    45     1.77687354E+03   # McR(Q)          
    46     1.09672766E+03   # MtR(Q)          
    47     1.77672595E+03   # MdR(Q)          
    48     1.77672595E+03   # MsR(Q)          
    49     1.76564880E+03   # MbR(Q)          
Block AU Q=  1.27289221E+03   #
  1  1    -5.62429260E+02   # A_u
  2  2    -5.62429260E+02   # A_c
  3  3    -5.62429260E+02   # A_t
Block AD Q=  1.27289221E+03   #
  1  1    -8.33505737E+02   # A_d
  2  2    -8.33505737E+02   # A_s
  3  3    -8.33505737E+02   # A_b
Block AE Q=  1.27289221E+03   #
  1  1    -1.94821686E+02   # A_e
  2  2    -1.94821686E+02   # A_mu
  3  3    -1.94821686E+02   # A_tau
#  ISAJET decay tables in SUSY Les Houches accord format
#  Created by ISALHD. Last revision: C. Balazs, 2005 May 25
Block DCINFO                           # Program information
     1   ISASUGRA from ISAJET          # Spectrum Calculator
     2   7.80   29-OCT-2009 12:50:36   # Version number
#         PDG         Width
DECAY         6  1.14680779E+00   # TP    decays
#          BR          NDA       ID1       ID2       ID3       ID4
      3.33333343E-01    3            2        -1         5             # TP     -->  UP     DB     BT          
      3.33333343E-01    3            4        -3         5             # TP     -->  CH     SB     BT          
      1.11111112E-01    3          -11        12         5             # TP     -->  E+     NUE    BT          
      1.11111112E-01    3          -13        14         5             # TP     -->  MU+    NUM    BT          
      1.11111112E-01    3          -15        16         5             # TP     -->  TAU+   NUT    BT          
#         PDG         Width
DECAY   1000021  3.50929913E-03   # GLSS  decays
#          BR          NDA       ID1       ID2       ID3       ID4
      5.64297773E-02    3      1000024         1        -2             # GLSS   -->  W1SS+  DN     UB          
      5.64297773E-02    3     -1000024         2        -1             # GLSS   -->  W1SS-  UP     DB          
      5.64297475E-02    3      1000024         3        -4             # GLSS   -->  W1SS+  ST     CB          
      5.64297475E-02    3     -1000024         4        -3             # GLSS   -->  W1SS-  CH     SB          
      6.60335422E-02    3      1000024         5        -6             # GLSS   -->  W1SS+  BT     TB          
      6.60335422E-02    3     -1000024         6        -5             # GLSS   -->  W1SS-  TP     BB          
      1.85390806E-03    3      1000037         1        -2             # GLSS   -->  W2SS+  DN     UB          
      1.85390806E-03    3     -1000037         2        -1             # GLSS   -->  W2SS-  UP     DB          
      1.85390725E-03    3      1000037         3        -4             # GLSS   -->  W2SS+  ST     CB          
      1.85390725E-03    3     -1000037         4        -3             # GLSS   -->  W2SS-  CH     SB          
      9.34879929E-02    3      1000037         5        -6             # GLSS   -->  W2SS+  BT     TB          
      9.34879929E-02    3     -1000037         6        -5             # GLSS   -->  W2SS-  TP     BB          
      1.14996840E-06    2      1000022        21                       # GLSS   -->  Z1SS   GL                 
      2.41818260E-02    3      1000022         2        -2             # GLSS   -->  Z1SS   UP     UB          
      7.86033738E-03    3      1000022         1        -1             # GLSS   -->  Z1SS   DN     DB          
      7.86033738E-03    3      1000022         3        -3             # GLSS   -->  Z1SS   ST     SB          
      2.41817944E-02    3      1000022         4        -4             # GLSS   -->  Z1SS   CH     CB          
      1.10268500E-02    3      1000022         5        -5             # GLSS   -->  Z1SS   BT     BB          
      9.20599476E-02    3      1000022         6        -6             # GLSS   -->  Z1SS   TP     TB          
      2.72189593E-03    2      1000023        21                       # GLSS   -->  Z2SS   GL                 
      2.90897321E-02    3      1000023         2        -2             # GLSS   -->  Z2SS   UP     UB          
      2.72525847E-02    3      1000023         1        -1             # GLSS   -->  Z2SS   DN     DB          
      2.72525847E-02    3      1000023         3        -3             # GLSS   -->  Z2SS   ST     SB          
      2.90896967E-02    3      1000023         4        -4             # GLSS   -->  Z2SS   CH     CB          
      6.49027675E-02    3      1000023         5        -5             # GLSS   -->  Z2SS   BT     BB          
      1.55682778E-02    3      1000023         6        -6             # GLSS   -->  Z2SS   TP     TB          
      1.98391546E-02    2      1000025        21                       # GLSS   -->  Z3SS   GL                 
      2.01054354E-05    3      1000025         2        -2             # GLSS   -->  Z3SS   UP     UB          
      2.61652840E-05    3      1000025         1        -1             # GLSS   -->  Z3SS   DN     DB          
      2.61652840E-05    3      1000025         3        -3             # GLSS   -->  Z3SS   ST     SB          
      2.01054081E-05    3      1000025         4        -4             # GLSS   -->  Z3SS   CH     CB          
      1.70934526E-03    3      1000025         5        -5             # GLSS   -->  Z3SS   BT     BB          
      1.20909866E-02    3      1000025         6        -6             # GLSS   -->  Z3SS   TP     TB          
      1.72375869E-02    2      1000035        21                       # GLSS   -->  Z4SS   GL                 
      8.98914586E-04    3      1000035         2        -2             # GLSS   -->  Z4SS   UP     UB          
      1.07523962E-03    3      1000035         1        -1             # GLSS   -->  Z4SS   DN     DB          
      1.07523962E-03    3      1000035         3        -3             # GLSS   -->  Z4SS   ST     SB          
      8.98913248E-04    3      1000035         4        -4             # GLSS   -->  Z4SS   CH     CB          
      3.93805467E-03    3      1000035         5        -5             # GLSS   -->  Z4SS   BT     BB          
      2.59164535E-02    3      1000035         6        -6             # GLSS   -->  Z4SS   TP     TB          
#         PDG         Width
DECAY   1000002  8.42619019E+01   # UPL   decays
#          BR          NDA       ID1       ID2       ID3       ID4
      1.91526441E-03    2      1000022         2                       # UPL    -->  Z1SS   UP                 
      7.98006430E-02    2      1000023         2                       # UPL    -->  Z2SS   UP                 
      2.83010013E-04    2      1000025         2                       # UPL    -->  Z3SS   UP                 
      7.37476395E-03    2      1000035         2                       # UPL    -->  Z4SS   UP                 
      7.37395585E-01    2      1000021         2                       # UPL    -->  GLSS   UP                 
      1.63122579E-01    2      1000024         1                       # UPL    -->  W1SS+  DN                 
      1.01080928E-02    2      1000037         1                       # UPL    -->  W2SS+  DN                 
#         PDG         Width
DECAY   1000001  8.43024521E+01   # DNL   decays
#          BR          NDA       ID1       ID2       ID3       ID4
      4.22086241E-03    2      1000022         1                       # DNL    -->  Z1SS   DN                 
      7.53144249E-02    2      1000023         1                       # DNL    -->  Z2SS   DN                 
      4.76099405E-04    2      1000025         1                       # DNL    -->  Z3SS   DN                 
      9.28581320E-03    2      1000035         1                       # DNL    -->  Z4SS   DN                 
      7.38546968E-01    2      1000021         1                       # DNL    -->  GLSS   DN                 
      1.49370551E-01    2     -1000024         2                       # DNL    -->  W1SS-  UP                 
      2.27853861E-02    2     -1000037         2                       # DNL    -->  W2SS-  UP                 
#         PDG         Width
DECAY   1000003  8.43024368E+01   # STL   decays
#          BR          NDA       ID1       ID2       ID3       ID4
      4.22086334E-03    2      1000022         3                       # STL    -->  Z1SS   ST                 
      7.53144398E-02    2      1000023         3                       # STL    -->  Z2SS   ST                 
      4.76099493E-04    2      1000025         3                       # STL    -->  Z3SS   ST                 
      9.28581506E-03    2      1000035         3                       # STL    -->  Z4SS   ST                 
      7.38547146E-01    2      1000021         3                       # STL    -->  GLSS   ST                 
      1.49370402E-01    2     -1000024         4                       # STL    -->  W1SS-  CH                 
      2.27853619E-02    2     -1000037         4                       # STL    -->  W2SS-  CH                 
#         PDG         Width
DECAY   1000004  8.42618179E+01   # CHL   decays
#          BR          NDA       ID1       ID2       ID3       ID4
      1.91526476E-03    2      1000022         4                       # CHL    -->  Z1SS   CH                 
      7.98006579E-02    2      1000023         4                       # CHL    -->  Z2SS   CH                 
      2.83010100E-04    2      1000025         4                       # CHL    -->  Z3SS   CH                 
      7.37476535E-03    2      1000035         4                       # CHL    -->  Z4SS   CH                 
      7.37395287E-01    2      1000021         4                       # CHL    -->  GLSS   CH                 
      1.63122788E-01    2      1000024         3                       # CHL    -->  W1SS+  ST                 
      1.01081077E-02    2      1000037         3                       # CHL    -->  W2SS+  ST                 
#         PDG         Width
DECAY   1000005  7.60034027E+01   # BT1   decays
#          BR          NDA       ID1       ID2       ID3       ID4
      4.01983038E-03    2      1000022         5                       # BT1    -->  Z1SS   BT                 
      6.87062889E-02    2      1000023         5                       # BT1    -->  Z2SS   BT                 
      3.37039214E-03    2      1000025         5                       # BT1    -->  Z3SS   BT                 
      1.04611628E-02    2      1000035         5                       # BT1    -->  Z4SS   BT                 
      5.17933309E-01    2      1000021         5                       # BT1    -->  GLSS   BT                 
      1.44124448E-01    2     -1000024         6                       # BT1    -->  W1SS-  TP                 
      2.39044935E-01    2     -1000037         6                       # BT1    -->  W2SS-  TP                 
      1.23395966E-02    2          -24   1000006                       # BT1    -->  W-     TP1                
#         PDG         Width
DECAY   1000006  3.15497913E+01   # TP1   decays
#          BR          NDA       ID1       ID2       ID3       ID4
      2.31404498E-01    2      1000021         6                       # TP1    -->  GLSS   TP                 
      7.34893680E-02    2      1000022         6                       # TP1    -->  Z1SS   TP                 
      2.00917572E-02    2      1000023         6                       # TP1    -->  Z2SS   TP                 
      1.75499514E-01    2      1000025         6                       # TP1    -->  Z3SS   TP                 
      1.43322065E-01    2      1000035         6                       # TP1    -->  Z4SS   TP                 
      4.11466919E-02    2      1000024         5                       # TP1    -->  W1SS+  BT                 
      3.15046072E-01    2      1000037         5                       # TP1    -->  W2SS+  BT                 
#         PDG         Width
DECAY   2000002  6.60264511E+01   # UPR   decays
#          BR          NDA       ID1       ID2       ID3       ID4
      6.02602437E-02    2      1000022         2                       # UPR    -->  Z1SS   UP                 
      3.37257254E-04    2      1000023         2                       # UPR    -->  Z2SS   UP                 
      1.26865270E-04    2      1000025         2                       # UPR    -->  Z3SS   UP                 
      5.56654064E-04    2      1000035         2                       # UPR    -->  Z4SS   UP                 
      9.38719034E-01    2      1000021         2                       # UPR    -->  GLSS   UP                 
#         PDG         Width
DECAY   2000001  6.30198288E+01   # DNR   decays
#          BR          NDA       ID1       ID2       ID3       ID4
      1.57872327E-02    2      1000022         1                       # DNR    -->  Z1SS   DN                 
      8.83571847E-05    2      1000023         1                       # DNR    -->  Z2SS   DN                 
      3.32382624E-05    2      1000025         1                       # DNR    -->  Z3SS   DN                 
      1.45842248E-04    2      1000035         1                       # DNR    -->  Z4SS   DN                 
      9.83945370E-01    2      1000021         1                       # DNR    -->  GLSS   DN                 
#         PDG         Width
DECAY   2000003  6.30198288E+01   # STR   decays
#          BR          NDA       ID1       ID2       ID3       ID4
      1.57872327E-02    2      1000022         3                       # STR    -->  Z1SS   ST                 
      8.83571847E-05    2      1000023         3                       # STR    -->  Z2SS   ST                 
      3.32382624E-05    2      1000025         3                       # STR    -->  Z3SS   ST                 
      1.45842248E-04    2      1000035         3                       # STR    -->  Z4SS   ST                 
      9.83945370E-01    2      1000021         3                       # STR    -->  GLSS   ST                 
#         PDG         Width
DECAY   2000004  6.60263824E+01   # CHR   decays
#          BR          NDA       ID1       ID2       ID3       ID4
      6.02602623E-02    2      1000022         4                       # CHR    -->  Z1SS   CH                 
      3.37257341E-04    2      1000023         4                       # CHR    -->  Z2SS   CH                 
      1.26865285E-04    2      1000025         4                       # CHR    -->  Z3SS   CH                 
      5.56654239E-04    2      1000035         4                       # CHR    -->  Z4SS   CH                 
      9.38719034E-01    2      1000021         4                       # CHR    -->  GLSS   CH                 
#         PDG         Width
DECAY   2000005  6.28883820E+01   # BT2   decays
#          BR          NDA       ID1       ID2       ID3       ID4
      1.57313496E-02    2      1000022         5                       # BT2    -->  Z1SS   BT                 
      5.96399535E-04    2      1000023         5                       # BT2    -->  Z2SS   BT                 
      4.63950401E-03    2      1000025         5                       # BT2    -->  Z3SS   BT                 
      4.25342610E-03    2      1000035         5                       # BT2    -->  Z4SS   BT                 
      9.64610219E-01    2      1000021         5                       # BT2    -->  GLSS   BT                 
      9.81325633E-04    2     -1000024         6                       # BT2    -->  W1SS-  TP                 
      8.28530267E-03    2     -1000037         6                       # BT2    -->  W2SS-  TP                 
      1.35413320E-05    2          -24   1000006                       # BT2    -->  W-     TP1                
      2.46385520E-04    2          -24   2000006                       # BT2    -->  W-     TP2                
      1.36275776E-04    2           23   1000005                       # BT2    -->  Z0     BT1                
      5.06280747E-04    2           25   1000005                       # BT2    -->  HL0    BT1                
#         PDG         Width
DECAY   2000006  7.44733963E+01   # TP2   decays
#          BR          NDA       ID1       ID2       ID3       ID4
      4.95152831E-01    2      1000021         6                       # TP2    -->  GLSS   TP                 
      1.45044401E-01    2      1000024         5                       # TP2    -->  W1SS+  BT                 
      2.16264259E-02    2      1000037         5                       # TP2    -->  W2SS+  BT                 
      6.74665719E-03    2           23   1000006                       # TP2    -->  Z0     TP1                
      1.36634717E-02    2           25   1000006                       # TP2    -->  HL0    TP1                
      2.04412686E-03    2      1000022         6                       # TP2    -->  Z1SS   TP                 
      7.52748102E-02    2      1000023         6                       # TP2    -->  Z2SS   TP                 
      1.17369160E-01    2      1000025         6                       # TP2    -->  Z3SS   TP                 
      1.23078100E-01    2      1000035         6                       # TP2    -->  Z4SS   TP                 
#         PDG         Width
DECAY   1000011  2.25414410E+01   # EL-   decays
#          BR          NDA       ID1       ID2       ID3       ID4
      8.17826241E-02    2      1000022        11                       # EL-    -->  Z1SS   E-                 
      2.96004951E-01    2      1000023        11                       # EL-    -->  Z2SS   E-                 
      4.85776807E-04    2      1000025        11                       # EL-    -->  Z3SS   E-                 
      1.97028145E-02    2      1000035        11                       # EL-    -->  Z4SS   E-                 
      5.23165703E-01    2     -1000024        12                       # EL-    -->  W1SS-  NUE                
      7.88580626E-02    2     -1000037        12                       # EL-    -->  W2SS-  NUE                
#         PDG         Width
DECAY   1000013  2.25414410E+01   # MUL-  decays
#          BR          NDA       ID1       ID2       ID3       ID4
      8.17826241E-02    2      1000022        13                       # MUL-   -->  Z1SS   MU-                
      2.96004951E-01    2      1000023        13                       # MUL-   -->  Z2SS   MU-                
      4.85776807E-04    2      1000025        13                       # MUL-   -->  Z3SS   MU-                
      1.97028145E-02    2      1000035        13                       # MUL-   -->  Z4SS   MU-                
      5.23165703E-01    2     -1000024        14                       # MUL-   -->  W1SS-  NUM                
      7.88580626E-02    2     -1000037        14                       # MUL-   -->  W2SS-  NUM                
#         PDG         Width
DECAY   1000015  9.53829670E+00   # TAU1- decays
#          BR          NDA       ID1       ID2       ID3       ID4
      8.55339646E-01    2      1000022        15                       # TAU1-  -->  Z1SS   TAU-               
      4.17505689E-02    2      1000023        15                       # TAU1-  -->  Z2SS   TAU-               
      1.46578094E-02    2      1000025        15                       # TAU1-  -->  Z3SS   TAU-               
      1.06329462E-02    2      1000035        15                       # TAU1-  -->  Z4SS   TAU-               
      6.95225596E-02    2     -1000024        16                       # TAU1-  -->  W1SS-  NUT                
      8.09634756E-03    2     -1000037        16                       # TAU1-  -->  W2SS-  NUT                
#         PDG         Width
DECAY   1000012  2.25902710E+01   # NUEL  decays
#          BR          NDA       ID1       ID2       ID3       ID4
      1.05766840E-01    2      1000022        12                       # NUEL   -->  Z1SS   NUE                
      2.47616798E-01    2      1000023        12                       # NUEL   -->  Z2SS   NUE                
      2.48338282E-03    2      1000025        12                       # NUEL   -->  Z3SS   NUE                
      3.93560603E-02    2      1000035        12                       # NUEL   -->  Z4SS   NUE                
      5.69882631E-01    2      1000024        11                       # NUEL   -->  W1SS+  E-                 
      3.48943286E-02    2      1000037        11                       # NUEL   -->  W2SS+  E-                 
#         PDG         Width
DECAY   1000014  2.25902710E+01   # NUML  decays
#          BR          NDA       ID1       ID2       ID3       ID4
      1.05766840E-01    2      1000022        14                       # NUML   -->  Z1SS   NUM                
      2.47616798E-01    2      1000023        14                       # NUML   -->  Z2SS   NUM                
      2.48338282E-03    2      1000025        14                       # NUML   -->  Z3SS   NUM                
      3.93560603E-02    2      1000035        14                       # NUML   -->  Z4SS   NUM                
      5.69882631E-01    2      1000024        13                       # NUML   -->  W1SS+  MU-                
      3.48943286E-02    2      1000037        13                       # NUML   -->  W2SS+  MU-                
#         PDG         Width
DECAY   1000016  2.27989063E+01   # NUTL  decays
#          BR          NDA       ID1       ID2       ID3       ID4
      1.04318328E-01    2      1000022        16                       # NUTL   -->  Z1SS   NUT                
      2.44152918E-01    2      1000023        16                       # NUTL   -->  Z2SS   NUT                
      2.44660443E-03    2      1000025        16                       # NUTL   -->  Z3SS   NUT                
      3.87682207E-02    2      1000035        16                       # NUTL   -->  Z4SS   NUT                
      5.64071059E-01    2      1000024        15                       # NUTL   -->  W1SS+  TAU-               
      4.62429300E-02    2      1000037        15                       # NUTL   -->  W2SS+  TAU-               
      2.73029627E-10    3      1000015        16       -15             # NUTL   -->  TAU1-  NUT    TAU+        
      2.73029627E-10    3      1000015        12       -11             # NUTL   -->  TAU1-  NUE    E+          
      2.73029627E-10    3      1000015        14       -13             # NUTL   -->  TAU1-  NUM    MU+         
      8.19088908E-10    3      1000015         2        -1             # NUTL   -->  TAU1-  UP     DB          
      8.19088908E-10    3      1000015         4        -3             # NUTL   -->  TAU1-  CH     SB          
#         PDG         Width
DECAY   2000011  8.53529930E+00   # ER-   decays
#          BR          NDA       ID1       ID2       ID3       ID4
      9.83540475E-01    2      1000022        11                       # ER-    -->  Z1SS   E-                 
      5.48299355E-03    2      1000023        11                       # ER-    -->  Z2SS   E-                 
      2.04008585E-03    2      1000025        11                       # ER-    -->  Z3SS   E-                 
      8.93635117E-03    2      1000035        11                       # ER-    -->  Z4SS   E-                 
#         PDG         Width
DECAY   2000013  8.53529930E+00   # MUR-  decays
#          BR          NDA       ID1       ID2       ID3       ID4
      9.83540475E-01    2      1000022        13                       # MUR-   -->  Z1SS   MU-                
      5.48299355E-03    2      1000023        13                       # MUR-   -->  Z2SS   MU-                
      2.04008585E-03    2      1000025        13                       # MUR-   -->  Z3SS   MU-                
      8.93635117E-03    2      1000035        13                       # MUR-   -->  Z4SS   MU-                
#         PDG         Width
DECAY   2000015  2.22952461E+01   # TAU2- decays
#          BR          NDA       ID1       ID2       ID3       ID4
      8.98027346E-02    2      1000022        15                       # TAU2-  -->  Z1SS   TAU-               
      2.84140319E-01    2      1000023        15                       # TAU2-  -->  Z2SS   TAU-               
      8.95831455E-03    2      1000025        15                       # TAU2-  -->  Z3SS   TAU-               
      3.06146443E-02    2      1000035        15                       # TAU2-  -->  Z4SS   TAU-               
      4.98590142E-01    2     -1000024        16                       # TAU2-  -->  W1SS-  NUT                
      8.78938138E-02    2     -1000037        16                       # TAU2-  -->  W2SS-  NUT                
#         PDG         Width
DECAY   1000023  8.64195358E-03   # Z2SS  decays
#          BR          NDA       ID1       ID2       ID3       ID4
      3.25113115E-06    2      1000022        22                       # Z2SS   -->  Z1SS   GM                 
      1.69258341E-01    2      1000022        23                       # Z2SS   -->  Z1SS   Z0                 
      6.41944240E-08    3      1000022         2        -2             # Z2SS   -->  Z1SS   UP     UB          
      1.23060389E-07    3      1000022         1        -1             # Z2SS   -->  Z1SS   DN     DB          
      1.23060389E-07    3      1000022         3        -3             # Z2SS   -->  Z1SS   ST     SB          
      6.41943458E-08    3      1000022         4        -4             # Z2SS   -->  Z1SS   CH     CB          
      3.01867090E-07    3      1000022         5        -5             # Z2SS   -->  Z1SS   BT     BB          
      3.33737830E-07    3      1000022        11       -11             # Z2SS   -->  Z1SS   E-     E+          
      3.33737830E-07    3      1000022        13       -13             # Z2SS   -->  Z1SS   MU-    MU+         
      3.54908423E-07    3      1000022        15       -15             # Z2SS   -->  Z1SS   TAU-   TAU+        
      3.52967277E-07    3      1000022        12       -12             # Z2SS   -->  Z1SS   NUE    ANUE        
      3.52967277E-07    3      1000022        14       -14             # Z2SS   -->  Z1SS   NUM    ANUM        
      3.59439156E-07    3      1000022        16       -16             # Z2SS   -->  Z1SS   NUT    ANUT        
      8.30735624E-01    2      1000022        25                       # Z2SS   -->  Z1SS   HL0                
#         PDG         Width
DECAY   1000025  1.95128036E+00   # Z3SS  decays
#          BR          NDA       ID1       ID2       ID3       ID4
      5.60435076E-08    2      1000022        22                       # Z3SS   -->  Z1SS   GM                 
      7.16185980E-07    2      1000023        22                       # Z3SS   -->  Z2SS   GM                 
      2.94987530E-01    2      1000024       -24                       # Z3SS   -->  W1SS+  W-                 
      2.94987530E-01    2     -1000024        24                       # Z3SS   -->  W1SS-  W+                 
      1.28858954E-01    2      1000022        23                       # Z3SS   -->  Z1SS   Z0                 
      2.51437217E-01    2      1000023        23                       # Z3SS   -->  Z2SS   Z0                 
      2.44605752E-10    3      1000022         2        -2             # Z3SS   -->  Z1SS   UP     UB          
      1.06460799E-10    3      1000022         1        -1             # Z3SS   -->  Z1SS   DN     DB          
      1.06460799E-10    3      1000022         3        -3             # Z3SS   -->  Z1SS   ST     SB          
      2.44605419E-10    3      1000022         4        -4             # Z3SS   -->  Z1SS   CH     CB          
      1.80534432E-08    3      1000022         5        -5             # Z3SS   -->  Z1SS   BT     BB          
      5.44457535E-10    3      1000022        11       -11             # Z3SS   -->  Z1SS   E-     E+          
      5.44457535E-10    3      1000022        13       -13             # Z3SS   -->  Z1SS   MU-    MU+         
      1.54304232E-08    3      1000022        15       -15             # Z3SS   -->  Z1SS   TAU-   TAU+        
      4.29836777E-10    3      1000022        12       -12             # Z3SS   -->  Z1SS   NUE    ANUE        
      4.29836777E-10    3      1000022        14       -14             # Z3SS   -->  Z1SS   NUM    ANUM        
      4.37893583E-10    3      1000022        16       -16             # Z3SS   -->  Z1SS   NUT    ANUT        
      1.39589076E-10    3      1000023         2        -2             # Z3SS   -->  Z2SS   UP     UB          
      2.20198124E-10    3      1000023         1        -1             # Z3SS   -->  Z2SS   DN     DB          
      2.20198124E-10    3      1000023         3        -3             # Z3SS   -->  Z2SS   ST     SB          
      1.39588924E-10    3      1000023         4        -4             # Z3SS   -->  Z2SS   CH     CB          
      1.30738957E-08    3      1000023         5        -5             # Z3SS   -->  Z2SS   BT     BB          
      3.15404924E-11    3      1000023        11       -11             # Z3SS   -->  Z2SS   E-     E+          
      3.15404924E-11    3      1000023        13       -13             # Z3SS   -->  Z2SS   MU-    MU+         
      1.93437599E-09    3      1000023        15       -15             # Z3SS   -->  Z2SS   TAU-   TAU+        
      1.34689579E-10    3      1000023        12       -12             # Z3SS   -->  Z2SS   NUE    ANUE        
      1.34689579E-10    3      1000023        14       -14             # Z3SS   -->  Z2SS   NUM    ANUM        
      1.37238387E-10    3      1000023        16       -16             # Z3SS   -->  Z2SS   NUT    ANUT        
      2.15362832E-02    2      1000022        25                       # Z3SS   -->  Z1SS   HL0                
      8.19177367E-03    2      1000023        25                       # Z3SS   -->  Z2SS   HL0                
#         PDG         Width
DECAY   1000035  2.35404801E+00   # Z4SS  decays
#          BR          NDA       ID1       ID2       ID3       ID4
      1.40495251E-08    2      1000022        22                       # Z4SS   -->  Z1SS   GM                 
      2.01611229E-07    2      1000023        22                       # Z4SS   -->  Z2SS   GM                 
      5.17085752E-09    2      1000025        22                       # Z4SS   -->  Z3SS   GM                 
      3.42381418E-01    2      1000024       -24                       # Z4SS   -->  W1SS+  W-                 
      3.42381418E-01    2     -1000024        24                       # Z4SS   -->  W1SS-  W+                 
      2.20967978E-02    2      1000022        23                       # Z4SS   -->  Z1SS   Z0                 
      1.43962707E-02    2      1000023        23                       # Z4SS   -->  Z2SS   Z0                 
      3.97074906E-09    3      1000022         2        -2             # Z4SS   -->  Z1SS   UP     UB          
      4.58634508E-09    3      1000022         1        -1             # Z4SS   -->  Z1SS   DN     DB          
      4.58634508E-09    3      1000022         3        -3             # Z4SS   -->  Z1SS   ST     SB          
      3.97074373E-09    3      1000022         4        -4             # Z4SS   -->  Z1SS   CH     CB          
      2.19665903E-08    3      1000022         5        -5             # Z4SS   -->  Z1SS   BT     BB          
      1.15804326E-08    3      1000022        11       -11             # Z4SS   -->  Z1SS   E-     E+          
      1.15804326E-08    3      1000022        13       -13             # Z4SS   -->  Z1SS   MU-    MU+         
      2.50674415E-08    3      1000022        15       -15             # Z4SS   -->  Z1SS   TAU-   TAU+        
      1.67341874E-08    3      1000022        12       -12             # Z4SS   -->  Z1SS   NUE    ANUE        
      1.67341874E-08    3      1000022        14       -14             # Z4SS   -->  Z1SS   NUM    ANUM        
      1.70473129E-08    3      1000022        16       -16             # Z4SS   -->  Z1SS   NUT    ANUT        
      1.37173632E-08    3      1000023         2        -2             # Z4SS   -->  Z2SS   UP     UB          
      1.62108122E-08    3      1000023         1        -1             # Z4SS   -->  Z2SS   DN     DB          
      1.62108122E-08    3      1000023         3        -3             # Z4SS   -->  Z2SS   ST     SB          
      1.37173455E-08    3      1000023         4        -4             # Z4SS   -->  Z2SS   CH     CB          
      4.68614125E-08    3      1000023         5        -5             # Z4SS   -->  Z2SS   BT     BB          
      4.78833906E-09    3      1000023        11       -11             # Z4SS   -->  Z2SS   E-     E+          
      4.78833906E-09    3      1000023        13       -13             # Z4SS   -->  Z2SS   MU-    MU+         
      6.52619603E-09    3      1000023        15       -15             # Z4SS   -->  Z2SS   TAU-   TAU+        
      8.07165179E-09    3      1000023        12       -12             # Z4SS   -->  Z2SS   NUE    ANUE        
      8.07165179E-09    3      1000023        14       -14             # Z4SS   -->  Z2SS   NUM    ANUM        
      8.22449753E-09    3      1000023        16       -16             # Z4SS   -->  Z2SS   NUT    ANUT        
      1.58721676E-07    3      1000025         2        -2             # Z4SS   -->  Z3SS   UP     UB          
      2.04719910E-07    3      1000025         1        -1             # Z4SS   -->  Z3SS   DN     DB          
      2.04719910E-07    3      1000025         3        -3             # Z4SS   -->  Z3SS   ST     SB          
      1.58721676E-07    3      1000025         4        -4             # Z4SS   -->  Z3SS   CH     CB          
      1.03371342E-07    3      1000025         5        -5             # Z4SS   -->  Z3SS   BT     BB          
      4.64385188E-08    3      1000025        11       -11             # Z4SS   -->  Z3SS   E-     E+          
      4.64385188E-08    3      1000025        13       -13             # Z4SS   -->  Z3SS   MU-    MU+         
      4.18358148E-08    3      1000025        15       -15             # Z4SS   -->  Z3SS   TAU-   TAU+        
      9.23738668E-08    3      1000025        12       -12             # Z4SS   -->  Z3SS   NUE    ANUE        
      9.23738668E-08    3      1000025        14       -14             # Z4SS   -->  Z3SS   NUM    ANUM        
      9.23737105E-08    3      1000025        16       -16             # Z4SS   -->  Z3SS   NUT    ANUT        
      9.16168615E-02    2      1000022        25                       # Z4SS   -->  Z1SS   HL0                
      1.87125638E-01    2      1000023        25                       # Z4SS   -->  Z2SS   HL0                
#         PDG         Width
DECAY   1000024  1.16912453E-02   # W1SS+ decays
#          BR          NDA       ID1       ID2       ID3       ID4
      1.36904603E-07    3      1000022         2        -1             # W1SS+  -->  Z1SS   UP     DB          
      1.36904518E-07    3      1000022         4        -3             # W1SS+  -->  Z1SS   CH     SB          
      5.26407632E-07    3      1000022       -11        12             # W1SS+  -->  Z1SS   E+     NUE         
      5.26407632E-07    3      1000022       -13        14             # W1SS+  -->  Z1SS   MU+    NUM         
      5.47728860E-07    3      1000022       -15        16             # W1SS+  -->  Z1SS   TAU+   NUT         
      9.99998093E-01    2      1000022        24                       # W1SS+  -->  Z1SS   W+                 
      2.55546747E-11    3      1000023       -11        12             # W1SS+  -->  Z2SS   E+     NUE         
      2.55546747E-11    3      1000023       -13        14             # W1SS+  -->  Z2SS   MU+    NUM         
#         PDG         Width
DECAY   1000037  2.07526541E+00   # W2SS+ decays
#          BR          NDA       ID1       ID2       ID3       ID4
      6.84162238E-09    3      1000022         2        -1             # W2SS+  -->  Z1SS   UP     DB          
      6.84161972E-09    3      1000022         4        -3             # W2SS+  -->  Z1SS   CH     SB          
      2.24674075E-08    3      1000022       -11        12             # W2SS+  -->  Z1SS   E+     NUE         
      2.24674075E-08    3      1000022       -13        14             # W2SS+  -->  Z1SS   MU+    NUM         
      3.80332175E-08    3      1000022       -15        16             # W2SS+  -->  Z1SS   TAU+   NUT         
      1.03298441E-01    2      1000022        24                       # W2SS+  -->  Z1SS   W+                 
      1.25936275E-08    3      1000023         2        -1             # W2SS+  -->  Z2SS   UP     DB          
      1.25936275E-08    3      1000023         4        -3             # W2SS+  -->  Z2SS   CH     SB          
      5.85829518E-09    3      1000023       -11        12             # W2SS+  -->  Z2SS   E+     NUE         
      5.85829518E-09    3      1000023       -13        14             # W2SS+  -->  Z2SS   MU+    NUM         
      8.74263062E-09    3      1000023       -15        16             # W2SS+  -->  Z2SS   TAU+   NUT         
      3.41205865E-01    2      1000023        24                       # W2SS+  -->  Z2SS   W+                 
      5.12860709E-07    3      1000025         2        -1             # W2SS+  -->  Z3SS   UP     DB          
      5.12860709E-07    3      1000025         4        -3             # W2SS+  -->  Z3SS   CH     SB          
      1.70945029E-07    3      1000025       -11        12             # W2SS+  -->  Z3SS   E+     NUE         
      1.70945029E-07    3      1000025       -13        14             # W2SS+  -->  Z3SS   MU+    NUM         
      1.70955474E-07    3      1000025       -15        16             # W2SS+  -->  Z3SS   TAU+   NUT         
      3.11182469E-01    2      1000024        23                       # W2SS+  -->  W1SS+  Z0                 
      1.43209000E-08    3      1000024         1        -1             # W2SS+  -->  W1SS+  DN     DB          
      1.43208823E-08    3      1000024         3        -3             # W2SS+  -->  W1SS+  ST     SB          
      2.94021589E-08    3      1000024         2        -2             # W2SS+  -->  W1SS+  UP     UB          
      2.94021589E-08    3      1000024         4        -4             # W2SS+  -->  W1SS+  CH     CB          
      1.26100081E-08    3      1000024        12       -12             # W2SS+  -->  W1SS+  NUE    ANUE        
      1.26100081E-08    3      1000024        14       -14             # W2SS+  -->  W1SS+  NUM    ANUM        
      1.33753710E-08    3      1000024        16       -16             # W2SS+  -->  W1SS+  NUT    ANUT        
      6.13935658E-09    3      1000024        11       -11             # W2SS+  -->  W1SS+  E-     E+          
      6.13935658E-09    3      1000024        13       -13             # W2SS+  -->  W1SS+  MU-    MU+         
      6.25569108E-09    3      1000024        15       -15             # W2SS+  -->  W1SS+  TAU-   TAU+        
      2.44311348E-01    2      1000024        25                       # W2SS+  -->  W1SS+  HL0                
#         PDG         Width
DECAY        25  4.02850332E-03   # HL0   decays
#          BR          NDA       ID1       ID2       ID3       ID4
      4.87345941E-09    2           11       -11                       # HL0    -->  E-     E+                 
      2.05765202E-04    2           13       -13                       # HL0    -->  MU-    MU+                
      5.88487126E-02    2           15       -15                       # HL0    -->  TAU-   TAU+               
      6.11750693E-06    2            1        -1                       # HL0    -->  DN     DB                 
      2.47177924E-03    2            3        -3                       # HL0    -->  ST     SB                 
      8.11299682E-01    2            5        -5                       # HL0    -->  BT     BB                 
      1.93129904E-06    2            2        -2                       # HL0    -->  UP     UB                 
      3.64053100E-02    2            4        -4                       # HL0    -->  CH     CB                 
      1.80521526E-03    2           22        22                       # HL0    -->  GM     GM                 
      3.83866727E-02    2           21        21                       # HL0    -->  GL     GL                 
      2.62643397E-03    3           24        11       -12             # HL0    -->  W+     E-     ANUE        
      2.62643397E-03    3           24        13       -14             # HL0    -->  W+     MU-    ANUM        
      2.62643397E-03    3           24        15       -16             # HL0    -->  W+     TAU-   ANUT        
      7.87930191E-03    3           24        -2         1             # HL0    -->  W+     UB     DN          
      7.87930191E-03    3           24        -4         3             # HL0    -->  W+     CB     ST          
      2.62643397E-03    3          -24       -11        12             # HL0    -->  W-     E+     NUE         
      2.62643397E-03    3          -24       -13        14             # HL0    -->  W-     MU+    NUM         
      2.62643397E-03    3          -24       -15        16             # HL0    -->  W-     TAU+   NUT         
      7.87930191E-03    3          -24         2        -1             # HL0    -->  W-     UP     DB          
      7.87930191E-03    3          -24         4        -3             # HL0    -->  W-     CH     SB          
      2.25206008E-04    3           23        12       -12             # HL0    -->  Z0     NUE    ANUE        
      2.25206008E-04    3           23        14       -14             # HL0    -->  Z0     NUM    ANUM        
      2.25206008E-04    3           23        16       -16             # HL0    -->  Z0     NUT    ANUT        
      1.13343922E-04    3           23        11       -11             # HL0    -->  Z0     E-     E+          
      1.13343922E-04    3           23        13       -13             # HL0    -->  Z0     MU-    MU+         
      1.13343922E-04    3           23        15       -15             # HL0    -->  Z0     TAU-   TAU+        
      3.88306682E-04    3           23         2        -2             # HL0    -->  Z0     UP     UB          
      3.88306682E-04    3           23         4        -4             # HL0    -->  Z0     CH     CB          
      5.00234659E-04    3           23         1        -1             # HL0    -->  Z0     DN     DB          
      5.00234659E-04    3           23         3        -3             # HL0    -->  Z0     ST     SB          
      5.00234659E-04    3           23         5        -5             # HL0    -->  Z0     BT     BB          
#         PDG         Width
DECAY        35  2.37809887E+01   # HH0   decays
#          BR          NDA       ID1       ID2       ID3       ID4
      1.24977706E-09    2           11       -11                       # HH0    -->  E-     E+                 
      5.27678385E-05    2           13       -13                       # HH0    -->  MU-    MU+                
      1.51134254E-02    2           15       -15                       # HH0    -->  TAU-   TAU+               
      1.52435030E-06    2            1        -1                       # HH0    -->  DN     DB                 
      6.15914643E-04    2            3        -3                       # HH0    -->  ST     SB                 
      8.35625306E-02    2            5        -5                       # HH0    -->  BT     BB                 
      4.94335510E-11    2            2        -2                       # HH0    -->  UP     UB                 
      6.53406687E-07    2            4        -4                       # HH0    -->  CH     CB                 
      3.29697765E-02    2            6        -6                       # HH0    -->  TP     TB                 
      2.77057836E-07    2           22        22                       # HH0    -->  GM     GM                 
      1.16349656E-05    2           21        21                       # HH0    -->  GL     GL                 
      3.21492989E-05    2           24       -24                       # HH0    -->  W+     W-                 
      1.64422690E-05    2           23        23                       # HH0    -->  Z0     Z0                 
      2.66166311E-03    2      1000022   1000022                       # HH0    -->  Z1SS   Z1SS               
      1.76434126E-02    2      1000022   1000023                       # HH0    -->  Z1SS   Z2SS               
      5.27872518E-02    2      1000022   1000025                       # HH0    -->  Z1SS   Z3SS               
      2.16895323E-02    2      1000022   1000035                       # HH0    -->  Z1SS   Z4SS               
      2.73678619E-02    2      1000023   1000023                       # HH0    -->  Z2SS   Z2SS               
      1.25198573E-01    2      1000023   1000025                       # HH0    -->  Z2SS   Z3SS               
      4.30034883E-02    2      1000023   1000035                       # HH0    -->  Z2SS   Z4SS               
      2.12313165E-03    2      1000025   1000025                       # HH0    -->  Z3SS   Z3SS               
      3.17299925E-02    2      1000025   1000035                       # HH0    -->  Z3SS   Z4SS               
      1.85189750E-02    2      1000035   1000035                       # HH0    -->  Z4SS   Z4SS               
      6.27301782E-02    2      1000024  -1000024                       # HH0    -->  W1SS+  W1SS-              
      1.47409355E-02    2      1000037  -1000037                       # HH0    -->  W2SS+  W2SS-              
      2.23659888E-01    2      1000024  -1000037                       # HH0    -->  W1SS+  W2SS-              
      2.23659888E-01    2     -1000024   1000037                       # HH0    -->  W1SS-  W2SS+              
      1.08084721E-04    2           25        25                       # HH0    -->  HL0    HL0                
#         PDG         Width
DECAY        36  2.35857143E+01   # HA0   decays
#          BR          NDA       ID1       ID2       ID3       ID4
      1.25198196E-09    2           11       -11                       # HA0    -->  E-     E+                 
      5.28609417E-05    2           13       -13                       # HA0    -->  MU-    MU+                
      1.51401507E-02    2           15       -15                       # HA0    -->  TAU-   TAU+               
      1.52711493E-06    2            1        -1                       # HA0    -->  DN     DB                 
      6.17031765E-04    2            3        -3                       # HA0    -->  ST     SB                 
      8.37152526E-02    2            5        -5                       # HA0    -->  BT     BB                 
      4.88627784E-11    2            2        -2                       # HA0    -->  UP     UB                 
      6.46340197E-07    2            4        -4                       # HA0    -->  CH     CB                 
      3.36488299E-02    2            6        -6                       # HA0    -->  TP     TB                 
      3.89171305E-07    2           22        22                       # HA0    -->  GM     GM                 
      1.90014507E-05    2           21        21                       # HA0    -->  GL     GL                 
      3.21302516E-03    2      1000022   1000022                       # HA0    -->  Z1SS   Z1SS               
      2.31877845E-02    2      1000022   1000023                       # HA0    -->  Z1SS   Z2SS               
      3.17339040E-02    2      1000022   1000025                       # HA0    -->  Z1SS   Z3SS               
      3.74079123E-02    2      1000022   1000035                       # HA0    -->  Z1SS   Z4SS               
      3.92159037E-02    2      1000023   1000023                       # HA0    -->  Z2SS   Z2SS               
      6.88603744E-02    2      1000023   1000025                       # HA0    -->  Z2SS   Z3SS               
      8.00225958E-02    2      1000023   1000035                       # HA0    -->  Z2SS   Z4SS               
      1.87483197E-03    2      1000025   1000025                       # HA0    -->  Z3SS   Z3SS               
      1.81910135E-02    2      1000025   1000035                       # HA0    -->  Z3SS   Z4SS               
      3.86732370E-02    2      1000035   1000035                       # HA0    -->  Z4SS   Z4SS               
      8.88172239E-02    2      1000024  -1000024                       # HA0    -->  W1SS+  W1SS-              
      3.80849466E-02    2      1000037  -1000037                       # HA0    -->  W2SS+  W2SS-              
      1.98744759E-01    2      1000024  -1000037                       # HA0    -->  W1SS+  W2SS-              
      1.98744759E-01    2     -1000024   1000037                       # HA0    -->  W1SS-  W2SS+              
      3.19210412E-05    2           25        23                       # HA0    -->  HL0    Z0                 
#         PDG         Width
DECAY        37  2.35007877E+01   # H+    decays
#          BR          NDA       ID1       ID2       ID3       ID4
      1.26630439E-09    2           12       -11                       # H+     -->  NUE    E+                 
      5.34656538E-05    2           14       -13                       # H+     -->  NUM    MU+                
      1.53133515E-02    2           16       -15                       # H+     -->  NUT    TAU+               
      1.42594195E-06    2            2        -1                       # H+     -->  UP     DB                 
      5.76736580E-04    2            4        -3                       # H+     -->  CH     SB                 
      1.07661523E-01    2            6        -5                       # H+     -->  TP     BB                 
      3.62528451E-02    2      1000024   1000022                       # H+     -->  W1SS+  Z1SS               
      1.19210250E-04    2      1000024   1000023                       # H+     -->  W1SS+  Z2SS               
      2.32182294E-01    2      1000024   1000025                       # H+     -->  W1SS+  Z3SS               
      2.39810184E-01    2      1000024   1000035                       # H+     -->  W1SS+  Z4SS               
      4.51673418E-02    2      1000037   1000022                       # H+     -->  W2SS+  Z1SS               
      2.93414831E-01    2      1000037   1000023                       # H+     -->  W2SS+  Z2SS               
      2.71124654E-02    2      1000037   1000025                       # H+     -->  W2SS+  Z3SS               
      2.30183895E-03    2      1000037   1000035                       # H+     -->  W2SS+  Z4SS               
      3.24345347E-05    2           25        24                       # H+     -->  HL0    W+                 
