#  ISAJET SUSY parameters in SUSY Les Houches Accord 2 format
#  Created by ISALHA 2.0 Last revision: C. Balazs 21 Apr 2009
Block SPINFO   # Program information
     1   ISASUGRA from ISAJET          # Spectrum Calculator
     2   7.80   29-OCT-2009 12:50:36   # Version number
Block MODSEL   # Model selection
     1     1   # Minimal supergravity (mSUGRA) model               
Block SMINPUTS   # Standard Model inputs
     1     1.27846931E+02   # alpha_em^(-1)
     2     1.16570000E-05   # G_Fermi
     3     1.17200002E-01   # alpha_s(M_Z)
     4     9.11699982E+01   # m_{Z}(pole)
     5     4.19999981E+00   # m_{b}(m_{b})
     6     1.72500000E+02   # m_{top}(pole)
     7     1.77699995E+00   # m_{tau}(pole)
Block MINPAR   # SUSY breaking input parameters
     1     5.00000000E+02   # m_0
     2     3.90000000E+02   # m_{1/2}
     3     1.00000000E+01   # tan(beta)
     4     1.00000000E+00   # sign(mu)
     5     0.00000000E+00   # A_0
Block EXTPAR   # Non-universal SUSY breaking parameters
     0     2.03191896E+16   # Input scale
Block MASS   # Scalar and gaugino mass spectrum
#  PDG code   mass                 particle
        24     8.04229965E+01   #  W^+
        25     1.12578583E+02   #  h^0            
        35     7.45281738E+02   #  H^0            
        36     7.40215454E+02   #  A^0            
        37     7.50332642E+02   #  H^+            
   1000001     9.75231873E+02   #  dnl            
   1000002     9.71843811E+02   #  upl            
   1000003     9.75231934E+02   #  stl            
   1000004     9.71844788E+02   #  chl            
   1000005     8.74459167E+02   #  b1             
   1000006     7.02285095E+02   #  t1             
   1000011     5.65273376E+02   #  el-            
   1000012     5.58920776E+02   #  nuel           
   1000013     5.65273376E+02   #  mul-           
   1000014     5.58920776E+02   #  numl           
   1000015     5.15008179E+02   #  tau1           
   1000016     5.56235474E+02   #  nutl           
   1000021     9.35393066E+02   #  glss           
   1000022     1.58868515E+02   #  z1ss           
   1000023     2.97754242E+02   #  z2ss           
   1000024     2.98191742E+02   #  w1ss           
   1000025    -5.00369049E+02   #  z3ss           
   1000035     5.18358704E+02   #  z4ss           
   1000037     5.17759460E+02   #  w2ss           
   2000001     9.47639832E+02   #  dnr            
   2000002     9.49485962E+02   #  upr            
   2000003     9.47639832E+02   #  str            
   2000004     9.49486938E+02   #  chr            
   2000005     9.40092346E+02   #  b2             
   2000006     9.10617859E+02   #  t2             
   2000011     5.21452698E+02   #  er-            
   2000013     5.21452698E+02   #  mur-           
   2000015     5.64213440E+02   #  tau2           
Block ALPHA   # Effective Higgs mixing parameter
         -1.02964796E-01   # alpha
Block STOPMIX   # stop mixing matrix
  1  1     3.72414589E-01   # O_{11}
  1  2     9.28066492E-01   # O_{12}
  2  1    -9.28066492E-01   # O_{21}
  2  2     3.72414589E-01   # O_{22}
Block SBOTMIX   # sbottom mixing matrix
  1  1     9.92218673E-01   # O_{11}
  1  2     1.24507248E-01   # O_{12}
  2  1    -1.24507248E-01   # O_{21}
  2  2     9.92218673E-01   # O_{22}
Block STAUMIX   # stau mixing matrix
  1  1     1.77187473E-01   # O_{11}
  1  2     9.84177113E-01   # O_{12}
  2  1    -9.84177113E-01   # O_{21}
  2  2     1.77187473E-01   # O_{22}
Block NMIX   # neutralino mixing matrix
  1  1     9.93359983E-01   #
  1  2    -2.66732182E-02   #
  1  3     1.03779137E-01   #
  1  4    -4.18895334E-02   #
  2  1    -5.72662838E-02   #
  2  2    -9.56467867E-01   #
  2  3     2.38457724E-01   #
  2  4    -1.58201575E-01   #
  3  1     4.18201163E-02   #
  3  2    -6.02689683E-02   #
  3  3    -7.01800764E-01   #
  3  4    -7.08585918E-01   #
  4  1    -9.05976817E-02   #
  4  2     2.84298271E-01   #
  4  3     6.63206577E-01   #
  4  4    -6.86384439E-01   #
Block UMIX   # chargino U mixing matrix
  1  1    -9.40034688E-01   # U_{11}
  1  2     3.41078877E-01   # U_{12}
  2  1    -3.41078877E-01   # U_{21}
  2  2    -9.40034688E-01   # U_{22}
Block VMIX   # chargino V mixing matrix
  1  1    -9.73794580E-01   # V_{11}
  1  2     2.27429464E-01   # V_{12}
  2  1    -2.27429464E-01   # V_{21}
  2  2    -9.73794580E-01   # V_{22}
Block GAUGE Q=  7.61811829E+02   #
     1     3.57487589E-01   # g`
     2     6.52487934E-01   # g_2
     3     1.22077334E+00   # g_3
Block YU Q=  7.61811829E+02   #
  3  3     8.65112007E-01   # y_t
Block YD Q=  7.61811829E+02   #
  3  3     1.34186119E-01   # y_b
Block YE Q=  7.61811829E+02   #
  3  3     1.01971574E-01   # y_tau
Block HMIX Q=  7.61811829E+02   # Higgs mixing parameters
     1     4.94455383E+02   # mu(Q)
     2     1.00000000E+01   # tan(beta)(M_GUT)
     3     2.50686829E+02   # Higgs vev at Q
     4     5.47918938E+05   # m_A^2(Q)
Block MSOFT Q=  7.61811829E+02   # DRbar SUSY breaking parameters
     1     1.62324280E+02   # M_1(Q)          
     2     3.02637024E+02   # M_2(Q)          
     3     8.73778442E+02   # M_3(Q)          
    31     5.61195984E+02   # MeL(Q)          
    32     5.61195984E+02   # MmuL(Q)         
    33     5.58564331E+02   # MtauL(Q)        
    34     5.19173706E+02   # MeR(Q)          
    35     5.19173706E+02   # MmuR(Q)         
    36     5.14135132E+02   # MtauR(Q)        
    41     9.27666504E+02   # MqL1(Q)         
    42     9.27666504E+02   # MqL2(Q)         
    43     8.35341736E+02   # MqL3(Q)         
    44     9.04690735E+02   # MuR(Q)          
    45     9.04690735E+02   # McR(Q)          
    46     6.94754333E+02   # MtR(Q)          
    47     9.01821960E+02   # MdR(Q)          
    48     9.01821960E+02   # MsR(Q)          
    49     9.01402222E+02   # MbR(Q)          
Block AU Q=  7.61811829E+02   #
  1  1    -6.96574219E+02   # A_u
  2  2    -6.96574219E+02   # A_c
  3  3    -6.96574219E+02   # A_t
Block AD Q=  7.61811829E+02   #
  1  1    -1.03201770E+03   # A_d
  2  2    -1.03201770E+03   # A_s
  3  3    -1.03201770E+03   # A_b
Block AE Q=  7.61811829E+02   #
  1  1    -2.33777176E+02   # A_e
  2  2    -2.33777176E+02   # A_mu
  3  3    -2.33777176E+02   # A_tau
#  ISAJET decay tables in SUSY Les Houches accord format
#  Created by ISALHD. Last revision: C. Balazs, 2005 May 25
Block DCINFO                           # Program information
     1   ISASUGRA from ISAJET          # Spectrum Calculator
     2   7.80   29-OCT-2009 12:50:36   # Version number
#         PDG         Width
DECAY         6  1.14680779E+00   # TP    decays
#          BR          NDA       ID1       ID2       ID3       ID4
      3.33333343E-01    3            2        -1         5             # TP     -->  UP     DB     BT          
      3.33333343E-01    3            4        -3         5             # TP     -->  CH     SB     BT          
      1.11111112E-01    3          -11        12         5             # TP     -->  E+     NUE    BT          
      1.11111112E-01    3          -13        14         5             # TP     -->  MU+    NUM    BT          
      1.11111112E-01    3          -15        16         5             # TP     -->  TAU+   NUT    BT          
#         PDG         Width
DECAY   1000021  1.79664922E+00   # GLSS  decays
#          BR          NDA       ID1       ID2       ID3       ID4
      6.10595616E-03    3      1000024         1        -2             # GLSS   -->  W1SS+  DN     UB          
      6.10595616E-03    3     -1000024         2        -1             # GLSS   -->  W1SS-  UP     DB          
      6.10591844E-03    3      1000024         3        -4             # GLSS   -->  W1SS+  ST     CB          
      6.10591844E-03    3     -1000024         4        -3             # GLSS   -->  W1SS-  CH     SB          
      1.68674230E-03    3      1000024         5        -6             # GLSS   -->  W1SS+  BT     TB          
      1.68674230E-03    3     -1000024         6        -5             # GLSS   -->  W1SS-  TP     BB          
      2.03306350E-04    3      1000037         1        -2             # GLSS   -->  W2SS+  DN     UB          
      2.03306350E-04    3     -1000037         2        -1             # GLSS   -->  W2SS-  UP     DB          
      2.03305288E-04    3      1000037         3        -4             # GLSS   -->  W2SS+  ST     CB          
      2.03305288E-04    3     -1000037         4        -3             # GLSS   -->  W2SS-  CH     SB          
      4.80616785E-04    3      1000037         5        -6             # GLSS   -->  W2SS+  BT     TB          
      4.80616785E-04    3     -1000037         6        -5             # GLSS   -->  W2SS-  TP     BB          
      8.20051071E-07    2      1000022        21                       # GLSS   -->  Z1SS   GL                 
      3.23497830E-03    3      1000022         2        -2             # GLSS   -->  Z1SS   UP     UB          
      9.91045497E-04    3      1000022         1        -1             # GLSS   -->  Z1SS   DN     DB          
      9.91045381E-04    3      1000022         3        -3             # GLSS   -->  Z1SS   ST     SB          
      3.23493057E-03    3      1000022         4        -4             # GLSS   -->  Z1SS   CH     CB          
      8.92508600E-04    3      1000022         5        -5             # GLSS   -->  Z1SS   BT     BB          
      1.47237180E-04    3      1000022         6        -6             # GLSS   -->  Z1SS   TP     TB          
      4.95636641E-06    2      1000023        21                       # GLSS   -->  Z2SS   GL                 
      3.18717863E-03    3      1000023         2        -2             # GLSS   -->  Z2SS   UP     UB          
      2.92935688E-03    3      1000023         1        -1             # GLSS   -->  Z2SS   DN     DB          
      2.92935479E-03    3      1000023         3        -3             # GLSS   -->  Z2SS   ST     SB          
      3.18714161E-03    3      1000023         4        -4             # GLSS   -->  Z2SS   CH     CB          
      1.47236569E-05    3      1000023         5        -5             # GLSS   -->  Z2SS   BT     BB          
      1.10827060E-03    3      1000023         6        -6             # GLSS   -->  Z2SS   TP     TB          
      1.12068970E-04    2      1000025        21                       # GLSS   -->  Z3SS   GL                 
      3.16020578E-06    3      1000025         2        -2             # GLSS   -->  Z3SS   UP     UB          
      3.53875225E-06    3      1000025         1        -1             # GLSS   -->  Z3SS   DN     DB          
      3.53874952E-06    3      1000025         3        -3             # GLSS   -->  Z3SS   ST     SB          
      3.16014393E-06    3      1000025         4        -4             # GLSS   -->  Z3SS   CH     CB          
      9.76973533E-05    3      1000025         5        -5             # GLSS   -->  Z3SS   BT     BB          
      1.64764875E-04    3      1000025         6        -6             # GLSS   -->  Z3SS   TP     TB          
      8.26346877E-05    2      1000035        21                       # GLSS   -->  Z4SS   GL                 
      9.87672975E-05    3      1000035         2        -2             # GLSS   -->  Z4SS   UP     UB          
      1.11484544E-04    3      1000035         1        -1             # GLSS   -->  Z4SS   DN     DB          
      1.11484442E-04    3      1000035         3        -3             # GLSS   -->  Z4SS   ST     SB          
      9.87658932E-05    3      1000035         4        -4             # GLSS   -->  Z4SS   CH     CB          
      1.10723711E-04    3      1000035         5        -5             # GLSS   -->  Z4SS   BT     BB          
      7.04820792E-04    3      1000035         6        -6             # GLSS   -->  Z4SS   TP     TB          
      9.35812294E-02    2     -1000005         5                       # GLSS   -->  BB1    BT                 
      9.35812294E-02    2      1000005        -5                       # GLSS   -->  BT1    BB                 
      3.79352868E-01    2     -1000006         6                       # GLSS   -->  TB1    TP                 
      3.79352868E-01    2      1000006        -6                       # GLSS   -->  TP1    TB                 
#         PDG         Width
DECAY   1000002  1.02979145E+01   # UPL   decays
#          BR          NDA       ID1       ID2       ID3       ID4
      9.07761790E-03    2      1000022         2                       # UPL    -->  Z1SS   UP                 
      3.04970413E-01    2      1000023         2                       # UPL    -->  Z2SS   UP                 
      5.93775592E-04    2      1000025         2                       # UPL    -->  Z3SS   UP                 
      1.45742828E-02    2      1000035         2                       # UPL    -->  Z4SS   UP                 
      3.14894989E-02    2      1000021         2                       # UPL    -->  GLSS   UP                 
      6.18217289E-01    2      1000024         1                       # UPL    -->  W1SS+  DN                 
      2.10771188E-02    2      1000037         1                       # UPL    -->  W2SS+  DN                 
#         PDG         Width
DECAY   1000001  1.02305222E+01   # DNL   decays
#          BR          NDA       ID1       ID2       ID3       ID4
      1.65559687E-02    2      1000022         1                       # DNL    -->  Z1SS   DN                 
      2.95248955E-01    2      1000023         1                       # DNL    -->  Z2SS   DN                 
      1.00507168E-03    2      1000025         1                       # DNL    -->  Z3SS   DN                 
      1.87016129E-02    2      1000035         1                       # DNL    -->  Z4SS   DN                 
      3.75897288E-02    2      1000021         1                       # DNL    -->  GLSS   DN                 
      5.82750976E-01    2     -1000024         2                       # DNL    -->  W1SS-  UP                 
      4.81476150E-02    2     -1000037         2                       # DNL    -->  W2SS-  UP                 
#         PDG         Width
DECAY   1000003  1.02304926E+01   # STL   decays
#          BR          NDA       ID1       ID2       ID3       ID4
      1.65560171E-02    2      1000022         3                       # STL    -->  Z1SS   ST                 
      2.95249820E-01    2      1000023         3                       # STL    -->  Z2SS   ST                 
      1.00507482E-03    2      1000025         3                       # STL    -->  Z3SS   ST                 
      1.87016688E-02    2      1000035         3                       # STL    -->  Z4SS   ST                 
      3.75899523E-02    2      1000021         3                       # STL    -->  GLSS   ST                 
      5.82750082E-01    2     -1000024         4                       # STL    -->  W1SS-  CH                 
      4.81474027E-02    2     -1000037         4                       # STL    -->  W2SS-  CH                 
#         PDG         Width
DECAY   1000004  1.02976980E+01   # CHL   decays
#          BR          NDA       ID1       ID2       ID3       ID4
      9.07778367E-03    2      1000022         4                       # CHL    -->  Z1SS   CH                 
      3.04975778E-01    2      1000023         4                       # CHL    -->  Z2SS   CH                 
      5.93785313E-04    2      1000025         4                       # CHL    -->  Z3SS   CH                 
      1.45745194E-02    2      1000035         4                       # CHL    -->  Z4SS   CH                 
      3.14693898E-02    2      1000021         4                       # CHL    -->  GLSS   CH                 
      6.18231118E-01    2      1000024         3                       # CHL    -->  W1SS+  ST                 
      2.10776161E-02    2      1000037         3                       # CHL    -->  W2SS+  ST                 
#         PDG         Width
DECAY   1000005  1.45270138E+01   # BT1   decays
#          BR          NDA       ID1       ID2       ID3       ID4
      1.18831871E-02    2      1000022         5                       # BT1    -->  Z1SS   BT                 
      1.78537324E-01    2      1000023         5                       # BT1    -->  Z2SS   BT                 
      4.98449523E-03    2      1000025         5                       # BT1    -->  Z3SS   BT                 
      1.20173087E-02    2      1000035         5                       # BT1    -->  Z4SS   BT                 
      3.16168934E-01    2     -1000024         6                       # BT1    -->  W1SS-  TP                 
      3.50379735E-01    2     -1000037         6                       # BT1    -->  W2SS-  TP                 
      1.26029044E-01    2          -24   1000006                       # BT1    -->  W-     TP1                
#         PDG         Width
DECAY   1000006  5.90132761E+00   # TP1   decays
#          BR          NDA       ID1       ID2       ID3       ID4
      1.93833530E-01    2      1000022         6                       # TP1    -->  Z1SS   TP                 
      1.05837330E-01    2      1000023         6                       # TP1    -->  Z2SS   TP                 
      1.55804262E-01    2      1000025         6                       # TP1    -->  Z3SS   TP                 
      1.61023382E-02    2      1000035         6                       # TP1    -->  Z4SS   TP                 
      2.75488347E-01    2      1000024         5                       # TP1    -->  W1SS+  BT                 
      2.52934217E-01    2      1000037         5                       # TP1    -->  W2SS+  BT                 
#         PDG         Width
DECAY   2000002  2.06828308E+00   # UPR   decays
#          BR          NDA       ID1       ID2       ID3       ID4
      9.67484772E-01    2      1000022         2                       # UPR    -->  Z1SS   UP                 
      2.76679266E-03    2      1000023         2                       # UPR    -->  Z2SS   UP                 
      9.46845626E-04    2      1000025         2                       # UPR    -->  Z3SS   UP                 
      4.19706758E-03    2      1000035         2                       # UPR    -->  Z4SS   UP                 
      2.46045068E-02    2      1000021         2                       # UPR    -->  GLSS   UP                 
#         PDG         Width
DECAY   2000001  5.41832864E-01   # DNR   decays
#          BR          NDA       ID1       ID2       ID3       ID4
      9.21267927E-01    2      1000022         1                       # DNR    -->  Z1SS   DN                 
      2.63297348E-03    2      1000023         1                       # DNR    -->  Z2SS   DN                 
      8.99114588E-04    2      1000025         1                       # DNR    -->  Z3SS   DN                 
      3.98424361E-03    2      1000035         1                       # DNR    -->  Z4SS   DN                 
      7.12157041E-02    2      1000021         1                       # DNR    -->  GLSS   DN                 
#         PDG         Width
DECAY   2000003  5.41832864E-01   # STR   decays
#          BR          NDA       ID1       ID2       ID3       ID4
      9.21267927E-01    2      1000022         3                       # STR    -->  Z1SS   ST                 
      2.63297348E-03    2      1000023         3                       # STR    -->  Z2SS   ST                 
      8.99114588E-04    2      1000025         3                       # STR    -->  Z3SS   ST                 
      3.98424361E-03    2      1000035         3                       # STR    -->  Z4SS   ST                 
      7.12157041E-02    2      1000021         3                       # STR    -->  GLSS   ST                 
#         PDG         Width
DECAY   2000004  2.06804633E+00   # CHR   decays
#          BR          NDA       ID1       ID2       ID3       ID4
      9.67592537E-01    2      1000022         4                       # CHR    -->  Z1SS   CH                 
      2.76710000E-03    2      1000023         4                       # CHR    -->  Z2SS   CH                 
      9.46949178E-04    2      1000025         4                       # CHR    -->  Z3SS   CH                 
      4.19752533E-03    2      1000035         4                       # CHR    -->  Z4SS   CH                 
      2.44958848E-02    2      1000021         4                       # CHR    -->  GLSS   CH                 
#         PDG         Width
DECAY   2000005  1.14415276E+00   # BT2   decays
#          BR          NDA       ID1       ID2       ID3       ID4
      4.16730404E-01    2      1000022         5                       # BT2    -->  Z1SS   BT                 
      8.75753351E-03    2      1000023         5                       # BT2    -->  Z2SS   BT                 
      8.49890336E-02    2      1000025         5                       # BT2    -->  Z3SS   BT                 
      9.66816843E-02    2      1000035         5                       # BT2    -->  Z4SS   BT                 
      1.55955888E-02    2     -1000024         6                       # BT2    -->  W1SS-  TP                 
      3.04416239E-01    2     -1000037         6                       # BT2    -->  W2SS-  TP                 
      7.28295892E-02    2          -24   1000006                       # BT2    -->  W-     TP1                
#         PDG         Width
DECAY   2000006  1.60445366E+01   # TP2   decays
#          BR          NDA       ID1       ID2       ID3       ID4
      2.40799055E-01    2      1000024         5                       # TP2    -->  W1SS+  BT                 
      1.10972822E-01    2      1000037         5                       # TP2    -->  W2SS+  BT                 
      8.92315432E-02    2           23   1000006                       # TP2    -->  Z0     TP1                
      6.72976002E-02    2           25   1000006                       # TP2    -->  HL0    TP1                
      1.34377191E-02    2      1000022         6                       # TP2    -->  Z1SS   TP                 
      1.10904604E-01    2      1000023         6                       # TP2    -->  Z2SS   TP                 
      1.31137490E-01    2      1000025         6                       # TP2    -->  Z3SS   TP                 
      2.36219123E-01    2      1000035         6                       # TP2    -->  Z4SS   TP                 
#         PDG         Width
DECAY   1000011  3.96500111E+00   # EL-   decays
#          BR          NDA       ID1       ID2       ID3       ID4
      1.37275219E-01    2      1000022        11                       # EL-    -->  Z1SS   E-                 
      3.05784643E-01    2      1000023        11                       # EL-    -->  Z2SS   E-                 
      3.90843379E-05    2      1000025        11                       # EL-    -->  Z3SS   E-                 
      8.35361425E-04    2      1000035        11                       # EL-    -->  Z4SS   E-                 
      5.52444458E-01    2     -1000024        12                       # EL-    -->  W1SS-  NUE                
      3.62124597E-03    2     -1000037        12                       # EL-    -->  W2SS-  NUE                
#         PDG         Width
DECAY   1000013  3.96500087E+00   # MUL-  decays
#          BR          NDA       ID1       ID2       ID3       ID4
      1.37275219E-01    2      1000022        13                       # MUL-   -->  Z1SS   MU-                
      3.05784643E-01    2      1000023        13                       # MUL-   -->  Z2SS   MU-                
      3.90842797E-05    2      1000025        13                       # MUL-   -->  Z3SS   MU-                
      8.35359329E-04    2      1000035        13                       # MUL-   -->  Z4SS   MU-                
      5.52444458E-01    2     -1000024        14                       # MUL-   -->  W1SS-  NUM                
      3.62124620E-03    2     -1000037        14                       # MUL-   -->  W2SS-  NUM                
#         PDG         Width
DECAY   1000015  2.22037363E+00   # TAU1- decays
#          BR          NDA       ID1       ID2       ID3       ID4
      9.34387505E-01    2      1000022        15                       # TAU1-  -->  Z1SS   TAU-               
      2.37422623E-02    2      1000023        15                       # TAU1-  -->  Z2SS   TAU-               
      6.67682252E-05    2      1000025        15                       # TAU1-  -->  Z3SS   TAU-               
      4.18034308E-02    2     -1000024        16                       # TAU1-  -->  W1SS-  NUT                
#         PDG         Width
DECAY   1000012  3.97847557E+00   # NUEL  decays
#          BR          NDA       ID1       ID2       ID3       ID4
      1.63848549E-01    2      1000022        12                       # NUEL   -->  Z1SS   NUE                
      2.59530842E-01    2      1000023        12                       # NUEL   -->  Z2SS   NUE                
      1.61571865E-04    2      1000025        12                       # NUEL   -->  Z3SS   NUE                
      1.29144418E-03    2      1000035        12                       # NUEL   -->  Z4SS   NUE                
      5.73936403E-01    2      1000024        11                       # NUEL   -->  W1SS+  E-                 
      1.23117678E-03    2      1000037        11                       # NUEL   -->  W2SS+  E-                 
#         PDG         Width
DECAY   1000014  3.97847509E+00   # NUML  decays
#          BR          NDA       ID1       ID2       ID3       ID4
      1.63848564E-01    2      1000022        14                       # NUML   -->  Z1SS   NUM                
      2.59530872E-01    2      1000023        14                       # NUML   -->  Z2SS   NUM                
      1.61571879E-04    2      1000025        14                       # NUML   -->  Z3SS   NUM                
      1.29144429E-03    2      1000035        14                       # NUML   -->  Z4SS   NUM                
      5.73936403E-01    2      1000024        13                       # NUML   -->  W1SS+  MU-                
      1.23117259E-03    2      1000037        13                       # NUML   -->  W2SS+  MU-                
#         PDG         Width
DECAY   1000016  3.93959975E+00   # NUTL  decays
#          BR          NDA       ID1       ID2       ID3       ID4
      1.64390400E-01    2      1000022        16                       # NUTL   -->  Z1SS   NUT                
      2.58835793E-01    2      1000023        16                       # NUTL   -->  Z2SS   NUT                
      1.49941814E-04    2      1000025        16                       # NUTL   -->  Z3SS   NUT                
      1.14802783E-03    2      1000035        16                       # NUTL   -->  Z4SS   NUT                
      5.73837280E-01    2      1000024        15                       # NUTL   -->  W1SS+  TAU-               
      1.63591502E-03    2      1000037        15                       # NUTL   -->  W2SS+  TAU-               
      2.88111494E-07    3      1000015        16       -15             # NUTL   -->  TAU1-  NUT    TAU+        
      2.88111494E-07    3      1000015        12       -11             # NUTL   -->  TAU1-  NUE    E+          
      2.88111494E-07    3      1000015        14       -13             # NUTL   -->  TAU1-  NUM    MU+         
      8.64334424E-07    3      1000015         2        -1             # NUTL   -->  TAU1-  UP     DB          
      8.64334424E-07    3      1000015         4        -3             # NUTL   -->  TAU1-  CH     SB          
#         PDG         Width
DECAY   2000011  2.15782118E+00   # ER-   decays
#          BR          NDA       ID1       ID2       ID3       ID4
      9.98154283E-01    2      1000022        11                       # ER-    -->  Z1SS   E-                 
      1.83083734E-03    2      1000023        11                       # ER-    -->  Z2SS   E-                 
      1.34943029E-05    2      1000025        11                       # ER-    -->  Z3SS   E-                 
      1.41226803E-06    2      1000035        11                       # ER-    -->  Z4SS   E-                 
#         PDG         Width
DECAY   2000013  2.15782094E+00   # MUR-  decays
#          BR          NDA       ID1       ID2       ID3       ID4
      9.98154283E-01    2      1000022        13                       # MUR-   -->  Z1SS   MU-                
      1.83083687E-03    2      1000023        13                       # MUR-   -->  Z2SS   MU-                
      1.34941274E-05    2      1000025        13                       # MUR-   -->  Z3SS   MU-                
      1.41144994E-06    2      1000035        13                       # MUR-   -->  Z4SS   MU-                
#         PDG         Width
DECAY   2000015  3.83475447E+00   # TAU2- decays
#          BR          NDA       ID1       ID2       ID3       ID4
      1.54440373E-01    2      1000022        15                       # TAU2-  -->  Z1SS   TAU-               
      2.99971551E-01    2      1000023        15                       # TAU2-  -->  Z2SS   TAU-               
      8.61136185E-04    2      1000025        15                       # TAU2-  -->  Z3SS   TAU-               
      1.45267905E-03    2      1000035        15                       # TAU2-  -->  Z4SS   TAU-               
      5.39222300E-01    2     -1000024        16                       # TAU2-  -->  W1SS-  NUT                
      4.05198801E-03    2     -1000037        16                       # TAU2-  -->  W2SS-  NUT                
#         PDG         Width
DECAY   1000023  1.44659681E-02   # Z2SS  decays
#          BR          NDA       ID1       ID2       ID3       ID4
      1.33037872E-06    2      1000022        22                       # Z2SS   -->  Z1SS   GM                 
      9.55392718E-02    2      1000022        23                       # Z2SS   -->  Z1SS   Z0                 
      1.21119001E-06    3      1000022         2        -2             # Z2SS   -->  Z1SS   UP     UB          
      1.97486543E-06    3      1000022         1        -1             # Z2SS   -->  Z1SS   DN     DB          
      1.97486474E-06    3      1000022         3        -3             # Z2SS   -->  Z1SS   ST     SB          
      1.21118455E-06    3      1000022         4        -4             # Z2SS   -->  Z1SS   CH     CB          
      4.03568492E-06    3      1000022         5        -5             # Z2SS   -->  Z1SS   BT     BB          
      5.20926696E-05    3      1000022        11       -11             # Z2SS   -->  Z1SS   E-     E+          
      5.20926696E-05    3      1000022        13       -13             # Z2SS   -->  Z1SS   MU-    MU+         
      5.68471587E-05    3      1000022        15       -15             # Z2SS   -->  Z1SS   TAU-   TAU+        
      5.71263045E-05    3      1000022        12       -12             # Z2SS   -->  Z1SS   NUE    ANUE        
      5.71263045E-05    3      1000022        14       -14             # Z2SS   -->  Z1SS   NUM    ANUM        
      5.84780028E-05    3      1000022        16       -16             # Z2SS   -->  Z1SS   NUT    ANUT        
      9.04115200E-01    2      1000022        25                       # Z2SS   -->  Z1SS   HL0                
#         PDG         Width
DECAY   1000025  2.48182797E+00   # Z3SS  decays
#          BR          NDA       ID1       ID2       ID3       ID4
      9.51528776E-08    2      1000022        22                       # Z3SS   -->  Z1SS   GM                 
      2.78825496E-07    2      1000023        22                       # Z3SS   -->  Z2SS   GM                 
      2.99840510E-01    2      1000024       -24                       # Z3SS   -->  W1SS+  W-                 
      2.99840510E-01    2     -1000024        24                       # Z3SS   -->  W1SS-  W+                 
      1.17027350E-01    2      1000022        23                       # Z3SS   -->  Z1SS   Z0                 
      2.54249454E-01    2      1000023        23                       # Z3SS   -->  Z2SS   Z0                 
      5.08886755E-09    3      1000022         2        -2             # Z3SS   -->  Z1SS   UP     UB          
      1.90285632E-09    3      1000022         1        -1             # Z3SS   -->  Z1SS   DN     DB          
      1.90285587E-09    3      1000022         3        -3             # Z3SS   -->  Z1SS   ST     SB          
      5.08884224E-09    3      1000022         4        -4             # Z3SS   -->  Z1SS   CH     CB          
      7.85992825E-07    3      1000022         5        -5             # Z3SS   -->  Z1SS   BT     BB          
      3.88204143E-07    3      1000022        11       -11             # Z3SS   -->  Z1SS   E-     E+          
      3.88204143E-07    3      1000022        13       -13             # Z3SS   -->  Z1SS   MU-    MU+         
      9.12965243E-06    3      1000022        15       -15             # Z3SS   -->  Z1SS   TAU-   TAU+        
      1.58573428E-07    3      1000022        12       -12             # Z3SS   -->  Z1SS   NUE    ANUE        
      1.58573428E-07    3      1000022        14       -14             # Z3SS   -->  Z1SS   NUM    ANUM        
      1.65560394E-07    3      1000022        16       -16             # Z3SS   -->  Z1SS   NUT    ANUT        
      2.80542434E-09    3      1000023         2        -2             # Z3SS   -->  Z2SS   UP     UB          
      4.39820669E-09    3      1000023         1        -1             # Z3SS   -->  Z2SS   DN     DB          
      4.39820536E-09    3      1000023         3        -3             # Z3SS   -->  Z2SS   ST     SB          
      2.80541057E-09    3      1000023         4        -4             # Z3SS   -->  Z2SS   CH     CB          
      3.83674745E-07    3      1000023         5        -5             # Z3SS   -->  Z2SS   BT     BB          
      1.59513860E-08    3      1000023        11       -11             # Z3SS   -->  Z2SS   E-     E+          
      1.59513860E-08    3      1000023        13       -13             # Z3SS   -->  Z2SS   MU-    MU+         
      6.15994111E-07    3      1000023        15       -15             # Z3SS   -->  Z2SS   TAU-   TAU+        
      7.71689272E-08    3      1000023        12       -12             # Z3SS   -->  Z2SS   NUE    ANUE        
      7.71689272E-08    3      1000023        14       -14             # Z3SS   -->  Z2SS   NUM    ANUM        
      8.13149157E-08    3      1000023        16       -16             # Z3SS   -->  Z2SS   NUT    ANUT        
      1.98121704E-02    2      1000022        25                       # Z3SS   -->  Z1SS   HL0                
      9.21714678E-03    2      1000023        25                       # Z3SS   -->  Z2SS   HL0                
#         PDG         Width
DECAY   1000035  2.74442887E+00   # Z4SS  decays
#          BR          NDA       ID1       ID2       ID3       ID4
      3.49134098E-07    2      1000022        22                       # Z4SS   -->  Z1SS   GM                 
      1.10388001E-08    2      1000023        22                       # Z4SS   -->  Z2SS   GM                 
      1.84853199E-09    2      1000025        22                       # Z4SS   -->  Z3SS   GM                 
      3.23493779E-01    2      1000024       -24                       # Z4SS   -->  W1SS+  W-                 
      3.23493779E-01    2     -1000024        24                       # Z4SS   -->  W1SS-  W+                 
      2.12315470E-02    2      1000022        23                       # Z4SS   -->  Z1SS   Z0                 
      1.48215378E-02    2      1000023        23                       # Z4SS   -->  Z2SS   Z0                 
      8.67461836E-08    3      1000022         2        -2             # Z4SS   -->  Z1SS   UP     UB          
      8.09452345E-08    3      1000022         1        -1             # Z4SS   -->  Z1SS   DN     DB          
      8.09452132E-08    3      1000022         3        -3             # Z4SS   -->  Z1SS   ST     SB          
      8.67457786E-08    3      1000022         4        -4             # Z4SS   -->  Z1SS   CH     CB          
      7.79479137E-07    3      1000022         5        -5             # Z4SS   -->  Z1SS   BT     BB          
      6.44980128E-06    3      1000022        11       -11             # Z4SS   -->  Z1SS   E-     E+          
      6.44980128E-06    3      1000022        13       -13             # Z4SS   -->  Z1SS   MU-    MU+         
      4.10427810E-06    3      1000022        15       -15             # Z4SS   -->  Z1SS   TAU-   TAU+        
      5.85572297E-06    3      1000022        12       -12             # Z4SS   -->  Z1SS   NUE    ANUE        
      5.85572297E-06    3      1000022        14       -14             # Z4SS   -->  Z1SS   NUM    ANUM        
      6.11482392E-06    3      1000022        16       -16             # Z4SS   -->  Z1SS   NUT    ANUT        
      2.67417050E-07    3      1000023         2        -2             # Z4SS   -->  Z2SS   UP     UB          
      3.17846684E-07    3      1000023         1        -1             # Z4SS   -->  Z2SS   DN     DB          
      3.17846570E-07    3      1000023         3        -3             # Z4SS   -->  Z2SS   ST     SB          
      2.67415743E-07    3      1000023         4        -4             # Z4SS   -->  Z2SS   CH     CB          
      8.99082067E-07    3      1000023         5        -5             # Z4SS   -->  Z2SS   BT     BB          
      2.23343250E-06    3      1000023        11       -11             # Z4SS   -->  Z2SS   E-     E+          
      2.23343250E-06    3      1000023        13       -13             # Z4SS   -->  Z2SS   MU-    MU+         
      3.59099590E-06    3      1000023        15       -15             # Z4SS   -->  Z2SS   TAU-   TAU+        
      4.46494550E-06    3      1000023        12       -12             # Z4SS   -->  Z2SS   NUE    ANUE        
      4.46494550E-06    3      1000023        14       -14             # Z4SS   -->  Z2SS   NUM    ANUM        
      4.70645136E-06    3      1000023        16       -16             # Z4SS   -->  Z2SS   NUT    ANUT        
      7.64853212E-08    3      1000025         2        -2             # Z4SS   -->  Z3SS   UP     UB          
      9.87075595E-08    3      1000025         1        -1             # Z4SS   -->  Z3SS   DN     DB          
      9.87075595E-08    3      1000025         3        -3             # Z4SS   -->  Z3SS   ST     SB          
      7.64853212E-08    3      1000025         4        -4             # Z4SS   -->  Z3SS   CH     CB          
      4.05879526E-08    3      1000025         5        -5             # Z4SS   -->  Z3SS   BT     BB          
      2.25397194E-08    3      1000025        11       -11             # Z4SS   -->  Z3SS   E-     E+          
      2.25397194E-08    3      1000025        13       -13             # Z4SS   -->  Z3SS   MU-    MU+         
      1.98361843E-08    3      1000025        15       -15             # Z4SS   -->  Z3SS   TAU-   TAU+        
      4.42206876E-08    3      1000025        12       -12             # Z4SS   -->  Z3SS   NUE    ANUE        
      4.42206876E-08    3      1000025        14       -14             # Z4SS   -->  Z3SS   NUM    ANUM        
      4.42018262E-08    3      1000025        16       -16             # Z4SS   -->  Z3SS   NUT    ANUT        
      9.52702239E-02    2      1000022        25                       # Z4SS   -->  Z1SS   HL0                
      2.21627653E-01    2      1000023        25                       # Z4SS   -->  Z2SS   HL0                
      4.61917466E-07    2      1000015       -15                       # Z4SS   -->  TAU1-  TAU+               
      4.61917466E-07    2     -1000015        15                       # Z4SS   -->  TAU1+  TAU-               
#         PDG         Width
DECAY   1000024  1.36196604E-02   # W1SS+ decays
#          BR          NDA       ID1       ID2       ID3       ID4
      3.32998911E-06    3      1000022         2        -1             # W1SS+  -->  Z1SS   UP     DB          
      3.32998252E-06    3      1000022         4        -3             # W1SS+  -->  Z1SS   CH     SB          
      1.17303010E-04    3      1000022       -11        12             # W1SS+  -->  Z1SS   E+     NUE         
      1.17303010E-04    3      1000022       -13        14             # W1SS+  -->  Z1SS   MU+    NUM         
      1.24022976E-04    3      1000022       -15        16             # W1SS+  -->  Z1SS   TAU+   NUT         
      9.99634683E-01    2      1000022        24                       # W1SS+  -->  Z1SS   W+                 
      7.09406926E-13    3      1000023       -11        12             # W1SS+  -->  Z2SS   E+     NUE         
      7.09406926E-13    3      1000023       -13        14             # W1SS+  -->  Z2SS   MU+    NUM         
#         PDG         Width
DECAY   1000037  2.64614391E+00   # W2SS+ decays
#          BR          NDA       ID1       ID2       ID3       ID4
      1.21695336E-07    3      1000022         2        -1             # W2SS+  -->  Z1SS   UP     DB          
      1.21695152E-07    3      1000022         4        -3             # W2SS+  -->  Z1SS   CH     SB          
      7.38965582E-06    3      1000022       -11        12             # W2SS+  -->  Z1SS   E+     NUE         
      7.38965582E-06    3      1000022       -13        14             # W2SS+  -->  Z1SS   MU+    NUM         
      1.01081259E-05    3      1000022       -15        16             # W2SS+  -->  Z1SS   TAU+   NUT         
      1.00266576E-01    2      1000022        24                       # W2SS+  -->  Z1SS   W+                 
      2.41601413E-07    3      1000023         2        -1             # W2SS+  -->  Z2SS   UP     DB          
      2.41601185E-07    3      1000023         4        -3             # W2SS+  -->  Z2SS   CH     SB          
      3.32500190E-06    3      1000023       -11        12             # W2SS+  -->  Z2SS   E+     NUE         
      3.32500190E-06    3      1000023       -13        14             # W2SS+  -->  Z2SS   MU+    NUM         
      4.49239633E-06    3      1000023       -15        16             # W2SS+  -->  Z2SS   TAU+   NUT         
      3.40428472E-01    2      1000023        24                       # W2SS+  -->  Z2SS   W+                 
      2.34211413E-07    3      1000025         2        -1             # W2SS+  -->  Z3SS   UP     DB          
      2.34211413E-07    3      1000025         4        -3             # W2SS+  -->  Z3SS   CH     SB          
      7.79982301E-08    3      1000025       -11        12             # W2SS+  -->  Z3SS   E+     NUE         
      7.79982301E-08    3      1000025       -13        14             # W2SS+  -->  Z3SS   MU+    NUM         
      7.80935210E-08    3      1000025       -15        16             # W2SS+  -->  Z3SS   TAU+   NUT         
      7.02474722E-07    2     -1000015        16                       # W2SS+  -->  TAU1+  NUT                
      3.06045711E-01    2      1000024        23                       # W2SS+  -->  W1SS+  Z0                 
      2.72734468E-07    3      1000024         1        -1             # W2SS+  -->  W1SS+  DN     DB          
      2.72733132E-07    3      1000024         3        -3             # W2SS+  -->  W1SS+  ST     SB          
      5.61929994E-07    3      1000024         2        -2             # W2SS+  -->  W1SS+  UP     UB          
      5.61929767E-07    3      1000024         4        -4             # W2SS+  -->  W1SS+  CH     CB          
      6.29271017E-06    3      1000024        12       -12             # W2SS+  -->  W1SS+  NUE    ANUE        
      6.29271017E-06    3      1000024        14       -14             # W2SS+  -->  W1SS+  NUM    ANUM        
      3.40031124E-06    3      1000024        11       -11             # W2SS+  -->  W1SS+  E-     E+          
      3.40031124E-06    3      1000024        13       -13             # W2SS+  -->  W1SS+  MU-    MU+         
      3.59381488E-06    3      1000024        15       -15             # W2SS+  -->  W1SS+  TAU-   TAU+        
      2.53196537E-01    2      1000024        25                       # W2SS+  -->  W1SS+  HL0                
#         PDG         Width
DECAY        25  4.12884308E-03   # HL0   decays
#          BR          NDA       ID1       ID2       ID3       ID4
      4.94406249E-09    2           11       -11                       # HL0    -->  E-     E+                 
      2.08746147E-04    2           13       -13                       # HL0    -->  MU-    MU+                
      5.96990548E-02    2           15       -15                       # HL0    -->  TAU-   TAU+               
      6.20731316E-06    2            1        -1                       # HL0    -->  DN     DB                 
      2.50806543E-03    2            3        -3                       # HL0    -->  ST     SB                 
      8.24675679E-01    2            5        -5                       # HL0    -->  BT     BB                 
      1.86018019E-06    2            2        -2                       # HL0    -->  UP     UB                 
      3.51326242E-02    2            4        -4                       # HL0    -->  CH     CB                 
      1.66307553E-03    2           22        22                       # HL0    -->  GM     GM                 
      3.62225808E-02    2           21        21                       # HL0    -->  GL     GL                 
      2.08390108E-03    3           24        11       -12             # HL0    -->  W+     E-     ANUE        
      2.08390108E-03    3           24        13       -14             # HL0    -->  W+     MU-    ANUM        
      2.08390108E-03    3           24        15       -16             # HL0    -->  W+     TAU-   ANUT        
      6.25170395E-03    3           24        -2         1             # HL0    -->  W+     UB     DN          
      6.25170395E-03    3           24        -4         3             # HL0    -->  W+     CB     ST          
      2.08390108E-03    3          -24       -11        12             # HL0    -->  W-     E+     NUE         
      2.08390108E-03    3          -24       -13        14             # HL0    -->  W-     MU+    NUM         
      2.08390108E-03    3          -24       -15        16             # HL0    -->  W-     TAU+   NUT         
      6.25170395E-03    3          -24         2        -1             # HL0    -->  W-     UP     DB          
      6.25170395E-03    3          -24         4        -3             # HL0    -->  W-     CH     SB          
      1.62221259E-04    3           23        12       -12             # HL0    -->  Z0     NUE    ANUE        
      1.62221259E-04    3           23        14       -14             # HL0    -->  Z0     NUM    ANUM        
      1.62221259E-04    3           23        16       -16             # HL0    -->  Z0     NUT    ANUT        
      8.16443280E-05    3           23        11       -11             # HL0    -->  Z0     E-     E+          
      8.16443280E-05    3           23        13       -13             # HL0    -->  Z0     MU-    MU+         
      8.16443280E-05    3           23        15       -15             # HL0    -->  Z0     TAU-   TAU+        
      2.79706554E-04    3           23         2        -2             # HL0    -->  Z0     UP     UB          
      2.79706554E-04    3           23         4        -4             # HL0    -->  Z0     CH     CB          
      3.60330945E-04    3           23         1        -1             # HL0    -->  Z0     DN     DB          
      3.60330945E-04    3           23         3        -3             # HL0    -->  Z0     ST     SB          
      3.60330945E-04    3           23         5        -5             # HL0    -->  Z0     BT     BB          
#         PDG         Width
DECAY        35  1.92740750E+00   # HH0   decays
#          BR          NDA       ID1       ID2       ID3       ID4
      6.56672539E-09    2           11       -11                       # HH0    -->  E-     E+                 
      2.77258951E-04    2           13       -13                       # HH0    -->  MU-    MU+                
      7.94085190E-02    2           15       -15                       # HH0    -->  TAU-   TAU+               
      8.06494336E-06    2            1        -1                       # HH0    -->  DN     DB                 
      3.25864507E-03    2            3        -3                       # HH0    -->  ST     SB                 
      5.04224122E-01    2            5        -5                       # HH0    -->  BT     BB                 
      2.75525630E-10    2            2        -2                       # HH0    -->  UP     UB                 
      4.02259275E-06    2            4        -4                       # HH0    -->  CH     CB                 
      1.58929408E-01    2            6        -6                       # HH0    -->  TP     TB                 
      2.38472967E-06    2           22        22                       # HH0    -->  GM     GM                 
      1.43832411E-04    2           21        21                       # HH0    -->  GL     GL                 
      7.08070758E-04    2           24       -24                       # HH0    -->  W+     W-                 
      3.56286007E-04    2           23        23                       # HH0    -->  Z0     Z0                 
      7.73187820E-03    2      1000022   1000022                       # HH0    -->  Z1SS   Z1SS               
      3.75233293E-02    2      1000022   1000023                       # HH0    -->  Z1SS   Z2SS               
      1.00059949E-01    2      1000022   1000025                       # HH0    -->  Z1SS   Z3SS               
      9.60776769E-03    2      1000022   1000035                       # HH0    -->  Z1SS   Z4SS               
      2.95545142E-02    2      1000023   1000023                       # HH0    -->  Z2SS   Z2SS               
      6.67848811E-02    2      1000024  -1000024                       # HH0    -->  W1SS+  W1SS-              
      1.41697982E-03    2           25        25                       # HH0    -->  HL0    HL0                
#         PDG         Width
DECAY        36  2.45228314E+00   # HA0   decays
#          BR          NDA       ID1       ID2       ID3       ID4
      5.12956477E-09    2           11       -11                       # HA0    -->  E-     E+                 
      2.16579472E-04    2           13       -13                       # HA0    -->  MU-    MU+                
      6.20309636E-02    2           15       -15                       # HA0    -->  TAU-   TAU+               
      6.30026807E-06    2            1        -1                       # HA0    -->  DN     DB                 
      2.54562707E-03    2            3        -3                       # HA0    -->  ST     SB                 
      3.93929243E-01    2            5        -5                       # HA0    -->  BT     BB                 
      2.01588357E-10    2            2        -2                       # HA0    -->  UP     UB                 
      2.94559027E-06    2            4        -4                       # HA0    -->  CH     CB                 
      1.43652827E-01    2            6        -6                       # HA0    -->  TP     TB                 
      3.02636181E-07    2           22        22                       # HA0    -->  GM     GM                 
      1.43910540E-04    2           21        21                       # HA0    -->  GL     GL                 
      8.68654158E-03    2      1000022   1000022                       # HA0    -->  Z1SS   Z1SS               
      5.65422028E-02    2      1000022   1000023                       # HA0    -->  Z1SS   Z2SS               
      1.30312983E-02    2      1000022   1000025                       # HA0    -->  Z1SS   Z3SS               
      4.97615598E-02    2      1000022   1000035                       # HA0    -->  Z1SS   Z4SS               
      8.26698840E-02    2      1000023   1000023                       # HA0    -->  Z2SS   Z2SS               
      1.86254233E-01    2      1000024  -1000024                       # HA0    -->  W1SS+  W1SS-              
      5.25711512E-04    2           25        23                       # HA0    -->  HL0    Z0                 
#         PDG         Width
DECAY        37  1.60051489E+00   # H+    decays
#          BR          NDA       ID1       ID2       ID3       ID4
      7.96685828E-09    2           12       -11                       # H+     -->  NUE    E+                 
      3.36375117E-04    2           14       -13                       # H+     -->  NUM    MU+                
      9.63419154E-02    2           16       -15                       # H+     -->  NUT    TAU+               
      8.97120572E-06    2            2        -1                       # H+     -->  UP     DB                 
      3.62886791E-03    2            4        -3                       # H+     -->  CH     SB                 
      6.96399391E-01    2            6        -5                       # H+     -->  TP     BB                 
      1.23722062E-01    2      1000024   1000022                       # H+     -->  W1SS+  Z1SS               
      3.34299402E-04    2      1000024   1000023                       # H+     -->  W1SS+  Z2SS               
      7.83884302E-02    2      1000037   1000022                       # H+     -->  W2SS+  Z1SS               
      8.39714077E-04    2           25        24                       # H+     -->  HL0    W+                 
