  65
  401   2000.8307    0.26333E-25
  402   1999.3210    0.26235E-25
  403   2000.8307    0.26333E-25
  404   1999.3215    0.26235E-25
  405   1999.9324    0.51877E-25
  406   1828.7444    0.13959E-25
  407   2000.8307    0.26333E-25
  408   1999.3210    0.26235E-25
  409   2000.8307    0.26333E-25
  410   1999.3215    0.26235E-25
  411   1999.9324    0.51877E-25
  412   1828.7444    0.13959E-25
  413   2000.1520    0.60152E-24
  414   1999.6959    0.15042E-24
  415   2000.1520    0.60152E-24
  416   1999.6964    0.15042E-24
  417   2001.0538    0.13903E-25
  418   2165.5852    0.80614E-26
  419   2000.1520    0.60152E-24
  420   1999.6959    0.15042E-24
  421   2000.1520    0.60152E-24
  422   1999.6964    0.15042E-24
  423   2001.0538    0.13903E-25
  424   2165.5852    0.80614E-26
  425   2000.5267    0.24197E-25
  426   1999.0170    0.24154E-25
  427   2000.5267    0.24197E-25
  428   1999.0170    0.24154E-25
  429     94.6309    0.18351E-21
  430   1999.0170    0.24025E-25
  431   2000.5267    0.24197E-25
  432   1999.0170    0.24154E-25
  433   2000.5267    0.24197E-25
  434   1999.0170    0.24154E-25
  435     94.6309    0.18351E-21
  436   1999.0170    0.24025E-25
  437     94.5912    0.27537E-21
  438      0.0000    0.10000E+31
  439     94.5913    0.27537E-21
  440      0.0000    0.10000E+31
  441   2000.5475    0.24067E-25
  442      0.0000    0.10000E+31
  443     94.5912    0.27537E-21
  444      0.0000    0.10000E+31
  445     94.5913    0.27537E-21
  446      0.0000    0.10000E+31
  447   2000.5475    0.24067E-25
  448      0.0000    0.10000E+31
  449   2000.0000    0.19576E-24
  450     69.4077    0.10000E+31
  451   -119.8333    0.27893E-21
  452    214.1209    0.53208E-24
  453    266.3047    0.24304E-24
  454     78.1342    0.80443E-17
  455    226.5629    0.85645E-24
  456     78.1342    0.80443E-17
  457    226.5629    0.85645E-24
  203    119.0149    0.13105E-21
  204    504.3801    0.11690E-24
  205    500.0000    0.11842E-24
  206    509.4134    0.12204E-24
  207    509.4134    0.12204E-24
  458      0.0000    0.10000E+31
    6    172.5000    0.57395E-24
   12    172.5000    0.57395E-24
   6
   401  0.77980608E-01     0   450     1     0     0     0
   401  0.10767821E-01     0   451     1     0     0     0
   401  0.18136427E+00     0   452     1     0     0     0
   401  0.71057886E-01     0   453     1     0     0     0
   401  0.94249338E-01     0   456     2     0     0     0
   401  0.56458008E+00     0   457     2     0     0     0
   6
   402  0.60643058E-01     0   450     2     0     0     0
   402  0.77275988E-02     0   451     2     0     0     0
   402  0.26512676E+00     0   452     2     0     0     0
   402  0.65643494E-02     0   453     2     0     0     0
   402  0.27478546E+00     0   454     1     0     0     0
   402  0.38515282E+00     0   455     1     0     0     0
   6
   403  0.77980660E-01     0   450     3     0     0     0
   403  0.10767828E-01     0   451     3     0     0     0
   403  0.18136439E+00     0   452     3     0     0     0
   403  0.71057931E-01     0   453     3     0     0     0
   403  0.94249301E-01     0   456     4     0     0     0
   403  0.56457990E+00     0   457     4     0     0     0
   6
   404  0.60643014E-01     0   450     4     0     0     0
   404  0.77275932E-02     0   451     4     0     0     0
   404  0.26512662E+00     0   452     4     0     0     0
   404  0.65643447E-02     0   453     4     0     0     0
   404  0.27478555E+00     0   454     3     0     0     0
   404  0.38515291E+00     0   455     3     0     0     0
   7
   405  0.85671894E-01     0   450     5     0     0     0
   405  0.17842150E-02     0   451     5     0     0     0
   405  0.71070746E-01     0   452     5     0     0     0
   405  0.68938576E-01     0   453     5     0     0     0
   405  0.32763141E+00     0   456     6     0     0     0
   405  0.32449806E+00     0   457     6     0     0     0
   405  0.12040511E+00     0   199   406     0     0     0
   6
   406  0.66623852E-01     0   450     6     0     0     0
   406  0.21710528E+00     0   451     6     0     0     0
   406  0.17080131E+00     0   452     6     0     0     0
   406  0.14463864E+00     0   453     6     0     0     0
   406  0.17621186E-01     0   454     5     0     0     0
   406  0.38320974E+00     0   455     5     0     0     0
   6
   407  0.77980608E-01     0   450     7     0     0     0
   407  0.10767821E-01     0   451     7     0     0     0
   407  0.18136427E+00     0   452     7     0     0     0
   407  0.71057886E-01     0   453     7     0     0     0
   407  0.94249338E-01     0   454     8     0     0     0
   407  0.56458008E+00     0   455     8     0     0     0
   6
   408  0.60643058E-01     0   450     8     0     0     0
   408  0.77275988E-02     0   451     8     0     0     0
   408  0.26512676E+00     0   452     8     0     0     0
   408  0.65643494E-02     0   453     8     0     0     0
   408  0.27478546E+00     0   456     7     0     0     0
   408  0.38515282E+00     0   457     7     0     0     0
   6
   409  0.77980660E-01     0   450     9     0     0     0
   409  0.10767828E-01     0   451     9     0     0     0
   409  0.18136439E+00     0   452     9     0     0     0
   409  0.71057931E-01     0   453     9     0     0     0
   409  0.94249301E-01     0   454    10     0     0     0
   409  0.56457990E+00     0   455    10     0     0     0
   6
   410  0.60643014E-01     0   450    10     0     0     0
   410  0.77275932E-02     0   451    10     0     0     0
   410  0.26512662E+00     0   452    10     0     0     0
   410  0.65643447E-02     0   453    10     0     0     0
   410  0.27478555E+00     0   456     9     0     0     0
   410  0.38515291E+00     0   457     9     0     0     0
   7
   411  0.85671894E-01     0   450    11     0     0     0
   411  0.17842150E-02     0   451    11     0     0     0
   411  0.71070746E-01     0   452    11     0     0     0
   411  0.68938576E-01     0   453    11     0     0     0
   411  0.32763141E+00     0   454    12     0     0     0
   411  0.32449806E+00     0   455    12     0     0     0
   411  0.12040511E+00     0   198   412     0     0     0
   6
   412  0.66623852E-01     0   450    12     0     0     0
   412  0.21710528E+00     0   451    12     0     0     0
   412  0.17080131E+00     0   452    12     0     0     0
   412  0.14463864E+00     0   453    12     0     0     0
   412  0.17621186E-01     0   456    11     0     0     0
   412  0.38320974E+00     0   457    11     0     0     0
   4
   413  0.24029251E-01     0   450     1     0     0     0
   413  0.56025926E-02     0   451     1     0     0     0
   413  0.18578649E+00     0   452     1     0     0     0
   413  0.78458172E+00     0   453     1     0     0     0
   4
   414  0.24029583E-01     0   450     2     0     0     0
   414  0.56026569E-02     0   451     2     0     0     0
   414  0.18578728E+00     0   452     2     0     0     0
   414  0.78458047E+00     0   453     2     0     0     0
   4
   415  0.24029251E-01     0   450     3     0     0     0
   415  0.56025926E-02     0   451     3     0     0     0
   415  0.18578649E+00     0   452     3     0     0     0
   415  0.78458172E+00     0   453     3     0     0     0
   4
   416  0.24029586E-01     0   450     4     0     0     0
   416  0.56026573E-02     0   451     4     0     0     0
   416  0.18578728E+00     0   452     4     0     0     0
   416  0.78458047E+00     0   453     4     0     0     0
   7
   417  0.26118416E-01     0   450     5     0     0     0
   417  0.11491485E-01     0   451     5     0     0     0
   417  0.81578732E-01     0   452     5     0     0     0
   417  0.37565552E-01     0   453     5     0     0     0
   417  0.27643400E+00     0   456     6     0     0     0
   417  0.42927396E+00     0   457     6     0     0     0
   417  0.13753782E+00     0   199   406     0     0     0
   9
   418  0.28139839E+00     0   454     5     0     0     0
   418  0.36044823E-03     0   455     5     0     0     0
   418  0.21581410E+00     0   200   406     0     0     0
   418  0.16666872E-01     0   198   405     0     0     0
   418  0.67562118E-01     0   198   417     0     0     0
   418  0.15037200E+00     0   450     6     0     0     0
   418  0.21119957E+00     0   451     6     0     0     0
   418  0.47739219E-01     0   452     6     0     0     0
   418  0.88872900E-02     0   453     6     0     0     0
   4
   419  0.24029251E-01     0   450     7     0     0     0
   419  0.56025926E-02     0   451     7     0     0     0
   419  0.18578649E+00     0   452     7     0     0     0
   419  0.78458172E+00     0   453     7     0     0     0
   4
   420  0.24029583E-01     0   450     8     0     0     0
   420  0.56026569E-02     0   451     8     0     0     0
   420  0.18578728E+00     0   452     8     0     0     0
   420  0.78458047E+00     0   453     8     0     0     0
   4
   421  0.24029251E-01     0   450     9     0     0     0
   421  0.56025926E-02     0   451     9     0     0     0
   421  0.18578649E+00     0   452     9     0     0     0
   421  0.78458172E+00     0   453     9     0     0     0
   4
   422  0.24029586E-01     0   450    10     0     0     0
   422  0.56026573E-02     0   451    10     0     0     0
   422  0.18578728E+00     0   452    10     0     0     0
   422  0.78458047E+00     0   453    10     0     0     0
   7
   423  0.26118416E-01     0   450    11     0     0     0
   423  0.11491485E-01     0   451    11     0     0     0
   423  0.81578732E-01     0   452    11     0     0     0
   423  0.37565552E-01     0   453    11     0     0     0
   423  0.27643400E+00     0   454    12     0     0     0
   423  0.42927396E+00     0   455    12     0     0     0
   423  0.13753782E+00     0   198   412     0     0     0
   9
   424  0.28139839E+00     0   456    11     0     0     0
   424  0.36044823E-03     0   457    11     0     0     0
   424  0.21581410E+00     0   200   412     0     0     0
   424  0.16666872E-01     0   199   411     0     0     0
   424  0.67562118E-01     0   199   423     0     0     0
   424  0.15037200E+00     0   450    12     0     0     0
   424  0.21119957E+00     0   451    12     0     0     0
   424  0.47739219E-01     0   452    12     0     0     0
   424  0.88872900E-02     0   453    12     0     0     0
   6
   425  0.42221457E-01     0   450   121     0     0     0
   425  0.48212898E-02     0   451   121     0     0     0
   425  0.33769515E+00     0   452   121     0     0     0
   425  0.99672116E-02     0   453   121     0     0     0
   425  0.86591415E-01     0   456   122     0     0     0
   425  0.51870352E+00     0   457   122     0     0     0
   6
   426  0.89029416E-01     0   450   122     0     0     0
   426  0.13071524E-01     0   451   122     0     0     0
   426  0.10325134E+00     0   452   122     0     0     0
   426  0.18715633E+00     0   453   122     0     0     0
   426  0.25294864E+00     0   454   121     0     0     0
   426  0.35454279E+00     0   455   121     0     0     0
   6
   427  0.42221457E-01     0   450   123     0     0     0
   427  0.48212898E-02     0   451   123     0     0     0
   427  0.33769515E+00     0   452   123     0     0     0
   427  0.99672116E-02     0   453   123     0     0     0
   427  0.86591415E-01     0   456   124     0     0     0
   427  0.51870352E+00     0   457   124     0     0     0
   6
   428  0.89029416E-01     0   450   124     0     0     0
   428  0.13071524E-01     0   451   124     0     0     0
   428  0.10325134E+00     0   452   124     0     0     0
   428  0.18715633E+00     0   453   124     0     0     0
   428  0.25294864E+00     0   454   123     0     0     0
   428  0.35454279E+00     0   455   123     0     0     0
   2
   429  0.83086330E+00     0   450   125     0     0     0
   429  0.16913670E+00     0   456   126     0     0     0
   7
   430  0.88553898E-01     0   450   126     0     0     0
   430  0.13001707E-01     0   451   126     0     0     0
   430  0.10269986E+00     0   452   126     0     0     0
   430  0.18615671E+00     0   453   126     0     0     0
   430  0.25618467E+00     0   454   125     0     0     0
   430  0.35338756E+00     0   455   125     0     0     0
   430  0.15630761E-04     0   198   429     0     0     0
   6
   431  0.42221457E-01     0   450   127     0     0     0
   431  0.48212898E-02     0   451   127     0     0     0
   431  0.33769515E+00     0   452   127     0     0     0
   431  0.99672116E-02     0   453   127     0     0     0
   431  0.86591415E-01     0   454   128     0     0     0
   431  0.51870352E+00     0   455   128     0     0     0
   6
   432  0.89029416E-01     0   450   128     0     0     0
   432  0.13071524E-01     0   451   128     0     0     0
   432  0.10325134E+00     0   452   128     0     0     0
   432  0.18715633E+00     0   453   128     0     0     0
   432  0.25294864E+00     0   456   127     0     0     0
   432  0.35454279E+00     0   457   127     0     0     0
   6
   433  0.42221457E-01     0   450   129     0     0     0
   433  0.48212898E-02     0   451   129     0     0     0
   433  0.33769515E+00     0   452   129     0     0     0
   433  0.99672116E-02     0   453   129     0     0     0
   433  0.86591415E-01     0   454   130     0     0     0
   433  0.51870352E+00     0   455   130     0     0     0
   6
   434  0.89029416E-01     0   450   130     0     0     0
   434  0.13071524E-01     0   451   130     0     0     0
   434  0.10325134E+00     0   452   130     0     0     0
   434  0.18715633E+00     0   453   130     0     0     0
   434  0.25294864E+00     0   456   129     0     0     0
   434  0.35454279E+00     0   457   129     0     0     0
   2
   435  0.83086330E+00     0   450   131     0     0     0
   435  0.16913670E+00     0   454   132     0     0     0
   7
   436  0.88553898E-01     0   450   132     0     0     0
   436  0.13001707E-01     0   451   132     0     0     0
   436  0.10269986E+00     0   452   132     0     0     0
   436  0.18615671E+00     0   453   132     0     0     0
   436  0.25618467E+00     0   456   131     0     0     0
   436  0.35338756E+00     0   457   131     0     0     0
   436  0.15630761E-04     0   199   435     0     0     0
   1
   437  0.10000000E+01     0   450   121     0     0     0
   0
   1
   439  0.10000000E+01     0   450   123     0     0     0
   0
   6
   441  0.44701666E-01     0   450   125     0     0     0
   441  0.70687984E-02     0   451   125     0     0     0
   441  0.33610857E+00     0   452   125     0     0     0
   441  0.10057569E-01     0   453   125     0     0     0
   441  0.86117670E-01     0   456   126     0     0     0
   441  0.51594579E+00     0   457   126     0     0     0
   0
   1
   443  0.10000000E+01     0   450   127     0     0     0
   0
   1
   445  0.10000000E+01     0   450   129     0     0     0
   0
   6
   447  0.44701666E-01     0   450   131     0     0     0
   447  0.70687984E-02     0   451   131     0     0     0
   447  0.33610857E+00     0   452   131     0     0     0
   447  0.10057569E-01     0   453   131     0     0     0
   447  0.86117670E-01     0   454   132     0     0     0
   447  0.51594579E+00     0   455   132     0     0     0
   0
  32
   449  0.11722656E-02     0   454     1     8     0     0
   449  0.11722656E-02     0   456     2     7     0     0
   449  0.11722656E-02     0   454     3    10     0     0
   449  0.11722656E-02     0   456     4     9     0     0
   449  0.21219887E-01     0   454     5    12     0     0
   449  0.21219887E-01     0   456     6    11     0     0
   449  0.68682772E-02     0   455     1     8     0     0
   449  0.68682772E-02     0   457     2     7     0     0
   449  0.68682772E-02     0   455     3    10     0     0
   449  0.68682772E-02     0   457     4     9     0     0
   449  0.18042701E+00     0   455     5    12     0     0
   449  0.18042701E+00     0   457     6    11     0     0
   449  0.50543051E-03     0   450    13     0     0     0
   449  0.20161329E-02     0   450     1     7     0     0
   449  0.20161329E-02     0   450     3     9     0     0
   449  0.23954283E-02     0   450     5    11     0     0
   449  0.62008679E-01     0   450     6    12     0     0
   449  0.93604904E-03     0   451    13     0     0     0
   449  0.26156378E-03     0   451     1     7     0     0
   449  0.26156378E-03     0   451     3     9     0     0
   449  0.64652512E-03     0   451     5    11     0     0
   449  0.19560669E+00     0   451     6    12     0     0
   449  0.12174914E-03     0   452    13     0     0     0
   449  0.49529397E-02     0   452     1     7     0     0
   449  0.49529397E-02     0   452     3     9     0     0
   449  0.49490808E-02     0   452     5    11     0     0
   449  0.14810389E+00     0   452     6    12     0     0
   449  0.95733005E-04     0   453    13     0     0     0
   449  0.27703273E-02     0   453     1     7     0     0
   449  0.27703273E-02     0   453     3     9     0     0
   449  0.27768952E-02     0   453     5    11     0     0
   449  0.12639594E+00     0   453     6    12     0     0
   0
  28
   451  0.18786110E-04     0   450    59     0     0     0
   451  0.12934190E-01     0   456     2     7     0     0
   451  0.43113967E-02     0   456   122   127     0     0
   451  0.43113967E-02     0   456   124   129     0     0
   451  0.12934190E-01     0   454     1     8     0     0
   451  0.43113967E-02     0   454   121   128     0     0
   451  0.43113967E-02     0   454   123   130     0     0
   451  0.12934190E-01     0   456     4     9     0     0
   451  0.43113967E-02     0   456   126   131     0     0
   451  0.12934190E-01     0   454     3    10     0     0
   451  0.43113967E-02     0   454   125   132     0     0
   451  0.77184909E-02     0   450     2     8     0     0
   451  0.99468902E-02     0   450     1     7     0     0
   451  0.99468902E-02     0   450     3     9     0     0
   451  0.77184909E-02     0   450     4    10     0     0
   451  0.89327209E-02     0   450     5    11     0     0
   451  0.22568316E-02     0   450   121   127     0     0
   451  0.22568316E-02     0   450   123   129     0     0
   451  0.22168562E-02     0   450   125   131     0     0
   451  0.44928533E-02     0   450   122   128     0     0
   451  0.44928533E-02     0   450   124   130     0     0
   451  0.44928533E-02     0   450   126   132     0     0
   451  0.10022346E+00     0   437   127     0     0     0
   451  0.10022346E+00     0   443   121     0     0     0
   451  0.10022235E+00     0   439   129     0     0     0
   451  0.10022235E+00     0   445   123     0     0     0
   451  0.22850594E+00     0   429   131     0     0     0
   451  0.22850594E+00     0   435   125     0     0     0
  11
   452  0.33671910E+00     0   454   199     0     0     0
   452  0.33671910E+00     0   456   198     0     0     0
   452  0.10367457E-02     0   450   200     0     0     0
   452  0.20802370E-02     0   451   200     0     0     0
   452  0.80536986E-02     0   450   203     0     0     0
   452  0.52478705E-01     0   437   127     0     0     0
   452  0.52478705E-01     0   443   121     0     0     0
   452  0.52478664E-01     0   439   129     0     0     0
   452  0.52478664E-01     0   445   123     0     0     0
   452  0.52738238E-01     0   429   131     0     0     0
   452  0.52738238E-01     0   435   125     0     0     0
  12
   453  0.29857846E-02     0   454   199     0     0     0
   453  0.29857846E-02     0   456   198     0     0     0
   453  0.31728086E-02     0   450   200     0     0     0
   453  0.66383943E-01     0   451   200     0     0     0
   453  0.21086484E-01     0   450   203     0     0     0
   453  0.16048515E-02     0   451   203     0     0     0
   453  0.15031941E+00     0   437   127     0     0     0
   453  0.15031941E+00     0   443   121     0     0     0
   453  0.15031935E+00     0   439   129     0     0     0
   453  0.15031935E+00     0   445   123     0     0     0
   453  0.15025143E+00     0   429   131     0     0     0
   453  0.15025143E+00     0   435   125     0     0     0
   5
   454  0.33277223E+00     0   450     2     7     0     0
   454  0.33277223E+00     0   450     4     9     0     0
   454  0.11092572E+00     0   450   127   122     0     0
   454  0.11092572E+00     0   450   129   124     0     0
   454  0.11260410E+00     0   450   131   126     0     0
   5
   455  0.36807016E+00     0   450   198     0     0     0
   455  0.19438139E+00     0   451   198     0     0     0
   455  0.10191007E-02     0   435   126     0     0     0
   455  0.35368559E+00     0   454   200     0     0     0
   455  0.82843989E-01     0   454   203     0     0     0
   5
   456  0.33277223E+00     0   450     8     1     0     0
   456  0.33277223E+00     0   450    10     3     0     0
   456  0.11092572E+00     0   450   121   128     0     0
   456  0.11092572E+00     0   450   123   130     0     0
   456  0.11260410E+00     0   450   125   132     0     0
   5
   457  0.36807016E+00     0   450   199     0     0     0
   457  0.19438139E+00     0   451   199     0     0     0
   457  0.10191007E-02     0   429   132     0     0     0
   457  0.35368559E+00     0   456   200     0     0     0
   457  0.82843989E-01     0   456   203     0     0     0
  28
   203  0.20215152E-03     0   123   129     0     0     0
   203  0.57822138E-01     0   125   131     0     0     0
   203  0.24268012E-02     0     3     9     0     0     0
   203  0.79169637E+00     0     5    11     0     0     0
   203  0.30109245E-01     0     4    10     0     0     0
   203  0.19052736E-02     0    59    59     0     0     0
   203  0.34961775E-01     0    13    13     0     0     0
   203  0.41197776E-02     0   198   121   128     0     0
   203  0.41197776E-02     0   198   123   130     0     0
   203  0.41197776E-02     0   198   125   132     0     0
   203  0.12359333E-01     0   198     8     1     0     0
   203  0.12359333E-01     0   198    10     3     0     0
   203  0.41197776E-02     0   199   127   122     0     0
   203  0.41197776E-02     0   199   129   124     0     0
   203  0.41197776E-02     0   199   131   126     0     0
   203  0.12359333E-01     0   199     2     7     0     0
   203  0.12359333E-01     0   199     4     9     0     0
   203  0.45961246E-03     0   200   122   128     0     0
   203  0.45961246E-03     0   200   124   130     0     0
   203  0.45961246E-03     0   200   126   132     0     0
   203  0.23131834E-03     0   200   121   127     0     0
   203  0.23131834E-03     0   200   123   129     0     0
   203  0.23131834E-03     0   200   125   131     0     0
   203  0.79247699E-03     0   200     2     8     0     0
   203  0.79247699E-03     0   200     4    10     0     0
   203  0.10209056E-02     0   200     1     7     0     0
   203  0.10209056E-02     0   200     3     9     0     0
   203  0.10209056E-02     0   200     5    11     0     0
  25
   204  0.23017426E-04     0   123   129     0     0     0
   204  0.65920549E-02     0   125   131     0     0     0
   204  0.27149491E-03     0     3     9     0     0     0
   204  0.72847128E-01     0     5    11     0     0     0
   204  0.72656803E-01     0     6    12     0     0     0
   204  0.10972578E-03     0    13    13     0     0     0
   204  0.14491462E-02     0   198   199     0     0     0
   204  0.71239041E-03     0   200   200     0     0     0
   204  0.71661748E-01     0   450   450     0     0     0
   204  0.29039059E-01     0   450   451     0     0     0
   204  0.16098373E-01     0   450   452     0     0     0
   204  0.25962807E-01     0   450   453     0     0     0
   204  0.13117565E-01     0   451   451     0     0     0
   204  0.62120520E-01     0   451   452     0     0     0
   204  0.85874416E-01     0   451   453     0     0     0
   204  0.74359600E-03     0   452   452     0     0     0
   204  0.32014149E-03     0   452   453     0     0     0
   204  0.18425564E+00     0   454   456     0     0     0
   204  0.19859495E-02     0   455   457     0     0     0
   204  0.17384285E+00     0   454   457     0     0     0
   204  0.17384285E+00     0   456   455     0     0     0
   204  0.59256228E-02     0   203   203     0     0     0
   204  0.18590468E-03     0   437   443     0     0     0
   204  0.18586757E-03     0   439   445     0     0     0
   204  0.17538927E-03     0   429   435     0     0     0
  20
   205  0.23236746E-04     0   123   129     0     0     0
   205  0.66551929E-02     0   125   131     0     0     0
   205  0.27410462E-03     0     3     9     0     0     0
   205  0.73643282E-01     0     5    11     0     0     0
   205  0.10968629E+00     0     6    12     0     0     0
   205  0.94831747E-04     0    13    13     0     0     0
   205  0.13014674E+00     0   450   450     0     0     0
   205  0.41997163E-02     0   450   451     0     0     0
   205  0.29021051E-01     0   450   452     0     0     0
   205  0.56495905E-01     0   450   453     0     0     0
   205  0.77432515E-02     0   451   451     0     0     0
   205  0.19584261E-01     0   451   452     0     0     0
   205  0.19492917E-01     0   451   453     0     0     0
   205  0.83706938E-02     0   452   452     0     0     0
   205  0.10751403E-01     0   452   453     0     0     0
   205  0.28870368E+00     0   454   456     0     0     0
   205  0.46542920E-01     0   455   457     0     0     0
   205  0.93657911E-01     0   454   457     0     0     0
   205  0.93657911E-01     0   456   455     0     0     0
   205  0.12545874E-02     0   203   200     0     0     0
  13
   206  0.24396442E-04     0   124   129     0     0     0
   206  0.69873459E-02     0   126   131     0     0     0
   206  0.26534562E-03     0     4     9     0     0     0
   206  0.15483369E+00     0     6    11     0     0     0
   206  0.77457301E-03     0   454   450     0     0     0
   206  0.74983679E-01     0   454   451     0     0     0
   206  0.31178430E+00     0   454   452     0     0     0
   206  0.11887235E-02     0   454   453     0     0     0
   206  0.28412142E+00     0   455   450     0     0     0
   206  0.15366159E+00     0   455   451     0     0     0
   206  0.35778987E-02     0   455   452     0     0     0
   206  0.63952231E-02     0   455   453     0     0     0
   206  0.14018950E-02     0   203   198     0     0     0
  13
   207  0.24396442E-04     0   130   123     0     0     0
   207  0.69873459E-02     0   132   125     0     0     0
   207  0.26534562E-03     0    10     3     0     0     0
   207  0.15483369E+00     0    12     5     0     0     0
   207  0.77457301E-03     0   456   450     0     0     0
   207  0.74983679E-01     0   456   451     0     0     0
   207  0.31178430E+00     0   456   452     0     0     0
   207  0.11887235E-02     0   456   453     0     0     0
   207  0.28412142E+00     0   457   450     0     0     0
   207  0.15366159E+00     0   457   451     0     0     0
   207  0.35778987E-02     0   457   452     0     0     0
   207  0.63952231E-02     0   457   453     0     0     0
   207  0.14018950E-02     0   203   199     0     0     0
   0
   5
     6  0.33333334E+00   100     2     7     5     0     0
     6  0.33333334E+00   100     4     9     5     0     0
     6  0.11111111E+00   100   122   127     5     0     0
     6  0.11111111E+00   100   124   129     5     0     0
     6  0.11111111E+00   100   126   131     5     0     0
   5
    12  0.33333334E+00   100     8     1    11     0     0
    12  0.33333334E+00   100    10     3    11     0     0
    12  0.11111111E+00   100   128   121    11     0     0
    12  0.11111111E+00   100   130   123    11     0     0
    12  0.11111111E+00   100   132   125    11     0     0
      6.00000000     -0.18023436
      0.15270108     -0.45368370      0.71192366     -0.51382709
     -0.07391029      0.16586989      0.65253085      0.73568201
     -0.42900425     -0.82076472     -0.20032871      0.31963947
     -0.88722855      0.30496532      0.16503593     -0.30427676
     -0.64097786      0.76755935     -0.76755935     -0.64097786
     -0.37455100      0.92720628     -0.92720628     -0.37455100
      0.78484112     -1.11495078     -1.57050765
   4899.00000000      0.00000000      0.00000000
    110.00000000
    T
