#  ISAJET SUSY parameters in SUSY Les Houches Accord 2 format
#  Created by ISALHA 2.0 Last revision: C. Balazs 21 Apr 2009
Block SPINFO   # Program information
     1   ISASUGRA from ISAJET          # Spectrum Calculator
     2   7.80   29-OCT-2009 12:50:36   # Version number
Block MODSEL   # Model selection
     1     1   # Minimal supergravity (mSUGRA) model               
Block SMINPUTS   # Standard Model inputs
     1     1.27834763E+02   # alpha_em^(-1)
     2     1.16570000E-05   # G_Fermi
     3     1.17200002E-01   # alpha_s(M_Z)
     4     9.11699982E+01   # m_{Z}(pole)
     5     4.19999981E+00   # m_{b}(m_{b})
     6     1.72500000E+02   # m_{top}(pole)
     7     1.77699995E+00   # m_{tau}(pole)
Block MINPAR   # SUSY breaking input parameters
     1     1.38000000E+03   # m_0
     2     4.50000000E+02   # m_{1/2}
     3     1.00000000E+01   # tan(beta)
     4     1.00000000E+00   # sign(mu)
     5     0.00000000E+00   # A_0
Block EXTPAR   # Non-universal SUSY breaking parameters
     0     1.97523849E+16   # Input scale
Block MASS   # Scalar and gaugino mass spectrum
#  PDG code   mass                 particle
        24     8.04229965E+01   #  W^+
        25     1.14183517E+02   #  h^0            
        35     1.50168469E+03   #  H^0            
        36     1.49175574E+03   #  A^0            
        37     1.50427942E+03   #  H^+            
   1000001     1.65647754E+03   #  dnl            
   1000002     1.65454858E+03   #  upl            
   1000003     1.65647754E+03   #  stl            
   1000004     1.65454919E+03   #  chl            
   1000005     1.41397119E+03   #  b1             
   1000006     1.09218408E+03   #  t1             
   1000011     1.40954700E+03   #  el-            
   1000012     1.40733447E+03   #  nuel           
   1000013     1.40954700E+03   #  mul-           
   1000014     1.40733447E+03   #  numl           
   1000015     1.37558179E+03   #  tau1           
   1000016     1.40117932E+03   #  nutl           
   1000021     1.11766431E+03   #  glss           
   1000022     1.88035477E+02   #  z1ss           
   1000023     3.54152924E+02   #  z2ss           
   1000024     3.54945038E+02   #  w1ss           
   1000025    -5.55498047E+02   #  z3ss           
   1000035     5.73591675E+02   #  z4ss           
   1000037     5.73142151E+02   #  w2ss           
   2000001     1.64027356E+03   #  dnr            
   2000002     1.64127173E+03   #  upr            
   2000003     1.64027356E+03   #  str            
   2000004     1.64127234E+03   #  chr            
   2000005     1.62360144E+03   #  b2             
   2000006     1.42835339E+03   #  t2             
   2000011     1.38897644E+03   #  er-            
   2000013     1.38897644E+03   #  mur-           
   2000015     1.40380371E+03   #  tau2           
Block ALPHA   # Effective Higgs mixing parameter
         -1.00546427E-01   # alpha
Block STOPMIX   # stop mixing matrix
  1  1     1.36093587E-01   # O_{11}
  1  2     9.90696013E-01   # O_{12}
  2  1    -9.90696013E-01   # O_{21}
  2  2     1.36093587E-01   # O_{22}
Block SBOTMIX   # sbottom mixing matrix
  1  1     9.99666691E-01   # O_{11}
  1  2     2.58161481E-02   # O_{12}
  2  1    -2.58161481E-02   # O_{21}
  2  2     9.99666691E-01   # O_{22}
Block STAUMIX   # stau mixing matrix
  1  1     1.47527218E-01   # O_{11}
  1  2     9.89058018E-01   # O_{12}
  2  1    -9.89058018E-01   # O_{21}
  2  2     1.47527218E-01   # O_{22}
Block NMIX   # neutralino mixing matrix
  1  1     9.94572818E-01   #
  1  2    -2.10441258E-02   #
  1  3     9.38663632E-02   #
  1  4    -3.96454372E-02   #
  2  1    -4.91184779E-02   #
  2  2    -9.56228495E-01   #
  2  3     2.35994443E-01   #
  2  4    -1.65894598E-01   #
  3  1     3.69858295E-02   #
  3  2    -5.24600483E-02   #
  3  3    -7.02860594E-01   #
  3  4    -7.08425999E-01   #
  4  1    -8.39340761E-02   #
  4  2     2.87109852E-01   #
  4  3     6.64442122E-01   #
  4  4    -6.84864938E-01   #
Block UMIX   # chargino U mixing matrix
  1  1    -9.43354905E-01   # U_{11}
  1  2     3.31785351E-01   # U_{12}
  2  1    -3.31785351E-01   # U_{21}
  2  2    -9.43354905E-01   # U_{22}
Block VMIX   # chargino V mixing matrix
  1  1    -9.72388685E-01   # V_{11}
  1  2     2.33367249E-01   # V_{12}
  2  1    -2.33367249E-01   # V_{21}
  2  2    -9.72388685E-01   # V_{22}
Block GAUGE Q=  1.20378992E+03   #
     1     3.57526630E-01   # g`
     2     6.52385116E-01   # g_2
     3     1.21930015E+00   # g_3
Block YU Q=  1.20378992E+03   #
  3  3     8.54980350E-01   # y_t
Block YD Q=  1.20378992E+03   #
  3  3     1.32440910E-01   # y_b
Block YE Q=  1.20378992E+03   #
  3  3     1.01873197E-01   # y_tau
Block HMIX Q=  1.20378992E+03   # Higgs mixing parameters
     1     5.47049316E+02   # mu(Q)
     2     1.00000000E+01   # tan(beta)(M_GUT)
     3     2.51204895E+02   # Higgs vev at Q
     4     2.22533525E+06   # m_A^2(Q)
Block MSOFT Q=  1.20378992E+03   # DRbar SUSY breaking parameters
     1     1.90729507E+02   # M_1(Q)          
     2     3.52484863E+02   # M_2(Q)          
     3     1.00301953E+03   # M_3(Q)          
    31     1.40428516E+03   # MeL(Q)          
    32     1.40428516E+03   # MmuL(Q)         
    33     1.39826123E+03   # MtauL(Q)        
    34     1.38694055E+03   # MeR(Q)          
    35     1.38694055E+03   # MmuR(Q)         
    36     1.37450598E+03   # MtauR(Q)        
    41     1.60687439E+03   # MqL1(Q)         
    42     1.60687439E+03   # MqL2(Q)         
    43     1.36933679E+03   # MqL3(Q)         
    44     1.59299133E+03   # MuR(Q)          
    45     1.59299133E+03   # McR(Q)          
    46     1.05825696E+03   # MtR(Q)          
    47     1.59138989E+03   # MdR(Q)          
    48     1.59138989E+03   # MsR(Q)          
    49     1.58537292E+03   # MbR(Q)          
Block AU Q=  1.20378992E+03   #
  1  1    -7.67593567E+02   # A_u
  2  2    -7.67593567E+02   # A_c
  3  3    -7.67593567E+02   # A_t
Block AD Q=  1.20378992E+03   #
  1  1    -1.13385474E+03   # A_d
  2  2    -1.13385474E+03   # A_s
  3  3    -1.13385474E+03   # A_b
Block AE Q=  1.20378992E+03   #
  1  1    -2.65010376E+02   # A_e
  2  2    -2.65010376E+02   # A_mu
  3  3    -2.65010376E+02   # A_tau
#  ISAJET decay tables in SUSY Les Houches accord format
#  Created by ISALHD. Last revision: C. Balazs, 2005 May 25
Block DCINFO                           # Program information
     1   ISASUGRA from ISAJET          # Spectrum Calculator
     2   7.80   29-OCT-2009 12:50:36   # Version number
#         PDG         Width
DECAY         6  1.14680779E+00   # TP    decays
#          BR          NDA       ID1       ID2       ID3       ID4
      3.33333343E-01    3            2        -1         5             # TP     -->  UP     DB     BT          
      3.33333343E-01    3            4        -3         5             # TP     -->  CH     SB     BT          
      1.11111112E-01    3          -11        12         5             # TP     -->  E+     NUE    BT          
      1.11111112E-01    3          -13        14         5             # TP     -->  MU+    NUM    BT          
      1.11111112E-01    3          -15        16         5             # TP     -->  TAU+   NUT    BT          
#         PDG         Width
DECAY   1000021  3.11342869E-02   # GLSS  decays
#          BR          NDA       ID1       ID2       ID3       ID4
      3.84494811E-02    3      1000024         1        -2             # GLSS   -->  W1SS+  DN     UB          
      3.84494811E-02    3     -1000024         2        -1             # GLSS   -->  W1SS-  UP     DB          
      3.84494439E-02    3      1000024         3        -4             # GLSS   -->  W1SS+  ST     CB          
      3.84494439E-02    3     -1000024         4        -3             # GLSS   -->  W1SS-  CH     SB          
      6.06039539E-02    3      1000024         5        -6             # GLSS   -->  W1SS+  BT     TB          
      6.06039539E-02    3     -1000024         6        -5             # GLSS   -->  W1SS-  TP     BB          
      1.23181927E-03    3      1000037         1        -2             # GLSS   -->  W2SS+  DN     UB          
      1.23181927E-03    3     -1000037         2        -1             # GLSS   -->  W2SS-  UP     DB          
      1.23181823E-03    3      1000037         3        -4             # GLSS   -->  W2SS+  ST     CB          
      1.23181823E-03    3     -1000037         4        -3             # GLSS   -->  W2SS-  CH     SB          
      1.28844291E-01    3      1000037         5        -6             # GLSS   -->  W2SS+  BT     TB          
      1.28844291E-01    3     -1000037         6        -5             # GLSS   -->  W2SS-  TP     BB          
      2.30574697E-05    2      1000022        21                       # GLSS   -->  Z1SS   GL                 
      1.75189916E-02    3      1000022         2        -2             # GLSS   -->  Z1SS   UP     UB          
      5.43800695E-03    3      1000022         1        -1             # GLSS   -->  Z1SS   DN     DB          
      5.43800695E-03    3      1000022         3        -3             # GLSS   -->  Z1SS   ST     SB          
      1.75189562E-02    3      1000022         4        -4             # GLSS   -->  Z1SS   CH     CB          
      7.43335485E-03    3      1000022         5        -5             # GLSS   -->  Z1SS   BT     BB          
      1.03903145E-01    3      1000022         6        -6             # GLSS   -->  Z1SS   TP     TB          
      9.79945180E-04    2      1000023        21                       # GLSS   -->  Z2SS   GL                 
      1.96548216E-02    3      1000023         2        -2             # GLSS   -->  Z2SS   UP     UB          
      1.87933203E-02    3      1000023         1        -1             # GLSS   -->  Z2SS   DN     DB          
      1.87933203E-02    3      1000023         3        -3             # GLSS   -->  Z2SS   ST     SB          
      1.96547862E-02    3      1000023         4        -4             # GLSS   -->  Z2SS   CH     CB          
      4.59591225E-02    3      1000023         5        -5             # GLSS   -->  Z2SS   BT     BB          
      1.99114475E-02    3      1000023         6        -6             # GLSS   -->  Z2SS   TP     TB          
      7.20999623E-03    2      1000025        21                       # GLSS   -->  Z3SS   GL                 
      9.86805935E-06    3      1000025         2        -2             # GLSS   -->  Z3SS   UP     UB          
      1.27067306E-05    3      1000025         1        -1             # GLSS   -->  Z3SS   DN     DB          
      1.27067306E-05    3      1000025         3        -3             # GLSS   -->  Z3SS   ST     SB          
      9.86803934E-06    3      1000025         4        -4             # GLSS   -->  Z3SS   CH     CB          
      1.40493363E-03    3      1000025         5        -5             # GLSS   -->  Z3SS   BT     BB          
      5.75260930E-02    3      1000025         6        -6             # GLSS   -->  Z3SS   TP     TB          
      6.83329022E-03    2      1000035        21                       # GLSS   -->  Z4SS   GL                 
      5.93595672E-04    3      1000035         2        -2             # GLSS   -->  Z4SS   UP     UB          
      7.01197830E-04    3      1000035         1        -1             # GLSS   -->  Z4SS   DN     DB          
      7.01197830E-04    3      1000035         3        -3             # GLSS   -->  Z4SS   ST     SB          
      5.93594508E-04    3      1000035         4        -4             # GLSS   -->  Z4SS   CH     CB          
      2.96700839E-03    3      1000035         5        -5             # GLSS   -->  Z4SS   BT     BB          
      8.27819258E-02    3      1000035         6        -6             # GLSS   -->  Z4SS   TP     TB          
#         PDG         Width
DECAY   1000002  4.76234550E+01   # UPL   decays
#          BR          NDA       ID1       ID2       ID3       ID4
      3.70117743E-03    2      1000022         2                       # UPL    -->  Z1SS   UP                 
      1.24049105E-01    2      1000023         2                       # UPL    -->  Z2SS   UP                 
      2.40280613E-04    2      1000025         2                       # UPL    -->  Z3SS   UP                 
      8.35868064E-03    2      1000035         2                       # UPL    -->  Z4SS   UP                 
      5.99630415E-01    2      1000021         2                       # UPL    -->  GLSS   UP                 
      2.51685083E-01    2      1000024         1                       # UPL    -->  W1SS+  DN                 
      1.23353116E-02    2      1000037         1                       # UPL    -->  W2SS+  DN                 
#         PDG         Width
DECAY   1000001  4.76760139E+01   # DNL   decays
#          BR          NDA       ID1       ID2       ID3       ID4
      5.88739151E-03    2      1000022         1                       # DNL    -->  Z1SS   DN                 
      1.19500324E-01    2      1000023         1                       # DNL    -->  Z2SS   DN                 
      4.04247839E-04    2      1000025         1                       # DNL    -->  Z3SS   DN                 
      1.03650512E-02    2      1000035         1                       # DNL    -->  Z4SS   DN                 
      6.01944387E-01    2      1000021         1                       # DNL    -->  GLSS   DN                 
      2.36947626E-01    2     -1000024         2                       # DNL    -->  W1SS-  UP                 
      2.49509644E-02    2     -1000037         2                       # DNL    -->  W2SS-  UP                 
#         PDG         Width
DECAY   1000003  4.76759949E+01   # STL   decays
#          BR          NDA       ID1       ID2       ID3       ID4
      5.88739384E-03    2      1000022         3                       # STL    -->  Z1SS   ST                 
      1.19500369E-01    2      1000023         3                       # STL    -->  Z2SS   ST                 
      4.04247985E-04    2      1000025         3                       # STL    -->  Z3SS   ST                 
      1.03650559E-02    2      1000035         3                       # STL    -->  Z4SS   ST                 
      6.01944625E-01    2      1000021         3                       # STL    -->  GLSS   ST                 
      2.36947373E-01    2     -1000024         4                       # STL    -->  W1SS-  CH                 
      2.49509346E-02    2     -1000037         4                       # STL    -->  W2SS-  CH                 
#         PDG         Width
DECAY   1000004  4.76233711E+01   # CHL   decays
#          BR          NDA       ID1       ID2       ID3       ID4
      3.70117952E-03    2      1000022         4                       # CHL    -->  Z1SS   CH                 
      1.24049217E-01    2      1000023         4                       # CHL    -->  Z2SS   CH                 
      2.40280773E-04    2      1000025         4                       # CHL    -->  Z3SS   CH                 
      8.35868716E-03    2      1000035         4                       # CHL    -->  Z4SS   CH                 
      5.99629581E-01    2      1000021         4                       # CHL    -->  GLSS   CH                 
      2.51685619E-01    2      1000024         3                       # CHL    -->  W1SS+  ST                 
      1.23353405E-02    2      1000037         3                       # CHL    -->  W2SS+  ST                 
#         PDG         Width
DECAY   1000005  4.32733269E+01   # BT1   decays
#          BR          NDA       ID1       ID2       ID3       ID4
      5.69730531E-03    2      1000022         5                       # BT1    -->  Z1SS   BT                 
      1.09287456E-01    2      1000023         5                       # BT1    -->  Z2SS   BT                 
      4.45599807E-03    2      1000025         5                       # BT1    -->  Z3SS   BT                 
      1.21518523E-02    2      1000035         5                       # BT1    -->  Z4SS   BT                 
      2.72922277E-01    2      1000021         5                       # BT1    -->  GLSS   BT                 
      2.20703796E-01    2     -1000024         6                       # BT1    -->  W1SS-  TP                 
      3.27971458E-01    2     -1000037         6                       # BT1    -->  W2SS-  TP                 
      4.68097590E-02    2          -24   1000006                       # BT1    -->  W-     TP1                
#         PDG         Width
DECAY   1000006  1.85312786E+01   # TP1   decays
#          BR          NDA       ID1       ID2       ID3       ID4
      1.18214883E-01    2      1000022         6                       # TP1    -->  Z1SS   TP                 
      3.46342623E-02    2      1000023         6                       # TP1    -->  Z2SS   TP                 
      2.25656345E-01    2      1000025         6                       # TP1    -->  Z3SS   TP                 
      1.64491862E-01    2      1000035         6                       # TP1    -->  Z4SS   TP                 
      7.37562850E-02    2      1000024         5                       # TP1    -->  W1SS+  BT                 
      3.83246332E-01    2      1000037         5                       # TP1    -->  W2SS+  BT                 
#         PDG         Width
DECAY   2000002  3.11884403E+01   # UPR   decays
#          BR          NDA       ID1       ID2       ID3       ID4
      1.14604071E-01    2      1000022         2                       # UPR    -->  Z1SS   UP                 
      2.60902860E-04    2      1000023         2                       # UPR    -->  Z2SS   UP                 
      1.27585008E-04    2      1000025         2                       # UPR    -->  Z3SS   UP                 
      6.45853463E-04    2      1000035         2                       # UPR    -->  Z4SS   UP                 
      8.84361565E-01    2      1000021         2                       # UPR    -->  GLSS   UP                 
#         PDG         Width
DECAY   2000001  2.84097672E+01   # DNR   decays
#          BR          NDA       ID1       ID2       ID3       ID4
      3.14331390E-02    2      1000022         1                       # DNR    -->  Z1SS   DN                 
      7.15531860E-05    2      1000023         1                       # DNR    -->  Z2SS   DN                 
      3.49836046E-05    2      1000025         1                       # DNR    -->  Z3SS   DN                 
      1.77087786E-04    2      1000035         1                       # DNR    -->  Z4SS   DN                 
      9.68283236E-01    2      1000021         1                       # DNR    -->  GLSS   DN                 
#         PDG         Width
DECAY   2000003  2.84097672E+01   # STR   decays
#          BR          NDA       ID1       ID2       ID3       ID4
      3.14331390E-02    2      1000022         3                       # STR    -->  Z1SS   ST                 
      7.15531860E-05    2      1000023         3                       # STR    -->  Z2SS   ST                 
      3.49836046E-05    2      1000025         3                       # STR    -->  Z3SS   ST                 
      1.77087786E-04    2      1000035         3                       # STR    -->  Z4SS   ST                 
      9.68283236E-01    2      1000021         3                       # STR    -->  GLSS   ST                 
#         PDG         Width
DECAY   2000004  3.11883545E+01   # CHR   decays
#          BR          NDA       ID1       ID2       ID3       ID4
      1.14604279E-01    2      1000022         4                       # CHR    -->  Z1SS   CH                 
      2.60903384E-04    2      1000023         4                       # CHR    -->  Z2SS   CH                 
      1.27585197E-04    2      1000025         4                       # CHR    -->  Z3SS   CH                 
      6.45854510E-04    2      1000035         4                       # CHR    -->  Z4SS   CH                 
      8.84361386E-01    2      1000021         4                       # CHR    -->  GLSS   CH                 
#         PDG         Width
DECAY   2000005  2.81776772E+01   # BT2   decays
#          BR          NDA       ID1       ID2       ID3       ID4
      3.13236900E-02    2      1000022         5                       # BT2    -->  Z1SS   BT                 
      5.29414683E-04    2      1000023         5                       # BT2    -->  Z2SS   BT                 
      8.24173447E-03    2      1000025         5                       # BT2    -->  Z3SS   BT                 
      7.89751485E-03    2      1000035         5                       # BT2    -->  Z4SS   BT                 
      9.32547390E-01    2      1000021         5                       # BT2    -->  GLSS   BT                 
      8.92136071E-04    2     -1000024         6                       # BT2    -->  W1SS-  TP                 
      1.58832688E-02    2     -1000037         6                       # BT2    -->  W2SS-  TP                 
      1.93150190E-04    2          -24   1000006                       # BT2    -->  W-     TP1                
      5.64541551E-04    2          -24   2000006                       # BT2    -->  W-     TP2                
      3.42796382E-04    2           23   1000005                       # BT2    -->  Z0     BT1                
      1.58442615E-03    2           25   1000005                       # BT2    -->  HL0    BT1                
#         PDG         Width
DECAY   2000006  4.13758354E+01   # TP2   decays
#          BR          NDA       ID1       ID2       ID3       ID4
      2.11963817E-01    2      1000021         6                       # TP2    -->  GLSS   TP                 
      2.18758211E-01    2      1000024         5                       # TP2    -->  W1SS+  BT                 
      4.09042537E-02    2      1000037         5                       # TP2    -->  W2SS+  BT                 
      2.69123930E-02    2           23   1000006                       # TP2    -->  Z0     TP1                
      4.03769463E-02    2           25   1000006                       # TP2    -->  HL0    TP1                
      3.97258624E-03    2      1000022         6                       # TP2    -->  Z1SS   TP                 
      1.10683985E-01    2      1000023         6                       # TP2    -->  Z2SS   TP                 
      1.62182733E-01    2      1000025         6                       # TP2    -->  Z3SS   TP                 
      1.84245095E-01    2      1000035         6                       # TP2    -->  Z4SS   TP                 
#         PDG         Width
DECAY   1000011  1.70334415E+01   # EL-   decays
#          BR          NDA       ID1       ID2       ID3       ID4
      9.28311050E-02    2      1000022        11                       # EL-    -->  Z1SS   E-                 
      2.95566767E-01    2      1000023        11                       # EL-    -->  Z2SS   E-                 
      2.56597967E-04    2      1000025        11                       # EL-    -->  Z3SS   E-                 
      1.40830874E-02    2      1000035        11                       # EL-    -->  Z4SS   E-                 
      5.43835819E-01    2     -1000024        12                       # EL-    -->  W1SS-  NUE                
      5.34266308E-02    2     -1000037        12                       # EL-    -->  W2SS-  NUE                
#         PDG         Width
DECAY   1000013  1.70334415E+01   # MUL-  decays
#          BR          NDA       ID1       ID2       ID3       ID4
      9.28311050E-02    2      1000022        13                       # MUL-   -->  Z1SS   MU-                
      2.95566767E-01    2      1000023        13                       # MUL-   -->  Z2SS   MU-                
      2.56597967E-04    2      1000025        13                       # MUL-   -->  Z3SS   MU-                
      1.40830874E-02    2      1000035        13                       # MUL-   -->  Z4SS   MU-                
      5.43835819E-01    2     -1000024        14                       # MUL-   -->  W1SS-  NUM                
      5.34266308E-02    2     -1000037        14                       # MUL-   -->  W2SS-  NUM                
#         PDG         Width
DECAY   1000015  7.39789867E+00   # TAU1- decays
#          BR          NDA       ID1       ID2       ID3       ID4
      8.88821840E-01    2      1000022        15                       # TAU1-  -->  Z1SS   TAU-               
      2.81220451E-02    2      1000023        15                       # TAU1-  -->  Z2SS   TAU-               
      1.28784878E-02    2      1000025        15                       # TAU1-  -->  Z3SS   TAU-               
      9.37878340E-03    2      1000035        15                       # TAU1-  -->  Z4SS   TAU-               
      5.00746705E-02    2     -1000024        16                       # TAU1-  -->  W1SS-  NUT                
      1.07241953E-02    2     -1000037        16                       # TAU1-  -->  W2SS-  NUT                
#         PDG         Width
DECAY   1000012  1.70808182E+01   # NUEL  decays
#          BR          NDA       ID1       ID2       ID3       ID4
      1.07811570E-01    2      1000022        12                       # NUEL   -->  Z1SS   NUE                
      2.62739420E-01    2      1000023        12                       # NUEL   -->  Z2SS   NUE                
      1.30952185E-03    2      1000025        12                       # NUEL   -->  Z3SS   NUE                
      2.67812684E-02    2      1000035        12                       # NUEL   -->  Z4SS   NUE                
      5.75074136E-01    2      1000024        11                       # NUEL   -->  W1SS+  E-                 
      2.62841005E-02    2      1000037        11                       # NUEL   -->  W2SS+  E-                 
#         PDG         Width
DECAY   1000014  1.70808182E+01   # NUML  decays
#          BR          NDA       ID1       ID2       ID3       ID4
      1.07811570E-01    2      1000022        14                       # NUML   -->  Z1SS   NUM                
      2.62739420E-01    2      1000023        14                       # NUML   -->  Z2SS   NUM                
      1.30952185E-03    2      1000025        14                       # NUML   -->  Z3SS   NUM                
      2.67812684E-02    2      1000035        14                       # NUML   -->  Z4SS   NUM                
      5.75074136E-01    2      1000024        13                       # NUML   -->  W1SS+  MU-                
      2.62841005E-02    2      1000037        13                       # NUML   -->  W2SS+  MU-                
#         PDG         Width
DECAY   1000016  1.72001495E+01   # NUTL  decays
#          BR          NDA       ID1       ID2       ID3       ID4
      1.06561221E-01    2      1000022        16                       # NUTL   -->  Z1SS   NUT                
      2.59466231E-01    2      1000023        16                       # NUTL   -->  Z2SS   NUT                
      1.29054429E-03    2      1000025        16                       # NUTL   -->  Z3SS   NUT                
      2.63863411E-02    2      1000035        16                       # NUTL   -->  Z4SS   NUT                
      5.69550574E-01    2      1000024        15                       # NUTL   -->  W1SS+  TAU-               
      3.67451310E-02    2      1000037        15                       # NUTL   -->  W2SS+  TAU-               
      4.13287182E-09    3      1000015        16       -15             # NUTL   -->  TAU1-  NUT    TAU+        
      4.13287182E-09    3      1000015        12       -11             # NUTL   -->  TAU1-  NUE    E+          
      4.13287182E-09    3      1000015        14       -13             # NUTL   -->  TAU1-  NUM    MU+         
      1.23986155E-08    3      1000015         2        -1             # NUTL   -->  TAU1-  UP     DB          
      1.23986155E-08    3      1000015         4        -3             # NUTL   -->  TAU1-  CH     SB          
#         PDG         Width
DECAY   2000011  6.79038906E+00   # ER-   decays
#          BR          NDA       ID1       ID2       ID3       ID4
      9.91758585E-01    2      1000022        11                       # ER-    -->  Z1SS   E-                 
      2.19432591E-03    2      1000023        11                       # ER-    -->  Z2SS   E-                 
      1.00434583E-03    2      1000025        11                       # ER-    -->  Z3SS   E-                 
      5.04278857E-03    2      1000035        11                       # ER-    -->  Z4SS   E-                 
#         PDG         Width
DECAY   2000013  6.79038906E+00   # MUR-  decays
#          BR          NDA       ID1       ID2       ID3       ID4
      9.91758585E-01    2      1000022        13                       # MUR-   -->  Z1SS   MU-                
      2.19432591E-03    2      1000023        13                       # MUR-   -->  Z2SS   MU-                
      1.00434583E-03    2      1000025        13                       # MUR-   -->  Z3SS   MU-                
      5.04278857E-03    2      1000035        13                       # MUR-   -->  Z4SS   MU-                
#         PDG         Width
DECAY   2000015  1.68926544E+01   # TAU2- decays
#          BR          NDA       ID1       ID2       ID3       ID4
      9.88922045E-02    2      1000022        15                       # TAU2-  -->  Z1SS   TAU-               
      2.86465675E-01    2      1000023        15                       # TAU2-  -->  Z2SS   TAU-               
      7.37304660E-03    2      1000025        15                       # TAU2-  -->  Z3SS   TAU-               
      2.28789374E-02    2      1000035        15                       # TAU2-  -->  Z4SS   TAU-               
      5.24744451E-01    2     -1000024        16                       # TAU2-  -->  W1SS-  NUT                
      5.96457273E-02    2     -1000037        16                       # TAU2-  -->  W2SS-  NUT                
#         PDG         Width
DECAY   1000023  2.14992166E-02   # Z2SS  decays
#          BR          NDA       ID1       ID2       ID3       ID4
      1.05200706E-06    2      1000022        22                       # Z2SS   -->  Z1SS   GM                 
      7.85124302E-02    2      1000022        23                       # Z2SS   -->  Z1SS   Z0                 
      2.34545325E-07    3      1000022         2        -2             # Z2SS   -->  Z1SS   UP     UB          
      3.47749562E-07    3      1000022         1        -1             # Z2SS   -->  Z1SS   DN     DB          
      3.47749562E-07    3      1000022         3        -3             # Z2SS   -->  Z1SS   ST     SB          
      2.34544970E-07    3      1000022         4        -4             # Z2SS   -->  Z1SS   CH     CB          
      7.68015127E-07    3      1000022         5        -5             # Z2SS   -->  Z1SS   BT     BB          
      1.64839844E-06    3      1000022        11       -11             # Z2SS   -->  Z1SS   E-     E+          
      1.64839844E-06    3      1000022        13       -13             # Z2SS   -->  Z1SS   MU-    MU+         
      1.73421085E-06    3      1000022        15       -15             # Z2SS   -->  Z1SS   TAU-   TAU+        
      1.70517535E-06    3      1000022        12       -12             # Z2SS   -->  Z1SS   NUE    ANUE        
      1.70517535E-06    3      1000022        14       -14             # Z2SS   -->  Z1SS   NUM    ANUM        
      1.73655008E-06    3      1000022        16       -16             # Z2SS   -->  Z1SS   NUT    ANUT        
      9.21474457E-01    2      1000022        25                       # Z2SS   -->  Z1SS   HL0                
#         PDG         Width
DECAY   1000025  2.59364700E+00   # Z3SS  decays
#          BR          NDA       ID1       ID2       ID3       ID4
      1.11879705E-08    2      1000022        22                       # Z3SS   -->  Z1SS   GM                 
      4.86824092E-07    2      1000023        22                       # Z3SS   -->  Z2SS   GM                 
      2.92850733E-01    2      1000024       -24                       # Z3SS   -->  W1SS+  W-                 
      2.92850733E-01    2     -1000024        24                       # Z3SS   -->  W1SS-  W+                 
      1.24367230E-01    2      1000022        23                       # Z3SS   -->  Z1SS   Z0                 
      2.63246268E-01    2      1000023        23                       # Z3SS   -->  Z2SS   Z0                 
      5.31546085E-10    3      1000022         2        -2             # Z3SS   -->  Z1SS   UP     UB          
      1.96731159E-10    3      1000022         1        -1             # Z3SS   -->  Z1SS   DN     DB          
      1.96731159E-10    3      1000022         3        -3             # Z3SS   -->  Z1SS   ST     SB          
      5.31545197E-10    3      1000022         4        -4             # Z3SS   -->  Z1SS   CH     CB          
      7.05381282E-08    3      1000022         5        -5             # Z3SS   -->  Z1SS   BT     BB          
      1.84883198E-09    3      1000022        11       -11             # Z3SS   -->  Z1SS   E-     E+          
      1.84883198E-09    3      1000022        13       -13             # Z3SS   -->  Z1SS   MU-    MU+         
      8.55726086E-08    3      1000022        15       -15             # Z3SS   -->  Z1SS   TAU-   TAU+        
      1.32852163E-09    3      1000022        12       -12             # Z3SS   -->  Z1SS   NUE    ANUE        
      1.32852163E-09    3      1000022        14       -14             # Z3SS   -->  Z1SS   NUM    ANUM        
      1.35429135E-09    3      1000022        16       -16             # Z3SS   -->  Z1SS   NUT    ANUT        
      1.97621558E-10    3      1000023         2        -2             # Z3SS   -->  Z2SS   UP     UB          
      3.18214177E-10    3      1000023         1        -1             # Z3SS   -->  Z2SS   DN     DB          
      3.18214177E-10    3      1000023         3        -3             # Z3SS   -->  Z2SS   ST     SB          
      1.97621239E-10    3      1000023         4        -4             # Z3SS   -->  Z2SS   CH     CB          
      3.23788250E-08    3      1000023         5        -5             # Z3SS   -->  Z2SS   BT     BB          
      6.89576105E-11    3      1000023        11       -11             # Z3SS   -->  Z2SS   E-     E+          
      6.89576105E-11    3      1000023        13       -13             # Z3SS   -->  Z2SS   MU-    MU+         
      6.77062362E-09    3      1000023        15       -15             # Z3SS   -->  Z2SS   TAU-   TAU+        
      3.16671994E-10    3      1000023        12       -12             # Z3SS   -->  Z2SS   NUE    ANUE        
      3.16671994E-10    3      1000023        14       -14             # Z3SS   -->  Z2SS   NUM    ANUM        
      3.22982779E-10    3      1000023        16       -16             # Z3SS   -->  Z2SS   NUT    ANUT        
      1.95959695E-02    2      1000022        25                       # Z3SS   -->  Z1SS   HL0                
      7.08831521E-03    2      1000023        25                       # Z3SS   -->  Z2SS   HL0                
#         PDG         Width
DECAY   1000035  2.97857022E+00   # Z4SS  decays
#          BR          NDA       ID1       ID2       ID3       ID4
      1.48869750E-09    2      1000022        22                       # Z4SS   -->  Z1SS   GM                 
      9.06758046E-08    2      1000023        22                       # Z4SS   -->  Z2SS   GM                 
      2.17749219E-09    2      1000025        22                       # Z4SS   -->  Z3SS   GM                 
      3.26145530E-01    2      1000024       -24                       # Z4SS   -->  W1SS+  W-                 
      3.26145530E-01    2     -1000024        24                       # Z4SS   -->  W1SS-  W+                 
      1.94732007E-02    2      1000022        23                       # Z4SS   -->  Z1SS   Z0                 
      1.11328382E-02    2      1000023        23                       # Z4SS   -->  Z2SS   Z0                 
      1.12239675E-08    3      1000022         2        -2             # Z4SS   -->  Z1SS   UP     UB          
      1.09262697E-08    3      1000022         1        -1             # Z4SS   -->  Z1SS   DN     DB          
      1.09262697E-08    3      1000022         3        -3             # Z4SS   -->  Z1SS   ST     SB          
      1.12239489E-08    3      1000022         4        -4             # Z4SS   -->  Z1SS   CH     CB          
      7.52414380E-08    3      1000022         5        -5             # Z4SS   -->  Z1SS   BT     BB          
      5.00993700E-08    3      1000022        11       -11             # Z4SS   -->  Z1SS   E-     E+          
      5.00993700E-08    3      1000022        13       -13             # Z4SS   -->  Z1SS   MU-    MU+         
      1.27513900E-07    3      1000022        15       -15             # Z4SS   -->  Z1SS   TAU-   TAU+        
      6.71340246E-08    3      1000022        12       -12             # Z4SS   -->  Z1SS   NUE    ANUE        
      6.71340246E-08    3      1000022        14       -14             # Z4SS   -->  Z1SS   NUM    ANUM        
      6.84279726E-08    3      1000022        16       -16             # Z4SS   -->  Z1SS   NUT    ANUT        
      2.54774406E-08    3      1000023         2        -2             # Z4SS   -->  Z2SS   UP     UB          
      3.02487173E-08    3      1000023         1        -1             # Z4SS   -->  Z2SS   DN     DB          
      3.02487173E-08    3      1000023         3        -3             # Z4SS   -->  Z2SS   ST     SB          
      2.54774015E-08    3      1000023         4        -4             # Z4SS   -->  Z2SS   CH     CB          
      9.05994781E-08    3      1000023         5        -5             # Z4SS   -->  Z2SS   BT     BB          
      1.40759822E-08    3      1000023        11       -11             # Z4SS   -->  Z2SS   E-     E+          
      1.40759822E-08    3      1000023        13       -13             # Z4SS   -->  Z2SS   MU-    MU+         
      2.04187973E-08    3      1000023        15       -15             # Z4SS   -->  Z2SS   TAU-   TAU+        
      2.42019347E-08    3      1000023        12       -12             # Z4SS   -->  Z2SS   NUE    ANUE        
      2.42019347E-08    3      1000023        14       -14             # Z4SS   -->  Z2SS   NUM    ANUM        
      2.46843648E-08    3      1000023        16       -16             # Z4SS   -->  Z2SS   NUT    ANUT        
      7.29857348E-08    3      1000025         2        -2             # Z4SS   -->  Z3SS   UP     UB          
      9.41343927E-08    3      1000025         1        -1             # Z4SS   -->  Z3SS   DN     DB          
      9.41343927E-08    3      1000025         3        -3             # Z4SS   -->  Z3SS   ST     SB          
      7.29857348E-08    3      1000025         4        -4             # Z4SS   -->  Z3SS   CH     CB          
      3.91015114E-08    3      1000025         5        -5             # Z4SS   -->  Z3SS   BT     BB          
      2.13539462E-08    3      1000025        11       -11             # Z4SS   -->  Z3SS   E-     E+          
      2.13539462E-08    3      1000025        13       -13             # Z4SS   -->  Z3SS   MU-    MU+         
      1.87659950E-08    3      1000025        15       -15             # Z4SS   -->  Z3SS   TAU-   TAU+        
      4.24754063E-08    3      1000025        12       -12             # Z4SS   -->  Z3SS   NUE    ANUE        
      4.24754063E-08    3      1000025        14       -14             # Z4SS   -->  Z3SS   NUM    ANUM        
      4.24753210E-08    3      1000025        16       -16             # Z4SS   -->  Z3SS   NUT    ANUT        
      9.81992856E-02    2      1000022        25                       # Z4SS   -->  Z1SS   HL0                
      2.18902320E-01    2      1000023        25                       # Z4SS   -->  Z2SS   HL0                
#         PDG         Width
DECAY   1000024  1.93366949E-02   # W1SS+ decays
#          BR          NDA       ID1       ID2       ID3       ID4
      6.49813501E-07    3      1000022         2        -1             # W1SS+  -->  Z1SS   UP     DB          
      6.49813103E-07    3      1000022         4        -3             # W1SS+  -->  Z1SS   CH     SB          
      3.81313953E-06    3      1000022       -11        12             # W1SS+  -->  Z1SS   E+     NUE         
      3.81313953E-06    3      1000022       -13        14             # W1SS+  -->  Z1SS   MU+    NUM         
      3.94716153E-06    3      1000022       -15        16             # W1SS+  -->  Z1SS   TAU+   NUT         
      9.99987066E-01    2      1000022        24                       # W1SS+  -->  Z1SS   W+                 
      8.53710592E-12    3      1000023       -11        12             # W1SS+  -->  Z2SS   E+     NUE         
      8.53710592E-12    3      1000023       -13        14             # W1SS+  -->  Z2SS   MU+    NUM         
#         PDG         Width
DECAY   1000037  2.74952316E+00   # W2SS+ decays
#          BR          NDA       ID1       ID2       ID3       ID4
      1.72429999E-08    3      1000022         2        -1             # W2SS+  -->  Z1SS   UP     DB          
      1.72429910E-08    3      1000022         4        -3             # W2SS+  -->  Z1SS   CH     SB          
      9.55950554E-08    3      1000022       -11        12             # W2SS+  -->  Z1SS   E+     NUE         
      9.55950554E-08    3      1000022       -13        14             # W2SS+  -->  Z1SS   MU+    NUM         
      1.80987982E-07    3      1000022       -15        16             # W2SS+  -->  Z1SS   TAU+   NUT         
      1.09886266E-01    2      1000022        24                       # W2SS+  -->  Z1SS   W+                 
      2.21799930E-08    3      1000023         2        -1             # W2SS+  -->  Z2SS   UP     DB          
      2.21799876E-08    3      1000023         4        -3             # W2SS+  -->  Z2SS   CH     SB          
      1.58633036E-08    3      1000023       -11        12             # W2SS+  -->  Z2SS   E+     NUE         
      1.58633036E-08    3      1000023       -13        14             # W2SS+  -->  Z2SS   MU+    NUM         
      2.47129819E-08    3      1000023       -15        16             # W2SS+  -->  Z2SS   TAU+   NUT         
      3.25604230E-01    2      1000023        24                       # W2SS+  -->  Z2SS   W+                 
      2.43488472E-07    3      1000025         2        -1             # W2SS+  -->  Z3SS   UP     DB          
      2.43488472E-07    3      1000025         4        -3             # W2SS+  -->  Z3SS   CH     SB          
      8.11588521E-08    3      1000025       -11        12             # W2SS+  -->  Z3SS   E+     NUE         
      8.11588521E-08    3      1000025       -13        14             # W2SS+  -->  Z3SS   MU+    NUM         
      8.11671725E-08    3      1000025       -15        16             # W2SS+  -->  Z3SS   TAU+   NUT         
      3.05045187E-01    2      1000024        23                       # W2SS+  -->  W1SS+  Z0                 
      2.73704472E-08    3      1000024         1        -1             # W2SS+  -->  W1SS+  DN     DB          
      2.73704028E-08    3      1000024         3        -3             # W2SS+  -->  W1SS+  ST     SB          
      5.18064880E-08    3      1000024         2        -2             # W2SS+  -->  W1SS+  UP     UB          
      5.18064880E-08    3      1000024         4        -4             # W2SS+  -->  W1SS+  CH     CB          
      3.52713840E-08    3      1000024        12       -12             # W2SS+  -->  W1SS+  NUE    ANUE        
      3.52713840E-08    3      1000024        14       -14             # W2SS+  -->  W1SS+  NUM    ANUM        
      3.93827477E-08    3      1000024        16       -16             # W2SS+  -->  W1SS+  NUT    ANUT        
      1.86720541E-08    3      1000024        11       -11             # W2SS+  -->  W1SS+  E-     E+          
      1.86720541E-08    3      1000024        13       -13             # W2SS+  -->  W1SS+  MU-    MU+         
      1.90448599E-08    3      1000024        15       -15             # W2SS+  -->  W1SS+  TAU-   TAU+        
      2.59462893E-01    2      1000024        25                       # W2SS+  -->  W1SS+  HL0                
#         PDG         Width
DECAY        25  4.05474100E-03   # HL0   decays
#          BR          NDA       ID1       ID2       ID3       ID4
      4.86994356E-09    2           11       -11                       # HL0    -->  E-     E+                 
      2.05616743E-04    2           13       -13                       # HL0    -->  MU-    MU+                
      5.88065274E-02    2           15       -15                       # HL0    -->  TAU-   TAU+               
      6.11294718E-06    2            1        -1                       # HL0    -->  DN     DB                 
      2.46993662E-03    2            3        -3                       # HL0    -->  ST     SB                 
      8.10513139E-01    2            5        -5                       # HL0    -->  BT     BB                 
      1.92171706E-06    2            2        -2                       # HL0    -->  UP     UB                 
      3.62158604E-02    2            4        -4                       # HL0    -->  CH     CB                 
      1.79577782E-03    2           22        22                       # HL0    -->  GM     GM                 
      3.83981504E-02    2           21        21                       # HL0    -->  GL     GL                 
      2.67730793E-03    3           24        11       -12             # HL0    -->  W+     E-     ANUE        
      2.67730793E-03    3           24        13       -14             # HL0    -->  W+     MU-    ANUM        
      2.67730793E-03    3           24        15       -16             # HL0    -->  W+     TAU-   ANUT        
      8.03192426E-03    3           24        -2         1             # HL0    -->  W+     UB     DN          
      8.03192426E-03    3           24        -4         3             # HL0    -->  W+     CB     ST          
      2.67730793E-03    3          -24       -11        12             # HL0    -->  W-     E+     NUE         
      2.67730793E-03    3          -24       -13        14             # HL0    -->  W-     MU+    NUM         
      2.67730793E-03    3          -24       -15        16             # HL0    -->  W-     TAU+   NUT         
      8.03192426E-03    3          -24         2        -1             # HL0    -->  W-     UP     DB          
      8.03192426E-03    3          -24         4        -3             # HL0    -->  W-     CH     SB          
      2.32214647E-04    3           23        12       -12             # HL0    -->  Z0     NUE    ANUE        
      2.32214647E-04    3           23        14       -14             # HL0    -->  Z0     NUM    ANUM        
      2.32214647E-04    3           23        16       -16             # HL0    -->  Z0     NUT    ANUT        
      1.16871306E-04    3           23        11       -11             # HL0    -->  Z0     E-     E+          
      1.16871306E-04    3           23        13       -13             # HL0    -->  Z0     MU-    MU+         
      1.16871306E-04    3           23        15       -15             # HL0    -->  Z0     TAU-   TAU+        
      4.00391174E-04    3           23         2        -2             # HL0    -->  Z0     UP     UB          
      4.00391174E-04    3           23         4        -4             # HL0    -->  Z0     CH     CB          
      5.15802472E-04    3           23         1        -1             # HL0    -->  Z0     DN     DB          
      5.15802472E-04    3           23         3        -3             # HL0    -->  Z0     ST     SB          
      5.15802472E-04    3           23         5        -5             # HL0    -->  Z0     BT     BB          
#         PDG         Width
DECAY        35  1.65414772E+01   # HH0   decays
#          BR          NDA       ID1       ID2       ID3       ID4
      1.54248458E-09    2           11       -11                       # HH0    -->  E-     E+                 
      6.51264781E-05    2           13       -13                       # HH0    -->  MU-    MU+                
      1.86530668E-02    2           15       -15                       # HH0    -->  TAU-   TAU+               
      1.88353613E-06    2            1        -1                       # HH0    -->  DN     DB                 
      7.61043862E-04    2            3        -3                       # HH0    -->  ST     SB                 
      1.03136241E-01    2            5        -5                       # HH0    -->  BT     BB                 
      6.13404882E-11    2            2        -2                       # HH0    -->  UP     UB                 
      8.24821086E-07    2            4        -4                       # HH0    -->  CH     CB                 
      4.09288853E-02    2            6        -6                       # HH0    -->  TP     TB                 
      5.65314167E-07    2           22        22                       # HH0    -->  GM     GM                 
      1.65151923E-05    2           21        21                       # HH0    -->  GL     GL                 
      5.04465315E-05    2           24       -24                       # HH0    -->  W+     W-                 
      2.57668507E-05    2           23        23                       # HH0    -->  Z0     Z0                 
      1.78674678E-03    2      1000022   1000022                       # HH0    -->  Z1SS   Z1SS               
      1.31880380E-02    2      1000022   1000023                       # HH0    -->  Z1SS   Z2SS               
      5.61778434E-02    2      1000022   1000025                       # HH0    -->  Z1SS   Z3SS               
      2.22050119E-02    2      1000022   1000035                       # HH0    -->  Z1SS   Z4SS               
      2.15316638E-02    2      1000023   1000023                       # HH0    -->  Z2SS   Z2SS               
      1.44991890E-01    2      1000023   1000025                       # HH0    -->  Z2SS   Z3SS               
      4.19475809E-02    2      1000023   1000035                       # HH0    -->  Z2SS   Z4SS               
      7.31920649E-04    2      1000025   1000025                       # HH0    -->  Z3SS   Z3SS               
      2.26473231E-02    2      1000025   1000035                       # HH0    -->  Z3SS   Z4SS               
      8.00185930E-03    2      1000035   1000035                       # HH0    -->  Z4SS   Z4SS               
      4.67223562E-02    2      1000024  -1000024                       # HH0    -->  W1SS+  W1SS-              
      7.17831682E-03    2      1000037  -1000037                       # HH0    -->  W2SS+  W2SS-              
      2.24550441E-01    2      1000024  -1000037                       # HH0    -->  W1SS+  W2SS-              
      2.24550441E-01    2     -1000024   1000037                       # HH0    -->  W1SS-  W2SS+              
      1.48321968E-04    2           25        25                       # HH0    -->  HL0    HL0                
#         PDG         Width
DECAY        36  1.63306255E+01   # HA0   decays
#          BR          NDA       ID1       ID2       ID3       ID4
      1.55234359E-09    2           11       -11                       # HA0    -->  E-     E+                 
      6.55427430E-05    2           13       -13                       # HA0    -->  MU-    MU+                
      1.87723935E-02    2           15       -15                       # HA0    -->  TAU-   TAU+               
      1.89567140E-06    2            1        -1                       # HA0    -->  DN     DB                 
      7.65947218E-04    2            3        -3                       # HA0    -->  ST     SB                 
      1.03802726E-01    2            5        -5                       # HA0    -->  BT     BB                 
      6.06554112E-11    2            2        -2                       # HA0    -->  UP     UB                 
      8.16223405E-07    2            4        -4                       # HA0    -->  CH     CB                 
      4.23015393E-02    2            6        -6                       # HA0    -->  TP     TB                 
      1.31903050E-07    2           22        22                       # HA0    -->  GM     GM                 
      2.68607873E-05    2           21        21                       # HA0    -->  GL     GL                 
      2.27258331E-03    2      1000022   1000022                       # HA0    -->  Z1SS   Z1SS               
      1.91081129E-02    2      1000022   1000023                       # HA0    -->  Z1SS   Z2SS               
      2.97305677E-02    2      1000022   1000025                       # HA0    -->  Z1SS   Z3SS               
      4.33938242E-02    2      1000022   1000035                       # HA0    -->  Z1SS   Z4SS               
      3.69147994E-02    2      1000023   1000023                       # HA0    -->  Z2SS   Z2SS               
      6.07829355E-02    2      1000023   1000025                       # HA0    -->  Z2SS   Z3SS               
      1.02785267E-01    2      1000023   1000035                       # HA0    -->  Z2SS   Z4SS               
      1.07532809E-03    2      1000025   1000025                       # HA0    -->  Z3SS   Z3SS               
      7.40406616E-03    2      1000025   1000035                       # HA0    -->  Z3SS   Z4SS               
      2.90345494E-02    2      1000035   1000035                       # HA0    -->  Z4SS   Z4SS               
      7.95402229E-02    2      1000024  -1000024                       # HA0    -->  W1SS+  W1SS-              
      3.10441479E-02    2      1000037  -1000037                       # HA0    -->  W2SS+  W2SS-              
      1.95562765E-01    2      1000024  -1000037                       # HA0    -->  W1SS+  W2SS-              
      1.95562765E-01    2     -1000024   1000037                       # HA0    -->  W1SS-  W2SS+              
      5.01545401E-05    2           25        23                       # HA0    -->  HL0    Z0                 
#         PDG         Width
DECAY        37  1.62874222E+01   # H+    decays
#          BR          NDA       ID1       ID2       ID3       ID4
      1.56952817E-09    2           12       -11                       # H+     -->  NUE    E+                 
      6.62683160E-05    2           14       -13                       # H+     -->  NUM    MU+                
      1.89802069E-02    2           16       -15                       # H+     -->  NUT    TAU+               
      1.76739195E-06    2            2        -1                       # H+     -->  UP     DB                 
      7.14851951E-04    2            4        -3                       # H+     -->  CH     SB                 
      1.33006841E-01    2            6        -5                       # H+     -->  TP     BB                 
      3.00685689E-02    2      1000024   1000022                       # H+     -->  W1SS+  Z1SS               
      3.91844405E-05    2      1000024   1000023                       # H+     -->  W1SS+  Z2SS               
      2.32663393E-01    2      1000024   1000025                       # H+     -->  W1SS+  Z3SS               
      2.36338586E-01    2      1000024   1000035                       # H+     -->  W1SS+  Z4SS               
      5.70154339E-02    2      1000037   1000022                       # H+     -->  W2SS+  Z1SS               
      2.72141814E-01    2      1000037   1000023                       # H+     -->  W2SS+  Z2SS               
      1.76619217E-02    2      1000037   1000025                       # H+     -->  W2SS+  Z3SS               
      1.25008705E-03    2      1000037   1000035                       # H+     -->  W2SS+  Z4SS               
      5.10449681E-05    2           25        24                       # H+     -->  HL0    W+                 
