  65
  401   1502.3956    0.48412E-25
  402   1500.2769    0.48115E-25
  403   1502.3756    0.48413E-25
  404   1500.2574    0.48116E-25
  405   1359.3267    0.35959E-25
  406   1172.5844    0.68301E-25
  407   1502.3956    0.48412E-25
  408   1500.2769    0.48115E-25
  409   1502.3756    0.48413E-25
  410   1500.2574    0.48116E-25
  411   1359.3267    0.35959E-25
  412   1172.5844    0.68301E-25
  413   1435.4331    0.89491E-24
  414   1441.3856    0.22262E-24
  415   1435.4032    0.89493E-24
  416   1441.3762    0.22262E-24
  417   1405.2516    0.76570E-25
  418   1401.0847    0.27966E-25
  419   1435.4331    0.89491E-24
  420   1441.3856    0.22262E-24
  421   1435.4032    0.89493E-24
  422   1441.3762    0.22262E-24
  423   1405.2516    0.76570E-25
  424   1401.0847    0.27966E-25
  425    494.8323    0.26703E-23
  426    488.3617    0.26602E-23
  427    494.8324    0.26703E-23
  428    488.3617    0.26602E-23
  429    232.4681    0.40466E-11
  430    479.8414    0.46602E-24
  431    494.8323    0.26703E-23
  432    488.3617    0.26602E-23
  433    494.8324    0.26703E-23
  434    488.3617    0.26602E-23
  435    232.4681    0.40466E-11
  436    479.8414    0.46602E-24
  437    279.8391    0.26464E-22
  438      0.0000    0.10000E+31
  439    280.6846    0.27705E-18
  440      0.0000    0.10000E+31
  441    495.0804    0.43908E-24
  442      0.0000    0.10000E+31
  443    279.8391    0.26464E-22
  444      0.0000    0.10000E+31
  445    280.6846    0.27705E-18
  446      0.0000    0.10000E+31
  447    495.0804    0.43908E-24
  448      0.0000    0.10000E+31
  449   1647.6500    0.23718E-25
  450    310.3430    0.16436E-23
  451    582.7946    0.48274E-24
  452   -870.5963    0.12489E-24
  453    881.7496    0.11394E-24
  454    582.9186    0.48180E-24
  455    881.9064    0.11561E-24
  456    582.9186    0.48180E-24
  457    881.9064    0.11561E-24
  203    120.1046    0.12048E-21
  204    830.0659    0.43324E-25
  205    829.0140    0.43343E-25
  206    834.1981    0.49531E-25
  207    834.1981    0.49531E-25
  458      0.0000    0.10000E+31
    6    173.3000    0.56017E-24
   12    173.3000    0.56017E-24
   6
   401  0.15413169E-01     0   450     1     0     0     0
   401  0.31932098E+00     0   451     1     0     0     0
   401  0.35650222E-03     0   452     1     0     0     0
   401  0.88821240E-02     0   453     1     0     0     0
   401  0.63358861E+00     0   456     2     0     0     0
   401  0.22438578E-01     0   457     2     0     0     0
   6
   402  0.13028538E-01     0   450     2     0     0     0
   402  0.32134005E+00     0   451     2     0     0     0
   402  0.21372089E-03     0   452     2     0     0     0
   402  0.71653062E-02     0   453     2     0     0     0
   402  0.64756215E+00     0   454     1     0     0     0
   402  0.10690295E-01     0   455     1     0     0     0
   6
   403  0.15413308E-01     0   450     3     0     0     0
   403  0.31932160E+00     0   451     3     0     0     0
   403  0.35649675E-03     0   452     3     0     0     0
   403  0.88819750E-02     0   453     3     0     0     0
   403  0.63358849E+00     0   456     4     0     0     0
   403  0.22438120E-01     0   457     4     0     0     0
   6
   404  0.13028614E-01     0   450     4     0     0     0
   404  0.32133964E+00     0   451     4     0     0     0
   404  0.21371662E-03     0   452     4     0     0     0
   404  0.71651558E-02     0   453     4     0     0     0
   404  0.64756274E+00     0   454     3     0     0     0
   404  0.10690111E-01     0   455     3     0     0     0
   7
   405  0.22966186E-01     0   450     5     0     0     0
   405  0.18884939E+00     0   451     5     0     0     0
   405  0.42998139E-01     0   452     5     0     0     0
   405  0.33160172E-01     0   453     5     0     0     0
   405  0.34546539E+00     0   456     6     0     0     0
   405  0.25222903E+00     0   457     6     0     0     0
   405  0.11433177E+00     0   199   406     0     0     0
   6
   406  0.20680013E+00     0   450     6     0     0     0
   406  0.79208642E-01     0   451     6     0     0     0
   406  0.19400510E+00     0   452     6     0     0     0
   406  0.71610466E-01     0   453     6     0     0     0
   406  0.18028860E+00     0   454     5     0     0     0
   406  0.26808706E+00     0   455     5     0     0     0
   6
   407  0.15413169E-01     0   450     7     0     0     0
   407  0.31932098E+00     0   451     7     0     0     0
   407  0.35650222E-03     0   452     7     0     0     0
   407  0.88821240E-02     0   453     7     0     0     0
   407  0.63358861E+00     0   454     8     0     0     0
   407  0.22438578E-01     0   455     8     0     0     0
   6
   408  0.13028538E-01     0   450     8     0     0     0
   408  0.32134005E+00     0   451     8     0     0     0
   408  0.21372089E-03     0   452     8     0     0     0
   408  0.71653062E-02     0   453     8     0     0     0
   408  0.64756215E+00     0   456     7     0     0     0
   408  0.10690295E-01     0   457     7     0     0     0
   6
   409  0.15413308E-01     0   450     9     0     0     0
   409  0.31932160E+00     0   451     9     0     0     0
   409  0.35649675E-03     0   452     9     0     0     0
   409  0.88819750E-02     0   453     9     0     0     0
   409  0.63358849E+00     0   454    10     0     0     0
   409  0.22438120E-01     0   455    10     0     0     0
   6
   410  0.13028614E-01     0   450    10     0     0     0
   410  0.32133964E+00     0   451    10     0     0     0
   410  0.21371662E-03     0   452    10     0     0     0
   410  0.71651558E-02     0   453    10     0     0     0
   410  0.64756274E+00     0   456     9     0     0     0
   410  0.10690111E-01     0   457     9     0     0     0
   7
   411  0.22966186E-01     0   450    11     0     0     0
   411  0.18884939E+00     0   451    11     0     0     0
   411  0.42998139E-01     0   452    11     0     0     0
   411  0.33160172E-01     0   453    11     0     0     0
   411  0.34546539E+00     0   454    12     0     0     0
   411  0.25222903E+00     0   455    12     0     0     0
   411  0.11433177E+00     0   198   412     0     0     0
   6
   412  0.20680013E+00     0   450    12     0     0     0
   412  0.79208642E-01     0   451    12     0     0     0
   412  0.19400510E+00     0   452    12     0     0     0
   412  0.71610466E-01     0   453    12     0     0     0
   412  0.18028860E+00     0   456    11     0     0     0
   412  0.26808706E+00     0   457    11     0     0     0
   4
   413  0.99808228E+00     0   450     1     0     0     0
   413  0.30343616E-03     0   451     1     0     0     0
   413  0.28027667E-03     0   452     1     0     0     0
   413  0.13339629E-02     0   453     1     0     0     0
   4
   414  0.99806684E+00     0   450     2     0     0     0
   414  0.30417368E-03     0   451     2     0     0     0
   414  0.28273874E-03     0   452     2     0     0     0
   414  0.13462123E-02     0   453     2     0     0     0
   4
   415  0.99808240E+00     0   450     3     0     0     0
   415  0.30343243E-03     0   451     3     0     0     0
   415  0.28026427E-03     0   452     3     0     0     0
   415  0.13339011E-02     0   453     3     0     0     0
   4
   416  0.99806696E+00     0   450     4     0     0     0
   416  0.30417228E-03     0   451     4     0     0     0
   416  0.28273414E-03     0   452     4     0     0     0
   416  0.13461895E-02     0   453     4     0     0     0
   7
   417  0.58484383E-01     0   450     5     0     0     0
   417  0.42469308E-01     0   451     5     0     0     0
   417  0.11536660E+00     0   452     5     0     0     0
   417  0.13216628E+00     0   453     5     0     0     0
   417  0.77227049E-01     0   456     6     0     0     0
   417  0.45351520E+00     0   457     6     0     0     0
   417  0.12077117E+00     0   199   406     0     0     0
   8
   418  0.25084731E+00     0   454     5     0     0     0
   418  0.13413608E+00     0   455     5     0     0     0
   418  0.88495746E-01     0   200   406     0     0     0
   418  0.73867150E-01     0   203   406     0     0     0
   418  0.16639825E-01     0   450     6     0     0     0
   418  0.11556450E+00     0   451     6     0     0     0
   418  0.12388266E+00     0   452     6     0     0     0
   418  0.19656678E+00     0   453     6     0     0     0
   4
   419  0.99808228E+00     0   450     7     0     0     0
   419  0.30343616E-03     0   451     7     0     0     0
   419  0.28027667E-03     0   452     7     0     0     0
   419  0.13339629E-02     0   453     7     0     0     0
   4
   420  0.99806684E+00     0   450     8     0     0     0
   420  0.30417368E-03     0   451     8     0     0     0
   420  0.28273874E-03     0   452     8     0     0     0
   420  0.13462123E-02     0   453     8     0     0     0
   4
   421  0.99808240E+00     0   450     9     0     0     0
   421  0.30343243E-03     0   451     9     0     0     0
   421  0.28026427E-03     0   452     9     0     0     0
   421  0.13339011E-02     0   453     9     0     0     0
   4
   422  0.99806696E+00     0   450    10     0     0     0
   422  0.30417228E-03     0   451    10     0     0     0
   422  0.28273414E-03     0   452    10     0     0     0
   422  0.13461895E-02     0   453    10     0     0     0
   7
   423  0.58484383E-01     0   450    11     0     0     0
   423  0.42469308E-01     0   451    11     0     0     0
   423  0.11536660E+00     0   452    11     0     0     0
   423  0.13216628E+00     0   453    11     0     0     0
   423  0.77227049E-01     0   454    12     0     0     0
   423  0.45351520E+00     0   455    12     0     0     0
   423  0.12077117E+00     0   198   412     0     0     0
   8
   424  0.25084731E+00     0   456    11     0     0     0
   424  0.13413608E+00     0   457    11     0     0     0
   424  0.88495746E-01     0   200   412     0     0     0
   424  0.73867150E-01     0   203   412     0     0     0
   424  0.16639825E-01     0   450    12     0     0     0
   424  0.11556450E+00     0   451    12     0     0     0
   424  0.12388266E+00     0   452    12     0     0     0
   424  0.19656678E+00     0   453    12     0     0     0
   4
   425  0.91075712E+00     0   450   121     0     0     0
   425  0.11954199E-04     0   429   121   131     0     0
   425  0.27548764E-04     0   435   121   125     0     0
   425  0.89203350E-01     0   121   130     0     0     0
   4
   426  0.91216689E+00     0   450   122     0     0     0
   426  0.22274093E-04     0   435   122   125     0     0
   426  0.10739440E-03     0   435   121   126     0     0
   426  0.87703504E-01     0   129   121     0     0     0
   4
   427  0.91075712E+00     0   450   123     0     0     0
   427  0.11954207E-04     0   429   123   131     0     0
   427  0.27548793E-04     0   435   123   125     0     0
   427  0.89203365E-01     0   121   128     0     0     0
   4
   428  0.91216689E+00     0   450   124     0     0     0
   428  0.22274093E-04     0   435   124   125     0     0
   428  0.10740107E-03     0   435   123   126     0     0
   428  0.87703511E-01     0   127   121     0     0     0
   3
   429  0.22685982E-01     0   125   130     0     0     0
   429  0.48862857E+00     0   125   124     0     0     0
   429  0.48868543E+00     0   123   126     0     0     0
   2
   430  0.14948212E+00     0   450   126     0     0     0
   430  0.85051793E+00     0   198   429     0     0     0
   4
   431  0.91075712E+00     0   450   127     0     0     0
   431  0.11954199E-04     0   435   127   125     0     0
   431  0.27548764E-04     0   429   127   131     0     0
   431  0.89203350E-01     0   127   124     0     0     0
   4
   432  0.91216689E+00     0   450   128     0     0     0
   432  0.22274093E-04     0   429   128   131     0     0
   432  0.10739440E-03     0   429   127   132     0     0
   432  0.87703504E-01     0   123   127     0     0     0
   4
   433  0.91075712E+00     0   450   129     0     0     0
   433  0.11954207E-04     0   435   129   125     0     0
   433  0.27548793E-04     0   429   129   131     0     0
   433  0.89203365E-01     0   127   122     0     0     0
   4
   434  0.91216689E+00     0   450   130     0     0     0
   434  0.22274093E-04     0   429   130   131     0     0
   434  0.10740107E-03     0   429   129   132     0     0
   434  0.87703511E-01     0   121   127     0     0     0
   3
   435  0.22685982E-01     0   131   124     0     0     0
   435  0.48862857E+00     0   131   130     0     0     0
   435  0.48868543E+00     0   129   132     0     0     0
   2
   436  0.14948212E+00     0   450   132     0     0     0
   436  0.85051793E+00     0   199   435     0     0     0
   4
   437  0.35407022E-04     0   429   121   131     0     0
   437  0.50906507E-04     0   435   121   125     0     0
   437  0.49995679E+00     0   123   122     0     0     0
   437  0.49995691E+00     0   121   124     0     0     0
   0
   2
   439  0.41126978E+00     0   429   123   131     0     0
   439  0.58873028E+00     0   435   123   125     0     0
   0
   3
   441  0.16670680E+00     0   450   125     0     0     0
   441  0.43170086E+00     0   200   429     0     0     0
   441  0.40159234E+00     0   203   429     0     0     0
   0
   4
   443  0.35407022E-04     0   435   127   125     0     0
   443  0.50906507E-04     0   429   127   131     0     0
   443  0.49995679E+00     0   129   128     0     0     0
   443  0.49995691E+00     0   127   130     0     0     0
   0
   2
   445  0.41126978E+00     0   435   129   125     0     0
   445  0.58873028E+00     0   429   129   131     0     0
   0
   3
   447  0.16670680E+00     0   450   131     0     0     0
   447  0.43170086E+00     0   200   435     0     0     0
   447  0.40159234E+00     0   203   435     0     0     0
   0
  24
   449  0.18988322E-01     0   408     2     0     0     0
   449  0.18988322E-01     0   402     8     0     0     0
   449  0.18471101E-01     0   407     1     0     0     0
   449  0.18471101E-01     0   401     7     0     0     0
   449  0.35817489E-01     0   420     2     0     0     0
   449  0.35817489E-01     0   414     8     0     0     0
   449  0.37768617E-01     0   419     1     0     0     0
   449  0.37768617E-01     0   413     7     0     0     0
   449  0.18475944E-01     0   409     3     0     0     0
   449  0.18475944E-01     0   403     9     0     0     0
   449  0.37778523E-01     0   421     3     0     0     0
   449  0.37778523E-01     0   415     9     0     0     0
   449  0.18992374E-01     0   410     4     0     0     0
   449  0.18992374E-01     0   404    10     0     0     0
   449  0.35819884E-01     0   422     4     0     0     0
   449  0.35819884E-01     0   416    10     0     0     0
   449  0.65313466E-01     0   411     5     0     0     0
   449  0.65313466E-01     0   405    11     0     0     0
   449  0.49155701E-01     0   423     5     0     0     0
   449  0.49155701E-01     0   417    11     0     0     0
   449  0.10867410E+00     0   412     6     0     0     0
   449  0.10867410E+00     0   406    12     0     0     0
   449  0.54744452E-01     0   424     6     0     0     0
   449  0.54744452E-01     0   418    12     0     0     0
   6
   450  0.68573959E-01     0   437   127     0     0     0
   450  0.68573959E-01     0   443   121     0     0     0
   450  0.65010883E-01     0   439   129     0     0     0
   450  0.65010883E-01     0   445   123     0     0     0
   450  0.36641514E+00     0   429   131     0     0     0
   450  0.36641514E+00     0   435   125     0     0     0
  20
   451  0.10449634E-02     0   450   200     0     0     0
   451  0.11500797E-01     0   450   203     0     0     0
   451  0.68654060E-01     0   425   127     0     0     0
   451  0.68654060E-01     0   431   121     0     0     0
   451  0.68653971E-01     0   427   129     0     0     0
   451  0.68653971E-01     0   433   123     0     0     0
   451  0.25383753E-03     0   437   127     0     0     0
   451  0.25383753E-03     0   443   121     0     0     0
   451  0.25291773E-03     0   439   129     0     0     0
   451  0.25291773E-03     0   445   123     0     0     0
   451  0.55303033E-01     0   429   131     0     0     0
   451  0.55303033E-01     0   435   125     0     0     0
   451  0.63611671E-01     0   441   131     0     0     0
   451  0.63611671E-01     0   447   125     0     0     0
   451  0.74768350E-01     0   426   128     0     0     0
   451  0.74768350E-01     0   432   122     0     0     0
   451  0.74768350E-01     0   428   130     0     0     0
   451  0.74768350E-01     0   434   124     0     0     0
   451  0.87460995E-01     0   430   132     0     0     0
   451  0.87460995E-01     0   436   126     0     0     0
  25
   452  0.25886756E+00     0   454   199     0     0     0
   452  0.25886756E+00     0   456   198     0     0     0
   452  0.91287814E-01     0   450   200     0     0     0
   452  0.23729666E+00     0   451   200     0     0     0
   452  0.34412806E-04     0   450     5    11     0     0
   452  0.16624408E-01     0   450   203     0     0     0
   452  0.68697468E-02     0   451   203     0     0     0
   452  0.85756619E-04     0   425   127     0     0     0
   452  0.85756619E-04     0   431   121     0     0     0
   452  0.85756619E-04     0   427   129     0     0     0
   452  0.85756619E-04     0   433   123     0     0     0
   452  0.21479402E-03     0   437   127     0     0     0
   452  0.21479402E-03     0   443   121     0     0     0
   452  0.21449459E-03     0   439   129     0     0     0
   452  0.21449459E-03     0   445   123     0     0     0
   452  0.39609917E-01     0   429   131     0     0     0
   452  0.39609917E-01     0   435   125     0     0     0
   452  0.23581456E-01     0   441   131     0     0     0
   452  0.23581456E-01     0   447   125     0     0     0
   452  0.42340480E-03     0   426   128     0     0     0
   452  0.42340480E-03     0   432   122     0     0     0
   452  0.42340480E-03     0   428   130     0     0     0
   452  0.42340480E-03     0   434   124     0     0     0
   452  0.43696014E-03     0   430   132     0     0     0
   452  0.43696014E-03     0   436   126     0     0     0
  25
   453  0.25239092E+00     0   454   199     0     0     0
   453  0.25239092E+00     0   456   198     0     0     0
   453  0.16350651E-01     0   450   200     0     0     0
   453  0.90362644E-02     0   451   200     0     0     0
   453  0.31186995E-04     0   450     5    11     0     0
   453  0.78049310E-01     0   450   203     0     0     0
   453  0.20518944E+00     0   451   203     0     0     0
   453  0.43501053E-02     0   425   127     0     0     0
   453  0.43501053E-02     0   431   121     0     0     0
   453  0.43501053E-02     0   427   129     0     0     0
   453  0.43501053E-02     0   433   123     0     0     0
   453  0.97924902E-03     0   437   127     0     0     0
   453  0.97924902E-03     0   443   121     0     0     0
   453  0.97792211E-03     0   439   129     0     0     0
   453  0.97792211E-03     0   445   123     0     0     0
   453  0.28474655E-01     0   429   131     0     0     0
   453  0.28474655E-01     0   435   125     0     0     0
   453  0.29123846E-01     0   441   131     0     0     0
   453  0.29123846E-01     0   447   125     0     0     0
   453  0.82567316E-02     0   426   128     0     0     0
   453  0.82567316E-02     0   432   122     0     0     0
   453  0.82567316E-02     0   428   130     0     0     0
   453  0.82567316E-02     0   434   124     0     0     0
   453  0.85114120E-02     0   430   132     0     0     0
   453  0.85114120E-02     0   436   126     0     0     0
   8
   454  0.12328982E-01     0   450   198     0     0     0
   454  0.15530428E+00     0   426   127     0     0     0
   454  0.15530421E+00     0   428   129     0     0     0
   454  0.18369329E+00     0   430   131     0     0     0
   454  0.13232760E+00     0   431   122     0     0     0
   454  0.13232753E+00     0   433   124     0     0     0
   454  0.10781146E+00     0   435   126     0     0     0
   454  0.12090263E+00     0   447   126     0     0     0
  11
   455  0.92580616E-01     0   450   198     0     0     0
   455  0.25895965E+00     0   451   198     0     0     0
   455  0.84736068E-02     0   426   127     0     0     0
   455  0.84736068E-02     0   428   129     0     0     0
   455  0.51237509E-01     0   430   131     0     0     0
   455  0.17186601E-01     0   431   122     0     0     0
   455  0.17186601E-01     0   433   124     0     0     0
   455  0.52710772E-01     0   435   126     0     0     0
   455  0.29054638E-01     0   447   126     0     0     0
   455  0.24640188E+00     0   454   200     0     0     0
   455  0.21773449E+00     0   454   203     0     0     0
   8
   456  0.12328982E-01     0   450   199     0     0     0
   456  0.15530428E+00     0   432   121     0     0     0
   456  0.15530421E+00     0   434   123     0     0     0
   456  0.18369329E+00     0   436   125     0     0     0
   456  0.13232760E+00     0   425   128     0     0     0
   456  0.13232753E+00     0   427   130     0     0     0
   456  0.10781146E+00     0   429   132     0     0     0
   456  0.12090263E+00     0   441   132     0     0     0
  11
   457  0.92580616E-01     0   450   199     0     0     0
   457  0.25895965E+00     0   451   199     0     0     0
   457  0.84736068E-02     0   432   121     0     0     0
   457  0.84736068E-02     0   434   123     0     0     0
   457  0.51237509E-01     0   436   125     0     0     0
   457  0.17186601E-01     0   425   128     0     0     0
   457  0.17186601E-01     0   427   130     0     0     0
   457  0.52710772E-01     0   429   132     0     0     0
   457  0.29054638E-01     0   441   132     0     0     0
   457  0.24640188E+00     0   456   200     0     0     0
   457  0.21773449E+00     0   456   203     0     0     0
  28
   203  0.16671390E-03     0   123   129     0     0     0
   203  0.47686934E-01     0   125   131     0     0     0
   203  0.20011051E-02     0     3     9     0     0     0
   203  0.78645593E+00     0     5    11     0     0     0
   203  0.37804063E-01     0     4    10     0     0     0
   203  0.16418545E-02     0    59    59     0     0     0
   203  0.32821041E-01     0    13    13     0     0     0
   203  0.46676472E-02     0   198   121   128     0     0
   203  0.46676472E-02     0   198   123   130     0     0
   203  0.46676472E-02     0   198   125   132     0     0
   203  0.14002942E-01     0   198     8     1     0     0
   203  0.14002942E-01     0   198    10     3     0     0
   203  0.46676472E-02     0   199   127   122     0     0
   203  0.46676472E-02     0   199   129   124     0     0
   203  0.46676472E-02     0   199   131   126     0     0
   203  0.14002942E-01     0   199     2     7     0     0
   203  0.14002942E-01     0   199     4     9     0     0
   203  0.50640095E-03     0   200   122   128     0     0
   203  0.50640095E-03     0   200   124   130     0     0
   203  0.50640095E-03     0   200   126   132     0     0
   203  0.25486649E-03     0   200   121   127     0     0
   203  0.25486649E-03     0   200   123   129     0     0
   203  0.25486649E-03     0   200   125   131     0     0
   203  0.87315100E-03     0   200     2     8     0     0
   203  0.87315100E-03     0   200     4    10     0     0
   203  0.11248336E-02     0   200     1     7     0     0
   203  0.11248336E-02     0   200     3     9     0     0
   203  0.11248336E-02     0   200     5    11     0     0
  10
   204  0.23254273E-03     0   123   129     0     0     0
   204  0.66601984E-01     0   125   131     0     0     0
   204  0.27305200E-02     0     3     9     0     0     0
   204  0.83246291E+00     0     5    11     0     0     0
   204  0.44380361E-02     0     6    12     0     0     0
   204  0.10216024E-04     0   198   199     0     0     0
   204  0.14246113E-03     0   450   450     0     0     0
   204  0.14752839E-01     0   429   435     0     0     0
   204  0.39314307E-01     0   429   447     0     0     0
   204  0.39314307E-01     0   441   435     0     0     0
  10
   205  0.23236879E-03     0   123   129     0     0     0
   205  0.66553377E-01     0   125   131     0     0     0
   205  0.27285074E-02     0     3     9     0     0     0
   205  0.83203179E+00     0     5    11     0     0     0
   205  0.50059925E-02     0     6    12     0     0     0
   205  0.25265274E-04     0    13    13     0     0     0
   205  0.34425393E-03     0   450   450     0     0     0
   205  0.14593630E-01     0   429   435     0     0     0
   205  0.39242409E-01     0   429   447     0     0     0
   205  0.39242409E-01     0   441   435     0     0     0
   6
   206  0.26720174E-03     0   124   129     0     0     0
   206  0.76529980E-01     0   126   131     0     0     0
   206  0.28794198E-02     0     4     9     0     0     0
   206  0.80783743E+00     0     6    11     0     0     0
   206  0.11428327E-04     0   203   198     0     0     0
   206  0.11247462E+00     0   435   430     0     0     0
   6
   207  0.26720174E-03     0   130   123     0     0     0
   207  0.76529980E-01     0   132   125     0     0     0
   207  0.28794198E-02     0    10     3     0     0     0
   207  0.80783743E+00     0    12     5     0     0     0
   207  0.11428327E-04     0   203   199     0     0     0
   207  0.11247462E+00     0   429   436     0     0     0
   0
   5
     6  0.33333334E+00   100     2     7     5     0     0
     6  0.33333334E+00   100     4     9     5     0     0
     6  0.11111111E+00   100   122   127     5     0     0
     6  0.11111111E+00   100   124   129     5     0     0
     6  0.11111111E+00   100   126   131     5     0     0
   5
    12  0.33333334E+00   100     8     1    11     0     0
    12  0.33333334E+00   100    10     3    11     0     0
    12  0.11111111E+00   100   128   121    11     0     0
    12  0.11111111E+00   100   130   123    11     0     0
    12  0.11111111E+00   100   132   125    11     0     0
     24.22820091     -0.04218486
      0.99792302     -0.00732128      0.05956508     -0.02341362
     -0.01986041     -0.97895259      0.16690193     -0.11576320
      0.02521712     -0.03706042     -0.70517570     -0.70761383
     -0.05585213      0.20056117      0.68652910     -0.69665873
     -0.98639083      0.16441755     -0.16441755     -0.98639083
     -0.97152102      0.23695344     -0.23695344     -0.97152102
     -1.20612240     -0.45489180     -1.35856974
  -1275.33996582   4451.60986328  -1500.91003418
    867.83398438
    F
  0.00000000E+00  0.00000000E+00  0.00000000E+00  0.47260702E-01 -0.50328900E-23  0.00000000E+00  0.00000000E+00  0.00000000E+00 -0.29362501E-22 -0.47260702E-01  0.50328900E-23 -0.00000000E+00  0.00000000E+00  0.00000000E+00  0.00000000E+00  0.00000000E+00  0.00000000E+00  0.13410900E-06 -0.00000000E+00 -0.00000000E+00  0.29362501E-22 -0.00000000E+00 -0.00000000E+00 -0.13410900E-06  0.00000000E+00  0.00000000E+00  0.00000000E+00
 -0.43758201E-25  0.00000000E+00  0.00000000E+00  0.00000000E+00 -0.95807403E-24  0.00000000E+00  0.00000000E+00  0.00000000E+00 -0.38642601E-22  0.19985900E-09 -0.20744401E-36  0.00000000E+00  0.24526002E-38  0.43758699E-08  0.00000000E+00  0.00000000E+00  0.00000000E+00  0.17649501E-06  0.00000000E+00  0.00000000E+00  0.00000000E+00  0.00000000E+00  0.00000000E+00  0.00000000E+00  0.00000000E+00  0.00000000E+00  0.00000000E+00
  0.00000000E+00  0.00000000E+00  0.00000000E+00  0.00000000E+00  0.00000000E+00  0.00000000E+00  0.00000000E+00  0.00000000E+00  0.00000000E+00  0.00000000E+00  0.00000000E+00  0.00000000E+00  0.00000000E+00  0.00000000E+00  0.00000000E+00  0.00000000E+00  0.00000000E+00  0.00000000E+00  0.00000000E+00  0.00000000E+00  0.00000000E+00  0.00000000E+00  0.00000000E+00  0.00000000E+00  0.00000000E+00  0.00000000E+00  0.00000000E+00
