#  ISAJET SUSY parameters in SUSY Les Houches Accord 2 format
#  Created by ISALHA 2.0 Last revision: C. Balazs 21 Apr 2009
Block SPINFO   # Program information
     1   ISASUGRA from ISAJET          # Spectrum Calculator
     2   7.80   29-OCT-2009 12:50:36   # Version number
Block MODSEL   # Model selection
     1     2   # Minimal gauge mediated (GMSB) model               
Block SMINPUTS   # Standard Model inputs
     1     1.27836258E+02   # alpha_em^(-1)
     2     1.16570000E-05   # G_Fermi
     3     1.17200002E-01   # alpha_s(M_Z)
     4     9.11699982E+01   # m_{Z}(pole)
     5     4.19999981E+00   # m_{b}(m_{b})
     6     1.72500000E+02   # m_{top}(pole)
     7     1.77699995E+00   # m_{tau}(pole)
Block MINPAR   # SUSY breaking input parameters
     1     1.00000000E+04   # Lambda scale of soft SSB
     2     2.50000000E+05   # M_mess overall messenger scale
     3     1.00000000E+01   # tan(beta)
     4     1.00000000E+00   # sign(mu)
     5     3.00000000E+00   # N_5 messenger index
     6     1.00000000E+00   # c_grav gravitino mass factor
    51     3.00000000E+00   # N5_1  U(1)_Y messenger index
    52     3.00000000E+00   # N5_2 SU(2)_L messenger index
    53     3.00000000E+00   # N5_3 SU(3)_C messenger index
   101     1.00000000E+00   # Rsl
   102     0.00000000E+00   # dmH_d^2
   103     0.00000000E+00   # dmH_u^2
   104     0.00000000E+00   # d_Y
Block MASS   # Scalar and gaugino mass spectrum
#  PDG code   mass                 particle
        24     8.04229965E+01   #  W^+
        25     8.58587723E+01   #  h^0            
        35     1.03942055E+02   #  H^0            
        36     9.06606216E+01   #  A^0            
        37     1.21131065E+02   #  H^+            
   1000001     2.61981354E+02   #  dnl            
   1000002     2.48766418E+02   #  upl            
   1000003     2.61981415E+02   #  stl            
   1000004     2.48770401E+02   #  chl            
   1000005     2.43574829E+02   #  b1             
   1000006     2.42504028E+02   #  t1             
   1000011     8.22465591E+01   #  el-            
   1000012     1.85853004E+01   #  nuel           
   1000013     8.22466354E+01   #  mul-           
   1000014     1.85853004E+01   #  numl           
   1000015     4.78710022E+01   #  tau1           
   1000016     1.57754030E+01   #  nutl           
   1000021     2.65271393E+02   #  glss           
   1000022     1.94924603E+01   #  z1ss           
   1000023     5.18389053E+01   #  z2ss           
   1000024     3.63251915E+01   #  w1ss           
   1000025    -1.08680649E+02   #  z3ss           
   1000035     1.57049744E+02   #  z4ss           
   1000037     1.57651459E+02   #  w2ss           
   1000039     6.01406591E-10   #  gvss
   2000001     2.48171097E+02   #  dnr            
   2000002     2.44668365E+02   #  upr            
   2000003     2.48171188E+02   #  str            
   2000004     2.44672424E+02   #  chr            
   2000005     2.54377563E+02   #  b2             
   2000006     3.12101593E+02   #  t2             
   2000011     5.27366028E+01   #  er-            
   2000013     5.27367134E+01   #  mur-           
   2000015     8.46566010E+01   #  tau2           
Block ALPHA   # Effective Higgs mixing parameter
         -1.01453090E+00   # alpha
Block STOPMIX   # stop mixing matrix
  1  1     6.20123863E-01   # O_{11}
  1  2     7.84503937E-01   # O_{12}
  2  1    -7.84503937E-01   # O_{21}
  2  2     6.20123863E-01   # O_{22}
Block SBOTMIX   # sbottom mixing matrix
  1  1     5.85571289E-01   # O_{11}
  1  2     8.10620904E-01   # O_{12}
  2  1    -8.10620904E-01   # O_{21}
  2  2     5.85571289E-01   # O_{22}
Block STAUMIX   # stau mixing matrix
  1  1     3.35196346E-01   # O_{11}
  1  2     9.42148328E-01   # O_{12}
  2  1    -9.42148328E-01   # O_{21}
  2  2     3.35196346E-01   # O_{22}
Block NMIX   # neutralino mixing matrix
  1  1    -6.00572765E-01   #
  1  2     3.81140620E-01   #
  1  3    -6.69522583E-01   #
  1  4     2.13971391E-01   #
  2  1    -7.37260818E-01   #
  2  2    -5.95131755E-01   #
  2  3     2.65643448E-01   #
  2  4    -1.78040057E-01   #
  3  1    -1.98533535E-01   #
  3  2     2.80521959E-01   #
  3  3     5.75053573E-01   #
  3  4     7.42432058E-01   #
  4  1     2.37367764E-01   #
  4  2    -6.49505496E-01   #
  4  3    -3.87925982E-01   #
  4  4     6.09354556E-01   #
Block UMIX   # chargino U mixing matrix
  1  1    -5.34999073E-01   # U_{11}
  1  2     8.44852626E-01   # U_{12}
  2  1    -8.44852626E-01   # U_{21}
  2  2    -5.34999073E-01   # U_{22}
Block VMIX   # chargino V mixing matrix
  1  1    -8.86566401E-01   # V_{11}
  1  2     4.62601364E-01   # V_{12}
  2  1    -4.62601364E-01   # V_{21}
  2  2    -8.86566401E-01   # V_{22}
Block GAUGE Q=  2.22500732E+02   #
     1     3.57524991E-01   # g`
     2     6.52378619E-01   # g_2
     3     1.21928000E+00   # g_3
Block YU Q=  2.22500732E+02   #
  3  3     9.17991817E-01   # y_t
Block YD Q=  2.22500732E+02   #
  3  3     1.47524819E-01   # y_b
Block YE Q=  2.22500732E+02   #
  3  3     1.00304946E-01   # y_tau
Block HMIX Q=  2.22500732E+02   # Higgs mixing parameters
     1     8.82395782E+01   # mu(Q)
     2     1.00000000E+01   # tan(beta)(M_GUT)
     3     2.48683228E+02   # Higgs vev at Q
     4     8.21934863E+03   # m_A^2(Q)
Block MSOFT Q=  2.22500732E+02   # DRbar SUSY breaking parameters
     1     4.04685936E+01   # M_1(Q)          
     2     7.90420914E+01   # M_2(Q)          
     3     2.45236526E+02   # M_3(Q)          
    31     6.77300949E+01   # MeL(Q)          
    32     6.77300949E+01   # MmuL(Q)         
    33     6.70759048E+01   # MtauL(Q)        
    34     3.09143810E+01   # MeR(Q)          
    35     3.09143810E+01   # MmuR(Q)         
    36     3.05727386E+01   # MtauR(Q)        
    41     2.42187347E+02   # MqL1(Q)         
    42     2.42187347E+02   # MqL2(Q)         
    43     2.32367599E+02   # MqL3(Q)         
    44     2.35036652E+02   # MuR(Q)          
    45     2.35036652E+02   # McR(Q)          
    46     2.13052841E+02   # MtR(Q)          
    47     2.34389969E+02   # MdR(Q)          
    48     2.34389969E+02   # MsR(Q)          
    49     2.34414734E+02   # MbR(Q)          
Block AU Q=  2.22500732E+02   #
  1  1    -1.02687317E+02   # A_u
  2  2    -1.02687317E+02   # A_c
  3  3    -1.02687317E+02   # A_t
Block AD Q=  2.22500732E+02   #
  1  1    -1.20453972E+02   # A_d
  2  2    -1.20453972E+02   # A_s
  3  3    -1.20453972E+02   # A_b
Block AE Q=  2.22500732E+02   #
  1  1    -1.05782824E+01   # A_e
  2  2    -1.05782824E+01   # A_mu
  3  3    -1.05782824E+01   # A_tau
#  ISAJET decay tables in SUSY Les Houches accord format
#  Created by ISALHD. Last revision: C. Balazs, 2005 May 25
Block DCINFO                           # Program information
     1   ISASUGRA from ISAJET          # Spectrum Calculator
     2   7.80   29-OCT-2009 12:50:36   # Version number
#         PDG         Width
DECAY         6  1.18985796E+00   # TP    decays
#          BR          NDA       ID1       ID2       ID3       ID4
      3.21273029E-01    3            2        -1         5             # TP     -->  UP     DB     BT          
      3.21273029E-01    3            4        -3         5             # TP     -->  CH     SB     BT          
      1.07091010E-01    3          -11        12         5             # TP     -->  E+     NUE    BT          
      1.07091010E-01    3          -13        14         5             # TP     -->  MU+    NUM    BT          
      1.07091010E-01    3          -15        16         5             # TP     -->  TAU+   NUT    BT          
      3.61809172E-02    2           37         5                       # TP     -->  H+     BT                 
#         PDG         Width
DECAY   1000021  9.41914260E-01   # GLSS  decays
#          BR          NDA       ID1       ID2       ID3       ID4
      1.68572751E-06    3      1000024         5        -6             # GLSS   -->  W1SS+  BT     TB          
      1.68572751E-06    3     -1000024         6        -5             # GLSS   -->  W1SS-  TP     BB          
      1.82039676E-05    2      1000022        21                       # GLSS   -->  Z1SS   GL                 
      1.37182697E-05    2      1000023        21                       # GLSS   -->  Z2SS   GL                 
      1.44913531E-04    2      1000025        21                       # GLSS   -->  Z3SS   GL                 
      5.46232041E-05    2      1000035        21                       # GLSS   -->  Z4SS   GL                 
      5.47284186E-02    2     -1000002         2                       # GLSS   -->  UBL    UP                 
      5.47284186E-02    2      1000002        -2                       # GLSS   -->  UPL    UB                 
      2.28788401E-03    2     -1000001         1                       # GLSS   -->  DBL    DN                 
      2.28788401E-03    2      1000001        -1                       # GLSS   -->  DNL    DB                 
      8.39252770E-02    2     -2000002         2                       # GLSS   -->  UBR    UP                 
      8.39252770E-02    2      2000002        -2                       # GLSS   -->  UPR    UB                 
      5.86116388E-02    2     -2000001         1                       # GLSS   -->  DBR    DN                 
      5.86116388E-02    2      2000001        -1                       # GLSS   -->  DNR    DB                 
      2.28367443E-03    2     -1000003         3                       # GLSS   -->  SBL    ST                 
      2.28367443E-03    2      1000003        -3                       # GLSS   -->  STL    SB                 
      5.86073548E-02    2     -2000003         3                       # GLSS   -->  SBR    ST                 
      5.86073548E-02    2      2000003        -3                       # GLSS   -->  STR    SB                 
      5.45310006E-02    2     -1000004         4                       # GLSS   -->  CBL    CH                 
      5.45310006E-02    2      1000004        -4                       # GLSS   -->  CHL    CB                 
      8.37274119E-02    2     -2000004         4                       # GLSS   -->  CBR    CH                 
      8.37274119E-02    2      2000004        -4                       # GLSS   -->  CHR    CB                 
      6.98081255E-02    2     -1000005         5                       # GLSS   -->  BB1    BT                 
      6.98081255E-02    2      1000005        -5                       # GLSS   -->  BT1    BB                 
      3.13717909E-02    2     -2000005         5                       # GLSS   -->  BB2    BT                 
      3.13717909E-02    2      2000005        -5                       # GLSS   -->  BT2    BB                 
      4.43905757E-09    2      1000039        21                       # GLSS   -->  GVSS   GL                 
#         PDG         Width
DECAY   1000002  2.50402117E+00   # UPL   decays
#          BR          NDA       ID1       ID2       ID3       ID4
      3.03607397E-02    2      1000022         2                       # UPL    -->  Z1SS   UP                 
      2.04029188E-01    2      1000023         2                       # UPL    -->  Z2SS   UP                 
      1.63200349E-02    2      1000025         2                       # UPL    -->  Z3SS   UP                 
      5.55552915E-02    2      1000035         2                       # UPL    -->  Z4SS   UP                 
      6.29648089E-01    2      1000024         1                       # UPL    -->  W1SS+  DN                 
      6.40866458E-02    2      1000037         1                       # UPL    -->  W2SS+  DN                 
#         PDG         Width
DECAY   1000001  2.01962590E+00   # DNL   decays
#          BR          NDA       ID1       ID2       ID3       ID4
      1.30272552E-01    2      1000022         1                       # DNL    -->  Z1SS   DN                 
      1.06696270E-01    2      1000023         1                       # DNL    -->  Z2SS   DN                 
      3.75841148E-02    2      1000025         1                       # DNL    -->  Z3SS   DN                 
      1.07619941E-01    2      1000035         1                       # DNL    -->  Z4SS   DN                 
      3.00667197E-01    2     -1000024         2                       # DNL    -->  W1SS-  UP                 
      3.17159891E-01    2     -1000037         2                       # DNL    -->  W2SS-  UP                 
#         PDG         Width
DECAY   1000003  2.01950979E+00   # STL   decays
#          BR          NDA       ID1       ID2       ID3       ID4
      1.30280077E-01    2      1000022         3                       # STL    -->  Z1SS   ST                 
      1.06702439E-01    2      1000023         3                       # STL    -->  Z2SS   ST                 
      3.75862941E-02    2      1000025         3                       # STL    -->  Z3SS   ST                 
      1.07626252E-01    2      1000035         3                       # STL    -->  Z4SS   ST                 
      3.00667971E-01    2     -1000024         4                       # STL    -->  W1SS-  CH                 
      3.17137003E-01    2     -1000037         4                       # STL    -->  W2SS-  CH                 
#         PDG         Width
DECAY   1000004  2.50401449E+00   # CHL   decays
#          BR          NDA       ID1       ID2       ID3       ID4
      3.03595122E-02    2      1000022         4                       # CHL    -->  Z1SS   CH                 
      2.04020455E-01    2      1000023         4                       # CHL    -->  Z2SS   CH                 
      1.63191203E-02    2      1000025         4                       # CHL    -->  Z3SS   CH                 
      5.55496290E-02    2      1000035         4                       # CHL    -->  Z4SS   CH                 
      6.29660666E-01    2      1000024         3                       # CHL    -->  W1SS+  ST                 
      6.40906096E-02    2      1000037         3                       # CHL    -->  W2SS+  ST                 
#         PDG         Width
DECAY   1000005  5.65539658E-01   # BT1   decays
#          BR          NDA       ID1       ID2       ID3       ID4
      5.47975361E-01    2      1000022         5                       # BT1    -->  Z1SS   BT                 
      2.38410786E-01    2      1000023         5                       # BT1    -->  Z2SS   BT                 
      4.20989236E-03    2      1000025         5                       # BT1    -->  Z3SS   BT                 
      5.71868978E-02    2      1000035         5                       # BT1    -->  Z4SS   BT                 
      1.52217135E-01    2     -1000024         6                       # BT1    -->  W1SS-  TP                 
#         PDG         Width
DECAY   1000006  2.75974059E+00   # TP1   decays
#          BR          NDA       ID1       ID2       ID3       ID4
      4.08424623E-02    2      1000022         6                       # TP1    -->  Z1SS   TP                 
      4.24611941E-02    2      1000023         6                       # TP1    -->  Z2SS   TP                 
      8.00117254E-01    2      1000024         5                       # TP1    -->  W1SS+  BT                 
      1.16579100E-01    2      1000037         5                       # TP1    -->  W2SS+  BT                 
#         PDG         Width
DECAY   2000002  4.96034861E-01   # UPR   decays
#          BR          NDA       ID1       ID2       ID3       ID4
      3.97084177E-01    2      1000022         2                       # UPR    -->  Z1SS   UP                 
      5.52879453E-01    2      1000023         2                       # UPR    -->  Z2SS   UP                 
      2.83168890E-02    2      1000025         2                       # UPR    -->  Z3SS   UP                 
      2.17195060E-02    2      1000035         2                       # UPR    -->  Z4SS   UP                 
#         PDG         Width
DECAY   2000001  1.26142919E-01   # DNR   decays
#          BR          NDA       ID1       ID2       ID3       ID4
      3.96096349E-01    2      1000022         1                       # DNR    -->  Z1SS   DN                 
      5.52760065E-01    2      1000023         1                       # DNR    -->  Z2SS   DN                 
      2.86267586E-02    2      1000025         1                       # DNR    -->  Z3SS   DN                 
      2.25168280E-02    2      1000035         1                       # DNR    -->  Z4SS   DN                 
#         PDG         Width
DECAY   2000003  1.26142979E-01   # STR   decays
#          BR          NDA       ID1       ID2       ID3       ID4
      3.96096289E-01    2      1000022         3                       # STR    -->  Z1SS   ST                 
      5.52760005E-01    2      1000023         3                       # STR    -->  Z2SS   ST                 
      2.86267642E-02    2      1000025         3                       # STR    -->  Z3SS   ST                 
      2.25168522E-02    2      1000035         3                       # STR    -->  Z4SS   ST                 
#         PDG         Width
DECAY   2000004  4.96011049E-01   # CHR   decays
#          BR          NDA       ID1       ID2       ID3       ID4
      3.97085458E-01    2      1000022         4                       # CHR    -->  Z1SS   CH                 
      5.52879930E-01    2      1000023         4                       # CHR    -->  Z2SS   CH                 
      2.83165034E-02    2      1000025         4                       # CHR    -->  Z3SS   CH                 
      2.17180867E-02    2      1000035         4                       # CHR    -->  Z4SS   CH                 
#         PDG         Width
DECAY   2000005  6.66161299E-01   # BT2   decays
#          BR          NDA       ID1       ID2       ID3       ID4
      1.20308638E-01    2      1000022         5                       # BT2    -->  Z1SS   BT                 
      2.28339255E-01    2      1000023         5                       # BT2    -->  Z2SS   BT                 
      1.80378646E-01    2      1000025         5                       # BT2    -->  Z3SS   BT                 
      2.66768187E-01    2      1000035         5                       # BT2    -->  Z4SS   BT                 
      2.04205319E-01    2     -1000024         6                       # BT2    -->  W1SS-  TP                 
#         PDG         Width
DECAY   2000006  2.58557439E+00   # TP2   decays
#          BR          NDA       ID1       ID2       ID3       ID4
      1.07468128E-01    2      1000024         5                       # TP2    -->  W1SS+  BT                 
      7.31327772E-01    2      1000037         5                       # TP2    -->  W2SS+  BT                 
      1.61473826E-03    2      1000022         6                       # TP2    -->  Z1SS   TP                 
      8.26561153E-02    2      1000023         6                       # TP2    -->  Z2SS   TP                 
      7.69332498E-02    2      1000025         6                       # TP2    -->  Z3SS   TP                 
#         PDG         Width
DECAY   1000011  2.55070537E-01   # EL-   decays
#          BR          NDA       ID1       ID2       ID3       ID4
      3.15140164E-03    2      1000022        11                       # EL-    -->  Z1SS   E-                 
      4.93432909E-01    2      1000023        11                       # EL-    -->  Z2SS   E-                 
      5.03415704E-01    2     -1000024        12                       # EL-    -->  W1SS-  NUE                
      1.44640842E-08    3      1000015        11       -15             # EL-    -->  TAU1-  E-     TAU+        
      4.71016754E-08    3     -1000015        11        15             # EL-    -->  TAU1+  E-     TAU-        
      4.69654524E-11    2           11   1000039                       # EL-    -->  E-     GVSS               
#         PDG         Width
DECAY   1000013  2.55070090E-01   # MUL-  decays
#          BR          NDA       ID1       ID2       ID3       ID4
      3.15139908E-03    2      1000022        13                       # MUL-   -->  Z1SS   MU-                
      4.93431032E-01    2      1000023        13                       # MUL-   -->  Z2SS   MU-                
      5.03417552E-01    2     -1000024        14                       # MUL-   -->  W1SS-  NUM                
      1.44642183E-08    3      1000015        13       -15             # MUL-   -->  TAU1-  MU-    TAU+        
      4.71022439E-08    3     -1000015        13        15             # MUL-   -->  TAU1+  MU-    TAU-        
      4.69654350E-11    2           13   1000039                       # MUL-   -->  MU-    GVSS               
#         PDG         Width
DECAY   1000015  7.19176456E-02   # TAU1- decays
#          BR          NDA       ID1       ID2       ID3       ID4
      9.07448590E-01    2      1000022        15                       # TAU1-  -->  Z1SS   TAU-               
      9.25514325E-02    2     -1000024        16                       # TAU1-  -->  W1SS-  NUT                
      1.10657759E-11    2           15   1000039                       # TAU1-  -->  TAU-   GVSS               
#         PDG         Width
DECAY   1000012  7.05826583E-15   # NUEL  decays
#          BR          NDA       ID1       ID2       ID3       ID4
      1.00000000E+00    2           12   1000039                       # NUEL   -->  NUE    GVSS               
#         PDG         Width
DECAY   1000014  7.05826583E-15   # NUML  decays
#          BR          NDA       ID1       ID2       ID3       ID4
      1.00000000E+00    2           14   1000039                       # NUML   -->  NUM    GVSS               
#         PDG         Width
DECAY   1000016  3.10994288E-15   # NUTL  decays
#          BR          NDA       ID1       ID2       ID3       ID4
      1.00000000E+00    2           16   1000039                       # NUTL   -->  NUT    GVSS               
#         PDG         Width
DECAY   2000011  7.22848028E-02   # ER-   decays
#          BR          NDA       ID1       ID2       ID3       ID4
      9.97701883E-01    2      1000022        11                       # ER-    -->  Z1SS   E-                 
      2.29813531E-03    2      1000023        11                       # ER-    -->  Z2SS   E-                 
      7.28890386E-12    3      1000015        11       -15             # ER-    -->  TAU1-  E-     TAU+        
      1.96073745E-14    3     -1000015        11        15             # ER-    -->  TAU1+  E-     TAU-        
      4.65019582E-20    3      1000015        12       -16             # ER-    -->  TAU1-  NUE    ANUT        
      1.79623746E-11    2           11   1000039                       # ER-    -->  E-     GVSS               
#         PDG         Width
DECAY   2000013  7.22831711E-02   # MUR-  decays
#          BR          NDA       ID1       ID2       ID3       ID4
      9.97717321E-01    2      1000022        13                       # MUR-   -->  Z1SS   MU-                
      2.28270260E-03    2      1000023        13                       # MUR-   -->  Z2SS   MU-                
      7.29004704E-12    3      1000015        13       -15             # MUR-   -->  TAU1-  MU-    TAU+        
      1.96085366E-14    3     -1000015        13        15             # MUR-   -->  TAU1+  MU-    TAU-        
      1.97425338E-15    3      1000015        14       -16             # MUR-   -->  TAU1-  NUM    ANUT        
      1.79626869E-11    2           13   1000039                       # MUR-   -->  MU-    GVSS               
#         PDG         Width
DECAY   2000015  2.32282758E-01   # TAU2- decays
#          BR          NDA       ID1       ID2       ID3       ID4
      9.40744299E-03    2      1000022        15                       # TAU2-  -->  Z1SS   TAU-               
      5.58298290E-01    2      1000023        15                       # TAU2-  -->  Z2SS   TAU-               
      4.32294279E-01    2     -1000024        16                       # TAU2-  -->  W1SS-  NUT                
#         PDG         Width
DECAY   1000022  5.62675018E-03   # Z1SS  decays
#          BR          NDA       ID1       ID2       ID3       ID4
      3.04826219E-02    2      1000012       -12                       # Z1SS   -->  NUEL   ANUE               
      3.04826219E-02    2     -1000012        12                       # Z1SS   -->  ANUEL  NUE                
      3.04826219E-02    2      1000014       -14                       # Z1SS   -->  NUML   ANUM               
      3.04826219E-02    2     -1000014        14                       # Z1SS   -->  ANUML  NUM                
      4.39034760E-01    2      1000016       -16                       # Z1SS   -->  NUTL   ANUT               
      4.39034760E-01    2     -1000016        16                       # Z1SS   -->  ANUTL  NUT                
      1.86999355E-13    2      1000039        22                       # Z1SS   -->  GVSS   GM                 
      3.27044778E-15    3      1000039        11       -11             # Z1SS   -->  GVSS   E-     E+          
#         PDG         Width
DECAY   1000023  2.03395262E-02   # Z2SS  decays
#          BR          NDA       ID1       ID2       ID3       ID4
      3.72759814E-08    2      1000022        22                       # Z2SS   -->  Z1SS   GM                 
      1.41232485E-05    3     -1000024         2        -1             # Z2SS   -->  W1SS-  UP     DB          
      4.70774921E-06    3     -1000024        12       -11             # Z2SS   -->  W1SS-  NUE    E+          
      4.70774921E-06    3     -1000024        14       -13             # Z2SS   -->  W1SS-  NUM    MU+         
      1.41232485E-05    3      1000024         1        -2             # Z2SS   -->  W1SS+  DN     UB          
      4.70774921E-06    3      1000024        11       -12             # Z2SS   -->  W1SS+  E-     ANUE        
      4.70774921E-06    3      1000024        13       -14             # Z2SS   -->  W1SS+  MU-    ANUM        
      1.41232485E-05    3     -1000024         4        -3             # Z2SS   -->  W1SS-  CH     SB          
      4.70774921E-06    3     -1000024        16       -15             # Z2SS   -->  W1SS-  NUT    TAU+        
      1.41232485E-05    3      1000024         3        -4             # Z2SS   -->  W1SS+  ST     CB          
      4.70774921E-06    3      1000024        15       -16             # Z2SS   -->  W1SS+  TAU-   ANUT        
      3.82173675E-06    3      1000022         2        -2             # Z2SS   -->  Z1SS   UP     UB          
      7.06253741E-06    3      1000022         1        -1             # Z2SS   -->  Z1SS   DN     DB          
      7.06253604E-06    3      1000022         3        -3             # Z2SS   -->  Z1SS   ST     SB          
      3.82173175E-06    3      1000022         4        -4             # Z2SS   -->  Z1SS   CH     CB          
      7.61985530E-06    3      1000022         5        -5             # Z2SS   -->  Z1SS   BT     BB          
      9.24140157E-04    3      1000022        11       -11             # Z2SS   -->  Z1SS   E-     E+          
      9.24109831E-04    3      1000022        13       -13             # Z2SS   -->  Z1SS   MU-    MU+         
      1.22840288E-06    3      1000022        15       -15             # Z2SS   -->  Z1SS   TAU-   TAU+        
      2.37266295E-06    3      1000022        12       -12             # Z2SS   -->  Z1SS   NUE    ANUE        
      2.37266295E-06    3      1000022        14       -14             # Z2SS   -->  Z1SS   NUM    ANUM        
      2.37266295E-06    3      1000022        16       -16             # Z2SS   -->  Z1SS   NUT    ANUT        
      4.58433963E-02    2      1000015       -15                       # Z2SS   -->  TAU1-  TAU+               
      4.58433963E-02    2     -1000015        15                       # Z2SS   -->  TAU1+  TAU-               
      1.46935269E-01    2      1000012       -12                       # Z2SS   -->  NUEL   ANUE               
      1.46935269E-01    2     -1000012        12                       # Z2SS   -->  ANUEL  NUE                
      1.46935269E-01    2      1000014       -14                       # Z2SS   -->  NUML   ANUM               
      1.46935269E-01    2     -1000014        14                       # Z2SS   -->  ANUML  NUM                
      1.59300685E-01    2      1000016       -16                       # Z2SS   -->  NUTL   ANUT               
      1.59300685E-01    2     -1000016        16                       # Z2SS   -->  ANUTL  NUT                
      5.09712064E-11    2      1000039        22                       # Z2SS   -->  GVSS   GM                 
      9.74093636E-13    3      1000039        11       -11             # Z2SS   -->  GVSS   E-     E+          
#         PDG         Width
DECAY   1000025  2.47776985E-01   # Z3SS  decays
#          BR          NDA       ID1       ID2       ID3       ID4
      1.72733166E-06    2      1000022        22                       # Z3SS   -->  Z1SS   GM                 
      3.15540524E-06    2      1000023        22                       # Z3SS   -->  Z2SS   GM                 
      2.05452112E-03    3     -1000024         2        -1             # Z3SS   -->  W1SS-  UP     DB          
      6.84840372E-04    3     -1000024        12       -11             # Z3SS   -->  W1SS-  NUE    E+          
      6.84840372E-04    3     -1000024        14       -13             # Z3SS   -->  W1SS-  NUM    MU+         
      2.05452112E-03    3      1000024         1        -2             # Z3SS   -->  W1SS+  DN     UB          
      6.84840372E-04    3      1000024        11       -12             # Z3SS   -->  W1SS+  E-     ANUE        
      6.84840372E-04    3      1000024        13       -14             # Z3SS   -->  W1SS+  MU-    ANUM        
      2.05452112E-03    3     -1000024         4        -3             # Z3SS   -->  W1SS-  CH     SB          
      6.84840372E-04    3     -1000024        16       -15             # Z3SS   -->  W1SS-  NUT    TAU+        
      2.05452112E-03    3      1000024         3        -4             # Z3SS   -->  W1SS+  ST     CB          
      6.84840372E-04    3      1000024        15       -16             # Z3SS   -->  W1SS+  TAU-   ANUT        
      7.26249767E-04    3      1000022         2        -2             # Z3SS   -->  Z1SS   UP     UB          
      8.86673050E-04    3      1000022         1        -1             # Z3SS   -->  Z1SS   DN     DB          
      8.86673050E-04    3      1000022         3        -3             # Z3SS   -->  Z1SS   ST     SB          
      7.26249244E-04    3      1000022         4        -4             # Z3SS   -->  Z1SS   CH     CB          
      8.97502585E-04    3      1000022         5        -5             # Z3SS   -->  Z1SS   BT     BB          
      2.07692239E-04    3      1000022        11       -11             # Z3SS   -->  Z1SS   E-     E+          
      2.07692239E-04    3      1000022        13       -13             # Z3SS   -->  Z1SS   MU-    MU+         
      2.09268896E-04    3      1000022        15       -15             # Z3SS   -->  Z1SS   TAU-   TAU+        
      4.13242204E-04    3      1000022        12       -12             # Z3SS   -->  Z1SS   NUE    ANUE        
      4.13242204E-04    3      1000022        14       -14             # Z3SS   -->  Z1SS   NUM    ANUM        
      4.13242204E-04    3      1000022        16       -16             # Z3SS   -->  Z1SS   NUT    ANUT        
      1.54796471E-05    3      1000023         2        -2             # Z3SS   -->  Z2SS   UP     UB          
      1.58956173E-05    3      1000023         1        -1             # Z3SS   -->  Z2SS   DN     DB          
      1.58956173E-05    3      1000023         3        -3             # Z3SS   -->  Z2SS   ST     SB          
      1.54795762E-05    3      1000023         4        -4             # Z3SS   -->  Z2SS   CH     CB          
      1.48149993E-05    3      1000023         5        -5             # Z3SS   -->  Z2SS   BT     BB          
      4.00593444E-06    3      1000023        11       -11             # Z3SS   -->  Z2SS   E-     E+          
      4.00593444E-06    3      1000023        13       -13             # Z3SS   -->  Z2SS   MU-    MU+         
      3.95378902E-06    3      1000023        15       -15             # Z3SS   -->  Z2SS   TAU-   TAU+        
      7.97055054E-06    3      1000023        12       -12             # Z3SS   -->  Z2SS   NUE    ANUE        
      7.97055054E-06    3      1000023        14       -14             # Z3SS   -->  Z2SS   NUM    ANUM        
      7.97055054E-06    3      1000023        16       -16             # Z3SS   -->  Z2SS   NUT    ANUT        
      3.44007247E-04    2      1000022        25                       # Z3SS   -->  Z1SS   HL0                
      4.95187333E-03    2      1000011       -11                       # Z3SS   -->  EL-    E+                 
      4.95187333E-03    2     -1000011        11                       # Z3SS   -->  EL+    E-                 
      4.95181931E-03    2      1000013       -13                       # Z3SS   -->  MUL-   MU+                
      4.95181931E-03    2     -1000013        13                       # Z3SS   -->  MUL+   MU-                
      2.56996136E-02    2      2000011       -11                       # Z3SS   -->  ER-    E+                 
      2.56996136E-02    2     -2000011        11                       # Z3SS   -->  ER+    E-                 
      2.56995298E-02    2      2000013       -13                       # Z3SS   -->  MUR-   MU+                
      2.56995298E-02    2     -2000013        13                       # Z3SS   -->  MUR+   MU-                
      1.87440217E-02    2      1000015       -15                       # Z3SS   -->  TAU1-  TAU+               
      1.87440217E-02    2     -1000015        15                       # Z3SS   -->  TAU1+  TAU-               
      1.21054100E-02    2      2000015       -15                       # Z3SS   -->  TAU2-  TAU+               
      1.21054100E-02    2     -2000015        15                       # Z3SS   -->  TAU2+  TAU-               
      1.32075161E-01    2      1000012       -12                       # Z3SS   -->  NUEL   ANUE               
      1.32075161E-01    2     -1000012        12                       # Z3SS   -->  ANUEL  NUE                
      1.32075161E-01    2      1000014       -14                       # Z3SS   -->  NUML   ANUM               
      1.32075161E-01    2     -1000014        14                       # Z3SS   -->  ANUML  NUM                
      1.34308815E-01    2      1000016       -16                       # Z3SS   -->  NUTL   ANUT               
      1.34308815E-01    2     -1000016        16                       # Z3SS   -->  ANUTL  NUT                
      2.94274614E-13    2      1000039        22                       # Z3SS   -->  GVSS   GM                 
      5.98493914E-15    3      1000039        11       -11             # Z3SS   -->  GVSS   E-     E+          
      5.23584268E-13    2      1000039        23                       # Z3SS   -->  GVSS   Z0                 
      1.50685313E-12    2      1000039        25                       # Z3SS   -->  GVSS   HL0                
      5.50882383E-16    2      1000039        35                       # Z3SS   -->  GVSS   HH0                
      3.47758714E-13    2      1000039        36                       # Z3SS   -->  GVSS   HA0                
#         PDG         Width
DECAY   1000035  2.02466393E+00   # Z4SS  decays
#          BR          NDA       ID1       ID2       ID3       ID4
      1.07269052E-07    2      1000022        22                       # Z4SS   -->  Z1SS   GM                 
      2.53386284E-10    2      1000023        22                       # Z4SS   -->  Z2SS   GM                 
      2.87965261E-08    2      1000025        22                       # Z4SS   -->  Z3SS   GM                 
      1.02952987E-01    2      1000024       -24                       # Z4SS   -->  W1SS+  W-                 
      1.02952987E-01    2     -1000024        24                       # Z4SS   -->  W1SS-  W+                 
      8.89710616E-03    2      1000022        23                       # Z4SS   -->  Z1SS   Z0                 
      1.20080358E-05    2      1000023        23                       # Z4SS   -->  Z2SS   Z0                 
      9.00557040E-07    3      1000022         2        -2             # Z4SS   -->  Z1SS   UP     UB          
      2.44757643E-06    3      1000022         1        -1             # Z4SS   -->  Z1SS   DN     DB          
      2.44757371E-06    3      1000022         3        -3             # Z4SS   -->  Z1SS   ST     SB          
      9.00486157E-07    3      1000022         4        -4             # Z4SS   -->  Z1SS   CH     CB          
      3.07808068E-06    3      1000022         5        -5             # Z4SS   -->  Z1SS   BT     BB          
      3.49018455E-06    3      1000023         2        -2             # Z4SS   -->  Z2SS   UP     UB          
      1.34490733E-06    3      1000023         1        -1             # Z4SS   -->  Z2SS   DN     DB          
      1.34490585E-06    3      1000023         3        -3             # Z4SS   -->  Z2SS   ST     SB          
      3.48990216E-06    3      1000023         4        -4             # Z4SS   -->  Z2SS   CH     CB          
      1.69019916E-06    3      1000023         5        -5             # Z4SS   -->  Z2SS   BT     BB          
      5.15698594E-06    3      1000025         2        -2             # Z4SS   -->  Z3SS   UP     UB          
      7.82318511E-06    3      1000025         1        -1             # Z4SS   -->  Z3SS   DN     DB          
      7.82318421E-06    3      1000025         3        -3             # Z4SS   -->  Z3SS   ST     SB          
      5.15700503E-06    3      1000025         4        -4             # Z4SS   -->  Z3SS   CH     CB          
      8.15451767E-06    3      1000025         5        -5             # Z4SS   -->  Z3SS   BT     BB          
      1.63033747E-06    3      1000025        11       -11             # Z4SS   -->  Z3SS   E-     E+          
      1.63033747E-06    3      1000025        13       -13             # Z4SS   -->  Z3SS   MU-    MU+         
      1.74927379E-06    3      1000025        15       -15             # Z4SS   -->  Z3SS   TAU-   TAU+        
      3.24385860E-06    3      1000025        12       -12             # Z4SS   -->  Z3SS   NUE    ANUE        
      3.24385860E-06    3      1000025        14       -14             # Z4SS   -->  Z3SS   NUM    ANUM        
      3.24385860E-06    3      1000025        16       -16             # Z4SS   -->  Z3SS   NUT    ANUT        
      4.96042368E-04    2      1000022        25                       # Z4SS   -->  Z1SS   HL0                
      8.92318320E-03    2      1000022        35                       # Z4SS   -->  Z1SS   HH0                
      2.15018238E-03    2      1000022        36                       # Z4SS   -->  Z1SS   HA0                
      1.77783612E-03    2      1000023        25                       # Z4SS   -->  Z2SS   HL0                
      6.72445167E-05    2      1000023        35                       # Z4SS   -->  Z2SS   HH0                
      1.40366232E-04    2      1000023        36                       # Z4SS   -->  Z2SS   HA0                
      2.31652297E-02    2      1000011       -11                       # Z4SS   -->  EL-    E+                 
      2.31652297E-02    2     -1000011        11                       # Z4SS   -->  EL+    E-                 
      2.31651831E-02    2      1000013       -13                       # Z4SS   -->  MUL-   MU+                
      2.31651831E-02    2     -1000013        13                       # Z4SS   -->  MUL+   MU-                
      8.74943845E-03    2      2000011       -11                       # Z4SS   -->  ER-    E+                 
      8.74943845E-03    2     -2000011        11                       # Z4SS   -->  ER+    E-                 
      8.74942727E-03    2      2000013       -13                       # Z4SS   -->  MUR-   MU+                
      8.74942727E-03    2     -2000013        13                       # Z4SS   -->  MUR+   MU-                
      7.65668182E-03    2      1000015       -15                       # Z4SS   -->  TAU1-  TAU+               
      7.65668182E-03    2     -1000015        15                       # Z4SS   -->  TAU1+  TAU-               
      2.38641985E-02    2      2000015       -15                       # Z4SS   -->  TAU2-  TAU+               
      2.38641985E-02    2     -2000015        15                       # Z4SS   -->  TAU2+  TAU-               
      9.65538621E-02    2      1000012       -12                       # Z4SS   -->  NUEL   ANUE               
      9.65538621E-02    2     -1000012        12                       # Z4SS   -->  ANUEL  NUE                
      9.65538621E-02    2      1000014       -14                       # Z4SS   -->  NUML   ANUM               
      9.65538621E-02    2     -1000014        14                       # Z4SS   -->  ANUML  NUM                
      9.73220617E-02    2      1000016       -16                       # Z4SS   -->  NUTL   ANUT               
      9.73220617E-02    2     -1000016        16                       # Z4SS   -->  ANUTL  NUT                
      1.65047696E-12    2      1000039        22                       # Z4SS   -->  GVSS   GM                 
      3.45746516E-14    3      1000039        11       -11             # Z4SS   -->  GVSS   E-     E+          
      1.95955786E-11    2      1000039        23                       # Z4SS   -->  GVSS   Z0                 
      1.07294892E-15    2      1000039        25                       # Z4SS   -->  GVSS   HL0                
      3.90793040E-12    2      1000039        35                       # Z4SS   -->  GVSS   HH0                
      1.57133464E-12    2      1000039        36                       # Z4SS   -->  GVSS   HA0                
#         PDG         Width
DECAY   1000024  2.14552701E-01   # W1SS+ decays
#          BR          NDA       ID1       ID2       ID3       ID4
      1.54905945E-06    3      1000022         2        -1             # W1SS+  -->  Z1SS   UP     DB          
      1.54905888E-06    3      1000022         4        -3             # W1SS+  -->  Z1SS   CH     SB          
      5.14326928E-07    3      1000022       -11        12             # W1SS+  -->  Z1SS   E+     NUE         
      5.14326871E-07    3      1000022       -13        14             # W1SS+  -->  Z1SS   MU+    NUM         
      9.62224135E-07    3      1000022       -15        16             # W1SS+  -->  Z1SS   TAU+   NUT         
      3.05273801E-01    2      1000012       -11                       # W1SS+  -->  NUEL   E+                 
      3.05271298E-01    2      1000014       -13                       # W1SS+  -->  NUML   MU+                
      3.89449835E-01    2      1000016       -15                       # W1SS+  -->  NUTL   TAU+               
#         PDG         Width
DECAY   1000037  1.52682519E+00   # W2SS+ decays
#          BR          NDA       ID1       ID2       ID3       ID4
      4.10773600E-06    3      1000022         2        -1             # W2SS+  -->  Z1SS   UP     DB          
      4.10771190E-06    3      1000022         4        -3             # W2SS+  -->  Z1SS   CH     SB          
      7.17650540E-03    2      1000022        24                       # W2SS+  -->  Z1SS   W+                 
      2.10695919E-02    2      1000022        37                       # W2SS+  -->  Z1SS   H+                 
      2.53402322E-06    3      1000023         2        -1             # W2SS+  -->  Z2SS   UP     DB          
      2.53391772E-06    3      1000023         4        -3             # W2SS+  -->  Z2SS   CH     SB          
      3.53606538E-06    3      1000023       -15        16             # W2SS+  -->  Z2SS   TAU+   NUT         
      9.94698778E-02    2      1000023        24                       # W2SS+  -->  Z2SS   W+                 
      4.40406911E-05    3      1000025         2        -1             # W2SS+  -->  Z3SS   UP     DB          
      4.40407057E-05    3      1000025         4        -3             # W2SS+  -->  Z3SS   CH     SB          
      1.40451730E-05    3      1000025       -11        12             # W2SS+  -->  Z3SS   E+     NUE         
      1.40451730E-05    3      1000025       -13        14             # W2SS+  -->  Z3SS   MU+    NUM         
      1.40703442E-05    3      1000025       -15        16             # W2SS+  -->  Z3SS   TAU+   NUT         
      1.41603250E-14    3      1000035       -11        12             # W2SS+  -->  Z4SS   E+     NUE         
      1.41603250E-14    3      1000035       -13        14             # W2SS+  -->  Z4SS   MU+    NUM         
      9.04437453E-02    2      1000012       -11                       # W2SS+  -->  NUEL   E+                 
      9.04437453E-02    2      1000014       -13                       # W2SS+  -->  NUML   MU+                
      9.33529958E-02    2      1000016       -15                       # W2SS+  -->  NUTL   TAU+               
      1.64339960E-01    2     -1000011        12                       # W2SS+  -->  EL+    NUE                
      1.64339706E-01    2     -1000013        14                       # W2SS+  -->  MUL+   NUM                
      1.50385024E-02    2     -1000015        16                       # W2SS+  -->  TAU1+  NUT                
      1.49390593E-01    2     -2000015        16                       # W2SS+  -->  TAU2+  NUT                
      4.90969978E-02    2      1000024        23                       # W2SS+  -->  W1SS+  Z0                 
      8.16774445E-06    3      1000024         1        -1             # W2SS+  -->  W1SS+  DN     DB          
      8.16709053E-06    3      1000024         3        -3             # W2SS+  -->  W1SS+  ST     SB          
      7.68026075E-06    3      1000024         2        -2             # W2SS+  -->  W1SS+  UP     UB          
      7.68025075E-06    3      1000024         4        -4             # W2SS+  -->  W1SS+  CH     CB          
      2.53739883E-03    2      1000024        25                       # W2SS+  -->  W1SS+  HL0                
      1.00579737E-02    2      1000024        35                       # W2SS+  -->  W1SS+  HH0                
      4.30635996E-02    2      1000024        36                       # W2SS+  -->  W1SS+  HA0                
#         PDG         Width
DECAY        25  5.32978594E-01   # HL0   decays
#          BR          NDA       ID1       ID2       ID3       ID4
      1.99408157E-09    2           11       -11                       # HL0    -->  E-     E+                 
      8.41929650E-05    2           13       -13                       # HL0    -->  MU-    MU+                
      2.40524225E-02    2           15       -15                       # HL0    -->  TAU-   TAU+               
      2.51429151E-06    2            1        -1                       # HL0    -->  DN     DB                 
      1.01589842E-03    2            3        -3                       # HL0    -->  ST     SB                 
      3.46943885E-01    2            5        -5                       # HL0    -->  BT     BB                 
      3.11004023E-09    2            2        -2                       # HL0    -->  UP     UB                 
      6.12914591E-05    2            4        -4                       # HL0    -->  CH     CB                 
      1.12640646E-05    2           22        22                       # HL0    -->  GM     GM                 
      4.09090135E-05    2           21        21                       # HL0    -->  GL     GL                 
      2.25391045E-01    2      1000022   1000022                       # HL0    -->  Z1SS   Z1SS               
      1.37829455E-02    2      1000022   1000023                       # HL0    -->  Z1SS   Z2SS               
      1.20684162E-01    2      1000024  -1000024                       # HL0    -->  W1SS+  W1SS-              
      8.83750170E-02    2      1000012  -1000012                       # HL0    -->  NUEL   ANUEL              
      8.83750170E-02    2      1000014  -1000014                       # HL0    -->  NUML   ANUML              
      9.11794454E-02    2      1000016  -1000016                       # HL0    -->  NUTL   ANUTL              
#         PDG         Width
DECAY        35  5.92555702E-01   # HH0   decays
#          BR          NDA       ID1       ID2       ID3       ID4
      8.39410652E-10    2           11       -11                       # HH0    -->  E-     E+                 
      3.54412150E-05    2           13       -13                       # HH0    -->  MU-    MU+                
      1.01331742E-02    2           15       -15                       # HH0    -->  TAU-   TAU+               
      1.05517711E-06    2            1        -1                       # HH0    -->  DN     DB                 
      4.26344253E-04    2            3        -3                       # HH0    -->  ST     SB                 
      8.55993778E-02    2            5        -5                       # HH0    -->  BT     BB                 
      8.73347439E-09    2            2        -2                       # HH0    -->  UP     UB                 
      1.66998740E-04    2            4        -4                       # HH0    -->  CH     CB                 
      3.76618823E-06    2           22        22                       # HH0    -->  GM     GM                 
      2.74909660E-04    2           21        21                       # HH0    -->  GL     GL                 
      2.08035658E-06    3           24        11       -12             # HH0    -->  W+     E-     ANUE        
      2.08035658E-06    3           24        13       -14             # HH0    -->  W+     MU-    ANUM        
      2.08035658E-06    3           24        15       -16             # HH0    -->  W+     TAU-   ANUT        
      6.24106997E-06    3           24        -2         1             # HH0    -->  W+     UB     DN          
      6.24106997E-06    3           24        -4         3             # HH0    -->  W+     CB     ST          
      2.08035658E-06    3          -24       -11        12             # HH0    -->  W-     E+     NUE         
      2.08035658E-06    3          -24       -13        14             # HH0    -->  W-     MU+    NUM         
      2.08035658E-06    3          -24       -15        16             # HH0    -->  W-     TAU+   NUT         
      6.24106997E-06    3          -24         2        -1             # HH0    -->  W-     UP     DB          
      6.24106997E-06    3          -24         4        -3             # HH0    -->  W-     CH     SB          
      6.12412165E-08    3           23        12       -12             # HH0    -->  Z0     NUE    ANUE        
      6.12412165E-08    3           23        14       -14             # HH0    -->  Z0     NUM    ANUM        
      6.12412165E-08    3           23        16       -16             # HH0    -->  Z0     NUT    ANUT        
      3.08220898E-08    3           23        11       -11             # HH0    -->  Z0     E-     E+          
      3.08220898E-08    3           23        13       -13             # HH0    -->  Z0     MU-    MU+         
      3.08220898E-08    3           23        15       -15             # HH0    -->  Z0     TAU-   TAU+        
      1.05593863E-07    3           23         2        -2             # HH0    -->  Z0     UP     UB          
      1.05593863E-07    3           23         4        -4             # HH0    -->  Z0     CH     CB          
      1.36030920E-07    3           23         1        -1             # HH0    -->  Z0     DN     DB          
      1.36030920E-07    3           23         3        -3             # HH0    -->  Z0     ST     SB          
      1.36030920E-07    3           23         5        -5             # HH0    -->  Z0     BT     BB          
      1.75650660E-02    2      1000022   1000022                       # HH0    -->  Z1SS   Z1SS               
      1.66793630E-04    2      1000022   1000023                       # HH0    -->  Z1SS   Z2SS               
      2.30377561E-09    2      1000023   1000023                       # HH0    -->  Z2SS   Z2SS               
      1.85508691E-02    2      1000024  -1000024                       # HH0    -->  W1SS+  W1SS-              
      1.55855082E-02    2      1000015  -1000015                       # HH0    -->  TAU1-  TAU1+              
      2.81910956E-01    2      1000012  -1000012                       # HH0    -->  NUEL   ANUEL              
      2.81910956E-01    2      1000014  -1000014                       # HH0    -->  NUML   ANUML              
      2.87630439E-01    2      1000016  -1000016                       # HH0    -->  NUTL   ANUTL              
#         PDG         Width
DECAY        36  6.34268165E-01   # HA0   decays
#          BR          NDA       ID1       ID2       ID3       ID4
      2.42906273E-09    2           11       -11                       # HA0    -->  E-     E+                 
      1.02559134E-04    2           13       -13                       # HA0    -->  MU-    MU+                
      2.93520093E-02    2           15       -15                       # HA0    -->  TAU-   TAU+               
      3.06004404E-06    2            1        -1                       # HA0    -->  DN     DB                 
      1.23641395E-03    2            3        -3                       # HA0    -->  ST     SB                 
      2.49532506E-01    2            5        -5                       # HA0    -->  BT     BB                 
      9.79115886E-11    2            2        -2                       # HA0    -->  UP     UB                 
      1.91368167E-06    2            4        -4                       # HA0    -->  CH     CB                 
      4.27782970E-06    2           22        22                       # HA0    -->  GM     GM                 
      1.09215056E-04    2           21        21                       # HA0    -->  GL     GL                 
      2.59742320E-01    2      1000022   1000022                       # HA0    -->  Z1SS   Z1SS               
      3.32027934E-02    2      1000022   1000023                       # HA0    -->  Z1SS   Z2SS               
      4.26712871E-01    2      1000024  -1000024                       # HA0    -->  W1SS+  W1SS-              
#         PDG         Width
DECAY        37  2.30347753E-01   # H+    decays
#          BR          NDA       ID1       ID2       ID3       ID4
      8.93643914E-09    2           12       -11                       # H+     -->  NUE    E+                 
      3.77312041E-04    2           14       -13                       # H+     -->  NUM    MU+                
      1.08021602E-01    2           16       -15                       # H+     -->  NUT    TAU+               
      1.00630186E-05    2            2        -1                       # H+     -->  UP     DB                 
      4.07079980E-03    2            4        -3                       # H+     -->  CH     SB                 
      3.71001959E-01    2      1000024   1000022                       # H+     -->  W1SS+  Z1SS               
      4.62008595E-01    2      1000024   1000023                       # H+     -->  W1SS+  Z2SS               
      1.80377010E-02    2     -1000011   1000012                       # H+     -->  EL+    NUEL               
      1.80345606E-02    2     -1000013   1000014                       # H+     -->  MUL+   NUML               
      3.84227349E-03    2     -1000015   1000016                       # H+     -->  TAU1+  NUTL               
      1.45950578E-02    2     -2000015   1000016                       # H+     -->  TAU2+  NUTL               
