  65
  401   2000.8307    0.26325E-25
  402   1999.3210    0.26227E-25
  403   2000.8307    0.26325E-25
  404   1999.3215    0.26227E-25
  405   1999.8334    0.43068E-25
  406   1828.9327    0.13973E-25
  407   2000.8307    0.26325E-25
  408   1999.3210    0.26227E-25
  409   2000.8307    0.26325E-25
  410   1999.3215    0.26227E-25
  411   1999.8334    0.43068E-25
  412   1828.9327    0.13973E-25
  413   2000.1520    0.58579E-24
  414   1999.6959    0.14648E-24
  415   2000.1520    0.58579E-24
  416   1999.6964    0.14648E-24
  417   2001.1527    0.14741E-25
  418   2165.4263    0.80799E-26
  419   2000.1520    0.58579E-24
  420   1999.6959    0.14648E-24
  421   2000.1520    0.58579E-24
  422   1999.6964    0.14648E-24
  423   2001.1527    0.14741E-25
  424   2165.4263    0.80799E-26
  425   2000.5267    0.24138E-25
  426   1999.0170    0.24095E-25
  427   2000.5267    0.24138E-25
  428   1999.0170    0.24095E-25
  429     96.6986    0.13947E-22
  430   1999.0170    0.23967E-25
  431   2000.5267    0.24138E-25
  432   1999.0170    0.24095E-25
  433   2000.5267    0.24138E-25
  434   1999.0170    0.24095E-25
  435     96.6986    0.13947E-22
  436   1999.0170    0.23967E-25
  437     96.6490    0.13926E-22
  438      0.0000    0.10000E+31
  439     96.6491    0.13927E-22
  440      0.0000    0.10000E+31
  441   2000.5476    0.24009E-25
  442      0.0000    0.10000E+31
  443     96.6490    0.13926E-22
  444      0.0000    0.10000E+31
  445     96.6491    0.13927E-22
  446      0.0000    0.10000E+31
  447   2000.5476    0.24009E-25
  448      0.0000    0.10000E+31
  449   2000.0000    0.20799E-24
  450     70.6808    0.10000E+31
  451    122.7311    0.47660E-23
  452   -149.8845    0.52601E-22
  453    236.4726    0.83417E-24
  454     98.2578    0.43350E-19
  455    235.1194    0.11847E-23
  456     98.2578    0.43350E-19
  457    235.1194    0.11847E-23
  203    119.0191    0.13106E-21
  204    504.3782    0.11929E-24
  205    500.0000    0.12204E-24
  206    509.4133    0.12382E-24
  207    509.4133    0.12382E-24
  458      0.0000    0.10000E+31
    6    172.5000    0.57395E-24
   12    172.5000    0.57395E-24
   6
   401  0.67251109E-01     0   450     1     0     0     0
   401  0.49798857E-01     0   451     1     0     0     0
   401  0.94195874E-02     0   452     1     0     0     0
   401  0.21489246E+00     0   453     1     0     0     0
   401  0.15127414E+00     0   456     2     0     0     0
   401  0.50736392E+00     0   457     2     0     0     0
   6
   402  0.13803851E-01     0   450     2     0     0     0
   402  0.13989729E+00     0   451     2     0     0     0
   402  0.54925941E-02     0   452     2     0     0     0
   402  0.18106323E+00     0   453     2     0     0     0
   402  0.32959327E+00     0   454     1     0     0     0
   402  0.33014971E+00     0   455     1     0     0     0
   6
   403  0.67251146E-01     0   450     3     0     0     0
   403  0.49798887E-01     0   451     3     0     0     0
   403  0.94195930E-02     0   452     3     0     0     0
   403  0.21489260E+00     0   453     3     0     0     0
   403  0.15127409E+00     0   456     4     0     0     0
   403  0.50736368E+00     0   457     4     0     0     0
   6
   404  0.13803840E-01     0   450     4     0     0     0
   404  0.13989720E+00     0   451     4     0     0     0
   404  0.54925899E-02     0   452     4     0     0     0
   404  0.18106313E+00     0   453     4     0     0     0
   404  0.32959336E+00     0   454     3     0     0     0
   404  0.33014983E+00     0   455     3     0     0     0
   7
   405  0.96060611E-01     0   450     5     0     0     0
   405  0.54905616E-01     0   451     5     0     0     0
   405  0.11659479E-02     0   452     5     0     0     0
   405  0.60900085E-01     0   453     5     0     0     0
   405  0.32214230E+00     0   456     6     0     0     0
   405  0.34173182E+00     0   457     6     0     0     0
   405  0.12309363E+00     0   199   406     0     0     0
   6
   406  0.14785288E-01     0   450     6     0     0     0
   406  0.92172287E-01     0   451     6     0     0     0
   406  0.20989153E+00     0   452     6     0     0     0
   406  0.28309691E+00     0   453     6     0     0     0
   406  0.73038433E-02     0   454     5     0     0     0
   406  0.39275017E+00     0   455     5     0     0     0
   6
   407  0.67251109E-01     0   450     7     0     0     0
   407  0.49798857E-01     0   451     7     0     0     0
   407  0.94195874E-02     0   452     7     0     0     0
   407  0.21489246E+00     0   453     7     0     0     0
   407  0.15127414E+00     0   454     8     0     0     0
   407  0.50736392E+00     0   455     8     0     0     0
   6
   408  0.13803851E-01     0   450     8     0     0     0
   408  0.13989729E+00     0   451     8     0     0     0
   408  0.54925941E-02     0   452     8     0     0     0
   408  0.18106323E+00     0   453     8     0     0     0
   408  0.32959327E+00     0   456     7     0     0     0
   408  0.33014971E+00     0   457     7     0     0     0
   6
   409  0.67251146E-01     0   450     9     0     0     0
   409  0.49798887E-01     0   451     9     0     0     0
   409  0.94195930E-02     0   452     9     0     0     0
   409  0.21489260E+00     0   453     9     0     0     0
   409  0.15127409E+00     0   454    10     0     0     0
   409  0.50736368E+00     0   455    10     0     0     0
   6
   410  0.13803840E-01     0   450    10     0     0     0
   410  0.13989720E+00     0   451    10     0     0     0
   410  0.54925899E-02     0   452    10     0     0     0
   410  0.18106313E+00     0   453    10     0     0     0
   410  0.32959336E+00     0   456     9     0     0     0
   410  0.33014983E+00     0   457     9     0     0     0
   7
   411  0.96060611E-01     0   450    11     0     0     0
   411  0.54905616E-01     0   451    11     0     0     0
   411  0.11659479E-02     0   452    11     0     0     0
   411  0.60900085E-01     0   453    11     0     0     0
   411  0.32214230E+00     0   454    12     0     0     0
   411  0.34173182E+00     0   455    12     0     0     0
   411  0.12309363E+00     0   198   412     0     0     0
   6
   412  0.14785288E-01     0   450    12     0     0     0
   412  0.92172287E-01     0   451    12     0     0     0
   412  0.20989153E+00     0   452    12     0     0     0
   412  0.28309691E+00     0   453    12     0     0     0
   412  0.73038433E-02     0   456    11     0     0     0
   412  0.39275017E+00     0   457    11     0     0     0
   4
   413  0.44586161E+00     0   450     1     0     0     0
   413  0.51200503E+00     0   451     1     0     0     0
   413  0.11538982E-01     0   452     1     0     0     0
   413  0.30594308E-01     0   453     1     0     0     0
   4
   414  0.44586235E+00     0   450     2     0     0     0
   414  0.51200473E+00     0   451     2     0     0     0
   414  0.11538955E-01     0   452     2     0     0     0
   414  0.30594001E-01     0   453     2     0     0     0
   4
   415  0.44586161E+00     0   450     3     0     0     0
   415  0.51200503E+00     0   451     3     0     0     0
   415  0.11538982E-01     0   452     3     0     0     0
   415  0.30594308E-01     0   453     3     0     0     0
   4
   416  0.44586235E+00     0   450     4     0     0     0
   416  0.51200473E+00     0   451     4     0     0     0
   416  0.11538954E-01     0   452     4     0     0     0
   416  0.30594001E-01     0   453     4     0     0     0
   7
   417  0.20991249E-01     0   450     5     0     0     0
   417  0.23815183E-01     0   451     5     0     0     0
   417  0.11838450E-01     0   452     5     0     0     0
   417  0.10203717E+00     0   453     5     0     0     0
   417  0.25897259E+00     0   456     6     0     0     0
   417  0.44516772E+00     0   457     6     0     0     0
   417  0.13717763E+00     0   199   406     0     0     0
   9
   418  0.27884692E+00     0   454     5     0     0     0
   418  0.30538600E-02     0   455     5     0     0     0
   418  0.21564032E+00     0   200   406     0     0     0
   418  0.20671893E-01     0   198   405     0     0     0
   418  0.63441500E-01     0   198   417     0     0     0
   418  0.10322352E+00     0   450     6     0     0     0
   418  0.78577936E-01     0   451     6     0     0     0
   418  0.20703518E+00     0   452     6     0     0     0
   418  0.29508939E-01     0   453     6     0     0     0
   4
   419  0.44586161E+00     0   450     7     0     0     0
   419  0.51200503E+00     0   451     7     0     0     0
   419  0.11538982E-01     0   452     7     0     0     0
   419  0.30594308E-01     0   453     7     0     0     0
   4
   420  0.44586235E+00     0   450     8     0     0     0
   420  0.51200473E+00     0   451     8     0     0     0
   420  0.11538955E-01     0   452     8     0     0     0
   420  0.30594001E-01     0   453     8     0     0     0
   4
   421  0.44586161E+00     0   450     9     0     0     0
   421  0.51200503E+00     0   451     9     0     0     0
   421  0.11538982E-01     0   452     9     0     0     0
   421  0.30594308E-01     0   453     9     0     0     0
   4
   422  0.44586235E+00     0   450    10     0     0     0
   422  0.51200473E+00     0   451    10     0     0     0
   422  0.11538954E-01     0   452    10     0     0     0
   422  0.30594001E-01     0   453    10     0     0     0
   7
   423  0.20991249E-01     0   450    11     0     0     0
   423  0.23815183E-01     0   451    11     0     0     0
   423  0.11838450E-01     0   452    11     0     0     0
   423  0.10203717E+00     0   453    11     0     0     0
   423  0.25897259E+00     0   454    12     0     0     0
   423  0.44516772E+00     0   455    12     0     0     0
   423  0.13717763E+00     0   198   412     0     0     0
   9
   424  0.27884692E+00     0   456    11     0     0     0
   424  0.30538600E-02     0   457    11     0     0     0
   424  0.21564032E+00     0   200   412     0     0     0
   424  0.20671893E-01     0   199   411     0     0     0
   424  0.63441500E-01     0   199   423     0     0     0
   424  0.10322352E+00     0   450    12     0     0     0
   424  0.78577936E-01     0   451    12     0     0     0
   424  0.20703518E+00     0   452    12     0     0     0
   424  0.29508939E-01     0   453    12     0     0     0
   6
   425  0.52022067E-03     0   450   121     0     0     0
   425  0.25421429E+00     0   451   121     0     0     0
   425  0.24318481E-02     0   452   121     0     0     0
   425  0.13900816E+00     0   453   121     0     0     0
   425  0.13868572E+00     0   456   122     0     0     0
   425  0.46513972E+00     0   457   122     0     0     0
   6
   426  0.14697607E+00     0   450   122     0     0     0
   426  0.46675531E-02     0   451   122     0     0     0
   426  0.13130887E-01     0   452   122     0     0     0
   426  0.22920191E+00     0   453   122     0     0     0
   426  0.30275732E+00     0   454   121     0     0     0
   426  0.30326629E+00     0   455   121     0     0     0
   6
   427  0.52022067E-03     0   450   123     0     0     0
   427  0.25421429E+00     0   451   123     0     0     0
   427  0.24318481E-02     0   452   123     0     0     0
   427  0.13900816E+00     0   453   123     0     0     0
   427  0.13868572E+00     0   456   124     0     0     0
   427  0.46513972E+00     0   457   124     0     0     0
   6
   428  0.14697607E+00     0   450   124     0     0     0
   428  0.46675531E-02     0   451   124     0     0     0
   428  0.13130887E-01     0   452   124     0     0     0
   428  0.22920191E+00     0   453   124     0     0     0
   428  0.30275732E+00     0   454   123     0     0     0
   428  0.30326629E+00     0   455   123     0     0     0
   1
   429  0.10000000E+01     0   450   125     0     0     0
   7
   430  0.14619444E+00     0   450   126     0     0     0
   430  0.46427306E-02     0   451   126     0     0     0
   430  0.13061057E-01     0   452   126     0     0     0
   430  0.22798300E+00     0   453   126     0     0     0
   430  0.30525967E+00     0   454   125     0     0     0
   430  0.30283388E+00     0   455   125     0     0     0
   430  0.25243766E-04     0   198   429     0     0     0
   6
   431  0.52022067E-03     0   450   127     0     0     0
   431  0.25421429E+00     0   451   127     0     0     0
   431  0.24318481E-02     0   452   127     0     0     0
   431  0.13900816E+00     0   453   127     0     0     0
   431  0.13868572E+00     0   454   128     0     0     0
   431  0.46513972E+00     0   455   128     0     0     0
   6
   432  0.14697607E+00     0   450   128     0     0     0
   432  0.46675531E-02     0   451   128     0     0     0
   432  0.13130887E-01     0   452   128     0     0     0
   432  0.22920191E+00     0   453   128     0     0     0
   432  0.30275732E+00     0   456   127     0     0     0
   432  0.30326629E+00     0   457   127     0     0     0
   6
   433  0.52022067E-03     0   450   129     0     0     0
   433  0.25421429E+00     0   451   129     0     0     0
   433  0.24318481E-02     0   452   129     0     0     0
   433  0.13900816E+00     0   453   129     0     0     0
   433  0.13868572E+00     0   454   130     0     0     0
   433  0.46513972E+00     0   455   130     0     0     0
   6
   434  0.14697607E+00     0   450   130     0     0     0
   434  0.46675531E-02     0   451   130     0     0     0
   434  0.13130887E-01     0   452   130     0     0     0
   434  0.22920191E+00     0   453   130     0     0     0
   434  0.30275732E+00     0   456   129     0     0     0
   434  0.30326629E+00     0   457   129     0     0     0
   1
   435  0.10000000E+01     0   450   131     0     0     0
   7
   436  0.14619444E+00     0   450   132     0     0     0
   436  0.46427306E-02     0   451   132     0     0     0
   436  0.13061057E-01     0   452   132     0     0     0
   436  0.22798300E+00     0   453   132     0     0     0
   436  0.30525967E+00     0   456   131     0     0     0
   436  0.30283388E+00     0   457   131     0     0     0
   436  0.25243766E-04     0   199   435     0     0     0
   1
   437  0.10000000E+01     0   450   121     0     0     0
   0
   1
   439  0.10000000E+01     0   450   123     0     0     0
   0
   8
   441  0.22438082E-02     0   450   125     0     0     0
   441  0.25349373E+00     0   451   125     0     0     0
   441  0.47385874E-02     0   452   125     0     0     0
   441  0.13889189E+00     0   453   125     0     0     0
   441  0.13792883E+00     0   456   126     0     0     0
   441  0.46267736E+00     0   457   126     0     0     0
   441  0.12822656E-04     0   200   429     0     0     0
   441  0.13068917E-04     0   203   429     0     0     0
   0
   1
   443  0.10000000E+01     0   450   127     0     0     0
   0
   1
   445  0.10000000E+01     0   450   129     0     0     0
   0
   8
   447  0.22438082E-02     0   450   131     0     0     0
   447  0.25349373E+00     0   451   131     0     0     0
   447  0.47385874E-02     0   452   131     0     0     0
   447  0.13889189E+00     0   453   131     0     0     0
   447  0.13792883E+00     0   454   132     0     0     0
   447  0.46267736E+00     0   455   132     0     0     0
   447  0.12822656E-04     0   200   435     0     0     0
   447  0.13068917E-04     0   203   435     0     0     0
   0
  32
   449  0.19960692E-02     0   454     1     8     0     0
   449  0.19960692E-02     0   456     2     7     0     0
   449  0.19960692E-02     0   454     3    10     0     0
   449  0.19960692E-02     0   456     4     9     0     0
   449  0.16417546E-01     0   454     5    12     0     0
   449  0.16417546E-01     0   456     6    11     0     0
   449  0.65471539E-02     0   455     1     8     0     0
   449  0.65471539E-02     0   457     2     7     0     0
   449  0.65471539E-02     0   455     3    10     0     0
   449  0.65471539E-02     0   457     4     9     0     0
   449  0.18492660E+00     0   455     5    12     0     0
   449  0.18492660E+00     0   457     6    11     0     0
   449  0.28881655E-03     0   450    13     0     0     0
   449  0.23747135E-02     0   450     1     7     0     0
   449  0.23747135E-02     0   450     3     9     0     0
   449  0.26035155E-02     0   450     5    11     0     0
   449  0.15046041E-01     0   450     6    12     0     0
   449  0.17945797E-03     0   451    13     0     0     0
   449  0.20069277E-02     0   451     1     7     0     0
   449  0.20069277E-02     0   451     3     9     0     0
   449  0.20893938E-02     0   451     5    11     0     0
   449  0.79456218E-01     0   451     6    12     0     0
   449  0.96577639E-03     0   452    13     0     0     0
   449  0.24743885E-03     0   452     1     7     0     0
   449  0.24743885E-03     0   452     3     9     0     0
   449  0.66298322E-03     0   452     5    11     0     0
   449  0.18782060E+00     0   452     6    12     0     0
   449  0.30943233E-03     0   453    13     0     0     0
   449  0.60108383E-02     0   453     1     7     0     0
   449  0.60108383E-02     0   453     3     9     0     0
   449  0.60886480E-02     0   453     5    11     0     0
   449  0.24634826E+00     0   453     6    12     0     0
   0
  10
   451  0.20789108E-04     0   456     2     7     0     0
   451  0.20789108E-04     0   454     1     8     0     0
   451  0.20789108E-04     0   456     4     9     0     0
   451  0.20789108E-04     0   454     3    10     0     0
   451  0.16724898E+00     0   437   127     0     0     0
   451  0.16724898E+00     0   443   121     0     0     0
   451  0.16724722E+00     0   439   129     0     0     0
   451  0.16724722E+00     0   445   123     0     0     0
   451  0.16546227E+00     0   429   131     0     0     0
   451  0.16546227E+00     0   435   125     0     0     0
  35
   452  0.69674789E-02     0   456     2     7     0     0
   452  0.23224929E-02     0   456   122   127     0     0
   452  0.23224929E-02     0   456   124   129     0     0
   452  0.69674789E-02     0   454     1     8     0     0
   452  0.23224929E-02     0   454   121   128     0     0
   452  0.23224929E-02     0   454   123   130     0     0
   452  0.69674789E-02     0   456     4     9     0     0
   452  0.23224929E-02     0   456   126   131     0     0
   452  0.69674789E-02     0   454     3    10     0     0
   452  0.23224929E-02     0   454   125   132     0     0
   452  0.10596965E-01     0   450     2     8     0     0
   452  0.13658229E-01     0   450     1     7     0     0
   452  0.13658229E-01     0   450     3     9     0     0
   452  0.10596965E-01     0   450     4    10     0     0
   452  0.13347746E-01     0   450     5    11     0     0
   452  0.30993468E-02     0   450   121   127     0     0
   452  0.30993468E-02     0   450   123   129     0     0
   452  0.30869092E-02     0   450   125   131     0     0
   452  0.61697033E-02     0   450   122   128     0     0
   452  0.61697033E-02     0   450   124   130     0     0
   452  0.61697033E-02     0   450   126   132     0     0
   452  0.25061201E-04     0   451     2     8     0     0
   452  0.32283486E-04     0   451     1     7     0     0
   452  0.32283486E-04     0   451     3     9     0     0
   452  0.25061201E-04     0   451     4    10     0     0
   452  0.22021326E-04     0   451     5    11     0     0
   452  0.14581153E-04     0   451   122   128     0     0
   452  0.14581153E-04     0   451   124   130     0     0
   452  0.14581153E-04     0   451   126   132     0     0
   452  0.12060228E+00     0   437   127     0     0     0
   452  0.12060228E+00     0   443   121     0     0     0
   452  0.12060191E+00     0   439   129     0     0     0
   452  0.12060191E+00     0   445   123     0     0     0
   452  0.19297671E+00     0   429   131     0     0     0
   452  0.19297671E+00     0   435   125     0     0     0
  22
   453  0.44499823E+00     0   454   199     0     0     0
   453  0.44499823E+00     0   456   198     0     0     0
   453  0.19758912E-02     0   450   200     0     0     0
   453  0.38106486E-02     0   451   200     0     0     0
   453  0.40074930E-03     0   452     2     8     0     0
   453  0.51721284E-03     0   452     1     7     0     0
   453  0.51721284E-03     0   452     3     9     0     0
   453  0.40074930E-03     0   452     4    10     0     0
   453  0.51676983E-03     0   452     5    11     0     0
   453  0.11729622E-03     0   452   121   127     0     0
   453  0.11729622E-03     0   452   123   129     0     0
   453  0.11720049E-03     0   452   125   131     0     0
   453  0.23320469E-03     0   452   122   128     0     0
   453  0.23320469E-03     0   452   124   130     0     0
   453  0.23320469E-03     0   452   126   132     0     0
   453  0.90860740E-04     0   450   203     0     0     0
   453  0.16540775E-01     0   437   127     0     0     0
   453  0.16540775E-01     0   443   121     0     0     0
   453  0.16540766E-01     0   439   129     0     0     0
   453  0.16540766E-01     0   445   123     0     0     0
   453  0.17279500E-01     0   429   131     0     0     0
   453  0.17279500E-01     0   435   125     0     0     0
   6
   454  0.27229121E+00     0   450     2     7     0     0
   454  0.27229121E+00     0   450     4     9     0     0
   454  0.90751678E-01     0   450   127   122     0     0
   454  0.90751678E-01     0   450   129   124     0     0
   454  0.90751737E-01     0   450   131   126     0     0
   454  0.18316258E+00     0   435   126     0     0     0
   6
   455  0.10470505E+00     0   450   198     0     0     0
   455  0.38634279E+00     0   451   198     0     0     0
   455  0.35651647E-01     0   452   198     0     0     0
   455  0.23850773E-02     0   435   126     0     0     0
   455  0.42820853E+00     0   454   200     0     0     0
   455  0.42706978E-01     0   454   203     0     0     0
   6
   456  0.27229121E+00     0   450     8     1     0     0
   456  0.27229121E+00     0   450    10     3     0     0
   456  0.90751678E-01     0   450   121   128     0     0
   456  0.90751678E-01     0   450   123   130     0     0
   456  0.90751737E-01     0   450   125   132     0     0
   456  0.18316258E+00     0   429   132     0     0     0
   6
   457  0.10470505E+00     0   450   199     0     0     0
   457  0.38634279E+00     0   451   199     0     0     0
   457  0.35651647E-01     0   452   199     0     0     0
   457  0.23850773E-02     0   429   132     0     0     0
   457  0.42820853E+00     0   456   200     0     0     0
   457  0.42706978E-01     0   456   203     0     0     0
  28
   203  0.20215761E-03     0   123   129     0     0     0
   203  0.57823885E-01     0   125   131     0     0     0
   203  0.24268727E-02     0     3     9     0     0     0
   203  0.79171580E+00     0     5    11     0     0     0
   203  0.30111670E-01     0     4    10     0     0     0
   203  0.18266597E-02     0    59    59     0     0     0
   203  0.34967910E-01     0    13    13     0     0     0
   203  0.41221664E-02     0   198   121   128     0     0
   203  0.41221664E-02     0   198   123   130     0     0
   203  0.41221664E-02     0   198   125   132     0     0
   203  0.12366497E-01     0   198     8     1     0     0
   203  0.12366497E-01     0   198    10     3     0     0
   203  0.41221664E-02     0   199   127   122     0     0
   203  0.41221664E-02     0   199   129   124     0     0
   203  0.41221664E-02     0   199   131   126     0     0
   203  0.12366497E-01     0   199     2     7     0     0
   203  0.12366497E-01     0   199     4     9     0     0
   203  0.45996151E-03     0   200   122   128     0     0
   203  0.45996151E-03     0   200   124   130     0     0
   203  0.45996151E-03     0   200   126   132     0     0
   203  0.23149399E-03     0   200   121   127     0     0
   203  0.23149399E-03     0   200   123   129     0     0
   203  0.23149399E-03     0   200   125   131     0     0
   203  0.79307880E-03     0   200     2     8     0     0
   203  0.79307880E-03     0   200     4    10     0     0
   203  0.10216809E-02     0   200     1     7     0     0
   203  0.10216809E-02     0   200     3     9     0     0
   203  0.10216809E-02     0   200     5    11     0     0
  26
   204  0.23488168E-04     0   123   129     0     0     0
   204  0.67268722E-02     0   125   131     0     0     0
   204  0.27704737E-03     0     3     9     0     0     0
   204  0.74336998E-01     0     5    11     0     0     0
   204  0.74137941E-01     0     6    12     0     0     0
   204  0.11196507E-03     0    13    13     0     0     0
   204  0.14777894E-02     0   198   199     0     0     0
   204  0.72647096E-03     0   200   200     0     0     0
   204  0.80642737E-01     0   450   450     0     0     0
   204  0.20106100E-01     0   450   451     0     0     0
   204  0.63576944E-01     0   450   452     0     0     0
   204  0.12606931E-01     0   450   453     0     0     0
   204  0.63390454E-03     0   451   451     0     0     0
   204  0.45135015E-03     0   451   452     0     0     0
   204  0.61741653E-02     0   451   453     0     0     0
   204  0.10522575E-01     0   452   452     0     0     0
   204  0.12765543E+00     0   452   453     0     0     0
   204  0.15236178E-02     0   453   453     0     0     0
   204  0.18039094E+00     0   454   456     0     0     0
   204  0.17879936E-02     0   455   457     0     0     0
   204  0.16475940E+00     0   454   457     0     0     0
   204  0.16475940E+00     0   456   455     0     0     0
   204  0.60335584E-02     0   203   203     0     0     0
   204  0.18901816E-03     0   437   443     0     0     0
   204  0.18898041E-03     0   439   445     0     0     0
   204  0.17830185E-03     0   429   435     0     0     0
  21
   205  0.23945906E-04     0   123   129     0     0     0
   205  0.68583023E-02     0   125   131     0     0     0
   205  0.28246999E-03     0     3     9     0     0     0
   205  0.75890787E-01     0     5    11     0     0     0
   205  0.11303381E+00     0     6    12     0     0     0
   205  0.97725897E-04     0    13    13     0     0     0
   205  0.13788037E+00     0   450   450     0     0     0
   205  0.43130133E-01     0   450   451     0     0     0
   205  0.15975524E-01     0   450   452     0     0     0
   205  0.16488299E-01     0   450   453     0     0     0
   205  0.16099876E-02     0   451   451     0     0     0
   205  0.58479538E-04     0   451   452     0     0     0
   205  0.21468228E-01     0   451   453     0     0     0
   205  0.76383101E-02     0   452   452     0     0     0
   205  0.30068535E-01     0   452   453     0     0     0
   205  0.34154430E-01     0   453   453     0     0     0
   205  0.31786281E+00     0   454   456     0     0     0
   205  0.50193343E-01     0   455   457     0     0     0
   205  0.62996231E-01     0   454   457     0     0     0
   205  0.62996231E-01     0   456   455     0     0     0
   205  0.12920022E-02     0   203   200     0     0     0
  13
   206  0.24753812E-04     0   124   129     0     0     0
   206  0.70896996E-02     0   126   131     0     0     0
   206  0.26923252E-03     0     4     9     0     0     0
   206  0.15710177E+00     0     6    11     0     0     0
   206  0.63760951E-01     0   454   450     0     0     0
   206  0.10637838E+00     0   454   451     0     0     0
   206  0.89689963E-01     0   454   452     0     0     0
   206  0.16569579E+00     0   454   453     0     0     0
   206  0.11215586E+00     0   455   450     0     0     0
   206  0.17002389E+00     0   455   451     0     0     0
   206  0.12543322E+00     0   455   452     0     0     0
   206  0.95516781E-03     0   455   453     0     0     0
   206  0.14214698E-02     0   203   198     0     0     0
  13
   207  0.24753812E-04     0   130   123     0     0     0
   207  0.70896996E-02     0   132   125     0     0     0
   207  0.26923252E-03     0    10     3     0     0     0
   207  0.15710177E+00     0    12     5     0     0     0
   207  0.63760951E-01     0   456   450     0     0     0
   207  0.10637838E+00     0   456   451     0     0     0
   207  0.89689963E-01     0   456   452     0     0     0
   207  0.16569579E+00     0   456   453     0     0     0
   207  0.11215586E+00     0   457   450     0     0     0
   207  0.17002389E+00     0   457   451     0     0     0
   207  0.12543322E+00     0   457   452     0     0     0
   207  0.95516781E-03     0   457   453     0     0     0
   207  0.14214698E-02     0   203   199     0     0     0
   0
   5
     6  0.33333334E+00   100     2     7     5     0     0
     6  0.33333334E+00   100     4     9     5     0     0
     6  0.11111111E+00   100   122   127     5     0     0
     6  0.11111111E+00   100   124   129     5     0     0
     6  0.11111111E+00   100   126   131     5     0     0
   5
    12  0.33333334E+00   100     8     1    11     0     0
    12  0.33333334E+00   100    10     3    11     0     0
    12  0.11111111E+00   100   128   121    11     0     0
    12  0.11111111E+00   100   130   123    11     0     0
    12  0.11111111E+00   100   132   125    11     0     0
      6.00000000     -0.18022937
      0.66656774     -0.32526445      0.57021326     -0.35319582
      0.71610546      0.51714957     -0.34665412      0.31556371
      0.10770379     -0.14843798     -0.66117775     -0.72746825
     -0.17686227      0.77764130      0.34282935     -0.49644980
     -0.70272654      0.71145999     -0.71145999     -0.70272654
     -0.47501218      0.87997919     -0.87997919     -0.47501218
      0.78484070     -1.05865228     -1.57042897
   4899.00000000      0.00000000      0.00000000
    140.00000000
    T
