  65
  401   2000.8307    0.26241E-25
  402   1999.3210    0.26145E-25
  403   2000.8307    0.26241E-25
  404   1999.3215    0.26145E-25
  405   1999.0466    0.29129E-25
  406   1830.2511    0.14645E-25
  407   2000.8307    0.26241E-25
  408   1999.3210    0.26145E-25
  409   2000.8307    0.26241E-25
  410   1999.3215    0.26145E-25
  411   1999.0466    0.29129E-25
  412   1830.2511    0.14645E-25
  413   2000.1520    0.60151E-24
  414   1999.6959    0.15041E-24
  415   2000.1520    0.60151E-24
  416   1999.6964    0.15041E-24
  417   2001.9387    0.18373E-25
  418   2164.3120    0.83181E-26
  419   2000.1520    0.60151E-24
  420   1999.6959    0.15041E-24
  421   2000.1520    0.60151E-24
  422   1999.6964    0.15041E-24
  423   2001.9387    0.18373E-25
  424   2164.3120    0.83181E-26
  425   2000.5267    0.24120E-25
  426   1999.0170    0.24078E-25
  427   2000.5267    0.24120E-25
  428   1999.0170    0.24078E-25
  429    192.6798    0.33272E-21
  430   1999.0170    0.23953E-25
  431   2000.5267    0.24120E-25
  432   1999.0170    0.24078E-25
  433   2000.5267    0.24120E-25
  434   1999.0170    0.24078E-25
  435    192.6798    0.33272E-21
  436   1999.0170    0.23953E-25
  437    192.6929    0.48960E-21
  438      0.0000    0.10000E+31
  439    192.6929    0.48960E-21
  440      0.0000    0.10000E+31
  441   2000.5482    0.23994E-25
  442      0.0000    0.10000E+31
  443    192.6929    0.48960E-21
  444      0.0000    0.10000E+31
  445    192.6929    0.48960E-21
  446      0.0000    0.10000E+31
  447   2000.5482    0.23994E-25
  448      0.0000    0.10000E+31
  449   2000.0000    0.28547E-24
  450    142.9649    0.10000E+31
  451    242.4138    0.13224E-23
  452   -355.4098    0.30834E-24
  453    380.0313    0.28244E-24
  454    143.8898    0.31207E-12
  455    374.6084    0.30596E-24
  456    143.8898    0.31207E-12
  457    374.6084    0.30596E-24
  203    119.0513    0.13102E-21
  204    504.3599    0.44041E-24
  205    500.0000    0.31896E-24
  206    509.4117    0.49629E-24
  207    509.4117    0.49629E-24
  458      0.0000    0.10000E+31
    6    172.5000    0.57395E-24
   12    172.5000    0.57395E-24
   6
   401  0.30434856E+00     0   450     1     0     0     0
   401  0.74447707E-04     0   451     1     0     0     0
   401  0.31134496E-02     0   452     1     0     0     0
   401  0.33600528E-01     0   453     1     0     0     0
   401  0.56748664E+00     0   456     2     0     0     0
   401  0.91376446E-01     0   457     2     0     0     0
   6
   402  0.28418821E+00     0   450     2     0     0     0
   402  0.36853220E-01     0   451     2     0     0     0
   402  0.21978419E-02     0   452     2     0     0     0
   402  0.16806193E-01     0   453     2     0     0     0
   402  0.63266104E+00     0   454     1     0     0     0
   402  0.27293460E-01     0   455     1     0     0     0
   6
   403  0.30434877E+00     0   450     3     0     0     0
   403  0.74447758E-04     0   451     3     0     0     0
   403  0.31134516E-02     0   452     3     0     0     0
   403  0.33600550E-01     0   453     3     0     0     0
   403  0.56748646E+00     0   456     4     0     0     0
   403  0.91376409E-01     0   457     4     0     0     0
   6
   404  0.28418803E+00     0   450     4     0     0     0
   404  0.36853198E-01     0   451     4     0     0     0
   404  0.21978403E-02     0   452     4     0     0     0
   404  0.16806183E-01     0   453     4     0     0     0
   404  0.63266122E+00     0   454     3     0     0     0
   404  0.27293472E-01     0   455     3     0     0     0
   7
   405  0.15094389E+00     0   450     5     0     0     0
   405  0.32845963E-01     0   451     5     0     0     0
   405  0.27962120E-02     0   452     5     0     0     0
   405  0.36115386E-02     0   453     5     0     0     0
   405  0.29048097E+00     0   456     6     0     0     0
   405  0.39283451E+00     0   457     6     0     0     0
   405  0.12648696E+00     0   199   406     0     0     0
   6
   406  0.39379120E-01     0   450     6     0     0     0
   406  0.43362655E-01     0   451     6     0     0     0
   406  0.20780277E+00     0   452     6     0     0     0
   406  0.30514488E+00     0   453     6     0     0     0
   406  0.88570878E-01     0   454     5     0     0     0
   406  0.31573969E+00     0   455     5     0     0     0
   6
   407  0.30434856E+00     0   450     7     0     0     0
   407  0.74447707E-04     0   451     7     0     0     0
   407  0.31134496E-02     0   452     7     0     0     0
   407  0.33600528E-01     0   453     7     0     0     0
   407  0.56748664E+00     0   454     8     0     0     0
   407  0.91376446E-01     0   455     8     0     0     0
   6
   408  0.28418821E+00     0   450     8     0     0     0
   408  0.36853220E-01     0   451     8     0     0     0
   408  0.21978419E-02     0   452     8     0     0     0
   408  0.16806193E-01     0   453     8     0     0     0
   408  0.63266104E+00     0   456     7     0     0     0
   408  0.27293460E-01     0   457     7     0     0     0
   6
   409  0.30434877E+00     0   450     9     0     0     0
   409  0.74447758E-04     0   451     9     0     0     0
   409  0.31134516E-02     0   452     9     0     0     0
   409  0.33600550E-01     0   453     9     0     0     0
   409  0.56748646E+00     0   454    10     0     0     0
   409  0.91376409E-01     0   455    10     0     0     0
   6
   410  0.28418803E+00     0   450    10     0     0     0
   410  0.36853198E-01     0   451    10     0     0     0
   410  0.21978403E-02     0   452    10     0     0     0
   410  0.16806183E-01     0   453    10     0     0     0
   410  0.63266122E+00     0   456     9     0     0     0
   410  0.27293472E-01     0   457     9     0     0     0
   7
   411  0.15094389E+00     0   450    11     0     0     0
   411  0.32845963E-01     0   451    11     0     0     0
   411  0.27962120E-02     0   452    11     0     0     0
   411  0.36115386E-02     0   453    11     0     0     0
   411  0.29048097E+00     0   454    12     0     0     0
   411  0.39283451E+00     0   455    12     0     0     0
   411  0.12648696E+00     0   198   412     0     0     0
   6
   412  0.39379120E-01     0   450    12     0     0     0
   412  0.43362655E-01     0   451    12     0     0     0
   412  0.20780277E+00     0   452    12     0     0     0
   412  0.30514488E+00     0   453    12     0     0     0
   412  0.88570878E-01     0   456    11     0     0     0
   412  0.31573969E+00     0   457    11     0     0     0
   4
   413  0.69402610E-02     0   450     1     0     0     0
   413  0.92601043E+00     0   451     1     0     0     0
   413  0.17789741E-02     0   452     1     0     0     0
   413  0.65270372E-01     0   453     1     0     0     0
   4
   414  0.69403322E-02     0   450     2     0     0     0
   414  0.92601150E+00     0   451     2     0     0     0
   414  0.17789479E-02     0   452     2     0     0     0
   414  0.65269105E-01     0   453     2     0     0     0
   4
   415  0.69402610E-02     0   450     3     0     0     0
   415  0.92601043E+00     0   451     3     0     0     0
   415  0.17789741E-02     0   452     3     0     0     0
   415  0.65270372E-01     0   453     3     0     0     0
   4
   416  0.69403318E-02     0   450     4     0     0     0
   416  0.92601156E+00     0   451     4     0     0     0
   416  0.17789475E-02     0   452     4     0     0     0
   416  0.65269105E-01     0   453     4     0     0     0
   7
   417  0.11963649E+00     0   450     5     0     0     0
   417  0.82062744E-02     0   451     5     0     0     0
   417  0.92097754E-02     0   452     5     0     0     0
   417  0.30465281E-01     0   453     5     0     0     0
   417  0.23710983E+00     0   456     6     0     0     0
   417  0.45791596E+00     0   457     6     0     0     0
   417  0.13745640E+00     0   199   406     0     0     0
   9
   418  0.17429936E+00     0   454     5     0     0     0
   418  0.10864033E+00     0   455     5     0     0     0
   418  0.21720931E+00     0   200   406     0     0     0
   418  0.33607826E-01     0   198   405     0     0     0
   418  0.50781440E-01     0   198   417     0     0     0
   418  0.86026803E-01     0   450     6     0     0     0
   418  0.50010957E-01     0   451     6     0     0     0
   418  0.18472274E+00     0   452     6     0     0     0
   418  0.94701305E-01     0   453     6     0     0     0
   4
   419  0.69402610E-02     0   450     7     0     0     0
   419  0.92601043E+00     0   451     7     0     0     0
   419  0.17789741E-02     0   452     7     0     0     0
   419  0.65270372E-01     0   453     7     0     0     0
   4
   420  0.69403322E-02     0   450     8     0     0     0
   420  0.92601150E+00     0   451     8     0     0     0
   420  0.17789479E-02     0   452     8     0     0     0
   420  0.65269105E-01     0   453     8     0     0     0
   4
   421  0.69402610E-02     0   450     9     0     0     0
   421  0.92601043E+00     0   451     9     0     0     0
   421  0.17789741E-02     0   452     9     0     0     0
   421  0.65270372E-01     0   453     9     0     0     0
   4
   422  0.69403318E-02     0   450    10     0     0     0
   422  0.92601156E+00     0   451    10     0     0     0
   422  0.17789475E-02     0   452    10     0     0     0
   422  0.65269105E-01     0   453    10     0     0     0
   7
   423  0.11963649E+00     0   450    11     0     0     0
   423  0.82062744E-02     0   451    11     0     0     0
   423  0.92097754E-02     0   452    11     0     0     0
   423  0.30465281E-01     0   453    11     0     0     0
   423  0.23710983E+00     0   454    12     0     0     0
   423  0.45791596E+00     0   455    12     0     0     0
   423  0.13745640E+00     0   198   412     0     0     0
   9
   424  0.17429936E+00     0   456    11     0     0     0
   424  0.10864033E+00     0   457    11     0     0     0
   424  0.21720931E+00     0   200   412     0     0     0
   424  0.33607826E-01     0   199   411     0     0     0
   424  0.50781440E-01     0   199   423     0     0     0
   424  0.86026803E-01     0   450    12     0     0     0
   424  0.50010957E-01     0   451    12     0     0     0
   424  0.18472274E+00     0   452    12     0     0     0
   424  0.94701305E-01     0   453    12     0     0     0
   6
   425  0.24552025E+00     0   450   121     0     0     0
   425  0.14225002E+00     0   451   121     0     0     0
   425  0.13393364E-02     0   452   121     0     0     0
   425  0.53866748E-02     0   453   121     0     0     0
   425  0.52152896E+00     0   456   122     0     0     0
   425  0.83974764E-01     0   457   122     0     0     0
   6
   426  0.29687548E+00     0   450   122     0     0     0
   426  0.40292878E-01     0   451   122     0     0     0
   426  0.38262759E-02     0   452   122     0     0     0
   426  0.51343463E-01     0   453   122     0     0     0
   426  0.58253151E+00     0   454   121     0     0     0
   426  0.25130361E-01     0   455   121     0     0     0
   6
   427  0.24552025E+00     0   450   123     0     0     0
   427  0.14225002E+00     0   451   123     0     0     0
   427  0.13393364E-02     0   452   123     0     0     0
   427  0.53866748E-02     0   453   123     0     0     0
   427  0.52152896E+00     0   456   124     0     0     0
   427  0.83974764E-01     0   457   124     0     0     0
   6
   428  0.29687548E+00     0   450   124     0     0     0
   428  0.40292878E-01     0   451   124     0     0     0
   428  0.38262759E-02     0   452   124     0     0     0
   428  0.51343463E-01     0   453   124     0     0     0
   428  0.58253151E+00     0   454   123     0     0     0
   428  0.25130361E-01     0   455   123     0     0     0
   2
   429  0.78560638E+00     0   450   125     0     0     0
   429  0.21439366E+00     0   456   126     0     0     0
   7
   430  0.29533875E+00     0   450   126     0     0     0
   430  0.40084306E-01     0   451   126     0     0     0
   430  0.38064697E-02     0   452   126     0     0     0
   430  0.51077694E-01     0   453   126     0     0     0
   430  0.58028239E+00     0   454   125     0     0     0
   430  0.29253898E-01     0   455   125     0     0     0
   430  0.15658571E-03     0   198   429     0     0     0
   6
   431  0.24552025E+00     0   450   127     0     0     0
   431  0.14225002E+00     0   451   127     0     0     0
   431  0.13393364E-02     0   452   127     0     0     0
   431  0.53866748E-02     0   453   127     0     0     0
   431  0.52152896E+00     0   454   128     0     0     0
   431  0.83974764E-01     0   455   128     0     0     0
   6
   432  0.29687548E+00     0   450   128     0     0     0
   432  0.40292878E-01     0   451   128     0     0     0
   432  0.38262759E-02     0   452   128     0     0     0
   432  0.51343463E-01     0   453   128     0     0     0
   432  0.58253151E+00     0   456   127     0     0     0
   432  0.25130361E-01     0   457   127     0     0     0
   6
   433  0.24552025E+00     0   450   129     0     0     0
   433  0.14225002E+00     0   451   129     0     0     0
   433  0.13393364E-02     0   452   129     0     0     0
   433  0.53866748E-02     0   453   129     0     0     0
   433  0.52152896E+00     0   454   130     0     0     0
   433  0.83974764E-01     0   455   130     0     0     0
   6
   434  0.29687548E+00     0   450   130     0     0     0
   434  0.40292878E-01     0   451   130     0     0     0
   434  0.38262759E-02     0   452   130     0     0     0
   434  0.51343463E-01     0   453   130     0     0     0
   434  0.58253151E+00     0   456   129     0     0     0
   434  0.25130361E-01     0   457   129     0     0     0
   2
   435  0.78560638E+00     0   450   131     0     0     0
   435  0.21439366E+00     0   454   132     0     0     0
   7
   436  0.29533875E+00     0   450   132     0     0     0
   436  0.40084306E-01     0   451   132     0     0     0
   436  0.38064697E-02     0   452   132     0     0     0
   436  0.51077694E-01     0   453   132     0     0     0
   436  0.58028239E+00     0   456   131     0     0     0
   436  0.29253898E-01     0   457   131     0     0     0
   436  0.15658571E-03     0   199   435     0     0     0
   1
   437  0.10000000E+01     0   450   121     0     0     0
   0
   1
   439  0.10000000E+01     0   450   123     0     0     0
   0
   8
   441  0.24465813E+00     0   450   125     0     0     0
   441  0.14167470E+00     0   451   125     0     0     0
   441  0.37690930E-02     0   452   125     0     0     0
   441  0.73781703E-02     0   453   125     0     0     0
   441  0.51878536E+00     0   456   126     0     0     0
   441  0.83573982E-01     0   457   126     0     0     0
   441  0.79537291E-04     0   200   429     0     0     0
   441  0.81057464E-04     0   203   429     0     0     0
   0
   1
   443  0.10000000E+01     0   450   127     0     0     0
   0
   1
   445  0.10000000E+01     0   450   129     0     0     0
   0
   8
   447  0.24465813E+00     0   450   131     0     0     0
   447  0.14167470E+00     0   451   131     0     0     0
   447  0.37690930E-02     0   452   131     0     0     0
   447  0.73781703E-02     0   453   131     0     0     0
   447  0.51878536E+00     0   454   132     0     0     0
   447  0.83573982E-01     0   455   132     0     0     0
   447  0.79537291E-04     0   200   435     0     0     0
   447  0.81057464E-04     0   203   435     0     0     0
   0
  32
   449  0.10253849E-01     0   454     1     8     0     0
   449  0.10253849E-01     0   456     2     7     0     0
   449  0.10253849E-01     0   454     3    10     0     0
   449  0.10253849E-01     0   456     4     9     0     0
   449  0.47759347E-01     0   454     5    12     0     0
   449  0.47759347E-01     0   456     6    11     0     0
   449  0.15599623E-02     0   455     1     8     0     0
   449  0.15599623E-02     0   457     2     7     0     0
   449  0.15599623E-02     0   455     3    10     0     0
   449  0.15599623E-02     0   457     4     9     0     0
   449  0.15469788E+00     0   455     5    12     0     0
   449  0.15469788E+00     0   457     6    11     0     0
   449  0.12885925E-03     0   450    13     0     0     0
   449  0.11551765E-01     0   450     1     7     0     0
   449  0.11551765E-01     0   450     3     9     0     0
   449  0.11491865E-01     0   450     5    11     0     0
   449  0.32466728E-01     0   450     6    12     0     0
   449  0.61026618E-04     0   451    13     0     0     0
   449  0.15710294E-02     0   451     1     7     0     0
   449  0.15710294E-02     0   451     3     9     0     0
   449  0.15791473E-02     0   451     5    11     0     0
   449  0.34840196E-01     0   451     6    12     0     0
   449  0.11526854E-02     0   452    13     0     0     0
   449  0.97874152E-04     0   452     1     7     0     0
   449  0.97874152E-04     0   452     3     9     0     0
   449  0.65397489E-03     0   452     5    11     0     0
   449  0.17625476E+00     0   452     6    12     0     0
   449  0.84405480E-03     0   453    13     0     0     0
   449  0.13847756E-02     0   453     1     7     0     0
   449  0.13847756E-02     0   453     3     9     0     0
   449  0.18444427E-02     0   453     5    11     0     0
   449  0.25730172E+00     0   453     6    12     0     0
   0
   9
   451  0.33497307E-01     0   454   199     0     0     0
   451  0.33497307E-01     0   456   198     0     0     0
   451  0.23061857E-02     0   450   200     0     0     0
   451  0.15500273E+00     0   437   127     0     0     0
   451  0.15500273E+00     0   443   121     0     0     0
   451  0.15500230E+00     0   439   129     0     0     0
   451  0.15500230E+00     0   445   123     0     0     0
   451  0.15534461E+00     0   429   131     0     0     0
   451  0.15534461E+00     0   435   125     0     0     0
  11
   452  0.33059993E+00     0   454   199     0     0     0
   452  0.33059993E+00     0   456   198     0     0     0
   452  0.30214572E+00     0   450   200     0     0     0
   452  0.11134945E-01     0   451   200     0     0     0
   452  0.20206574E-01     0   450   203     0     0     0
   452  0.38758898E-03     0   437   127     0     0     0
   452  0.38758898E-03     0   443   121     0     0     0
   452  0.38758881E-03     0   439   129     0     0     0
   452  0.38758881E-03     0   445   123     0     0     0
   452  0.18814047E-02     0   429   131     0     0     0
   452  0.18814047E-02     0   435   125     0     0     0
  12
   453  0.32605368E+00     0   454   199     0     0     0
   453  0.32605368E+00     0   456   198     0     0     0
   453  0.34105033E-01     0   450   200     0     0     0
   453  0.94468117E-03     0   451   200     0     0     0
   453  0.20521800E+00     0   450   203     0     0     0
   453  0.11825774E-01     0   451   203     0     0     0
   453  0.15565954E-01     0   437   127     0     0     0
   453  0.15565954E-01     0   443   121     0     0     0
   453  0.15565949E-01     0   439   129     0     0     0
   453  0.15565949E-01     0   445   123     0     0     0
   453  0.16767727E-01     0   429   131     0     0     0
   453  0.16767727E-01     0   435   125     0     0     0
   6
   454  0.48374647E+00     0   450    38     0     0     0
   454  0.19081330E+00     0   450    38    21     0     0
   454  0.12931753E-02     0   450    38    21    21     0
   454  0.12931753E-02     0   450    38    30    38     0
   454  0.16142699E+00     0   450   127   122     0     0
   454  0.16142699E+00     0   450   129   124     0     0
   5
   455  0.33068353E+00     0   450   198     0     0     0
   455  0.80469333E-01     0   451   198     0     0     0
   455  0.29285648E-02     0   435   126     0     0     0
   455  0.34641933E+00     0   454   200     0     0     0
   455  0.23949939E+00     0   454   203     0     0     0
   6
   456  0.48374647E+00     0   450    30     0     0     0
   456  0.19081330E+00     0   450    30    21     0     0
   456  0.12931753E-02     0   450    30    21    21     0
   456  0.12931753E-02     0   450    30    38    30     0
   456  0.16142699E+00     0   450   121   128     0     0
   456  0.16142699E+00     0   450   123   130     0     0
   5
   457  0.33068353E+00     0   450   199     0     0     0
   457  0.80469333E-01     0   451   199     0     0     0
   457  0.29285648E-02     0   429   132     0     0     0
   457  0.34641933E+00     0   456   200     0     0     0
   457  0.23949939E+00     0   456   203     0     0     0
  28
   203  0.20210215E-03     0   123   129     0     0     0
   203  0.57808060E-01     0   125   131     0     0     0
   203  0.24261975E-02     0     3     9     0     0     0
   203  0.79146516E+00     0     5    11     0     0     0
   203  0.30111197E-01     0     4    10     0     0     0
   203  0.17554588E-02     0    59    59     0     0     0
   203  0.34989573E-01     0    13    13     0     0     0
   203  0.41378858E-02     0   198   121   128     0     0
   203  0.41378858E-02     0   198   123   130     0     0
   203  0.41378858E-02     0   198   125   132     0     0
   203  0.12413656E-01     0   198     8     1     0     0
   203  0.12413656E-01     0   198    10     3     0     0
   203  0.41378858E-02     0   199   127   122     0     0
   203  0.41378858E-02     0   199   129   124     0     0
   203  0.41378858E-02     0   199   131   126     0     0
   203  0.12413656E-01     0   199     2     7     0     0
   203  0.12413656E-01     0   199     4     9     0     0
   203  0.46234985E-03     0   200   122   128     0     0
   203  0.46234985E-03     0   200   124   130     0     0
   203  0.46234985E-03     0   200   126   132     0     0
   203  0.23269604E-03     0   200   121   127     0     0
   203  0.23269604E-03     0   200   123   129     0     0
   203  0.23269604E-03     0   200   125   131     0     0
   203  0.79719687E-03     0   200     2     8     0     0
   203  0.79719687E-03     0   200     4    10     0     0
   203  0.10269859E-02     0   200     1     7     0     0
   203  0.10269859E-02     0   200     3     9     0     0
   203  0.10269859E-02     0   200     5    11     0     0
  18
   204  0.86713117E-04     0   123   129     0     0     0
   204  0.24834123E-01     0   125   131     0     0     0
   204  0.10227980E-02     0     3     9     0     0     0
   204  0.27443710E+00     0     5    11     0     0     0
   204  0.11444237E-04     0     4    10     0     0     0
   204  0.27359626E+00     0     6    12     0     0     0
   204  0.41324151E-03     0    13    13     0     0     0
   204  0.54357983E-02     0   198   199     0     0     0
   204  0.26721926E-02     0   200   200     0     0     0
   204  0.10023761E+00     0   450   450     0     0     0
   204  0.21971408E-01     0   450   451     0     0     0
   204  0.97090907E-01     0   450   452     0     0     0
   204  0.18261657E-03     0   451   451     0     0     0
   204  0.17456435E+00     0   454   456     0     0     0
   204  0.22009747E-01     0   203   203     0     0     0
   204  0.48731963E-03     0   437   443     0     0     0
   204  0.48722231E-03     0   439   445     0     0     0
   204  0.45901895E-03     0   429   435     0     0     0
  12
   205  0.62585736E-04     0   123   129     0     0     0
   205  0.17925063E-01     0   125   131     0     0     0
   205  0.73827192E-03     0     3     9     0     0     0
   205  0.19835043E+00     0     5    11     0     0     0
   205  0.29542851E+00     0     6    12     0     0     0
   205  0.25541932E-03     0    13    13     0     0     0
   205  0.15499872E+00     0   450   450     0     0     0
   205  0.58497898E-01     0   450   451     0     0     0
   205  0.13393791E-03     0   450   452     0     0     0
   205  0.26522174E-02     0   451   451     0     0     0
   205  0.26759243E+00     0   454   456     0     0     0
   205  0.33644608E-02     0   203   200     0     0     0
   8
   206  0.99213881E-04     0   124   129     0     0     0
   206  0.28415686E-01     0   126   131     0     0     0
   206  0.10790904E-02     0     4     9     0     0     0
   206  0.62966686E+00     0     6    11     0     0     0
   206  0.12033740E-02     0   454   450     0     0     0
   206  0.18926370E+00     0   454   451     0     0     0
   206  0.14459567E+00     0   454   452     0     0     0
   206  0.56764376E-02     0   203   198     0     0     0
   8
   207  0.99213881E-04     0   130   123     0     0     0
   207  0.28415686E-01     0   132   125     0     0     0
   207  0.10790904E-02     0    10     3     0     0     0
   207  0.62966686E+00     0    12     5     0     0     0
   207  0.12033740E-02     0   456   450     0     0     0
   207  0.18926370E+00     0   456   451     0     0     0
   207  0.14459567E+00     0   456   452     0     0     0
   207  0.56764376E-02     0   203   199     0     0     0
   0
   5
     6  0.33333334E+00   100     2     7     5     0     0
     6  0.33333334E+00   100     4     9     5     0     0
     6  0.11111111E+00   100   122   127     5     0     0
     6  0.11111111E+00   100   124   129     5     0     0
     6  0.11111111E+00   100   126   131     5     0     0
   5
    12  0.33333334E+00   100     8     1    11     0     0
    12  0.33333334E+00   100    10     3    11     0     0
    12  0.11111111E+00   100   128   121    11     0     0
    12  0.11111111E+00   100   130   123    11     0     0
    12  0.11111111E+00   100   132   125    11     0     0
      6.00000000     -0.18020257
      0.08238826     -0.94185370      0.28682616     -0.15444979
      0.96092051      0.16093518      0.17843160     -0.13745514
      0.04285203     -0.09158085     -0.69588929     -0.71099520
      0.26078293     -0.28040105     -0.63374293      0.67211401
     -0.97783047      0.20939809     -0.20939809     -0.97783047
     -0.92404759      0.38227740     -0.38227740     -0.92404759
      0.78483683     -0.90437746     -1.56987143
   4899.00000000      0.00000000      0.00000000
    350.00000000
    T
