  65
  401    602.5777    0.28552E-23
  402    597.8857    0.35433E-23
  403    602.5777    0.28558E-23
  404    597.8872    0.35436E-23
  405   2000.1373    0.73536E-26
  406   2004.0999    0.53125E-26
  407    602.5777    0.28552E-23
  408    597.8857    0.35433E-23
  409    602.5777    0.28558E-23
  410    597.8872    0.35436E-23
  411   2000.1373    0.73536E-26
  412   2004.0999    0.53125E-26
  413   2000.1418    0.73698E-26
  414   1999.7164    0.71287E-26
  415   2000.1418    0.73698E-26
  416   1999.7168    0.71287E-26
  417   2000.7828    0.52130E-26
  418   2004.4734    0.52645E-26
  419   2000.1418    0.73698E-26
  420   1999.7164    0.71287E-26
  421   2000.1418    0.73698E-26
  422   1999.7168    0.71287E-26
  423   2000.7828    0.52130E-26
  424   2004.4734    0.52645E-26
  425    501.9617    0.32667E-22
  426    496.3194    0.27944E-22
  427    501.9617    0.32667E-22
  428    496.3194    0.27944E-22
  429   2000.4075    0.71266E-25
  430   1999.0830    0.27757E-25
  431    501.9617    0.32667E-22
  432    496.3194    0.27944E-22
  433    501.9617    0.32667E-22
  434    496.3194    0.27944E-22
  435   2000.4075    0.71266E-25
  436   1999.0830    0.27757E-25
  437   2000.4253    0.71934E-25
  438      0.0000    0.10000E+31
  439   2000.4253    0.71934E-25
  440      0.0000    0.10000E+31
  441   2000.5106    0.27798E-25
  442      0.0000    0.10000E+31
  443   2000.4253    0.71934E-25
  444      0.0000    0.10000E+31
  445   2000.4253    0.71934E-25
  446      0.0000    0.10000E+31
  447   2000.5106    0.27798E-25
  448      0.0000    0.10000E+31
  449    700.0000    0.14028E-24
  450    449.9507    0.10000E+31
  451    549.8345    0.24018E-23
  452   -901.5555    0.94965E-25
  453    916.5579    0.84439E-25
  454    549.4230    0.23683E-23
  455    914.6907    0.83545E-25
  456    549.4230    0.23683E-23
  457    914.6907    0.83545E-25
  203    105.4012    0.17895E-21
  204   1007.8071    0.20512E-24
  205   1000.0000    0.19583E-24
  206   1002.1505    0.24149E-24
  207   1002.1505    0.24149E-24
  458      0.0000    0.10000E+31
    6    172.5000    0.57395E-24
   12    172.5000    0.57395E-24
   3
   401  0.11567675E+00     0   450     1     0     0     0
   401  0.28878322E+00     0   451     1     0     0     0
   401  0.59554005E+00     0   456     2     0     0     0
   3
   402  0.44800915E-01     0   450     2     0     0     0
   402  0.31741011E+00     0   451     2     0     0     0
   402  0.63778901E+00     0   454     1     0     0     0
   3
   403  0.11570109E+00     0   450     3     0     0     0
   403  0.28884396E+00     0   451     3     0     0     0
   403  0.59545493E+00     0   456     4     0     0     0
   3
   404  0.44802871E-01     0   450     4     0     0     0
   404  0.31731877E+00     0   451     4     0     0     0
   404  0.63787836E+00     0   454     3     0     0     0
   7
   405  0.11264503E-01     0   450     5     0     0     0
   405  0.81932216E-04     0   451     5     0     0     0
   405  0.56145823E-03     0   452     5     0     0     0
   405  0.57432754E-03     0   453     5     0     0     0
   405  0.98641789E+00     0   449     5     0     0     0
   405  0.71963084E-04     0   456     6     0     0     0
   405  0.10279544E-02     0   457     6     0     0     0
   7
   406  0.70100307E+00     0   449     6     0     0     0
   406  0.32243986E-01     0   450     6     0     0     0
   406  0.24447008E-02     0   451     6     0     0     0
   406  0.66278294E-01     0   452     6     0     0     0
   406  0.63531235E-01     0   453     6     0     0     0
   406  0.49189515E-02     0   454     5     0     0     0
   406  0.12957977E+00     0   455     5     0     0     0
   3
   407  0.11567675E+00     0   450     7     0     0     0
   407  0.28878322E+00     0   451     7     0     0     0
   407  0.59554005E+00     0   454     8     0     0     0
   3
   408  0.44800915E-01     0   450     8     0     0     0
   408  0.31741011E+00     0   451     8     0     0     0
   408  0.63778901E+00     0   456     7     0     0     0
   3
   409  0.11570109E+00     0   450     9     0     0     0
   409  0.28884396E+00     0   451     9     0     0     0
   409  0.59545493E+00     0   454    10     0     0     0
   3
   410  0.44802871E-01     0   450    10     0     0     0
   410  0.31731877E+00     0   451    10     0     0     0
   410  0.63787836E+00     0   456     9     0     0     0
   7
   411  0.11264503E-01     0   450    11     0     0     0
   411  0.81932216E-04     0   451    11     0     0     0
   411  0.56145823E-03     0   452    11     0     0     0
   411  0.57432754E-03     0   453    11     0     0     0
   411  0.98641789E+00     0   449    11     0     0     0
   411  0.71963084E-04     0   454    12     0     0     0
   411  0.10279544E-02     0   455    12     0     0     0
   7
   412  0.70100307E+00     0   449    12     0     0     0
   412  0.32243986E-01     0   450    12     0     0     0
   412  0.24447008E-02     0   451    12     0     0     0
   412  0.66278294E-01     0   452    12     0     0     0
   412  0.63531235E-01     0   453    12     0     0     0
   412  0.49189515E-02     0   456    11     0     0     0
   412  0.12957977E+00     0   457    11     0     0     0
   4
   413  0.11280802E-01     0   450     1     0     0     0
   413  0.47708614E-04     0   451     1     0     0     0
   413  0.50881536E-04     0   453     1     0     0     0
   413  0.98862064E+00     0   449     1     0     0     0
   4
   414  0.43635853E-01     0   450     2     0     0     0
   414  0.18453971E-03     0   451     2     0     0     0
   414  0.19678193E-03     0   453     2     0     0     0
   414  0.95598280E+00     0   449     2     0     0     0
   4
   415  0.11280802E-01     0   450     3     0     0     0
   415  0.47708614E-04     0   451     3     0     0     0
   415  0.50881536E-04     0   453     3     0     0     0
   415  0.98862064E+00     0   449     3     0     0     0
   4
   416  0.43635853E-01     0   450     4     0     0     0
   416  0.18453971E-03     0   451     4     0     0     0
   416  0.19678187E-03     0   453     4     0     0     0
   416  0.95598280E+00     0   449     4     0     0     0
   7
   417  0.32358051E-02     0   450     5     0     0     0
   417  0.53415351E-01     0   451     5     0     0     0
   417  0.43788436E-03     0   452     5     0     0     0
   417  0.21338791E-02     0   453     5     0     0     0
   417  0.69960970E+00     0   449     5     0     0     0
   417  0.10905524E+00     0   456     6     0     0     0
   417  0.13211216E+00     0   457     6     0     0     0
   7
   418  0.69488376E+00     0   449     6     0     0     0
   418  0.11237139E+00     0   454     5     0     0     0
   418  0.30536631E-02     0   455     5     0     0     0
   418  0.16114181E-02     0   450     6     0     0     0
   418  0.56913294E-01     0   451     6     0     0     0
   418  0.65861054E-01     0   452     6     0     0     0
   418  0.65305397E-01     0   453     6     0     0     0
   4
   419  0.11280802E-01     0   450     7     0     0     0
   419  0.47708614E-04     0   451     7     0     0     0
   419  0.50881536E-04     0   453     7     0     0     0
   419  0.98862064E+00     0   449     7     0     0     0
   4
   420  0.43635853E-01     0   450     8     0     0     0
   420  0.18453971E-03     0   451     8     0     0     0
   420  0.19678193E-03     0   453     8     0     0     0
   420  0.95598280E+00     0   449     8     0     0     0
   4
   421  0.11280802E-01     0   450     9     0     0     0
   421  0.47708614E-04     0   451     9     0     0     0
   421  0.50881536E-04     0   453     9     0     0     0
   421  0.98862064E+00     0   449     9     0     0     0
   4
   422  0.43635853E-01     0   450    10     0     0     0
   422  0.18453971E-03     0   451    10     0     0     0
   422  0.19678187E-03     0   453    10     0     0     0
   422  0.95598280E+00     0   449    10     0     0     0
   7
   423  0.32358051E-02     0   450    11     0     0     0
   423  0.53415351E-01     0   451    11     0     0     0
   423  0.43788436E-03     0   452    11     0     0     0
   423  0.21338791E-02     0   453    11     0     0     0
   423  0.69960970E+00     0   449    11     0     0     0
   423  0.10905524E+00     0   454    12     0     0     0
   423  0.13211216E+00     0   455    12     0     0     0
   7
   424  0.69488376E+00     0   449    12     0     0     0
   424  0.11237139E+00     0   456    11     0     0     0
   424  0.30536631E-02     0   457    11     0     0     0
   424  0.16114181E-02     0   450    12     0     0     0
   424  0.56913294E-01     0   451    12     0     0     0
   424  0.65861054E-01     0   452    12     0     0     0
   424  0.65305397E-01     0   453    12     0     0     0
   1
   425  0.10000000E+01     0   450   121     0     0     0
   1
   426  0.10000000E+01     0   450   122     0     0     0
   1
   427  0.10000000E+01     0   450   123     0     0     0
   1
   428  0.10000000E+01     0   450   124     0     0     0
   6
   429  0.98195022E+00     0   450   125     0     0     0
   429  0.42949356E-02     0   451   125     0     0     0
   429  0.25075835E-02     0   452   125     0     0     0
   429  0.65948325E-02     0   453   125     0     0     0
   429  0.30260364E-03     0   456   126     0     0     0
   429  0.43498441E-02     0   457   126     0     0     0
   6
   430  0.11364931E+00     0   450   126     0     0     0
   430  0.26988271E+00     0   451   126     0     0     0
   430  0.31790847E-03     0   452   126     0     0     0
   430  0.12213458E-01     0   453   126     0     0     0
   430  0.59021962E+00     0   454   125     0     0     0
   430  0.13716973E-01     0   455   125     0     0     0
   1
   431  0.10000000E+01     0   450   127     0     0     0
   1
   432  0.10000000E+01     0   450   128     0     0     0
   1
   433  0.10000000E+01     0   450   129     0     0     0
   1
   434  0.10000000E+01     0   450   130     0     0     0
   6
   435  0.98195022E+00     0   450   131     0     0     0
   435  0.42949356E-02     0   451   131     0     0     0
   435  0.25075835E-02     0   452   131     0     0     0
   435  0.65948325E-02     0   453   131     0     0     0
   435  0.30260364E-03     0   454   132     0     0     0
   435  0.43498441E-02     0   455   132     0     0     0
   6
   436  0.11364931E+00     0   450   132     0     0     0
   436  0.26988271E+00     0   451   132     0     0     0
   436  0.31790847E-03     0   452   132     0     0     0
   436  0.12213458E-01     0   453   132     0     0     0
   436  0.59021962E+00     0   456   131     0     0     0
   436  0.13716973E-01     0   457   131     0     0     0
   4
   437  0.99113744E+00     0   450   121     0     0     0
   437  0.41917725E-02     0   451   121     0     0     0
   437  0.19977445E-03     0   452   121     0     0     0
   437  0.44710189E-02     0   453   121     0     0     0
   0
   4
   439  0.99113744E+00     0   450   123     0     0     0
   439  0.41917725E-02     0   451   123     0     0     0
   439  0.19977445E-03     0   452   123     0     0     0
   439  0.44710189E-02     0   453   123     0     0     0
   0
   6
   441  0.79191826E-01     0   450   125     0     0     0
   441  0.31408039E+00     0   451   125     0     0     0
   441  0.98325324E-03     0   452   125     0     0     0
   441  0.56225942E-02     0   453   125     0     0     0
   441  0.57857382E+00     0   456   126     0     0     0
   441  0.21548107E-01     0   457   126     0     0     0
   0
   4
   443  0.99113744E+00     0   450   127     0     0     0
   443  0.41917725E-02     0   451   127     0     0     0
   443  0.19977445E-03     0   452   127     0     0     0
   443  0.44710189E-02     0   453   127     0     0     0
   0
   4
   445  0.99113744E+00     0   450   129     0     0     0
   445  0.41917725E-02     0   451   129     0     0     0
   445  0.19977445E-03     0   452   129     0     0     0
   445  0.44710189E-02     0   453   129     0     0     0
   0
   6
   447  0.79191826E-01     0   450   131     0     0     0
   447  0.31408039E+00     0   451   131     0     0     0
   447  0.98325324E-03     0   452   131     0     0     0
   447  0.56225942E-02     0   453   131     0     0     0
   447  0.57857382E+00     0   454   132     0     0     0
   447  0.21548107E-01     0   455   132     0     0     0
   0
   8
   449  0.13042875E+00     0   408     2     0     0     0
   449  0.13042875E+00     0   402     8     0     0     0
   449  0.11957799E+00     0   407     1     0     0     0
   449  0.11957799E+00     0   401     7     0     0     0
   449  0.11957777E+00     0   409     3     0     0     0
   449  0.11957777E+00     0   403     9     0     0     0
   449  0.13041550E+00     0   410     4     0     0     0
   449  0.13041550E+00     0   404    10     0     0     0
   0
   9
   451  0.26573648E-03     0   450   200     0     0     0
   451  0.12103114E+00     0   425   127     0     0     0
   451  0.12103114E+00     0   431   121     0     0     0
   451  0.12103087E+00     0   427   129     0     0     0
   451  0.12103087E+00     0   433   123     0     0     0
   451  0.12890257E+00     0   426   128     0     0     0
   451  0.12890257E+00     0   432   122     0     0     0
   451  0.12890257E+00     0   428   130     0     0     0
   451  0.12890257E+00     0   434   124     0     0     0
  22
   452  0.30073455E+00     0   454   199     0     0     0
   452  0.30073455E+00     0   456   198     0     0     0
   452  0.11629469E+00     0   450   200     0     0     0
   452  0.26977563E+00     0   451   200     0     0     0
   452  0.44714385E-02     0   450   203     0     0     0
   452  0.53990870E-02     0   451   203     0     0     0
   452  0.16428916E-03     0   402     8     0     0     0
   452  0.16428916E-03     0   408     2     0     0     0
   452  0.24803684E-03     0   401     7     0     0     0
   452  0.24803684E-03     0   407     1     0     0     0
   452  0.24803681E-03     0   403     9     0     0     0
   452  0.24803681E-03     0   409     3     0     0     0
   452  0.16428682E-03     0   404    10     0     0     0
   452  0.16428682E-03     0   410     4     0     0     0
   452  0.47469366E-04     0   425   127     0     0     0
   452  0.47469366E-04     0   431   121     0     0     0
   452  0.47469366E-04     0   427   129     0     0     0
   452  0.47469366E-04     0   433   123     0     0     0
   452  0.18772190E-03     0   426   128     0     0     0
   452  0.18772190E-03     0   432   122     0     0     0
   452  0.18772190E-03     0   428   130     0     0     0
   452  0.18772190E-03     0   434   124     0     0     0
  22
   453  0.28087762E+00     0   454   199     0     0     0
   453  0.28087762E+00     0   456   198     0     0     0
   453  0.45139575E-02     0   450   200     0     0     0
   453  0.59390068E-02     0   451   200     0     0     0
   453  0.95537968E-01     0   450   203     0     0     0
   453  0.22371995E+00     0   451   203     0     0     0
   453  0.75969435E-02     0   402     8     0     0     0
   453  0.75969435E-02     0   408     2     0     0     0
   453  0.10106270E-01     0   401     7     0     0     0
   453  0.10106270E-01     0   407     1     0     0     0
   453  0.10106268E-01     0   403     9     0     0     0
   453  0.10106268E-01     0   409     3     0     0     0
   453  0.75968434E-02     0   404    10     0     0     0
   453  0.75968434E-02     0   410     4     0     0     0
   453  0.26093018E-02     0   425   127     0     0     0
   453  0.26093018E-02     0   431   121     0     0     0
   453  0.26093018E-02     0   427   129     0     0     0
   453  0.26093018E-02     0   433   123     0     0     0
   453  0.68209982E-02     0   426   128     0     0     0
   453  0.68209982E-02     0   432   122     0     0     0
   453  0.68209982E-02     0   428   130     0     0     0
   453  0.68209982E-02     0   434   124     0     0     0
   5
   454  0.19265745E-01     0   450   198     0     0     0
   454  0.27399138E+00     0   426   127     0     0     0
   454  0.27399087E+00     0   428   129     0     0     0
   454  0.21637601E+00     0   431   122     0     0     0
   454  0.21637601E+00     0   433   124     0     0     0
  12
   455  0.68675414E-01     0   450   198     0     0     0
   455  0.29866812E+00     0   451   198     0     0     0
   455  0.13025525E-01     0   402     7     0     0     0
   455  0.22745527E-01     0   407     2     0     0     0
   455  0.13025423E-01     0   404     9     0     0     0
   455  0.23289513E-01     0   409     4     0     0     0
   455  0.65892991E-02     0   426   127     0     0     0
   455  0.65892991E-02     0   428   129     0     0     0
   455  0.11558002E-01     0   431   122     0     0     0
   455  0.11558002E-01     0   433   124     0     0     0
   455  0.27760905E+00     0   454   200     0     0     0
   455  0.24666680E+00     0   454   203     0     0     0
   5
   456  0.19265745E-01     0   450   199     0     0     0
   456  0.27399138E+00     0   432   121     0     0     0
   456  0.27399087E+00     0   434   123     0     0     0
   456  0.21637601E+00     0   425   128     0     0     0
   456  0.21637601E+00     0   427   130     0     0     0
  12
   457  0.68675414E-01     0   450   199     0     0     0
   457  0.29866812E+00     0   451   199     0     0     0
   457  0.13025525E-01     0   408     1     0     0     0
   457  0.22745527E-01     0   401     8     0     0     0
   457  0.13025423E-01     0   410     3     0     0     0
   457  0.23289513E-01     0   403    10     0     0     0
   457  0.65892991E-02     0   432   121     0     0     0
   457  0.65892991E-02     0   434   123     0     0     0
   457  0.11558002E-01     0   425   128     0     0     0
   457  0.11558002E-01     0   427   130     0     0     0
   457  0.27760905E+00     0   456   200     0     0     0
   457  0.24666680E+00     0   456   203     0     0     0
  28
   203  0.21322104E-03     0   123   129     0     0     0
   203  0.60966015E-01     0   125   131     0     0     0
   203  0.25644139E-02     0     3     9     0     0     0
   203  0.85108805E+00     0     5    11     0     0     0
   203  0.37276704E-01     0     4    10     0     0     0
   203  0.14722884E-02     0    59    59     0     0     0
   203  0.33282556E-01     0    13    13     0     0     0
   203  0.70844148E-03     0   198   121   128     0     0
   203  0.70844148E-03     0   198   123   130     0     0
   203  0.70844148E-03     0   198   125   132     0     0
   203  0.21253244E-02     0   198     8     1     0     0
   203  0.21253244E-02     0   198    10     3     0     0
   203  0.70844148E-03     0   199   127   122     0     0
   203  0.70844148E-03     0   199   129   124     0     0
   203  0.70844148E-03     0   199   131   126     0     0
   203  0.21253244E-02     0   199     2     7     0     0
   203  0.21253244E-02     0   199     4     9     0     0
   203  0.26319985E-04     0   200   122   128     0     0
   203  0.26319985E-04     0   200   124   130     0     0
   203  0.26319985E-04     0   200   126   132     0     0
   203  0.13246585E-04     0   200   121   127     0     0
   203  0.13246585E-04     0   200   123   129     0     0
   203  0.13246585E-04     0   200   125   131     0     0
   203  0.45381679E-04     0   200     2     8     0     0
   203  0.45381679E-04     0   200     4    10     0     0
   203  0.58462778E-04     0   200     1     7     0     0
   203  0.58462778E-04     0   200     3     9     0     0
   203  0.58462778E-04     0   200     5    11     0     0
  16
   204  0.35972138E-04     0   123   129     0     0     0
   204  0.10302780E-01     0   125   131     0     0     0
   204  0.42169544E-03     0     3     9     0     0     0
   204  0.10397627E+00     0     5    11     0     0     0
   204  0.19092853E-04     0     4    10     0     0     0
   204  0.87128830E+00     0     6    12     0     0     0
   204  0.51017065E-03     0    13    13     0     0     0
   204  0.21061569E-02     0   198   199     0     0     0
   204  0.10693561E-02     0   200   200     0     0     0
   204  0.33326141E-03     0   450   450     0     0     0
   204  0.43828237E-04     0   450   451     0     0     0
   204  0.92562912E-02     0   203   203     0     0     0
   204  0.40510513E-04     0   425   431     0     0     0
   204  0.40507188E-04     0   427   433     0     0     0
   204  0.27788276E-03     0   426   432     0     0     0
   204  0.27788276E-03     0   428   434     0     0     0
  10
   205  0.34156565E-04     0   123   129     0     0     0
   205  0.97829020E-02     0   125   131     0     0     0
   205  0.40043757E-03     0     3     9     0     0     0
   205  0.98829865E-01     0     5    11     0     0     0
   205  0.17458273E-04     0     4    10     0     0     0
   205  0.88459784E+00     0     6    12     0     0     0
   205  0.51661837E-03     0    13    13     0     0     0
   205  0.29875000E-02     0   450   450     0     0     0
   205  0.88468194E-03     0   450   451     0     0     0
   205  0.19485933E-02     0   203   200     0     0     0
   8
   206  0.42209638E-04     0   124   129     0     0     0
   206  0.12089413E-01     0   126   131     0     0     0
   206  0.47466514E-03     0     4     9     0     0     0
   206  0.98113090E+00     0     6    11     0     0     0
   206  0.34740355E-02     0   454   450     0     0     0
   206  0.24012369E-02     0   203   198     0     0     0
   206  0.19377362E-03     0   431   426     0     0     0
   206  0.19376801E-03     0   433   428     0     0     0
   8
   207  0.42209638E-04     0   130   123     0     0     0
   207  0.12089413E-01     0   132   125     0     0     0
   207  0.47466514E-03     0    10     3     0     0     0
   207  0.98113090E+00     0    12     5     0     0     0
   207  0.34740355E-02     0   456   450     0     0     0
   207  0.24012369E-02     0   203   199     0     0     0
   207  0.19377362E-03     0   425   432     0     0     0
   207  0.19376801E-03     0   427   434     0     0     0
   0
   5
     6  0.33333334E+00   100     2     7     5     0     0
     6  0.33333334E+00   100     4     9     5     0     0
     6  0.11111111E+00   100   122   127     5     0     0
     6  0.11111111E+00   100   124   129     5     0     0
     6  0.11111111E+00   100   126   131     5     0     0
   5
    12  0.33333334E+00   100     8     1    11     0     0
    12  0.33333334E+00   100    10     3    11     0     0
    12  0.11111111E+00   100   128   121    11     0     0
    12  0.11111111E+00   100   130   123    11     0     0
    12  0.11111111E+00   100   132   125    11     0     0
      4.00000000     -0.24957004
      0.99441671     -0.04957278      0.07751133     -0.05167104
     -0.06641533     -0.97996914      0.15042518     -0.11234624
     -0.01682008      0.02832863      0.70570487      0.70773911
     -0.08025867      0.19078900      0.68800026     -0.69556707
     -0.98636502      0.16457228     -0.16457228     -0.98636502
     -0.97548622      0.22006056     -0.22006056     -0.97548622
      1.57071936     -1.57079589     -1.57079399
    225.00000000   3600.00000000   3600.00000000
    900.00000000
    T
