#  ISAJET SUSY parameters in Les Houches accord format
#  Created by ISALHA3. Last revision by C. Balazs on 2005 Jan. 10
Block SPINFO   # Program information
     1   ISASUGRA from ISAJET          # Spectrum Calculator
     2   7.79   16-DEC-2008 15:42:00   # Version number
Block MODSEL   # Model selection
     1     1   # Minimal supergravity (mSUGRA,CMSSM) model         
Block SMINPUTS   # Standard Model inputs
     1     1.27845901E+02   # alpha_em^(-1)
     2     1.16570000E-05   # G_Fermi
     3     1.17200002E-01   # alpha_s(M_Z)
     4     9.11699982E+01   # m_{Z}(pole)
     5     4.19999981E+00   # m_{b}(m_{b})
     6     1.72500000E+02   # m_{top}(pole)
     7     1.77699995E+00   # m_{tau}(pole)
Block MINPAR   # SUSY breaking input parameters
     1     4.80000000E+02   # m_0
     2     4.00000000E+02   # m_{1/2}
     3     3.00000000E+00   # tan(beta)
     4     1.00000000E+00   # sign(mu)
     5     0.00000000E+00   # A_0
#  
#  M_{GUT} =   0.19862998E+17
Block MASS   # Scalar and gaugino mass spectrum
#  PDG code   mass                 particle
        24     8.04229965E+01   #  W^+
        25     1.01282845E+02   #  h^0            
        35     8.77128052E+02   #  H^0            
        36     8.69567688E+02   #  A^0            
        37     8.78845825E+02   #  H^+            
   1000001     9.82990112E+02   #  dnl            
   1000002     9.80234009E+02   #  upl            
   1000003     9.82990173E+02   #  stl            
   1000004     9.80234985E+02   #  chl            
   1000005     8.81225159E+02   #  b1             
   1000006     6.85449524E+02   #  t1             
   1000011     5.50757446E+02   #  el-            
   1000012     5.45222595E+02   #  nuel           
   1000013     5.50757507E+02   #  mul-           
   1000014     5.45222595E+02   #  numl           
   1000015     5.02583466E+02   #  tau1           
   1000016     5.44591248E+02   #  nutl           
   1000021     9.55757690E+02   #  glss           
   1000022     1.62417023E+02   #  z1ss           
   1000023     3.06503357E+02   #  z2ss           
   1000024     3.06338196E+02   #  w1ss           
   1000025    -6.14448364E+02   #  z3ss           
   1000035     6.33099182E+02   #  z4ss           
   1000037     6.30421326E+02   #  w2ss           
   2000001     9.53600464E+02   #  dnr            
   2000002     9.55814819E+02   #  upr            
   2000003     9.53600525E+02   #  str            
   2000004     9.55815796E+02   #  chr            
   2000005     9.51129578E+02   #  b2             
   2000006     9.21343811E+02   #  t2             
   2000011     5.02951843E+02   #  er-            
   2000013     5.02951874E+02   #  mur-           
   2000015     5.50506836E+02   #  tau2           
#  Higgs mixing
Block ALPHA   # Effective Higgs mixing parameter
         -3.28574330E-01   # alpha
Block STOPMIX   # stop mixing matrix
  1  1     3.93498093E-01   # O_{11}
  1  2    -9.19325411E-01   # O_{12}
  2  1     9.19325411E-01   # O_{21}
  2  2     3.93498093E-01   # O_{22}
Block SBOTMIX   # sbottom mixing matrix
  1  1     9.98457015E-01   # O_{11}
  1  2    -5.55301793E-02   # O_{12}
  2  1     5.55301793E-02   # O_{21}
  2  2     9.98457015E-01   # O_{22}
Block STAUMIX   # stau mixing matrix
  1  1     7.31304288E-02   # O_{11}
  1  2    -9.97322381E-01   # O_{12}
  2  1     9.97322381E-01   # O_{21}
  2  2     7.31304288E-02   # O_{22}
Block NMIX   # neutralino mixing matrix
  1  1     9.95032847E-01   #
  1  2    -3.25997137E-02   #
  1  3     8.24245736E-02   #
  1  4    -4.53128852E-02   #
  2  1    -5.23883067E-02   #
  2  2    -9.74544108E-01   #
  2  3     1.77175358E-01   #
  2  4    -1.26997814E-01   #
  3  1     2.48931218E-02   #
  3  2    -3.71337049E-02   #
  3  3    -7.04553008E-01   #
  3  4    -7.08241642E-01   #
  4  1     8.09047222E-02   #
  4  2    -2.18683526E-01   #
  4  3    -6.82217002E-01   #
  4  4     6.92973375E-01   #
Block UMIX   # chargino U mixing matrix
  1  1    -9.66571331E-01   # U_{11}
  1  2     2.56397933E-01   # U_{12}
  2  1    -2.56397933E-01   # U_{21}
  2  2    -9.66571331E-01   # U_{22}
Block VMIX   # chargino V mixing matrix
  1  1    -9.82608378E-01   # V_{11}
  1  2     1.85690030E-01   # V_{12}
  2  1    -1.85690030E-01   # V_{21}
  2  2    -9.82608378E-01   # V_{22}
Block GAUGE Q=  7.60095154E+02   #
     1     3.57491404E-01   # g`
     2     6.52476072E-01   # g_2
     3     1.22103906E+00   # g_3
Block YU Q=  7.60095154E+02   #
  3  3     9.06310022E-01   # y_t
Block YD Q=  7.60095154E+02   #
  3  3     4.28714044E-02   # y_b
Block YE Q=  7.60095154E+02   #
  3  3     3.18271443E-02   # y_tau
Block HMIX Q=  7.60095154E+02   # Higgs mixing parameters
     1     6.12690857E+02   # mu(Q)
     2     3.00000000E+00   # tan(beta)(M_{GUT})
     3     2.50693069E+02   # Higgs vev at Q
     4     7.56147938E+05   # m_A^2(Q)
Block MSOFT Q=  7.60095154E+02   # DRbar SUSY breaking parameters
     1     1.66782288E+02   # M_1(Q)          
     2     3.10896545E+02   # M_2(Q)          
     3     8.95352722E+02   # M_3(Q)          
    31     5.46914612E+02   # MeL(Q)          
    32     5.46914612E+02   # MmuL(Q)         
    33     5.46295471E+02   # MtauL(Q)        
    34     5.01106384E+02   # MeR(Q)          
    35     5.01106384E+02   # MmuR(Q)         
    36     5.00572449E+02   # MtauR(Q)        
    41     9.34869690E+02   # MqL1(Q)         
    42     9.34869690E+02   # MqL2(Q)         
    43     8.40533691E+02   # MqL3(Q)         
    44     9.10102783E+02   # MuR(Q)          
    45     9.10102783E+02   # McR(Q)          
    46     6.87354492E+02   # MtR(Q)          
    47     9.07076233E+02   # MdR(Q)          
    48     9.07076233E+02   # MsR(Q)          
    49     9.13011414E+02   # MbR(Q)          
Block AU Q=  7.60095154E+02   #
  1  1    -6.76080383E+02   # A_u
  2  2    -6.76080383E+02   # A_c
  3  3    -6.76080383E+02   # A_t
Block AD Q=  7.60095154E+02   #
  1  1    -1.06260693E+03   # A_d
  2  2    -1.06260693E+03   # A_s
  3  3    -1.06260693E+03   # A_b
Block AE Q=  7.60095154E+02   #
  1  1    -2.46044083E+02   # A_e
  2  2    -2.46044083E+02   # A_mu
  3  3    -2.46044083E+02   # A_tau
#  ISAJET decay tables in SUSY Les Houches accord format
#  Created by ISALHD. Last revision: C. Balazs, 2005 May 25
Block DCINFO                           # Program information
     1   ISASUGRA from ISAJET          # Spectrum Calculator
     2   7.79   16-DEC-2008 15:42:00   # Version number
#         PDG         Width
DECAY         6  1.14680767E+00   # TP    decays
#          BR          NDA       ID1       ID2       ID3       ID4
      3.33333343E-01    3            2        -1         5             # TP     -->  UP     DB     BT          
      3.33333343E-01    3            4        -3         5             # TP     -->  CH     SB     BT          
      1.11111112E-01    3          -11        12         5             # TP     -->  E+     NUE    BT          
      1.11111112E-01    3          -13        14         5             # TP     -->  MU+    NUM    BT          
      1.11111112E-01    3          -15        16         5             # TP     -->  TAU+   NUT    BT          
#         PDG         Width
DECAY   1000021  2.71806169E+00   # GLSS  decays
#          BR          NDA       ID1       ID2       ID3       ID4
      4.97048115E-03    3      1000024         1        -2             # GLSS   -->  W1SS+  DN     UB          
      4.97048115E-03    3     -1000024         2        -1             # GLSS   -->  W1SS-  UP     DB          
      4.97044669E-03    3      1000024         3        -4             # GLSS   -->  W1SS+  ST     CB          
      4.97044669E-03    3     -1000024         4        -3             # GLSS   -->  W1SS-  CH     SB          
      1.31559814E-03    3      1000024         5        -6             # GLSS   -->  W1SS+  BT     TB          
      1.31559814E-03    3     -1000024         6        -5             # GLSS   -->  W1SS-  TP     BB          
      4.65685080E-05    3      1000037         1        -2             # GLSS   -->  W2SS+  DN     UB          
      4.65685080E-05    3     -1000037         2        -1             # GLSS   -->  W2SS-  UP     DB          
      4.65681514E-05    3      1000037         3        -4             # GLSS   -->  W2SS+  ST     CB          
      4.65681514E-05    3     -1000037         4        -3             # GLSS   -->  W2SS-  CH     SB          
      7.05561251E-05    3      1000037         5        -6             # GLSS   -->  W2SS+  BT     TB          
      7.05561251E-05    3     -1000037         6        -5             # GLSS   -->  W2SS-  TP     BB          
      9.53579274E-06    2      1000022        21                       # GLSS   -->  Z1SS   GL                 
      2.92032841E-03    3      1000022         2        -2             # GLSS   -->  Z1SS   UP     UB          
      1.54781970E-04    3      1000022         1        -1             # GLSS   -->  Z1SS   DN     DB          
      1.54781854E-04    3      1000022         3        -3             # GLSS   -->  Z1SS   ST     SB          
      2.92017334E-03    3      1000022         4        -4             # GLSS   -->  Z1SS   CH     CB          
      8.96721205E-04    3      1000022         5        -5             # GLSS   -->  Z1SS   BT     BB          
      1.20032855E-04    3      1000022         6        -6             # GLSS   -->  Z1SS   TP     TB          
      4.90922821E-06    2      1000023        21                       # GLSS   -->  Z2SS   GL                 
      2.58380221E-03    3      1000023         2        -2             # GLSS   -->  Z2SS   UP     UB          
      2.39097606E-03    3      1000023         1        -1             # GLSS   -->  Z2SS   DN     DB          
      2.39097443E-03    3      1000023         3        -3             # GLSS   -->  Z2SS   ST     SB          
      2.58376892E-03    3      1000023         4        -4             # GLSS   -->  Z2SS   CH     CB          
      8.52270114E-06    3      1000023         5        -5             # GLSS   -->  Z2SS   BT     BB          
      9.45206557E-04    3      1000023         6        -6             # GLSS   -->  Z2SS   TP     TB          
      5.86870519E-05    2      1000025        21                       # GLSS   -->  Z3SS   GL                 
      5.28005557E-07    3      1000025         2        -2             # GLSS   -->  Z3SS   UP     UB          
      4.66993015E-07    3      1000025         1        -1             # GLSS   -->  Z3SS   DN     DB          
      4.66992333E-07    3      1000025         3        -3             # GLSS   -->  Z3SS   ST     SB          
      5.27970656E-07    3      1000025         4        -4             # GLSS   -->  Z3SS   CH     CB          
      6.51709433E-06    3      1000025         5        -5             # GLSS   -->  Z3SS   BT     BB          
      3.69346380E-05    2      1000035        21                       # GLSS   -->  Z4SS   GL                 
      2.29489124E-05    3      1000035         2        -2             # GLSS   -->  Z4SS   UP     UB          
      2.45665451E-05    3      1000035         1        -1             # GLSS   -->  Z4SS   DN     DB          
      2.45665215E-05    3      1000035         3        -3             # GLSS   -->  Z4SS   ST     SB          
      2.29482612E-05    3      1000035         4        -4             # GLSS   -->  Z4SS   CH     CB          
      8.73415684E-06    3      1000035         5        -5             # GLSS   -->  Z4SS   BT     BB          
      8.26972973E-05    2     -2000001         1                       # GLSS   -->  DBR    DN                 
      8.26972973E-05    2      2000001        -1                       # GLSS   -->  DNR    DB                 
      8.23418159E-05    2     -2000003         3                       # GLSS   -->  SBR    ST                 
      8.23418159E-05    2      2000003        -3                       # GLSS   -->  STR    SB                 
      9.04803053E-02    2     -1000005         5                       # GLSS   -->  BB1    BT                 
      9.04803053E-02    2      1000005        -5                       # GLSS   -->  BT1    BB                 
      3.88788253E-01    2     -1000006         6                       # GLSS   -->  TB1    TP                 
      3.88788253E-01    2      1000006        -6                       # GLSS   -->  TP1    TB                 
#         PDG         Width
DECAY   1000002  1.01322594E+01   # UPL   decays
#          BR          NDA       ID1       ID2       ID3       ID4
      8.63145199E-03    2      1000022         2                       # UPL    -->  Z1SS   UP                 
      3.21058720E-01    2      1000023         2                       # UPL    -->  Z2SS   UP                 
      1.59234318E-04    2      1000025         2                       # UPL    -->  Z3SS   UP                 
      5.74950222E-03    2      1000035         2                       # UPL    -->  Z4SS   UP                 
      1.44777931E-02    2      1000021         2                       # UPL    -->  GLSS   UP                 
      6.40267253E-01    2      1000024         1                       # UPL    -->  W1SS+  DN                 
      9.65606142E-03    2      1000037         1                       # UPL    -->  W2SS+  DN                 
#         PDG         Width
DECAY   1000001  1.00723801E+01   # DNL   decays
#          BR          NDA       ID1       ID2       ID3       ID4
      1.79492533E-02    2      1000022         1                       # DNL    -->  Z1SS   DN                 
      3.11742246E-01    2      1000023         1                       # DNL    -->  Z2SS   DN                 
      2.65098701E-04    2      1000025         1                       # DNL    -->  Z3SS   DN                 
      7.67050730E-03    2      1000035         1                       # DNL    -->  Z4SS   DN                 
      1.79229323E-02    2      1000021         1                       # DNL    -->  GLSS   DN                 
      6.25731528E-01    2     -1000024         2                       # DNL    -->  W1SS-  UP                 
      1.87184364E-02    2     -1000037         2                       # DNL    -->  W2SS-  UP                 
#         PDG         Width
DECAY   1000003  1.00723505E+01   # STL   decays
#          BR          NDA       ID1       ID2       ID3       ID4
      1.79493073E-02    2      1000022         3                       # STL    -->  Z1SS   ST                 
      3.11743170E-01    2      1000023         3                       # STL    -->  Z2SS   ST                 
      2.65099545E-04    2      1000025         3                       # STL    -->  Z3SS   ST                 
      7.67053105E-03    2      1000035         3                       # STL    -->  Z4SS   ST                 
      1.79230608E-02    2      1000021         3                       # STL    -->  GLSS   ST                 
      6.25730515E-01    2     -1000024         4                       # STL    -->  W1SS-  CH                 
      1.87182911E-02    2     -1000037         4                       # STL    -->  W2SS-  CH                 
#         PDG         Width
DECAY   1000004  1.01320410E+01   # CHL   decays
#          BR          NDA       ID1       ID2       ID3       ID4
      8.63161311E-03    2      1000022         4                       # CHL    -->  Z1SS   CH                 
      3.21064681E-01    2      1000023         4                       # CHL    -->  Z2SS   CH                 
      1.59236675E-04    2      1000025         4                       # CHL    -->  Z3SS   CH                 
      5.74958464E-03    2      1000035         4                       # CHL    -->  Z4SS   CH                 
      1.44566298E-02    2      1000021         4                       # CHL    -->  GLSS   CH                 
      6.40281975E-01    2      1000024         3                       # CHL    -->  W1SS+  ST                 
      9.65630729E-03    2      1000037         3                       # CHL    -->  W2SS+  ST                 
#         PDG         Width
DECAY   1000005  1.35268993E+01   # BT1   decays
#          BR          NDA       ID1       ID2       ID3       ID4
      1.20232115E-02    2      1000022         5                       # BT1    -->  Z1SS   BT                 
      1.97072089E-01    2      1000023         5                       # BT1    -->  Z2SS   BT                 
      4.16311057E-04    2      1000025         5                       # BT1    -->  Z3SS   BT                 
      3.66808521E-03    2      1000035         5                       # BT1    -->  Z4SS   BT                 
      3.51375043E-01    2     -1000024         6                       # BT1    -->  W1SS-  TP                 
      1.99056119E-01    2     -1000037         6                       # BT1    -->  W2SS-  TP                 
      2.36389175E-01    2          -24   1000006                       # BT1    -->  W-     TP1                
#         PDG         Width
DECAY   1000006  3.23201275E+00   # TP1   decays
#          BR          NDA       ID1       ID2       ID3       ID4
      3.38214368E-01    2      1000022         6                       # TP1    -->  Z1SS   TP                 
      1.64695904E-01    2      1000023         6                       # TP1    -->  Z2SS   TP                 
      4.40073311E-01    2      1000024         5                       # TP1    -->  W1SS+  BT                 
      5.70164360E-02    2      1000037         5                       # TP1    -->  W2SS+  BT                 
#         PDG         Width
DECAY   2000002  2.02719951E+00   # UPR   decays
#          BR          NDA       ID1       ID2       ID3       ID4
      9.95219886E-01    2      1000022         2                       # UPR    -->  Z1SS   UP                 
      2.35456717E-03    2      1000023         2                       # UPR    -->  Z2SS   UP                 
      2.27375538E-04    2      1000025         2                       # UPR    -->  Z3SS   UP                 
      2.19779438E-03    2      1000035         2                       # UPR    -->  Z4SS   UP                 
      4.15625749E-07    2      1000021         2                       # UPR    -->  GLSS   UP                 
#         PDG         Width
DECAY   2000001  5.05476356E-01   # DNR   decays
#          BR          NDA       ID1       ID2       ID3       ID4
      9.95238841E-01    2      1000022         1                       # DNR    -->  Z1SS   DN                 
      2.35275342E-03    2      1000023         1                       # DNR    -->  Z2SS   DN                 
      2.25955533E-04    2      1000025         1                       # DNR    -->  Z3SS   DN                 
      2.18249275E-03    2      1000035         1                       # DNR    -->  Z4SS   DN                 
#         PDG         Width
DECAY   2000003  5.05476356E-01   # STR   decays
#          BR          NDA       ID1       ID2       ID3       ID4
      9.95238841E-01    2      1000022         3                       # STR    -->  Z1SS   ST                 
      2.35275365E-03    2      1000023         3                       # STR    -->  Z2SS   ST                 
      2.25955577E-04    2      1000025         3                       # STR    -->  Z3SS   ST                 
      2.18249322E-03    2      1000035         3                       # STR    -->  Z4SS   ST                 
#         PDG         Width
DECAY   2000004  2.02719235E+00   # CHR   decays
#          BR          NDA       ID1       ID2       ID3       ID4
      9.95220304E-01    2      1000022         4                       # CHR    -->  Z1SS   CH                 
      2.35456740E-03    2      1000023         4                       # CHR    -->  Z2SS   CH                 
      2.27374607E-04    2      1000025         4                       # CHR    -->  Z3SS   CH                 
      2.19778344E-03    2      1000035         4                       # CHR    -->  Z4SS   CH                 
#         PDG         Width
DECAY   2000005  5.88175535E-01   # BT2   decays
#          BR          NDA       ID1       ID2       ID3       ID4
      8.48260641E-01    2      1000022         5                       # BT2    -->  Z1SS   BT                 
      9.57689248E-03    2      1000023         5                       # BT2    -->  Z2SS   BT                 
      1.13610802E-02    2      1000025         5                       # BT2    -->  Z3SS   BT                 
      1.51826236E-02    2      1000035         5                       # BT2    -->  Z4SS   BT                 
      1.39912656E-02    2     -1000024         6                       # BT2    -->  W1SS-  TP                 
      5.80887571E-02    2     -1000037         6                       # BT2    -->  W2SS-  TP                 
      4.35386784E-02    2          -24   1000006                       # BT2    -->  W-     TP1                
#         PDG         Width
DECAY   2000006  1.46053066E+01   # TP2   decays
#          BR          NDA       ID1       ID2       ID3       ID4
      2.71133155E-01    2      1000024         5                       # TP2    -->  W1SS+  BT                 
      7.43441582E-02    2      1000037         5                       # TP2    -->  W2SS+  BT                 
      1.60585463E-01    2           23   1000006                       # TP2    -->  Z0     TP1                
      1.09483719E-01    2           25   1000006                       # TP2    -->  HL0    TP1                
      1.55132785E-02    2      1000022         6                       # TP2    -->  Z1SS   TP                 
      1.25409171E-01    2      1000023         6                       # TP2    -->  Z2SS   TP                 
      7.67950639E-02    2      1000025         6                       # TP2    -->  Z3SS   TP                 
      1.66736037E-01    2      1000035         6                       # TP2    -->  Z4SS   TP                 
#         PDG         Width
DECAY   1000011  3.68938017E+00   # EL-   decays
#          BR          NDA       ID1       ID2       ID3       ID4
      1.38551950E-01    2      1000022        11                       # EL-    -->  Z1SS   E-                 
      3.01426530E-01    2      1000023        11                       # EL-    -->  Z2SS   E-                 
      5.60021460E-01    2     -1000024        12                       # EL-    -->  W1SS-  NUE                
      3.99113034E-12    3      1000015        11       -15             # EL-    -->  TAU1-  E-     TAU+        
      3.19282968E-12    3     -1000015        11        15             # EL-    -->  TAU1+  E-     TAU-        
#         PDG         Width
DECAY   1000013  3.68938136E+00   # MUL-  decays
#          BR          NDA       ID1       ID2       ID3       ID4
      1.38551921E-01    2      1000022        13                       # MUL-   -->  Z1SS   MU-                
      3.01426530E-01    2      1000023        13                       # MUL-   -->  Z2SS   MU-                
      5.60021520E-01    2     -1000024        14                       # MUL-   -->  W1SS-  NUM                
      3.99115593E-12    3      1000015        13       -15             # MUL-   -->  TAU1-  MU-    TAU+        
      3.19285115E-12    3     -1000015        13        15             # MUL-   -->  TAU1+  MU-    TAU-        
#         PDG         Width
DECAY   1000015  2.04307795E+00   # TAU1- decays
#          BR          NDA       ID1       ID2       ID3       ID4
      9.89966035E-01    2      1000022        15                       # TAU1-  -->  Z1SS   TAU-               
      4.34067240E-03    2      1000023        15                       # TAU1-  -->  Z2SS   TAU-               
      5.69330808E-03    2     -1000024        16                       # TAU1-  -->  W1SS-  NUT                
#         PDG         Width
DECAY   1000012  3.67563772E+00   # NUEL  decays
#          BR          NDA       ID1       ID2       ID3       ID4
      1.74113184E-01    2      1000022        12                       # NUEL   -->  Z1SS   NUE                
      2.61267602E-01    2      1000023        12                       # NUEL   -->  Z2SS   NUE                
      5.64619243E-01    2      1000024        11                       # NUEL   -->  W1SS+  E-                 
      4.72214021E-12    3      1000015        12       -15             # NUEL   -->  TAU1-  NUE    TAU+        
      3.84306345E-12    3     -1000015        12        15             # NUEL   -->  TAU1+  NUE    TAU-        
      2.23868623E-12    3     -1000015        11        16             # NUEL   -->  TAU1+  E-     NUT         
#         PDG         Width
DECAY   1000014  3.67563725E+00   # NUML  decays
#          BR          NDA       ID1       ID2       ID3       ID4
      1.74113199E-01    2      1000022        14                       # NUML   -->  Z1SS   NUM                
      2.61267632E-01    2      1000023        14                       # NUML   -->  Z2SS   NUM                
      5.64619184E-01    2      1000024        13                       # NUML   -->  W1SS+  MU-                
      4.72214065E-12    3      1000015        14       -15             # NUML   -->  TAU1-  NUM    TAU+        
      3.84306389E-12    3     -1000015        14        15             # NUML   -->  TAU1+  NUM    TAU-        
      2.23886643E-12    3     -1000015        13        16             # NUML   -->  TAU1+  MU-    NUT         
#         PDG         Width
DECAY   1000016  3.66457129E+00   # NUTL  decays
#          BR          NDA       ID1       ID2       ID3       ID4
      1.74357936E-01    2      1000022        16                       # NUTL   -->  Z1SS   NUT                
      2.61192292E-01    2      1000023        16                       # NUTL   -->  Z2SS   NUT                
      5.64449251E-01    2      1000024        15                       # NUTL   -->  W1SS+  TAU-               
      4.42694145E-12    3     -1000015        16        15             # NUTL   -->  TAU1+  NUT    TAU-        
      5.80968873E-08    3      1000015        16       -15             # NUTL   -->  TAU1-  NUT    TAU+        
      5.80933310E-08    3      1000015        12       -11             # NUTL   -->  TAU1-  NUE    E+          
      5.80933310E-08    3      1000015        14       -13             # NUTL   -->  TAU1-  NUM    MU+         
      1.74279990E-07    3      1000015         2        -1             # NUTL   -->  TAU1-  UP     DB          
      1.74279990E-07    3      1000015         4        -3             # NUTL   -->  TAU1-  CH     SB          
#         PDG         Width
DECAY   2000011  2.03486204E+00   # ER-   decays
#          BR          NDA       ID1       ID2       ID3       ID4
      9.98636544E-01    2      1000022        11                       # ER-    -->  Z1SS   E-                 
      1.36344100E-03    2      1000023        11                       # ER-    -->  Z2SS   E-                 
      1.13003199E-31    3      1000015        12       -16             # ER-    -->  TAU1-  NUE    ANUT        
#         PDG         Width
DECAY   2000013  2.03486180E+00   # MUR-  decays
#          BR          NDA       ID1       ID2       ID3       ID4
      9.98636544E-01    2      1000022        13                       # MUR-   -->  Z1SS   MU-                
      1.36344123E-03    2      1000023        13                       # MUR-   -->  Z2SS   MU-                
      4.79920557E-27    3      1000015        14       -16             # MUR-   -->  TAU1-  NUM    ANUT        
#         PDG         Width
DECAY   2000015  3.67054176E+00   # TAU2- decays
#          BR          NDA       ID1       ID2       ID3       ID4
      1.41470149E-01    2      1000022        15                       # TAU2-  -->  Z1SS   TAU-               
      3.00439209E-01    2      1000023        15                       # TAU2-  -->  Z2SS   TAU-               
      5.58090627E-01    2     -1000024        16                       # TAU2-  -->  W1SS-  NUT                
#         PDG         Width
DECAY   1000023  2.07849946E-02   # Z2SS  decays
#          BR          NDA       ID1       ID2       ID3       ID4
      4.87439848E-08    2      1000022        22                       # Z2SS   -->  Z1SS   GM                 
      1.75106246E-02    2      1000022        23                       # Z2SS   -->  Z1SS   Z0                 
      9.33136278E-07    3      1000022         2        -2             # Z2SS   -->  Z1SS   UP     UB          
      1.75844559E-06    3      1000022         1        -1             # Z2SS   -->  Z1SS   DN     DB          
      1.75844502E-06    3      1000022         3        -3             # Z2SS   -->  Z1SS   ST     SB          
      9.33132242E-07    3      1000022         4        -4             # Z2SS   -->  Z1SS   CH     CB          
      2.79929441E-06    3      1000022         5        -5             # Z2SS   -->  Z1SS   BT     BB          
      5.06689503E-05    3      1000022        11       -11             # Z2SS   -->  Z1SS   E-     E+          
      5.06689212E-05    3      1000022        13       -13             # Z2SS   -->  Z1SS   MU-    MU+         
      5.11182989E-05    3      1000022        15       -15             # Z2SS   -->  Z1SS   TAU-   TAU+        
      5.87071881E-05    3      1000022        12       -12             # Z2SS   -->  Z1SS   NUE    ANUE        
      5.87071881E-05    3      1000022        14       -14             # Z2SS   -->  Z1SS   NUM    ANUM        
      5.90463678E-05    3      1000022        16       -16             # Z2SS   -->  Z1SS   NUT    ANUT        
      9.82152224E-01    2      1000022        25                       # Z2SS   -->  Z1SS   HL0                
#         PDG         Width
DECAY   1000025  4.83576870E+00   # Z3SS  decays
#          BR          NDA       ID1       ID2       ID3       ID4
      1.43106618E-07    2      1000022        22                       # Z3SS   -->  Z1SS   GM                 
      2.52602916E-07    2      1000023        22                       # Z3SS   -->  Z2SS   GM                 
      3.05365682E-01    2      1000024       -24                       # Z3SS   -->  W1SS+  W-                 
      3.05365682E-01    2     -1000024        24                       # Z3SS   -->  W1SS-  W+                 
      9.92086232E-02    2      1000022        23                       # Z3SS   -->  Z1SS   Z0                 
      2.73416013E-01    2      1000023        23                       # Z3SS   -->  Z2SS   Z0                 
      3.92592847E-09    3      1000022         2        -2             # Z3SS   -->  Z1SS   UP     UB          
      1.60047797E-09    3      1000022         1        -1             # Z3SS   -->  Z1SS   DN     DB          
      1.60047742E-09    3      1000022         3        -3             # Z3SS   -->  Z1SS   ST     SB          
      3.92590760E-09    3      1000022         4        -4             # Z3SS   -->  Z1SS   CH     CB          
      7.91312189E-08    3      1000022         5        -5             # Z3SS   -->  Z1SS   BT     BB          
      5.04754771E-09    3      1000022        15       -15             # Z3SS   -->  Z1SS   TAU-   TAU+        
      4.53118876E-09    3      1000023         2        -2             # Z3SS   -->  Z2SS   UP     UB          
      7.02618630E-09    3      1000023         1        -1             # Z3SS   -->  Z2SS   DN     DB          
      7.02618497E-09    3      1000023         3        -3             # Z3SS   -->  Z2SS   ST     SB          
      4.53116389E-09    3      1000023         4        -4             # Z3SS   -->  Z2SS   CH     CB          
      1.10112566E-07    3      1000023         5        -5             # Z3SS   -->  Z2SS   BT     BB          
      2.40331999E-09    3      1000023        15       -15             # Z3SS   -->  Z2SS   TAU-   TAU+        
      8.36753380E-03    2      1000022        25                       # Z3SS   -->  Z1SS   HL0                
      7.73640815E-03    2      1000023        25                       # Z3SS   -->  Z2SS   HL0                
      5.68300129E-06    2      1000011       -11                       # Z3SS   -->  EL-    E+                 
      5.68300129E-06    2     -1000011        11                       # Z3SS   -->  EL+    E-                 
      5.68298128E-06    2      1000013       -13                       # Z3SS   -->  MUL-   MU+                
      5.68298128E-06    2     -1000013        13                       # Z3SS   -->  MUL+   MU-                
      2.18044916E-05    2      2000011       -11                       # Z3SS   -->  ER-    E+                 
      2.18044916E-05    2     -2000011        11                       # Z3SS   -->  ER+    E-                 
      2.18044752E-05    2      2000013       -13                       # Z3SS   -->  MUR-   MU+                
      2.18044752E-05    2     -2000013        13                       # Z3SS   -->  MUR+   MU-                
      8.44834940E-05    2      1000015       -15                       # Z3SS   -->  TAU1-  TAU+               
      8.44834940E-05    2     -1000015        15                       # Z3SS   -->  TAU1+  TAU-               
      3.60656450E-05    2      2000015       -15                       # Z3SS   -->  TAU2-  TAU+               
      3.60656450E-05    2     -2000015        15                       # Z3SS   -->  TAU2+  TAU-               
      3.12217962E-05    2      1000012       -12                       # Z3SS   -->  NUEL   ANUE               
      3.12217962E-05    2     -1000012        12                       # Z3SS   -->  ANUEL  NUE                
      3.12217962E-05    2      1000014       -14                       # Z3SS   -->  NUML   ANUM               
      3.12217962E-05    2     -1000014        14                       # Z3SS   -->  ANUML  NUM                
      3.17592785E-05    2      1000016       -16                       # Z3SS   -->  NUTL   ANUT               
      3.17592785E-05    2     -1000016        16                       # Z3SS   -->  ANUTL  NUT                
#         PDG         Width
DECAY   1000035  5.04187918E+00   # Z4SS  decays
#          BR          NDA       ID1       ID2       ID3       ID4
      6.75071703E-07    2      1000022        22                       # Z4SS   -->  Z1SS   GM                 
      1.52413165E-07    2      1000023        22                       # Z4SS   -->  Z2SS   GM                 
      7.47679862E-10    2      1000025        22                       # Z4SS   -->  Z3SS   GM                 
      3.13517720E-01    2      1000024       -24                       # Z4SS   -->  W1SS+  W-                 
      3.13517720E-01    2     -1000024        24                       # Z4SS   -->  W1SS-  W+                 
      1.30323287E-11    3     -1000037         2        -1             # Z4SS   -->  W2SS-  UP     DB          
      4.34410927E-12    3     -1000037        12       -11             # Z4SS   -->  W2SS-  NUE    E+          
      4.34410927E-12    3     -1000037        14       -13             # Z4SS   -->  W2SS-  NUM    MU+         
      1.30323287E-11    3      1000037         1        -2             # Z4SS   -->  W2SS+  DN     UB          
      4.34410927E-12    3      1000037        11       -12             # Z4SS   -->  W2SS+  E-     ANUE        
      4.34410927E-12    3      1000037        13       -14             # Z4SS   -->  W2SS+  MU-    ANUM        
      1.30323287E-11    3     -1000037         4        -3             # Z4SS   -->  W2SS-  CH     SB          
      4.34410927E-12    3     -1000037        16       -15             # Z4SS   -->  W2SS-  NUT    TAU+        
      1.30323287E-11    3      1000037         3        -4             # Z4SS   -->  W2SS+  ST     CB          
      4.34410927E-12    3      1000037        15       -16             # Z4SS   -->  W2SS+  TAU-   ANUT        
      8.62439629E-03    2      1000022        23                       # Z4SS   -->  Z1SS   Z0                 
      8.80214758E-03    2      1000023        23                       # Z4SS   -->  Z2SS   Z0                 
      1.19644682E-07    3      1000022         2        -2             # Z4SS   -->  Z1SS   UP     UB          
      1.02486695E-07    3      1000022         1        -1             # Z4SS   -->  Z1SS   DN     DB          
      1.02486652E-07    3      1000022         3        -3             # Z4SS   -->  Z1SS   ST     SB          
      1.19644056E-07    3      1000022         4        -4             # Z4SS   -->  Z1SS   CH     CB          
      2.45951583E-07    3      1000022         5        -5             # Z4SS   -->  Z1SS   BT     BB          
      4.97196728E-09    3      1000022        15       -15             # Z4SS   -->  Z1SS   TAU-   TAU+        
      5.68357564E-07    3      1000023         2        -2             # Z4SS   -->  Z2SS   UP     UB          
      7.06125775E-07    3      1000023         1        -1             # Z4SS   -->  Z2SS   DN     DB          
      7.06125377E-07    3      1000023         3        -3             # Z4SS   -->  Z2SS   ST     SB          
      5.68354551E-07    3      1000023         4        -4             # Z4SS   -->  Z2SS   CH     CB          
      1.38909513E-06    3      1000023         5        -5             # Z4SS   -->  Z2SS   BT     BB          
      2.40759368E-09    3      1000023        15       -15             # Z4SS   -->  Z2SS   TAU-   TAU+        
      5.24405230E-08    3      1000025         2        -2             # Z4SS   -->  Z3SS   UP     UB          
      6.76527705E-08    3      1000025         1        -1             # Z4SS   -->  Z3SS   DN     DB          
      6.76527705E-08    3      1000025         3        -3             # Z4SS   -->  Z3SS   ST     SB          
      5.24405230E-08    3      1000025         4        -4             # Z4SS   -->  Z3SS   CH     CB          
      2.97357570E-08    3      1000025         5        -5             # Z4SS   -->  Z3SS   BT     BB          
      1.53431223E-08    3      1000025        11       -11             # Z4SS   -->  Z3SS   E-     E+          
      1.53431223E-08    3      1000025        13       -13             # Z4SS   -->  Z3SS   MU-    MU+         
      1.35778553E-08    3      1000025        15       -15             # Z4SS   -->  Z3SS   TAU-   TAU+        
      3.05279890E-08    3      1000025        12       -12             # Z4SS   -->  Z3SS   NUE    ANUE        
      3.05279890E-08    3      1000025        14       -14             # Z4SS   -->  Z3SS   NUM    ANUM        
      3.05279890E-08    3      1000025        16       -16             # Z4SS   -->  Z3SS   NUT    ANUT        
      8.89599994E-02    2      1000022        25                       # Z4SS   -->  Z1SS   HL0                
      2.54501253E-01    2      1000023        25                       # Z4SS   -->  Z2SS   HL0                
      4.74451401E-04    2      1000011       -11                       # Z4SS   -->  EL-    E+                 
      4.74451401E-04    2     -1000011        11                       # Z4SS   -->  EL+    E-                 
      4.74450295E-04    2      1000013       -13                       # Z4SS   -->  MUL-   MU+                
      4.74450295E-04    2     -1000013        13                       # Z4SS   -->  MUL+   MU-                
      2.84429785E-04    2      2000011       -11                       # Z4SS   -->  ER-    E+                 
      2.84429785E-04    2     -2000011        11                       # Z4SS   -->  ER+    E-                 
      2.84429581E-04    2      2000013       -13                       # Z4SS   -->  MUR-   MU+                
      2.84429581E-04    2     -2000013        13                       # Z4SS   -->  MUR+   MU-                
      3.03718756E-04    2      1000015       -15                       # Z4SS   -->  TAU1-  TAU+               
      3.03718756E-04    2     -1000015        15                       # Z4SS   -->  TAU1+  TAU-               
      5.33508079E-04    2      2000015       -15                       # Z4SS   -->  TAU2-  TAU+               
      5.33508079E-04    2     -2000015        15                       # Z4SS   -->  TAU2+  TAU-               
      1.22139719E-03    2      1000012       -12                       # Z4SS   -->  NUEL   ANUE               
      1.22139719E-03    2     -1000012        12                       # Z4SS   -->  ANUEL  NUE                
      1.22139719E-03    2      1000014       -14                       # Z4SS   -->  NUML   ANUM               
      1.22139719E-03    2     -1000014        14                       # Z4SS   -->  ANUML  NUM                
      1.23768300E-03    2      1000016       -16                       # Z4SS   -->  NUTL   ANUT               
      1.23768300E-03    2     -1000016        16                       # Z4SS   -->  ANUTL  NUT                
#         PDG         Width
DECAY   1000024  1.50710093E-02   # W1SS+ decays
#          BR          NDA       ID1       ID2       ID3       ID4
      3.58205057E-06    3      1000022         2        -1             # W1SS+  -->  Z1SS   UP     DB          
      3.58204443E-06    3      1000022         4        -3             # W1SS+  -->  Z1SS   CH     SB          
      1.49349726E-04    3      1000022       -11        12             # W1SS+  -->  Z1SS   E+     NUE         
      1.49349682E-04    3      1000022       -13        14             # W1SS+  -->  Z1SS   MU+    NUM         
      1.50563836E-04    3      1000022       -15        16             # W1SS+  -->  Z1SS   TAU+   NUT         
      9.99543607E-01    2      1000022        24                       # W1SS+  -->  Z1SS   W+                 
#         PDG         Width
DECAY   1000037  5.10069132E+00   # W2SS+ decays
#          BR          NDA       ID1       ID2       ID3       ID4
      1.35276210E-07    3      1000022         2        -1             # W2SS+  -->  Z1SS   UP     DB          
      1.35276011E-07    3      1000022         4        -3             # W2SS+  -->  Z1SS   CH     SB          
      3.67717878E-09    3      1000022       -15        16             # W2SS+  -->  Z1SS   TAU+   NUT         
      7.48293772E-02    2      1000022        24                       # W2SS+  -->  Z1SS   W+                 
      5.23773735E-07    3      1000023         2        -1             # W2SS+  -->  Z2SS   UP     DB          
      5.23772883E-07    3      1000023         4        -3             # W2SS+  -->  Z2SS   CH     SB          
      3.58813868E-09    3      1000023       -15        16             # W2SS+  -->  Z2SS   TAU+   NUT         
      3.30855459E-01    2      1000023        24                       # W2SS+  -->  Z2SS   W+                 
      8.25680644E-08    3      1000025         2        -1             # W2SS+  -->  Z3SS   UP     DB          
      8.25680644E-08    3      1000025         4        -3             # W2SS+  -->  Z3SS   CH     SB          
      2.75211658E-08    3      1000025       -11        12             # W2SS+  -->  Z3SS   E+     NUE         
      2.75211658E-08    3      1000025       -13        14             # W2SS+  -->  Z3SS   MU+    NUM         
      2.75211658E-08    3      1000025       -15        16             # W2SS+  -->  Z3SS   TAU+   NUT         
      1.13942416E-03    2      1000012       -11                       # W2SS+  -->  NUEL   E+                 
      1.13942346E-03    2      1000014       -13                       # W2SS+  -->  NUML   MU+                
      1.21930847E-03    2      1000016       -15                       # W2SS+  -->  NUTL   TAU+               
      1.91722740E-03    2     -1000011        12                       # W2SS+  -->  EL+    NUE                
      1.91722461E-03    2     -1000013        14                       # W2SS+  -->  MUL+   NUM                
      5.92571632E-05    2     -1000015        16                       # W2SS+  -->  TAU1+  NUT                
      1.97138335E-03    2     -2000015        16                       # W2SS+  -->  TAU2+  NUT                
      3.07869345E-01    2      1000024        23                       # W2SS+  -->  W1SS+  Z0                 
      6.27932991E-07    3      1000024         1        -1             # W2SS+  -->  W1SS+  DN     DB          
      6.27929637E-07    3      1000024         3        -3             # W2SS+  -->  W1SS+  ST     SB          
      1.14111128E-06    3      1000024         2        -2             # W2SS+  -->  W1SS+  UP     UB          
      1.14111094E-06    3      1000024         4        -4             # W2SS+  -->  W1SS+  CH     CB          
      2.77077466E-01    2      1000024        25                       # W2SS+  -->  W1SS+  HL0                
#         PDG         Width
DECAY        25  3.53189604E-03   # HL0   decays
#          BR          NDA       ID1       ID2       ID3       ID4
      5.07461273E-09    2           11       -11                       # HL0    -->  E-     E+                 
      2.14257932E-04    2           13       -13                       # HL0    -->  MU-    MU+                
      6.12538457E-02    2           15       -15                       # HL0    -->  TAU-   TAU+               
      6.38158917E-06    2            1        -1                       # HL0    -->  DN     DB                 
      2.57848063E-03    2            3        -3                       # HL0    -->  ST     SB                 
      8.60572040E-01    2            5        -5                       # HL0    -->  BT     BB                 
      1.95188750E-06    2            2        -2                       # HL0    -->  UP     UB                 
      3.74746621E-02    2            4        -4                       # HL0    -->  CH     CB                 
      1.33369071E-03    2           22        22                       # HL0    -->  GM     GM                 
      3.07995342E-02    2           21        21                       # HL0    -->  GL     GL                 
      3.15948215E-04    3           24        11       -12             # HL0    -->  W+     E-     ANUE        
      3.15948215E-04    3           24        13       -14             # HL0    -->  W+     MU-    ANUM        
      3.15948215E-04    3           24        15       -16             # HL0    -->  W+     TAU-   ANUT        
      9.47844645E-04    3           24        -2         1             # HL0    -->  W+     UB     DN          
      9.47844645E-04    3           24        -4         3             # HL0    -->  W+     CB     ST          
      3.15948215E-04    3          -24       -11        12             # HL0    -->  W-     E+     NUE         
      3.15948215E-04    3          -24       -13        14             # HL0    -->  W-     MU+    NUM         
      3.15948215E-04    3          -24       -15        16             # HL0    -->  W-     TAU+   NUT         
      9.47844645E-04    3          -24         2        -1             # HL0    -->  W-     UP     DB          
      9.47844645E-04    3          -24         4        -3             # HL0    -->  W-     CH     SB          
      5.34034052E-06    3           23        12       -12             # HL0    -->  Z0     NUE    ANUE        
      5.34034052E-06    3           23        14       -14             # HL0    -->  Z0     NUM    ANUM        
      5.34034052E-06    3           23        16       -16             # HL0    -->  Z0     NUT    ANUT        
      2.68773965E-06    3           23        11       -11             # HL0    -->  Z0     E-     E+          
      2.68773965E-06    3           23        13       -13             # HL0    -->  Z0     MU-    MU+         
      2.68773965E-06    3           23        15       -15             # HL0    -->  Z0     TAU-   TAU+        
      9.20796811E-06    3           23         2        -2             # HL0    -->  Z0     UP     UB          
      9.20796811E-06    3           23         4        -4             # HL0    -->  Z0     CH     CB          
      1.18621319E-05    3           23         1        -1             # HL0    -->  Z0     DN     DB          
      1.18621319E-05    3           23         3        -3             # HL0    -->  Z0     ST     SB          
      1.18621319E-05    3           23         5        -5             # HL0    -->  Z0     BT     BB          
#         PDG         Width
DECAY        35  4.82362795E+00   # HH0   decays
#          BR          NDA       ID1       ID2       ID3       ID4
      2.76838691E-10    2           11       -11                       # HH0    -->  E-     E+                 
      1.16886285E-05    2           13       -13                       # HH0    -->  MU-    MU+                
      3.34771979E-03    2           15       -15                       # HH0    -->  TAU-   TAU+               
      3.39521222E-07    2            1        -1                       # HH0    -->  DN     DB                 
      1.37183757E-04    2            3        -3                       # HH0    -->  ST     SB                 
      1.96514726E-02    2            5        -5                       # HH0    -->  BT     BB                 
      1.40303191E-09    2            2        -2                       # HH0    -->  UP     UB                 
      2.00849881E-05    2            4        -4                       # HH0    -->  CH     CB                 
      8.69140506E-01    2            6        -6                       # HH0    -->  TP     TB                 
      7.10783752E-06    2           22        22                       # HH0    -->  GM     GM                 
      7.10100227E-04    2           21        21                       # HH0    -->  GL     GL                 
      2.01544934E-03    2           24       -24                       # HH0    -->  W+     W-                 
      1.01974467E-03    2           23        23                       # HH0    -->  Z0     Z0                 
      1.65580341E-03    2      1000022   1000022                       # HH0    -->  Z1SS   Z1SS               
      8.10765475E-03    2      1000022   1000023                       # HH0    -->  Z1SS   Z2SS               
      5.94713576E-02    2      1000022   1000025                       # HH0    -->  Z1SS   Z3SS               
      2.50769523E-03    2      1000022   1000035                       # HH0    -->  Z1SS   Z4SS               
      8.04450642E-03    2      1000023   1000023                       # HH0    -->  Z2SS   Z2SS               
      1.82859115E-02    2      1000024  -1000024                       # HH0    -->  W1SS+  W1SS-              
      5.86572336E-03    2           25        25                       # HH0    -->  HL0    HL0                
#         PDG         Width
DECAY        36  5.75852823E+00   # HA0   decays
#          BR          NDA       ID1       ID2       ID3       ID4
      2.30955116E-10    2           11       -11                       # HA0    -->  E-     E+                 
      9.75134208E-06    2           13       -13                       # HA0    -->  MU-    MU+                
      2.79291067E-03    2           15       -15                       # HA0    -->  TAU-   TAU+               
      2.83269486E-07    2            1        -1                       # HA0    -->  DN     DB                 
      1.14455208E-04    2            3        -3                       # HA0    -->  ST     SB                 
      1.63966063E-02    2            5        -5                       # HA0    -->  BT     BB                 
      1.11897580E-09    2            2        -2                       # HA0    -->  UP     UB                 
      1.60352683E-05    2            4        -4                       # HA0    -->  CH     CB                 
      8.00957143E-01    2            6        -6                       # HA0    -->  TP     TB                 
      1.99947976E-06    2           22        22                       # HA0    -->  GM     GM                 
      5.89114032E-04    2           21        21                       # HA0    -->  GL     GL                 
      3.39000020E-03    2      1000022   1000022                       # HA0    -->  Z1SS   Z1SS               
      2.22499967E-02    2      1000022   1000023                       # HA0    -->  Z1SS   Z2SS               
      3.14803515E-03    2      1000022   1000025                       # HA0    -->  Z1SS   Z3SS               
      3.48193869E-02    2      1000022   1000035                       # HA0    -->  Z1SS   Z4SS               
      3.49727832E-02    2      1000023   1000023                       # HA0    -->  Z2SS   Z2SS               
      7.89161697E-02    2      1000024  -1000024                       # HA0    -->  W1SS+  W1SS-              
      1.62535207E-03    2           25        23                       # HA0    -->  HL0    Z0                 
#         PDG         Width
DECAY        37  4.60815334E+00   # H+    decays
#          BR          NDA       ID1       ID2       ID3       ID4
      2.91690033E-10    2           12       -11                       # H+     -->  NUE    E+                 
      1.23156797E-05    2           14       -13                       # H+     -->  NUM    MU+                
      3.52737075E-03    2           16       -15                       # H+     -->  NUT    TAU+               
      3.29749128E-07    2            2        -1                       # H+     -->  UP     DB                 
      1.51279557E-04    2            4        -3                       # H+     -->  CH     SB                 
      9.20282781E-01    2            6        -5                       # H+     -->  TP     BB                 
      3.38665955E-02    2      1000024   1000022                       # H+     -->  W1SS+  Z1SS               
      1.05608815E-04    2      1000024   1000023                       # H+     -->  W1SS+  Z2SS               
      3.99652086E-02    2      1000037   1000022                       # H+     -->  W2SS+  Z1SS               
      2.08853907E-03    2           25        24                       # H+     -->  HL0    W+                 
