  65
  401   1943.6345    0.38061E-25
  402   1942.0270    0.37923E-25
  403   1943.6246    0.38062E-25
  404   1942.0175    0.37924E-25
  405   1789.7363    0.22959E-25
  406   1524.3868    0.53263E-25
  407   1943.6345    0.38061E-25
  408   1942.0270    0.37923E-25
  409   1943.6246    0.38062E-25
  410   1942.0175    0.37924E-25
  411   1789.7363    0.22959E-25
  412   1524.3868    0.53263E-25
  413   1853.9497    0.69768E-24
  414   1862.4723    0.17345E-24
  415   1853.9497    0.69768E-24
  416   1862.4628    0.17345E-24
  417   1846.3024    0.27032E-24
  418   1816.5386    0.21482E-25
  419   1853.9497    0.69768E-24
  420   1862.4723    0.17345E-24
  421   1853.9497    0.69768E-24
  422   1862.4628    0.17345E-24
  423   1846.3024    0.27032E-24
  424   1816.5386    0.21482E-25
  425    650.3630    0.21199E-23
  426    645.5427    0.20966E-23
  427    650.3461    0.21201E-23
  428    645.5256    0.20968E-23
  429    360.7489    0.11041E-09
  430    644.0032    0.12530E-23
  431    650.3630    0.21199E-23
  432    645.5427    0.20966E-23
  433    650.3461    0.21201E-23
  434    645.5256    0.20968E-23
  435    360.7489    0.11041E-09
  436    644.0032    0.12530E-23
  437    367.8529    0.20270E-22
  438      0.0000    0.10000E+31
  439    369.0287    0.35081E-14
  440      0.0000    0.10000E+31
  441    649.9491    0.12182E-23
  442      0.0000    0.10000E+31
  443    367.8529    0.20270E-22
  444      0.0000    0.10000E+31
  445    369.0287    0.35081E-14
  446      0.0000    0.10000E+31
  447    649.9491    0.12182E-23
  448      0.0000    0.10000E+31
  449   2138.8301    0.18033E-25
  450    416.1240    0.20149E-23
  451    778.5060    0.35623E-24
  452  -1126.4366    0.97245E-25
  453   1137.3309    0.90319E-25
  454    778.6297    0.35577E-24
  455   1137.0435    0.91057E-25
  456    778.6297    0.35577E-24
  457   1137.0435    0.91057E-25
  203    120.4326    0.12171E-21
  204   1247.8073    0.17163E-24
  205   1246.0800    0.16959E-24
  206   1250.2167    0.18844E-24
  207   1250.2167    0.18844E-24
  458      0.0000    0.10000E+31
    6    173.3000    0.56017E-24
   12    173.3000    0.56017E-24
   6
   401  0.15323155E-01     0   450     1     0     0     0
   401  0.32118809E+00     0   451     1     0     0     0
   401  0.18326678E-03     0   452     1     0     0     0
   401  0.69418941E-02     0   453     1     0     0     0
   401  0.63968581E+00     0   456     2     0     0     0
   401  0.16677799E-01     0   457     2     0     0     0
   6
   402  0.13476893E-01     0   450     2     0     0     0
   402  0.32304531E+00     0   451     2     0     0     0
   402  0.11023597E-03     0   452     2     0     0     0
   402  0.56744008E-02     0   453     2     0     0     0
   402  0.64853734E+00     0   454     1     0     0     0
   402  0.91558425E-02     0   455     1     0     0     0
   6
   403  0.15323214E-01     0   450     3     0     0     0
   403  0.32118842E+00     0   451     3     0     0     0
   403  0.18326580E-03     0   452     3     0     0     0
   403  0.69418531E-02     0   453     3     0     0     0
   403  0.63968563E+00     0   456     4     0     0     0
   403  0.16677663E-01     0   457     4     0     0     0
   6
   404  0.13476923E-01     0   450     4     0     0     0
   404  0.32304505E+00     0   451     4     0     0     0
   404  0.11023509E-03     0   452     4     0     0     0
   404  0.56743533E-02     0   453     4     0     0     0
   404  0.64853764E+00     0   454     3     0     0     0
   404  0.91557866E-02     0   455     3     0     0     0
   7
   405  0.95566614E-02     0   450     5     0     0     0
   405  0.16572063E+00     0   451     5     0     0     0
   405  0.60094399E-02     0   452     5     0     0     0
   405  0.75772167E-02     0   453     5     0     0     0
   405  0.31924820E+00     0   456     6     0     0     0
   405  0.31027722E+00     0   457     6     0     0     0
   405  0.18161061E+00     0   199   406     0     0     0
   6
   406  0.22023170E+00     0   450     6     0     0     0
   406  0.57065338E-01     0   451     6     0     0     0
   406  0.19660793E+00     0   452     6     0     0     0
   406  0.10817875E+00     0   453     6     0     0     0
   406  0.12318183E+00     0   454     5     0     0     0
   406  0.29473448E+00     0   455     5     0     0     0
   6
   407  0.15323155E-01     0   450     7     0     0     0
   407  0.32118809E+00     0   451     7     0     0     0
   407  0.18326678E-03     0   452     7     0     0     0
   407  0.69418941E-02     0   453     7     0     0     0
   407  0.63968581E+00     0   454     8     0     0     0
   407  0.16677799E-01     0   455     8     0     0     0
   6
   408  0.13476893E-01     0   450     8     0     0     0
   408  0.32304531E+00     0   451     8     0     0     0
   408  0.11023597E-03     0   452     8     0     0     0
   408  0.56744008E-02     0   453     8     0     0     0
   408  0.64853734E+00     0   456     7     0     0     0
   408  0.91558425E-02     0   457     7     0     0     0
   6
   409  0.15323214E-01     0   450     9     0     0     0
   409  0.32118842E+00     0   451     9     0     0     0
   409  0.18326580E-03     0   452     9     0     0     0
   409  0.69418531E-02     0   453     9     0     0     0
   409  0.63968563E+00     0   454    10     0     0     0
   409  0.16677663E-01     0   455    10     0     0     0
   6
   410  0.13476923E-01     0   450    10     0     0     0
   410  0.32304505E+00     0   451    10     0     0     0
   410  0.11023509E-03     0   452    10     0     0     0
   410  0.56743533E-02     0   453    10     0     0     0
   410  0.64853764E+00     0   456     9     0     0     0
   410  0.91557866E-02     0   457     9     0     0     0
   7
   411  0.95566614E-02     0   450    11     0     0     0
   411  0.16572063E+00     0   451    11     0     0     0
   411  0.60094399E-02     0   452    11     0     0     0
   411  0.75772167E-02     0   453    11     0     0     0
   411  0.31924820E+00     0   454    12     0     0     0
   411  0.31027722E+00     0   455    12     0     0     0
   411  0.18161061E+00     0   198   412     0     0     0
   6
   412  0.22023170E+00     0   450    12     0     0     0
   412  0.57065338E-01     0   451    12     0     0     0
   412  0.19660793E+00     0   452    12     0     0     0
   412  0.10817875E+00     0   453    12     0     0     0
   412  0.12318183E+00     0   456    11     0     0     0
   412  0.29473448E+00     0   457    11     0     0     0
   4
   413  0.99875128E+00     0   450     1     0     0     0
   413  0.16009087E-03     0   451     1     0     0     0
   413  0.14255561E-03     0   452     1     0     0     0
   413  0.94610767E-03     0   453     1     0     0     0
   4
   414  0.99873984E+00     0   450     2     0     0     0
   414  0.16055997E-03     0   451     2     0     0     0
   414  0.14394203E-03     0   452     2     0     0     0
   414  0.95562538E-03     0   453     2     0     0     0
   4
   415  0.99875128E+00     0   450     3     0     0     0
   415  0.16009087E-03     0   451     3     0     0     0
   415  0.14255561E-03     0   452     3     0     0     0
   415  0.94610767E-03     0   453     3     0     0     0
   4
   416  0.99873984E+00     0   450     4     0     0     0
   416  0.16055939E-03     0   451     4     0     0     0
   416  0.14394028E-03     0   452     4     0     0     0
   416  0.95561339E-03     0   453     4     0     0     0
   7
   417  0.37203297E+00     0   450     5     0     0     0
   417  0.18886732E-01     0   451     5     0     0     0
   417  0.84387906E-01     0   452     5     0     0     0
   417  0.95403381E-01     0   453     5     0     0     0
   417  0.37040535E-01     0   456     6     0     0     0
   417  0.30866730E+00     0   457     6     0     0     0
   417  0.83581224E-01     0   199   406     0     0     0
   8
   418  0.26643652E+00     0   454     5     0     0     0
   418  0.58262378E-01     0   455     5     0     0     0
   418  0.10371099E+00     0   200   406     0     0     0
   418  0.10896417E+00     0   203   406     0     0     0
   418  0.12728538E-01     0   450     6     0     0     0
   418  0.12910312E+00     0   451     6     0     0     0
   418  0.13680261E+00     0   452     6     0     0     0
   418  0.18399164E+00     0   453     6     0     0     0
   4
   419  0.99875128E+00     0   450     7     0     0     0
   419  0.16009087E-03     0   451     7     0     0     0
   419  0.14255561E-03     0   452     7     0     0     0
   419  0.94610767E-03     0   453     7     0     0     0
   4
   420  0.99873984E+00     0   450     8     0     0     0
   420  0.16055997E-03     0   451     8     0     0     0
   420  0.14394203E-03     0   452     8     0     0     0
   420  0.95562538E-03     0   453     8     0     0     0
   4
   421  0.99875128E+00     0   450     9     0     0     0
   421  0.16009087E-03     0   451     9     0     0     0
   421  0.14255561E-03     0   452     9     0     0     0
   421  0.94610767E-03     0   453     9     0     0     0
   4
   422  0.99873984E+00     0   450    10     0     0     0
   422  0.16055939E-03     0   451    10     0     0     0
   422  0.14394028E-03     0   452    10     0     0     0
   422  0.95561339E-03     0   453    10     0     0     0
   7
   423  0.37203297E+00     0   450    11     0     0     0
   423  0.18886732E-01     0   451    11     0     0     0
   423  0.84387906E-01     0   452    11     0     0     0
   423  0.95403381E-01     0   453    11     0     0     0
   423  0.37040535E-01     0   454    12     0     0     0
   423  0.30866730E+00     0   455    12     0     0     0
   423  0.83581224E-01     0   198   412     0     0     0
   8
   424  0.26643652E+00     0   456    11     0     0     0
   424  0.58262378E-01     0   457    11     0     0     0
   424  0.10371099E+00     0   200   412     0     0     0
   424  0.10896417E+00     0   203   412     0     0     0
   424  0.12728538E-01     0   450    12     0     0     0
   424  0.12910312E+00     0   451    12     0     0     0
   424  0.13680261E+00     0   452    12     0     0     0
   424  0.18399164E+00     0   453    12     0     0     0
   2
   425  0.90754569E+00     0   450   121     0     0     0
   425  0.92454381E-01     0   121   130     0     0     0
   2
   426  0.90923965E+00     0   450   122     0     0     0
   426  0.90760455E-01     0   129   121     0     0     0
   2
   427  0.90753961E+00     0   450   123     0     0     0
   427  0.92460454E-01     0   121   128     0     0     0
   2
   428  0.90923339E+00     0   450   124     0     0     0
   428  0.90766676E-01     0   127   121     0     0     0
   3
   429  0.24486897E-02     0   125   130     0     0     0
   429  0.49876359E+00     0   125   124     0     0     0
   429  0.49878770E+00     0   123   126     0     0     0
   2
   430  0.53839773E+00     0   450   126     0     0     0
   430  0.46160215E+00     0   198   429     0     0     0
   2
   431  0.90754569E+00     0   450   127     0     0     0
   431  0.92454381E-01     0   127   124     0     0     0
   2
   432  0.90923965E+00     0   450   128     0     0     0
   432  0.90760455E-01     0   123   127     0     0     0
   2
   433  0.90753961E+00     0   450   129     0     0     0
   433  0.92460454E-01     0   127   122     0     0     0
   2
   434  0.90923339E+00     0   450   130     0     0     0
   434  0.90766676E-01     0   121   127     0     0     0
   3
   435  0.24486897E-02     0   131   124     0     0     0
   435  0.49876359E+00     0   131   130     0     0     0
   435  0.49878770E+00     0   129   132     0     0     0
   2
   436  0.53839773E+00     0   450   132     0     0     0
   436  0.46160215E+00     0   199   435     0     0     0
   2
   437  0.49999994E+00     0   123   122     0     0     0
   437  0.50000006E+00     0   121   124     0     0     0
   0
   2
   439  0.43383497E+00     0   429   123   131     0     0
   439  0.56616503E+00     0   435   123   125     0     0
   0
   3
   441  0.52613765E+00     0   450   125     0     0     0
   441  0.22780654E+00     0   200   429     0     0     0
   441  0.24605581E+00     0   203   429     0     0     0
   0
   2
   443  0.49999994E+00     0   129   128     0     0     0
   443  0.50000006E+00     0   127   130     0     0     0
   0
   2
   445  0.43383497E+00     0   435   129   125     0     0
   445  0.56616503E+00     0   429   129   131     0     0
   0
   3
   447  0.52613765E+00     0   450   131     0     0     0
   447  0.22780654E+00     0   200   435     0     0     0
   447  0.24605581E+00     0   203   435     0     0     0
   0
  24
   449  0.19288452E-01     0   408     2     0     0     0
   449  0.19288452E-01     0   402     8     0     0     0
   449  0.18989576E-01     0   407     1     0     0     0
   449  0.18989576E-01     0   401     7     0     0     0
   449  0.36565959E-01     0   420     2     0     0     0
   449  0.36565959E-01     0   414     8     0     0     0
   449  0.38690690E-01     0   419     1     0     0     0
   449  0.38690690E-01     0   413     7     0     0     0
   449  0.18991401E-01     0   409     3     0     0     0
   449  0.18991401E-01     0   403     9     0     0     0
   449  0.38690683E-01     0   421     3     0     0     0
   449  0.38690683E-01     0   415     9     0     0     0
   449  0.19289816E-01     0   410     4     0     0     0
   449  0.19289816E-01     0   404    10     0     0     0
   449  0.36567919E-01     0   422     4     0     0     0
   449  0.36567919E-01     0   416    10     0     0     0
   449  0.55986725E-01     0   411     5     0     0     0
   449  0.55986725E-01     0   405    11     0     0     0
   449  0.40849973E-01     0   423     5     0     0     0
   449  0.40849973E-01     0   417    11     0     0     0
   449  0.12136914E+00     0   412     6     0     0     0
   449  0.12136914E+00     0   406    12     0     0     0
   449  0.54719649E-01     0   424     6     0     0     0
   449  0.54719649E-01     0   418    12     0     0     0
   6
   450  0.15430604E+00     0   437   127     0     0     0
   450  0.15430604E+00     0   443   121     0     0     0
   450  0.14732096E+00     0   439   129     0     0     0
   450  0.14732096E+00     0   445   123     0     0     0
   450  0.19837297E+00     0   429   131     0     0     0
   450  0.19837297E+00     0   435   125     0     0     0
  20
   451  0.65243250E-03     0   450   200     0     0     0
   451  0.11790273E-01     0   450   203     0     0     0
   451  0.79660356E-01     0   425   127     0     0     0
   451  0.79660356E-01     0   431   121     0     0     0
   451  0.79679474E-01     0   427   129     0     0     0
   451  0.79679474E-01     0   433   123     0     0     0
   451  0.13735845E-03     0   437   127     0     0     0
   451  0.13735845E-03     0   443   121     0     0     0
   451  0.13685330E-03     0   439   129     0     0     0
   451  0.13685330E-03     0   445   123     0     0     0
   451  0.54823998E-02     0   429   131     0     0     0
   451  0.54823998E-02     0   435   125     0     0     0
   451  0.79547867E-01     0   441   131     0     0     0
   451  0.79547867E-01     0   447   125     0     0     0
   451  0.82459025E-01     0   426   128     0     0     0
   451  0.82459025E-01     0   432   122     0     0     0
   451  0.82478188E-01     0   428   130     0     0     0
   451  0.82478188E-01     0   434   124     0     0     0
   451  0.84197164E-01     0   430   132     0     0     0
   451  0.84197164E-01     0   436   126     0     0     0
  24
   452  0.29049766E+00     0   454   199     0     0     0
   452  0.29049766E+00     0   456   198     0     0     0
   452  0.10373534E+00     0   450   200     0     0     0
   452  0.27430871E+00     0   451   200     0     0     0
   452  0.14063171E-01     0   450   203     0     0     0
   452  0.55084880E-02     0   451   203     0     0     0
   452  0.42250354E-04     0   425   127     0     0     0
   452  0.42250354E-04     0   431   121     0     0     0
   452  0.42252552E-04     0   427   129     0     0     0
   452  0.42252552E-04     0   433   123     0     0     0
   452  0.10895234E-03     0   437   127     0     0     0
   452  0.10895234E-03     0   443   121     0     0     0
   452  0.10878584E-03     0   439   129     0     0     0
   452  0.10878584E-03     0   445   123     0     0     0
   452  0.61507956E-02     0   429   131     0     0     0
   452  0.61507956E-02     0   435   125     0     0     0
   452  0.36189088E-02     0   441   131     0     0     0
   452  0.36189088E-02     0   447   125     0     0     0
   452  0.20720871E-03     0   426   128     0     0     0
   452  0.20720871E-03     0   432   122     0     0     0
   452  0.20721939E-03     0   428   130     0     0     0
   452  0.20721939E-03     0   434   124     0     0     0
   452  0.20817529E-03     0   430   132     0     0     0
   452  0.20817529E-03     0   436   126     0     0     0
  24
   453  0.28345457E+00     0   454   199     0     0     0
   453  0.28345457E+00     0   456   198     0     0     0
   453  0.13676180E-01     0   450   200     0     0     0
   453  0.65994593E-02     0   451   200     0     0     0
   453  0.91536768E-01     0   450   203     0     0     0
   453  0.24360944E+00     0   451   203     0     0     0
   453  0.33434932E-02     0   425   127     0     0     0
   453  0.33434932E-02     0   431   121     0     0     0
   453  0.33436622E-02     0   427   129     0     0     0
   453  0.33436622E-02     0   433   123     0     0     0
   453  0.69694058E-03     0   437   127     0     0     0
   453  0.69694058E-03     0   443   121     0     0     0
   453  0.69589820E-03     0   439   129     0     0     0
   453  0.69589820E-03     0   445   123     0     0     0
   453  0.52875332E-02     0   429   131     0     0     0
   453  0.52875332E-02     0   435   125     0     0     0
   453  0.70823859E-02     0   441   131     0     0     0
   453  0.70823859E-02     0   447   125     0     0     0
   453  0.61188648E-02     0   426   128     0     0     0
   453  0.61188648E-02     0   432   122     0     0     0
   453  0.61191716E-02     0   428   130     0     0     0
   453  0.61191716E-02     0   434   124     0     0     0
   453  0.61466047E-02     0   430   132     0     0     0
   453  0.61466047E-02     0   436   126     0     0     0
   8
   454  0.12245677E-01     0   450   198     0     0     0
   454  0.16925220E+00     0   426   127     0     0     0
   454  0.16929145E+00     0   428   129     0     0     0
   454  0.17311586E+00     0   430   131     0     0     0
   454  0.15532690E+00     0   431   122     0     0     0
   454  0.15536419E+00     0   433   124     0     0     0
   454  0.10595216E-01     0   435   126     0     0     0
   454  0.15480852E+00     0   447   126     0     0     0
  11
   455  0.10293688E+00     0   450   198     0     0     0
   455  0.28926441E+00     0   451   198     0     0     0
   455  0.68429960E-02     0   426   127     0     0     0
   455  0.68433397E-02     0   428   129     0     0     0
   455  0.13324165E-01     0   430   131     0     0     0
   455  0.12212016E-01     0   431   122     0     0     0
   455  0.12212634E-01     0   433   124     0     0     0
   455  0.92665758E-02     0   435   126     0     0     0
   455  0.13432077E-01     0   447   126     0     0     0
   455  0.27946573E+00     0   454   200     0     0     0
   455  0.25419918E+00     0   454   203     0     0     0
   8
   456  0.12245677E-01     0   450   199     0     0     0
   456  0.16925220E+00     0   432   121     0     0     0
   456  0.16929145E+00     0   434   123     0     0     0
   456  0.17311586E+00     0   436   125     0     0     0
   456  0.15532690E+00     0   425   128     0     0     0
   456  0.15536419E+00     0   427   130     0     0     0
   456  0.10595216E-01     0   429   132     0     0     0
   456  0.15480852E+00     0   441   132     0     0     0
  11
   457  0.10293688E+00     0   450   199     0     0     0
   457  0.28926441E+00     0   451   199     0     0     0
   457  0.68429960E-02     0   432   121     0     0     0
   457  0.68433397E-02     0   434   123     0     0     0
   457  0.13324165E-01     0   436   125     0     0     0
   457  0.12212016E-01     0   425   128     0     0     0
   457  0.12212634E-01     0   427   130     0     0     0
   457  0.92665758E-02     0   429   132     0     0     0
   457  0.13432077E-01     0   441   132     0     0     0
   457  0.27946573E+00     0   456   200     0     0     0
   457  0.25419918E+00     0   456   203     0     0     0
  28
   203  0.16558392E-03     0   123   129     0     0     0
   203  0.47364056E-01     0   125   131     0     0     0
   203  0.19874612E-02     0     3     9     0     0     0
   203  0.78079462E+00     0     5    11     0     0     0
   203  0.38267642E-01     0     4    10     0     0     0
   203  0.16813389E-02     0    59    59     0     0     0
   203  0.33510752E-01     0    13    13     0     0     0
   203  0.49078455E-02     0   198   121   128     0     0
   203  0.49078455E-02     0   198   123   130     0     0
   203  0.49078455E-02     0   198   125   132     0     0
   203  0.14723537E-01     0   198     8     1     0     0
   203  0.14723537E-01     0   198    10     3     0     0
   203  0.49078455E-02     0   199   127   122     0     0
   203  0.49078455E-02     0   199   129   124     0     0
   203  0.49078455E-02     0   199   131   126     0     0
   203  0.14723537E-01     0   199     2     7     0     0
   203  0.14723537E-01     0   199     4     9     0     0
   203  0.53944194E-03     0   200   122   128     0     0
   203  0.53944194E-03     0   200   124   130     0     0
   203  0.53944194E-03     0   200   126   132     0     0
   203  0.27149569E-03     0   200   121   127     0     0
   203  0.27149569E-03     0   200   123   129     0     0
   203  0.27149569E-03     0   200   125   131     0     0
   203  0.93012128E-03     0   200     2     8     0     0
   203  0.93012128E-03     0   200     4    10     0     0
   203  0.11982253E-02     0   200     1     7     0     0
   203  0.11982253E-02     0   200     3     9     0     0
   203  0.11982253E-02     0   200     5    11     0     0
  16
   204  0.21765870E-03     0   123   129     0     0     0
   204  0.62340036E-01     0   125   131     0     0     0
   204  0.25471500E-02     0     3     9     0     0     0
   204  0.74040437E+00     0     5    11     0     0     0
   204  0.17935614E+00     0     6    12     0     0     0
   204  0.73918207E-04     0    13    13     0     0     0
   204  0.28135191E-03     0   198   199     0     0     0
   204  0.14036227E-03     0   200   200     0     0     0
   204  0.69583836E-03     0   450   450     0     0     0
   204  0.42398414E-03     0   450   451     0     0     0
   204  0.53937628E-03     0   203   203     0     0     0
   204  0.35645557E-04     0   437   443     0     0     0
   204  0.35565885E-04     0   439   445     0     0     0
   204  0.35659532E-03     0   429   435     0     0     0
   204  0.62760049E-02     0   429   447     0     0     0
   204  0.62760049E-02     0   441   435     0     0     0
  12
   205  0.21482947E-03     0   123   129     0     0     0
   205  0.61530206E-01     0   125   131     0     0     0
   205  0.25140685E-02     0     3     9     0     0     0
   205  0.73092508E+00     0     5    11     0     0     0
   205  0.18440883E+00     0     6    12     0     0     0
   205  0.13179098E-03     0    13    13     0     0     0
   205  0.14965951E-02     0   450   450     0     0     0
   205  0.59080976E-02     0   450   451     0     0     0
   205  0.27205006E-03     0   203   200     0     0     0
   205  0.17652092E-03     0   429   435     0     0     0
   205  0.62109381E-02     0   429   447     0     0     0
   205  0.62109381E-02     0   441   435     0     0     0
   7
   206  0.23951073E-03     0   124   129     0     0     0
   206  0.68599261E-01     0   126   131     0     0     0
   206  0.25853151E-02     0     4     9     0     0     0
   206  0.90665448E+00     0     6    11     0     0     0
   206  0.71905726E-02     0   454   450     0     0     0
   206  0.30578842E-03     0   203   198     0     0     0
   206  0.14425145E-01     0   435   430     0     0     0
   7
   207  0.23951073E-03     0   130   123     0     0     0
   207  0.68599261E-01     0   132   125     0     0     0
   207  0.25853151E-02     0    10     3     0     0     0
   207  0.90665448E+00     0    12     5     0     0     0
   207  0.71905726E-02     0   456   450     0     0     0
   207  0.30578842E-03     0   203   199     0     0     0
   207  0.14425145E-01     0   429   436     0     0     0
   0
   5
     6  0.33333334E+00   100     2     7     5     0     0
     6  0.33333334E+00   100     4     9     5     0     0
     6  0.11111111E+00   100   122   127     5     0     0
     6  0.11111111E+00   100   124   129     5     0     0
     6  0.11111111E+00   100   126   131     5     0     0
   5
    12  0.33333334E+00   100     8     1    11     0     0
    12  0.33333334E+00   100    10     3    11     0     0
    12  0.11111111E+00   100   128   121    11     0     0
    12  0.11111111E+00   100   130   123    11     0     0
    12  0.11111111E+00   100   132   125    11     0     0
      9.60626030     -0.10504081
      0.99863636     -0.00565949      0.04720989     -0.02155273
     -0.01457671     -0.98408651      0.14216173     -0.10559987
      0.01795989     -0.02634592     -0.70604014     -0.70745355
     -0.04680043      0.17563501      0.69214773     -0.69849366
     -0.98868376      0.15001486     -0.15001486     -0.98868376
     -0.97941804      0.20184238     -0.20184238     -0.97941804
     -1.28638327     -0.14654569     -1.50084269
  -1668.18005371    818.79901123   -866.66802979
   1124.60998535
    F
  0.00000000E+00  0.00000000E+00  0.00000000E+00  0.47102399E-01  0.48218400E-21  0.00000000E+00  0.00000000E+00  0.00000000E+00  0.27829799E-20 -0.47102399E-01 -0.48218400E-21 -0.00000000E+00  0.00000000E+00  0.00000000E+00  0.00000000E+00  0.00000000E+00  0.00000000E+00  0.20404499E-07 -0.00000000E+00 -0.00000000E+00 -0.27829799E-20 -0.00000000E+00 -0.00000000E+00 -0.20404499E-07  0.00000000E+00  0.00000000E+00  0.00000000E+00
  0.42450499E-23  0.00000000E+00  0.00000000E+00  0.00000000E+00  0.92944299E-22  0.00000000E+00  0.00000000E+00  0.00000000E+00  0.39370501E-20  0.31124301E-10  0.61870699E-34  0.00000000E+00  0.28890600E-35  0.68145800E-09  0.00000000E+00  0.00000000E+00  0.00000000E+00  0.28865999E-07  0.00000000E+00  0.00000000E+00  0.00000000E+00  0.00000000E+00  0.00000000E+00  0.00000000E+00  0.00000000E+00  0.00000000E+00  0.00000000E+00
  0.00000000E+00  0.00000000E+00  0.00000000E+00  0.00000000E+00  0.00000000E+00  0.00000000E+00  0.00000000E+00  0.00000000E+00  0.00000000E+00  0.00000000E+00  0.00000000E+00  0.00000000E+00  0.00000000E+00  0.00000000E+00  0.00000000E+00  0.00000000E+00  0.00000000E+00  0.00000000E+00  0.00000000E+00  0.00000000E+00  0.00000000E+00  0.00000000E+00  0.00000000E+00  0.00000000E+00  0.00000000E+00  0.00000000E+00  0.00000000E+00
