  65
  401   1502.3149    0.48380E-25
  402   1500.2158    0.48087E-25
  403   1502.3049    0.48380E-25
  404   1500.2064    0.48088E-25
  405   1378.8879    0.31452E-25
  406   1170.9359    0.71054E-25
  407   1502.3149    0.48380E-25
  408   1500.2158    0.48087E-25
  409   1502.3049    0.48380E-25
  410   1500.2064    0.48088E-25
  411   1378.8879    0.31452E-25
  412   1170.9359    0.71054E-25
  413   1435.3711    0.89486E-24
  414   1441.3197    0.22261E-24
  415   1435.3711    0.89486E-24
  416   1441.3103    0.22261E-24
  417   1426.2615    0.21952E-24
  418   1413.5657    0.28266E-25
  419   1435.3711    0.89486E-24
  420   1441.3197    0.22261E-24
  421   1435.3711    0.89486E-24
  422   1441.3103    0.22261E-24
  423   1426.2615    0.21952E-24
  424   1413.5657    0.28266E-25
  425    494.7179    0.26767E-23
  426    488.3062    0.26453E-23
  427    494.7329    0.26765E-23
  428    488.3214    0.26450E-23
  429    267.9795    0.51171E-10
  430    486.1034    0.12903E-23
  431    494.7179    0.26767E-23
  432    488.3062    0.26453E-23
  433    494.7329    0.26765E-23
  434    488.3214    0.26450E-23
  435    267.9795    0.51171E-10
  436    486.1034    0.12903E-23
  437    279.8606    0.26458E-22
  438      0.0000    0.10000E+31
  439    280.7655    0.10022E-15
  440      0.0000    0.10000E+31
  441    495.0573    0.12131E-23
  442      0.0000    0.10000E+31
  443    279.8606    0.26458E-22
  444      0.0000    0.10000E+31
  445    280.7655    0.10022E-15
  446      0.0000    0.10000E+31
  447    495.0573    0.12131E-23
  448      0.0000    0.10000E+31
  449   1648.0100    0.24663E-25
  450    310.0344    0.32309E-23
  451    581.6918    0.54095E-24
  452   -877.3096    0.12734E-24
  453    889.2971    0.11478E-24
  454    581.7955    0.53998E-24
  455    889.1884    0.11636E-24
  456    581.7955    0.53998E-24
  457    889.1884    0.11636E-24
  203    119.7106    0.12171E-21
  204    942.8499    0.14597E-24
  205    941.5600    0.14445E-24
  206    946.1552    0.16468E-24
  207    946.1552    0.16468E-24
  458      0.0000    0.10000E+31
    6    173.3000    0.56017E-24
   12    173.3000    0.56017E-24
   6
   401  0.15588683E-01     0   450     1     0     0     0
   401  0.31922168E+00     0   451     1     0     0     0
   401  0.31886081E-03     0   452     1     0     0     0
   401  0.88256113E-02     0   453     1     0     0     0
   401  0.63408214E+00     0   456     2     0     0     0
   401  0.21962978E-01     0   457     2     0     0     0
   6
   402  0.12851740E-01     0   450     2     0     0     0
   402  0.32161129E+00     0   451     2     0     0     0
   402  0.19129332E-03     0   452     2     0     0     0
   402  0.70997467E-02     0   453     2     0     0     0
   402  0.64735967E+00     0   454     1     0     0     0
   402  0.10886312E-01     0   455     1     0     0     0
   6
   403  0.15588765E-01     0   450     3     0     0     0
   403  0.31922224E+00     0   451     3     0     0     0
   403  0.31885845E-03     0   452     3     0     0     0
   403  0.88255377E-02     0   453     3     0     0     0
   403  0.63408184E+00     0   456     4     0     0     0
   403  0.21962719E-01     0   457     4     0     0     0
   6
   404  0.12851770E-01     0   450     4     0     0     0
   404  0.32161081E+00     0   451     4     0     0     0
   404  0.19129111E-03     0   452     4     0     0     0
   404  0.70996587E-02     0   453     4     0     0     0
   404  0.64736027E+00     0   454     3     0     0     0
   404  0.10886222E-01     0   455     3     0     0     0
   7
   405  0.12268353E-01     0   450     5     0     0     0
   405  0.17652211E+00     0   451     5     0     0     0
   405  0.10505243E-01     0   452     5     0     0     0
   405  0.11043653E-01     0   453     5     0     0     0
   405  0.32973245E+00     0   456     6     0     0     0
   405  0.30223536E+00     0   457     6     0     0     0
   405  0.15769275E+00     0   199   406     0     0     0
   6
   406  0.21685113E+00     0   450     6     0     0     0
   406  0.80108322E-01     0   451     6     0     0     0
   406  0.19021018E+00     0   452     6     0     0     0
   406  0.69513857E-01     0   453     6     0     0     0
   406  0.18118101E+00     0   454     5     0     0     0
   406  0.26213548E+00     0   455     5     0     0     0
   6
   407  0.15588683E-01     0   450     7     0     0     0
   407  0.31922168E+00     0   451     7     0     0     0
   407  0.31886081E-03     0   452     7     0     0     0
   407  0.88256113E-02     0   453     7     0     0     0
   407  0.63408214E+00     0   454     8     0     0     0
   407  0.21962978E-01     0   455     8     0     0     0
   6
   408  0.12851740E-01     0   450     8     0     0     0
   408  0.32161129E+00     0   451     8     0     0     0
   408  0.19129332E-03     0   452     8     0     0     0
   408  0.70997467E-02     0   453     8     0     0     0
   408  0.64735967E+00     0   456     7     0     0     0
   408  0.10886312E-01     0   457     7     0     0     0
   6
   409  0.15588765E-01     0   450     9     0     0     0
   409  0.31922224E+00     0   451     9     0     0     0
   409  0.31885845E-03     0   452     9     0     0     0
   409  0.88255377E-02     0   453     9     0     0     0
   409  0.63408184E+00     0   454    10     0     0     0
   409  0.21962719E-01     0   455    10     0     0     0
   6
   410  0.12851770E-01     0   450    10     0     0     0
   410  0.32161081E+00     0   451    10     0     0     0
   410  0.19129111E-03     0   452    10     0     0     0
   410  0.70996587E-02     0   453    10     0     0     0
   410  0.64736027E+00     0   456     9     0     0     0
   410  0.10886222E-01     0   457     9     0     0     0
   7
   411  0.12268353E-01     0   450    11     0     0     0
   411  0.17652211E+00     0   451    11     0     0     0
   411  0.10505243E-01     0   452    11     0     0     0
   411  0.11043653E-01     0   453    11     0     0     0
   411  0.32973245E+00     0   454    12     0     0     0
   411  0.30223536E+00     0   455    12     0     0     0
   411  0.15769275E+00     0   198   412     0     0     0
   6
   412  0.21685113E+00     0   450    12     0     0     0
   412  0.80108322E-01     0   451    12     0     0     0
   412  0.19021018E+00     0   452    12     0     0     0
   412  0.69513857E-01     0   453    12     0     0     0
   412  0.18118101E+00     0   456    11     0     0     0
   412  0.26213548E+00     0   457    11     0     0     0
   4
   413  0.99804497E+00     0   450     1     0     0     0
   413  0.34735212E-03     0   451     1     0     0     0
   413  0.24967140E-03     0   452     1     0     0     0
   413  0.13580914E-02     0   453     1     0     0     0
   4
   414  0.99802899E+00     0   450     2     0     0     0
   414  0.34819118E-03     0   451     2     0     0     0
   414  0.25192325E-03     0   452     2     0     0     0
   414  0.13709391E-02     0   453     2     0     0     0
   4
   415  0.99804497E+00     0   450     3     0     0     0
   415  0.34735212E-03     0   451     3     0     0     0
   415  0.24967140E-03     0   452     3     0     0     0
   415  0.13580914E-02     0   453     3     0     0     0
   4
   416  0.99802899E+00     0   450     4     0     0     0
   416  0.34818967E-03     0   451     4     0     0     0
   416  0.25191909E-03     0   452     4     0     0     0
   416  0.13709150E-02     0   453     4     0     0     0
   7
   417  0.22310247E+00     0   450     5     0     0     0
   417  0.28525654E-01     0   451     5     0     0     0
   417  0.92220999E-01     0   452     5     0     0     0
   417  0.10678012E+00     0   453     5     0     0     0
   417  0.54234602E-01     0   456     6     0     0     0
   417  0.38351157E+00     0   457     6     0     0     0
   417  0.11162448E+00     0   199   406     0     0     0
   8
   418  0.25619709E+00     0   454     5     0     0     0
   418  0.86684227E-01     0   455     5     0     0     0
   418  0.10240759E+00     0   200   406     0     0     0
   418  0.88761106E-01     0   203   406     0     0     0
   418  0.15901217E-01     0   450     6     0     0     0
   418  0.12108179E+00     0   451     6     0     0     0
   418  0.12881532E+00     0   452     6     0     0     0
   418  0.20015164E+00     0   453     6     0     0     0
   4
   419  0.99804497E+00     0   450     7     0     0     0
   419  0.34735212E-03     0   451     7     0     0     0
   419  0.24967140E-03     0   452     7     0     0     0
   419  0.13580914E-02     0   453     7     0     0     0
   4
   420  0.99802899E+00     0   450     8     0     0     0
   420  0.34819118E-03     0   451     8     0     0     0
   420  0.25192325E-03     0   452     8     0     0     0
   420  0.13709391E-02     0   453     8     0     0     0
   4
   421  0.99804497E+00     0   450     9     0     0     0
   421  0.34735212E-03     0   451     9     0     0     0
   421  0.24967140E-03     0   452     9     0     0     0
   421  0.13580914E-02     0   453     9     0     0     0
   4
   422  0.99802899E+00     0   450    10     0     0     0
   422  0.34818967E-03     0   451    10     0     0     0
   422  0.25191909E-03     0   452    10     0     0     0
   422  0.13709150E-02     0   453    10     0     0     0
   7
   423  0.22310247E+00     0   450    11     0     0     0
   423  0.28525654E-01     0   451    11     0     0     0
   423  0.92220999E-01     0   452    11     0     0     0
   423  0.10678012E+00     0   453    11     0     0     0
   423  0.54234602E-01     0   454    12     0     0     0
   423  0.38351157E+00     0   455    12     0     0     0
   423  0.11162448E+00     0   198   412     0     0     0
   8
   424  0.25619709E+00     0   456    11     0     0     0
   424  0.86684227E-01     0   457    11     0     0     0
   424  0.10240759E+00     0   200   412     0     0     0
   424  0.88761106E-01     0   203   412     0     0     0
   424  0.15901217E-01     0   450    12     0     0     0
   424  0.12108179E+00     0   451    12     0     0     0
   424  0.12881532E+00     0   452    12     0     0     0
   424  0.20015164E+00     0   453    12     0     0     0
   2
   425  0.91057813E+00     0   450   121     0     0     0
   425  0.89421876E-01     0   121   130     0     0     0
   3
   426  0.91275609E+00     0   450   122     0     0     0
   426  0.18818037E-04     0   435   121   126     0     0
   426  0.87225117E-01     0   129   121     0     0     0
   2
   427  0.91058451E+00     0   450   123     0     0     0
   427  0.89415528E-01     0   121   128     0     0     0
   3
   428  0.91276270E+00     0   450   124     0     0     0
   428  0.18822826E-04     0   435   123   126     0     0
   428  0.87218463E-01     0   127   121     0     0     0
   3
   429  0.71594687E-02     0   125   130     0     0     0
   429  0.49639851E+00     0   125   124     0     0     0
   429  0.49644199E+00     0   123   126     0     0     0
   2
   430  0.43779811E+00     0   450   126     0     0     0
   430  0.56220192E+00     0   198   429     0     0     0
   2
   431  0.91057813E+00     0   450   127     0     0     0
   431  0.89421876E-01     0   127   124     0     0     0
   3
   432  0.91275609E+00     0   450   128     0     0     0
   432  0.18818037E-04     0   429   127   132     0     0
   432  0.87225117E-01     0   123   127     0     0     0
   2
   433  0.91058451E+00     0   450   129     0     0     0
   433  0.89415528E-01     0   127   122     0     0     0
   3
   434  0.91276270E+00     0   450   130     0     0     0
   434  0.18822826E-04     0   429   129   132     0     0
   434  0.87218463E-01     0   121   127     0     0     0
   3
   435  0.71594687E-02     0   131   124     0     0     0
   435  0.49639851E+00     0   131   130     0     0     0
   435  0.49644199E+00     0   129   132     0     0     0
   2
   436  0.43779811E+00     0   450   132     0     0     0
   436  0.56220192E+00     0   199   435     0     0     0
   2
   437  0.49999997E+00     0   123   122     0     0     0
   437  0.50000012E+00     0   121   124     0     0     0
   0
   2
   439  0.43870413E+00     0   429   123   131     0     0
   439  0.56129593E+00     0   435   123   125     0     0
   0
   3
   441  0.42808172E+00     0   450   125     0     0     0
   441  0.27453035E+00     0   200   429     0     0     0
   441  0.29738784E+00     0   203   429     0     0     0
   0
   2
   443  0.49999997E+00     0   129   128     0     0     0
   443  0.50000012E+00     0   127   130     0     0     0
   0
   2
   445  0.43870413E+00     0   435   129   125     0     0
   445  0.56129593E+00     0   429   129   131     0     0
   0
   3
   447  0.42808172E+00     0   450   131     0     0     0
   447  0.27453035E+00     0   200   435     0     0     0
   447  0.29738784E+00     0   203   435     0     0     0
   0
  24
   449  0.19848095E-01     0   408     2     0     0     0
   449  0.19848095E-01     0   402     8     0     0     0
   449  0.19314019E-01     0   407     1     0     0     0
   449  0.19314019E-01     0   401     7     0     0     0
   449  0.37380148E-01     0   420     2     0     0     0
   449  0.37380148E-01     0   414     8     0     0     0
   449  0.39410539E-01     0   419     1     0     0     0
   449  0.39410539E-01     0   413     7     0     0     0
   449  0.19316550E-01     0   409     3     0     0     0
   449  0.19316550E-01     0   403     9     0     0     0
   449  0.39410524E-01     0   421     3     0     0     0
   449  0.39410524E-01     0   415     9     0     0     0
   449  0.19849753E-01     0   410     4     0     0     0
   449  0.19849753E-01     0   404    10     0     0     0
   449  0.37382629E-01     0   422     4     0     0     0
   449  0.37382629E-01     0   416    10     0     0     0
   449  0.60291439E-01     0   411     5     0     0     0
   449  0.60291439E-01     0   405    11     0     0     0
   449  0.43046478E-01     0   423     5     0     0     0
   449  0.43046478E-01     0   417    11     0     0     0
   449  0.11533648E+00     0   412     6     0     0     0
   449  0.11533648E+00     0   406    12     0     0     0
   449  0.49413338E-01     0   424     6     0     0     0
   449  0.49413338E-01     0   418    12     0     0     0
   6
   450  0.13214298E+00     0   437   127     0     0     0
   450  0.13214298E+00     0   443   121     0     0     0
   450  0.12471722E+00     0   439   129     0     0     0
   450  0.12471722E+00     0   445   123     0     0     0
   450  0.24313980E+00     0   429   131     0     0     0
   450  0.24313980E+00     0   435   125     0     0     0
  20
   451  0.10798755E-02     0   450   200     0     0     0
   451  0.15336595E-01     0   450   203     0     0     0
   451  0.75559676E-01     0   425   127     0     0     0
   451  0.75559676E-01     0   431   121     0     0     0
   451  0.75535700E-01     0   427   129     0     0     0
   451  0.75535700E-01     0   433   123     0     0     0
   451  0.32379088E-03     0   437   127     0     0     0
   451  0.32379088E-03     0   443   121     0     0     0
   451  0.32252879E-03     0   439   129     0     0     0
   451  0.32252879E-03     0   445   123     0     0     0
   451  0.16851563E-01     0   429   131     0     0     0
   451  0.16851563E-01     0   435   125     0     0     0
   451  0.73458619E-01     0   441   131     0     0     0
   451  0.73458619E-01     0   447   125     0     0     0
   451  0.82066849E-01     0   426   128     0     0     0
   451  0.82066849E-01     0   432   122     0     0     0
   451  0.82042560E-01     0   428   130     0     0     0
   451  0.82042560E-01     0   434   124     0     0     0
   451  0.85630447E-01     0   430   132     0     0     0
   451  0.85630447E-01     0   436   126     0     0     0
  24
   452  0.28711483E+00     0   454   199     0     0     0
   452  0.28711483E+00     0   456   198     0     0     0
   452  0.10061352E+00     0   450   200     0     0     0
   452  0.26422778E+00     0   451   200     0     0     0
   452  0.15947700E-01     0   450   203     0     0     0
   452  0.69401930E-02     0   451   203     0     0     0
   452  0.81479215E-04     0   425   127     0     0     0
   452  0.81479215E-04     0   431   121     0     0     0
   452  0.81474594E-04     0   427   129     0     0     0
   452  0.81474594E-04     0   433   123     0     0     0
   452  0.20092528E-03     0   437   127     0     0     0
   452  0.20092528E-03     0   443   121     0     0     0
   452  0.20063050E-03     0   439   129     0     0     0
   452  0.20063050E-03     0   445   123     0     0     0
   452  0.10560377E-01     0   429   131     0     0     0
   452  0.10560377E-01     0   435   125     0     0     0
   452  0.66891597E-02     0   441   131     0     0     0
   452  0.66891597E-02     0   447   125     0     0     0
   452  0.40107296E-03     0   426   128     0     0     0
   452  0.40107296E-03     0   432   122     0     0     0
   452  0.40105055E-03     0   428   130     0     0     0
   452  0.40105055E-03     0   434   124     0     0     0
   452  0.40432048E-03     0   430   132     0     0     0
   452  0.40432048E-03     0   436   126     0     0     0
  24
   453  0.27654633E+00     0   454   199     0     0     0
   453  0.27654633E+00     0   456   198     0     0     0
   453  0.15471199E-01     0   450   200     0     0     0
   453  0.88282209E-02     0   451   200     0     0     0
   453  0.84704921E-01     0   450   203     0     0     0
   453  0.22478396E+00     0   451   203     0     0     0
   453  0.45185001E-02     0   425   127     0     0     0
   453  0.45185001E-02     0   431   121     0     0     0
   453  0.45182551E-02     0   427   129     0     0     0
   453  0.45182551E-02     0   433   123     0     0     0
   453  0.10384879E-02     0   437   127     0     0     0
   453  0.10384879E-02     0   443   121     0     0     0
   453  0.10370094E-02     0   439   129     0     0     0
   453  0.10370094E-02     0   445   123     0     0     0
   453  0.79168677E-02     0   429   131     0     0     0
   453  0.79168677E-02     0   435   125     0     0     0
   453  0.11528058E-01     0   441   131     0     0     0
   453  0.11528058E-01     0   447   125     0     0     0
   453  0.86451629E-02     0   426   128     0     0     0
   453  0.86451629E-02     0   432   122     0     0     0
   453  0.86447001E-02     0   428   130     0     0     0
   453  0.86447001E-02     0   434   124     0     0     0
   453  0.87124780E-02     0   430   132     0     0     0
   453  0.87124780E-02     0   436   126     0     0     0
   8
   454  0.16061658E-01     0   450   198     0     0     0
   454  0.17058440E+00     0   426   127     0     0     0
   454  0.17053391E+00     0   428   129     0     0     0
   454  0.17867891E+00     0   430   131     0     0     0
   454  0.14546244E+00     0   431   122     0     0     0
   454  0.14541639E+00     0   433   124     0     0     0
   454  0.32505617E-01     0   435   126     0     0     0
   454  0.14075680E+00     0   447   126     0     0     0
  11
   455  0.97255841E-01     0   450   198     0     0     0
   455  0.28460300E+00     0   451   198     0     0     0
   455  0.90493485E-02     0   426   127     0     0     0
   455  0.90488624E-02     0   428   129     0     0     0
   455  0.20573448E-01     0   430   131     0     0     0
   455  0.17656615E-01     0   431   122     0     0     0
   455  0.17655650E-01     0   433   124     0     0     0
   455  0.13835819E-01     0   435   126     0     0     0
   455  0.20872150E-01     0   447   126     0     0     0
   455  0.27080932E+00     0   454   200     0     0     0
   455  0.23863997E+00     0   454   203     0     0     0
   8
   456  0.16061658E-01     0   450   199     0     0     0
   456  0.17058440E+00     0   432   121     0     0     0
   456  0.17053391E+00     0   434   123     0     0     0
   456  0.17867891E+00     0   436   125     0     0     0
   456  0.14546244E+00     0   425   128     0     0     0
   456  0.14541639E+00     0   427   130     0     0     0
   456  0.32505617E-01     0   429   132     0     0     0
   456  0.14075680E+00     0   441   132     0     0     0
  11
   457  0.97255841E-01     0   450   199     0     0     0
   457  0.28460300E+00     0   451   199     0     0     0
   457  0.90493485E-02     0   432   121     0     0     0
   457  0.90488624E-02     0   434   123     0     0     0
   457  0.20573448E-01     0   436   125     0     0     0
   457  0.17656615E-01     0   425   128     0     0     0
   457  0.17655650E-01     0   427   130     0     0     0
   457  0.13835819E-01     0   429   132     0     0     0
   457  0.20872150E-01     0   441   132     0     0     0
   457  0.27080932E+00     0   456   200     0     0     0
   457  0.23863997E+00     0   456   203     0     0     0
  28
   203  0.16729064E-03     0   123   129     0     0     0
   203  0.47851492E-01     0   125   131     0     0     0
   203  0.20081266E-02     0     3     9     0     0     0
   203  0.78957951E+00     0     5    11     0     0     0
   203  0.38076438E-01     0     4    10     0     0     0
   203  0.16370724E-02     0    59    59     0     0     0
   203  0.32814175E-01     0    13    13     0     0     0
   203  0.44918782E-02     0   198   121   128     0     0
   203  0.44918782E-02     0   198   123   130     0     0
   203  0.44918782E-02     0   198   125   132     0     0
   203  0.13475635E-01     0   198     8     1     0     0
   203  0.13475635E-01     0   198    10     3     0     0
   203  0.44918782E-02     0   199   127   122     0     0
   203  0.44918782E-02     0   199   129   124     0     0
   203  0.44918782E-02     0   199   131   126     0     0
   203  0.13475635E-01     0   199     2     7     0     0
   203  0.13475635E-01     0   199     4     9     0     0
   203  0.47954835E-03     0   200   122   128     0     0
   203  0.47954835E-03     0   200   124   130     0     0
   203  0.47954835E-03     0   200   126   132     0     0
   203  0.24135188E-03     0   200   121   127     0     0
   203  0.24135188E-03     0   200   123   129     0     0
   203  0.24135188E-03     0   200   125   131     0     0
   203  0.82685106E-03     0   200     2     8     0     0
   203  0.82685106E-03     0   200     4    10     0     0
   203  0.10651879E-02     0   200     1     7     0     0
   203  0.10651879E-02     0   200     3     9     0     0
   203  0.10651879E-02     0   200     5    11     0     0
  16
   204  0.23822936E-03     0   123   129     0     0     0
   204  0.68231091E-01     0   125   131     0     0     0
   204  0.27942648E-02     0     3     9     0     0     0
   204  0.83912110E+00     0     5    11     0     0     0
   204  0.65871626E-01     0     6    12     0     0     0
   204  0.36446072E-04     0    13    13     0     0     0
   204  0.16287898E-03     0   198   199     0     0     0
   204  0.80809696E-04     0   200   200     0     0     0
   204  0.77061303E-03     0   450   450     0     0     0
   204  0.58757118E-03     0   450   451     0     0     0
   204  0.19223450E-03     0   203   203     0     0     0
   204  0.23876759E-04     0   437   443     0     0     0
   204  0.23813373E-04     0   439   445     0     0     0
   204  0.11617399E-02     0   429   435     0     0     0
   204  0.10351891E-01     0   429   447     0     0     0
   204  0.10351891E-01     0   441   435     0     0     0
  12
   205  0.23548579E-03     0   123   129     0     0     0
   205  0.67446262E-01     0   125   131     0     0     0
   205  0.27621165E-02     0     3     9     0     0     0
   205  0.82964361E+00     0     5    11     0     0     0
   205  0.70689104E-01     0     6    12     0     0     0
   205  0.80714279E-04     0    13    13     0     0     0
   205  0.15366048E-02     0   450   450     0     0     0
   205  0.60488116E-02     0   450   451     0     0     0
   205  0.15533736E-03     0   203   200     0     0     0
   205  0.88117964E-03     0   429   435     0     0     0
   205  0.10260421E-01     0   429   447     0     0     0
   205  0.10260421E-01     0   441   435     0     0     0
   7
   206  0.26976623E-03     0   124   129     0     0     0
   206  0.77264637E-01     0   126   131     0     0     0
   206  0.29086974E-02     0     4     9     0     0     0
   206  0.88614684E+00     0     6    11     0     0     0
   206  0.77252924E-02     0   454   450     0     0     0
   206  0.18059208E-03     0   203   198     0     0     0
   206  0.25504176E-01     0   435   430     0     0     0
   7
   207  0.26976623E-03     0   130   123     0     0     0
   207  0.77264637E-01     0   132   125     0     0     0
   207  0.29086974E-02     0    10     3     0     0     0
   207  0.88614684E+00     0    12     5     0     0     0
   207  0.77252924E-02     0   456   450     0     0     0
   207  0.18059208E-03     0   203   199     0     0     0
   207  0.25504176E-01     0   429   436     0     0     0
   0
   5
     6  0.33333334E+00   100     2     7     5     0     0
     6  0.33333334E+00   100     4     9     5     0     0
     6  0.11111111E+00   100   122   127     5     0     0
     6  0.11111111E+00   100   124   129     5     0     0
     6  0.11111111E+00   100   126   131     5     0     0
   5
    12  0.33333334E+00   100     8     1    11     0     0
    12  0.33333334E+00   100    10     3    11     0     0
    12  0.11111111E+00   100   128   121    11     0     0
    12  0.11111111E+00   100   130   123    11     0     0
    12  0.11111111E+00   100   132   125    11     0     0
     12.53639984     -0.08126719
      0.99786192     -0.00846578      0.05970314     -0.02520923
     -0.02123464     -0.97877413      0.16642526     -0.11769738
      0.02401933     -0.03534573     -0.70526689     -0.70765269
     -0.05695427      0.20169269      0.68653971     -0.69623238
     -0.98588181      0.16744287     -0.16744287     -0.98588181
     -0.97160947      0.23659045     -0.23659045     -0.97160947
     -1.21969700     -0.22563140     -1.45127368
  -1285.64001465   1374.23999023   -778.69500732
    874.78802490
    F
  0.00000000E+00  0.00000000E+00  0.00000000E+00  0.47266901E-01  0.10551900E-25  0.00000000E+00  0.00000000E+00  0.00000000E+00  0.61017898E-25 -0.47266901E-01 -0.10551900E-25 -0.00000000E+00  0.00000000E+00  0.00000000E+00  0.00000000E+00  0.00000000E+00  0.00000000E+00  0.34857798E-07 -0.00000000E+00 -0.00000000E+00 -0.61017898E-25 -0.00000000E+00 -0.00000000E+00 -0.34857798E-07  0.00000000E+00  0.00000000E+00  0.00000000E+00
  0.92738300E-28  0.00000000E+00  0.00000000E+00  0.00000000E+00  0.20304800E-26  0.00000000E+00  0.00000000E+00  0.00000000E+00  0.85393201E-25  0.52978701E-10 -0.58030101E-36  0.00000000E+00 -0.26962801E-37  0.11599600E-08  0.00000000E+00  0.00000000E+00  0.00000000E+00  0.48782699E-07  0.00000000E+00  0.00000000E+00  0.00000000E+00  0.00000000E+00  0.00000000E+00  0.00000000E+00  0.00000000E+00  0.00000000E+00  0.00000000E+00
  0.00000000E+00  0.00000000E+00  0.00000000E+00  0.00000000E+00  0.00000000E+00  0.00000000E+00  0.00000000E+00  0.00000000E+00  0.00000000E+00  0.00000000E+00  0.00000000E+00  0.00000000E+00  0.00000000E+00  0.00000000E+00  0.00000000E+00  0.00000000E+00  0.00000000E+00  0.00000000E+00  0.00000000E+00  0.00000000E+00  0.00000000E+00  0.00000000E+00  0.00000000E+00  0.00000000E+00  0.00000000E+00  0.00000000E+00  0.00000000E+00
