  65
  401   3000.5166    0.33423E-26
  402   2999.5779    0.33423E-26
  403   3000.5166    0.33423E-26
  404   2999.5781    0.33423E-26
  405   2997.8540    0.34979E-26
  406   2994.8535    0.30217E-26
  407   3000.5166    0.33423E-26
  408   2999.5779    0.33423E-26
  409   3000.5166    0.33423E-26
  410   2999.5781    0.33423E-26
  411   2997.8540    0.34979E-26
  412   2994.8535    0.30217E-26
  413   3000.0945    0.40783E-26
  414   2999.8110    0.39558E-26
  415   3000.0945    0.40783E-26
  416   2999.8113    0.39558E-26
  417   3002.7573    0.34041E-26
  418   3010.5735    0.30971E-26
  419   3000.0945    0.40783E-26
  420   2999.8110    0.39558E-26
  421   3000.0945    0.40783E-26
  422   2999.8113    0.39558E-26
  423   3002.7573    0.34041E-26
  424   3010.5735    0.30971E-26
  425    303.2582    0.17725E-22
  426    293.8247    0.21778E-22
  427    303.2582    0.17725E-22
  428    293.8247    0.21778E-22
  429    286.4526    0.12342E-22
  430    293.8247    0.21778E-22
  431    303.2582    0.17725E-22
  432    293.8247    0.21778E-22
  433    303.2582    0.17725E-22
  434    293.8247    0.21778E-22
  435    286.4526    0.12342E-22
  436    293.8247    0.21778E-22
  437    302.8226    0.42194E-23
  438      0.0000    0.10000E+31
  439    302.8226    0.42194E-23
  440      0.0000    0.10000E+31
  441    318.7758    0.45758E-23
  442      0.0000    0.10000E+31
  443    302.8226    0.42194E-23
  444      0.0000    0.10000E+31
  445    302.8226    0.42194E-23
  446      0.0000    0.10000E+31
  447    318.7758    0.45758E-23
  448      0.0000    0.10000E+31
  449    400.0000    0.14027E-16
  450    249.9874    0.10000E+31
  451    349.9488    0.99228E-24
  452  -1401.2905    0.38439E-25
  453   1405.7676    0.38173E-25
  454    349.9126    0.98898E-24
  455   1405.5006    0.37997E-25
  456    349.9126    0.98898E-24
  457   1405.5006    0.37997E-25
  203    106.5847    0.15959E-21
  204    505.5095    0.55771E-24
  205    500.0000    0.41563E-24
  206    509.5998    0.52563E-24
  207    509.5998    0.52563E-24
  458      0.0000    0.10000E+31
    6    172.5000    0.57395E-24
   12    172.5000    0.57395E-24
   7
   401  0.25300053E-02     0   450     1     0     0     0
   401  0.61638914E-01     0   451     1     0     0     0
   401  0.26761891E-04     0   452     1     0     0     0
   401  0.19922102E-03     0   453     1     0     0     0
   401  0.81117094E+00     0   449     1     0     0     0
   401  0.12381537E+00     0   456     2     0     0     0
   401  0.61879447E-03     0   457     2     0     0     0
   7
   402  0.17445359E-02     0   450     2     0     0     0
   402  0.62505044E-01     0   451     2     0     0     0
   402  0.17407478E-04     0   452     2     0     0     0
   402  0.13778325E-03     0   453     2     0     0     0
   402  0.81091589E+00     0   449     2     0     0     0
   402  0.12454204E+00     0   454     1     0     0     0
   402  0.13728786E-03     0   455     1     0     0     0
   7
   403  0.25300055E-02     0   450     3     0     0     0
   403  0.61638921E-01     0   451     3     0     0     0
   403  0.26761893E-04     0   452     3     0     0     0
   403  0.19922103E-03     0   453     3     0     0     0
   403  0.81117100E+00     0   449     3     0     0     0
   403  0.12381533E+00     0   456     4     0     0     0
   403  0.61879412E-03     0   457     4     0     0     0
   7
   404  0.17445356E-02     0   450     4     0     0     0
   404  0.62505044E-01     0   451     4     0     0     0
   404  0.17407472E-04     0   452     4     0     0     0
   404  0.13778321E-03     0   453     4     0     0     0
   404  0.81091589E+00     0   449     4     0     0     0
   404  0.12454208E+00     0   454     3     0     0     0
   404  0.13728792E-03     0   455     3     0     0     0
   7
   405  0.61930679E-02     0   450     5     0     0     0
   405  0.29989105E-01     0   451     5     0     0     0
   405  0.26111765E-03     0   452     5     0     0     0
   405  0.14205102E-03     0   453     5     0     0     0
   405  0.84857428E+00     0   449     5     0     0     0
   405  0.59910923E-01     0   456     6     0     0     0
   405  0.54929469E-01     0   457     6     0     0     0
   7
   406  0.73838955E+00     0   449     6     0     0     0
   406  0.16631614E-01     0   450     6     0     0     0
   406  0.31345453E-01     0   451     6     0     0     0
   406  0.57250928E-01     0   452     6     0     0     0
   406  0.44985935E-01     0   453     6     0     0     0
   406  0.62947929E-01     0   454     5     0     0     0
   406  0.48448641E-01     0   455     5     0     0     0
   7
   407  0.25300053E-02     0   450     7     0     0     0
   407  0.61638914E-01     0   451     7     0     0     0
   407  0.26761891E-04     0   452     7     0     0     0
   407  0.19922102E-03     0   453     7     0     0     0
   407  0.81117094E+00     0   449     7     0     0     0
   407  0.12381537E+00     0   454     8     0     0     0
   407  0.61879447E-03     0   455     8     0     0     0
   7
   408  0.17445359E-02     0   450     8     0     0     0
   408  0.62505044E-01     0   451     8     0     0     0
   408  0.17407478E-04     0   452     8     0     0     0
   408  0.13778325E-03     0   453     8     0     0     0
   408  0.81091589E+00     0   449     8     0     0     0
   408  0.12454204E+00     0   456     7     0     0     0
   408  0.13728786E-03     0   457     7     0     0     0
   7
   409  0.25300055E-02     0   450     9     0     0     0
   409  0.61638921E-01     0   451     9     0     0     0
   409  0.26761893E-04     0   452     9     0     0     0
   409  0.19922103E-03     0   453     9     0     0     0
   409  0.81117100E+00     0   449     9     0     0     0
   409  0.12381533E+00     0   454    10     0     0     0
   409  0.61879412E-03     0   455    10     0     0     0
   7
   410  0.17445356E-02     0   450    10     0     0     0
   410  0.62505044E-01     0   451    10     0     0     0
   410  0.17407472E-04     0   452    10     0     0     0
   410  0.13778321E-03     0   453    10     0     0     0
   410  0.81091589E+00     0   449    10     0     0     0
   410  0.12454208E+00     0   456     9     0     0     0
   410  0.13728792E-03     0   457     9     0     0     0
   7
   411  0.61930679E-02     0   450    11     0     0     0
   411  0.29989105E-01     0   451    11     0     0     0
   411  0.26111765E-03     0   452    11     0     0     0
   411  0.14205102E-03     0   453    11     0     0     0
   411  0.84857428E+00     0   449    11     0     0     0
   411  0.59910923E-01     0   454    12     0     0     0
   411  0.54929469E-01     0   455    12     0     0     0
   7
   412  0.73838955E+00     0   449    12     0     0     0
   412  0.16631614E-01     0   450    12     0     0     0
   412  0.31345453E-01     0   451    12     0     0     0
   412  0.57250928E-01     0   452    12     0     0     0
   412  0.44985935E-01     0   453    12     0     0     0
   412  0.62947929E-01     0   456    11     0     0     0
   412  0.48448641E-01     0   457    11     0     0     0
   2
   413  0.10342855E-01     0   450     1     0     0     0
   413  0.98965710E+00     0   449     1     0     0     0
   4
   414  0.40124509E-01     0   450     2     0     0     0
   414  0.15003886E-04     0   451     2     0     0     0
   414  0.26634374E-04     0   453     2     0     0     0
   414  0.95983380E+00     0   449     2     0     0     0
   2
   415  0.10342855E-01     0   450     3     0     0     0
   415  0.98965710E+00     0   449     3     0     0     0
   4
   416  0.40124509E-01     0   450     4     0     0     0
   416  0.15003886E-04     0   451     4     0     0     0
   416  0.26634369E-04     0   453     4     0     0     0
   416  0.95983386E+00     0   449     4     0     0     0
   7
   417  0.51850011E-02     0   450     5     0     0     0
   417  0.33603478E-01     0   451     5     0     0     0
   417  0.49121148E-03     0   452     5     0     0     0
   417  0.78332744E-03     0   453     5     0     0     0
   417  0.82638085E+00     0   449     5     0     0     0
   417  0.67106567E-01     0   456     6     0     0     0
   417  0.66449620E-01     0   457     6     0     0     0
   7
   418  0.73734832E+00     0   449     6     0     0     0
   418  0.51285952E-01     0   454     5     0     0     0
   418  0.59309911E-01     0   455     5     0     0     0
   418  0.15846005E-01     0   450     6     0     0     0
   418  0.25672726E-01     0   451     6     0     0     0
   418  0.49131919E-01     0   452     6     0     0     0
   418  0.61405167E-01     0   453     6     0     0     0
   2
   419  0.10342855E-01     0   450     7     0     0     0
   419  0.98965710E+00     0   449     7     0     0     0
   4
   420  0.40124509E-01     0   450     8     0     0     0
   420  0.15003886E-04     0   451     8     0     0     0
   420  0.26634374E-04     0   453     8     0     0     0
   420  0.95983380E+00     0   449     8     0     0     0
   2
   421  0.10342855E-01     0   450     9     0     0     0
   421  0.98965710E+00     0   449     9     0     0     0
   4
   422  0.40124509E-01     0   450    10     0     0     0
   422  0.15003886E-04     0   451    10     0     0     0
   422  0.26634369E-04     0   453    10     0     0     0
   422  0.95983386E+00     0   449    10     0     0     0
   7
   423  0.51850011E-02     0   450    11     0     0     0
   423  0.33603478E-01     0   451    11     0     0     0
   423  0.49121148E-03     0   452    11     0     0     0
   423  0.78332744E-03     0   453    11     0     0     0
   423  0.82638085E+00     0   449    11     0     0     0
   423  0.67106567E-01     0   454    12     0     0     0
   423  0.66449620E-01     0   455    12     0     0     0
   7
   424  0.73734832E+00     0   449    12     0     0     0
   424  0.51285952E-01     0   456    11     0     0     0
   424  0.59309911E-01     0   457    11     0     0     0
   424  0.15846005E-01     0   450    12     0     0     0
   424  0.25672726E-01     0   451    12     0     0     0
   424  0.49131919E-01     0   452    12     0     0     0
   424  0.61405167E-01     0   453    12     0     0     0
   1
   425  0.10000000E+01     0   450   121     0     0     0
   1
   426  0.10000000E+01     0   450   122     0     0     0
   1
   427  0.10000000E+01     0   450   123     0     0     0
   1
   428  0.10000000E+01     0   450   124     0     0     0
   1
   429  0.10000000E+01     0   450   125     0     0     0
   1
   430  0.10000000E+01     0   450   126     0     0     0
   1
   431  0.10000000E+01     0   450   127     0     0     0
   1
   432  0.10000000E+01     0   450   128     0     0     0
   1
   433  0.10000000E+01     0   450   129     0     0     0
   1
   434  0.10000000E+01     0   450   130     0     0     0
   1
   435  0.10000000E+01     0   450   131     0     0     0
   1
   436  0.10000000E+01     0   450   132     0     0     0
   1
   437  0.10000000E+01     0   450   121     0     0     0
   0
   1
   439  0.10000000E+01     0   450   123     0     0     0
   0
   1
   441  0.10000000E+01     0   450   125     0     0     0
   0
   1
   443  0.10000000E+01     0   450   127     0     0     0
   0
   1
   445  0.10000000E+01     0   450   129     0     0     0
   0
   1
   447  0.10000000E+01     0   450   131     0     0     0
   0
  16
   449  0.76211910E-02     0   454     1     8     0     0
   449  0.76211910E-02     0   456     2     7     0     0
   449  0.76211900E-02     0   454     3    10     0     0
   449  0.76211900E-02     0   456     4     9     0     0
   449  0.18876583E-02     0   450    13     0     0     0
   449  0.32463413E+00     0   450     2     8     0     0
   449  0.10016850E+00     0   450     1     7     0     0
   449  0.10016850E+00     0   450     3     9     0     0
   449  0.32463408E+00     0   450     4    10     0     0
   449  0.98997056E-01     0   450     5    11     0     0
   449  0.45980886E-03     0   451    13     0     0     0
   449  0.38267355E-02     0   451     2     8     0     0
   449  0.37670711E-02     0   451     1     7     0     0
   449  0.37670711E-02     0   451     3     9     0     0
   449  0.38267346E-02     0   451     4    10     0     0
   449  0.33779331E-02     0   451     5    11     0     0
   0
  18
   451  0.69988854E-01     0   425   127     0     0     0
   451  0.69988854E-01     0   431   121     0     0     0
   451  0.69988705E-01     0   427   129     0     0     0
   451  0.69988705E-01     0   433   123     0     0     0
   451  0.32033309E-04     0   437   127     0     0     0
   451  0.32033309E-04     0   443   121     0     0     0
   451  0.32033196E-04     0   439   129     0     0     0
   451  0.32033196E-04     0   445   123     0     0     0
   451  0.61212968E-01     0   429   131     0     0     0
   451  0.61212968E-01     0   435   125     0     0     0
   451  0.16430574E-01     0   441   131     0     0     0
   451  0.16430574E-01     0   447   125     0     0     0
   451  0.94104938E-01     0   426   128     0     0     0
   451  0.94104938E-01     0   432   122     0     0     0
   451  0.94104938E-01     0   428   130     0     0     0
   451  0.94104938E-01     0   434   124     0     0     0
   451  0.94104938E-01     0   430   132     0     0     0
   451  0.94104938E-01     0   436   126     0     0     0
  30
   452  0.20797871E+00     0   454   199     0     0     0
   452  0.20797871E+00     0   456   198     0     0     0
   452  0.93202405E-01     0   454   207     0     0     0
   452  0.93202405E-01     0   456   206     0     0     0
   452  0.55064477E-01     0   450   200     0     0     0
   452  0.18183948E+00     0   451   200     0     0     0
   452  0.88738147E-02     0   450   203     0     0     0
   452  0.18630149E-01     0   450   204     0     0     0
   452  0.15148288E-01     0   450   205     0     0     0
   452  0.21735931E-01     0   451   203     0     0     0
   452  0.42723965E-01     0   451   204     0     0     0
   452  0.49753740E-01     0   451   205     0     0     0
   452  0.40206054E-04     0   425   127     0     0     0
   452  0.40206054E-04     0   431   121     0     0     0
   452  0.40206054E-04     0   427   129     0     0     0
   452  0.40206054E-04     0   433   123     0     0     0
   452  0.35896213E-04     0   437   127     0     0     0
   452  0.35896213E-04     0   443   121     0     0     0
   452  0.35896213E-04     0   439   129     0     0     0
   452  0.35896213E-04     0   445   123     0     0     0
   452  0.35809792E-03     0   429   131     0     0     0
   452  0.35809792E-03     0   435   125     0     0     0
   452  0.96475176E-03     0   441   131     0     0     0
   452  0.96475176E-03     0   447   125     0     0     0
   452  0.15297819E-03     0   426   128     0     0     0
   452  0.15297819E-03     0   432   122     0     0     0
   452  0.15297819E-03     0   428   130     0     0     0
   452  0.15297819E-03     0   434   124     0     0     0
   452  0.15297819E-03     0   430   132     0     0     0
   452  0.15297819E-03     0   436   126     0     0     0
  30
   453  0.20740660E+00     0   454   199     0     0     0
   453  0.20740660E+00     0   456   198     0     0     0
   453  0.93189247E-01     0   454   207     0     0     0
   453  0.93189247E-01     0   456   206     0     0     0
   453  0.96582510E-02     0   450   200     0     0     0
   453  0.23741925E-01     0   451   200     0     0     0
   453  0.54342888E-01     0   450   203     0     0     0
   453  0.13846177E-01     0   450   204     0     0     0
   453  0.18135857E-01     0   450   205     0     0     0
   453  0.17958945E+00     0   451   203     0     0     0
   453  0.45468498E-01     0   451   204     0     0     0
   453  0.41718699E-01     0   451   205     0     0     0
   453  0.35050703E-03     0   425   127     0     0     0
   453  0.35050703E-03     0   431   121     0     0     0
   453  0.35050703E-03     0   427   129     0     0     0
   453  0.35050703E-03     0   433   123     0     0     0
   453  0.20232017E-03     0   437   127     0     0     0
   453  0.20232017E-03     0   443   121     0     0     0
   453  0.20232017E-03     0   439   129     0     0     0
   453  0.20232017E-03     0   445   123     0     0     0
   453  0.76226854E-04     0   429   131     0     0     0
   453  0.76226854E-04     0   435   125     0     0     0
   453  0.16960144E-02     0   441   131     0     0     0
   453  0.16960144E-02     0   447   125     0     0     0
   453  0.10917905E-02     0   426   128     0     0     0
   453  0.10917905E-02     0   432   122     0     0     0
   453  0.10917905E-02     0   428   130     0     0     0
   453  0.10917905E-02     0   434   124     0     0     0
   453  0.10917905E-02     0   430   132     0     0     0
   453  0.10917905E-02     0   436   126     0     0     0
   8
   454  0.70704246E-03     0   450   198     0     0     0
   454  0.19210802E+00     0   426   127     0     0     0
   454  0.19210775E+00     0   428   129     0     0     0
   454  0.19210833E+00     0   430   131     0     0     0
   454  0.13600044E+00     0   431   122     0     0     0
   454  0.13600044E+00     0   433   124     0     0     0
   454  0.11914902E+00     0   435   126     0     0     0
   454  0.31818956E-01     0   447   126     0     0     0
  15
   455  0.55614449E-01     0   450   198     0     0     0
   455  0.28586205E-01     0   450   206     0     0     0
   455  0.21065563E+00     0   451   198     0     0     0
   455  0.95754176E-01     0   451   206     0     0     0
   455  0.54900645E-03     0   426   127     0     0     0
   455  0.54900645E-03     0   428   129     0     0     0
   455  0.17864520E-02     0   430   131     0     0     0
   455  0.24581365E-02     0   431   122     0     0     0
   455  0.24581365E-02     0   433   124     0     0     0
   455  0.97171527E-04     0   435   126     0     0     0
   455  0.35596304E-02     0   447   126     0     0     0
   455  0.20839070E+00     0   454   200     0     0     0
   455  0.20470802E+00     0   454   203     0     0     0
   455  0.90880491E-01     0   454   204     0     0     0
   455  0.93952760E-01     0   454   205     0     0     0
   8
   456  0.70704246E-03     0   450   199     0     0     0
   456  0.19210802E+00     0   432   121     0     0     0
   456  0.19210775E+00     0   434   123     0     0     0
   456  0.19210833E+00     0   436   125     0     0     0
   456  0.13600044E+00     0   425   128     0     0     0
   456  0.13600044E+00     0   427   130     0     0     0
   456  0.11914902E+00     0   429   132     0     0     0
   456  0.31818956E-01     0   441   132     0     0     0
  15
   457  0.55614449E-01     0   450   199     0     0     0
   457  0.28586205E-01     0   450   207     0     0     0
   457  0.21065563E+00     0   451   199     0     0     0
   457  0.95754176E-01     0   451   207     0     0     0
   457  0.54900645E-03     0   432   121     0     0     0
   457  0.54900645E-03     0   434   123     0     0     0
   457  0.17864520E-02     0   436   125     0     0     0
   457  0.24581365E-02     0   425   128     0     0     0
   457  0.24581365E-02     0   427   130     0     0     0
   457  0.97171527E-04     0   429   132     0     0     0
   457  0.35596304E-02     0   441   132     0     0     0
   457  0.20839070E+00     0   456   200     0     0     0
   457  0.20470802E+00     0   456   203     0     0     0
   457  0.90880491E-01     0   456   204     0     0     0
   457  0.93952760E-01     0   456   205     0     0     0
  28
   203  0.21482678E-03     0   123   129     0     0     0
   203  0.61427459E-01     0   125   131     0     0     0
   203  0.25832821E-02     0     3     9     0     0     0
   203  0.85600066E+00     0     5    11     0     0     0
   203  0.33298235E-01     0     4    10     0     0     0
   203  0.13523983E-02     0    59    59     0     0     0
   203  0.30482057E-01     0    13    13     0     0     0
   203  0.78551896E-03     0   198   121   128     0     0
   203  0.78551896E-03     0   198   123   130     0     0
   203  0.78551896E-03     0   198   125   132     0     0
   203  0.23565567E-02     0   198     8     1     0     0
   203  0.23565567E-02     0   198    10     3     0     0
   203  0.78551896E-03     0   199   127   122     0     0
   203  0.78551896E-03     0   199   129   124     0     0
   203  0.78551896E-03     0   199   131   126     0     0
   203  0.23565567E-02     0   199     2     7     0     0
   203  0.23565567E-02     0   199     4     9     0     0
   203  0.34314464E-04     0   200   122   128     0     0
   203  0.34314464E-04     0   200   124   130     0     0
   203  0.34314464E-04     0   200   126   132     0     0
   203  0.17270126E-04     0   200   121   127     0     0
   203  0.17270126E-04     0   200   123   129     0     0
   203  0.17270126E-04     0   200   125   131     0     0
   203  0.59165985E-04     0   200     2     8     0     0
   203  0.59165985E-04     0   200     4    10     0     0
   203  0.76220371E-04     0   200     1     7     0     0
   203  0.76220371E-04     0   200     3     9     0     0
   203  0.76220371E-04     0   200     5    11     0     0
  10
   204  0.48685877E-04     0   123   129     0     0     0
   204  0.13943351E-01     0   125   131     0     0     0
   204  0.57424686E-03     0     3     9     0     0     0
   204  0.15403751E+00     0     5    11     0     0     0
   204  0.31848416E-04     0     4    10     0     0     0
   204  0.76538450E+00     0     6    12     0     0     0
   204  0.10919316E-02     0    13    13     0     0     0
   204  0.11211480E-01     0   198   199     0     0     0
   204  0.55125337E-02     0   200   200     0     0     0
   204  0.48163895E-01     0   203   203     0     0     0
   9
   205  0.36246125E-04     0   123   129     0     0     0
   205  0.10381184E-01     0   125   131     0     0     0
   205  0.42756542E-03     0     3     9     0     0     0
   205  0.11487336E+00     0     5    11     0     0     0
   205  0.20293153E-04     0     4    10     0     0     0
   205  0.86617017E+00     0     6    12     0     0     0
   205  0.70466904E-03     0    13    13     0     0     0
   205  0.11321762E-04     0   450   450     0     0     0
   205  0.73751952E-02     0   203   200     0     0     0
   5
   206  0.46718764E-04     0   124   129     0     0     0
   206  0.13380646E-01     0   126   131     0     0     0
   206  0.52725914E-03     0     4     9     0     0     0
   206  0.97594541E+00     0     6    11     0     0     0
   206  0.10099929E-01     0   203   198     0     0     0
   5
   207  0.46718764E-04     0   130   123     0     0     0
   207  0.13380646E-01     0   132   125     0     0     0
   207  0.52725914E-03     0    10     3     0     0     0
   207  0.97594541E+00     0    12     5     0     0     0
   207  0.10099929E-01     0   203   199     0     0     0
   0
   5
     6  0.33333334E+00   100     2     7     5     0     0
     6  0.33333334E+00   100     4     9     5     0     0
     6  0.11111111E+00   100   122   127     5     0     0
     6  0.11111111E+00   100   124   129     5     0     0
     6  0.11111111E+00   100   126   131     5     0     0
   5
    12  0.33333334E+00   100     8     1    11     0     0
    12  0.33333334E+00   100    10     3    11     0     0
    12  0.11111111E+00   100   128   121    11     0     0
    12  0.11111111E+00   100   130   123    11     0     0
    12  0.11111111E+00   100   132   125    11     0     0
      4.00000000     -0.26411885
      0.99917907     -0.01694829      0.03404354     -0.01396637
     -0.01945202     -0.99743545      0.06232144     -0.02932578
      0.01377670     -0.02360150     -0.70629966     -0.70738512
      0.03275803     -0.06540696     -0.70434195      0.70608163
     -0.99912071      0.04192594     -0.04192594     -0.99912071
     -0.99603337      0.08898030     -0.08898030     -0.99603337
     -0.77800179     -0.82854742     -0.79221231
      0.00000000      0.00000000      0.00000000
   1400.00000000
    T
