  65
  401   1502.3671    0.48432E-25
  402   1500.2457    0.48134E-25
  403   1502.3472    0.48433E-25
  404   1500.2264    0.48135E-25
  405   1344.5636    0.39421E-25
  406   1172.5594    0.66955E-25
  407   1502.3671    0.48432E-25
  408   1500.2457    0.48134E-25
  409   1502.3472    0.48433E-25
  410   1500.2264    0.48135E-25
  411   1344.5636    0.39421E-25
  412   1172.5594    0.66955E-25
  413   1435.3934    0.89502E-24
  414   1441.3551    0.22265E-24
  415   1435.3534    0.89505E-24
  416   1441.3558    0.22265E-24
  417   1392.4305    0.53407E-25
  418   1392.9779    0.27649E-25
  419   1435.3934    0.89502E-24
  420   1441.3551    0.22265E-24
  421   1435.3534    0.89505E-24
  422   1441.3558    0.22265E-24
  423   1392.4305    0.53407E-25
  424   1392.9779    0.27649E-25
  425    494.8948    0.26705E-23
  426    488.4171    0.26643E-23
  427    494.8838    0.26707E-23
  428    488.4060    0.26645E-23
  429    204.7460    0.18660E-11
  430    475.6113    0.29443E-24
  431    494.8948    0.26705E-23
  432    488.4171    0.26643E-23
  433    494.8838    0.26707E-23
  434    488.4060    0.26645E-23
  435    204.7460    0.18660E-11
  436    475.6113    0.29443E-24
  437    279.7909    0.26464E-22
  438      0.0000    0.10000E+31
  439    280.5979    0.46444E-19
  440      0.0000    0.10000E+31
  441    495.2144    0.28463E-24
  442      0.0000    0.10000E+31
  443    279.7909    0.26464E-22
  444      0.0000    0.10000E+31
  445    280.5979    0.46444E-19
  446      0.0000    0.10000E+31
  447    495.2144    0.28463E-24
  448      0.0000    0.10000E+31
  449   1647.3700    0.23077E-25
  450    310.5096    0.11145E-23
  451    583.1485    0.44870E-24
  452   -868.1411    0.11853E-24
  453    879.1638    0.10922E-24
  454    583.2766    0.44802E-24
  455    879.3752    0.11078E-24
  456    583.2766    0.44802E-24
  457    879.3752    0.11078E-24
  203    120.1084    0.11995E-21
  204    757.4540    0.28258E-25
  205    756.5470    0.28288E-25
  206    762.3058    0.32183E-25
  207    762.3058    0.32183E-25
  458      0.0000    0.10000E+31
    6    173.3000    0.56017E-24
   12    173.3000    0.56017E-24
   6
   401  0.15381148E-01     0   450     1     0     0     0
   401  0.31925067E+00     0   451     1     0     0     0
   401  0.36607005E-03     0   452     1     0     0     0
   401  0.89800674E-02     0   453     1     0     0     0
   401  0.63328254E+00     0   456     2     0     0     0
   401  0.22739526E-01     0   457     2     0     0     0
   6
   402  0.13065540E-01     0   450     2     0     0     0
   402  0.32121110E+00     0   451     2     0     0     0
   402  0.21940508E-03     0   452     2     0     0     0
   402  0.72518792E-02     0   453     2     0     0     0
   402  0.64748192E+00     0   454     1     0     0     0
   402  0.10770144E-01     0   455     1     0     0     0
   6
   403  0.15381286E-01     0   450     3     0     0     0
   403  0.31925130E+00     0   451     3     0     0     0
   403  0.36606455E-03     0   452     3     0     0     0
   403  0.89799231E-02     0   453     3     0     0     0
   403  0.63328230E+00     0   456     4     0     0     0
   403  0.22739075E-01     0   457     4     0     0     0
   6
   404  0.13065618E-01     0   450     4     0     0     0
   404  0.32121071E+00     0   451     4     0     0     0
   404  0.21940072E-03     0   452     4     0     0     0
   404  0.72517288E-02     0   453     4     0     0     0
   404  0.64748251E+00     0   454     3     0     0     0
   404  0.10769964E-01     0   455     3     0     0     0
   7
   405  0.31931978E-01     0   450     5     0     0     0
   405  0.19355582E+00     0   451     5     0     0     0
   405  0.70765793E-01     0   452     5     0     0     0
   405  0.52624378E-01     0   453     5     0     0     0
   405  0.34982762E+00     0   456     6     0     0     0
   405  0.21562234E+00     0   457     6     0     0     0
   405  0.85672073E-01     0   199   406     0     0     0
   6
   406  0.20118257E+00     0   450     6     0     0     0
   406  0.80440693E-01     0   451     6     0     0     0
   406  0.19450861E+00     0   452     6     0     0     0
   406  0.70555687E-01     0   453     6     0     0     0
   406  0.18419354E+00     0   454     5     0     0     0
   406  0.26911888E+00     0   455     5     0     0     0
   6
   407  0.15381148E-01     0   450     7     0     0     0
   407  0.31925067E+00     0   451     7     0     0     0
   407  0.36607005E-03     0   452     7     0     0     0
   407  0.89800674E-02     0   453     7     0     0     0
   407  0.63328254E+00     0   454     8     0     0     0
   407  0.22739526E-01     0   455     8     0     0     0
   6
   408  0.13065540E-01     0   450     8     0     0     0
   408  0.32121110E+00     0   451     8     0     0     0
   408  0.21940508E-03     0   452     8     0     0     0
   408  0.72518792E-02     0   453     8     0     0     0
   408  0.64748192E+00     0   456     7     0     0     0
   408  0.10770144E-01     0   457     7     0     0     0
   6
   409  0.15381286E-01     0   450     9     0     0     0
   409  0.31925130E+00     0   451     9     0     0     0
   409  0.36606455E-03     0   452     9     0     0     0
   409  0.89799231E-02     0   453     9     0     0     0
   409  0.63328230E+00     0   454    10     0     0     0
   409  0.22739075E-01     0   455    10     0     0     0
   6
   410  0.13065618E-01     0   450    10     0     0     0
   410  0.32121071E+00     0   451    10     0     0     0
   410  0.21940072E-03     0   452    10     0     0     0
   410  0.72517288E-02     0   453    10     0     0     0
   410  0.64748251E+00     0   456     9     0     0     0
   410  0.10769964E-01     0   457     9     0     0     0
   7
   411  0.31931978E-01     0   450    11     0     0     0
   411  0.19355582E+00     0   451    11     0     0     0
   411  0.70765793E-01     0   452    11     0     0     0
   411  0.52624378E-01     0   453    11     0     0     0
   411  0.34982762E+00     0   454    12     0     0     0
   411  0.21562234E+00     0   455    12     0     0     0
   411  0.85672073E-01     0   198   412     0     0     0
   6
   412  0.20118257E+00     0   450    12     0     0     0
   412  0.80440693E-01     0   451    12     0     0     0
   412  0.19450861E+00     0   452    12     0     0     0
   412  0.70555687E-01     0   453    12     0     0     0
   412  0.18419354E+00     0   456    11     0     0     0
   412  0.26911888E+00     0   457    11     0     0     0
   4
   413  0.99807841E+00     0   450     1     0     0     0
   413  0.29696530E-03     0   451     1     0     0     0
   413  0.28819134E-03     0   452     1     0     0     0
   413  0.13364510E-02     0   453     1     0     0     0
   4
   414  0.99806303E+00     0   450     2     0     0     0
   414  0.29768940E-03     0   451     2     0     0     0
   414  0.29070210E-03     0   452     2     0     0     0
   414  0.13486171E-02     0   453     2     0     0     0
   4
   415  0.99807853E+00     0   450     3     0     0     0
   415  0.29696041E-03     0   451     3     0     0     0
   415  0.28817443E-03     0   452     3     0     0     0
   415  0.13363692E-02     0   453     3     0     0     0
   4
   416  0.99806303E+00     0   450     4     0     0     0
   416  0.29768934E-03     0   451     4     0     0     0
   416  0.29070175E-03     0   452     4     0     0     0
   416  0.13486153E-02     0   453     4     0     0     0
   7
   417  0.31673741E-01     0   450     5     0     0     0
   417  0.50565802E-01     0   451     5     0     0     0
   417  0.12092294E+00     0   452     5     0     0     0
   417  0.13733441E+00     0   453     5     0     0     0
   417  0.89472800E-01     0   456     6     0     0     0
   417  0.45170715E+00     0   457     6     0     0     0
   417  0.11832316E+00     0   199   406     0     0     0
   8
   418  0.24506158E+00     0   454     5     0     0     0
   418  0.16706271E+00     0   455     5     0     0     0
   418  0.81703536E-01     0   200   406     0     0     0
   418  0.65706685E-01     0   203   406     0     0     0
   418  0.17122729E-01     0   450     6     0     0     0
   418  0.11095373E+00     0   451     6     0     0     0
   418  0.11949013E+00     0   452     6     0     0     0
   418  0.19289890E+00     0   453     6     0     0     0
   4
   419  0.99807841E+00     0   450     7     0     0     0
   419  0.29696530E-03     0   451     7     0     0     0
   419  0.28819134E-03     0   452     7     0     0     0
   419  0.13364510E-02     0   453     7     0     0     0
   4
   420  0.99806303E+00     0   450     8     0     0     0
   420  0.29768940E-03     0   451     8     0     0     0
   420  0.29070210E-03     0   452     8     0     0     0
   420  0.13486171E-02     0   453     8     0     0     0
   4
   421  0.99807853E+00     0   450     9     0     0     0
   421  0.29696041E-03     0   451     9     0     0     0
   421  0.28817443E-03     0   452     9     0     0     0
   421  0.13363692E-02     0   453     9     0     0     0
   4
   422  0.99806303E+00     0   450    10     0     0     0
   422  0.29768934E-03     0   451    10     0     0     0
   422  0.29070175E-03     0   452    10     0     0     0
   422  0.13486153E-02     0   453    10     0     0     0
   7
   423  0.31673741E-01     0   450    11     0     0     0
   423  0.50565802E-01     0   451    11     0     0     0
   423  0.12092294E+00     0   452    11     0     0     0
   423  0.13733441E+00     0   453    11     0     0     0
   423  0.89472800E-01     0   454    12     0     0     0
   423  0.45170715E+00     0   455    12     0     0     0
   423  0.11832316E+00     0   198   412     0     0     0
   8
   424  0.24506158E+00     0   456    11     0     0     0
   424  0.16706271E+00     0   457    11     0     0     0
   424  0.81703536E-01     0   200   412     0     0     0
   424  0.65706685E-01     0   203   412     0     0     0
   424  0.17122729E-01     0   450    12     0     0     0
   424  0.11095373E+00     0   451    12     0     0     0
   424  0.11949013E+00     0   452    12     0     0     0
   424  0.19289890E+00     0   453    12     0     0     0
   4
   425  0.91072601E+00     0   450   121     0     0     0
   425  0.22831786E-04     0   429   121   131     0     0
   425  0.55991412E-04     0   435   121   125     0     0
   425  0.89195214E-01     0   121   130     0     0     0
   5
   426  0.91188866E+00     0   450   122     0     0     0
   426  0.17569519E-04     0   429   122   131     0     0
   426  0.45875910E-04     0   435   122   125     0     0
   426  0.22459691E-03     0   435   121   126     0     0
   426  0.87823249E-01     0   129   121     0     0     0
   4
   427  0.91072124E+00     0   450   123     0     0     0
   427  0.22828121E-04     0   429   123   131     0     0
   427  0.55984900E-04     0   435   123   125     0     0
   427  0.89199916E-01     0   121   128     0     0     0
   5
   428  0.91188377E+00     0   450   124     0     0     0
   428  0.17566674E-04     0   429   124   131     0     0
   428  0.45870576E-04     0   435   124   125     0     0
   428  0.22459369E-03     0   435   123   126     0     0
   428  0.87828204E-01     0   127   121     0     0     0
   3
   429  0.32090712E-01     0   125   130     0     0     0
   429  0.48391831E+00     0   125   124     0     0     0
   429  0.48399097E+00     0   123   126     0     0     0
   2
   430  0.91001920E-01     0   450   126     0     0     0
   430  0.90899813E+00     0   198   429     0     0     0
   4
   431  0.91072601E+00     0   450   127     0     0     0
   431  0.22831786E-04     0   435   127   125     0     0
   431  0.55991412E-04     0   429   127   131     0     0
   431  0.89195214E-01     0   127   124     0     0     0
   5
   432  0.91188866E+00     0   450   128     0     0     0
   432  0.17569519E-04     0   435   128   125     0     0
   432  0.45875910E-04     0   429   128   131     0     0
   432  0.22459691E-03     0   429   127   132     0     0
   432  0.87823249E-01     0   123   127     0     0     0
   4
   433  0.91072124E+00     0   450   129     0     0     0
   433  0.22828121E-04     0   435   129   125     0     0
   433  0.55984900E-04     0   429   129   131     0     0
   433  0.89199916E-01     0   127   122     0     0     0
   5
   434  0.91188377E+00     0   450   130     0     0     0
   434  0.17566674E-04     0   435   130   125     0     0
   434  0.45870576E-04     0   429   130   131     0     0
   434  0.22459369E-03     0   429   129   132     0     0
   434  0.87828204E-01     0   121   127     0     0     0
   3
   435  0.32090712E-01     0   131   124     0     0     0
   435  0.48391831E+00     0   131   130     0     0     0
   435  0.48399097E+00     0   129   132     0     0     0
   2
   436  0.91001920E-01     0   450   132     0     0     0
   436  0.90899813E+00     0   199   435     0     0     0
   4
   437  0.20835393E-03     0   429   121   131     0     0
   437  0.32665054E-03     0   435   121   125     0     0
   437  0.49973246E+00     0   123   122     0     0     0
   437  0.49973255E+00     0   121   124     0     0     0
   0
   2
   439  0.39055648E+00     0   429   123   131     0     0
   439  0.60944355E+00     0   435   123   125     0     0
   0
   3
   441  0.11247497E+00     0   450   125     0     0     0
   441  0.48006666E+00     0   200   429     0     0     0
   441  0.40745836E+00     0   203   429     0     0     0
   0
   4
   443  0.20835393E-03     0   435   127   125     0     0
   443  0.32665054E-03     0   429   127   131     0     0
   443  0.49973246E+00     0   129   128     0     0     0
   443  0.49973255E+00     0   127   130     0     0     0
   0
   2
   445  0.39055648E+00     0   435   129   125     0     0
   445  0.60944355E+00     0   429   129   131     0     0
   0
   3
   447  0.11247497E+00     0   450   131     0     0     0
   447  0.48006666E+00     0   200   435     0     0     0
   447  0.40745836E+00     0   203   435     0     0     0
   0
  24
   449  0.18418727E-01     0   408     2     0     0     0
   449  0.18418727E-01     0   402     8     0     0     0
   449  0.17915541E-01     0   407     1     0     0     0
   449  0.17915541E-01     0   401     7     0     0     0
   449  0.34776296E-01     0   420     2     0     0     0
   449  0.34776296E-01     0   414     8     0     0     0
   449  0.36676131E-01     0   419     1     0     0     0
   449  0.36676131E-01     0   413     7     0     0     0
   449  0.17920207E-01     0   409     3     0     0     0
   449  0.17920207E-01     0   403     9     0     0     0
   449  0.36689028E-01     0   421     3     0     0     0
   449  0.36689028E-01     0   415     9     0     0     0
   449  0.18422637E-01     0   410     4     0     0     0
   449  0.18422637E-01     0   404    10     0     0     0
   449  0.34775406E-01     0   422     4     0     0     0
   449  0.34775406E-01     0   416    10     0     0     0
   449  0.69307074E-01     0   411     5     0     0     0
   449  0.69307074E-01     0   405    11     0     0     0
   449  0.52582745E-01     0   423     5     0     0     0
   449  0.52582745E-01     0   417    11     0     0     0
   449  0.10453723E+00     0   412     6     0     0     0
   449  0.10453723E+00     0   406    12     0     0     0
   449  0.57979006E-01     0   424     6     0     0     0
   449  0.57979006E-01     0   418    12     0     0     0
   6
   450  0.47099873E-01     0   437   127     0     0     0
   450  0.47099873E-01     0   443   121     0     0     0
   450  0.44779789E-01     0   439   129     0     0     0
   450  0.44779789E-01     0   445   123     0     0     0
   450  0.40812030E+00     0   429   131     0     0     0
   450  0.40812030E+00     0   435   125     0     0     0
  20
   451  0.99509279E-03     0   450   200     0     0     0
   451  0.10365198E-01     0   450   203     0     0     0
   451  0.64139523E-01     0   425   127     0     0     0
   451  0.64139523E-01     0   431   121     0     0     0
   451  0.64154103E-01     0   427   129     0     0     0
   451  0.64154103E-01     0   433   123     0     0     0
   451  0.23135680E-03     0   437   127     0     0     0
   451  0.23135680E-03     0   443   121     0     0     0
   451  0.23055825E-03     0   439   129     0     0     0
   451  0.23055825E-03     0   445   123     0     0     0
   451  0.80459870E-01     0   429   131     0     0     0
   451  0.80459870E-01     0   435   125     0     0     0
   451  0.57476651E-01     0   441   131     0     0     0
   451  0.57476651E-01     0   447   125     0     0     0
   451  0.69862351E-01     0   426   128     0     0     0
   451  0.69862351E-01     0   432   122     0     0     0
   451  0.69877297E-01     0   428   130     0     0     0
   451  0.69877297E-01     0   434   124     0     0     0
   451  0.87888129E-01     0   430   132     0     0     0
   451  0.87888129E-01     0   436   126     0     0     0
  26
   452  0.24023584E+00     0   454   199     0     0     0
   452  0.24023584E+00     0   456   198     0     0     0
   452  0.85089020E-01     0   450   200     0     0     0
   452  0.21998324E+00     0   451   200     0     0     0
   452  0.80049256E-04     0   450     5    11     0     0
   452  0.11288067E-04     0   451     5    11     0     0
   452  0.15909653E-01     0   450   203     0     0     0
   452  0.64466405E-02     0   451   203     0     0     0
   452  0.82315157E-04     0   425   127     0     0     0
   452  0.82315157E-04     0   431   121     0     0     0
   452  0.82318671E-04     0   427   129     0     0     0
   452  0.82318671E-04     0   433   123     0     0     0
   452  0.20739374E-03     0   437   127     0     0     0
   452  0.20739374E-03     0   443   121     0     0     0
   452  0.20711607E-03     0   439   129     0     0     0
   452  0.20711607E-03     0   445   123     0     0     0
   452  0.59985396E-01     0   429   131     0     0     0
   452  0.59985396E-01     0   435   125     0     0     0
   452  0.34199338E-01     0   441   131     0     0     0
   452  0.34199338E-01     0   447   125     0     0     0
   452  0.40683505E-03     0   426   128     0     0     0
   452  0.40683505E-03     0   432   122     0     0     0
   452  0.40685220E-03     0   428   130     0     0     0
   452  0.40685220E-03     0   434   124     0     0     0
   452  0.42656888E-03     0   430   132     0     0     0
   452  0.42656888E-03     0   436   126     0     0     0
  26
   453  0.23673968E+00     0   454   199     0     0     0
   453  0.23673968E+00     0   456   198     0     0     0
   453  0.15814727E-01     0   450   200     0     0     0
   453  0.86310375E-02     0   451   200     0     0     0
   453  0.74084397E-04     0   450     5    11     0     0
   453  0.10965885E-04     0   451     5    11     0     0
   453  0.73520094E-01     0   450   203     0     0     0
   453  0.19231851E+00     0   451   203     0     0     0
   453  0.41626785E-02     0   425   127     0     0     0
   453  0.41626785E-02     0   431   121     0     0     0
   453  0.41628499E-02     0   427   129     0     0     0
   453  0.41628499E-02     0   433   123     0     0     0
   453  0.92991220E-03     0   437   127     0     0     0
   453  0.92991220E-03     0   443   121     0     0     0
   453  0.92870166E-03     0   439   129     0     0     0
   453  0.92870166E-03     0   445   123     0     0     0
   453  0.43708492E-01     0   429   131     0     0     0
   453  0.43708492E-01     0   435   125     0     0     0
   453  0.40181730E-01     0   441   131     0     0     0
   453  0.40181730E-01     0   447   125     0     0     0
   453  0.78776181E-02     0   426   128     0     0     0
   453  0.78776181E-02     0   432   122     0     0     0
   453  0.78779366E-02     0   428   130     0     0     0
   453  0.78779366E-02     0   434   124     0     0     0
   453  0.82457978E-02     0   430   132     0     0     0
   453  0.82457978E-02     0   436   126     0     0     0
   8
   454  0.11174777E-01     0   450   198     0     0     0
   454  0.14517881E+00     0   426   127     0     0     0
   454  0.14520976E+00     0   428   129     0     0     0
   454  0.18560354E+00     0   430   131     0     0     0
   454  0.12369171E+00     0   431   122     0     0     0
   454  0.12371989E+00     0   433   124     0     0     0
   454  0.15685566E+00     0   435   126     0     0     0
   454  0.10856596E+00     0   447   126     0     0     0
  11
   455  0.87730043E-01     0   450   198     0     0     0
   455  0.24260664E+00     0   451   198     0     0     0
   455  0.80621811E-02     0   426   127     0     0     0
   455  0.80625089E-02     0   428   129     0     0     0
   455  0.71930811E-01     0   430   131     0     0     0
   455  0.16444771E-01     0   431   122     0     0     0
   455  0.16445443E-01     0   433   124     0     0     0
   455  0.79876982E-01     0   435   126     0     0     0
   455  0.34184221E-01     0   447   126     0     0     0
   455  0.23075956E+00     0   454   200     0     0     0
   455  0.20389684E+00     0   454   203     0     0     0
   8
   456  0.11174777E-01     0   450   199     0     0     0
   456  0.14517881E+00     0   432   121     0     0     0
   456  0.14520976E+00     0   434   123     0     0     0
   456  0.18560354E+00     0   436   125     0     0     0
   456  0.12369171E+00     0   425   128     0     0     0
   456  0.12371989E+00     0   427   130     0     0     0
   456  0.15685566E+00     0   429   132     0     0     0
   456  0.10856596E+00     0   441   132     0     0     0
  11
   457  0.87730043E-01     0   450   199     0     0     0
   457  0.24260664E+00     0   451   199     0     0     0
   457  0.80621811E-02     0   432   121     0     0     0
   457  0.80625089E-02     0   434   123     0     0     0
   457  0.71930811E-01     0   436   125     0     0     0
   457  0.16444771E-01     0   425   128     0     0     0
   457  0.16445443E-01     0   427   130     0     0     0
   457  0.79876982E-01     0   429   132     0     0     0
   457  0.34184221E-01     0   441   132     0     0     0
   457  0.23075956E+00     0   456   200     0     0     0
   457  0.20389684E+00     0   456   203     0     0     0
  28
   203  0.16684803E-03     0   123   129     0     0     0
   203  0.47725301E-01     0   125   131     0     0     0
   203  0.20027144E-02     0     3     9     0     0     0
   203  0.78708488E+00     0     5    11     0     0     0
   203  0.37639610E-01     0     4    10     0     0     0
   203  0.16359003E-02     0    59    59     0     0     0
   203  0.32681480E-01     0    13    13     0     0     0
   203  0.46492689E-02     0   198   121   128     0     0
   203  0.46492689E-02     0   198   123   130     0     0
   203  0.46492689E-02     0   198   125   132     0     0
   203  0.13947808E-01     0   198     8     1     0     0
   203  0.13947808E-01     0   198    10     3     0     0
   203  0.46492689E-02     0   199   127   122     0     0
   203  0.46492689E-02     0   199   129   124     0     0
   203  0.46492689E-02     0   199   131   126     0     0
   203  0.13947808E-01     0   199     2     7     0     0
   203  0.13947808E-01     0   199     4     9     0     0
   203  0.50448353E-03     0   200   122   128     0     0
   203  0.50448353E-03     0   200   124   130     0     0
   203  0.50448353E-03     0   200   126   132     0     0
   203  0.25390147E-03     0   200   121   127     0     0
   203  0.25390147E-03     0   200   123   129     0     0
   203  0.25390147E-03     0   200   125   131     0     0
   203  0.86984498E-03     0   200     2     8     0     0
   203  0.86984498E-03     0   200     4    10     0     0
   203  0.11205747E-02     0   200     1     7     0     0
   203  0.11205747E-02     0   200     3     9     0     0
   203  0.11205747E-02     0   200     5    11     0     0
   9
   204  0.21425106E-03     0   123   129     0     0     0
   204  0.61362773E-01     0   125   131     0     0     0
   204  0.25177409E-02     0     3     9     0     0     0
   204  0.77606577E+00     0     5    11     0     0     0
   204  0.16442785E-02     0     6    12     0     0     0
   204  0.54841585E-04     0   450   450     0     0     0
   204  0.42164326E-01     0   429   435     0     0     0
   204  0.57988040E-01     0   429   447     0     0     0
   204  0.57988040E-01     0   441   435     0     0     0
  10
   205  0.21423040E-03     0   123   129     0     0     0
   205  0.61358202E-01     0   125   131     0     0     0
   205  0.25175244E-02     0     3     9     0     0     0
   205  0.77617508E+00     0     5    11     0     0     0
   205  0.19216471E-02     0     6    12     0     0     0
   205  0.21632530E-04     0    13    13     0     0     0
   205  0.17579214E-03     0   450   450     0     0     0
   205  0.42154551E-01     0   429   435     0     0     0
   205  0.57730615E-01     0   429   447     0     0     0
   205  0.57730615E-01     0   441   435     0     0     0
   5
   206  0.24557926E-03     0   124   129     0     0     0
   206  0.70336893E-01     0   126   131     0     0     0
   206  0.26463410E-02     0     4     9     0     0     0
   206  0.73459548E+00     0     6    11     0     0     0
   206  0.19217573E+00     0   435   430     0     0     0
   5
   207  0.24557926E-03     0   130   123     0     0     0
   207  0.70336893E-01     0   132   125     0     0     0
   207  0.26463410E-02     0    10     3     0     0     0
   207  0.73459548E+00     0    12     5     0     0     0
   207  0.19217573E+00     0   429   436     0     0     0
   0
   5
     6  0.33333334E+00   100     2     7     5     0     0
     6  0.33333334E+00   100     4     9     5     0     0
     6  0.11111111E+00   100   122   127     5     0     0
     6  0.11111111E+00   100   124   129     5     0     0
     6  0.11111111E+00   100   126   131     5     0     0
   5
    12  0.33333334E+00   100     8     1    11     0     0
    12  0.33333334E+00   100    10     3    11     0     0
    12  0.11111111E+00   100   128   121    11     0     0
    12  0.11111111E+00   100   130   123    11     0     0
    12  0.11111111E+00   100   132   125    11     0     0
     30.14369965     -0.03400107
      0.99792832     -0.00709588      0.05962384     -0.02309812
     -0.01965149     -0.97883737      0.16752970     -0.11586662
      0.02548674     -0.03743948     -0.70515412     -0.70760602
     -0.05570565      0.20106074      0.68639368     -0.69665998
     -0.98637599      0.16450667     -0.16450667     -0.98637599
     -0.97131908      0.23777992     -0.23777992     -0.97131908
     -1.19398475     -0.58555180     -1.31875670
  -1265.72998047   6130.27978516  -2030.98999023
    865.32598877
    F
  0.00000000E+00  0.00000000E+00  0.00000000E+00  0.47254100E-01  0.64690201E-20  0.00000000E+00  0.00000000E+00  0.00000000E+00  0.37812801E-19 -0.47254100E-01 -0.64690201E-20 -0.00000000E+00  0.00000000E+00  0.00000000E+00  0.00000000E+00  0.00000000E+00  0.00000000E+00  0.21140499E-06 -0.00000000E+00 -0.00000000E+00 -0.37812801E-19 -0.00000000E+00 -0.00000000E+00 -0.21140499E-06  0.00000000E+00  0.00000000E+00  0.00000000E+00
  0.55826399E-22  0.28025969E-44  0.00000000E+00  0.00000000E+00  0.12223000E-20  0.00000000E+00  0.00000000E+00  0.00000000E+00  0.48228100E-19  0.31211500E-09  0.18036101E-31  0.00000000E+00  0.84169602E-33  0.68336798E-08  0.00000000E+00  0.00000000E+00  0.00000000E+00  0.26963500E-06  0.00000000E+00  0.00000000E+00  0.00000000E+00  0.00000000E+00  0.00000000E+00  0.00000000E+00  0.00000000E+00  0.00000000E+00  0.00000000E+00
  0.00000000E+00  0.00000000E+00  0.00000000E+00  0.00000000E+00  0.00000000E+00  0.00000000E+00  0.00000000E+00  0.00000000E+00  0.00000000E+00  0.00000000E+00  0.00000000E+00  0.00000000E+00  0.00000000E+00  0.00000000E+00  0.00000000E+00  0.00000000E+00  0.00000000E+00  0.00000000E+00  0.00000000E+00  0.00000000E+00  0.00000000E+00  0.00000000E+00  0.00000000E+00  0.00000000E+00  0.00000000E+00  0.00000000E+00  0.00000000E+00
