#  ISAJET SUSY parameters in SUSY Les Houches Accord 2 format
#  Created by ISALHA 2.0 Last revision: C. Balazs 21 Apr 2009
Block SPINFO   # Program information
     1   ISASUGRA from ISAJET          # Spectrum Calculator
     2   7.80   29-OCT-2009 12:50:36   # Version number
Block MODSEL   # Model selection
     1    13   # Non-universal supergravity model                  
Block SMINPUTS   # Standard Model inputs
     1     1.27836243E+02   # alpha_em^(-1)
     2     1.16570000E-05   # G_Fermi
     3     1.17200002E-01   # alpha_s(M_Z)
     4     9.11699982E+01   # m_{Z}(pole)
     5     4.19999981E+00   # m_{b}(m_{b})
     6     1.72500000E+02   # m_{top}(pole)
     7     1.77699995E+00   # m_{tau}(pole)
Block MINPAR   # SUSY breaking input parameters
     1     5.00000000E+03   # m_0
     2     5.00000000E+03   # m_{1/2}
     3     1.04999995E+00   # tan(beta)
     4     1.00000000E+00   # sign(mu)
     5     0.00000000E+00   # A_0
Block EXTPAR   # Non-universal SUSY breaking parameters
     0     1.00000000E+04   # Input scale
    21    -1.21530960E+07   # Down type Higgs mass squared
    22    -1.21524730E+07   #  Up  type Higgs mass squared
     1     0.00000000E+00   #  U(1)_Y gaugino (Bino) mass
     2     5.00000000E+03   # SU(2)_L gaugino (Wino) mass
     3     5.00000000E+02   # SU(3)_C gaugino (gluino) mass
    34     5.00000000E+03   # Right scalar electron mass
    31     5.00000000E+03   # Left 1st gen. slepton mass
    47     5.00000000E+02   # Right scalar down mass
    44     5.00000000E+02   # Right scalar  up  mass
    41     5.00000000E+02   # Left 1st gen. squark mass
    36     5.00000000E+03   # Right scalar tau mass
    33     5.00000000E+03   # Left 3rd gen. slepton mass
    49     5.00000000E+03   # Right scalar bottom mass
    46     5.00000000E+03   # Right scalar top mass
    43     5.00000000E+03   # Left 3rd gen. squark mass
Block MASS   # Scalar and gaugino mass spectrum
#  PDG code   mass                 particle
        24     8.04229965E+01   #  W^+
        25     5.00000000e+03   #  h^0            
        35     5.00000000e+03   #  H^0            
        36     5.00000000e+03   #  A^0            
        37     5.00000000e+03   #  H^+            
   1000001     9.00000000e+02   #  dnl            
   1000002     9.00000000e+02   #  upl            
   1000003     9.00000000e+02   #  stl            
   1000004     9.00000000e+02   #  chl            
   1000005     5.00000000e+03   #  b1             
   1000006     5.00000000e+03   #  t1             
   1000011     5.00000000e+03   #  el-            
   1000012     5.00000000e+03   #  nuel           
   1000013     5.00000000e+03   #  mul-           
   1000014     5.00000000e+03   #  numl           
   1000015     5.00000000e+03   #  tau1           
   1000016     5.00000000e+03   #  nutl           
   1000021     1.40000000e+03   #  glss           
   1000022     1.95000000e+02   #  z1ss           
   1000023     5.00000000e+03   #  z2ss           
   1000024     5.00000000e+03   #  w1ss           
   1000025     5.00000000e+03   #  z3ss           
   1000035     5.00000000e+03   #  z4ss           
   1000037     5.00000000e+03   #  w2ss           
   2000001     9.00000000e+02   #  dnr            
   2000002     9.00000000e+02   #  upr            
   2000003     9.00000000e+02   #  str            
   2000004     9.00000000e+02   #  chr            
   2000005     5.00000000e+03   #  b2             
   2000006     5.00000000e+03   #  t2             
   2000011     5.00000000e+03   #  er-            
   2000013     5.00000000e+03   #  mur-           
   2000015     5.00000000e+03   #  tau2           
Block ALPHA   # Effective Higgs mixing parameter
         -7.61225343E-01   # alpha
Block STOPMIX   # stop mixing matrix
  1  1     4.11578804E-01   # O_{11}
  1  2     9.11374152E-01   # O_{12}
  2  1    -9.11374152E-01   # O_{21}
  2  2     4.11578804E-01   # O_{22}
Block SBOTMIX   # sbottom mixing matrix
  1  1     7.21292436E-01   # O_{11}
  1  2     6.92630649E-01   # O_{12}
  2  1    -6.92630649E-01   # O_{21}
  2  2     7.21292436E-01   # O_{22}
Block STAUMIX   # stau mixing matrix
  1  1     1.15967337E-02   # O_{11}
  1  2     9.99932766E-01   # O_{12}
  2  1    -9.99932766E-01   # O_{21}
  2  2     1.15967337E-02   # O_{22}
Block NMIX   # neutralino mixing matrix
  1  1     9.99965727E-01   #
  1  2     6.19883998E-04   #
  1  3     5.98469656E-03   #
  1  4    -5.69890067E-03   #
  2  1    -3.05461744E-03   #
  2  2    -8.99356544E-01   #
  2  3     3.09205741E-01   #
  2  4    -3.09095919E-01   #
  3  1    -2.02044539E-04   #
  3  2     8.11236241E-05   #
  3  3     7.07098126E-01   #
  3  4     7.07115471E-01   #
  4  1    -7.70109193E-03   #
  4  2     4.37215477E-01   #
  4  3     6.35899603E-01   #
  4  4    -6.35936439E-01   #
Block UMIX   # chargino U mixing matrix
  1  1    -8.51988018E-01   # U_{11}
  1  2     5.23561239E-01   # U_{12}
  2  1    -5.23561239E-01   # U_{21}
  2  2    -8.51988018E-01   # U_{22}
Block VMIX   # chargino V mixing matrix
  1  1    -8.51987004E-01   # V_{11}
  1  2     5.23562908E-01   # V_{12}
  2  1    -5.23562908E-01   # V_{21}
  2  2    -8.51987004E-01   # V_{22}
Block GAUGE Q=  4.95367969E+03   #
     1     3.57524991E-01   # g`
     2     6.52378619E-01   # g_2
     3     1.21928000E+00   # g_3
Block YU Q=  4.95367969E+03   #
  3  3     1.11666286E+00   # y_t
Block YD Q=  4.95367969E+03   #
  3  3     1.78913847E-02   # y_b
Block YE Q=  4.95367969E+03   #
  3  3     1.46171292E-02   # y_tau
Block HMIX Q=  4.95367969E+03   # Higgs mixing parameters
     1     5.00000000E+03   # mu(Q)
     2     1.04999995E+00   # tan(beta)(M_GUT)
     3     2.52928284E+02   # Higgs vev at Q
     4     2.50000000E+07   # m_A^2(Q)
Block MSOFT Q=  4.95367969E+03   # DRbar SUSY breaking parameters
     1    -2.49941841E-01   # M_1(Q)          
     2     4.97828369E+03   # M_2(Q)          
     3     5.71167542E+02   # M_3(Q)          
    31     5.02573047E+03   # MeL(Q)          
    32     5.02573047E+03   # MmuL(Q)         
    33     5.02622510E+03   # MtauL(Q)        
    34     4.99976221E+03   # MeR(Q)          
    35     4.99976221E+03   # MmuR(Q)         
    36     4.99974414E+03   # MtauR(Q)        
    41     1.03033508E+03   # MqL1(Q)         
    42     1.03033508E+03   # MqL2(Q)         
    43     4.98691504E+03   # MqL3(Q)         
    44     4.90182617E+02   # MuR(Q)          
    45     4.90182617E+02   # McR(Q)          
    46     4.92066553E+03   # MtR(Q)          
    47     4.83325043E+02   # MdR(Q)          
    48     4.83325043E+02   # MsR(Q)          
    49     4.99957080E+03   # MbR(Q)          
Block AU Q=  4.95367969E+03   #
  1  1    -7.30358887E+01   # A_u
  2  2    -7.30358887E+01   # A_c
  3  3    -7.30358887E+01   # A_t
Block AD Q=  4.95367969E+03   #
  1  1    -7.64760590E+01   # A_d
  2  2    -7.64760590E+01   # A_s
  3  3    -7.64760590E+01   # A_b
Block AE Q=  4.95367969E+03   #
  1  1    -5.29883537E+01   # A_e
  2  2    -5.29883537E+01   # A_mu
  3  3    -5.29883537E+01   # A_tau
#  ISAJET decay tables in SUSY Les Houches accord format
#  Created by ISALHD. Last revision: C. Balazs, 2005 May 25
Block DCINFO                           # Program information
     1   ISASUGRA from ISAJET          # Spectrum Calculator
     2   7.80   29-OCT-2009 12:50:36   # Version number
#         PDG         Width
DECAY         6  1.14680767E+00   # TP    decays
#          BR          NDA       ID1       ID2       ID3       ID4
      3.33333343E-01    3            2        -1         5             # TP     -->  UP     DB     BT          
      3.33333343E-01    3            4        -3         5             # TP     -->  CH     SB     BT          
      1.11111112E-01    3          -11        12         5             # TP     -->  E+     NUE    BT          
      1.11111112E-01    3          -13        14         5             # TP     -->  MU+    NUM    BT          
      1.11111112E-01    3          -15        16         5             # TP     -->  TAU+   NUT    BT          
#         PDG         Width
DECAY   1000021  8.58219604E+01   # GLSS  decays
#          BR          NDA       ID1       ID2       ID3       ID4
      1.92009950E-11    2      1000022        21                       # GLSS   -->  Z1SS   GL                 
      4.72287880E-08    3      1000022         5        -5             # GLSS   -->  Z1SS   BT     BB          
      1.15281296E-07    3      1000022         6        -6             # GLSS   -->  Z1SS   TP     TB          
      6.25152886E-02    2     -1000002         2                       # GLSS   -->  UBL    UP                 
      6.25152886E-02    2      1000002        -2                       # GLSS   -->  UPL    UB                 
      6.24814555E-02    2     -1000001         1                       # GLSS   -->  DBL    DN                 
      6.24814555E-02    2      1000001        -1                       # GLSS   -->  DNL    DB                 
      6.25068843E-02    2     -2000002         2                       # GLSS   -->  UBR    UP                 
      6.25068843E-02    2      2000002        -2                       # GLSS   -->  UPR    UB                 
      6.24966733E-02    2     -2000001         1                       # GLSS   -->  DBR    DN                 
      6.24966733E-02    2      2000001        -1                       # GLSS   -->  DNR    DB                 
      6.24814592E-02    2     -1000003         3                       # GLSS   -->  SBL    ST                 
      6.24814592E-02    2      1000003        -3                       # GLSS   -->  STL    SB                 
      6.24966547E-02    2     -2000003         3                       # GLSS   -->  SBR    ST                 
      6.24966547E-02    2      2000003        -3                       # GLSS   -->  STR    SB                 
      6.25149384E-02    2     -1000004         4                       # GLSS   -->  CBL    CH                 
      6.25149384E-02    2      1000004        -4                       # GLSS   -->  CHL    CB                 
      6.25065491E-02    2     -2000004         4                       # GLSS   -->  CBR    CH                 
      6.25065491E-02    2      2000004        -4                       # GLSS   -->  CHR    CB                 
#         PDG         Width
DECAY   1000002  1.15330063E-01   # UPL   decays
#          BR          NDA       ID1       ID2       ID3       ID4
      1.00000000E+00    2      1000022         2                       # UPL    -->  Z1SS   UP                 
#         PDG         Width
DECAY   1000001  1.15744628E-01   # DNL   decays
#          BR          NDA       ID1       ID2       ID3       ID4
      1.00000000E+00    2      1000022         1                       # DNL    -->  Z1SS   DN                 
#         PDG         Width
DECAY   1000003  1.15744628E-01   # STL   decays
#          BR          NDA       ID1       ID2       ID3       ID4
      1.00000000E+00    2      1000022         3                       # STL    -->  Z1SS   ST                 
#         PDG         Width
DECAY   1000004  1.15329646E-01   # CHL   decays
#          BR          NDA       ID1       ID2       ID3       ID4
      1.00000000E+00    2      1000022         4                       # CHL    -->  Z1SS   CH                 
#         PDG         Width
DECAY   1000005  2.25646210E+02   # BT1   decays
#          BR          NDA       ID1       ID2       ID3       ID4
      7.84299243E-03    2      1000022         5                       # BT1    -->  Z1SS   BT                 
      2.40948157E-05    2      1000023         5                       # BT1    -->  Z2SS   BT                 
      9.92132902E-01    2      1000021         5                       # BT1    -->  GLSS   BT                 
#         PDG         Width
DECAY   1000006  2.30550385E+02   # TP1   decays
#          BR          NDA       ID1       ID2       ID3       ID4
      9.73648787E-01    2      1000021         6                       # TP1    -->  GLSS   TP                 
      2.63336711E-02    2      1000022         6                       # TP1    -->  Z1SS   TP                 
      1.75343430E-05    2      1000024         5                       # TP1    -->  W1SS+  BT                 
#         PDG         Width
DECAY   2000002  1.84848905E+00   # UPR   decays
#          BR          NDA       ID1       ID2       ID3       ID4
      1.00000000E+00    2      1000022         2                       # UPR    -->  Z1SS   UP                 
#         PDG         Width
DECAY   2000001  4.62154299E-01   # DNR   decays
#          BR          NDA       ID1       ID2       ID3       ID4
      1.00000000E+00    2      1000022         1                       # DNR    -->  Z1SS   DN                 
#         PDG         Width
DECAY   2000003  4.62154359E-01   # STR   decays
#          BR          NDA       ID1       ID2       ID3       ID4
      1.00000000E+00    2      1000022         3                       # STR    -->  Z1SS   ST                 
#         PDG         Width
DECAY   2000004  1.84848237E+00   # CHR   decays
#          BR          NDA       ID1       ID2       ID3       ID4
      1.00000000E+00    2      1000022         4                       # CHR    -->  Z1SS   CH                 
#         PDG         Width
DECAY   2000005  2.25506790E+02   # BT2   decays
#          BR          NDA       ID1       ID2       ID3       ID4
      7.77172856E-03    2      1000022         5                       # BT2    -->  Z1SS   BT                 
      2.28467252E-05    2      1000023         5                       # BT2    -->  Z2SS   BT                 
      9.92205381E-01    2      1000021         5                       # BT2    -->  GLSS   BT                 
#         PDG         Width
DECAY   2000006  2.28419800E+02   # TP2   decays
#          BR          NDA       ID1       ID2       ID3       ID4
      9.72472608E-01    2      1000021         6                       # TP2    -->  GLSS   TP                 
      5.22543414E-05    2      1000024         5                       # TP2    -->  W1SS+  BT                 
      1.74260314E-03    2           23   1000006                       # TP2    -->  Z0     TP1                
      8.99908707E-12    2           25   1000006                       # TP2    -->  HL0    TP1                
      2.57324781E-02    2      1000022         6                       # TP2    -->  Z1SS   TP                 
#         PDG         Width
DECAY   1000011  6.36672354E+00   # EL-   decays
#          BR          NDA       ID1       ID2       ID3       ID4
      9.94940817E-01    2      1000022        11                       # EL-    -->  Z1SS   E-                 
      1.69545214E-03    2      1000023        11                       # EL-    -->  Z2SS   E-                 
      3.09779010E-19    2      1000025        11                       # EL-    -->  Z3SS   E-                 
      3.36371129E-03    2     -1000024        12                       # EL-    -->  W1SS-  NUE                
#         PDG         Width
DECAY   1000013  6.36672354E+00   # MUL-  decays
#          BR          NDA       ID1       ID2       ID3       ID4
      9.94940817E-01    2      1000022        13                       # MUL-   -->  Z1SS   MU-                
      1.69545063E-03    2      1000023        13                       # MUL-   -->  Z2SS   MU-                
      3.36371129E-03    2     -1000024        14                       # MUL-   -->  W1SS-  NUM                
#         PDG         Width
DECAY   1000015  1.58651018E+01   # TAU1- decays
#          BR          NDA       ID1       ID2       ID3       ID4
      9.98963714E-01    2      1000022        15                       # TAU1-  -->  Z1SS   TAU-               
      3.47031251E-04    2      1000023        15                       # TAU1-  -->  Z2SS   TAU-               
      6.89212815E-04    2     -1000024        16                       # TAU1-  -->  W1SS-  NUT                
#         PDG         Width
DECAY   1000012  6.37355328E+00   # NUEL  decays
#          BR          NDA       ID1       ID2       ID3       ID4
      9.94981766E-01    2      1000022        12                       # NUEL   -->  Z1SS   NUE                
      1.65800075E-03    2      1000023        12                       # NUEL   -->  Z2SS   NUE                
      3.36021627E-03    2      1000024        11                       # NUEL   -->  W1SS+  E-                 
      1.91668126E-19    3     -1000015        11        16             # NUEL   -->  TAU1+  E-     NUT         
#         PDG         Width
DECAY   1000014  6.37355328E+00   # NUML  decays
#          BR          NDA       ID1       ID2       ID3       ID4
      9.94981766E-01    2      1000022        14                       # NUML   -->  Z1SS   NUM                
      1.65800075E-03    2      1000023        14                       # NUML   -->  Z2SS   NUM                
      3.36021301E-03    2      1000024        13                       # NUML   -->  W1SS+  MU-                
      1.91668437E-19    3     -1000015        13        16             # NUML   -->  TAU1+  MU-    NUT         
#         PDG         Width
DECAY   1000016  6.37353754E+00   # NUTL  decays
#          BR          NDA       ID1       ID2       ID3       ID4
      9.94984269E-01    2      1000022        16                       # NUTL   -->  Z1SS   NUT                
      1.65800483E-03    2      1000023        16                       # NUTL   -->  Z2SS   NUT                
      3.35777458E-03    2      1000024        15                       # NUTL   -->  W1SS+  TAU-               
#         PDG         Width
DECAY   2000011  2.53522377E+01   # ER-   decays
#          BR          NDA       ID1       ID2       ID3       ID4
      9.99999940E-01    2      1000022        11                       # ER-    -->  Z1SS   E-                 
      4.43139534E-08    2      1000023        11                       # ER-    -->  Z2SS   E-                 
      4.20152718E-19    2      1000025        11                       # ER-    -->  Z3SS   E-                 
      2.47087486E-23    3      1000015        12       -16             # ER-    -->  TAU1-  NUE    ANUT        
#         PDG         Width
DECAY   2000013  2.53522377E+01   # MUR-  decays
#          BR          NDA       ID1       ID2       ID3       ID4
      9.99999940E-01    2      1000022        13                       # MUR-   -->  Z1SS   MU-                
      4.43139179E-08    2      1000023        13                       # MUR-   -->  Z2SS   MU-                
      5.21658190E-20    3      1000015        14       -16             # MUR-   -->  TAU1-  NUM    ANUT        
#         PDG         Width
DECAY   2000015  1.58538351E+01   # TAU2- decays
#          BR          NDA       ID1       ID2       ID3       ID4
      9.99006450E-01    2      1000022        15                       # TAU2-  -->  Z1SS   TAU-               
      3.32922733E-04    2      1000023        15                       # TAU2-  -->  Z2SS   TAU-               
      6.60620222E-04    2     -1000024        16                       # TAU2-  -->  W1SS-  NUT                
#         PDG         Width
DECAY   1000023  1.18123016E+02   # Z2SS  decays
#          BR          NDA       ID1       ID2       ID3       ID4
      3.25716121E-10    2      1000022        22                       # Z2SS   -->  Z1SS   GM                 
      7.23074527E-06    2      1000022        23                       # Z2SS   -->  Z1SS   Z0                 
      4.43239560E-06    3      1000022         5        -5             # Z2SS   -->  Z1SS   BT     BB          
      1.33119556E-05    3      1000022        11       -11             # Z2SS   -->  Z1SS   E-     E+          
      1.33119556E-05    3      1000022        13       -13             # Z2SS   -->  Z1SS   MU-    MU+         
      1.33609019E-05    3      1000022        15       -15             # Z2SS   -->  Z1SS   TAU-   TAU+        
      1.30520420E-05    3      1000022        12       -12             # Z2SS   -->  Z1SS   NUE    ANUE        
      1.30520420E-05    3      1000022        14       -14             # Z2SS   -->  Z1SS   NUM    ANUM        
      1.30520420E-05    3      1000022        16       -16             # Z2SS   -->  Z1SS   NUT    ANUT        
      1.47190094E-02    2      1000022        25                       # Z2SS   -->  Z1SS   HL0                
      1.23567753E-01    2      1000002        -2                       # Z2SS   -->  UPL    UB                 
      1.23567753E-01    2     -1000002         2                       # Z2SS   -->  UBL    UP                 
      1.22722618E-01    2      1000001        -1                       # Z2SS   -->  DNL    DB                 
      1.22722618E-01    2     -1000001         1                       # Z2SS   -->  DBL    DN                 
      1.22722618E-01    2      1000003        -3                       # Z2SS   -->  STL    SB                 
      1.22722618E-01    2     -1000003         3                       # Z2SS   -->  SBL    ST                 
      1.23567730E-01    2      1000004        -4                       # Z2SS   -->  CHL    CB                 
      1.23567730E-01    2     -1000004         4                       # Z2SS   -->  CBL    CH                 
      5.75506465E-06    2      2000002        -2                       # Z2SS   -->  UPR    UB                 
      5.75506465E-06    2     -2000002         2                       # Z2SS   -->  UBR    UP                 
      1.43875457E-06    2      2000001        -1                       # Z2SS   -->  DNR    DB                 
      1.43875457E-06    2     -2000001         1                       # Z2SS   -->  DBR    DN                 
      1.43875445E-06    2      2000003        -3                       # Z2SS   -->  STR    SB                 
      1.43875445E-06    2     -2000003         3                       # Z2SS   -->  SBR    ST                 
      5.75506374E-06    2      2000004        -4                       # Z2SS   -->  CHR    CB                 
      5.75506374E-06    2     -2000004         4                       # Z2SS   -->  CBR    CH                 
#         PDG         Width
DECAY   1000025  3.49308109E+00   # Z3SS  decays
#          BR          NDA       ID1       ID2       ID3       ID4
      7.44106364E-06    2      1000022        22                       # Z3SS   -->  Z1SS   GM                 
      1.21972799E-13    2      1000023        22                       # Z3SS   -->  Z2SS   GM                 
      8.26077594E-04    3     -1000024         2        -1             # Z3SS   -->  W1SS-  UP     DB          
      2.75359198E-04    3     -1000024        12       -11             # Z3SS   -->  W1SS-  NUE    E+          
      2.75359198E-04    3     -1000024        14       -13             # Z3SS   -->  W1SS-  NUM    MU+         
      8.26077594E-04    3      1000024         1        -2             # Z3SS   -->  W1SS+  DN     UB          
      2.75359198E-04    3      1000024        11       -12             # Z3SS   -->  W1SS+  E-     ANUE        
      2.75359198E-04    3      1000024        13       -14             # Z3SS   -->  W1SS+  MU-    ANUM        
      8.26077594E-04    3     -1000024         4        -3             # Z3SS   -->  W1SS-  CH     SB          
      2.75359198E-04    3     -1000024        16       -15             # Z3SS   -->  W1SS-  NUT    TAU+        
      8.26077594E-04    3      1000024         3        -4             # Z3SS   -->  W1SS+  ST     CB          
      2.75359198E-04    3      1000024        15       -16             # Z3SS   -->  W1SS+  TAU-   ANUT        
      9.93539393E-01    2      1000022        23                       # Z3SS   -->  Z1SS   Z0                 
      2.47831736E-06    3      1000022         5        -5             # Z3SS   -->  Z1SS   BT     BB          
      2.53240290E-10    3      1000022        11       -11             # Z3SS   -->  Z1SS   E-     E+          
      2.53240290E-10    3      1000022        13       -13             # Z3SS   -->  Z1SS   MU-    MU+         
      1.90554033E-06    3      1000022        15       -15             # Z3SS   -->  Z1SS   TAU-   TAU+        
      1.17817835E-04    3      1000023         2        -2             # Z3SS   -->  Z2SS   UP     UB          
      1.51926899E-04    3      1000023         1        -1             # Z3SS   -->  Z2SS   DN     DB          
      1.51926899E-04    3      1000023         3        -3             # Z3SS   -->  Z2SS   ST     SB          
      1.17817835E-04    3      1000023         4        -4             # Z3SS   -->  Z2SS   CH     CB          
      1.49527390E-04    3      1000023         5        -5             # Z3SS   -->  Z2SS   BT     BB          
      3.44644541E-05    3      1000023        11       -11             # Z3SS   -->  Z2SS   E-     E+          
      3.44644541E-05    3      1000023        13       -13             # Z3SS   -->  Z2SS   MU-    MU+         
      3.43424836E-05    3      1000023        15       -15             # Z3SS   -->  Z2SS   TAU-   TAU+        
      6.85735795E-05    3      1000023        12       -12             # Z3SS   -->  Z2SS   NUE    ANUE        
      6.85735795E-05    3      1000023        14       -14             # Z3SS   -->  Z2SS   NUM    ANUM        
      6.85735795E-05    3      1000023        16       -16             # Z3SS   -->  Z2SS   NUT    ANUT        
      4.90655948E-04    2      1000022        25                       # Z3SS   -->  Z1SS   HL0                
      1.25427807E-10    2      1000023        25                       # Z3SS   -->  Z2SS   HL0                
      2.11344016E-07    2      1000002        -2                       # Z3SS   -->  UPL    UB                 
      2.11344016E-07    2     -1000002         2                       # Z3SS   -->  UBL    UP                 
      4.63580534E-07    2      1000001        -1                       # Z3SS   -->  DNL    DB                 
      4.63580534E-07    2     -1000001         1                       # Z3SS   -->  DBL    DN                 
      4.63580534E-07    2      1000003        -3                       # Z3SS   -->  STL    SB                 
      4.63580534E-07    2     -1000003         3                       # Z3SS   -->  SBL    ST                 
      2.11343973E-07    2      1000004        -4                       # Z3SS   -->  CHL    CB                 
      2.11343973E-07    2     -1000004         4                       # Z3SS   -->  CBL    CH                 
      1.95636105E-07    2      2000002        -2                       # Z3SS   -->  UPR    UB                 
      1.95636105E-07    2     -2000002         2                       # Z3SS   -->  UBR    UP                 
      4.89086460E-08    2      2000001        -1                       # Z3SS   -->  DNR    DB                 
      4.89086460E-08    2     -2000001         1                       # Z3SS   -->  DBR    DN                 
      4.89086460E-08    2      2000003        -3                       # Z3SS   -->  STR    SB                 
      4.89086460E-08    2     -2000003         3                       # Z3SS   -->  SBR    ST                 
      1.95636076E-07    2      2000004        -4                       # Z3SS   -->  CHR    CB                 
      1.95636076E-07    2     -2000004         4                       # Z3SS   -->  CBR    CH                 
      2.13938056E-17    2      1000012       -12                       # Z3SS   -->  NUEL   ANUE               
      2.13938056E-17    2     -1000012        12                       # Z3SS   -->  ANUEL  NUE                
      2.13938056E-17    2      1000014       -14                       # Z3SS   -->  NUML   ANUM               
      2.13938056E-17    2     -1000014        14                       # Z3SS   -->  ANUML  NUM                
      2.13938056E-17    2      1000016       -16                       # Z3SS   -->  NUTL   ANUT               
      2.13938056E-17    2     -1000016        16                       # Z3SS   -->  ANUTL  NUT                
#         PDG         Width
DECAY   1000035  1.25213112E+02   # Z4SS  decays
#          BR          NDA       ID1       ID2       ID3       ID4
      2.33722176E-07    2      1000022        22                       # Z4SS   -->  Z1SS   GM                 
      1.71825987E-09    2      1000023        22                       # Z4SS   -->  Z2SS   GM                 
      3.05426823E-10    2      1000025        22                       # Z4SS   -->  Z3SS   GM                 
      1.33424252E-02    2      1000024       -24                       # Z4SS   -->  W1SS+  W-                 
      1.33424252E-02    2     -1000024        24                       # Z4SS   -->  W1SS-  W+                 
      7.29438898E-06    2      1000022        23                       # Z4SS   -->  Z1SS   Z0                 
      1.28646185E-13    2      1000023        23                       # Z4SS   -->  Z2SS   Z0                 
      2.00087484E-08    3      1000022         5        -5             # Z4SS   -->  Z1SS   BT     BB          
      3.13113158E-09    3      1000022        15       -15             # Z4SS   -->  Z1SS   TAU-   TAU+        
      1.68726912E-21    3      1000023         5        -5             # Z4SS   -->  Z2SS   BT     BB          
      2.66267945E-22    3      1000023        15       -15             # Z4SS   -->  Z2SS   TAU-   TAU+        
      3.42861790E-06    3      1000025         2        -2             # Z4SS   -->  Z3SS   UP     UB          
      4.42122564E-06    3      1000025         1        -1             # Z4SS   -->  Z3SS   DN     DB          
      4.42122564E-06    3      1000025         3        -3             # Z4SS   -->  Z3SS   ST     SB          
      3.42861790E-06    3      1000025         4        -4             # Z4SS   -->  Z3SS   CH     CB          
      4.36187065E-06    3      1000025         5        -5             # Z4SS   -->  Z3SS   BT     BB          
      1.00295279E-06    3      1000025        11       -11             # Z4SS   -->  Z3SS   E-     E+          
      1.00295279E-06    3      1000025        13       -13             # Z4SS   -->  Z3SS   MU-    MU+         
      9.99443046E-07    3      1000025        15       -15             # Z4SS   -->  Z3SS   TAU-   TAU+        
      1.99556052E-06    3      1000025        12       -12             # Z4SS   -->  Z3SS   NUE    ANUE        
      1.99556052E-06    3      1000025        14       -14             # Z4SS   -->  Z3SS   NUM    ANUM        
      1.99556052E-06    3      1000025        16       -16             # Z4SS   -->  Z3SS   NUT    ANUT        
      1.34489853E-02    2      1000022        25                       # Z4SS   -->  Z1SS   HL0                
      1.15155501E-07    2      1000023        25                       # Z4SS   -->  Z2SS   HL0                
      4.04053960E-12    2      1000025        25                       # Z4SS   -->  Z3SS   HL0                
      1.19483732E-01    2      1000002        -2                       # Z4SS   -->  UPL    UB                 
      1.19483732E-01    2     -1000002         2                       # Z4SS   -->  UBL    UP                 
      1.20277315E-01    2      1000001        -1                       # Z4SS   -->  DNL    DB                 
      1.20277315E-01    2     -1000001         1                       # Z4SS   -->  DBL    DN                 
      1.20277315E-01    2      1000003        -3                       # Z4SS   -->  STL    SB                 
      1.20277315E-01    2     -1000003         3                       # Z4SS   -->  SBL    ST                 
      1.19483717E-01    2      1000004        -4                       # Z4SS   -->  CHL    CB                 
      1.19483717E-01    2     -1000004         4                       # Z4SS   -->  CBL    CH                 
      5.29307590E-06    2      2000002        -2                       # Z4SS   -->  UPR    UB                 
      5.29307590E-06    2     -2000002         2                       # Z4SS   -->  UBR    UP                 
      1.32325908E-06    2      2000001        -1                       # Z4SS   -->  DNR    DB                 
      1.32325908E-06    2     -2000001         1                       # Z4SS   -->  DBR    DN                 
      1.32325908E-06    2      2000003        -3                       # Z4SS   -->  STR    SB                 
      1.32325908E-06    2     -2000003         3                       # Z4SS   -->  SBR    ST                 
      5.29307499E-06    2      2000004        -4                       # Z4SS   -->  CHR    CB                 
      5.29307499E-06    2     -2000004         4                       # Z4SS   -->  CBR    CH                 
      6.07698967E-05    2      1000005        -5                       # Z4SS   -->  BT1    BB                 
      6.07698967E-05    2     -1000005         5                       # Z4SS   -->  BB1    BT                 
      6.54624891E-05    2      2000005        -5                       # Z4SS   -->  BT2    BB                 
      6.54624891E-05    2     -2000005         5                       # Z4SS   -->  BB2    BT                 
      4.17670308E-05    2      1000011       -11                       # Z4SS   -->  EL-    E+                 
      4.17670308E-05    2     -1000011        11                       # Z4SS   -->  EL+    E-                 
      4.17669944E-05    2      1000013       -13                       # Z4SS   -->  MUL-   MU+                
      4.17669944E-05    2     -1000013        13                       # Z4SS   -->  MUL+   MU-                
      4.19111768E-09    2      2000011       -11                       # Z4SS   -->  ER-    E+                 
      4.19111768E-09    2     -2000011        11                       # Z4SS   -->  ER+    E-                 
      4.19111457E-09    2      2000013       -13                       # Z4SS   -->  MUR-   MU+                
      4.19111457E-09    2     -2000013        13                       # Z4SS   -->  MUR+   MU-                
      2.03853324E-05    2      1000015       -15                       # Z4SS   -->  TAU1-  TAU+               
      2.03853324E-05    2     -1000015        15                       # Z4SS   -->  TAU1+  TAU-               
      2.13383391E-05    2      2000015       -15                       # Z4SS   -->  TAU2-  TAU+               
      2.13383391E-05    2     -2000015        15                       # Z4SS   -->  TAU2+  TAU-               
      4.26403167E-05    2      1000012       -12                       # Z4SS   -->  NUEL   ANUE               
      4.26403167E-05    2     -1000012        12                       # Z4SS   -->  ANUEL  NUE                
      4.26403167E-05    2      1000014       -14                       # Z4SS   -->  NUML   ANUM               
      4.26403167E-05    2     -1000014        14                       # Z4SS   -->  ANUML  NUM                
      4.26403167E-05    2      1000016       -16                       # Z4SS   -->  NUTL   ANUT               
      4.26403167E-05    2     -1000016        16                       # Z4SS   -->  ANUTL  NUT                
#         PDG         Width
DECAY   1000024  1.17824417E+02   # W1SS+ decays
#          BR          NDA       ID1       ID2       ID3       ID4
      2.63413203E-05    3      1000022       -11        12             # W1SS+  -->  Z1SS   E+     NUE         
      2.63413203E-05    3      1000022       -13        14             # W1SS+  -->  Z1SS   MU+    NUM         
      2.63905549E-05    3      1000022       -15        16             # W1SS+  -->  Z1SS   TAU+   NUT         
      1.47924833E-02    2      1000022        24                       # W1SS+  -->  Z1SS   W+                 
      2.46380344E-01    2      1000002        -1                       # W1SS+  -->  UPL    DB                 
      2.46180639E-01    2     -1000001         2                       # W1SS+  -->  DBL    UP                 
      2.46380329E-01    2      1000004        -3                       # W1SS+  -->  CHL    SB                 
      2.46187150E-01    2     -1000003         4                       # W1SS+  -->  SBL    CH                 
#         PDG         Width
DECAY   1000037  1.25298340E+02   # W2SS+ decays
#          BR          NDA       ID1       ID2       ID3       ID4
      2.83939205E-09    3      1000022       -15        16             # W2SS+  -->  Z1SS   TAU+   NUT         
      1.34047810E-02    2      1000022        24                       # W2SS+  -->  Z1SS   W+                 
      2.82694330E-18    3      1000023       -15        16             # W2SS+  -->  Z2SS   TAU+   NUT         
      1.34026147E-02    2      1000023        24                       # W2SS+  -->  Z2SS   W+                 
      2.64184455E-05    3      1000025         2        -1             # W2SS+  -->  Z3SS   UP     DB          
      2.64184455E-05    3      1000025         4        -3             # W2SS+  -->  Z3SS   CH     SB          
      8.80614789E-06    3      1000025       -11        12             # W2SS+  -->  Z3SS   E+     NUE         
      8.80614789E-06    3      1000025       -13        14             # W2SS+  -->  Z3SS   MU+    NUM         
      8.80614789E-06    3      1000025       -15        16             # W2SS+  -->  Z3SS   TAU+   NUT         
      2.40101561E-01    2      1000002        -1                       # W2SS+  -->  UPL    DB                 
      2.40283981E-01    2     -1000001         2                       # W2SS+  -->  DBL    UP                 
      2.40101516E-01    2      1000004        -3                       # W2SS+  -->  CHL    SB                 
      2.40289927E-01    2     -1000003         4                       # W2SS+  -->  SBL    CH                 
      1.37754381E-04    2      1000006        -5                       # W2SS+  -->  TP1    BB                 
      3.45320223E-05    2      2000006        -5                       # W2SS+  -->  TP2    BB                 
      8.41489164E-05    2      1000012       -11                       # W2SS+  -->  NUEL   E+                 
      8.41488363E-05    2      1000014       -13                       # W2SS+  -->  NUML   MU+                
      8.40869616E-05    2      1000016       -15                       # W2SS+  -->  NUTL   TAU+               
      8.41510773E-05    2     -1000011        12                       # W2SS+  -->  EL+    NUE                
      8.41510773E-05    2     -1000013        14                       # W2SS+  -->  MUL+   NUM                
      4.11144028E-05    2     -1000015        16                       # W2SS+  -->  TAU1+  NUT                
      4.30036343E-05    2     -2000015        16                       # W2SS+  -->  TAU2+  NUT                
      1.16592580E-02    2      1000024        23                       # W2SS+  -->  W1SS+  Z0                 
      2.09321427E-09    2      1000024        25                       # W2SS+  -->  W1SS+  HL0                
#         PDG         Width
DECAY        25  2.65251938E-03   # HL0   decays
#          BR          NDA       ID1       ID2       ID3       ID4
      4.96657959E-09    2           11       -11                       # HL0    -->  E-     E+                 
      2.09695630E-04    2           13       -13                       # HL0    -->  MU-    MU+                
      5.98712862E-02    2           15       -15                       # HL0    -->  TAU-   TAU+               
      6.27292684E-06    2            1        -1                       # HL0    -->  DN     DB                 
      2.53457204E-03    2            3        -3                       # HL0    -->  ST     SB                 
      8.77734303E-01    2            5        -5                       # HL0    -->  BT     BB                 
      2.00542650E-06    2            2        -2                       # HL0    -->  UP     UB                 
      4.01812159E-02    2            4        -4                       # HL0    -->  CH     CB                 
      7.12843379E-04    2           22        22                       # HL0    -->  GM     GM                 
      1.87478010E-02    2           21        21                       # HL0    -->  GL     GL                 
#         PDG         Width
DECAY        35  1.86492859E+02   # HH0   decays
#          BR          NDA       ID1       ID2       ID3       ID4
      5.05543133E-12    2           11       -11                       # HH0    -->  E-     E+                 
      2.13449425E-07    2           13       -13                       # HH0    -->  MU-    MU+                
      6.11351425E-05    2           15       -15                       # HH0    -->  TAU-   TAU+               
      6.12203532E-09    2            1        -1                       # HH0    -->  DN     DB                 
      2.47361322E-06    2            3        -3                       # HH0    -->  ST     SB                 
      5.11733582E-04    2            5        -5                       # HH0    -->  BT     BB                 
      1.61292435E-09    2            2        -2                       # HH0    -->  UP     UB                 
      1.90548180E-05    2            4        -4                       # HH0    -->  CH     CB                 
      9.99066412E-01    2            6        -6                       # HH0    -->  TP     TB                 
      9.49312891E-07    2           22        22                       # HH0    -->  GM     GM                 
      1.06277097E-04    2           21        21                       # HH0    -->  GL     GL                 
      1.00116586E-05    2           24       -24                       # HH0    -->  W+     W-                 
      5.13661689E-06    2           23        23                       # HH0    -->  Z0     Z0                 
      1.25732083E-08    2      1000022   1000022                       # HH0    -->  Z1SS   Z1SS               
      3.64016014E-05    2           25        25                       # HH0    -->  HL0    HL0                
      3.27769776E-05    2      1000002  -1000002                       # HH0    -->  UPL    UBL                
      6.57479541E-06    2      2000002  -2000002                       # HH0    -->  UPR    UBR                
      3.27378075E-05    2      1000004  -1000004                       # HH0    -->  CHL    CBL                
      6.55725944E-06    2      2000004  -2000004                       # HH0    -->  CHR    CBR                
      4.90993443E-05    2      1000001  -1000001                       # HH0    -->  DNL    DBL                
      1.64368453E-06    2      2000001  -2000001                       # HH0    -->  DNR    DBR                
      4.91004939E-05    2      1000003  -1000003                       # HH0    -->  STL    SBL                
      1.64347512E-06    2      2000003  -2000003                       # HH0    -->  STR    SBR                
#         PDG         Width
DECAY        36  1.85873947E+02   # HA0   decays
#          BR          NDA       ID1       ID2       ID3       ID4
      5.03991683E-12    2           11       -11                       # HA0    -->  E-     E+                 
      2.12794362E-07    2           13       -13                       # HA0    -->  MU-    MU+                
      6.09475537E-05    2           15       -15                       # HA0    -->  TAU-   TAU+               
      6.10350925E-09    2            1        -1                       # HA0    -->  DN     DB                 
      2.46612558E-06    2            3        -3                       # HA0    -->  ST     SB                 
      5.10536658E-04    2            5        -5                       # HA0    -->  BT     BB                 
      1.60667324E-09    2            2        -2                       # HA0    -->  UP     UB                 
      1.89940711E-05    2            4        -4                       # HA0    -->  CH     CB                 
      9.99190807E-01    2            6        -6                       # HA0    -->  TP     TB                 
      9.46606747E-07    2           22        22                       # HA0    -->  GM     GM                 
      1.08040193E-04    2           21        21                       # HA0    -->  GL     GL                 
      5.77566061E-06    2      1000022   1000022                       # HA0    -->  Z1SS   Z1SS               
      9.97013558E-06    2           25        23                       # HA0    -->  HL0    Z0                 
      7.68305197E-10    2      1000002  -2000002                       # HA0    -->  UPL    UBR                
      7.68305197E-10    2      2000002  -1000002                       # HA0    -->  UPR    UBL                
      4.46503909E-05    2      1000004  -2000004                       # HA0    -->  CHL    CBR                
      4.46503909E-05    2      2000004  -1000004                       # HA0    -->  CHR    CBL                
      2.40115416E-09    2      1000001  -2000001                       # HA0    -->  DNL    DBR                
      2.40115416E-09    2      2000001  -1000001                       # HA0    -->  DNR    DBL                
      9.70187898E-07    2      1000003  -2000003                       # HA0    -->  STL    SBR                
      9.70187898E-07    2      2000003  -1000003                       # HA0    -->  STR    SBL                
#         PDG         Width
DECAY        37  1.73668976E+02   # H+    decays
#          BR          NDA       ID1       ID2       ID3       ID4
      5.43024133E-12    2           12       -11                       # H+     -->  NUE    E+                 
      2.29274576E-07    2           14       -13                       # H+     -->  NUM    MU+                
      6.56677366E-05    2           16       -15                       # H+     -->  NUT    TAU+               
      7.72421238E-09    2            2        -1                       # H+     -->  UP     DB                 
      2.14863903E-05    2            4        -3                       # H+     -->  CH     SB                 
      9.99725759E-01    2            6        -5                       # H+     -->  TP     BB                 
      1.07474452E-05    2           25        24                       # H+     -->  HL0    W+                 
      8.70474469E-05    2      1000002  -1000001                       # H+     -->  UPL    DBL                
      5.11071407E-09    2      2000002  -2000001                       # H+     -->  UPR    DBR                
      8.69995492E-05    2      1000004  -1000003                       # H+     -->  CHL    SBL                
      2.06498680E-06    2      2000004  -2000003                       # H+     -->  CHR    SBR                
