  65
  401   2733.4521    0.27857E-25
  402   2732.2854    0.27803E-25
  403   2733.3918    0.27859E-25
  404   2732.2258    0.27804E-25
  405   2399.4268    0.25808E-25
  406   2163.3972    0.32892E-25
  407   2733.4521    0.27857E-25
  408   2732.2854    0.27803E-25
  409   2733.3918    0.27859E-25
  410   2732.2258    0.27804E-25
  411   2399.4268    0.25808E-25
  412   2163.3972    0.32892E-25
  413   2601.1135    0.50269E-24
  414   2614.4944    0.12488E-24
  415   2601.0032    0.50272E-24
  416   2614.4949    0.12488E-24
  417   2461.1169    0.17057E-25
  418   2462.1069    0.14222E-25
  419   2601.1135    0.50269E-24
  420   2614.4944    0.12488E-24
  421   2601.0032    0.50272E-24
  422   2614.4949    0.12488E-24
  423   2461.1169    0.17057E-25
  424   2462.1069    0.14222E-25
  425    934.8318    0.15674E-23
  426    931.4152    0.15647E-23
  427    934.6591    0.15685E-23
  428    931.2418    0.15658E-23
  429    334.4401    0.27750E-12
  430    890.4290    0.72322E-25
  431    934.8318    0.15674E-23
  432    931.4152    0.15647E-23
  433    934.6591    0.15685E-23
  434    931.2418    0.15658E-23
  435    334.4401    0.27750E-12
  436    890.4290    0.72322E-25
  437    528.9848    0.14219E-22
  438      0.0000    0.10000E+31
  439    530.2664    0.10908E-19
  440      0.0000    0.10000E+31
  441    906.2367    0.72359E-25
  442      0.0000    0.10000E+31
  443    528.9848    0.14219E-22
  444      0.0000    0.10000E+31
  445    530.2664    0.10908E-19
  446      0.0000    0.10000E+31
  447    906.2367    0.72359E-25
  448      0.0000    0.10000E+31
  449   3018.3301    0.10911E-25
  450    614.7752    0.34025E-24
  451   1144.1106    0.17302E-24
  452  -1522.0210    0.61227E-25
  453   1530.4403    0.59525E-25
  454   1144.2676    0.17286E-24
  455   1530.4702    0.59877E-25
  456   1144.2676    0.17286E-24
  457   1530.4702    0.59877E-25
  203    122.5923    0.11604E-21
  204   1018.2608    0.11692E-25
  205   1017.1900    0.11698E-25
  206   1022.8777    0.15112E-25
  207   1022.8777    0.15112E-25
  458      0.0000    0.10000E+31
    6    173.3000    0.56017E-24
   12    173.3000    0.56017E-24
   6
   401  0.15089523E-01     0   450     1     0     0     0
   401  0.32258749E+00     0   451     1     0     0     0
   401  0.12535047E-03     0   452     1     0     0     0
   401  0.57172850E-02     0   453     1     0     0     0
   401  0.64290452E+00     0   456     2     0     0     0
   401  0.13575852E-01     0   457     2     0     0     0
   6
   402  0.14303541E-01     0   450     2     0     0     0
   402  0.32360524E+00     0   451     2     0     0     0
   402  0.75296368E-04     0   452     2     0     0     0
   402  0.48238817E-02     0   453     2     0     0     0
   402  0.64932019E+00     0   454     1     0     0     0
   402  0.78718653E-02     0   455     1     0     0     0
   6
   403  0.15089747E-01     0   450     3     0     0     0
   403  0.32258770E+00     0   451     3     0     0     0
   403  0.12534797E-03     0   452     3     0     0     0
   403  0.57171662E-02     0   453     3     0     0     0
   403  0.64290446E+00     0   456     4     0     0     0
   403  0.13575555E-01     0   457     4     0     0     0
   6
   404  0.14303737E-01     0   450     4     0     0     0
   404  0.32360512E+00     0   451     4     0     0     0
   404  0.75294767E-04     0   452     4     0     0     0
   404  0.48237755E-02     0   453     4     0     0     0
   404  0.64932042E+00     0   454     3     0     0     0
   404  0.78717005E-02     0   455     3     0     0     0
   7
   405  0.45844477E-01     0   450     5     0     0     0
   405  0.12254130E+00     0   451     5     0     0     0
   405  0.16359666E+00     0   452     5     0     0     0
   405  0.13658616E+00     0   453     5     0     0     0
   405  0.23404126E+00     0   456     6     0     0     0
   405  0.25840774E+00     0   457     6     0     0     0
   405  0.38982313E-01     0   199   406     0     0     0
   6
   406  0.19465353E+00     0   450     6     0     0     0
   406  0.38166571E-01     0   451     6     0     0     0
   406  0.20268118E+00     0   452     6     0     0     0
   406  0.14460258E+00     0   453     6     0     0     0
   406  0.80514058E-01     0   454     5     0     0     0
   406  0.33938205E+00     0   455     5     0     0     0
   6
   407  0.15089523E-01     0   450     7     0     0     0
   407  0.32258749E+00     0   451     7     0     0     0
   407  0.12535047E-03     0   452     7     0     0     0
   407  0.57172850E-02     0   453     7     0     0     0
   407  0.64290452E+00     0   454     8     0     0     0
   407  0.13575852E-01     0   455     8     0     0     0
   6
   408  0.14303541E-01     0   450     8     0     0     0
   408  0.32360524E+00     0   451     8     0     0     0
   408  0.75296368E-04     0   452     8     0     0     0
   408  0.48238817E-02     0   453     8     0     0     0
   408  0.64932019E+00     0   456     7     0     0     0
   408  0.78718653E-02     0   457     7     0     0     0
   6
   409  0.15089747E-01     0   450     9     0     0     0
   409  0.32258770E+00     0   451     9     0     0     0
   409  0.12534797E-03     0   452     9     0     0     0
   409  0.57171662E-02     0   453     9     0     0     0
   409  0.64290446E+00     0   454    10     0     0     0
   409  0.13575555E-01     0   455    10     0     0     0
   6
   410  0.14303737E-01     0   450    10     0     0     0
   410  0.32360512E+00     0   451    10     0     0     0
   410  0.75294767E-04     0   452    10     0     0     0
   410  0.48237755E-02     0   453    10     0     0     0
   410  0.64932042E+00     0   456     9     0     0     0
   410  0.78717005E-02     0   457     9     0     0     0
   7
   411  0.45844477E-01     0   450    11     0     0     0
   411  0.12254130E+00     0   451    11     0     0     0
   411  0.16359666E+00     0   452    11     0     0     0
   411  0.13658616E+00     0   453    11     0     0     0
   411  0.23404126E+00     0   454    12     0     0     0
   411  0.25840774E+00     0   455    12     0     0     0
   411  0.38982313E-01     0   198   412     0     0     0
   6
   412  0.19465353E+00     0   450    12     0     0     0
   412  0.38166571E-01     0   451    12     0     0     0
   412  0.20268118E+00     0   452    12     0     0     0
   412  0.14460258E+00     0   453    12     0     0     0
   412  0.80514058E-01     0   456    11     0     0     0
   412  0.33938205E+00     0   457    11     0     0     0
   4
   413  0.99928623E+00     0   450     1     0     0     0
   413  0.46054964E-04     0   451     1     0     0     0
   413  0.97883785E-04     0   452     1     0     0     0
   413  0.56983775E-03     0   453     1     0     0     0
   4
   414  0.99927968E+00     0   450     2     0     0     0
   414  0.46224664E-04     0   451     2     0     0     0
   414  0.98807141E-04     0   452     2     0     0     0
   414  0.57531655E-03     0   453     2     0     0     0
   4
   415  0.99928629E+00     0   450     3     0     0     0
   415  0.46053552E-04     0   451     3     0     0     0
   415  0.97876116E-04     0   452     3     0     0     0
   415  0.56979241E-03     0   453     3     0     0     0
   4
   416  0.99927968E+00     0   450     4     0     0     0
   416  0.46224664E-04     0   451     4     0     0     0
   416  0.98807119E-04     0   452     4     0     0     0
   416  0.57531649E-03     0   453     4     0     0     0
   7
   417  0.98092137E-02     0   450     5     0     0     0
   417  0.86480051E-01     0   451     5     0     0     0
   417  0.12338504E+00     0   452     5     0     0     0
   417  0.13527092E+00     0   453     5     0     0     0
   417  0.16264258E+00     0   456     6     0     0     0
   417  0.36903051E+00     0   457     6     0     0     0
   417  0.11338165E+00     0   199   406     0     0     0
   8
   418  0.24070941E+00     0   454     5     0     0     0
   418  0.21530105E+00     0   455     5     0     0     0
   418  0.63781716E-01     0   200   406     0     0     0
   418  0.74185044E-01     0   203   406     0     0     0
   418  0.10821798E-01     0   450     6     0     0     0
   418  0.11393486E+00     0   451     6     0     0     0
   418  0.12592009E+00     0   452     6     0     0     0
   418  0.15534592E+00     0   453     6     0     0     0
   4
   419  0.99928623E+00     0   450     7     0     0     0
   419  0.46054964E-04     0   451     7     0     0     0
   419  0.97883785E-04     0   452     7     0     0     0
   419  0.56983775E-03     0   453     7     0     0     0
   4
   420  0.99927968E+00     0   450     8     0     0     0
   420  0.46224664E-04     0   451     8     0     0     0
   420  0.98807141E-04     0   452     8     0     0     0
   420  0.57531655E-03     0   453     8     0     0     0
   4
   421  0.99928629E+00     0   450     9     0     0     0
   421  0.46053552E-04     0   451     9     0     0     0
   421  0.97876116E-04     0   452     9     0     0     0
   421  0.56979241E-03     0   453     9     0     0     0
   4
   422  0.99927968E+00     0   450    10     0     0     0
   422  0.46224664E-04     0   451    10     0     0     0
   422  0.98807119E-04     0   452    10     0     0     0
   422  0.57531649E-03     0   453    10     0     0     0
   7
   423  0.98092137E-02     0   450    11     0     0     0
   423  0.86480051E-01     0   451    11     0     0     0
   423  0.12338504E+00     0   452    11     0     0     0
   423  0.13527092E+00     0   453    11     0     0     0
   423  0.16264258E+00     0   454    12     0     0     0
   423  0.36903051E+00     0   455    12     0     0     0
   423  0.11338165E+00     0   198   412     0     0     0
   8
   424  0.24070941E+00     0   456    11     0     0     0
   424  0.21530105E+00     0   457    11     0     0     0
   424  0.63781716E-01     0   200   412     0     0     0
   424  0.74185044E-01     0   203   412     0     0     0
   424  0.10821798E-01     0   450    12     0     0     0
   424  0.11393486E+00     0   451    12     0     0     0
   424  0.12592009E+00     0   452    12     0     0     0
   424  0.15534592E+00     0   453    12     0     0     0
   4
   425  0.90266651E+00     0   450   121     0     0     0
   425  0.13949011E-04     0   429   121   131     0     0
   425  0.39301747E-04     0   435   121   125     0     0
   425  0.97280145E-01     0   121   130     0     0     0
   5
   426  0.90298080E+00     0   450   122     0     0     0
   426  0.11651012E-04     0   429   122   131     0     0
   426  0.34950619E-04     0   435   122   125     0     0
   426  0.21889673E-03     0   435   121   126     0     0
   426  0.96753731E-01     0   129   121     0     0     0
   4
   427  0.90261710E+00     0   450   123     0     0     0
   427  0.13934295E-04     0   429   123   131     0     0
   427  0.39274899E-04     0   435   123   125     0     0
   427  0.97329639E-01     0   121   128     0     0     0
   5
   428  0.90293056E+00     0   450   124     0     0     0
   428  0.11638504E-04     0   429   124   131     0     0
   428  0.34926572E-04     0   435   124   125     0     0
   428  0.21888429E-03     0   435   123   126     0     0
   428  0.96804015E-01     0   127   121     0     0     0
   3
   429  0.15754070E-01     0   125   130     0     0     0
   429  0.49210915E+00     0   125   124     0     0     0
   429  0.49213681E+00     0   123   126     0     0     0
   2
   430  0.34309760E-01     0   450   126     0     0     0
   430  0.96569037E+00     0   198   429     0     0     0
   4
   431  0.90266651E+00     0   450   127     0     0     0
   431  0.13949011E-04     0   435   127   125     0     0
   431  0.39301747E-04     0   429   127   131     0     0
   431  0.97280145E-01     0   127   124     0     0     0
   5
   432  0.90298080E+00     0   450   128     0     0     0
   432  0.11651012E-04     0   435   128   125     0     0
   432  0.34950619E-04     0   429   128   131     0     0
   432  0.21889673E-03     0   429   127   132     0     0
   432  0.96753731E-01     0   123   127     0     0     0
   4
   433  0.90261710E+00     0   450   129     0     0     0
   433  0.13934295E-04     0   435   129   125     0     0
   433  0.39274899E-04     0   429   129   131     0     0
   433  0.97329639E-01     0   127   122     0     0     0
   5
   434  0.90293056E+00     0   450   130     0     0     0
   434  0.11638504E-04     0   435   130   125     0     0
   434  0.34926572E-04     0   429   130   131     0     0
   434  0.21888429E-03     0   429   129   132     0     0
   434  0.96804015E-01     0   121   127     0     0     0
   3
   435  0.15754070E-01     0   131   124     0     0     0
   435  0.49210915E+00     0   131   130     0     0     0
   435  0.49213681E+00     0   129   132     0     0     0
   2
   436  0.34309760E-01     0   450   132     0     0     0
   436  0.96569037E+00     0   199   435     0     0     0
   4
   437  0.43143751E-03     0   429   121   131     0     0
   437  0.82580972E-03     0   435   121   125     0     0
   437  0.49937138E+00     0   123   122     0     0     0
   437  0.49937138E+00     0   121   124     0     0     0
   0
   2
   439  0.34405845E+00     0   429   123   131     0     0
   439  0.65594161E+00     0   435   123   125     0     0
   0
   3
   441  0.39253432E-01     0   450   125     0     0     0
   441  0.49874198E+00     0   200   429     0     0     0
   441  0.46200460E+00     0   203   429     0     0     0
   0
   4
   443  0.43143751E-03     0   435   127   125     0     0
   443  0.82580972E-03     0   429   127   131     0     0
   443  0.49937138E+00     0   129   128     0     0     0
   443  0.49937138E+00     0   127   130     0     0     0
   0
   2
   445  0.34405845E+00     0   435   129   125     0     0
   445  0.65594161E+00     0   429   129   131     0     0
   0
   3
   447  0.39253432E-01     0   450   131     0     0     0
   447  0.49874198E+00     0   200   435     0     0     0
   447  0.46200460E+00     0   203   435     0     0     0
   0
  24
   449  0.16868236E-01     0   408     2     0     0     0
   449  0.16868236E-01     0   402     8     0     0     0
   449  0.16737696E-01     0   407     1     0     0     0
   449  0.16737696E-01     0   401     7     0     0     0
   449  0.32257833E-01     0   420     2     0     0     0
   449  0.32257833E-01     0   414     8     0     0     0
   449  0.34267545E-01     0   419     1     0     0     0
   449  0.34267545E-01     0   413     7     0     0     0
   449  0.16744427E-01     0   409     3     0     0     0
   449  0.16744427E-01     0   403     9     0     0     0
   449  0.34284316E-01     0   421     3     0     0     0
   449  0.34284316E-01     0   415     9     0     0     0
   449  0.16874744E-01     0   410     4     0     0     0
   449  0.16874744E-01     0   404    10     0     0     0
   449  0.32257605E-01     0   422     4     0     0     0
   449  0.32257605E-01     0   416    10     0     0     0
   449  0.69499530E-01     0   411     5     0     0     0
   449  0.69499530E-01     0   405    11     0     0     0
   449  0.58649566E-01     0   423     5     0     0     0
   449  0.58649566E-01     0   417    11     0     0     0
   449  0.10684824E+00     0   412     6     0     0     0
   449  0.10684824E+00     0   406    12     0     0     0
   449  0.64710267E-01     0   424     6     0     0     0
   449  0.64710267E-01     0   418    12     0     0     0
   6
   450  0.54396227E-01     0   437   127     0     0     0
   450  0.54396227E-01     0   443   121     0     0     0
   450  0.52901506E-01     0   439   129     0     0     0
   450  0.52901506E-01     0   445   123     0     0     0
   450  0.39270234E+00     0   429   131     0     0     0
   450  0.39270234E+00     0   435   125     0     0     0
  20
   451  0.40184325E-03     0   450   200     0     0     0
   451  0.47684740E-02     0   450   203     0     0     0
   451  0.68894506E-01     0   425   127     0     0     0
   451  0.68894506E-01     0   431   121     0     0     0
   451  0.68996809E-01     0   427   129     0     0     0
   451  0.68996809E-01     0   433   123     0     0     0
   451  0.29815599E-04     0   437   127     0     0     0
   451  0.29815599E-04     0   443   121     0     0     0
   451  0.29736992E-04     0   439   129     0     0     0
   451  0.29736992E-04     0   445   123     0     0     0
   451  0.42938575E-01     0   429   131     0     0     0
   451  0.42938575E-01     0   435   125     0     0     0
   451  0.81795298E-01     0   441   131     0     0     0
   451  0.81795298E-01     0   447   125     0     0     0
   451  0.69686621E-01     0   426   128     0     0     0
   451  0.69686621E-01     0   432   122     0     0     0
   451  0.69788635E-01     0   428   130     0     0     0
   451  0.69788635E-01     0   434   124     0     0     0
   451  0.95254831E-01     0   430   132     0     0     0
   451  0.95254831E-01     0   436   126     0     0     0
  27
   452  0.19450684E+00     0   454   199     0     0     0
   452  0.19450684E+00     0   456   198     0     0     0
   452  0.77726774E-01     0   450   200     0     0     0
   452  0.18648876E+00     0   451   200     0     0     0
   452  0.53893571E-03     0   450     5    11     0     0
   452  0.58046109E-04     0   450   125   131     0     0
   452  0.13271950E-04     0   451     5    11     0     0
   452  0.12491626E-01     0   450   203     0     0     0
   452  0.31383641E-02     0   451   203     0     0     0
   452  0.19076017E-04     0   425   127     0     0     0
   452  0.19076017E-04     0   431   121     0     0     0
   452  0.19084553E-04     0   427   129     0     0     0
   452  0.19084553E-04     0   433   123     0     0     0
   452  0.56114764E-04     0   437   127     0     0     0
   452  0.56114764E-04     0   443   121     0     0     0
   452  0.56039989E-04     0   439   129     0     0     0
   452  0.56039989E-04     0   445   123     0     0     0
   452  0.11173430E+00     0   429   131     0     0     0
   452  0.11173430E+00     0   435   125     0     0     0
   452  0.53087428E-01     0   441   131     0     0     0
   452  0.53087428E-01     0   447   125     0     0     0
   452  0.94406947E-04     0   426   128     0     0     0
   452  0.94406947E-04     0   432   122     0     0     0
   452  0.94449053E-04     0   428   130     0     0     0
   452  0.94449053E-04     0   434   124     0     0     0
   452  0.10438760E-03     0   430   132     0     0     0
   452  0.10438760E-03     0   436   126     0     0     0
  27
   453  0.19648987E+00     0   454   199     0     0     0
   453  0.19648987E+00     0   456   198     0     0     0
   453  0.12466452E-01     0   450   200     0     0     0
   453  0.38274974E-02     0   451   200     0     0     0
   453  0.54169266E-03     0   450     5    11     0     0
   453  0.58514743E-04     0   450   125   131     0     0
   453  0.13294020E-04     0   451     5    11     0     0
   453  0.73089801E-01     0   450   203     0     0     0
   453  0.17634889E+00     0   451   203     0     0     0
   453  0.20121827E-02     0   425   127     0     0     0
   453  0.20121827E-02     0   431   121     0     0     0
   453  0.20130672E-02     0   427   129     0     0     0
   453  0.20130672E-02     0   433   123     0     0     0
   453  0.32404796E-03     0   437   127     0     0     0
   453  0.32404796E-03     0   443   121     0     0     0
   453  0.32362153E-03     0   439   129     0     0     0
   453  0.32362153E-03     0   445   123     0     0     0
   453  0.98477222E-01     0   429   131     0     0     0
   453  0.98477222E-01     0   435   125     0     0     0
   453  0.56771535E-01     0   441   131     0     0     0
   453  0.56771535E-01     0   447   125     0     0     0
   453  0.33551683E-02     0   426   128     0     0     0
   453  0.33551683E-02     0   432   122     0     0     0
   453  0.33566377E-02     0   428   130     0     0     0
   453  0.33566377E-02     0   434   124     0     0     0
   453  0.37035404E-02     0   430   132     0     0     0
   453  0.37035404E-02     0   436   126     0     0     0
   8
   454  0.51366491E-02     0   450   198     0     0     0
   454  0.14154822E+00     0   426   127     0     0     0
   454  0.14175524E+00     0   428   129     0     0     0
   454  0.19622815E+00     0   430   131     0     0     0
   454  0.13576108E+00     0   431   122     0     0     0
   454  0.13596246E+00     0   433   124     0     0     0
   454  0.84959261E-01     0   435   126     0     0     0
   454  0.15864895E+00     0   447   126     0     0     0
  12
   455  0.55103043E-04     0   450   131   126     0     0
   455  0.85145928E-01     0   450   198     0     0     0
   455  0.19857758E+00     0   451   198     0     0     0
   455  0.39969333E-02     0   426   127     0     0     0
   455  0.39986842E-02     0   428   129     0     0     0
   455  0.10907535E+00     0   430   131     0     0     0
   455  0.68121166E-02     0   431   122     0     0     0
   455  0.68151122E-02     0   433   124     0     0     0
   455  0.19068719E+00     0   435   126     0     0     0
   455  0.19637488E-01     0   447   126     0     0     0
   455  0.19387765E+00     0   454   200     0     0     0
   455  0.18132102E+00     0   454   203     0     0     0
   8
   456  0.51366491E-02     0   450   199     0     0     0
   456  0.14154822E+00     0   432   121     0     0     0
   456  0.14175524E+00     0   434   123     0     0     0
   456  0.19622815E+00     0   436   125     0     0     0
   456  0.13576108E+00     0   425   128     0     0     0
   456  0.13596246E+00     0   427   130     0     0     0
   456  0.84959261E-01     0   429   132     0     0     0
   456  0.15864895E+00     0   441   132     0     0     0
  12
   457  0.55103043E-04     0   450   125   132     0     0
   457  0.85145928E-01     0   450   199     0     0     0
   457  0.19857758E+00     0   451   199     0     0     0
   457  0.39969333E-02     0   432   121     0     0     0
   457  0.39986842E-02     0   434   123     0     0     0
   457  0.10907535E+00     0   436   125     0     0     0
   457  0.68121166E-02     0   425   128     0     0     0
   457  0.68151122E-02     0   427   130     0     0     0
   457  0.19068719E+00     0   429   132     0     0     0
   457  0.19637488E-01     0   441   132     0     0     0
   457  0.19387765E+00     0   456   200     0     0     0
   457  0.18132102E+00     0   456   203     0     0     0
  28
   203  0.16151936E-03     0   123   129     0     0     0
   203  0.46203516E-01     0   125   131     0     0     0
   203  0.19381640E-02     0     3     9     0     0     0
   203  0.75952935E+00     0     5    11     0     0     0
   203  0.37041046E-01     0     4    10     0     0     0
   203  0.17262322E-02     0    59    59     0     0     0
   203  0.33867333E-01     0    13    13     0     0     0
   203  0.60561229E-02     0   198   121   128     0     0
   203  0.60561229E-02     0   198   123   130     0     0
   203  0.60561229E-02     0   198   125   132     0     0
   203  0.18168371E-01     0   198     8     1     0     0
   203  0.18168371E-01     0   198    10     3     0     0
   203  0.60561229E-02     0   199   127   122     0     0
   203  0.60561229E-02     0   199   129   124     0     0
   203  0.60561229E-02     0   199   131   126     0     0
   203  0.18168371E-01     0   199     2     7     0     0
   203  0.18168371E-01     0   199     4     9     0     0
   203  0.71962370E-03     0   200   122   128     0     0
   203  0.71962370E-03     0   200   124   130     0     0
   203  0.71962370E-03     0   200   126   132     0     0
   203  0.36217936E-03     0   200   121   127     0     0
   203  0.36217936E-03     0   200   123   129     0     0
   203  0.36217936E-03     0   200   125   131     0     0
   203  0.12407957E-02     0   200     2     8     0     0
   203  0.12407957E-02     0   200     4    10     0     0
   203  0.15984507E-02     0   200     1     7     0     0
   203  0.15984507E-02     0   200     3     9     0     0
   203  0.15984507E-02     0   200     5    11     0     0
   6
   204  0.23172541E-03     0   123   129     0     0     0
   204  0.66368498E-01     0   125   131     0     0     0
   204  0.27162367E-02     0     3     9     0     0     0
   204  0.80835462E+00     0     5    11     0     0     0
   204  0.50986500E-03     0     6    12     0     0     0
   204  0.12181909E+00     0   429   435     0     0     0
   7
   205  0.23161204E-03     0   123   129     0     0     0
   205  0.66336833E-01     0   125   131     0     0     0
   205  0.27149315E-02     0     3     9     0     0     0
   205  0.80810112E+00     0     5    11     0     0     0
   205  0.54868602E-03     0     6    12     0     0     0
   205  0.12911171E-04     0    13    13     0     0     0
   205  0.12205401E+00     0   429   435     0     0     0
   4
   206  0.30086710E-03     0   124   129     0     0     0
   206  0.86172432E-01     0   126   131     0     0     0
   206  0.32420824E-02     0     4     9     0     0     0
   206  0.91028470E+00     0     6    11     0     0     0
   4
   207  0.30086710E-03     0   130   123     0     0     0
   207  0.86172432E-01     0   132   125     0     0     0
   207  0.32420824E-02     0    10     3     0     0     0
   207  0.91028470E+00     0    12     5     0     0     0
   0
   5
     6  0.33333334E+00   100     2     7     5     0     0
     6  0.33333334E+00   100     4     9     5     0     0
     6  0.11111111E+00   100   122   127     5     0     0
     6  0.11111111E+00   100   124   129     5     0     0
     6  0.11111111E+00   100   126   131     5     0     0
   5
    12  0.33333334E+00   100     8     1    11     0     0
    12  0.33333334E+00   100    10     3    11     0     0
    12  0.11111111E+00   100   128   121    11     0     0
    12  0.11111111E+00   100   130   123    11     0     0
    12  0.11111111E+00   100   132   125    11     0     0
     42.03329849     -0.02414752
      0.99927366     -0.00233526      0.03501639     -0.01484872
     -0.00794134     -0.98823619      0.12144463     -0.09261611
      0.01419917     -0.02065218     -0.70650160     -0.70726740
     -0.03445871      0.15151781      0.69633371     -0.70069575
     -0.99136072      0.13116382     -0.13116382     -0.99136072
     -0.98510075      0.17197818     -0.17197818     -0.98510075
     -1.31786370     -0.96874988     -1.39374697
  -2278.48999023  16082.00000000  -6519.45996094
   1520.44995117
    F
  0.00000000E+00  0.00000000E+00  0.00000000E+00  0.46867099E-01 -0.13030400E-19  0.00000000E+00  0.00000000E+00  0.00000000E+00 -0.75973302E-19 -0.46867099E-01  0.13030400E-19 -0.00000000E+00  0.00000000E+00  0.00000000E+00  0.00000000E+00  0.00000000E+00  0.00000000E+00  0.42551400E-06 -0.00000000E+00 -0.00000000E+00  0.75973302E-19 -0.00000000E+00 -0.00000000E+00 -0.42551400E-06  0.00000000E+00  0.00000000E+00  0.00000000E+00
 -0.10979900E-21  0.14012985E-43  0.00000000E+00  0.00000000E+00 -0.24040300E-20  0.00000000E+00  0.00000000E+00  0.00000000E+00 -0.90775899E-19  0.61496802E-09 -0.80166899E-31  0.00000000E+00 -0.37602000E-32  0.13464600E-07  0.00000000E+00  0.00000000E+00  0.00000000E+00  0.50842101E-06  0.00000000E+00  0.00000000E+00  0.00000000E+00  0.00000000E+00  0.00000000E+00  0.00000000E+00  0.00000000E+00  0.00000000E+00  0.00000000E+00
  0.00000000E+00  0.00000000E+00  0.00000000E+00  0.00000000E+00  0.00000000E+00  0.00000000E+00  0.00000000E+00  0.00000000E+00  0.00000000E+00  0.00000000E+00  0.00000000E+00  0.00000000E+00  0.00000000E+00  0.00000000E+00  0.00000000E+00  0.00000000E+00  0.00000000E+00  0.00000000E+00  0.00000000E+00  0.00000000E+00  0.00000000E+00  0.00000000E+00  0.00000000E+00  0.00000000E+00  0.00000000E+00  0.00000000E+00  0.00000000E+00
