# SUSY Les Houches Accord 2 - MSSM spectrum + Decays
# SPheno v3.1.10 
# W. Porod, Comput. Phys. Commun. 153 (2003) 275-315, hep-ph/0301101
# in case of problems send email to porod@physik.uni-wuerzburg.de
# Created: 30.05.2012,  11:30
Block SPINFO         # Program information
     1   SPheno      # spectrum calculator
     2   v3.1.10     # version number
#
Block SPhenoINFO     # SPheno specific information
    1      2         # using 2-loop RGEs
    2      1         # using running masses for boundary conditions at mZ
Block MODSEL  # Model selection
    4    1    # MSSM with explicit R-parity violation
Block MINPAR  # Input parameters
    3    1.00000000E+01  # tanb at m_Z    
    4    1.00000000E+00  # Sign(mu)
Block SMINPUTS  # SM parameters
         1     1.27934000E+02  # alpha_em^-1(MZ)^MSbar
         2     1.16639000E-05  # G_mu [GeV^-2]
         3     1.17200000E-01  # alpha_s(MZ)^MSbar
         4     9.11876000E+01  # m_Z(pole)
         5     4.25000000E+00  # m_b(m_b), MSbar
         6     1.72500000E+02  # m_t(pole)
         7     1.77700000E+00  # m_tau(pole)
         8     0.00000000E+00  # m_nu_3
        11     5.10998910E-04  # m_e(pole)
        12     0.00000000E+00  # m_nu_1
        13     1.05658000E-01  # m_muon(pole)
        14     0.00000000E+00  # m_nu_2
        21     5.00000000E-03  # m_d(2 GeV), MSbar
        22     3.00000000E-03  # m_u(2 GeV), MSbar
        23     1.05000000E-01  # m_s(2 GeV), MSbar
        24     1.27000000E+00  # m_c(m_c), MSbar
Block gauge Q=  1.45583990E+03  # (SUSY scale)
   1    3.63496979E-01  # g'(Q)^DRbar
   2    6.39667128E-01  # g(Q)^DRbar
   3    1.03560342E+00  # g3(Q)^DRbar
Block Yu Q=  1.45583990E+03  # (SUSY scale)
  1  1     8.46432981E-06   # Y_u(Q)^DRbar
  2  2     3.58323320E-03   # Y_c(Q)^DRbar
  3  3     8.48947382E-01   # Y_t(Q)^DRbar
Block Yd Q=  1.45583990E+03  # (SUSY scale)
  1  1     1.29065442E-04   # Y_d(Q)^DRbar
  2  2     2.71037395E-03   # Y_s(Q)^DRbar
  3  3     1.30851745E-01   # Y_b(Q)^DRbar
Block Ye Q=  1.45583990E+03  # (SUSY scale)
  1  1     2.87087516E-05   # Y_e(Q)^DRbar
  2  2     5.93603957E-03   # Y_mu(Q)^DRbar
  3  3     9.98392730E-02   # Y_tau(Q)^DRbar
Block Au Q=  1.45583990E+03  # (SUSY scale)
  1  1    -1.80261810E+03   # A_u(Q)^DRbar
  2  2    -1.80260951E+03   # A_c(Q)^DRbar
  3  3    -1.39803759E+03   # A_t(Q)^DRbar
Block Ad Q=  1.45583990E+03  # (SUSY scale)
  1  1    -2.19674992E+03   # A_d(Q)^DRbar
  2  2    -2.19674335E+03   # A_s(Q)^DRbar
  3  3    -2.05505596E+03   # A_b(Q)^DRbar
Block Ae Q=  1.45583990E+03  # (SUSY scale)
  1  1    -4.88855551E+02   # A_e(Q)^DRbar
  2  2    -4.88846441E+02   # A_mu(Q)^DRbar
  3  3    -4.86278932E+02   # A_tau(Q)^DRbar
Block MSOFT Q=  1.45583990E+03  # soft SUSY breaking masses at Q
   1    3.61347227E+02  # M_1
   2    6.60688943E+02  # M_2
   3    1.79986111E+03  # M_3
  21    3.50346303E+05  # M^2_(H,d)
  22   -9.48941337E+05  # M^2_(H,u)
  31    0.00000000E+00  # M_(L,11)
  32    0.00000000E+00  # M_(L,22)
  33    0.00000000E+00  # M_(L,33)
  34    0.00000000E+00  # M_(E,11)
  35    0.00000000E+00  # M_(E,22)
  36    0.00000000E+00  # M_(E,33)
  41    0.00000000E+00  # M_(Q,11)
  42    0.00000000E+00  # M_(Q,22)
  43    0.00000000E+00  # M_(Q,33)
  44    0.00000000E+00  # M_(U,11)
  45    0.00000000E+00  # M_(U,22)
  46    0.00000000E+00  # M_(U,33)
  47    0.00000000E+00  # M_(D,11)
  48    0.00000000E+00  # M_(D,22)
  49    0.00000000E+00  # M_(D,33)
Block RVKAPPA Q=  1.45583990E+03  # bilinear RP parameters at Q
         1     2.50260682E-01  # epsilon_1
         2    -2.92968635E-01  # epsilon_2
         3     2.94295841E-01  # epsilon_3
Block RVD Q=  1.45583990E+03  # bilinear RP parameters at Q
         1     3.48274430E+01  # Re( B_1 epsilon_1)
         2    -4.13087371E+01  # Re( B_2 epsilon_2)
         3     4.03936557E+01  # Re( B_3 epsilon_3)
Block RVSNVEV Q=  1.45583990E+03  # sneutrino vevs at Q
         1    -6.42116946E-03  # v_L_1
         2     7.85242382E-03  # v_L_2
         3    -7.24903168E-03  # v_L_3
Block SPhenoRP  # additional RP parameters
         4     1.39776478E-02  # Lambda_1 = v_d epsilon_1 + mu v_L1
         5     3.12395405E-01  # Lambda_2 = v_d epsilon_2 + mu v_L2
         6     3.12395405E-01  # Lambda_3 = v_d epsilon_3 + mu v_L3
         7     2.37186577E-03  # m^2_atm [eV^2]
         8     7.65441054E-05  # m^2_sol [eV^2]
         9     9.91323568E-01  # tan^2 theta_atm
        10     4.65846610E-01  # tan^2 theta_sol
        11     8.33685908E-04  # U_e3^2
        15     2.52014272E+01  # v_d
        16     2.52014272E+02  # v_u
Block MASS  # Mass spectrum
#   PDG code      mass          particle
         6     1.72500000E+02  # m_t(pole)
        23     9.11876000E+01  # m_Z(pole)
        24     8.03103518E+01  # W+
        25     1.18724508E+02  # leightest neutral scalar
   1000016     6.28375523E+02  # 2nd neutral scalar
   1000014     6.30427813E+02  # 3rd neutral scalar
   1000012     6.30435091E+02  # 4th neutral scalar
        35     1.17550169E+03  # 5th neutral scalar
   1000019     6.28375523E+02  # leightest pseudoscalar
   1000018     6.30427813E+02  # 2nd pseudoscalar
   1000017     6.30435091E+02  # 3rd pseudoscalar
        36     1.17532407E+03  # 4th pseudoscalar
   1000015     4.28872102E+02  # leightest charged scalar
   2000013     4.36366886E+02  # 2nd charged scalar
   2000011     4.36393394E+02  # 3rd charged scalar
   2000015     6.34835924E+02  # 4th charged scalar
   1000013     6.35649696E+02  # 5th charged scalar
   1000011     6.35652510E+02  # 6th charged scalar
        37     1.17847643E+03  # 7th charged scalar
   1000001     1.71530969E+03  # ~d_L
   2000001     1.63826705E+03  # ~d_R
   1000002     1.71354010E+03  # ~u_L
   2000002     1.64540397E+03  # ~u_R
   1000003     1.71530550E+03  # ~s_L
   2000003     1.63826294E+03  # ~s_R
   1000004     1.71353776E+03  # ~c_L
   2000004     1.64539624E+03  # ~c_R
   1000005     1.56964393E+03  # ~b_1
   2000005     1.63113664E+03  # ~b_2
   1000006     1.32482565E+03  # ~t_1
   2000006     1.59980340E+03  # ~t_2
   1000021     1.86403026E+03  # ~g
        12     1.37772728E-13  # nu_1
        14     8.75003353E-12  # nu_2
        16     4.94816012E-11  # nu_3
   1000022     3.54735764E+02  # chi_10
   1000023     6.69095547E+02  # chi_20
   1000025     1.00422588E+03  # chi_30
   1000035     1.01471286E+03  # chi_40
       -11     5.10998910E-04  # e+
       -13     1.05658000E-01  # mu+
       -15     1.77700000E+00  # tau+
   1000024     6.69262324E+02  # chi_1+
   1000037     1.01494158E+03  # chi_2+
# Higgs mixing
Block alpha # Effective Higgs mixing angle
          -1.05257857E-01   # alpha
Block Hmix Q=  1.45583990E+03  # Higgs mixing parameters
   1    9.98457284E+02  # mu
   2    9.60228223E+00  # tan[beta](Q)
   3    2.44038278E+02  # v(Q)
   4    1.31972030E+06  # m^2_A(Q)
Block staumix  # stau mixing matrix
   1  1     8.35505584E-02   # R_sta(1,1)
   1  2     9.96503539E-01   # R_sta(1,2)
   2  1    -9.96503539E-01   # R_sta(2,1)
   2  2     8.35505584E-02   # R_sta(2,2)
Block stopmix # stop mixing matrix
   1  1     3.01114392E-01   # Re[R_st(1,1)]
   1  2     9.53588026E-01   # Re[R_st(1,2)]
   2  1    -9.53588026E-01   # Re[R_st(2,1)]
   2  2     3.01114392E-01   # Re[R_st(2,2)]
Block sbotmix # sbottom mixing matrix
   1  1     9.90133173E-01   # Re[R_sb(1,1)]
   1  2     1.40129579E-01   # Re[R_sb(1,2)]
   2  1    -1.40129579E-01   # Re[R_sb(2,1)]
   2  2     9.90133173E-01   # Re[R_sb(2,2)]
Block Nmix # neutralino mixing matrix
   1  1    -9.98284425E-01   # Re[N(1,1)]
   1  2     7.08050828E-03   # Re[N(1,2)]
   1  3    -5.31111768E-02   # Re[N(1,3)]
   1  4     2.36067075E-02   # Re[N(1,4)]
   2  1    -1.71396440E-02   # Re[N(2,1)]
   2  2    -9.83842194E-01   # Re[N(2,2)]
   2  3     1.44852977E-01   # Re[N(2,3)]
   2  4    -1.03819000E-01   # Re[N(2,4)]
   3  1     2.06026137E-02   # Re[N(3,1)]
   3  2    -2.95930409E-02   # Re[N(3,2)]
   3  3    -7.05702300E-01   # Re[N(3,3)]
   3  4    -7.07590311E-01   # Re[N(3,4)]
   4  1     5.20573938E-02   # Re[N(4,1)]
   4  2    -1.76433147E-01   # Re[N(4,2)]
   4  3    -6.91506386E-01   # Re[N(4,3)]
   4  4     6.98555861E-01   # Re[N(4,4)]
Block Umix # chargino mixing matrix
   1  1    -9.78277770E-01   # Re[U(1,1)]
   1  2     2.07298322E-01   # Re[U(1,2)]
   2  1    -2.07298347E-01   # Re[U(2,1)]
   2  2    -9.78277650E-01   # Re[U(2,2)]
Block Vmix # chargino mixing matrix
   1  1    -9.89317783E-01   # Re[V(1,1)]
   1  2     1.45774911E-01   # Re[V(1,2)]
   2  1    -1.45774911E-01   # Re[V(2,1)]
   2  2    -9.89317783E-01   # Re[V(2,2)]
DECAY   2000001     8.67675756E-01   # ~d_R
#    BR                NDA      ID1      ID2
     9.98478272E-01    2     1000022         1   # BR(~d_R -> chi^0_1 d)
     1.62145301E-04    2     1000023         1   # BR(~d_R -> chi^0_2 d)
     1.99837988E-04    2     1000025         1   # BR(~d_R -> chi^0_3 d)
     1.15932556E-03    2     1000035         1   # BR(~d_R -> chi^0_4 d)
DECAY   1000001     1.50269405E+01   # ~d_L
#    BR                NDA      ID1      ID2
     1.58602846E-02    2     1000022         1   # BR(~d_L -> chi^0_1 d)
     3.20478252E-01    2     1000023         1   # BR(~d_L -> chi^0_2 d)
     2.48712609E-04    2     1000025         1   # BR(~d_L -> chi^0_3 d)
     7.41943355E-03    2     1000035         1   # BR(~d_L -> chi^0_4 d)
     6.39128184E-01    2    -1000024         2   # BR(~d_L -> chi^-_1 u)
     1.68651325E-02    2    -1000037         2   # BR(~d_L -> chi^-_2 u)
DECAY   2000003     8.67959742E-01   # ~s_R
#    BR                NDA      ID1      ID2
     9.98151156E-01    2     1000022         3   # BR(~s_R -> chi^0_1 s)
     2.16230800E-04    2     1000023         3   # BR(~s_R -> chi^0_2 s)
     2.50600018E-04    2     1000025         3   # BR(~s_R -> chi^0_3 s)
     1.19734862E-03    2     1000035         3   # BR(~s_R -> chi^0_4 s)
     1.06441084E-04    2    -1000024         4   # BR(~s_R -> chi^-_1 c)
     7.82232727E-05    2    -1000037         4   # BR(~s_R -> chi^-_2 c)
DECAY   1000003     1.50270605E+01   # ~s_L
#    BR                NDA      ID1      ID2
     1.58600381E-02    2     1000022         3   # BR(~s_L -> chi^0_1 s)
     3.20471469E-01    2     1000023         3   # BR(~s_L -> chi^0_2 s)
     2.52451256E-04    2     1000025         3   # BR(~s_L -> chi^0_3 s)
     7.42347217E-03    2     1000035         3   # BR(~s_L -> chi^0_4 s)
     6.39112999E-01    2    -1000024         4   # BR(~s_L -> chi^-_1 c)
     1.68795703E-02    2    -1000037         4   # BR(~s_L -> chi^-_2 c)
DECAY   1000005     2.40570215E+01   # ~b_1
#    BR                NDA      ID1      ID2
     1.00452928E-02    2     1000022         5   # BR(~b_1 -> chi^0_1 b)
     1.69692280E-01    2     1000023         5   # BR(~b_1 -> chi^0_2 b)
     3.74370855E-03    2     1000025         5   # BR(~b_1 -> chi^0_3 b)
     5.88716239E-03    2     1000035         5   # BR(~b_1 -> chi^0_4 b)
     3.23288574E-01    2    -1000024         6   # BR(~b_1 -> chi^-_1 t)
     3.06692769E-01    2    -1000037         6   # BR(~b_1 -> chi^-_2 t)
     1.80650207E-01    2     1000006       -24   # BR(~b_1 -> ~t_1 W^-)
DECAY   2000005     1.86329899E+00   # ~b_2
#    BR                NDA      ID1      ID2
     4.48649297E-01    2     1000022         5   # BR(~b_2 -> chi^0_1 b)
     2.20105051E-02    2     1000023         5   # BR(~b_2 -> chi^0_2 b)
     6.06247783E-02    2     1000025         5   # BR(~b_2 -> chi^0_3 b)
     7.09331395E-02    2     1000035         5   # BR(~b_2 -> chi^0_4 b)
     4.40436289E-02    2    -1000024         6   # BR(~b_2 -> chi^-_1 t)
     2.61152981E-01    2    -1000037         6   # BR(~b_2 -> chi^-_2 t)
     9.25855277E-02    2     1000006       -24   # BR(~b_2 -> ~t_1 W^-)
DECAY   2000002     3.48883776E+00   # ~u_R
#    BR                NDA      ID1      ID2
     9.98465170E-01    2     1000022         2   # BR(~u_R -> chi^0_1 u)
     1.62444054E-04    2     1000023         2   # BR(~u_R -> chi^0_2 u)
     2.01634794E-04    2     1000025         2   # BR(~u_R -> chi^0_3 u)
     1.17075059E-03    2     1000035         2   # BR(~u_R -> chi^0_4 u)
DECAY   1000002     1.51019344E+01   # ~u_L
#    BR                NDA      ID1      ID2
     1.45063738E-02    2     1000022         2   # BR(~u_L -> chi^0_1 u)
     3.21913254E-01    2     1000023         2   # BR(~u_L -> chi^0_2 u)
     1.45503631E-04    2     1000025         2   # BR(~u_L -> chi^0_3 u)
     5.92733764E-03    2     1000035         2   # BR(~u_L -> chi^0_4 u)
     6.49235987E-01    2     1000024         1   # BR(~u_L -> chi^+_1 d)
     8.27154426E-03    2     1000037         1   # BR(~u_L -> chi^+_2 d)
DECAY   2000004     3.48954103E+00   # ~c_R
#    BR                NDA      ID1      ID2
     9.98230514E-01    2     1000022         4   # BR(~c_R -> chi^0_1 c)
     2.16712145E-04    2     1000023         4   # BR(~c_R -> chi^0_2 c)
     2.27621406E-04    2     1000025         4   # BR(~c_R -> chi^0_3 c)
     1.18431445E-03    2     1000035         4   # BR(~c_R -> chi^0_4 c)
     1.07936953E-04    2     1000024         3   # BR(~c_R -> chi^+_1 s)
     3.29007527E-05    2     1000037         3   # BR(~c_R -> chi^+_2 s)
DECAY   1000004     1.51017675E+01   # ~c_L
#    BR                NDA      ID1      ID2
     1.45129386E-02    2     1000022         4   # BR(~c_L -> chi^0_1 c)
     3.21902202E-01    2     1000023         4   # BR(~c_L -> chi^0_2 c)
     1.51294184E-04    2     1000025         4   # BR(~c_L -> chi^0_3 c)
     5.93624711E-03    2     1000035         4   # BR(~c_L -> chi^0_4 c)
     6.49215732E-01    2     1000024         3   # BR(~c_L -> chi^+_1 s)
     8.28158632E-03    2     1000037         3   # BR(~c_L -> chi^+_2 s)
DECAY   1000006     9.80315087E+00   # ~t_1
#    BR                NDA      ID1      ID2
     2.46449105E-01    2     1000022         6   # BR(~t_1 -> chi^0_1 t)
     6.72256995E-02    2     1000023         6   # BR(~t_1 -> chi^0_2 t)
     1.85557322E-01    2     1000025         6   # BR(~t_1 -> chi^0_3 t)
     8.43533195E-02    2     1000035         6   # BR(~t_1 -> chi^0_4 t)
     1.42066964E-01    2     1000024         5   # BR(~t_1 -> chi^+_1 b)
     2.74347588E-01    2     1000037         5   # BR(~t_1 -> chi^+_2 b)
DECAY   2000006     2.51562112E+01   # ~t_2
#    BR                NDA      ID1      ID2
     1.53060036E-02    2     1000022         6   # BR(~t_2 -> chi^0_1 t)
     1.31330300E-01    2     1000023         6   # BR(~t_2 -> chi^0_2 t)
     1.35031398E-01    2     1000025         6   # BR(~t_2 -> chi^0_3 t)
     1.93161529E-01    2     1000035         6   # BR(~t_2 -> chi^0_4 t)
     2.76552443E-01    2     1000024         5   # BR(~t_2 -> chi^+_1 b)
     5.97177253E-02    2     1000037         5   # BR(~t_2 -> chi^+_2 b)
     1.13020542E-01    2     1000006        23   # BR(~t_2 -> ~t_1 Z)
     7.58800553E-02    2     1000006        25   # BR(~t_2 -> ~t_1 S^0_1)
DECAY   1000024     2.04782642E-01   # chi^+_1
#    BR                NDA      ID1      ID2
     5.62340659E-02    2     1000022        24   # BR(chi^+_1 -> chi^0_1 W^+)
     1.01662074E-02    2    -1000015        12   # BR(chi^+_1 -> S^+_1 nu_1)
     1.92933894E-02    2    -1000015        14   # BR(chi^+_1 -> S^+_1 nu_2)
     2.96677263E-02    2    -1000015        16   # BR(chi^+_1 -> S^+_1 nu_3)
     3.01782839E-05    2    -2000013        12   # BR(chi^+_1 -> S^+_2 nu_1)
     7.34018236E-05    2    -2000013        14   # BR(chi^+_1 -> S^+_2 nu_2)
     1.02511114E-04    2    -2000013        16   # BR(chi^+_1 -> S^+_2 nu_3)
     2.17213505E-02    2    -2000015        12   # BR(chi^+_1 -> S^+_4 nu_1)
     4.12138091E-02    2    -2000015        14   # BR(chi^+_1 -> S^+_4 nu_2)
     6.33897132E-02    2    -2000015        16   # BR(chi^+_1 -> S^+_4 nu_3)
     1.86517673E-02    2    -1000013        12   # BR(chi^+_1 -> S^+_5 nu_1)
     4.26596095E-02    2    -1000013        14   # BR(chi^+_1 -> S^+_5 nu_2)
     6.07555782E-02    2    -1000013        16   # BR(chi^+_1 -> S^+_5 nu_3)
     8.24163078E-02    2    -1000011        12   # BR(chi^+_1 -> S^+_6 nu_1)
     3.95779057E-02    2    -1000011        14   # BR(chi^+_1 -> S^+_6 nu_2)
     5.83392826E-05    2    -1000011        16   # BR(chi^+_1 -> S^+_6 nu_3)
     9.16199796E-02    2         -15   1000019   # BR(chi^+_1 -> tau^+ P^0_1)
     1.36218076E-06    2         -11   1000018   # BR(chi^+_1 -> e^+ P^0_2)
     8.26571822E-02    2         -13   1000018   # BR(chi^+_1 -> mu^+ P^0_2)
     8.26262042E-02    2         -11   1000017   # BR(chi^+_1 -> e^+ P^0_3)
     1.36168655E-06    2         -13   1000017   # BR(chi^+_1 -> mu^+ P^0_3)
     9.16199796E-02    2         -15   1000016   # BR(chi^+_1 -> tau^+ S^0_2)
     1.36283928E-06    2         -11   1000014   # BR(chi^+_1 -> e^+ S^0_3)
     8.26571816E-02    2         -13   1000014   # BR(chi^+_1 -> mu^+ S^0_3)
     8.26262036E-02    2         -11   1000012   # BR(chi^+_1 -> e^+ S^0_4)
     1.36234484E-06    2         -13   1000012   # BR(chi^+_1 -> mu^+ S^0_4)
#    BR                NDA      ID1      ID2       ID3
     1.54494246E-06    3     1000022        -1         2   # BR(chi^+_1 -> chi^0_1 d_bar u)
     1.54490878E-06    3     1000022        -3         4   # BR(chi^+_1 -> chi^0_1 s_bar c)
     1.72864404E-04    3     1000022        -5         6   # BR(chi^+_1 -> chi^0_1 b_bar t)
DECAY   1000037     6.01586886E+00   # chi^+_2
#    BR                NDA      ID1      ID2
     1.14872973E-01    2     1000022        24   # BR(chi^+_2 -> chi^0_1 W^+)
     2.62634765E-01    2     1000023        24   # BR(chi^+_2 -> chi^0_2 W^+)
     1.45253470E-03    2    -1000015        12   # BR(chi^+_2 -> S^+_1 nu_1)
     2.75661750E-03    2    -1000015        14   # BR(chi^+_2 -> S^+_1 nu_2)
     4.23888645E-03    2    -1000015        16   # BR(chi^+_2 -> S^+_1 nu_3)
     4.31346391E-06    2    -2000013        12   # BR(chi^+_2 -> S^+_2 nu_1)
     1.04915317E-05    2    -2000013        14   # BR(chi^+_2 -> S^+_2 nu_2)
     1.46521897E-05    2    -2000013        16   # BR(chi^+_2 -> S^+_2 nu_3)
     2.10267956E-03    2    -2000015        12   # BR(chi^+_2 -> S^+_4 nu_1)
     3.98964890E-03    2    -2000015        14   # BR(chi^+_2 -> S^+_4 nu_2)
     6.13627292E-03    2    -2000015        16   # BR(chi^+_2 -> S^+_4 nu_3)
     1.66611504E-03    2    -1000013        12   # BR(chi^+_2 -> S^+_5 nu_1)
     3.81072649E-03    2    -1000013        14   # BR(chi^+_2 -> S^+_5 nu_2)
     5.42713654E-03    2    -1000013        16   # BR(chi^+_2 -> S^+_5 nu_3)
     7.35976601E-03    2    -1000011        12   # BR(chi^+_2 -> S^+_6 nu_1)
     3.53435013E-03    2    -1000011        14   # BR(chi^+_2 -> S^+_6 nu_2)
     5.20968623E-06    2    -1000011        16   # BR(chi^+_2 -> S^+_6 nu_3)
     2.85190464E-01    2     1000024        23   # BR(chi^+_2 -> chi^+_1 Z)
     5.78578567E-03    2         -15   1000019   # BR(chi^+_2 -> tau^+ P^0_1)
     2.76266698E-03    2         -13   1000018   # BR(chi^+_2 -> mu^+ P^0_2)
     2.75203009E-03    2         -11   1000017   # BR(chi^+_2 -> e^+ P^0_3)
     2.70118562E-01    2     1000024        25   # BR(chi^+_2 -> chi^+_1 S^0_1)
     5.78578567E-03    2         -15   1000016   # BR(chi^+_2 -> tau^+ S^0_2)
     2.76266695E-03    2         -13   1000014   # BR(chi^+_2 -> mu^+ S^0_3)
     2.75203007E-03    2         -11   1000012   # BR(chi^+_2 -> e^+ S^0_4)
#    BR                NDA      ID1      ID2       ID3
     2.38036145E-06    3     1000024         5        -5   # BR(chi^+_2 -> chi^+_1 b b_bar)
     1.28335898E-03    3     1000022        -5         6   # BR(chi^+_2 -> chi^0_1 b_bar t)
     7.86293268E-04    3     1000023        -5         6   # BR(chi^+_2 -> chi^0_2 b_bar t)
DECAY   1000022     7.47256819E-12   # chi^0_1
#    BR                NDA      ID1      ID2
     5.61959818E-02    2         -13       -24   # BR(chi^0_1 -> mu^+ W^-)
     5.61959818E-02    2          13        24   # BR(chi^0_1 -> mu^- W^+)
     4.33618820E-02    2         -15       -24   # BR(chi^0_1 -> tau^+ W^-)
     4.33618820E-02    2          15        24   # BR(chi^0_1 -> tau^- W^+)
     4.43579473E-06    2          12        23   # BR(chi^0_1 -> nu_1 Z)
     7.27784815E-06    2          14        23   # BR(chi^0_1 -> nu_2 Z)
     1.03996602E-01    2          16        23   # BR(chi^0_1 -> nu_3 Z)
     1.86103121E-04    2          12        25   # BR(chi^0_1 -> nu_1 S^0_1)
     4.43933431E-02    2          14        25   # BR(chi^0_1 -> nu_2 S^0_1)
     8.77560338E-02    2          16        25   # BR(chi^0_1 -> nu_3 S^0_1)
     5.82064598E-06    2          16        22   # BR(chi^0_1 -> nu_3 photon)
#    BR                NDA      ID1      ID2       ID3
     8.73045388E-05    3          12         5        -5   # BR(chi^0_1 -> nu_1 b b_bar)
     1.10381013E-05    3          14         3        -3   # BR(chi^0_1 -> nu_2 s s_bar)
     2.60014796E-02    3          14         5        -5   # BR(chi^0_1 -> nu_2 b b_bar)
     1.05499357E-05    3          16         5        -5   # BR(chi^0_1 -> nu_3 b b_bar)
     1.39804922E-06    3         -11         3        -4   # BR(chi^0_1 -> e^+ s c_bar)
     1.39804922E-06    3          11        -3         4   # BR(chi^0_1 -> e^- s_bar c)
     7.21910544E-04    3         -11         5        -6   # BR(chi^0_1 -> e^+ b t_bar)
     7.21910544E-04    3          11        -5         6   # BR(chi^0_1 -> e^- b_bar t)
     1.92165953E-06    3         -13         3        -4   # BR(chi^0_1 -> mu^+ s c_bar)
     1.92165953E-06    3          13        -3         4   # BR(chi^0_1 -> mu^- s_bar c)
     1.22443814E-03    3         -13         5        -6   # BR(chi^0_1 -> mu^+ b t_bar)
     1.22443814E-03    3          13        -5         6   # BR(chi^0_1 -> mu^- b_bar t)
     2.06998107E-06    3         -15         3        -4   # BR(chi^0_1 -> tau^+ s c_bar)
     2.06998107E-06    3          15        -3         4   # BR(chi^0_1 -> tau^- s_bar c)
     9.86460654E-04    3         -15         5        -6   # BR(chi^0_1 -> tau^+ b t_bar)
     9.86460654E-04    3          15        -5         6   # BR(chi^0_1 -> tau^- b_bar t)
     2.65455109E-05    3          12       -13        11   # BR(chi^0_1 -> nu_1 mu^+ e^-)
     2.65455109E-05    3          12       -11        13   # BR(chi^0_1 -> nu_1 e^+ mu^-)
     4.15922123E-05    3          12       -13        13   # BR(chi^0_1 -> nu_1 mu^+ mu^-)
     9.60483341E-03    3          12       -15        11   # BR(chi^0_1 -> nu_1 tau^+ e^-)
     9.60483341E-03    3          12       -11        15   # BR(chi^0_1 -> nu_1 e^+ tau^-)
     1.31916927E-02    3          12       -15        13   # BR(chi^0_1 -> nu_1 tau^+ mu^-)
     1.31916927E-02    3          12       -13        15   # BR(chi^0_1 -> nu_1 mu^+ tau^-)
     1.60351034E-02    3          12       -15        15   # BR(chi^0_1 -> nu_1 tau^+ tau^-)
     6.45019103E-05    3          14       -13        11   # BR(chi^0_1 -> nu_2 mu^+ e^-)
     6.45019103E-05    3          14       -11        13   # BR(chi^0_1 -> nu_2 e^+ mu^-)
     5.55172100E-04    3          14       -13        13   # BR(chi^0_1 -> nu_2 mu^+ mu^-)
     1.82279839E-02    3          14       -15        11   # BR(chi^0_1 -> nu_2 tau^+ e^-)
     1.82279839E-02    3          14       -11        15   # BR(chi^0_1 -> nu_2 e^+ tau^-)
     2.50547929E-02    3          14       -15        13   # BR(chi^0_1 -> nu_2 tau^+ mu^-)
     2.50547929E-02    3          14       -13        15   # BR(chi^0_1 -> nu_2 mu^+ tau^-)
     1.79023843E-01    3          14       -15        15   # BR(chi^0_1 -> nu_2 tau^+ tau^-)
     1.70515797E-06    3          16       -11        11   # BR(chi^0_1 -> nu_3 e^+ e^-)
     9.00605251E-05    3          16       -13        11   # BR(chi^0_1 -> nu_3 mu^+ e^-)
     9.00605251E-05    3          16       -11        13   # BR(chi^0_1 -> nu_3 e^+ mu^-)
     2.70637732E-04    3          16       -13        13   # BR(chi^0_1 -> nu_3 mu^+ mu^-)
     2.80293892E-02    3          16       -15        11   # BR(chi^0_1 -> nu_3 tau^+ e^-)
     2.80293892E-02    3          16       -11        15   # BR(chi^0_1 -> nu_3 e^+ tau^-)
     3.85144796E-02    3          16       -15        13   # BR(chi^0_1 -> nu_3 tau^+ mu^-)
     3.85144796E-02    3          16       -13        15   # BR(chi^0_1 -> nu_3 mu^+ tau^-)
     7.10091307E-02    3          16       -15        15   # BR(chi^0_1 -> nu_3 tau^+ tau^-)
DECAY   1000023     2.12727935E-01   # chi^0_2
#    BR                NDA      ID1      ID2
     2.98761723E-02    2    -1000015        15   # BR(chi^0_2 -> S^+_1 tau^-)
     2.98761723E-02    2     1000015       -15   # BR(chi^0_2 -> S^-_1 tau^+)
     6.79679321E-04    2    -2000013        13   # BR(chi^0_2 -> S^+_2 mu^-)
     6.79679321E-04    2     2000013       -13   # BR(chi^0_2 -> S^-_2 mu^+)
     5.77681053E-04    2    -2000011        11   # BR(chi^0_2 -> S^+_3 e^-)
     5.77681053E-04    2     2000011       -11   # BR(chi^0_2 -> S^-_3 e^+)
     6.19959866E-02    2    -2000015        15   # BR(chi^0_2 -> S^+_4 tau^-)
     6.19959866E-02    2     2000015       -15   # BR(chi^0_2 -> S^-_4 tau^+)
     5.93645532E-06    2    -1000013        11   # BR(chi^0_2 -> S^+_5 e^-)
     5.93645532E-06    2     1000013       -11   # BR(chi^0_2 -> S^-_5 e^+)
     5.96724007E-02    2    -1000013        13   # BR(chi^0_2 -> S^+_5 mu^-)
     5.96724007E-02    2     1000013       -13   # BR(chi^0_2 -> S^-_5 mu^+)
     5.96645487E-02    2    -1000011        11   # BR(chi^0_2 -> S^+_6 e^-)
     5.96645487E-02    2     1000011       -11   # BR(chi^0_2 -> S^-_6 e^+)
     5.93526368E-06    2    -1000011        13   # BR(chi^0_2 -> S^+_6 mu^-)
     5.93526368E-06    2     1000011       -13   # BR(chi^0_2 -> S^-_6 mu^+)
     5.99686225E-03    2     1000022        23   # BR(chi^0_2 -> chi^0_1 Z)
     1.45435261E-02    2          12   1000019   # BR(chi^0_2 -> nu_1 P^0_1)
     2.75981759E-02    2          14   1000019   # BR(chi^0_2 -> nu_2 P^0_1)
     4.24421899E-02    2          16   1000019   # BR(chi^0_2 -> nu_3 P^0_1)
     1.14014444E-02    2          12   1000018   # BR(chi^0_2 -> nu_1 P^0_2)
     2.70433543E-02    2          14   1000018   # BR(chi^0_2 -> nu_2 P^0_2)
     3.80693711E-02    2          16   1000018   # BR(chi^0_2 -> nu_3 P^0_2)
     5.19377506E-02    2          12   1000017   # BR(chi^0_2 -> nu_1 P^0_3)
     2.44966894E-02    2          14   1000017   # BR(chi^0_2 -> nu_2 P^0_3)
     5.17867604E-05    2          16   1000017   # BR(chi^0_2 -> nu_3 P^0_3)
     9.38698239E-02    2     1000022        25   # BR(chi^0_2 -> chi^0_1 S^0_1)
     1.45435262E-02    2          12   1000016   # BR(chi^0_2 -> nu_1 S^0_2)
     2.75981755E-02    2          14   1000016   # BR(chi^0_2 -> nu_2 S^0_2)
     4.24421903E-02    2          16   1000016   # BR(chi^0_2 -> nu_3 S^0_2)
     1.14014922E-02    2          12   1000014   # BR(chi^0_2 -> nu_1 S^0_3)
     2.70433040E-02    2          14   1000014   # BR(chi^0_2 -> nu_2 S^0_3)
     3.80693736E-02    2          16   1000014   # BR(chi^0_2 -> nu_3 S^0_3)
     5.19377027E-02    2          12   1000012   # BR(chi^0_2 -> nu_1 S^0_4)
     2.44967400E-02    2          14   1000012   # BR(chi^0_2 -> nu_2 S^0_4)
     5.17840142E-05    2          16   1000012   # BR(chi^0_2 -> nu_3 S^0_4)
     3.77723373E-06    2     1000022        22   # BR(chi^0_2 -> chi^0_1 photon)
#    BR                NDA      ID1      ID2       ID3
     1.29831522E-06    3     1000022         5        -5   # BR(chi^0_2 -> chi^0_1 b b_bar)
DECAY   1000025     5.85711241E+00   # chi^0_3
#    BR                NDA      ID1      ID2
     2.78190133E-01    2     1000024       -24   # BR(chi^0_3 -> chi^+_1 W^-)
     2.78190133E-01    2    -1000024        24   # BR(chi^0_3 -> chi^-_1 W^+)
     5.54068273E-03    2    -1000015        15   # BR(chi^0_3 -> S^+_1 tau^-)
     5.54068273E-03    2     1000015       -15   # BR(chi^0_3 -> S^-_1 tau^+)
     1.56589759E-04    2    -2000013        13   # BR(chi^0_3 -> S^+_2 mu^-)
     1.56589759E-04    2     2000013       -13   # BR(chi^0_3 -> S^-_2 mu^+)
     1.37800510E-04    2    -2000011        11   # BR(chi^0_3 -> S^+_3 e^-)
     1.37800510E-04    2     2000011       -11   # BR(chi^0_3 -> S^-_3 e^+)
     3.24255980E-03    2    -2000015        15   # BR(chi^0_3 -> S^+_4 tau^-)
     3.24255980E-03    2     2000015       -15   # BR(chi^0_3 -> S^-_4 tau^+)
     5.58896119E-05    2    -1000013        13   # BR(chi^0_3 -> S^+_5 mu^-)
     5.58896119E-05    2     1000013       -13   # BR(chi^0_3 -> S^-_5 mu^+)
     4.46216772E-05    2    -1000011        11   # BR(chi^0_3 -> S^+_6 e^-)
     4.46216772E-05    2     1000011       -11   # BR(chi^0_3 -> S^-_6 e^+)
     1.08081775E-01    2     1000022        23   # BR(chi^0_3 -> chi^0_1 Z)
     2.91104521E-01    2     1000023        23   # BR(chi^0_3 -> chi^0_2 Z)
     4.17759699E-05    2          12   1000019   # BR(chi^0_3 -> nu_1 P^0_1)
     7.92751741E-05    2          14   1000019   # BR(chi^0_3 -> nu_2 P^0_1)
     1.21914290E-04    2          16   1000019   # BR(chi^0_3 -> nu_3 P^0_1)
     3.59002812E-05    2          12   1000018   # BR(chi^0_3 -> nu_1 P^0_2)
     8.51527222E-05    2          14   1000018   # BR(chi^0_3 -> nu_2 P^0_2)
     1.19870876E-04    2          16   1000018   # BR(chi^0_3 -> nu_3 P^0_2)
     1.63593749E-04    2          12   1000017   # BR(chi^0_3 -> nu_1 P^0_3)
     7.71597772E-05    2          14   1000017   # BR(chi^0_3 -> nu_2 P^0_3)
     1.59269969E-02    2     1000022        25   # BR(chi^0_3 -> chi^0_1 S^0_1)
     6.82214095E-03    2     1000023        25   # BR(chi^0_3 -> chi^0_2 S^0_1)
     4.17759701E-05    2          12   1000016   # BR(chi^0_3 -> nu_1 S^0_2)
     7.92751730E-05    2          14   1000016   # BR(chi^0_3 -> nu_2 S^0_2)
     1.21914291E-04    2          16   1000016   # BR(chi^0_3 -> nu_3 S^0_2)
     3.59004318E-05    2          12   1000014   # BR(chi^0_3 -> nu_1 S^0_3)
     8.51525638E-05    2          14   1000014   # BR(chi^0_3 -> nu_2 S^0_3)
     1.19870884E-04    2          16   1000014   # BR(chi^0_3 -> nu_3 S^0_3)
     1.63593599E-04    2          12   1000012   # BR(chi^0_3 -> nu_1 S^0_4)
     7.71599367E-05    2          14   1000012   # BR(chi^0_3 -> nu_2 S^0_4)
     2.42375081E-06    2     1000023        22   # BR(chi^0_3 -> chi^0_2 photon)
#    BR                NDA      ID1      ID2       ID3
     5.30076711E-04    3     1000022         6        -6   # BR(chi^0_3 -> chi^0_1 t t_bar)
     1.37179808E-06    3     1000022         5        -5   # BR(chi^0_3 -> chi^0_1 b b_bar)
     6.70345296E-04    3     1000024         5        -6   # BR(chi^0_3 -> chi^+_1 b t_bar)
     6.70345296E-04    3    -1000024        -5         6   # BR(chi^0_3 -> chi^-_1 b_bar t)
DECAY   1000035     6.83308794E+00   # chi^0_4
#    BR                NDA      ID1      ID2
     2.98509302E-01    2     1000024       -24   # BR(chi^0_4 -> chi^+_1 W^-)
     2.98509302E-01    2    -1000024        24   # BR(chi^0_4 -> chi^-_1 W^+)
     4.37987680E-03    2    -1000015        15   # BR(chi^0_4 -> S^+_1 tau^-)
     4.37987680E-03    2     1000015       -15   # BR(chi^0_4 -> S^-_1 tau^+)
     7.30049989E-04    2    -2000013        13   # BR(chi^0_4 -> S^+_2 mu^-)
     7.30049989E-04    2     2000013       -13   # BR(chi^0_4 -> S^-_2 mu^+)
     7.17411209E-04    2    -2000011        11   # BR(chi^0_4 -> S^+_3 e^-)
     7.17411209E-04    2     2000011       -11   # BR(chi^0_4 -> S^-_3 e^+)
     5.82388052E-03    2    -2000015        15   # BR(chi^0_4 -> S^+_4 tau^-)
     5.82388052E-03    2     2000015       -15   # BR(chi^0_4 -> S^-_4 tau^+)
     2.67550878E-03    2    -1000013        13   # BR(chi^0_4 -> S^+_5 mu^-)
     2.67550878E-03    2     1000013       -13   # BR(chi^0_4 -> S^-_5 mu^+)
     2.66431626E-03    2    -1000011        11   # BR(chi^0_4 -> S^+_6 e^-)
     2.66431626E-03    2     1000011       -11   # BR(chi^0_4 -> S^-_6 e^+)
     1.51394798E-02    2     1000022        23   # BR(chi^0_4 -> chi^0_1 Z)
     8.21794445E-03    2     1000023        23   # BR(chi^0_4 -> chi^0_2 Z)
     9.07234262E-04    2          12   1000019   # BR(chi^0_4 -> nu_1 P^0_1)
     1.72159149E-03    2          14   1000019   # BR(chi^0_4 -> nu_2 P^0_1)
     2.64757038E-03    2          16   1000019   # BR(chi^0_4 -> nu_3 P^0_1)
     7.79853869E-04    2          12   1000018   # BR(chi^0_4 -> nu_1 P^0_2)
     1.84975375E-03    2          14   1000018   # BR(chi^0_4 -> nu_2 P^0_2)
     2.60392854E-03    2          16   1000018   # BR(chi^0_4 -> nu_3 P^0_2)
     3.55371442E-03    2          12   1000017   # BR(chi^0_4 -> nu_1 P^0_3)
     1.67612646E-03    2          14   1000017   # BR(chi^0_4 -> nu_2 P^0_3)
     3.54338333E-06    2          16   1000017   # BR(chi^0_4 -> nu_3 P^0_3)
     8.69289053E-02    2     1000022        25   # BR(chi^0_4 -> chi^0_1 S^0_1)
     2.25638215E-01    2     1000023        25   # BR(chi^0_4 -> chi^0_2 S^0_1)
     9.07234266E-04    2          12   1000016   # BR(chi^0_4 -> nu_1 S^0_2)
     1.72159146E-03    2          14   1000016   # BR(chi^0_4 -> nu_2 S^0_2)
     2.64757040E-03    2          16   1000016   # BR(chi^0_4 -> nu_3 S^0_2)
     7.79857142E-04    2          12   1000014   # BR(chi^0_4 -> nu_1 S^0_3)
     1.84975031E-03    2          14   1000014   # BR(chi^0_4 -> nu_2 S^0_3)
     2.60392871E-03    2          16   1000014   # BR(chi^0_4 -> nu_3 S^0_3)
     3.55371114E-03    2          12   1000012   # BR(chi^0_4 -> nu_1 S^0_4)
     1.67612993E-03    2          14   1000012   # BR(chi^0_4 -> nu_2 S^0_4)
     3.54319541E-06    2          16   1000012   # BR(chi^0_4 -> nu_3 S^0_4)
     3.74847720E-06    2     1000023        22   # BR(chi^0_4 -> chi^0_2 photon)
#    BR                NDA      ID1      ID2       ID3
     2.56030049E-04    3     1000022         6        -6   # BR(chi^0_4 -> chi^0_1 t t_bar)
     1.18882592E-06    3     1000022         5        -5   # BR(chi^0_4 -> chi^0_1 b b_bar)
     6.51802085E-04    3     1000024         5        -6   # BR(chi^0_4 -> chi^+_1 b t_bar)
     6.51802085E-04    3    -1000024        -5         6   # BR(chi^0_4 -> chi^-_1 b_bar t)
     2.11086504E-06    3     1000023        12        12   # BR(chi^0_4 -> chi^0_2 nu_1 nu_1)
     2.10255347E-06    3     1000023        14        14   # BR(chi^0_4 -> chi^0_2 nu_2 nu_2)
     2.09314426E-06    3     1000023        16        16   # BR(chi^0_4 -> chi^0_2 nu_3 nu_3)
     1.04504034E-06    3          12   1000024        11   # BR(chi^0_4 -> nu_1 chi^+_1 e^-)
     1.04504034E-06    3          12       -11  -1000024   # BR(chi^0_4 -> nu_1 e^+ chi^-_1)
     1.10981362E-06    3          16   1000024        15   # BR(chi^0_4 -> nu_3 chi^+_1 tau^-)
     1.10981362E-06    3          16       -15  -1000024   # BR(chi^0_4 -> nu_3 tau^+ chi^-_1)
     1.22002928E-06    3     1000023       -11        11   # BR(chi^0_4 -> chi^0_2 e^+ e^-)
     1.22301975E-06    3     1000023       -13        13   # BR(chi^0_4 -> chi^0_2 mu^+ mu^-)
     2.01702072E-06    3     1000023       -15        15   # BR(chi^0_4 -> chi^0_2 tau^+ tau^-)
DECAY   1000021     2.77163684E+01   # ~g
#    BR                NDA      ID1      ID2
     3.49841155E-02    2     2000002        -2   # BR(~g -> ~u_R u_bar)
     3.49841155E-02    2    -2000002         2   # BR(~g -> ~u^*_R u)
     1.72260017E-02    2     1000002        -2   # BR(~g -> ~u_L u_bar)
     1.72260017E-02    2    -1000002         2   # BR(~g -> ~u^*_L u)
     3.49834991E-02    2     2000004        -4   # BR(~g -> ~c_R c_bar)
     3.49834991E-02    2    -2000004         4   # BR(~g -> ~c^*_R c)
     1.72276489E-02    2     1000004        -4   # BR(~g -> ~c_L c_bar)
     1.72276489E-02    2    -1000004         4   # BR(~g -> ~c^*_L c)
     1.33395984E-01    2     1000006        -6   # BR(~g -> ~t_1 t_bar)
     1.33395984E-01    2    -1000006         6   # BR(~g -> ~t^*_1 t)
     5.40828713E-02    2     2000006        -6   # BR(~g -> ~t_2 t_bar)
     5.40828713E-02    2    -2000006         6   # BR(~g -> ~t^*_2 t)
     3.71538886E-02    2     2000001        -1   # BR(~g -> ~d_R d_bar)
     3.71538886E-02    2    -2000001         1   # BR(~g -> ~d^*_R d)
     1.68399140E-02    2     1000001        -1   # BR(~g -> ~d_L d_bar)
     1.68399140E-02    2    -1000001         1   # BR(~g -> ~d^*_L d)
     3.71550661E-02    2     2000003        -3   # BR(~g -> ~s_R s_bar)
     3.71550661E-02    2    -2000003         3   # BR(~g -> ~s^*_R s)
     1.68408788E-02    2     1000003        -3   # BR(~g -> ~s_L s_bar)
     1.68408788E-02    2    -1000003         3   # BR(~g -> ~s^*_L s)
     6.04525211E-02    2     1000005        -5   # BR(~g -> ~b_1 b_bar)
     6.04525211E-02    2    -1000005         5   # BR(~g -> ~b^*_1 b)
     3.95839661E-02    2     2000005        -5   # BR(~g -> ~b_2 b_bar)
     3.95839661E-02    2    -2000005         5   # BR(~g -> ~b^*_2 b)
     1.97541829E-06    2     1000022        21   # BR(~g -> chi^0_1 g)
     2.32992884E-06    2     1000023        21   # BR(~g -> chi^0_2 g)
     6.45840286E-05    2     1000025        21   # BR(~g -> chi^0_3 g)
     7.84008503E-05    2     1000035        21   # BR(~g -> chi^0_4 g)
DECAY        25     1.73268817E-03   # S^0_1
#    BR                NDA      ID1      ID2
     3.38648551E-04    2           3        -3   # BR(S^0_1 -> s s_bar)
     7.86555227E-01    2           5        -5   # BR(S^0_1 -> b b_bar)
     5.80478089E-02    2           4        -4   # BR(S^0_1 -> c c_bar)
     4.84737522E-04    2         -13        13   # BR(S^0_1 -> mu^+ mu^-)
     1.36941136E-01    2         -15        15   # BR(S^0_1 -> tau^+ tau^-)
# writing decays into V V* as 3-body decays
#    BR                NDA      ID1      ID2       ID3
     0.00000000E+00    3          24        11        12   # BR(S^0_1 -> W^+ d u)
     0.00000000E+00    3          24        13        14   # BR(S^0_1 -> W^+ s c)
     0.00000000E+00    3          24        15        16   # BR(S^0_1 -> W^+ b t)
     0.00000000E+00    3          24         1        -2   # BR(S^0_1 -> W^+ ~c_L ~u^*_R)
     0.00000000E+00    3          24         3        -4   # BR(S^0_1 -> W^+ ~t_1 ~u^*_L)
     0.00000000E+00    3         -24       -11       -12   # BR(S^0_1 -> W^- d_bar u_bar)
     0.00000000E+00    3         -24       -13       -14   # BR(S^0_1 -> W^- s_bar c_bar)
     0.00000000E+00    3         -24       -15       -16   # BR(S^0_1 -> W^- b_bar t_bar)
     0.00000000E+00    3         -24        -1         2   # BR(S^0_1 -> W^- ~c^*_L ~u_R)
     0.00000000E+00    3         -24        -3         4   # BR(S^0_1 -> W^- ~t^*_1 ~u_L)
     6.17096870E-04    3          23        11       -11   # BR(S^0_1 -> Z d d_bar)
     6.17096870E-04    3          23        13       -13   # BR(S^0_1 -> Z s s_bar)
     5.28940174E-04    3          23        15       -15   # BR(S^0_1 -> Z b b_bar)
     3.52626783E-03    3          23        12       -12   # BR(S^0_1 -> Z u u_bar)
     2.46838748E-03    3          23         1        -1   # BR(S^0_1 -> Z ~u_R ~u^*_R)
     2.46838748E-03    3          23         3        -3   # BR(S^0_1 -> Z ~u_L ~u^*_L)
     2.46838748E-03    3          23         5        -5   # BR(S^0_1 -> Z ~c_R ~c^*_R)
     2.46838748E-03    3          23         2        -2   # BR(S^0_1 -> Z ~u_R ~u^*_R)
     2.46838748E-03    3          23         4        -4   # BR(S^0_1 -> Z ~u_L ~u^*_L)
DECAY   1000016     5.11400367E-01   # S^0_2
#    BR                NDA      ID1      ID2
     1.30232582E-01    2          12   1000022   # BR(S^0_2 -> nu_1 chi^0_1)
     2.47132753E-01    2          14   1000022   # BR(S^0_2 -> nu_2 chi^0_1)
     3.80056113E-01    2          16   1000022   # BR(S^0_2 -> nu_3 chi^0_1)
     1.21289235E-01    2    -1000015       -24   # BR(S^0_2 -> S^+_1 W^-)
     1.21289235E-01    2     1000015        24   # BR(S^0_2 -> S^-_1 W^+)
DECAY   1000014     3.91400855E-01   # S^0_3
#    BR                NDA      ID1      ID2
     1.48850325E-01    2          12   1000022   # BR(S^0_3 -> nu_1 chi^0_1)
     3.53059451E-01    2          14   1000022   # BR(S^0_3 -> nu_2 chi^0_1)
     4.97008507E-01    2          16   1000022   # BR(S^0_3 -> nu_3 chi^0_1)
     5.40827734E-04    2    -2000013       -24   # BR(S^0_3 -> S^+_2 W^-)
     5.40827734E-04    2     2000013        24   # BR(S^0_3 -> S^-_2 W^+)
DECAY   1000012     3.90990385E-01   # S^0_4
#    BR                NDA      ID1      ID2
     6.79046417E-01    2          12   1000022   # BR(S^0_4 -> nu_1 chi^0_1)
     3.20276459E-01    2          14   1000022   # BR(S^0_4 -> nu_2 chi^0_1)
     6.77037055E-04    2          16   1000022   # BR(S^0_4 -> nu_3 chi^0_1)
DECAY        35     2.13880487E+00   # S^0_5
#    BR                NDA      ID1      ID2
     2.72038873E-04    2           3        -3   # BR(S^0_5 -> s s_bar)
     6.34062701E-01    2           5        -5   # BR(S^0_5 -> b b_bar)
     4.84722803E-06    2           4        -4   # BR(S^0_5 -> c c_bar)
     2.51021942E-01    2           6        -6   # BR(S^0_5 -> t t_bar)
     1.94115179E-03    2     1000022   1000022   # BR(S^0_5 -> chi^0_1 chi^0_1)
     4.31307835E-03    2     1000022   1000023   # BR(S^0_5 -> chi^0_1 chi^0_2)
     3.81391249E-04    2         -13        13   # BR(S^0_5 -> mu^+ mu^-)
     1.07888222E-01    2         -15        15   # BR(S^0_5 -> tau^+ tau^-)
     1.13761934E-04    2          23        23   # BR(S^0_5 -> Z Z)
DECAY   1000019     5.11400368E-01   # P^0_1
#    BR                NDA      ID1      ID2
     1.30232581E-01    2          12   1000022   # BR(P^0_1 -> nu_1 chi^0_1)
     2.47132756E-01    2          14   1000022   # BR(P^0_1 -> nu_2 chi^0_1)
     3.80056110E-01    2          16   1000022   # BR(P^0_1 -> nu_3 chi^0_1)
     1.21289234E-01    2    -1000015       -24   # BR(P^0_1 -> S^+_1 W^-)
     1.21289234E-01    2     1000015        24   # BR(P^0_1 -> S^-_1 W^+)
DECAY   1000018     3.91400857E-01   # P^0_2
#    BR                NDA      ID1      ID2
     1.48849699E-01    2          12   1000022   # BR(P^0_2 -> nu_1 chi^0_1)
     3.53060107E-01    2          14   1000022   # BR(P^0_2 -> nu_2 chi^0_1)
     4.97008473E-01    2          16   1000022   # BR(P^0_2 -> nu_3 chi^0_1)
     5.40827736E-04    2    -2000013       -24   # BR(P^0_2 -> S^+_2 W^-)
     5.40827736E-04    2     2000013        24   # BR(P^0_2 -> S^-_2 W^+)
DECAY   1000017     3.90990386E-01   # P^0_3
#    BR                NDA      ID1      ID2
     6.79047041E-01    2          12   1000022   # BR(P^0_3 -> nu_1 chi^0_1)
     3.20275796E-01    2          14   1000022   # BR(P^0_3 -> nu_2 chi^0_1)
     6.77072959E-04    2          16   1000022   # BR(P^0_3 -> nu_3 chi^0_1)
DECAY        36     2.20283888E+00   # P^0_4
#    BR                NDA      ID1      ID2
     2.64141551E-04    2           3        -3   # BR(P^0_4 -> s s_bar)
     6.15658266E-01    2           5        -5   # BR(P^0_4 -> b b_bar)
     4.61667126E-06    2           4        -4   # BR(P^0_4 -> c c_bar)
     2.54656381E-01    2           6        -6   # BR(P^0_4 -> t t_bar)
     3.52246362E-03    2     1000022   1000022   # BR(P^0_4 -> chi^0_1 chi^0_1)
     2.05569184E-02    2     1000022   1000023   # BR(P^0_4 -> chi^0_1 chi^0_2)
     3.70320034E-04    2         -13        13   # BR(P^0_4 -> mu^+ mu^-)
     1.04757343E-01    2         -15        15   # BR(P^0_4 -> tau^+ tau^-)
     2.08708570E-04    2          25        23   # BR(P^0_4 -> S^0_1 Z)
DECAY  -1000015     2.23435920E-01   # S^+_1
#    BR                NDA      ID1      ID2
     9.99999882E-01    2         -15   1000022   # BR(S^+_1 -> tau^+ chi^0_1)
DECAY  -2000013     2.62954425E-01   # S^+_2
#    BR                NDA      ID1      ID2
     1.00000000E+00    2         -13   1000022   # BR(S^+_2 -> mu^+ chi^0_1)
DECAY  -2000011     2.63098125E-01   # S^+_3
#    BR                NDA      ID1      ID2
     1.00000000E+00    2         -11   1000022   # BR(S^+_3 -> e^+ chi^0_1)
DECAY  -2000015     4.58683914E-01   # S^+_4
#    BR                NDA      ID1      ID2
     8.59577845E-01    2         -15   1000022   # BR(S^+_4 -> tau^+ chi^0_1)
     1.40422067E-01    2    -1000015        23   # BR(S^+_4 -> S^+_1 Z)
DECAY  -1000013     3.89532047E-01   # S^+_5
#    BR                NDA      ID1      ID2
     9.94096238E-05    2         -11   1000022   # BR(S^+_5 -> e^+ chi^0_1)
     9.99344880E-01    2         -13   1000022   # BR(S^+_5 -> mu^+ chi^0_1)
     5.55655617E-04    2    -2000013        23   # BR(S^+_5 -> S^+_2 Z)
DECAY  -1000011     3.89296618E-01   # S^+_6
#    BR                NDA      ID1      ID2
     9.99900416E-01    2         -11   1000022   # BR(S^+_6 -> e^+ chi^0_1)
     9.94766293E-05    2         -13   1000022   # BR(S^+_6 -> mu^+ chi^0_1)
DECAY        37     1.90614965E+00   # S^+_7
#    BR                NDA      ID1      ID2
     2.73071471E-04    2          -3         4   # BR(S^+_7 -> s_bar c)
     8.50297959E-01    2          -5         6   # BR(S^+_7 -> b_bar t)
     6.28349214E-05    2         -13        12   # BR(S^+_7 -> mu^+ nu_1)
     1.52831773E-04    2         -13        14   # BR(S^+_7 -> mu^+ nu_2)
     2.13440917E-04    2         -13        16   # BR(S^+_7 -> mu^+ nu_3)
     2.08710439E-02    2         -15        12   # BR(S^+_7 -> tau^+ nu_1)
     3.96090103E-02    2         -15        14   # BR(S^+_7 -> tau^+ nu_2)
     6.09073143E-02    2         -15        16   # BR(S^+_7 -> tau^+ nu_3)
     2.73736020E-02    2     1000024   1000022   # BR(S^+_7 -> chi^+_1 chi^0_1)
     2.38002900E-04    2          25        24   # BR(S^+_7 -> S^0_1 W^+)
Block SPhenoLowEnergy  # low energy observables
    1    0.00000000E+00   # BR(b -> s gamma)
    2    0.00000000E+00   # BR(b -> s mu+ mu-)
    3    0.00000000E+00   # BR(b -> s nu nu)
    4    0.00000000E+00   # BR(Bd -> mu+ mu-)
    5    0.00000000E+00   # BR(Bs -> mu+ mu-)
    6    0.00000000E+00   # BR(B_u -> tau nu)
    7    0.00000000E+00   # BR(B_u -> tau nu)/BR(B_u -> tau nu)_SM
    8    0.00000000E+00   # |Delta(M_Bd)| [ps^-1] 
    9    0.00000000E+00   # |Delta(M_Bs)| [ps^-1] 
   20    0.00000000E+00   # Delta(g-2)_electron/2
   21    0.00000000E+00   # Delta(g-2)_muon/2
   22    0.00000000E+00   # Delta(g-2)_tau/2
   23    0.00000000E+00   # electric dipole moment of the electron
   24    0.00000000E+00   # electric dipole moment of the muon
   25    0.00000000E+00   # electric dipole moment of the tau
   26    0.00000000E+00   # Br(mu -> e gamma)
   27    0.00000000E+00   # Br(tau -> e gamma)
   28    0.00000000E+00   # Br(tau -> mu gamma)
   29    0.00000000E+00   # Br(mu -> 3 e)
   30    0.00000000E+00   # Br(tau -> 3 e)
   31    0.00000000E+00   # Br(tau -> 3 mu)
   39    0.00000000E+00   # Delta(rho_parameter)
   40    0.00000000E+00   # BR(Z -> e mu)
   41    0.00000000E+00   # BR(Z -> e tau)
   42    0.00000000E+00   # BR(Z -> mu tau)
