#  ISAJET SUSY parameters in SUSY Les Houches Accord 2 format
#  Created by ISALHA 2.0 Last revision: C. Balazs 21 Apr 2009
Block SPINFO   # Program information
     1   ISASUGRA from ISAJET          # Spectrum Calculator
     2   7.80   29-OCT-2009 12:50:36   # Version number
Block MODSEL   # Model selection
     1     1   # Minimal supergravity (mSUGRA) model               
Block SMINPUTS   # Standard Model inputs
     1     1.27840126E+02   # alpha_em^(-1)
     2     1.16570000E-05   # G_Fermi
     3     1.17200002E-01   # alpha_s(M_Z)
     4     9.11699982E+01   # m_{Z}(pole)
     5     4.19999981E+00   # m_{b}(m_{b})
     6     1.72500000E+02   # m_{top}(pole)
     7     1.77699995E+00   # m_{tau}(pole)
Block MINPAR   # SUSY breaking input parameters
     1     1.54000000E+03   # m_0
     2     1.80000000E+02   # m_{1/2}
     3     1.00000000E+01   # tan(beta)
     4     1.00000000E+00   # sign(mu)
     5     0.00000000E+00   # A_0
Block EXTPAR   # Non-universal SUSY breaking parameters
     0     2.57083406E+16   # Input scale
Block MASS   # Scalar and gaugino mass spectrum
#  PDG code   mass                 particle
        24     8.04229965E+01   #  W^+
        25     1.12542770E+02   #  h^0            
        35     1.55542322E+03   #  H^0            
        36     1.54514050E+03   #  A^0            
        37     1.55749512E+03   #  H^+            
   1000001     1.57032678E+03   #  dnl            
   1000002     1.56828210E+03   #  upl            
   1000003     1.57032678E+03   #  stl            
   1000004     1.56828271E+03   #  chl            
   1000005     1.28259717E+03   #  b1             
   1000006     9.18595276E+02   #  t1             
   1000011     1.54144128E+03   #  el-            
   1000012     1.53977759E+03   #  nuel           
   1000013     1.54144128E+03   #  mul-           
   1000014     1.53977759E+03   #  numl           
   1000015     1.52548840E+03   #  tau1           
   1000016     1.53276428E+03   #  nutl           
   1000021     5.21664795E+02   #  glss           
   1000022     7.16026840E+01   #  z1ss           
   1000023     1.32510666E+02   #  z2ss           
   1000024     1.33103683E+02   #  w1ss           
   1000025    -3.03901031E+02   #  z3ss           
   1000035     3.24200623E+02   #  z4ss           
   1000037     3.23550690E+02   #  w2ss           
   2000001     1.57327539E+03   #  dnr            
   2000002     1.57210925E+03   #  upr            
   2000003     1.57327539E+03   #  str            
   2000004     1.57210974E+03   #  chr            
   2000005     1.55717920E+03   #  b2             
   2000006     1.29320117E+03   #  t2             
   2000011     1.54017737E+03   #  er-            
   2000013     1.54017737E+03   #  mur-           
   2000015     1.53462280E+03   #  tau2           
Block ALPHA   # Effective Higgs mixing parameter
         -1.00512549E-01   # alpha
Block STOPMIX   # stop mixing matrix
  1  1     5.11803590E-02   # O_{11}
  1  2     9.98689413E-01   # O_{12}
  2  1    -9.98689413E-01   # O_{21}
  2  2     5.11803590E-02   # O_{22}
Block SBOTMIX   # sbottom mixing matrix
  1  1     9.99924600E-01   # O_{11}
  1  2     1.22790476E-02   # O_{12}
  2  1    -1.22790476E-02   # O_{21}
  2  2     9.99924600E-01   # O_{22}
Block STAUMIX   # stau mixing matrix
  1  1     2.44225904E-01   # O_{11}
  1  2     9.69718337E-01   # O_{12}
  2  1    -9.69718337E-01   # O_{21}
  2  2     2.44225904E-01   # O_{22}
Block NMIX   # neutralino mixing matrix
  1  1     9.78794336E-01   #
  1  2    -8.25182647E-02   #
  1  3     1.77732497E-01   #
  1  4    -5.96983470E-02   #
  2  1    -1.41902953E-01   #
  2  2    -9.31021571E-01   #
  2  3     2.95050204E-01   #
  2  4    -1.61269784E-01   #
  3  1    -7.29677081E-02   #
  3  2     1.06632665E-01   #
  3  3     6.90425515E-01   #
  3  4     7.11770892E-01   #
  4  1    -1.28457069E-01   #
  4  2     3.39144886E-01   #
  4  3     6.36136293E-01   #
  4  4    -6.81036234E-01   #
Block UMIX   # chargino U mixing matrix
  1  1    -9.03778791E-01   # U_{11}
  1  2     4.27999884E-01   # U_{12}
  2  1    -4.27999884E-01   # U_{21}
  2  2    -9.03778791E-01   # U_{22}
Block VMIX   # chargino V mixing matrix
  1  1    -9.72772002E-01   # V_{11}
  1  2     2.31764257E-01   # V_{12}
  2  1    -2.31764257E-01   # V_{21}
  2  2    -9.72772002E-01   # V_{22}
Block GAUGE Q=  1.07432837E+03   #
     1     3.57504576E-01   # g`
     2     6.52459800E-01   # g_2
     3     1.22039866E+00   # g_3
Block YU Q=  1.07432837E+03   #
  3  3     8.66509080E-01   # y_t
Block YD Q=  1.07432837E+03   #
  3  3     1.35267645E-01   # y_b
Block YE Q=  1.07432837E+03   #
  3  3     1.01641767E-01   # y_tau
Block HMIX Q=  1.07432837E+03   # Higgs mixing parameters
     1     2.92768463E+02   # mu(Q)
     2     1.00000000E+01   # tan(beta)(M_GUT)
     3     2.51168060E+02   # Higgs vev at Q
     4     2.38745925E+06   # m_A^2(Q)
Block MSOFT Q=  1.07432837E+03   # DRbar SUSY breaking parameters
     1     7.51477203E+01   # M_1(Q)          
     2     1.40146942E+02   # M_2(Q)          
     3     4.33656189E+02   # M_3(Q)          
    31     1.53616553E+03   # MeL(Q)          
    32     1.53616553E+03   # MmuL(Q)         
    33     1.52930542E+03   # MtauL(Q)        
    34     1.53811511E+03   # MeR(Q)          
    35     1.53811511E+03   # MmuR(Q)         
    36     1.52436084E+03   # MtauR(Q)        
    41     1.54403528E+03   # MqL1(Q)         
    42     1.54403528E+03   # MqL2(Q)         
    43     1.26318555E+03   # MqL3(Q)         
    44     1.54732349E+03   # MuR(Q)          
    45     1.54732349E+03   # McR(Q)          
    46     9.13706970E+02   # MtR(Q)          
    47     1.54786841E+03   # MdR(Q)          
    48     1.54786841E+03   # MsR(Q)          
    49     1.53573999E+03   # MbR(Q)          
Block AU Q=  1.07432837E+03   #
  1  1    -3.15166382E+02   # A_u
  2  2    -3.15166382E+02   # A_c
  3  3    -3.15166382E+02   # A_t
Block AD Q=  1.07432837E+03   #
  1  1    -4.69696625E+02   # A_d
  2  2    -4.69696625E+02   # A_s
  3  3    -4.69696625E+02   # A_b
Block AE Q=  1.07432837E+03   #
  1  1    -1.07754097E+02   # A_e
  2  2    -1.07754097E+02   # A_mu
  3  3    -1.07754097E+02   # A_tau
#  ISAJET decay tables in SUSY Les Houches accord format
#  Created by ISALHD. Last revision: C. Balazs, 2005 May 25
Block DCINFO                           # Program information
     1   ISASUGRA from ISAJET          # Spectrum Calculator
     2   7.80   29-OCT-2009 12:50:36   # Version number
#         PDG         Width
DECAY         6  1.14680779E+00   # TP    decays
#          BR          NDA       ID1       ID2       ID3       ID4
      3.33333343E-01    3            2        -1         5             # TP     -->  UP     DB     BT          
      3.33333343E-01    3            4        -3         5             # TP     -->  CH     SB     BT          
      1.11111112E-01    3          -11        12         5             # TP     -->  E+     NUE    BT          
      1.11111112E-01    3          -13        14         5             # TP     -->  MU+    NUM    BT          
      1.11111112E-01    3          -15        16         5             # TP     -->  TAU+   NUT    BT          
#         PDG         Width
DECAY   1000021  3.04163288E-04   # GLSS  decays
#          BR          NDA       ID1       ID2       ID3       ID4
      9.33398306E-02    3      1000024         1        -2             # GLSS   -->  W1SS+  DN     UB          
      9.33398306E-02    3     -1000024         2        -1             # GLSS   -->  W1SS-  UP     DB          
      9.33397487E-02    3      1000024         3        -4             # GLSS   -->  W1SS+  ST     CB          
      9.33397487E-02    3     -1000024         4        -3             # GLSS   -->  W1SS-  CH     SB          
      4.38960902E-02    3      1000024         5        -6             # GLSS   -->  W1SS+  BT     TB          
      4.38960902E-02    3     -1000024         6        -5             # GLSS   -->  W1SS-  TP     BB          
      1.16893288E-03    3      1000037         1        -2             # GLSS   -->  W2SS+  DN     UB          
      1.16893288E-03    3     -1000037         2        -1             # GLSS   -->  W2SS-  UP     DB          
      1.16893207E-03    3      1000037         3        -4             # GLSS   -->  W2SS+  ST     CB          
      1.16893207E-03    3     -1000037         4        -3             # GLSS   -->  W2SS-  CH     SB          
      5.16227155E-04    3      1000037         5        -6             # GLSS   -->  W2SS+  BT     TB          
      5.16227155E-04    3     -1000037         6        -5             # GLSS   -->  W2SS-  TP     BB          
      3.90481669E-04    2      1000022        21                       # GLSS   -->  Z1SS   GL                 
      3.48865539E-02    3      1000022         2        -2             # GLSS   -->  Z1SS   UP     UB          
      1.31240748E-02    3      1000022         1        -1             # GLSS   -->  Z1SS   DN     DB          
      1.31240748E-02    3      1000022         3        -3             # GLSS   -->  Z1SS   ST     SB          
      3.48865055E-02    3      1000022         4        -4             # GLSS   -->  Z1SS   CH     CB          
      2.01265439E-02    3      1000022         5        -5             # GLSS   -->  Z1SS   BT     BB          
      2.04033013E-02    3      1000022         6        -6             # GLSS   -->  Z1SS   TP     TB          
      8.74996744E-03    2      1000023        21                       # GLSS   -->  Z2SS   GL                 
      4.93807867E-02    3      1000023         2        -2             # GLSS   -->  Z2SS   UP     UB          
      4.35540974E-02    3      1000023         1        -1             # GLSS   -->  Z2SS   DN     DB          
      4.35540974E-02    3      1000023         3        -3             # GLSS   -->  Z2SS   ST     SB          
      4.93807122E-02    3      1000023         4        -4             # GLSS   -->  Z2SS   CH     CB          
      1.03423975E-01    3      1000023         5        -5             # GLSS   -->  Z2SS   BT     BB          
      6.20848732E-04    3      1000023         6        -6             # GLSS   -->  Z2SS   TP     TB          
      5.20141684E-02    2      1000025        21                       # GLSS   -->  Z3SS   GL                 
      3.21898333E-05    3      1000025         2        -2             # GLSS   -->  Z3SS   UP     UB          
      4.19542339E-05    3      1000025         1        -1             # GLSS   -->  Z3SS   DN     DB          
      4.19542339E-05    3      1000025         3        -3             # GLSS   -->  Z3SS   ST     SB          
      3.21897751E-05    3      1000025         4        -4             # GLSS   -->  Z3SS   CH     CB          
      1.22596044E-03    3      1000025         5        -5             # GLSS   -->  Z3SS   BT     BB          
      3.91955301E-02    2      1000035        21                       # GLSS   -->  Z4SS   GL                 
      5.58831380E-04    3      1000035         2        -2             # GLSS   -->  Z4SS   UP     UB          
      6.85696490E-04    3      1000035         1        -1             # GLSS   -->  Z4SS   DN     DB          
      6.85696490E-04    3      1000035         3        -3             # GLSS   -->  Z4SS   ST     SB          
      5.58830448E-04    3      1000035         4        -4             # GLSS   -->  Z4SS   CH     CB          
      2.46166158E-03    3      1000035         5        -5             # GLSS   -->  Z4SS   BT     BB          
#         PDG         Width
DECAY   1000002  9.24495697E+01   # UPL   decays
#          BR          NDA       ID1       ID2       ID3       ID4
      6.66350767E-04    2      1000022         2                       # UPL    -->  Z1SS   UP                 
      6.44687712E-02    2      1000023         2                       # UPL    -->  Z2SS   UP                 
      5.75333659E-04    2      1000025         2                       # UPL    -->  Z3SS   UP                 
      6.51777675E-03    2      1000035         2                       # UPL    -->  Z4SS   UP                 
      7.87539899E-01    2      1000021         2                       # UPL    -->  GLSS   UP                 
      1.33199990E-01    2      1000024         1                       # UPL    -->  W1SS+  DN                 
      7.03192782E-03    2      1000037         1                       # UPL    -->  W2SS+  DN                 
#         PDG         Width
DECAY   1000001  9.24783325E+01   # DNL   decays
#          BR          NDA       ID1       ID2       ID3       ID4
      4.88008279E-03    2      1000022         1                       # DNL    -->  Z1SS   DN                 
      5.77132069E-02    2      1000023         1                       # DNL    -->  Z2SS   DN                 
      9.53619077E-04    2      1000025         1                       # DNL    -->  Z3SS   DN                 
      8.61733314E-03    2      1000035         1                       # DNL    -->  Z4SS   DN                 
      7.88731098E-01    2      1000021         1                       # DNL    -->  GLSS   DN                 
      1.15094207E-01    2     -1000024         2                       # DNL    -->  W1SS-  UP                 
      2.40104310E-02    2     -1000037         2                       # DNL    -->  W2SS-  UP                 
#         PDG         Width
DECAY   1000003  9.24783173E+01   # STL   decays
#          BR          NDA       ID1       ID2       ID3       ID4
      4.88008326E-03    2      1000022         3                       # STL    -->  Z1SS   ST                 
      5.77132180E-02    2      1000023         3                       # STL    -->  Z2SS   ST                 
      9.53619252E-04    2      1000025         3                       # STL    -->  Z3SS   ST                 
      8.61733500E-03    2      1000035         3                       # STL    -->  Z4SS   ST                 
      7.88731217E-01    2      1000021         3                       # STL    -->  GLSS   ST                 
      1.15094073E-01    2     -1000024         4                       # STL    -->  W1SS-  CH                 
      2.40103994E-02    2     -1000037         4                       # STL    -->  W2SS-  CH                 
#         PDG         Width
DECAY   1000004  9.24494705E+01   # CHL   decays
#          BR          NDA       ID1       ID2       ID3       ID4
      6.66350767E-04    2      1000022         4                       # CHL    -->  Z1SS   CH                 
      6.44687787E-02    2      1000023         4                       # CHL    -->  Z2SS   CH                 
      5.75333601E-04    2      1000025         4                       # CHL    -->  Z3SS   CH                 
      6.51777722E-03    2      1000035         4                       # CHL    -->  Z4SS   CH                 
      7.87539661E-01    2      1000021         4                       # CHL    -->  GLSS   CH                 
      1.33200198E-01    2      1000024         3                       # CHL    -->  W1SS+  ST                 
      7.03193760E-03    2      1000037         3                       # CHL    -->  W2SS+  ST                 
#         PDG         Width
DECAY   1000005  8.59484100E+01   # BT1   decays
#          BR          NDA       ID1       ID2       ID3       ID4
      4.50759381E-03    2      1000022         5                       # BT1    -->  Z1SS   BT                 
      5.09359613E-02    2      1000023         5                       # BT1    -->  Z2SS   BT                 
      3.15908203E-03    2      1000025         5                       # BT1    -->  Z3SS   BT                 
      9.15373024E-03    2      1000035         5                       # BT1    -->  Z4SS   BT                 
      6.22385919E-01    2      1000021         5                       # BT1    -->  GLSS   BT                 
      1.06021866E-01    2     -1000024         6                       # BT1    -->  W1SS-  TP                 
      1.99359804E-01    2     -1000037         6                       # BT1    -->  W2SS-  TP                 
      4.47606528E-03    2          -24   1000006                       # BT1    -->  W-     TP1                
#         PDG         Width
DECAY   1000006  4.48616180E+01   # TP1   decays
#          BR          NDA       ID1       ID2       ID3       ID4
      5.10229945E-01    2      1000021         6                       # TP1    -->  GLSS   TP                 
      4.17878330E-02    2      1000022         6                       # TP1    -->  Z1SS   TP                 
      1.01329377E-02    2      1000023         6                       # TP1    -->  Z2SS   TP                 
      1.12917952E-01    2      1000025         6                       # TP1    -->  Z3SS   TP                 
      9.38237682E-02    2      1000035         6                       # TP1    -->  Z4SS   TP                 
      2.06114333E-02    2      1000024         5                       # TP1    -->  W1SS+  BT                 
      2.10496113E-01    2      1000037         5                       # TP1    -->  W2SS+  BT                 
#         PDG         Width
DECAY   2000002  7.65887222E+01   # UPR   decays
#          BR          NDA       ID1       ID2       ID3       ID4
      4.42703888E-02    2      1000022         2                       # UPR    -->  Z1SS   UP                 
      9.21136874E-04    2      1000023         2                       # UPR    -->  Z2SS   UP                 
      2.28937133E-04    2      1000025         2                       # UPR    -->  Z3SS   UP                 
      7.01945566E-04    2      1000035         2                       # UPR    -->  Z4SS   UP                 
      9.53877628E-01    2      1000021         2                       # UPR    -->  GLSS   UP                 
#         PDG         Width
DECAY   2000001  7.40157242E+01   # DNR   decays
#          BR          NDA       ID1       ID2       ID3       ID4
      1.14609068E-02    2      1000022         1                       # DNR    -->  Z1SS   DN                 
      2.38471330E-04    2      1000023         1                       # DNR    -->  Z2SS   DN                 
      5.92746583E-05    2      1000025         1                       # DNR    -->  Z3SS   DN                 
      1.81745447E-04    2      1000035         1                       # DNR    -->  Z4SS   DN                 
      9.88059640E-01    2      1000021         1                       # DNR    -->  GLSS   DN                 
#         PDG         Width
DECAY   2000003  7.40157242E+01   # STR   decays
#          BR          NDA       ID1       ID2       ID3       ID4
      1.14609068E-02    2      1000022         3                       # STR    -->  Z1SS   ST                 
      2.38471330E-04    2      1000023         3                       # STR    -->  Z2SS   ST                 
      5.92746583E-05    2      1000025         3                       # STR    -->  Z3SS   ST                 
      1.81745447E-04    2      1000035         3                       # STR    -->  Z4SS   ST                 
      9.88059640E-01    2      1000021         3                       # STR    -->  GLSS   ST                 
#         PDG         Width
DECAY   2000004  7.65886230E+01   # CHR   decays
#          BR          NDA       ID1       ID2       ID3       ID4
      4.42704037E-02    2      1000022         4                       # CHR    -->  Z1SS   CH                 
      9.21137049E-04    2      1000023         4                       # CHR    -->  Z2SS   CH                 
      2.28937191E-04    2      1000025         4                       # CHR    -->  Z3SS   CH                 
      7.01945741E-04    2      1000035         4                       # CHR    -->  Z4SS   CH                 
      9.53877568E-01    2      1000021         4                       # CHR    -->  GLSS   CH                 
#         PDG         Width
DECAY   2000005  7.40738525E+01   # BT2   decays
#          BR          NDA       ID1       ID2       ID3       ID4
      1.15107009E-02    2      1000022         5                       # BT2    -->  Z1SS   BT                 
      7.68420461E-04    2      1000023         5                       # BT2    -->  Z2SS   BT                 
      3.63069843E-03    2      1000025         5                       # BT2    -->  Z3SS   BT                 
      3.28773702E-03    2      1000035         5                       # BT2    -->  Z4SS   BT                 
      9.73070979E-01    2      1000021         5                       # BT2    -->  GLSS   BT                 
      1.08425657E-03    2     -1000024         6                       # BT2    -->  W1SS-  TP                 
      6.20357692E-03    2     -1000037         6                       # BT2    -->  W2SS-  TP                 
      3.53990208E-06    2          -24   1000006                       # BT2    -->  W-     TP1                
      1.28646192E-04    2          -24   2000006                       # BT2    -->  W-     TP2                
      7.05996354E-05    2           23   1000005                       # BT2    -->  Z0     BT1                
      2.40937006E-04    2           25   1000005                       # BT2    -->  HL0    BT1                
#         PDG         Width
DECAY   2000006  8.39080887E+01   # TP2   decays
#          BR          NDA       ID1       ID2       ID3       ID4
      6.05610430E-01    2      1000021         6                       # TP2    -->  GLSS   TP                 
      1.17093578E-01    2      1000024         5                       # TP2    -->  W1SS+  BT                 
      1.42438570E-02    2      1000037         5                       # TP2    -->  W2SS+  BT                 
      2.45729857E-03    2           23   1000006                       # TP2    -->  Z0     TP1                
      4.97738877E-03    2           25   1000006                       # TP2    -->  HL0    TP1                
      1.00434059E-03    2      1000022         6                       # TP2    -->  Z1SS   TP                 
      5.88274747E-02    2      1000023         6                       # TP2    -->  Z2SS   TP                 
      9.64677036E-02    2      1000025         6                       # TP2    -->  Z3SS   TP                 
      9.93179902E-02    2      1000035         6                       # TP2    -->  Z4SS   TP                 
#         PDG         Width
DECAY   1000011  2.09172287E+01   # EL-   decays
#          BR          NDA       ID1       ID2       ID3       ID4
      6.40671924E-02    2      1000022        11                       # EL-    -->  Z1SS   E-                 
      3.11162323E-01    2      1000023        11                       # EL-    -->  Z2SS   E-                 
      1.26826356E-03    2      1000025        11                       # EL-    -->  Z3SS   E-                 
      2.04343852E-02    2      1000035        11                       # EL-    -->  Z4SS   E-                 
      4.99215931E-01    2     -1000024        12                       # EL-    -->  W1SS-  NUE                
      1.03851981E-01    2     -1000037        12                       # EL-    -->  W2SS-  NUE                
#         PDG         Width
DECAY   1000013  2.09172287E+01   # MUL-  decays
#          BR          NDA       ID1       ID2       ID3       ID4
      6.40671924E-02    2      1000022        13                       # MUL-   -->  Z1SS   MU-                
      3.11162323E-01    2      1000023        13                       # MUL-   -->  Z2SS   MU-                
      1.26826356E-03    2      1000025        13                       # MUL-   -->  Z3SS   MU-                
      2.04343852E-02    2      1000035        13                       # MUL-   -->  Z4SS   MU-                
      4.99215931E-01    2     -1000024        14                       # MUL-   -->  W1SS-  NUM                
      1.03851981E-01    2     -1000037        14                       # MUL-   -->  W2SS-  NUM                
#         PDG         Width
DECAY   1000015  9.11542702E+00   # TAU1- decays
#          BR          NDA       ID1       ID2       ID3       ID4
      7.81535447E-01    2      1000022        15                       # TAU1-  -->  Z1SS   TAU-               
      7.97365978E-02    2      1000023        15                       # TAU1-  -->  Z2SS   TAU-               
      1.28059378E-02    2      1000025        15                       # TAU1-  -->  Z3SS   TAU-               
      1.01413103E-02    2      1000035        15                       # TAU1-  -->  Z4SS   TAU-               
      1.14191890E-01    2     -1000024        16                       # TAU1-  -->  W1SS-  NUT                
      1.58879254E-03    2     -1000037        16                       # TAU1-  -->  W2SS-  NUT                
#         PDG         Width
DECAY   1000012  2.09740353E+01   # NUEL  decays
#          BR          NDA       ID1       ID2       ID3       ID4
      1.18459336E-01    2      1000022        12                       # NUEL   -->  Z1SS   NUE                
      2.21543327E-01    2      1000023        12                       # NUEL   -->  Z2SS   NUE                
      6.14550523E-03    2      1000025        12                       # NUEL   -->  Z3SS   NUE                
      4.73844185E-02    2      1000035        12                       # NUEL   -->  Z4SS   NUE                
      5.76136470E-01    2      1000024        11                       # NUEL   -->  W1SS+  E-                 
      3.03310174E-02    2      1000037        11                       # NUEL   -->  W2SS+  E-                 
#         PDG         Width
DECAY   1000014  2.09740353E+01   # NUML  decays
#          BR          NDA       ID1       ID2       ID3       ID4
      1.18459336E-01    2      1000022        14                       # NUML   -->  Z1SS   NUM                
      2.21543327E-01    2      1000023        14                       # NUML   -->  Z2SS   NUM                
      6.14550523E-03    2      1000025        14                       # NUML   -->  Z3SS   NUM                
      4.73844185E-02    2      1000035        14                       # NUML   -->  Z4SS   NUM                
      5.76136470E-01    2      1000024        13                       # NUML   -->  W1SS+  MU-                
      3.03310174E-02    2      1000037        13                       # NUML   -->  W2SS+  MU-                
#         PDG         Width
DECAY   1000016  2.11782532E+01   # NUTL  decays
#          BR          NDA       ID1       ID2       ID3       ID4
      1.16778068E-01    2      1000022        16                       # NUTL   -->  Z1SS   NUT                
      2.18377814E-01    2      1000023        16                       # NUTL   -->  Z2SS   NUT                
      6.05402002E-03    2      1000025        16                       # NUTL   -->  Z3SS   NUT                
      4.66740169E-02    2      1000035        16                       # NUTL   -->  Z4SS   NUT                
      5.70678771E-01    2      1000024        15                       # NUTL   -->  W1SS+  TAU-               
      4.14373986E-02    2      1000037        15                       # NUTL   -->  W2SS+  TAU-               
      1.64864754E-11    3      1000015        16       -15             # NUTL   -->  TAU1-  NUT    TAU+        
      1.64864754E-11    3      1000015        12       -11             # NUTL   -->  TAU1-  NUE    E+          
      1.64864754E-11    3      1000015        14       -13             # NUTL   -->  TAU1-  NUM    MU+         
      4.94594296E-11    3      1000015         2        -1             # NUTL   -->  TAU1-  UP     DB          
      4.94594296E-11    3      1000015         4        -3             # NUTL   -->  TAU1-  CH     SB          
#         PDG         Width
DECAY   2000011  7.78462982E+00   # ER-   decays
#          BR          NDA       ID1       ID2       ID3       ID4
      9.59920168E-01    2      1000022        11                       # ER-    -->  Z1SS   E-                 
      1.99646242E-02    2      1000023        11                       # ER-    -->  Z2SS   E-                 
      4.94880090E-03    2      1000025        11                       # ER-    -->  Z3SS   E-                 
      1.51664205E-02    2      1000035        11                       # ER-    -->  Z4SS   E-                 
#         PDG         Width
DECAY   2000013  7.78462982E+00   # MUR-  decays
#          BR          NDA       ID1       ID2       ID3       ID4
      9.59920168E-01    2      1000022        13                       # MUR-   -->  Z1SS   MU-                
      1.99646242E-02    2      1000023        13                       # MUR-   -->  Z2SS   MU-                
      4.94880090E-03    2      1000025        13                       # MUR-   -->  Z3SS   MU-                
      1.51664205E-02    2      1000035        13                       # MUR-   -->  Z4SS   MU-                
#         PDG         Width
DECAY   2000015  2.03177967E+01   # TAU2- decays
#          BR          NDA       ID1       ID2       ID3       ID4
      8.03775415E-02    2      1000022        15                       # TAU2-  -->  Z1SS   TAU-               
      2.93272942E-01    2      1000023        15                       # TAU2-  -->  Z2SS   TAU-               
      1.16123017E-02    2      1000025        15                       # TAU2-  -->  Z3SS   TAU-               
      3.40816379E-02    2      1000035        15                       # TAU2-  -->  Z4SS   TAU-               
      4.62969631E-01    2     -1000024        16                       # TAU2-  -->  W1SS-  NUT                
      1.17685951E-01    2     -1000037        16                       # TAU2-  -->  W2SS-  NUT                
#         PDG         Width
DECAY   1000023  3.61082152E-06   # Z2SS  decays
#          BR          NDA       ID1       ID2       ID3       ID4
      3.21626756E-03    2      1000022        22                       # Z2SS   -->  Z1SS   GM                 
      1.20058909E-01    3      1000022         2        -2             # Z2SS   -->  Z1SS   UP     UB          
      1.56449437E-01    3      1000022         1        -1             # Z2SS   -->  Z1SS   DN     DB          
      1.56449437E-01    3      1000022         3        -3             # Z2SS   -->  Z1SS   ST     SB          
      1.20058909E-01    3      1000022         4        -4             # Z2SS   -->  Z1SS   CH     CB          
      1.49932534E-01    3      1000022         5        -5             # Z2SS   -->  Z1SS   BT     BB          
      3.25401723E-02    3      1000022        11       -11             # Z2SS   -->  Z1SS   E-     E+          
      3.25401723E-02    3      1000022        13       -13             # Z2SS   -->  Z1SS   MU-    MU+         
      3.23800482E-02    3      1000022        15       -15             # Z2SS   -->  Z1SS   TAU-   TAU+        
      6.54684752E-02    3      1000022        12       -12             # Z2SS   -->  Z1SS   NUE    ANUE        
      6.54684752E-02    3      1000022        14       -14             # Z2SS   -->  Z1SS   NUM    ANUM        
      6.54371828E-02    3      1000022        16       -16             # Z2SS   -->  Z1SS   NUT    ANUT        
#         PDG         Width
DECAY   1000025  1.46706820E+00   # Z3SS  decays
#          BR          NDA       ID1       ID2       ID3       ID4
      4.09942196E-08    2      1000022        22                       # Z3SS   -->  Z1SS   GM                 
      9.83713562E-07    2      1000023        22                       # Z3SS   -->  Z2SS   GM                 
      3.08679104E-01    2      1000024       -24                       # Z3SS   -->  W1SS+  W-                 
      3.08679104E-01    2     -1000024        24                       # Z3SS   -->  W1SS-  W+                 
      1.22383915E-01    2      1000022        23                       # Z3SS   -->  Z1SS   Z0                 
      2.19429582E-01    2      1000023        23                       # Z3SS   -->  Z2SS   Z0                 
      2.95751895E-10    3      1000022         2        -2             # Z3SS   -->  Z1SS   UP     UB          
      2.06284795E-10    3      1000022         1        -1             # Z3SS   -->  Z1SS   DN     DB          
      2.06284795E-10    3      1000022         3        -3             # Z3SS   -->  Z1SS   ST     SB          
      2.95751507E-10    3      1000022         4        -4             # Z3SS   -->  Z1SS   CH     CB          
      1.00934301E-08    3      1000022         5        -5             # Z3SS   -->  Z1SS   BT     BB          
      5.77018655E-10    3      1000022        11       -11             # Z3SS   -->  Z1SS   E-     E+          
      5.77018655E-10    3      1000022        13       -13             # Z3SS   -->  Z1SS   MU-    MU+         
      6.70258915E-09    3      1000022        15       -15             # Z3SS   -->  Z1SS   TAU-   TAU+        
      5.72595860E-10    3      1000022        12       -12             # Z3SS   -->  Z1SS   NUE    ANUE        
      5.72595860E-10    3      1000022        14       -14             # Z3SS   -->  Z1SS   NUM    ANUM        
      5.83360027E-10    3      1000022        16       -16             # Z3SS   -->  Z1SS   NUT    ANUT        
      4.94663310E-10    3      1000023         2        -2             # Z3SS   -->  Z2SS   UP     UB          
      7.25796867E-10    3      1000023         1        -1             # Z3SS   -->  Z2SS   DN     DB          
      7.25796867E-10    3      1000023         3        -3             # Z3SS   -->  Z2SS   ST     SB          
      4.94662478E-10    3      1000023         4        -4             # Z3SS   -->  Z2SS   CH     CB          
      1.71097962E-08    3      1000023         5        -5             # Z3SS   -->  Z2SS   BT     BB          
      1.03184461E-10    3      1000023        11       -11             # Z3SS   -->  Z2SS   E-     E+          
      1.03184461E-10    3      1000023        13       -13             # Z3SS   -->  Z2SS   MU-    MU+         
      2.16042406E-09    3      1000023        15       -15             # Z3SS   -->  Z2SS   TAU-   TAU+        
      3.48223533E-10    3      1000023        12       -12             # Z3SS   -->  Z2SS   NUE    ANUE        
      3.48223533E-10    3      1000023        14       -14             # Z3SS   -->  Z2SS   NUM    ANUM        
      3.54793944E-10    3      1000023        16       -16             # Z3SS   -->  Z2SS   NUT    ANUT        
      2.55500395E-02    2      1000022        25                       # Z3SS   -->  Z1SS   HL0                
      1.52772460E-02    2      1000023        25                       # Z3SS   -->  Z2SS   HL0                
#         PDG         Width
DECAY   1000035  1.75865185E+00   # Z4SS  decays
#          BR          NDA       ID1       ID2       ID3       ID4
      1.97380956E-08    2      1000022        22                       # Z4SS   -->  Z1SS   GM                 
      3.55439056E-07    2      1000023        22                       # Z4SS   -->  Z2SS   GM                 
      8.80765771E-09    2      1000025        22                       # Z4SS   -->  Z3SS   GM                 
      3.58435214E-01    2      1000024       -24                       # Z4SS   -->  W1SS+  W-                 
      3.58435214E-01    2     -1000024        24                       # Z4SS   -->  W1SS-  W+                 
      3.12247518E-02    2      1000022        23                       # Z4SS   -->  Z1SS   Z0                 
      2.69015320E-02    2      1000023        23                       # Z4SS   -->  Z2SS   Z0                 
      2.45107734E-09    3      1000022         2        -2             # Z4SS   -->  Z1SS   UP     UB          
      4.16254808E-09    3      1000022         1        -1             # Z4SS   -->  Z1SS   DN     DB          
      4.16254808E-09    3      1000022         3        -3             # Z4SS   -->  Z1SS   ST     SB          
      2.45107445E-09    3      1000022         4        -4             # Z4SS   -->  Z1SS   CH     CB          
      1.54724216E-08    3      1000022         5        -5             # Z4SS   -->  Z1SS   BT     BB          
      6.13350482E-09    3      1000022        11       -11             # Z4SS   -->  Z1SS   E-     E+          
      6.13350482E-09    3      1000022        13       -13             # Z4SS   -->  Z1SS   MU-    MU+         
      1.18826131E-08    3      1000022        15       -15             # Z4SS   -->  Z1SS   TAU-   TAU+        
      1.04467794E-08    3      1000022        12       -12             # Z4SS   -->  Z1SS   NUE    ANUE        
      1.04467794E-08    3      1000022        14       -14             # Z4SS   -->  Z1SS   NUM    ANUM        
      1.06430873E-08    3      1000022        16       -16             # Z4SS   -->  Z1SS   NUT    ANUT        
      1.93002414E-08    3      1000023         2        -2             # Z4SS   -->  Z2SS   UP     UB          
      2.26485621E-08    3      1000023         1        -1             # Z4SS   -->  Z2SS   DN     DB          
      2.26485621E-08    3      1000023         3        -3             # Z4SS   -->  Z2SS   ST     SB          
      1.93002112E-08    3      1000023         4        -4             # Z4SS   -->  Z2SS   CH     CB          
      6.58251338E-08    3      1000023         5        -5             # Z4SS   -->  Z2SS   BT     BB          
      5.58756064E-09    3      1000023        11       -11             # Z4SS   -->  Z2SS   E-     E+          
      5.58756064E-09    3      1000023        13       -13             # Z4SS   -->  Z2SS   MU-    MU+         
      7.46310125E-09    3      1000023        15       -15             # Z4SS   -->  Z2SS   TAU-   TAU+        
      9.27712218E-09    3      1000023        12       -12             # Z4SS   -->  Z2SS   NUE    ANUE        
      9.27712218E-09    3      1000023        14       -14             # Z4SS   -->  Z2SS   NUM    ANUM        
      9.45220435E-09    3      1000023        16       -16             # Z4SS   -->  Z2SS   NUT    ANUT        
      1.98450081E-07    3      1000025         2        -2             # Z4SS   -->  Z3SS   UP     UB          
      2.56032934E-07    3      1000025         1        -1             # Z4SS   -->  Z3SS   DN     DB          
      2.56032934E-07    3      1000025         3        -3             # Z4SS   -->  Z3SS   ST     SB          
      1.98450081E-07    3      1000025         4        -4             # Z4SS   -->  Z3SS   CH     CB          
      1.28828290E-07    3      1000025         5        -5             # Z4SS   -->  Z3SS   BT     BB          
      5.80744626E-08    3      1000025        11       -11             # Z4SS   -->  Z3SS   E-     E+          
      5.80744626E-08    3      1000025        13       -13             # Z4SS   -->  Z3SS   MU-    MU+         
      5.22836814E-08    3      1000025        15       -15             # Z4SS   -->  Z3SS   TAU-   TAU+        
      1.15487843E-07    3      1000025        12       -12             # Z4SS   -->  Z3SS   NUE    ANUE        
      1.15487843E-07    3      1000025        14       -14             # Z4SS   -->  Z3SS   NUM    ANUM        
      1.15487452E-07    3      1000025        16       -16             # Z4SS   -->  Z3SS   NUT    ANUT        
      7.96451718E-02    2      1000022        25                       # Z4SS   -->  Z1SS   HL0                
      1.45355865E-01    2      1000023        25                       # Z4SS   -->  Z2SS   HL0                
#         PDG         Width
DECAY   1000024  4.52982385E-05   # W1SS+ decays
#          BR          NDA       ID1       ID2       ID3       ID4
      3.33992660E-01    3      1000022         2        -1             # W1SS+  -->  Z1SS   UP     DB          
      3.33992660E-01    3      1000022         4        -3             # W1SS+  -->  Z1SS   CH     SB          
      1.10671237E-01    3      1000022       -11        12             # W1SS+  -->  Z1SS   E+     NUE         
      1.10671237E-01    3      1000022       -13        14             # W1SS+  -->  Z1SS   MU+    NUM         
      1.10672243E-01    3      1000022       -15        16             # W1SS+  -->  Z1SS   TAU+   NUT         
      8.19435741E-10    3      1000023       -11        12             # W1SS+  -->  Z2SS   E+     NUE         
      8.19435741E-10    3      1000023       -13        14             # W1SS+  -->  Z2SS   MU+    NUM         
#         PDG         Width
DECAY   1000037  1.51157618E+00   # W2SS+ decays
#          BR          NDA       ID1       ID2       ID3       ID4
      5.75228931E-09    3      1000022         2        -1             # W2SS+  -->  Z1SS   UP     DB          
      5.75228754E-09    3      1000022         4        -3             # W2SS+  -->  Z1SS   CH     SB          
      1.07659979E-08    3      1000022       -11        12             # W2SS+  -->  Z1SS   E+     NUE         
      1.07659979E-08    3      1000022       -13        14             # W2SS+  -->  Z1SS   MU+    NUM         
      1.76187935E-08    3      1000022       -15        16             # W2SS+  -->  Z1SS   TAU+   NUT         
      7.81296194E-02    2      1000022        24                       # W2SS+  -->  Z1SS   W+                 
      2.15677840E-08    3      1000023         2        -1             # W2SS+  -->  Z2SS   UP     DB          
      2.15677805E-08    3      1000023         4        -3             # W2SS+  -->  Z2SS   CH     SB          
      9.39021216E-09    3      1000023       -11        12             # W2SS+  -->  Z2SS   E+     NUE         
      9.39021216E-09    3      1000023       -13        14             # W2SS+  -->  Z2SS   MU+    NUM         
      1.29259083E-08    3      1000023       -15        16             # W2SS+  -->  Z2SS   TAU+   NUT         
      3.79356116E-01    2      1000023        24                       # W2SS+  -->  Z2SS   W+                 
      7.16382544E-07    3      1000025         2        -1             # W2SS+  -->  Z3SS   UP     DB          
      7.16382544E-07    3      1000025         4        -3             # W2SS+  -->  Z3SS   CH     SB          
      2.38769928E-07    3      1000025       -11        12             # W2SS+  -->  Z3SS   E+     NUE         
      2.38769928E-07    3      1000025       -13        14             # W2SS+  -->  Z3SS   MU+    NUM         
      2.38786896E-07    3      1000025       -15        16             # W2SS+  -->  Z3SS   TAU+   NUT         
      3.17457855E-01    2      1000024        23                       # W2SS+  -->  W1SS+  Z0                 
      1.71537522E-08    3      1000024         1        -1             # W2SS+  -->  W1SS+  DN     DB          
      1.71537256E-08    3      1000024         3        -3             # W2SS+  -->  W1SS+  ST     SB          
      5.02272179E-08    3      1000024         2        -2             # W2SS+  -->  W1SS+  UP     UB          
      5.02272179E-08    3      1000024         4        -4             # W2SS+  -->  W1SS+  CH     CB          
      1.80651778E-08    3      1000024        12       -12             # W2SS+  -->  W1SS+  NUE    ANUE        
      1.80651778E-08    3      1000024        14       -14             # W2SS+  -->  W1SS+  NUM    ANUM        
      1.88521287E-08    3      1000024        16       -16             # W2SS+  -->  W1SS+  NUT    ANUT        
      6.16406837E-09    3      1000024        11       -11             # W2SS+  -->  W1SS+  E-     E+          
      6.16406837E-09    3      1000024        13       -13             # W2SS+  -->  W1SS+  MU-    MU+         
      6.28048014E-09    3      1000024        15       -15             # W2SS+  -->  W1SS+  TAU-   TAU+        
      2.25054100E-01    2      1000024        25                       # W2SS+  -->  W1SS+  HL0                
#         PDG         Width
DECAY        25  3.95390624E-03   # HL0   decays
#          BR          NDA       ID1       ID2       ID3       ID4
      4.91907137E-09    2           11       -11                       # HL0    -->  E-     E+                 
      2.07690988E-04    2           13       -13                       # HL0    -->  MU-    MU+                
      5.93972281E-02    2           15       -15                       # HL0    -->  TAU-   TAU+               
      6.17596652E-06    2            1        -1                       # HL0    -->  DN     DB                 
      2.49539968E-03    2            3        -3                       # HL0    -->  ST     SB                 
      8.20548058E-01    2            5        -5                       # HL0    -->  BT     BB                 
      1.94284598E-06    2            2        -2                       # HL0    -->  UP     UB                 
      3.66957076E-02    2            4        -4                       # HL0    -->  CH     CB                 
      1.78427191E-03    2           22        22                       # HL0    -->  GM     GM                 
      3.74430753E-02    2           21        21                       # HL0    -->  GL     GL                 
      2.16460670E-03    3           24        11       -12             # HL0    -->  W+     E-     ANUE        
      2.16460670E-03    3           24        13       -14             # HL0    -->  W+     MU-    ANUM        
      2.16460670E-03    3           24        15       -16             # HL0    -->  W+     TAU-   ANUT        
      6.49381988E-03    3           24        -2         1             # HL0    -->  W+     UB     DN          
      6.49381988E-03    3           24        -4         3             # HL0    -->  W+     CB     ST          
      2.16460670E-03    3          -24       -11        12             # HL0    -->  W-     E+     NUE         
      2.16460670E-03    3          -24       -13        14             # HL0    -->  W-     MU+    NUM         
      2.16460670E-03    3          -24       -15        16             # HL0    -->  W-     TAU+   NUT         
      6.49381988E-03    3          -24         2        -1             # HL0    -->  W-     UP     DB          
      6.49381988E-03    3          -24         4        -3             # HL0    -->  W-     CH     SB          
      1.68068625E-04    3           23        12       -12             # HL0    -->  Z0     NUE    ANUE        
      1.68068625E-04    3           23        14       -14             # HL0    -->  Z0     NUM    ANUM        
      1.68068625E-04    3           23        16       -16             # HL0    -->  Z0     NUT    ANUT        
      8.45872491E-05    3           23        11       -11             # HL0    -->  Z0     E-     E+          
      8.45872491E-05    3           23        13       -13             # HL0    -->  Z0     MU-    MU+         
      8.45872491E-05    3           23        15       -15             # HL0    -->  Z0     TAU-   TAU+        
      2.89788761E-04    3           23         2        -2             # HL0    -->  Z0     UP     UB          
      2.89788761E-04    3           23         4        -4             # HL0    -->  Z0     CH     CB          
      3.73319315E-04    3           23         1        -1             # HL0    -->  Z0     DN     DB          
      3.73319315E-04    3           23         3        -3             # HL0    -->  Z0     ST     SB          
      3.73319315E-04    3           23         5        -5             # HL0    -->  Z0     BT     BB          
#         PDG         Width
DECAY        35  2.26398201E+01   # HH0   decays
#          BR          NDA       ID1       ID2       ID3       ID4
      1.16733345E-09    2           11       -11                       # HH0    -->  E-     E+                 
      4.92869258E-05    2           13       -13                       # HH0    -->  MU-    MU+                
      1.41164204E-02    2           15       -15                       # HH0    -->  TAU-   TAU+               
      1.42505394E-06    2            1        -1                       # HH0    -->  DN     DB                 
      5.75793907E-04    2            3        -3                       # HH0    -->  ST     SB                 
      8.02098513E-02    2            5        -5                       # HH0    -->  BT     BB                 
      4.63777766E-11    2            2        -2                       # HH0    -->  UP     UB                 
      6.21148104E-07    2            4        -4                       # HH0    -->  CH     CB                 
      3.09572686E-02    2            6        -6                       # HH0    -->  TP     TB                 
      2.61997627E-07    2           22        22                       # HH0    -->  GM     GM                 
      1.25857023E-05    2           21        21                       # HH0    -->  GL     GL                 
      3.79018529E-05    2           24       -24                       # HH0    -->  W+     W-                 
      1.93657870E-05    2           23        23                       # HH0    -->  Z0     Z0                 
      6.41710032E-03    2      1000022   1000022                       # HH0    -->  Z1SS   Z1SS               
      2.84425858E-02    2      1000022   1000023                       # HH0    -->  Z1SS   Z2SS               
      5.38412258E-02    2      1000022   1000025                       # HH0    -->  Z1SS   Z3SS               
      2.02798583E-02    2      1000022   1000035                       # HH0    -->  Z1SS   Z4SS               
      3.09812613E-02    2      1000023   1000023                       # HH0    -->  Z2SS   Z2SS               
      1.00152403E-01    2      1000023   1000025                       # HH0    -->  Z2SS   Z3SS               
      3.39405164E-02    2      1000023   1000035                       # HH0    -->  Z2SS   Z4SS               
      5.58612961E-03    2      1000025   1000025                       # HH0    -->  Z3SS   Z3SS               
      4.09727991E-02    2      1000025   1000035                       # HH0    -->  Z3SS   Z4SS               
      2.32466571E-02    2      1000035   1000035                       # HH0    -->  Z4SS   Z4SS               
      8.55335891E-02    2      1000024  -1000024                       # HH0    -->  W1SS+  W1SS-              
      1.20757204E-02    2      1000037  -1000037                       # HH0    -->  W2SS+  W2SS-              
      2.16207057E-01    2      1000024  -1000037                       # HH0    -->  W1SS+  W2SS-              
      2.16207057E-01    2     -1000024   1000037                       # HH0    -->  W1SS-  W2SS+              
      1.35264228E-04    2           25        25                       # HH0    -->  HL0    HL0                
#         PDG         Width
DECAY        36  2.24822464E+01   # HA0   decays
#          BR          NDA       ID1       ID2       ID3       ID4
      1.16794185E-09    2           11       -11                       # HA0    -->  E-     E+                 
      4.93126099E-05    2           13       -13                       # HA0    -->  MU-    MU+                
      1.41238514E-02    2           15       -15                       # HA0    -->  TAU-   TAU+               
      1.42586885E-06    2            1        -1                       # HA0    -->  DN     DB                 
      5.76123188E-04    2            3        -3                       # HA0    -->  ST     SB                 
      8.02571401E-02    2            5        -5                       # HA0    -->  BT     BB                 
      4.56232274E-11    2            2        -2                       # HA0    -->  UP     UB                 
      6.11500866E-07    2            4        -4                       # HA0    -->  CH     CB                 
      3.17289829E-02    2            6        -6                       # HA0    -->  TP     TB                 
      8.30007878E-07    2           22        22                       # HA0    -->  GM     GM                 
      2.03719082E-05    2           21        21                       # HA0    -->  GL     GL                 
      7.41082476E-03    2      1000022   1000022                       # HA0    -->  Z1SS   Z1SS               
      3.46563496E-02    2      1000022   1000023                       # HA0    -->  Z1SS   Z2SS               
      3.29920910E-02    2      1000022   1000025                       # HA0    -->  Z1SS   Z3SS               
      3.47797945E-02    2      1000022   1000035                       # HA0    -->  Z1SS   Z4SS               
      3.97656150E-02    2      1000023   1000023                       # HA0    -->  Z2SS   Z2SS               
      5.85198663E-02    2      1000023   1000025                       # HA0    -->  Z2SS   Z3SS               
      5.98704480E-02    2      1000023   1000035                       # HA0    -->  Z2SS   Z4SS               
      4.34866501E-03    2      1000025   1000025                       # HA0    -->  Z3SS   Z3SS               
      2.78507732E-02    2      1000025   1000035                       # HA0    -->  Z3SS   Z4SS               
      4.32973355E-02    2      1000035   1000035                       # HA0    -->  Z4SS   Z4SS               
      1.07907146E-01    2      1000024  -1000024                       # HA0    -->  W1SS+  W1SS-              
      3.27989757E-02    2      1000037  -1000037                       # HA0    -->  W2SS+  W2SS-              
      1.94503009E-01    2      1000024  -1000037                       # HA0    -->  W1SS+  W2SS-              
      1.94503009E-01    2     -1000024   1000037                       # HA0    -->  W1SS-  W2SS+              
      3.75116178E-05    2           25        23                       # HA0    -->  HL0    Z0                 
#         PDG         Width
DECAY        37  2.23614025E+01   # H+    decays
#          BR          NDA       ID1       ID2       ID3       ID4
      1.18364274E-09    2           12       -11                       # H+     -->  NUE    E+                 
      4.99755297E-05    2           14       -13                       # H+     -->  NUM    MU+                
      1.43137202E-02    2           16       -15                       # H+     -->  NUT    TAU+               
      1.33285948E-06    2            2        -1                       # H+     -->  UP     DB                 
      5.39095723E-04    2            4        -3                       # H+     -->  CH     SB                 
      1.02369629E-01    2            6        -5                       # H+     -->  TP     BB                 
      5.08834273E-02    2      1000024   1000022                       # H+     -->  W1SS+  Z1SS               
      8.45676987E-04    2      1000024   1000023                       # H+     -->  W1SS+  Z2SS               
      2.23453671E-01    2      1000024   1000025                       # H+     -->  W1SS+  Z3SS               
      2.29582578E-01    2      1000024   1000035                       # H+     -->  W1SS+  Z4SS               
      2.50658970E-02    2      1000037   1000022                       # H+     -->  W2SS+  Z1SS               
      3.16072464E-01    2      1000037   1000023                       # H+     -->  W2SS+  Z2SS               
      3.19195688E-02    2      1000037   1000025                       # H+     -->  W2SS+  Z3SS               
      4.86473460E-03    2      1000037   1000035                       # H+     -->  W2SS+  Z4SS               
      3.82279140E-05    2           25        24                       # H+     -->  HL0    W+                 
