#
#                               =====================
#                               | THE SDECAY OUTPUT |
#                               =====================
#
#
#              -----------------------------------------------------
#              |  SUSY Les Houches Accord - MSSM Spectrum + Decays |
#              |                                                   |
#              |                     SDECAY 1.1a                   |
#              |                                                   |
#              |  Authors: M.Muhlleitner, A.Djouadi and Y.Mambrini |
#              |  Ref.:    hep-ph/0311167                          |
#              |                                                   |
#              |  In case of problems please send an email to      |
#              |           muehlleitner@lapp.in2p3.fr              |
#              |           djouadi@mail.cern.ch                    |
#              |           yann.mambrini@th.u-psud.fr              |
#              |                                                   |
#              |  If not stated otherwise all DRbar couplings and  |
#              |  soft SUSY breaking masses are given at the scale |
#              |  Q=  0.51234753E+03
#              |                                                   |
#              -----------------------------------------------------
#
#
# WARNING: The DRbar value for the VEV at the scale Q has not been given.
# Instead v=246 GeV has been chosen.
# However, the QCD corrections to the decays cannot be calculated consistently
# in this case.
#
BLOCK DCINFO  # Decay Program information
     1   SDECAY      # decay calculator
     2   1.1a        # version number
#
BLOCK SPINFO  # Spectrum calculator information
     1   Modified ISASUGRA             # Spectrum Calculato
     2   7.71   18-OCT-2004 16:52:09   # Version number    
#
BLOCK MODSEL  # Model selection
     1     1   MSSM                                              
#
BLOCK SMINPUTS  # Standard Model inputs
         1     1.28000015E+02   # alpha_em^-1(M_Z)^MSbar
         2     1.16570000E-05   # G_F [GeV^-2]
         3     1.18000016E-01   # alpha_S(M_Z)^MSbar
         4     9.11699982E+01   # M_Z pole mass
         5     4.51715469E+00   # mb(mb)^MSbar
         6     1.75000000E+02   # mt pole mass
         7     1.77699995E+00   # mtau pole mass
#
BLOCK MINPAR  # Input parameters - minimal models
         3     7.00000000E+00   # tan(beta)           
#
BLOCK MASS  # Mass Spectrum
# PDG code           mass       particle
        24     8.04229965E+01   # W+
        25     1.16400787E+02   # h
        35     1.00691498E+03   # H
        36     1.00000000E+03   # A
        37     1.00944415E+03   # H+
         5     5.18114211E+00   # b-quark pole mass calculated from mb(mb)_Msbar
   1000001     1.01268857E+04   # ~d_L
   2000001     1.01267461E+04   # ~d_R
   1000002     1.01265752E+04   # ~u_L
   2000002     1.01266523E+04   # ~u_R
   1000003     1.01268857E+04   # ~s_L
   2000003     1.01267461E+04   # ~s_R
   1000004     1.01265752E+04   # ~c_L
   2000004     1.01266523E+04   # ~c_R
   1000005     1.00029559E+03   # ~b_1
   2000005     1.50113843E+03   # ~b_2
   1000006     1.20e+02   # ~t_1
   2000006     1.50935388E+03   # ~t_2
   1000011     9.95973242E+03   # ~e_L
   2000011     1.00137793E+04   # ~e_R
   1000012     9.95563770E+03   # ~nu_eL
   1000013     9.95973242E+03   # ~mu_L
   2000013     1.00137793E+04   # ~mu_R
   1000014     9.95563770E+03   # ~nu_muL
   1000015     9.99936951E+02   # ~tau_1
   2000015     1.00205994E+03   # ~tau_2
   1000016     9.79629822E+02   # ~nu_tauL
   1000021     9.48479980E+02   # ~g
   1000022     8.50e+01   # ~chi_10
   1000023     1.45375168E+02   # ~chi_20
   1000025     1.73715897E+02   # ~chi_30
   1000035     2.68948151E+02   # ~chi_40
   1000024     1.0580e+02   # ~chi_1+
   1000037     2.68303070E+02   # ~chi_2+
#
BLOCK NMIX  # Neutralino Mixing Matrix
  1  1     7.86932826E-01   # N_11
  1  2    -2.28547201E-01   # N_12
  1  3     4.84032869E-01   # N_13
  1  4    -3.06944728E-01   # N_14
  2  1    -5.93476415E-01   # N_21
  2  2    -5.14517903E-01   # N_22
  2  3     4.57802236E-01   # N_23
  2  4    -4.16502357E-01   # N_24
  3  1     9.62323770E-02   # N_31
  3  2    -1.26225501E-01   # N_32
  3  3    -6.73730969E-01   # N_33
  3  4    -7.21729159E-01   # N_34
  4  1     1.38786569E-01   # N_41
  4  2    -8.16764772E-01   # N_42
  4  3    -3.19712400E-01   # N_43
  4  4     4.59801853E-01   # N_44
#
BLOCK UMIX  # Chargino Mixing Matrix U
  1  1    -4.44946110E-01   # U_11
  1  2     8.95557344E-01   # U_12
  2  1    -8.95557344E-01   # U_21
  2  2    -4.44946110E-01   # U_22
#
BLOCK VMIX  # Chargino Mixing Matrix V
  1  1    -6.49420083E-01   # V_11
  1  2     7.60429859E-01   # V_12
  2  1    -7.60429859E-01   # V_21
  2  2    -6.49420083E-01   # V_22
#
BLOCK 1.20e+02MIX  # Stop Mixing Matrix
  1  1     6.49764985E-02   # cos(theta_t)
  1  2     9.97886795E-01   # sin(theta_t)
  2  1    -9.97886795E-01   # -sin(theta_t)
  2  2     6.49764985E-02   # cos(theta_t)
#
BLOCK SBOTMIX  # Sbottom Mixing Matrix
  1  1     2.49222910E-04   # cos(theta_b)
  1  2     9.99999969E-01   # sin(theta_b)
  2  1    -9.99999969E-01   # -sin(theta_b)
  2  2     2.49222910E-04   # cos(theta_b)
#
BLOCK STAUMIX  # Stau Mixing Matrix
  1  1     8.14655423E-02   # cos(theta_tau)
  1  2     9.96676159E-01   # sin(theta_tau)
  2  1    -9.96676159E-01   # -sin(theta_tau)
  2  2     8.14655423E-02   # cos(theta_tau)
#
BLOCK ALPHA  # Higgs mixing
          -1.44607887E-01   # Mixing angle in the neutral Higgs boson sector
#
BLOCK HMIX Q=  5.12347534E+02  # DRbar Higgs Parameters
         1     1.65000000E+02   # mu(Q)               
         2     7.00000000E+00   # tan(beta)(M_{GUT})  
         4     1.00000000E+06   # m_A^2(Q)            
#
BLOCK GAUGE Q=  5.12347534E+02  # The gauge couplings
     1     3.57279837E-01   # gprime(Q) DRbar
     2     6.52060628E-01   # g(Q) DRbar
    3   # g3(Q) DRbar depends on the scale Q = mass of the decaying particle
#
BLOCK AU Q=  5.12347534E+02  # The trilinear couplings
  1  1    -6.76428589E+02   # A_u(Q) DRbar
  2  2    -6.76428589E+02   # A_c(Q) DRbar
  3  3    -6.76428589E+02   # A_t(Q) DRbar
#
BLOCK AD Q=  5.12347534E+02  # The trilinear couplings
  1  1     0.00000000E+00   # A_d(Q) DRbar
  2  2     0.00000000E+00   # A_s(Q) DRbar
  3  3     0.00000000E+00   # A_b(Q) DRbar
#
BLOCK AE Q=  5.12347534E+02  # The trilinear couplings
  1  1     0.00000000E+00   # A_e(Q) DRbar
  2  2     0.00000000E+00   # A_mu(Q) DRbar
  3  3     0.00000000E+00   # A_tau(Q) DRbar
#
BLOCK Yu Q=  5.12347534E+02  # The Yukawa couplings
  3  3   # y_t DRbar depends on the scale Q = mass of the decaying particle
#
BLOCK Yd Q=  5.12347534E+02  # The Yukawa couplings
  3  3   # y_b DRbar depends on the scale Q = mass of the decaying particle
#
BLOCK Ye Q=  5.12347534E+02  # The Yukawa couplings
  3  3     0.00000000E+00   # y_tau(Q) DRbar
#
BLOCK MSOFT Q=  5.12347534E+02  # The soft SUSY breaking masses at the scale Q
         1     1.10000000E+02   # M_1(Q)              
         2     2.19838043E+02   # M_2(Q)              
         3     9.48479980E+02   # M_3(Q)              
        31     1.00000000E+04   # MeL(Q)              
        32     1.00000000E+04   # MmuL(Q)             
        33     1.00000000E+03   # MtauL(Q)            
        34     1.00000000E+04   # MeR(Q)              
        35     1.00000000E+04   # MmuR(Q)             
        36     1.00000000E+03   # MtauR(Q)            
        41     1.00000000E+04   # MqL1(Q)             
        42     1.00000000E+04   # MqL2(Q)             
        43     1.50000000E+03   # MqL3(Q)             
        44     1.00000000E+04   # MuR(Q)              
        45     1.00000000E+04   # McR(Q)              
        47     1.00000000E+04   # MdR(Q)              
        48     1.00000000E+04   # MsR(Q)              
        49     1.00000000E+03   # MbR(Q)              
#
#
#
#                             =================
#                             |The decay table|
#                             =================
#
# - The multi-body decays for the inos, stops and sbottoms are included.
#
# - The loop induced decays for the gluino, neutralinos and stops
#   are included.
#
# - The SUSY decays of the top quark are included.
#
#
#         PDG            Width
DECAY         6     1.55080635E+00   # top decays
#          BR         NDA      ID1       ID2
     1.00000000E+00    2           5        24   # BR(t ->  b    W+)
     0.00000000E+00    2           5        37   # BR(t ->  b    H+)
     0.00000000E+00    2     1000006   1000022   # BR(t -> ~t_1 ~chi_10)
     0.00000000E+00    2     1000006   1000023   # BR(t -> ~t_1 ~chi_20)
     0.00000000E+00    2     1000006   1000025   # BR(t -> ~t_1 ~chi_30)
     0.00000000E+00    2     1000006   1000035   # BR(t -> ~t_1 ~chi_40)
     0.00000000E+00    2     2000006   1000022   # BR(t -> ~t_2 ~chi_10)
     0.00000000E+00    2     2000006   1000023   # BR(t -> ~t_2 ~chi_20)
     0.00000000E+00    2     2000006   1000025   # BR(t -> ~t_2 ~chi_30)
     0.00000000E+00    2     2000006   1000035   # BR(t -> ~t_2 ~chi_40)
#
#         PDG            Width
DECAY   1000021     2.35209967E+01   # gluino decays
#          BR         NDA      ID1       ID2
     0.00000000E+00    2     1000001        -1   # BR(~g -> ~d_L  db)
     0.00000000E+00    2    -1000001         1   # BR(~g -> ~d_L* d )
     0.00000000E+00    2     2000001        -1   # BR(~g -> ~d_R  db)
     0.00000000E+00    2    -2000001         1   # BR(~g -> ~d_R* d )
     0.00000000E+00    2     1000002        -2   # BR(~g -> ~u_L  ub)
     0.00000000E+00    2    -1000002         2   # BR(~g -> ~u_L* u )
     0.00000000E+00    2     2000002        -2   # BR(~g -> ~u_R  ub)
     0.00000000E+00    2    -2000002         2   # BR(~g -> ~u_R* u )
     0.00000000E+00    2     1000003        -3   # BR(~g -> ~s_L  sb)
     0.00000000E+00    2    -1000003         3   # BR(~g -> ~s_L* s )
     0.00000000E+00    2     2000003        -3   # BR(~g -> ~s_R  sb)
     0.00000000E+00    2    -2000003         3   # BR(~g -> ~s_R* s )
     0.00000000E+00    2     1000004        -4   # BR(~g -> ~c_L  cb)
     0.00000000E+00    2    -1000004         4   # BR(~g -> ~c_L* c )
     0.00000000E+00    2     2000004        -4   # BR(~g -> ~c_R  cb)
     0.00000000E+00    2    -2000004         4   # BR(~g -> ~c_R* c )
     0.00000000E+00    2     1000005        -5   # BR(~g -> ~b_1  bb)
     0.00000000E+00    2    -1000005         5   # BR(~g -> ~b_1* b )
     0.00000000E+00    2     2000005        -5   # BR(~g -> ~b_2  bb)
     0.00000000E+00    2    -2000005         5   # BR(~g -> ~b_2* b )
     5.00000000E-01    2     1000006        -6   # BR(~g -> ~t_1  tb)
     5.00000000E-01    2    -1000006         6   # BR(~g -> ~t_1* t )
     0.00000000E+00    2     2000006        -6   # BR(~g -> ~t_2  tb)
     0.00000000E+00    2    -2000006         6   # BR(~g -> ~t_2* t )
#
#         PDG            Width
DECAY   1000006     1.63438167E-02   # stop1 decays
#          BR         NDA      ID1       ID2
     0.00000000E+00    2     1000022         6   # BR(~t_1 -> ~chi_10 t )
     0.00000000E+00    2     1000023         6   # BR(~t_1 -> ~chi_20 t )
     0.00000000E+00    2     1000025         6   # BR(~t_1 -> ~chi_30 t )
     0.00000000E+00    2     1000035         6   # BR(~t_1 -> ~chi_40 t )
     1.00000000E+00    2     1000024         5   # BR(~t_1 -> ~chi_1+ b )
     0.00000000E+00    2     1000037         5   # BR(~t_1 -> ~chi_2+ b )
     0.00000000E+00    2     1000021         6   # BR(~t_1 -> ~g      t )
     0.00000000E+00    2     1000005        37   # BR(~t_1 -> ~b_1    H+)
     0.00000000E+00    2     2000005        37   # BR(~t_1 -> ~b_2    H+)
     0.00000000E+00    2     1000005        24   # BR(~t_1 -> ~b_1    W+)
     0.00000000E+00    2     2000005        24   # BR(~t_1 -> ~b_2    W+)
#
#         PDG            Width
DECAY   2000006     7.55930054E+01   # stop2 decays
#          BR         NDA      ID1       ID2
     1.82734190E-02    2     1000022         6   # BR(~t_2 -> ~chi_10 t )
     6.68715111E-02    2     1000023         6   # BR(~t_2 -> ~chi_20 t )
     1.13354926E-01    2     1000025         6   # BR(~t_2 -> ~chi_30 t )
     1.03877785E-01    2     1000035         6   # BR(~t_2 -> ~chi_40 t )
     5.88369611E-02    2     1000024         5   # BR(~t_2 -> ~chi_1+ b )
     1.03716960E-01    2     1000037         5   # BR(~t_2 -> ~chi_2+ b )
     4.49916832E-01    2     1000021         6   # BR(~t_2 -> ~g      t )
     2.38873542E-02    2     1000006        25   # BR(~t_2 -> ~t_1    h )
     1.14370123E-04    2     1000006        35   # BR(~t_2 -> ~t_1    H )
     1.26253924E-04    2     1000006        36   # BR(~t_2 -> ~t_1    A )
     0.00000000E+00    2     1000005        37   # BR(~t_2 -> ~b_1    H+)
     0.00000000E+00    2     2000005        37   # BR(~t_2 -> ~b_2    H+)
     6.10233158E-02    2     1000006        23   # BR(~t_2 -> ~t_1    Z )
     3.11893301E-07    2     1000005        24   # BR(~t_2 -> ~b_1    W+)
     0.00000000E+00    2     2000005        24   # BR(~t_2 -> ~b_2    W+)
#
#         PDG            Width
DECAY   1000005     1.39054992E+00   # sbottom1 decays
#          BR         NDA      ID1       ID2
     2.57391282E-01    2     1000022         5   # BR(~b_1 -> ~chi_10 b )
     1.45859347E-01    2     1000023         5   # BR(~b_1 -> ~chi_20 b )
     2.21240336E-02    2     1000025         5   # BR(~b_1 -> ~chi_30 b )
     1.05432341E-02    2     1000035         5   # BR(~b_1 -> ~chi_40 b )
     3.17408880E-02    2    -1000024         6   # BR(~b_1 -> ~chi_1- t )
     6.81210678E-03    2    -1000037         6   # BR(~b_1 -> ~chi_2- t )
     5.25528994E-01    2     1000021         5   # BR(~b_1 -> ~g      b )
     0.00000000E+00    2     1000006       -37   # BR(~b_1 -> ~t_1    H-)
     0.00000000E+00    2     2000006       -37   # BR(~b_1 -> ~t_2    H-)
     1.14250417E-07    2     1000006       -24   # BR(~b_1 -> ~t_1    W-)
     0.00000000E+00    2     2000006       -24   # BR(~b_1 -> ~t_2    W-)
#
#         PDG            Width
DECAY   2000005     8.11652002E+01   # sbottom2 decays
#          BR         NDA      ID1       ID2
     1.10059322E-02    2     1000022         5   # BR(~b_2 -> ~chi_10 b )
     1.28743483E-02    2     1000023         5   # BR(~b_2 -> ~chi_20 b )
     2.04145665E-03    2     1000025         5   # BR(~b_2 -> ~chi_30 b )
     5.20737261E-02    2     1000035         5   # BR(~b_2 -> ~chi_40 b )
     1.46817733E-01    2    -1000024         6   # BR(~b_2 -> ~chi_1- t )
     2.05499666E-01    2    -1000037         6   # BR(~b_2 -> ~chi_2- t )
     4.58224031E-01    2     1000021         5   # BR(~b_2 -> ~g      b )
     3.35724881E-06    2     1000005        25   # BR(~b_2 -> ~b_1    h )
     0.00000000E+00    2     1000005        35   # BR(~b_2 -> ~b_1    H )
     0.00000000E+00    2     1000005        36   # BR(~b_2 -> ~b_1    A )
     2.31726442E-04    2     1000006       -37   # BR(~b_2 -> ~t_1    H-)
     0.00000000E+00    2     2000006       -37   # BR(~b_2 -> ~t_2    H-)
     1.39622965E-07    2     1000005        23   # BR(~b_2 -> ~b_1    Z )
     1.11227883E-01    2     1000006       -24   # BR(~b_2 -> ~t_1    W-)
     0.00000000E+00    2     2000006       -24   # BR(~b_2 -> ~t_2    W-)
#
#         PDG            Width
DECAY   1000002     6.87398607E+02   # sup_L decays
#          BR         NDA      ID1       ID2
     4.48193989E-04    2     1000022         2   # BR(~u_L -> ~chi_10 u)
     2.41659244E-02    2     1000023         2   # BR(~u_L -> ~chi_20 u)
     7.35071756E-04    2     1000025         2   # BR(~u_L -> ~chi_30 u)
     3.89697366E-02    2     1000035         2   # BR(~u_L -> ~chi_40 u)
     5.25377800E-02    2     1000024         1   # BR(~u_L -> ~chi_1+ d)
     7.19562331E-02    2     1000037         1   # BR(~u_L -> ~chi_2+ d)
     8.11187060E-01    2     1000021         2   # BR(~u_L -> ~g      u)
#
#         PDG            Width
DECAY   2000002     5.80465754E+02   # sup_R decays
#          BR         NDA      ID1       ID2
     2.43832626E-02    2     1000022         2   # BR(~u_R -> ~chi_10 u)
     1.38647435E-02    2     1000023         2   # BR(~u_R -> ~chi_20 u)
     3.64477499E-04    2     1000025         2   # BR(~u_R -> ~chi_30 u)
     7.57470871E-04    2     1000035         2   # BR(~u_R -> ~chi_40 u)
     0.00000000E+00    2     1000024         1   # BR(~u_R -> ~chi_1+ d)
     0.00000000E+00    2     1000037         1   # BR(~u_R -> ~chi_2+ d)
     9.60630046E-01    2     1000021         2   # BR(~u_R -> ~g      u)
#
#         PDG            Width
DECAY   1000001     6.87395760E+02   # sdown_L decays
#          BR         NDA      ID1       ID2
     8.63381038E-03    2     1000022         1   # BR(~d_L -> ~chi_10 d)
     1.02726996E-02    2     1000023         1   # BR(~d_L -> ~chi_20 d)
     1.28770530E-03    2     1000025         1   # BR(~d_L -> ~chi_30 d)
     4.41238100E-02    2     1000035         1   # BR(~d_L -> ~chi_40 d)
     2.46632462E-02    2    -1000024         2   # BR(~d_L -> ~chi_1- u)
     9.98049424E-02    2    -1000037         2   # BR(~d_L -> ~chi_2- u)
     8.11213786E-01    2     1000021         1   # BR(~d_L -> ~g      d)
#
#         PDG            Width
DECAY   2000001     5.63330976E+02   # sdown_R decays
#          BR         NDA      ID1       ID2
     6.28128961E-03    2     1000022         1   # BR(~d_R -> ~chi_10 d)
     3.57164959E-03    2     1000023         1   # BR(~d_R -> ~chi_20 d)
     9.38918136E-05    2     1000025         1   # BR(~d_R -> ~chi_30 d)
     1.95129508E-04    2     1000035         1   # BR(~d_R -> ~chi_40 d)
     0.00000000E+00    2    -1000024         2   # BR(~d_R -> ~chi_1- u)
     0.00000000E+00    2    -1000037         2   # BR(~d_R -> ~chi_2- u)
     9.89858039E-01    2     1000021         1   # BR(~d_R -> ~g      d)
#
#         PDG            Width
DECAY   1000004     6.87398607E+02   # scharm_L decays
#          BR         NDA      ID1       ID2
     4.48193989E-04    2     1000022         4   # BR(~c_L -> ~chi_10 c)
     2.41659244E-02    2     1000023         4   # BR(~c_L -> ~chi_20 c)
     7.35071756E-04    2     1000025         4   # BR(~c_L -> ~chi_30 c)
     3.89697366E-02    2     1000035         4   # BR(~c_L -> ~chi_40 c)
     5.25377800E-02    2     1000024         3   # BR(~c_L -> ~chi_1+ s)
     7.19562331E-02    2     1000037         3   # BR(~c_L -> ~chi_2+ s)
     8.11187060E-01    2     1000021         4   # BR(~c_L -> ~g      c)
#
#         PDG            Width
DECAY   2000004     5.80465754E+02   # scharm_R decays
#          BR         NDA      ID1       ID2
     2.43832626E-02    2     1000022         4   # BR(~c_R -> ~chi_10 c)
     1.38647435E-02    2     1000023         4   # BR(~c_R -> ~chi_20 c)
     3.64477499E-04    2     1000025         4   # BR(~c_R -> ~chi_30 c)
     7.57470871E-04    2     1000035         4   # BR(~c_R -> ~chi_40 c)
     0.00000000E+00    2     1000024         3   # BR(~c_R -> ~chi_1+ s)
     0.00000000E+00    2     1000037         3   # BR(~c_R -> ~chi_2+ s)
     9.60630046E-01    2     1000021         4   # BR(~c_R -> ~g      c)
#
#         PDG            Width
DECAY   1000003     6.87395760E+02   # sstrange_L decays
#          BR         NDA      ID1       ID2
     8.63381038E-03    2     1000022         3   # BR(~s_L -> ~chi_10 s)
     1.02726996E-02    2     1000023         3   # BR(~s_L -> ~chi_20 s)
     1.28770530E-03    2     1000025         3   # BR(~s_L -> ~chi_30 s)
     4.41238100E-02    2     1000035         3   # BR(~s_L -> ~chi_40 s)
     2.46632462E-02    2    -1000024         4   # BR(~s_L -> ~chi_1- c)
     9.98049424E-02    2    -1000037         4   # BR(~s_L -> ~chi_2- c)
     8.11213786E-01    2     1000021         3   # BR(~s_L -> ~g      s)
#
#         PDG            Width
DECAY   2000003     5.63330976E+02   # sstrange_R decays
#          BR         NDA      ID1       ID2
     6.28128961E-03    2     1000022         3   # BR(~s_R -> ~chi_10 s)
     3.57164959E-03    2     1000023         3   # BR(~s_R -> ~chi_20 s)
     9.38918136E-05    2     1000025         3   # BR(~s_R -> ~chi_30 s)
     1.95129508E-04    2     1000035         3   # BR(~s_R -> ~chi_40 s)
     0.00000000E+00    2    -1000024         4   # BR(~s_R -> ~chi_1- c)
     0.00000000E+00    2    -1000037         4   # BR(~s_R -> ~chi_2- c)
     9.89858039E-01    2     1000021         3   # BR(~s_R -> ~g      s)
#
#         PDG            Width
DECAY   1000011     1.38866300E+02   # selectron_L decays
#          BR         NDA      ID1       ID2
     1.24530262E-02    2     1000022        11   # BR(~e_L -> ~chi_10 e-)
     2.13790352E-01    2     1000023        11   # BR(~e_L -> ~chi_20 e-)
     1.63759739E-03    2     1000025        11   # BR(~e_L -> ~chi_30 e-)
     1.66188795E-01    2     1000035        11   # BR(~e_L -> ~chi_40 e-)
     1.20067994E-01    2    -1000024        12   # BR(~e_L -> ~chi_1- nu_e)
     4.85862235E-01    2    -1000037        12   # BR(~e_L -> ~chi_2- nu_e)
#
#         PDG            Width
DECAY   2000011     5.08456089E+01   # selectron_R decays
#          BR         NDA      ID1       ID2
     6.19338491E-01    2     1000022        11   # BR(~e_R -> ~chi_10 e-)
     3.52164493E-01    2     1000023        11   # BR(~e_R -> ~chi_20 e-)
     9.25769163E-03    2     1000025        11   # BR(~e_R -> ~chi_30 e-)
     1.92393246E-02    2     1000035        11   # BR(~e_R -> ~chi_40 e-)
     0.00000000E+00    2    -1000024        12   # BR(~e_R -> ~chi_1- nu_e)
     0.00000000E+00    2    -1000037        12   # BR(~e_R -> ~chi_2- nu_e)
#
#         PDG            Width
DECAY   1000013     1.38866300E+02   # smuon_L decays
#          BR         NDA      ID1       ID2
     1.24530262E-02    2     1000022        13   # BR(~mu_L -> ~chi_10 mu-)
     2.13790352E-01    2     1000023        13   # BR(~mu_L -> ~chi_20 mu-)
     1.63759739E-03    2     1000025        13   # BR(~mu_L -> ~chi_30 mu-)
     1.66188795E-01    2     1000035        13   # BR(~mu_L -> ~chi_40 mu-)
     1.20067994E-01    2    -1000024        14   # BR(~mu_L -> ~chi_1- nu_mu)
     4.85862235E-01    2    -1000037        14   # BR(~mu_L -> ~chi_2- nu_mu)
#
#         PDG            Width
DECAY   2000013     5.08456089E+01   # smuon_R decays
#          BR         NDA      ID1       ID2
     6.19338491E-01    2     1000022        13   # BR(~mu_R -> ~chi_10 mu-)
     3.52164493E-01    2     1000023        13   # BR(~mu_R -> ~chi_20 mu-)
     9.25769163E-03    2     1000025        13   # BR(~mu_R -> ~chi_30 mu-)
     1.92393246E-02    2     1000035        13   # BR(~mu_R -> ~chi_40 mu-)
     0.00000000E+00    2    -1000024        14   # BR(~mu_R -> ~chi_1- nu_mu)
     0.00000000E+00    2    -1000037        14   # BR(~mu_R -> ~chi_2- nu_mu)
#
#         PDG            Width
DECAY   1000015     4.98788889E+00   # stau_1 decays
#          BR         NDA      ID1       ID2
     6.16644448E-01    2     1000022        15   # BR(~tau_1 -> ~chi_10  tau-)
     3.45181370E-01    2     1000023        15   # BR(~tau_1 -> ~chi_20  tau-)
     8.83766830E-03    2     1000025        15   # BR(~tau_1 -> ~chi_30  tau-)
     1.94082430E-02    2     1000035        15   # BR(~tau_1 -> ~chi_40  tau-)
     2.15512599E-03    2    -1000024        16   # BR(~tau_1 -> ~chi_1-  nu_tau)
     7.77314391E-03    2    -1000037        16   # BR(~tau_1 -> ~chi_2-  nu_tau)
     0.00000000E+00    2     1000016       -37   # BR(~tau_1 -> ~nu_tauL H-)
     0.00000000E+00    2     1000016       -24   # BR(~tau_1 -> ~nu_tauL W-)
#
#         PDG            Width
DECAY   2000015     1.24900598E+01   # stau_2 decays
#          BR         NDA      ID1       ID2
     1.52663330E-02    2     1000022        15   # BR(~tau_2 -> ~chi_10  tau-)
     2.28659203E-01    2     1000023        15   # BR(~tau_2 -> ~chi_20  tau-)
     1.73678958E-03    2     1000025        15   # BR(~tau_2 -> ~chi_30  tau-)
     1.59300880E-01    2     1000035        15   # BR(~tau_2 -> ~chi_40  tau-)
     1.29112389E-01    2    -1000024        16   # BR(~tau_2 -> ~chi_1-  nu_tau)
     4.65924406E-01    2    -1000037        16   # BR(~tau_2 -> ~chi_2-  nu_tau)
     0.00000000E+00    2     1000016       -37   # BR(~tau_2 -> ~nu_tauL H-)
     0.00000000E+00    2     1000016       -24   # BR(~tau_2 -> ~nu_tauL W-)
     0.00000000E+00    2     1000015        25   # BR(~tau_2 -> ~tau_1   h)
     0.00000000E+00    2     1000015        35   # BR(~tau_2 -> ~tau_1   H)
     0.00000000E+00    2     1000015        36   # BR(~tau_2 -> ~tau_1   A)
     0.00000000E+00    2     1000015        23   # BR(~tau_2 -> ~tau_1   Z)
#
#         PDG            Width
DECAY   1000012     1.38823581E+02   # snu_eL decays
#          BR         NDA      ID1       ID2
     1.31989810E-01    2     1000022        12   # BR(~nu_eL -> ~chi_10 nu_e)
     1.08685415E-02    2     1000023        12   # BR(~nu_eL -> ~chi_20 nu_e)
     9.70729230E-03    2     1000025        12   # BR(~nu_eL -> ~chi_30 nu_e)
     2.41415547E-01    2     1000035        12   # BR(~nu_eL -> ~chi_40 nu_e)
     2.55751843E-01    2     1000024        11   # BR(~nu_eL -> ~chi_1+ e-)
     3.50266967E-01    2     1000037        11   # BR(~nu_eL -> ~chi_2+ e-)
#
#         PDG            Width
DECAY   1000014     1.38823581E+02   # snu_muL decays
#          BR         NDA      ID1       ID2
     1.31989810E-01    2     1000022        14   # BR(~nu_muL -> ~chi_10 nu_mu)
     1.08685415E-02    2     1000023        14   # BR(~nu_muL -> ~chi_20 nu_mu)
     9.70729230E-03    2     1000025        14   # BR(~nu_muL -> ~chi_30 nu_mu)
     2.41415547E-01    2     1000035        14   # BR(~nu_muL -> ~chi_40 nu_mu)
     2.55751843E-01    2     1000024        13   # BR(~nu_muL -> ~chi_1+ mu-)
     3.50266967E-01    2     1000037        13   # BR(~nu_muL -> ~chi_2+ mu-)
#
#         PDG            Width
DECAY   1000016     1.23388917E+01   # snu_tauL decays
#          BR         NDA      ID1       ID2
     1.43732086E-01    2     1000022        16   # BR(~nu_tauL -> ~chi_10 nu_tau)
     1.15131638E-02    2     1000023        16   # BR(~nu_tauL -> ~chi_20 nu_tau)
     1.00876721E-02    2     1000025        16   # BR(~nu_tauL -> ~chi_30 nu_tau)
     2.28829989E-01    2     1000035        16   # BR(~nu_tauL -> ~chi_40 nu_tau)
     2.73575845E-01    2     1000024        15   # BR(~nu_tauL -> ~chi_1+ tau-)
     3.32261244E-01    2     1000037        15   # BR(~nu_tauL -> ~chi_2+ tau-)
     0.00000000E+00    2     1000015       -37   # BR(~nu_tauL -> ~tau_1+ H-)
     0.00000000E+00    2     2000015       -37   # BR(~nu_tauL -> ~tau_2+ H-)
     0.00000000E+00    2     1000015       -24   # BR(~nu_tauL -> ~tau_1+ W-)
     0.00000000E+00    2     2000015       -24   # BR(~nu_tauL -> ~tau_2+ W-)
#
#         PDG            Width
DECAY   1000024     4.77438471E-05   # chargino1+ decays
#           BR         NDA      ID1       ID2       ID3
     3.33674034E-01    3     1000022         2        -1   # BR(~chi_1+ -> ~chi_10 u    db)
     0.00000000E+00    3     1000023         2        -1   # BR(~chi_1+ -> ~chi_20 u    db)
     0.00000000E+00    3     1000025         2        -1   # BR(~chi_1+ -> ~chi_30 u    db)
     0.00000000E+00    3     1000035         2        -1   # BR(~chi_1+ -> ~chi_40 u    db)
     3.33674034E-01    3     1000022         4        -3   # BR(~chi_1+ -> ~chi_10 c    sb)
     0.00000000E+00    3     1000023         4        -3   # BR(~chi_1+ -> ~chi_20 c    sb)
     0.00000000E+00    3     1000025         4        -3   # BR(~chi_1+ -> ~chi_30 c    sb)
     0.00000000E+00    3     1000035         4        -3   # BR(~chi_1+ -> ~chi_40 c    sb)
     0.00000000E+00    3     1000022         6        -5   # BR(~chi_1+ -> ~chi_10 t    bb)
     0.00000000E+00    3     1000023         6        -5   # BR(~chi_1+ -> ~chi_20 t    bb)
     0.00000000E+00    3     1000025         6        -5   # BR(~chi_1+ -> ~chi_30 t    bb)
     0.00000000E+00    3     1000035         6        -5   # BR(~chi_1+ -> ~chi_40 t    bb)
     1.11223579E-01    3     1000022       -11        12   # BR(~chi_1+ -> ~chi_10 e+   nu_e)
     0.00000000E+00    3     1000023       -11        12   # BR(~chi_1+ -> ~chi_20 e+   nu_e)
     0.00000000E+00    3     1000025       -11        12   # BR(~chi_1+ -> ~chi_30 e+   nu_e)
     0.00000000E+00    3     1000035       -11        12   # BR(~chi_1+ -> ~chi_40 e+   nu_e)
     1.11223579E-01    3     1000022       -13        14   # BR(~chi_1+ -> ~chi_10 mu+  nu_mu)
     0.00000000E+00    3     1000023       -13        14   # BR(~chi_1+ -> ~chi_20 mu+  nu_mu)
     0.00000000E+00    3     1000025       -13        14   # BR(~chi_1+ -> ~chi_30 mu+  nu_mu)
     0.00000000E+00    3     1000035       -13        14   # BR(~chi_1+ -> ~chi_40 mu+  nu_mu)
     1.10204774E-01    3     1000022       -15        16   # BR(~chi_1+ -> ~chi_10 tau+ nu_tau)
     0.00000000E+00    3     1000023       -15        16   # BR(~chi_1+ -> ~chi_20 tau+ nu_tau)
     0.00000000E+00    3     1000025       -15        16   # BR(~chi_1+ -> ~chi_30 tau+ nu_tau)
     0.00000000E+00    3     1000035       -15        16   # BR(~chi_1+ -> ~chi_40 tau+ nu_tau)
     0.00000000E+00    3     1000021         2        -1   # BR(~chi_1+ -> ~g      u    db)
     0.00000000E+00    3     1000021         4        -3   # BR(~chi_1+ -> ~g      c    sb)
     0.00000000E+00    3     1000021         6        -5   # BR(~chi_1+ -> ~g      t    bb)
#
#         PDG            Width
DECAY   1000037     2.42890012E+00   # chargino2+ decays
#          BR         NDA      ID1       ID2
     0.00000000E+00    2     1000002        -1   # BR(~chi_2+ -> ~u_L     db)
     0.00000000E+00    2     2000002        -1   # BR(~chi_2+ -> ~u_R     db)
     0.00000000E+00    2    -1000001         2   # BR(~chi_2+ -> ~d_L*    u )
     0.00000000E+00    2    -2000001         2   # BR(~chi_2+ -> ~d_R*    u )
     0.00000000E+00    2     1000004        -3   # BR(~chi_2+ -> ~c_L     sb)
     0.00000000E+00    2     2000004        -3   # BR(~chi_2+ -> ~c_R     sb)
     0.00000000E+00    2    -1000003         4   # BR(~chi_2+ -> ~s_L*    c )
     0.00000000E+00    2    -2000003         4   # BR(~chi_2+ -> ~s_R*    c )
     5.26741180E-01    2     1000006        -5   # BR(~chi_2+ -> ~t_1     bb)
     0.00000000E+00    2     2000006        -5   # BR(~chi_2+ -> ~t_2     bb)
     0.00000000E+00    2    -1000005         6   # BR(~chi_2+ -> ~b_1*    t )
     0.00000000E+00    2    -2000005         6   # BR(~chi_2+ -> ~b_2*    t )
     0.00000000E+00    2     1000012       -11   # BR(~chi_2+ -> ~nu_eL   e+  )
     0.00000000E+00    2     1000014       -13   # BR(~chi_2+ -> ~nu_muL  mu+ )
     0.00000000E+00    2     1000016       -15   # BR(~chi_2+ -> ~nu_tau1 tau+)
     0.00000000E+00    2    -1000011        12   # BR(~chi_2+ -> ~e_L+    nu_e)
     0.00000000E+00    2    -2000011        12   # BR(~chi_2+ -> ~e_R+    nu_e)
     0.00000000E+00    2    -1000013        14   # BR(~chi_2+ -> ~mu_L+   nu_mu)
     0.00000000E+00    2    -2000013        14   # BR(~chi_2+ -> ~mu_R+   nu_mu)
     0.00000000E+00    2    -1000015        16   # BR(~chi_2+ -> ~tau_1+  nu_tau)
     0.00000000E+00    2    -2000015        16   # BR(~chi_2+ -> ~tau_2+  nu_tau)
     1.16057193E-01    2     1000024        23   # BR(~chi_2+ -> ~chi_1+  Z )
     1.09793810E-02    2     1000022        24   # BR(~chi_2+ -> ~chi_10  W+)
     1.28247114E-01    2     1000023        24   # BR(~chi_2+ -> ~chi_20  W+)
     1.96461533E-01    2     1000025        24   # BR(~chi_2+ -> ~chi_30  W+)
     0.00000000E+00    2     1000035        24   # BR(~chi_2+ -> ~chi_40  W+)
     2.15135984E-02    2     1000024        25   # BR(~chi_2+ -> ~chi_1+  h )
     0.00000000E+00    2     1000024        35   # BR(~chi_2+ -> ~chi_1+  H )
     0.00000000E+00    2     1000024        36   # BR(~chi_2+ -> ~chi_1+  A )
     0.00000000E+00    2     1000022        37   # BR(~chi_2+ -> ~chi_10  H+)
     0.00000000E+00    2     1000023        37   # BR(~chi_2+ -> ~chi_20  H+)
     0.00000000E+00    2     1000025        37   # BR(~chi_2+ -> ~chi_30  H+)
     0.00000000E+00    2     1000035        37   # BR(~chi_2+ -> ~chi_40  H+)
#
#         PDG            Width
DECAY   1000022     0.00000000E+00   # neutralino1 decays
#
#         PDG            Width
DECAY   1000023     1.59070925E-05   # neutralino2 decays
#          BR         NDA      ID1       ID2
     8.12010520E-04    2     1000022        22   # BR(~chi_20 -> ~chi_10 gam)
#           BR         NDA      ID1       ID2       ID3
     9.24550846E-02    3     1000022        -2         2   # BR(~chi_20 -> ~chi_10 ub      u)
     1.19162898E-01    3     1000022        -1         1   # BR(~chi_20 -> ~chi_10 db      d)
     9.24550846E-02    3     1000022        -4         4   # BR(~chi_20 -> ~chi_10 cb      c)
     1.19162898E-01    3     1000022        -3         3   # BR(~chi_20 -> ~chi_10 sb      s)
     0.00000000E+00    3     1000022        -6         6   # BR(~chi_20 -> ~chi_10 tb      t)
     1.09992137E-01    3     1000022        -5         5   # BR(~chi_20 -> ~chi_10 bb      b)
     2.69874715E-02    3     1000022       -11        11   # BR(~chi_20 -> ~chi_10 e+      e-)
     2.69874715E-02    3     1000022       -13        13   # BR(~chi_20 -> ~chi_10 mu+     mu-)
     2.46523830E-02    3     1000022       -15        15   # BR(~chi_20 -> ~chi_10 tau+    tau-)
     5.36950459E-02    3     1000022       -12        12   # BR(~chi_20 -> ~chi_10 nu_eb   nu_e)
     5.36950459E-02    3     1000022       -14        14   # BR(~chi_20 -> ~chi_10 nu_mub  nu_mu)
     5.29343970E-02    3     1000022       -16        16   # BR(~chi_20 -> ~chi_10 nu_taub nu_tau)
     3.80468877E-02    3     1000024        -2         1   # BR(~chi_20 -> ~chi_1+ ub      d)
     3.80468877E-02    3    -1000024        -1         2   # BR(~chi_20 -> ~chi_1- db      u)
     0.00000000E+00    3     1000037        -2         1   # BR(~chi_20 -> ~chi_2+ ub      d)
     0.00000000E+00    3    -1000037        -1         2   # BR(~chi_20 -> ~chi_2- db      u)
     3.80468877E-02    3     1000024        -4         3   # BR(~chi_20 -> ~chi_1+ cb      s)
     3.80468877E-02    3    -1000024        -3         4   # BR(~chi_20 -> ~chi_1- sb      c)
     0.00000000E+00    3     1000037        -4         3   # BR(~chi_20 -> ~chi_2+ cb      s)
     0.00000000E+00    3    -1000037        -3         4   # BR(~chi_20 -> ~chi_2- sb      c)
     0.00000000E+00    3     1000024        -6         5   # BR(~chi_20 -> ~chi_1+ tb      b)
     0.00000000E+00    3    -1000024        -5         6   # BR(~chi_20 -> ~chi_1- bb      t)
     0.00000000E+00    3     1000037        -6         5   # BR(~chi_20 -> ~chi_2+ tb      b)
     0.00000000E+00    3    -1000037        -5         6   # BR(~chi_20 -> ~chi_2- bb      t)
     1.26822048E-02    3     1000024       -12        11   # BR(~chi_20 -> ~chi_1+ nu_eb   e-)
     1.26822048E-02    3    -1000024        12       -11   # BR(~chi_20 -> ~chi_1- nu_e    e+)
     0.00000000E+00    3     1000037       -12        11   # BR(~chi_20 -> ~chi_2+ nu_eb   e-)
     0.00000000E+00    3    -1000037        12       -11   # BR(~chi_20 -> ~chi_2- nu_e    e+)
     1.26822048E-02    3     1000024       -14        13   # BR(~chi_20 -> ~chi_1+ nu_mub  mu-)
     1.26822048E-02    3    -1000024        14       -13   # BR(~chi_20 -> ~chi_1- nu_mu   mu+)
     0.00000000E+00    3     1000037       -14        13   # BR(~chi_20 -> ~chi_2+ nu_mub  mu-)
     0.00000000E+00    3    -1000037        14       -13   # BR(~chi_20 -> ~chi_2- nu_mu   mu+)
     1.20458511E-02    3     1000024       -16        15   # BR(~chi_20 -> ~chi_1+ nu_taub tau-)
     1.20458511E-02    3    -1000024        16       -15   # BR(~chi_20 -> ~chi_1- nu_tau  tau+)
     0.00000000E+00    3     1000037       -16        15   # BR(~chi_20 -> ~chi_2+ nu_taub tau-)
     0.00000000E+00    3    -1000037        16       -15   # BR(~chi_20 -> ~chi_2- nu_tau  tau+)
     0.00000000E+00    3     1000021        -2         2   # BR(~chi_20 -> ~g      ub      u)
     0.00000000E+00    3     1000021        -1         1   # BR(~chi_20 -> ~g      db      d)
     0.00000000E+00    3     1000021        -4         4   # BR(~chi_20 -> ~g      cb      c)
     0.00000000E+00    3     1000021        -3         3   # BR(~chi_20 -> ~g      sb      s)
     0.00000000E+00    3     1000021        -6         6   # BR(~chi_20 -> ~g      tb      t)
     0.00000000E+00    3     1000021        -5         5   # BR(~chi_20 -> ~g      bb      b)
#
#         PDG            Width
DECAY   1000025     9.96637214E-03   # neutralino3 decays
#          BR         NDA      ID1       ID2
     2.47804376E-03    2     1000022        22   # BR(~chi_30 -> ~chi_10 gam)
     1.92565337E-02    2     1000023        22   # BR(~chi_30 -> ~chi_20 gam)
#           BR         NDA      ID1       ID2       ID3
     1.03977428E-01    3     1000022        -2         2   # BR(~chi_30 -> ~chi_10 ub      u)
     1.33999825E-01    3     1000022        -1         1   # BR(~chi_30 -> ~chi_10 db      d)
     1.03977428E-01    3     1000022        -4         4   # BR(~chi_30 -> ~chi_10 cb      c)
     1.33999825E-01    3     1000022        -3         3   # BR(~chi_30 -> ~chi_10 sb      s)
     0.00000000E+00    3     1000022        -6         6   # BR(~chi_30 -> ~chi_10 tb      t)
     1.30419491E-01    3     1000022        -5         5   # BR(~chi_30 -> ~chi_10 bb      b)
     3.03758133E-02    3     1000022       -11        11   # BR(~chi_30 -> ~chi_10 e+      e-)
     3.03758133E-02    3     1000022       -13        13   # BR(~chi_30 -> ~chi_10 mu+     mu-)
     3.02226537E-02    3     1000022       -15        15   # BR(~chi_30 -> ~chi_10 tau+    tau-)
     6.04000987E-02    3     1000022       -12        12   # BR(~chi_30 -> ~chi_10 nu_eb   nu_e)
     6.04000987E-02    3     1000022       -14        14   # BR(~chi_30 -> ~chi_10 nu_mub  nu_mu)
     6.04680377E-02    3     1000022       -16        16   # BR(~chi_30 -> ~chi_10 nu_taub nu_tau)
     2.21475224E-04    3     1000023        -2         2   # BR(~chi_30 -> ~chi_20 ub      u)
     2.85419042E-04    3     1000023        -1         1   # BR(~chi_30 -> ~chi_20 db      d)
     2.21475224E-04    3     1000023        -4         4   # BR(~chi_30 -> ~chi_20 cb      c)
     2.85419042E-04    3     1000023        -3         3   # BR(~chi_30 -> ~chi_20 sb      s)
     0.00000000E+00    3     1000023        -6         6   # BR(~chi_30 -> ~chi_20 tb      t)
     1.93844532E-04    3     1000023        -5         5   # BR(~chi_30 -> ~chi_20 bb      b)
     6.47011559E-05    3     1000023       -11        11   # BR(~chi_30 -> ~chi_20 e+      e-)
     6.47011559E-05    3     1000023       -13        13   # BR(~chi_30 -> ~chi_20 mu+     mu-)
     6.10916140E-05    3     1000023       -15        15   # BR(~chi_30 -> ~chi_20 tau+    tau-)
     1.28652354E-04    3     1000023       -12        12   # BR(~chi_30 -> ~chi_20 nu_eb   nu_e)
     1.28652354E-04    3     1000023       -14        14   # BR(~chi_30 -> ~chi_20 nu_mub  nu_mu)
     1.28744815E-04    3     1000023       -16        16   # BR(~chi_30 -> ~chi_20 nu_taub nu_tau)
     1.63218808E-02    3     1000024        -2         1   # BR(~chi_30 -> ~chi_1+ ub      d)
     1.63218808E-02    3    -1000024        -1         2   # BR(~chi_30 -> ~chi_1- db      u)
     0.00000000E+00    3     1000037        -2         1   # BR(~chi_30 -> ~chi_2+ ub      d)
     0.00000000E+00    3    -1000037        -1         2   # BR(~chi_30 -> ~chi_2- db      u)
     1.63218808E-02    3     1000024        -4         3   # BR(~chi_30 -> ~chi_1+ cb      s)
     1.63218808E-02    3    -1000024        -3         4   # BR(~chi_30 -> ~chi_1- sb      c)
     0.00000000E+00    3     1000037        -4         3   # BR(~chi_30 -> ~chi_2+ cb      s)
     0.00000000E+00    3    -1000037        -3         4   # BR(~chi_30 -> ~chi_2- sb      c)
     0.00000000E+00    3     1000024        -6         5   # BR(~chi_30 -> ~chi_1+ tb      b)
     0.00000000E+00    3    -1000024        -5         6   # BR(~chi_30 -> ~chi_1- bb      t)
     0.00000000E+00    3     1000037        -6         5   # BR(~chi_30 -> ~chi_2+ tb      b)
     0.00000000E+00    3    -1000037        -5         6   # BR(~chi_30 -> ~chi_2- bb      t)
     5.44065423E-03    3     1000024       -12        11   # BR(~chi_30 -> ~chi_1+ nu_eb   e-)
     5.44065423E-03    3    -1000024        12       -11   # BR(~chi_30 -> ~chi_1- nu_e    e+)
     0.00000000E+00    3     1000037       -12        11   # BR(~chi_30 -> ~chi_2+ nu_eb   e-)
     0.00000000E+00    3    -1000037        12       -11   # BR(~chi_30 -> ~chi_2- nu_e    e+)
     5.44065423E-03    3     1000024       -14        13   # BR(~chi_30 -> ~chi_1+ nu_mub  mu-)
     5.44065423E-03    3    -1000024        14       -13   # BR(~chi_30 -> ~chi_1- nu_mu   mu+)
     0.00000000E+00    3     1000037       -14        13   # BR(~chi_30 -> ~chi_2+ nu_mub  mu-)
     0.00000000E+00    3    -1000037        14       -13   # BR(~chi_30 -> ~chi_2- nu_mu   mu+)
     5.40729600E-03    3     1000024       -16        15   # BR(~chi_30 -> ~chi_1+ nu_taub tau-)
     5.40729600E-03    3    -1000024        16       -15   # BR(~chi_30 -> ~chi_1- nu_tau  tau+)
     0.00000000E+00    3     1000037       -16        15   # BR(~chi_30 -> ~chi_2+ nu_taub tau-)
     0.00000000E+00    3    -1000037        16       -15   # BR(~chi_30 -> ~chi_2- nu_tau  tau+)
     0.00000000E+00    3     1000021        -2         2   # BR(~chi_30 -> ~g      ub      u)
     0.00000000E+00    3     1000021        -1         1   # BR(~chi_30 -> ~g      db      d)
     0.00000000E+00    3     1000021        -4         4   # BR(~chi_30 -> ~g      cb      c)
     0.00000000E+00    3     1000021        -3         3   # BR(~chi_30 -> ~g      sb      s)
     0.00000000E+00    3     1000021        -6         6   # BR(~chi_30 -> ~g      tb      t)
     0.00000000E+00    3     1000021        -5         5   # BR(~chi_30 -> ~g      bb      b)
#
#         PDG            Width
DECAY   1000035     1.11657780E+00   # neutralino4 decays
#          BR         NDA      ID1       ID2
     8.89234874E-04    2     1000022        23   # BR(~chi_40 -> ~chi_10   Z )
     5.45136524E-03    2     1000023        23   # BR(~chi_40 -> ~chi_20   Z )
     2.62091367E-01    2     1000025        23   # BR(~chi_40 -> ~chi_30   Z )
     3.51786869E-01    2     1000024       -24   # BR(~chi_40 -> ~chi_1+   W-)
     3.51786869E-01    2    -1000024        24   # BR(~chi_40 -> ~chi_1-   W+)
     0.00000000E+00    2     1000037       -24   # BR(~chi_40 -> ~chi_2+   W-)
     0.00000000E+00    2    -1000037        24   # BR(~chi_40 -> ~chi_2-   W+)
     4.31246958E-06    2     1000022        25   # BR(~chi_40 -> ~chi_10   h )
     0.00000000E+00    2     1000022        35   # BR(~chi_40 -> ~chi_10   H )
     0.00000000E+00    2     1000022        36   # BR(~chi_40 -> ~chi_10   A )
     2.79899823E-02    2     1000023        25   # BR(~chi_40 -> ~chi_20   h )
     0.00000000E+00    2     1000023        35   # BR(~chi_40 -> ~chi_20   H )
     0.00000000E+00    2     1000023        36   # BR(~chi_40 -> ~chi_20   A )
     0.00000000E+00    2     1000025        25   # BR(~chi_40 -> ~chi_30   h )
     0.00000000E+00    2     1000025        35   # BR(~chi_40 -> ~chi_30   H )
     0.00000000E+00    2     1000025        36   # BR(~chi_40 -> ~chi_30   A )
     0.00000000E+00    2     1000024       -37   # BR(~chi_40 -> ~chi_1+   H-)
     0.00000000E+00    2    -1000024        37   # BR(~chi_40 -> ~chi_1-   H+)
     0.00000000E+00    2     1000037       -37   # BR(~chi_40 -> ~chi_2+   H-)
     0.00000000E+00    2    -1000037        37   # BR(~chi_40 -> ~chi_2-   H+)
     0.00000000E+00    2     1000002        -2   # BR(~chi_40 -> ~u_L      ub)
     0.00000000E+00    2    -1000002         2   # BR(~chi_40 -> ~u_L*     u )
     0.00000000E+00    2     2000002        -2   # BR(~chi_40 -> ~u_R      ub)
     0.00000000E+00    2    -2000002         2   # BR(~chi_40 -> ~u_R*     u )
     0.00000000E+00    2     1000001        -1   # BR(~chi_40 -> ~d_L      db)
     0.00000000E+00    2    -1000001         1   # BR(~chi_40 -> ~d_L*     d )
     0.00000000E+00    2     2000001        -1   # BR(~chi_40 -> ~d_R      db)
     0.00000000E+00    2    -2000001         1   # BR(~chi_40 -> ~d_R*     d )
     0.00000000E+00    2     1000004        -4   # BR(~chi_40 -> ~c_L      cb)
     0.00000000E+00    2    -1000004         4   # BR(~chi_40 -> ~c_L*     c )
     0.00000000E+00    2     2000004        -4   # BR(~chi_40 -> ~c_R      cb)
     0.00000000E+00    2    -2000004         4   # BR(~chi_40 -> ~c_R*     c )
     0.00000000E+00    2     1000003        -3   # BR(~chi_40 -> ~s_L      sb)
     0.00000000E+00    2    -1000003         3   # BR(~chi_40 -> ~s_L*     s )
     0.00000000E+00    2     2000003        -3   # BR(~chi_40 -> ~s_R      sb)
     0.00000000E+00    2    -2000003         3   # BR(~chi_40 -> ~s_R*     s )
     0.00000000E+00    2     1000006        -6   # BR(~chi_40 -> ~t_1      tb)
     0.00000000E+00    2    -1000006         6   # BR(~chi_40 -> ~t_1*     t )
     0.00000000E+00    2     2000006        -6   # BR(~chi_40 -> ~t_2      tb)
     0.00000000E+00    2    -2000006         6   # BR(~chi_40 -> ~t_2*     t )
     0.00000000E+00    2     1000005        -5   # BR(~chi_40 -> ~b_1      bb)
     0.00000000E+00    2    -1000005         5   # BR(~chi_40 -> ~b_1*     b )
     0.00000000E+00    2     2000005        -5   # BR(~chi_40 -> ~b_2      bb)
     0.00000000E+00    2    -2000005         5   # BR(~chi_40 -> ~b_2*     b )
     0.00000000E+00    2     1000011       -11   # BR(~chi_40 -> ~e_L-     e+)
     0.00000000E+00    2    -1000011        11   # BR(~chi_40 -> ~e_L+     e-)
     0.00000000E+00    2     2000011       -11   # BR(~chi_40 -> ~e_R-     e+)
     0.00000000E+00    2    -2000011        11   # BR(~chi_40 -> ~e_R+     e-)
     0.00000000E+00    2     1000013       -13   # BR(~chi_40 -> ~mu_L-    mu+)
     0.00000000E+00    2    -1000013        13   # BR(~chi_40 -> ~mu_L+    mu-)
     0.00000000E+00    2     2000013       -13   # BR(~chi_40 -> ~mu_R-    mu+)
     0.00000000E+00    2    -2000013        13   # BR(~chi_40 -> ~mu_R+    mu-)
     0.00000000E+00    2     1000015       -15   # BR(~chi_40 -> ~tau_1-   tau+)
     0.00000000E+00    2    -1000015        15   # BR(~chi_40 -> ~tau_1+   tau-)
     0.00000000E+00    2     2000015       -15   # BR(~chi_40 -> ~tau_2-   tau+)
     0.00000000E+00    2    -2000015        15   # BR(~chi_40 -> ~tau_2+   tau-)
     0.00000000E+00    2     1000012       -12   # BR(~chi_40 -> ~nu_eL    nu_eb)
     0.00000000E+00    2    -1000012        12   # BR(~chi_40 -> ~nu_eL*   nu_e )
     0.00000000E+00    2     1000014       -14   # BR(~chi_40 -> ~nu_muL   nu_mub)
     0.00000000E+00    2    -1000014        14   # BR(~chi_40 -> ~nu_muL*  nu_mu )
     0.00000000E+00    2     1000016       -16   # BR(~chi_40 -> ~nu_tau1  nu_taub)
     0.00000000E+00    2    -1000016        16   # BR(~chi_40 -> ~nu_tau1* nu_tau )
