#  ISAJET SUSY parameters in SUSY Les Houches Accord 2 format
#  Created by ISALHA 2.0 Last revision: C. Balazs 21 Apr 2009
Block SPINFO   # Program information
     1   ISASUGRA from ISAJET          # Spectrum Calculator
     2   7.80   29-OCT-2009 12:50:36   # Version number
Block MODSEL   # Model selection
     1    13   # Non-universal supergravity model                  
Block SMINPUTS   # Standard Model inputs
     1     1.27836243E+02   # alpha_em^(-1)
     2     1.16570000E-05   # G_Fermi
     3     1.17200002E-01   # alpha_s(M_Z)
     4     9.11699982E+01   # m_{Z}(pole)
     5     4.19999981E+00   # m_{b}(m_{b})
     6     1.72500000E+02   # m_{top}(pole)
     7     1.77699995E+00   # m_{tau}(pole)
Block MINPAR   # SUSY breaking input parameters
     1     5.00000000E+03   # m_0
     2     5.00000000E+03   # m_{1/2}
     3     1.04999995E+00   # tan(beta)
     4     1.00000000E+00   # sign(mu)
     5     0.00000000E+00   # A_0
Block EXTPAR   # Non-universal SUSY breaking parameters
     0     1.00000000E+04   # Input scale
    21    -1.21530960E+07   # Down type Higgs mass squared
    22    -1.21524730E+07   #  Up  type Higgs mass squared
     1     0.00000000E+00   #  U(1)_Y gaugino (Bino) mass
     2     5.00000000E+03   # SU(2)_L gaugino (Wino) mass
     3     5.00000000E+02   # SU(3)_C gaugino (gluino) mass
    34     5.00000000E+03   # Right scalar electron mass
    31     5.00000000E+03   # Left 1st gen. slepton mass
    47     5.00000000E+02   # Right scalar down mass
    44     5.00000000E+02   # Right scalar  up  mass
    41     5.00000000E+02   # Left 1st gen. squark mass
    36     5.00000000E+03   # Right scalar tau mass
    33     5.00000000E+03   # Left 3rd gen. slepton mass
    49     5.00000000E+03   # Right scalar bottom mass
    46     5.00000000E+03   # Right scalar top mass
    43     5.00000000E+03   # Left 3rd gen. squark mass
Block MASS   # Scalar and gaugino mass spectrum
#  PDG code   mass                 particle
        24     8.04229965E+01   #  W^+
        25     5.00000000e+03   #  h^0            
        35     5.00000000e+03   #  H^0            
        36     5.00000000e+03   #  A^0            
        37     5.00000000e+03   #  H^+            
   1000001     9.00000000e+02   #  dnl            
   1000002     9.00000000e+02   #  upl            
   1000003     9.00000000e+02   #  stl            
   1000004     9.00000000e+02   #  chl            
   1000005     5.00000000e+03   #  b1             
   1000006     5.00000000e+03   #  t1             
   1000011     5.00000000e+03   #  el-            
   1000012     5.00000000e+03   #  nuel           
   1000013     5.00000000e+03   #  mul-           
   1000014     5.00000000e+03   #  numl           
   1000015     5.00000000e+03   #  tau1           
   1000016     5.00000000e+03   #  nutl           
   1000021     2.00000000e+03   #  glss           
   1000022     2.95000000e+02   #  z1ss           
   1000023     5.00000000e+03   #  z2ss           
   1000024     5.00000000e+03   #  w1ss           
   1000025     5.00000000e+03   #  z3ss           
   1000035     5.00000000e+03   #  z4ss           
   1000037     5.00000000e+03   #  w2ss           
   2000001     9.00000000e+02   #  dnr            
   2000002     9.00000000e+02   #  upr            
   2000003     9.00000000e+02   #  str            
   2000004     9.00000000e+02   #  chr            
   2000005     5.00000000e+03   #  b2             
   2000006     5.00000000e+03   #  t2             
   2000011     5.00000000e+03   #  er-            
   2000013     5.00000000e+03   #  mur-           
   2000015     5.00000000e+03   #  tau2           
Block ALPHA   # Effective Higgs mixing parameter
         -7.61225343E-01   # alpha
Block STOPMIX   # stop mixing matrix
  1  1     4.11578804E-01   # O_{11}
  1  2     9.11374152E-01   # O_{12}
  2  1    -9.11374152E-01   # O_{21}
  2  2     4.11578804E-01   # O_{22}
Block SBOTMIX   # sbottom mixing matrix
  1  1     7.21292436E-01   # O_{11}
  1  2     6.92630649E-01   # O_{12}
  2  1    -6.92630649E-01   # O_{21}
  2  2     7.21292436E-01   # O_{22}
Block STAUMIX   # stau mixing matrix
  1  1     1.15967337E-02   # O_{11}
  1  2     9.99932766E-01   # O_{12}
  2  1    -9.99932766E-01   # O_{21}
  2  2     1.15967337E-02   # O_{22}
Block NMIX   # neutralino mixing matrix
  1  1     9.99965727E-01   #
  1  2     6.19883998E-04   #
  1  3     5.98469656E-03   #
  1  4    -5.69890067E-03   #
  2  1    -3.05461744E-03   #
  2  2    -8.99356544E-01   #
  2  3     3.09205741E-01   #
  2  4    -3.09095919E-01   #
  3  1    -2.02044539E-04   #
  3  2     8.11236241E-05   #
  3  3     7.07098126E-01   #
  3  4     7.07115471E-01   #
  4  1    -7.70109193E-03   #
  4  2     4.37215477E-01   #
  4  3     6.35899603E-01   #
  4  4    -6.35936439E-01   #
Block UMIX   # chargino U mixing matrix
  1  1    -8.51988018E-01   # U_{11}
  1  2     5.23561239E-01   # U_{12}
  2  1    -5.23561239E-01   # U_{21}
  2  2    -8.51988018E-01   # U_{22}
Block VMIX   # chargino V mixing matrix
  1  1    -8.51987004E-01   # V_{11}
  1  2     5.23562908E-01   # V_{12}
  2  1    -5.23562908E-01   # V_{21}
  2  2    -8.51987004E-01   # V_{22}
Block GAUGE Q=  4.95367969E+03   #
     1     3.57524991E-01   # g`
     2     6.52378619E-01   # g_2
     3     1.21928000E+00   # g_3
Block YU Q=  4.95367969E+03   #
  3  3     1.11666286E+00   # y_t
Block YD Q=  4.95367969E+03   #
  3  3     1.78913847E-02   # y_b
Block YE Q=  4.95367969E+03   #
  3  3     1.46171292E-02   # y_tau
Block HMIX Q=  4.95367969E+03   # Higgs mixing parameters
     1     5.00000000E+03   # mu(Q)
     2     1.04999995E+00   # tan(beta)(M_GUT)
     3     2.52928284E+02   # Higgs vev at Q
     4     2.50000000E+07   # m_A^2(Q)
Block MSOFT Q=  4.95367969E+03   # DRbar SUSY breaking parameters
     1    -2.49941841E-01   # M_1(Q)          
     2     4.97828369E+03   # M_2(Q)          
     3     5.71167542E+02   # M_3(Q)          
    31     5.02573047E+03   # MeL(Q)          
    32     5.02573047E+03   # MmuL(Q)         
    33     5.02622510E+03   # MtauL(Q)        
    34     4.99976221E+03   # MeR(Q)          
    35     4.99976221E+03   # MmuR(Q)         
    36     4.99974414E+03   # MtauR(Q)        
    41     1.03033508E+03   # MqL1(Q)         
    42     1.03033508E+03   # MqL2(Q)         
    43     4.98691504E+03   # MqL3(Q)         
    44     4.90182617E+02   # MuR(Q)          
    45     4.90182617E+02   # McR(Q)          
    46     4.92066553E+03   # MtR(Q)          
    47     4.83325043E+02   # MdR(Q)          
    48     4.83325043E+02   # MsR(Q)          
    49     4.99957080E+03   # MbR(Q)          
Block AU Q=  4.95367969E+03   #
  1  1    -7.30358887E+01   # A_u
  2  2    -7.30358887E+01   # A_c
  3  3    -7.30358887E+01   # A_t
Block AD Q=  4.95367969E+03   #
  1  1    -7.64760590E+01   # A_d
  2  2    -7.64760590E+01   # A_s
  3  3    -7.64760590E+01   # A_b
Block AE Q=  4.95367969E+03   #
  1  1    -5.29883537E+01   # A_e
  2  2    -5.29883537E+01   # A_mu
  3  3    -5.29883537E+01   # A_tau
#  ISAJET decay tables in SUSY Les Houches accord format
#  Created by ISALHD. Last revision: C. Balazs, 2005 May 25
Block DCINFO                           # Program information
     1   ISASUGRA from ISAJET          # Spectrum Calculator
     2   7.80   29-OCT-2009 12:50:36   # Version number
#         PDG         Width
DECAY         6  1.14680767E+00   # TP    decays
#          BR          NDA       ID1       ID2       ID3       ID4
      3.33333343E-01    3            2        -1         5             # TP     -->  UP     DB     BT          
      3.33333343E-01    3            4        -3         5             # TP     -->  CH     SB     BT          
      1.11111112E-01    3          -11        12         5             # TP     -->  E+     NUE    BT          
      1.11111112E-01    3          -13        14         5             # TP     -->  MU+    NUM    BT          
      1.11111112E-01    3          -15        16         5             # TP     -->  TAU+   NUT    BT          
#         PDG         Width
DECAY   1000021  2.18765747E+02   # GLSS  decays
#          BR          NDA       ID1       ID2       ID3       ID4
      2.40455381E-11    2      1000022        21                       # GLSS   -->  Z1SS   GL                 
      1.13301788E-07    3      1000022         5        -5             # GLSS   -->  Z1SS   BT     BB          
      3.23670179E-07    3      1000022         6        -6             # GLSS   -->  Z1SS   TP     TB          
      6.25054762E-02    2     -1000002         2                       # GLSS   -->  UBL    UP                 
      6.25054762E-02    2      1000002        -2                       # GLSS   -->  UPL    UB                 
      6.24932833E-02    2     -1000001         1                       # GLSS   -->  DBL    DN                 
      6.24932833E-02    2      1000001        -1                       # GLSS   -->  DNL    DB                 
      6.25024438E-02    2     -2000002         2                       # GLSS   -->  UBR    UP                 
      6.25024438E-02    2      2000002        -2                       # GLSS   -->  UPR    UB                 
      6.24987744E-02    2     -2000001         1                       # GLSS   -->  DBR    DN                 
      6.24987744E-02    2      2000001        -1                       # GLSS   -->  DNR    DB                 
      6.24932833E-02    2     -1000003         3                       # GLSS   -->  SBL    ST                 
      6.24932833E-02    2      1000003        -3                       # GLSS   -->  STL    SB                 
      6.24987669E-02    2     -2000003         3                       # GLSS   -->  SBR    ST                 
      6.24987669E-02    2      2000003        -3                       # GLSS   -->  STR    SB                 
      6.25053942E-02    2     -1000004         4                       # GLSS   -->  CBL    CH                 
      6.25053942E-02    2      1000004        -4                       # GLSS   -->  CHL    CB                 
      6.25023693E-02    2     -2000004         4                       # GLSS   -->  CBR    CH                 
      6.25023693E-02    2      2000004        -4                       # GLSS   -->  CHR    CB                 
#         PDG         Width
DECAY   1000002  1.01170495E-01   # UPL   decays
#          BR          NDA       ID1       ID2       ID3       ID4
      1.00000000E+00    2      1000022         2                       # UPL    -->  Z1SS   UP                 
#         PDG         Width
DECAY   1000001  1.01554334E-01   # DNL   decays
#          BR          NDA       ID1       ID2       ID3       ID4
      1.00000000E+00    2      1000022         1                       # DNL    -->  Z1SS   DN                 
#         PDG         Width
DECAY   1000003  1.01554334E-01   # STL   decays
#          BR          NDA       ID1       ID2       ID3       ID4
      1.00000000E+00    2      1000022         3                       # STL    -->  Z1SS   ST                 
#         PDG         Width
DECAY   1000004  1.01170100E-01   # CHL   decays
#          BR          NDA       ID1       ID2       ID3       ID4
      1.00000000E+00    2      1000022         4                       # CHL    -->  Z1SS   CH                 
#         PDG         Width
DECAY   1000005  1.87793747E+02   # BT1   decays
#          BR          NDA       ID1       ID2       ID3       ID4
      9.38712060E-03    2      1000022         5                       # BT1    -->  Z1SS   BT                 
      2.89474137E-05    2      1000023         5                       # BT1    -->  Z2SS   BT                 
      9.90583897E-01    2      1000021         5                       # BT1    -->  GLSS   BT                 
#         PDG         Width
DECAY   1000006  1.93685501E+02   # TP1   decays
#          BR          NDA       ID1       ID2       ID3       ID4
      9.68720973E-01    2      1000021         6                       # TP1    -->  GLSS   TP                 
      3.12581323E-02    2      1000022         6                       # TP1    -->  Z1SS   TP                 
      2.08717192E-05    2      1000024         5                       # TP1    -->  W1SS+  BT                 
#         PDG         Width
DECAY   2000002  1.62168097E+00   # UPR   decays
#          BR          NDA       ID1       ID2       ID3       ID4
      1.00000000E+00    2      1000022         2                       # UPR    -->  Z1SS   UP                 
#         PDG         Width
DECAY   2000001  4.05455053E-01   # DNR   decays
#          BR          NDA       ID1       ID2       ID3       ID4
      1.00000000E+00    2      1000022         1                       # DNR    -->  Z1SS   DN                 
#         PDG         Width
DECAY   2000003  4.05455112E-01   # STR   decays
#          BR          NDA       ID1       ID2       ID3       ID4
      1.00000000E+00    2      1000022         3                       # STR    -->  Z1SS   ST                 
#         PDG         Width
DECAY   2000004  1.62167430E+00   # CHR   decays
#          BR          NDA       ID1       ID2       ID3       ID4
      1.00000000E+00    2      1000022         4                       # CHR    -->  Z1SS   CH                 
#         PDG         Width
DECAY   2000005  1.87588776E+02   # BT2   decays
#          BR          NDA       ID1       ID2       ID3       ID4
      9.30611975E-03    2      1000022         5                       # BT2    -->  Z1SS   BT                 
      2.74608574E-05    2      1000023         5                       # BT2    -->  Z2SS   BT                 
      9.90666449E-01    2      1000021         5                       # BT2    -->  GLSS   BT                 
#         PDG         Width
DECAY   2000006  1.89491699E+02   # TP2   decays
#          BR          NDA       ID1       ID2       ID3       ID4
      9.66976523E-01    2      1000021         6                       # TP2    -->  GLSS   TP                 
      6.29891802E-05    2      1000024         5                       # TP2    -->  W1SS+  BT                 
      2.10059388E-03    2           23   1000006                       # TP2    -->  Z0     TP1                
      1.08478088E-11    2           25   1000006                       # TP2    -->  HL0    TP1                
      3.08599081E-02    2      1000022         6                       # TP2    -->  Z1SS   TP                 
#         PDG         Width
DECAY   1000011  6.34175014E+00   # EL-   decays
#          BR          NDA       ID1       ID2       ID3       ID4
      9.94920671E-01    2      1000022        11                       # EL-    -->  Z1SS   E-                 
      1.70238758E-03    2      1000023        11                       # EL-    -->  Z2SS   E-                 
      2.61931471E-19    2      1000025        11                       # EL-    -->  Z3SS   E-                 
      3.37695749E-03    2     -1000024        12                       # EL-    -->  W1SS-  NUE                
#         PDG         Width
DECAY   1000013  6.34175014E+00   # MUL-  decays
#          BR          NDA       ID1       ID2       ID3       ID4
      9.94920671E-01    2      1000022        13                       # MUL-   -->  Z1SS   MU-                
      1.70238595E-03    2      1000023        13                       # MUL-   -->  Z2SS   MU-                
      3.37695749E-03    2     -1000024        14                       # MUL-   -->  W1SS-  NUM                
#         PDG         Width
DECAY   1000015  1.58031282E+01   # TAU1- decays
#          BR          NDA       ID1       ID2       ID3       ID4
      9.98959601E-01    2      1000022        15                       # TAU1-  -->  Z1SS   TAU-               
      3.48443777E-04    2      1000023        15                       # TAU1-  -->  Z2SS   TAU-               
      6.91915629E-04    2     -1000024        16                       # TAU1-  -->  W1SS-  NUT                
#         PDG         Width
DECAY   1000012  6.34885073E+00   # NUEL  decays
#          BR          NDA       ID1       ID2       ID3       ID4
      9.94962692E-01    2      1000022        12                       # NUEL   -->  Z1SS   NUE                
      1.66396878E-03    2      1000023        12                       # NUEL   -->  Z2SS   NUE                
      3.37329041E-03    2      1000024        11                       # NUEL   -->  W1SS+  E-                 
      1.92413881E-19    3     -1000015        11        16             # NUEL   -->  TAU1+  E-     NUT         
#         PDG         Width
DECAY   1000014  6.34885073E+00   # NUML  decays
#          BR          NDA       ID1       ID2       ID3       ID4
      9.94962692E-01    2      1000022        14                       # NUML   -->  Z1SS   NUM                
      1.66396878E-03    2      1000023        14                       # NUML   -->  Z2SS   NUM                
      3.37328715E-03    2      1000024        13                       # NUML   -->  W1SS+  MU-                
      1.92414192E-19    3     -1000015        13        16             # NUML   -->  TAU1+  MU-    NUT         
#         PDG         Width
DECAY   1000016  6.34883499E+00   # NUTL  decays
#          BR          NDA       ID1       ID2       ID3       ID4
      9.94965196E-01    2      1000022        16                       # NUTL   -->  Z1SS   NUT                
      1.66397286E-03    2      1000023        16                       # NUTL   -->  Z2SS   NUT                
      3.37083940E-03    2      1000024        15                       # NUTL   -->  W1SS+  TAU-               
#         PDG         Width
DECAY   2000011  2.52528839E+01   # ER-   decays
#          BR          NDA       ID1       ID2       ID3       ID4
      9.99999940E-01    2      1000022        11                       # ER-    -->  Z1SS   E-                 
      4.64246277E-08    2      1000023        11                       # ER-    -->  Z2SS   E-                 
      3.09508083E-19    2      1000025        11                       # ER-    -->  Z3SS   E-                 
      2.48059615E-23    3      1000015        12       -16             # ER-    -->  TAU1-  NUE    ANUT        
#         PDG         Width
DECAY   2000013  2.52528839E+01   # MUR-  decays
#          BR          NDA       ID1       ID2       ID3       ID4
      9.99999940E-01    2      1000022        13                       # MUR-   -->  Z1SS   MU-                
      4.64245851E-08    2      1000023        13                       # MUR-   -->  Z2SS   MU-                
      5.23710567E-20    3      1000015        14       -16             # MUR-   -->  TAU1-  NUM    ANUT        
#         PDG         Width
DECAY   2000015  1.57914867E+01   # TAU2- decays
#          BR          NDA       ID1       ID2       ID3       ID4
      9.99002457E-01    2      1000022        15                       # TAU2-  -->  Z1SS   TAU-               
      3.34292592E-04    2      1000023        15                       # TAU2-  -->  Z2SS   TAU-               
      6.63228508E-04    2     -1000024        16                       # TAU2-  -->  W1SS-  NUT                
#         PDG         Width
DECAY   1000023  1.18195679E+02   # Z2SS  decays
#          BR          NDA       ID1       ID2       ID3       ID4
      5.60701263E-10    2      1000022        22                       # Z2SS   -->  Z1SS   GM                 
      6.91868854E-06    2      1000022        23                       # Z2SS   -->  Z1SS   Z0                 
      4.45674777E-06    3      1000022         5        -5             # Z2SS   -->  Z1SS   BT     BB          
      1.34011980E-05    3      1000022        11       -11             # Z2SS   -->  Z1SS   E-     E+          
      1.34011980E-05    3      1000022        13       -13             # Z2SS   -->  Z1SS   MU-    MU+         
      1.34490529E-05    3      1000022        15       -15             # Z2SS   -->  Z1SS   TAU-   TAU+        
      1.31341221E-05    3      1000022        12       -12             # Z2SS   -->  Z1SS   NUE    ANUE        
      1.31341221E-05    3      1000022        14       -14             # Z2SS   -->  Z1SS   NUM    ANUM        
      1.31341221E-05    3      1000022        16       -16             # Z2SS   -->  Z1SS   NUT    ANUT        
      1.52700106E-02    2      1000022        25                       # Z2SS   -->  Z1SS   HL0                
      1.23507529E-01    2      1000002        -2                       # Z2SS   -->  UPL    UB                 
      1.23507529E-01    2     -1000002         2                       # Z2SS   -->  UBL    UP                 
      1.22644722E-01    2      1000001        -1                       # Z2SS   -->  DNL    DB                 
      1.22644722E-01    2     -1000001         1                       # Z2SS   -->  DBL    DN                 
      1.22644722E-01    2      1000003        -3                       # Z2SS   -->  STL    SB                 
      1.22644722E-01    2     -1000003         3                       # Z2SS   -->  SBL    ST                 
      1.23507500E-01    2      1000004        -4                       # Z2SS   -->  CHL    CB                 
      1.23507500E-01    2     -1000004         4                       # Z2SS   -->  CBL    CH                 
      6.00258909E-06    2      2000002        -2                       # Z2SS   -->  UPR    UB                 
      6.00258909E-06    2     -2000002         2                       # Z2SS   -->  UBR    UP                 
      1.50063522E-06    2      2000001        -1                       # Z2SS   -->  DNR    DB                 
      1.50063522E-06    2     -2000001         1                       # Z2SS   -->  DBR    DN                 
      1.50063522E-06    2      2000003        -3                       # Z2SS   -->  STR    SB                 
      1.50063522E-06    2     -2000003         3                       # Z2SS   -->  SBR    ST                 
      6.00258818E-06    2      2000004        -4                       # Z2SS   -->  CHR    CB                 
      6.00258818E-06    2     -2000004         4                       # Z2SS   -->  CBR    CH                 
#         PDG         Width
DECAY   1000025  3.62069201E+00   # Z3SS  decays
#          BR          NDA       ID1       ID2       ID3       ID4
      7.13815871E-06    2      1000022        22                       # Z3SS   -->  Z1SS   GM                 
      1.14641234E-13    2      1000023        22                       # Z3SS   -->  Z2SS   GM                 
      7.93673273E-04    3     -1000024         2        -1             # Z3SS   -->  W1SS-  UP     DB          
      2.64557748E-04    3     -1000024        12       -11             # Z3SS   -->  W1SS-  NUE    E+          
      2.64557748E-04    3     -1000024        14       -13             # Z3SS   -->  W1SS-  NUM    MU+         
      7.93673273E-04    3      1000024         1        -2             # Z3SS   -->  W1SS+  DN     UB          
      2.64557748E-04    3      1000024        11       -12             # Z3SS   -->  W1SS+  E-     ANUE        
      2.64557748E-04    3      1000024        13       -14             # Z3SS   -->  W1SS+  MU-    ANUM        
      7.93673273E-04    3     -1000024         4        -3             # Z3SS   -->  W1SS-  CH     SB          
      2.64557748E-04    3     -1000024        16       -15             # Z3SS   -->  W1SS-  NUT    TAU+        
      7.93673273E-04    3      1000024         3        -4             # Z3SS   -->  W1SS+  ST     CB          
      2.64557748E-04    3      1000024        15       -16             # Z3SS   -->  W1SS+  TAU-   ANUT        
      9.93807971E-01    2      1000022        23                       # Z3SS   -->  Z1SS   Z0                 
      2.13432622E-06    3      1000022         5        -5             # Z3SS   -->  Z1SS   BT     BB          
      2.30863315E-10    3      1000022        11       -11             # Z3SS   -->  Z1SS   E-     E+          
      2.30863315E-10    3      1000022        13       -13             # Z3SS   -->  Z1SS   MU-    MU+         
      1.77802588E-06    3      1000022        15       -15             # Z3SS   -->  Z1SS   TAU-   TAU+        
      1.13630958E-04    3      1000023         2        -2             # Z3SS   -->  Z2SS   UP     UB          
      1.46527891E-04    3      1000023         1        -1             # Z3SS   -->  Z2SS   DN     DB          
      1.46527891E-04    3      1000023         3        -3             # Z3SS   -->  Z2SS   ST     SB          
      1.13630958E-04    3      1000023         4        -4             # Z3SS   -->  Z2SS   CH     CB          
      1.44125923E-04    3      1000023         5        -5             # Z3SS   -->  Z2SS   BT     BB          
      3.32396958E-05    3      1000023        11       -11             # Z3SS   -->  Z2SS   E-     E+          
      3.32396958E-05    3      1000023        13       -13             # Z3SS   -->  Z2SS   MU-    MU+         
      3.31199990E-05    3      1000023        15       -15             # Z3SS   -->  Z2SS   TAU-   TAU+        
      6.61366939E-05    3      1000023        12       -12             # Z3SS   -->  Z2SS   NUE    ANUE        
      6.61366939E-05    3      1000023        14       -14             # Z3SS   -->  Z2SS   NUM    ANUM        
      6.61366939E-05    3      1000023        16       -16             # Z3SS   -->  Z2SS   NUT    ANUT        
      4.52983222E-04    2      1000022        25                       # Z3SS   -->  Z1SS   HL0                
      1.20698979E-10    2      1000023        25                       # Z3SS   -->  Z2SS   HL0                
      2.05807950E-07    2      1000002        -2                       # Z3SS   -->  UPL    UB                 
      2.05807950E-07    2     -1000002         2                       # Z3SS   -->  UBL    UP                 
      4.44582753E-07    2      1000001        -1                       # Z3SS   -->  DNL    DB                 
      4.44582753E-07    2     -1000001         1                       # Z3SS   -->  DBL    DN                 
      4.44582753E-07    2      1000003        -3                       # Z3SS   -->  STL    SB                 
      4.44582753E-07    2     -1000003         3                       # Z3SS   -->  SBL    ST                 
      2.05807908E-07    2      1000004        -4                       # Z3SS   -->  CHL    CB                 
      2.05807908E-07    2     -1000004         4                       # Z3SS   -->  CBL    CH                 
      1.81676668E-07    2      2000002        -2                       # Z3SS   -->  UPR    UB                 
      1.81676668E-07    2     -2000002         2                       # Z3SS   -->  UBR    UP                 
      4.54188189E-08    2      2000001        -1                       # Z3SS   -->  DNR    DB                 
      4.54188189E-08    2     -2000001         1                       # Z3SS   -->  DBR    DN                 
      4.54188189E-08    2      2000003        -3                       # Z3SS   -->  STR    SB                 
      4.54188189E-08    2     -2000003         3                       # Z3SS   -->  SBR    ST                 
      1.81676640E-07    2      2000004        -4                       # Z3SS   -->  CHR    CB                 
      1.81676640E-07    2     -2000004         4                       # Z3SS   -->  CBR    CH                 
      2.22494578E-17    2      1000012       -12                       # Z3SS   -->  NUEL   ANUE               
      2.22494578E-17    2     -1000012        12                       # Z3SS   -->  ANUEL  NUE                
      2.22494578E-17    2      1000014       -14                       # Z3SS   -->  NUML   ANUM               
      2.22494578E-17    2     -1000014        14                       # Z3SS   -->  ANUML  NUM                
      2.22494578E-17    2      1000016       -16                       # Z3SS   -->  NUTL   ANUT               
      2.22494578E-17    2     -1000016        16                       # Z3SS   -->  ANUTL  NUT                
#         PDG         Width
DECAY   1000035  1.25266724E+02   # Z4SS  decays
#          BR          NDA       ID1       ID2       ID3       ID4
      2.33358890E-07    2      1000022        22                       # Z4SS   -->  Z1SS   GM                 
      1.71762382E-09    2      1000023        22                       # Z4SS   -->  Z2SS   GM                 
      3.05335479E-10    2      1000025        22                       # Z4SS   -->  Z3SS   GM                 
      1.33360643E-02    2      1000024       -24                       # Z4SS   -->  W1SS+  W-                 
      1.33360643E-02    2     -1000024        24                       # Z4SS   -->  W1SS-  W+                 
      6.97427367E-06    2      1000022        23                       # Z4SS   -->  Z1SS   Z0                 
      1.26291244E-13    2      1000023        23                       # Z4SS   -->  Z2SS   Z0                 
      1.54717057E-08    3      1000022         5        -5             # Z4SS   -->  Z1SS   BT     BB          
      2.42113996E-09    3      1000022        15       -15             # Z4SS   -->  Z1SS   TAU-   TAU+        
      1.70489154E-21    3      1000023         5        -5             # Z4SS   -->  Z2SS   BT     BB          
      2.69049128E-22    3      1000023        15       -15             # Z4SS   -->  Z2SS   TAU-   TAU+        
      3.42807152E-06    3      1000025         2        -2             # Z4SS   -->  Z3SS   UP     UB          
      4.42052078E-06    3      1000025         1        -1             # Z4SS   -->  Z3SS   DN     DB          
      4.42052078E-06    3      1000025         3        -3             # Z4SS   -->  Z3SS   ST     SB          
      3.42807152E-06    3      1000025         4        -4             # Z4SS   -->  Z3SS   CH     CB          
      4.35957054E-06    3      1000025         5        -5             # Z4SS   -->  Z3SS   BT     BB          
      1.00279294E-06    3      1000025        11       -11             # Z4SS   -->  Z3SS   E-     E+          
      1.00279294E-06    3      1000025        13       -13             # Z4SS   -->  Z3SS   MU-    MU+         
      9.99306053E-07    3      1000025        15       -15             # Z4SS   -->  Z3SS   TAU-   TAU+        
      1.99524243E-06    3      1000025        12       -12             # Z4SS   -->  Z3SS   NUE    ANUE        
      1.99524243E-06    3      1000025        14       -14             # Z4SS   -->  Z3SS   NUM    ANUM        
      1.99524243E-06    3      1000025        16       -16             # Z4SS   -->  Z3SS   NUT    ANUT        
      1.39221633E-02    2      1000022        25                       # Z4SS   -->  Z1SS   HL0                
      1.20086852E-07    2      1000023        25                       # Z4SS   -->  Z2SS   HL0                
      4.04692729E-12    2      1000025        25                       # Z4SS   -->  Z3SS   HL0                
      1.19417951E-01    2      1000002        -2                       # Z4SS   -->  UPL    UB                 
      1.19417951E-01    2     -1000002         2                       # Z4SS   -->  UBL    UP                 
      1.20227858E-01    2      1000001        -1                       # Z4SS   -->  DNL    DB                 
      1.20227858E-01    2     -1000001         1                       # Z4SS   -->  DBL    DN                 
      1.20227858E-01    2      1000003        -3                       # Z4SS   -->  STL    SB                 
      1.20227858E-01    2     -1000003         3                       # Z4SS   -->  SBL    ST                 
      1.19417936E-01    2      1000004        -4                       # Z4SS   -->  CHL    CB                 
      1.19417936E-01    2     -1000004         4                       # Z4SS   -->  CBL    CH                 
      5.51450103E-06    2      2000002        -2                       # Z4SS   -->  UPR    UB                 
      5.51450103E-06    2     -2000002         2                       # Z4SS   -->  UBR    UP                 
      1.37861502E-06    2      2000001        -1                       # Z4SS   -->  DNR    DB                 
      1.37861502E-06    2     -2000001         1                       # Z4SS   -->  DBR    DN                 
      1.37861502E-06    2      2000003        -3                       # Z4SS   -->  STR    SB                 
      1.37861502E-06    2     -2000003         3                       # Z4SS   -->  SBR    ST                 
      5.51449966E-06    2      2000004        -4                       # Z4SS   -->  CHR    CB                 
      5.51449966E-06    2     -2000004         4                       # Z4SS   -->  CBR    CH                 
      6.07515867E-05    2      1000005        -5                       # Z4SS   -->  BT1    BB                 
      6.07515867E-05    2     -1000005         5                       # Z4SS   -->  BB1    BT                 
      6.54425967E-05    2      2000005        -5                       # Z4SS   -->  BT2    BB                 
      6.54425967E-05    2     -2000005         5                       # Z4SS   -->  BB2    BT                 
      4.17426963E-05    2      1000011       -11                       # Z4SS   -->  EL-    E+                 
      4.17426963E-05    2     -1000011        11                       # Z4SS   -->  EL+    E-                 
      4.17426636E-05    2      1000013       -13                       # Z4SS   -->  MUL-   MU+                
      4.17426636E-05    2     -1000013        13                       # Z4SS   -->  MUL+   MU-                
      4.36691705E-09    2      2000011       -11                       # Z4SS   -->  ER-    E+                 
      4.36691705E-09    2     -2000011        11                       # Z4SS   -->  ER+    E-                 
      4.36691305E-09    2      2000013       -13                       # Z4SS   -->  MUR-   MU+                
      4.36691305E-09    2     -2000013        13                       # Z4SS   -->  MUR+   MU-                
      2.03733671E-05    2      1000015       -15                       # Z4SS   -->  TAU1-  TAU+               
      2.03733671E-05    2     -1000015        15                       # Z4SS   -->  TAU1+  TAU-               
      2.13261665E-05    2      2000015       -15                       # Z4SS   -->  TAU2-  TAU+               
      2.13261665E-05    2     -2000015        15                       # Z4SS   -->  TAU2+  TAU-               
      4.26331972E-05    2      1000012       -12                       # Z4SS   -->  NUEL   ANUE               
      4.26331972E-05    2     -1000012        12                       # Z4SS   -->  ANUEL  NUE                
      4.26331972E-05    2      1000014       -14                       # Z4SS   -->  NUML   ANUM               
      4.26331972E-05    2     -1000014        14                       # Z4SS   -->  ANUML  NUM                
      4.26331972E-05    2      1000016       -16                       # Z4SS   -->  NUTL   ANUT               
      4.26331972E-05    2     -1000016        16                       # Z4SS   -->  ANUTL  NUT                
#         PDG         Width
DECAY   1000024  1.17890732E+02   # W1SS+ decays
#          BR          NDA       ID1       ID2       ID3       ID4
      2.65117760E-05    3      1000022       -11        12             # W1SS+  -->  Z1SS   E+     NUE         
      2.65117760E-05    3      1000022       -13        14             # W1SS+  -->  Z1SS   MU+    NUM         
      2.65600211E-05    3      1000022       -15        16             # W1SS+  -->  Z1SS   TAU+   NUT         
      1.53460596E-02    2      1000022        24                       # W1SS+  -->  Z1SS   W+                 
      2.46241778E-01    2      1000002        -1                       # W1SS+  -->  UPL    DB                 
      2.46042177E-01    2     -1000001         2                       # W1SS+  -->  DBL    UP                 
      2.46241763E-01    2      1000004        -3                       # W1SS+  -->  CHL    SB                 
      2.46048674E-01    2     -1000003         4                       # W1SS+  -->  SBL    CH                 
#         PDG         Width
DECAY   1000037  1.25357941E+02   # W2SS+ decays
#          BR          NDA       ID1       ID2       ID3       ID4
      2.23604935E-09    3      1000022       -15        16             # W2SS+  -->  Z1SS   TAU+   NUT         
      1.38733480E-02    2      1000022        24                       # W2SS+  -->  Z1SS   W+                 
      2.82544300E-18    3      1000023       -15        16             # W2SS+  -->  Z2SS   TAU+   NUT         
      1.33968107E-02    2      1000023        24                       # W2SS+  -->  Z2SS   W+                 
      2.63805105E-05    3      1000025         2        -1             # W2SS+  -->  Z3SS   UP     DB          
      2.63805105E-05    3      1000025         4        -3             # W2SS+  -->  Z3SS   CH     SB          
      8.79350318E-06    3      1000025       -11        12             # W2SS+  -->  Z3SS   E+     NUE         
      8.79350318E-06    3      1000025       -13        14             # W2SS+  -->  Z3SS   MU+    NUM         
      8.79350318E-06    3      1000025       -15        16             # W2SS+  -->  Z3SS   TAU+   NUT         
      2.39987418E-01    2      1000002        -1                       # W2SS+  -->  UPL    DB                 
      2.40169734E-01    2     -1000001         2                       # W2SS+  -->  DBL    UP                 
      2.39987373E-01    2      1000004        -3                       # W2SS+  -->  CHL    SB                 
      2.40175679E-01    2     -1000003         4                       # W2SS+  -->  SBL    CH                 
      1.37688898E-04    2      1000006        -5                       # W2SS+  -->  TP1    BB                 
      3.45156041E-05    2      2000006        -5                       # W2SS+  -->  TP2    BB                 
      8.41089059E-05    2      1000012       -11                       # W2SS+  -->  NUEL   E+                 
      8.41088331E-05    2      1000014       -13                       # W2SS+  -->  NUML   MU+                
      8.40469802E-05    2      1000016       -15                       # W2SS+  -->  NUTL   TAU+               
      8.41110668E-05    2     -1000011        12                       # W2SS+  -->  EL+    NUE                
      8.41110668E-05    2     -1000013        14                       # W2SS+  -->  MUL+   NUM                
      4.10948523E-05    2     -1000015        16                       # W2SS+  -->  TAU1+  NUT                
      4.29831853E-05    2     -2000015        16                       # W2SS+  -->  TAU2+  NUT                
      1.16537148E-02    2      1000024        23                       # W2SS+  -->  W1SS+  Z0                 
      2.09221906E-09    2      1000024        25                       # W2SS+  -->  W1SS+  HL0                
#         PDG         Width
DECAY        25  2.65251938E-03   # HL0   decays
#          BR          NDA       ID1       ID2       ID3       ID4
      4.96657959E-09    2           11       -11                       # HL0    -->  E-     E+                 
      2.09695630E-04    2           13       -13                       # HL0    -->  MU-    MU+                
      5.98712862E-02    2           15       -15                       # HL0    -->  TAU-   TAU+               
      6.27292684E-06    2            1        -1                       # HL0    -->  DN     DB                 
      2.53457204E-03    2            3        -3                       # HL0    -->  ST     SB                 
      8.77734303E-01    2            5        -5                       # HL0    -->  BT     BB                 
      2.00542650E-06    2            2        -2                       # HL0    -->  UP     UB                 
      4.01812159E-02    2            4        -4                       # HL0    -->  CH     CB                 
      7.12843379E-04    2           22        22                       # HL0    -->  GM     GM                 
      1.87478010E-02    2           21        21                       # HL0    -->  GL     GL                 
#         PDG         Width
DECAY        35  1.86492859E+02   # HH0   decays
#          BR          NDA       ID1       ID2       ID3       ID4
      5.05543133E-12    2           11       -11                       # HH0    -->  E-     E+                 
      2.13449425E-07    2           13       -13                       # HH0    -->  MU-    MU+                
      6.11351425E-05    2           15       -15                       # HH0    -->  TAU-   TAU+               
      6.12203532E-09    2            1        -1                       # HH0    -->  DN     DB                 
      2.47361322E-06    2            3        -3                       # HH0    -->  ST     SB                 
      5.11733582E-04    2            5        -5                       # HH0    -->  BT     BB                 
      1.61292435E-09    2            2        -2                       # HH0    -->  UP     UB                 
      1.90548180E-05    2            4        -4                       # HH0    -->  CH     CB                 
      9.99066412E-01    2            6        -6                       # HH0    -->  TP     TB                 
      9.49312891E-07    2           22        22                       # HH0    -->  GM     GM                 
      1.06277097E-04    2           21        21                       # HH0    -->  GL     GL                 
      1.00116586E-05    2           24       -24                       # HH0    -->  W+     W-                 
      5.13661689E-06    2           23        23                       # HH0    -->  Z0     Z0                 
      1.24741222E-08    2      1000022   1000022                       # HH0    -->  Z1SS   Z1SS               
      3.64016014E-05    2           25        25                       # HH0    -->  HL0    HL0                
      3.27769776E-05    2      1000002  -1000002                       # HH0    -->  UPL    UBL                
      6.57479541E-06    2      2000002  -2000002                       # HH0    -->  UPR    UBR                
      3.27378075E-05    2      1000004  -1000004                       # HH0    -->  CHL    CBL                
      6.55725944E-06    2      2000004  -2000004                       # HH0    -->  CHR    CBR                
      4.90993443E-05    2      1000001  -1000001                       # HH0    -->  DNL    DBL                
      1.64368453E-06    2      2000001  -2000001                       # HH0    -->  DNR    DBR                
      4.91004939E-05    2      1000003  -1000003                       # HH0    -->  STL    SBL                
      1.64347512E-06    2      2000003  -2000003                       # HH0    -->  STR    SBR                
#         PDG         Width
DECAY        36  1.85873993E+02   # HA0   decays
#          BR          NDA       ID1       ID2       ID3       ID4
      5.03991597E-12    2           11       -11                       # HA0    -->  E-     E+                 
      2.12794319E-07    2           13       -13                       # HA0    -->  MU-    MU+                
      6.09475428E-05    2           15       -15                       # HA0    -->  TAU-   TAU+               
      6.10350837E-09    2            1        -1                       # HA0    -->  DN     DB                 
      2.46612512E-06    2            3        -3                       # HA0    -->  ST     SB                 
      5.10536542E-04    2            5        -5                       # HA0    -->  BT     BB                 
      1.60667302E-09    2            2        -2                       # HA0    -->  UP     UB                 
      1.89940674E-05    2            4        -4                       # HA0    -->  CH     CB                 
      9.99190629E-01    2            6        -6                       # HA0    -->  TP     TB                 
      9.46606633E-07    2           22        22                       # HA0    -->  GM     GM                 
      1.08040178E-04    2           21        21                       # HA0    -->  GL     GL                 
      5.99996201E-06    2      1000022   1000022                       # HA0    -->  Z1SS   Z1SS               
      9.97013376E-06    2           25        23                       # HA0    -->  HL0    Z0                 
      7.68305086E-10    2      1000002  -2000002                       # HA0    -->  UPL    UBR                
      7.68305086E-10    2      2000002  -1000002                       # HA0    -->  UPR    UBL                
      4.46503836E-05    2      1000004  -2000004                       # HA0    -->  CHL    CBR                
      4.46503836E-05    2      2000004  -1000004                       # HA0    -->  CHR    CBL                
      2.40115372E-09    2      1000001  -2000001                       # HA0    -->  DNL    DBR                
      2.40115372E-09    2      2000001  -1000001                       # HA0    -->  DNR    DBL                
      9.70187671E-07    2      1000003  -2000003                       # HA0    -->  STL    SBR                
      9.70187671E-07    2      2000003  -1000003                       # HA0    -->  STR    SBL                
#         PDG         Width
DECAY        37  1.73668976E+02   # H+    decays
#          BR          NDA       ID1       ID2       ID3       ID4
      5.43024133E-12    2           12       -11                       # H+     -->  NUE    E+                 
      2.29274576E-07    2           14       -13                       # H+     -->  NUM    MU+                
      6.56677366E-05    2           16       -15                       # H+     -->  NUT    TAU+               
      7.72421238E-09    2            2        -1                       # H+     -->  UP     DB                 
      2.14863903E-05    2            4        -3                       # H+     -->  CH     SB                 
      9.99725759E-01    2            6        -5                       # H+     -->  TP     BB                 
      1.07474452E-05    2           25        24                       # H+     -->  HL0    W+                 
      8.70474469E-05    2      1000002  -1000001                       # H+     -->  UPL    DBL                
      5.11071407E-09    2      2000002  -2000001                       # H+     -->  UPR    DBR                
      8.69995492E-05    2      1000004  -1000003                       # H+     -->  CHL    SBL                
      2.06498680E-06    2      2000004  -2000003                       # H+     -->  CHR    SBR                
