# SUSY Les Houches Accord 2 - MSSM spectrum + Decays
# SPheno v3.1.10 
# W. Porod, Comput. Phys. Commun. 153 (2003) 275-315, hep-ph/0301101
# in case of problems send email to porod@physik.uni-wuerzburg.de
# Created: 30.05.2012,  11:34
Block SPINFO         # Program information
     1   SPheno      # spectrum calculator
     2   v3.1.10     # version number
#
Block SPhenoINFO     # SPheno specific information
    1      2         # using 2-loop RGEs
    2      1         # using running masses for boundary conditions at mZ
Block MODSEL  # Model selection
    4    1    # MSSM with explicit R-parity violation
Block MINPAR  # Input parameters
    3    1.00000000E+01  # tanb at m_Z    
    4    1.00000000E+00  # Sign(mu)
Block SMINPUTS  # SM parameters
         1     1.27934000E+02  # alpha_em^-1(MZ)^MSbar
         2     1.16639000E-05  # G_mu [GeV^-2]
         3     1.17200000E-01  # alpha_s(MZ)^MSbar
         4     9.11876000E+01  # m_Z(pole)
         5     4.25000000E+00  # m_b(m_b), MSbar
         6     1.72500000E+02  # m_t(pole)
         7     1.77700000E+00  # m_tau(pole)
         8     0.00000000E+00  # m_nu_3
        11     5.10998910E-04  # m_e(pole)
        12     0.00000000E+00  # m_nu_1
        13     1.05658000E-01  # m_muon(pole)
        14     0.00000000E+00  # m_nu_2
        21     5.00000000E-03  # m_d(2 GeV), MSbar
        22     3.00000000E-03  # m_u(2 GeV), MSbar
        23     1.05000000E-01  # m_s(2 GeV), MSbar
        24     1.27000000E+00  # m_c(m_c), MSbar
Block gauge Q=  1.01088788E+03  # (SUSY scale)
   1    3.62174199E-01  # g'(Q)^DRbar
   2    6.43211307E-01  # g(Q)^DRbar
   3    1.06835411E+00  # g3(Q)^DRbar
Block Yu Q=  1.01088788E+03  # (SUSY scale)
  1  1     8.66074978E-06   # Y_u(Q)^DRbar
  2  2     3.66638415E-03   # Y_c(Q)^DRbar
  3  3     8.70071598E-01   # Y_t(Q)^DRbar
Block Yd Q=  1.01088788E+03  # (SUSY scale)
  1  1     1.37803273E-04   # Y_d(Q)^DRbar
  2  2     2.89386725E-03   # Y_s(Q)^DRbar
  3  3     1.37475290E-01   # Y_b(Q)^DRbar
Block Ye Q=  1.01088788E+03  # (SUSY scale)
  1  1     2.84125821E-05   # Y_e(Q)^DRbar
  2  2     5.87479947E-03   # Y_mu(Q)^DRbar
  3  3     9.88006556E-02   # Y_tau(Q)^DRbar
Block Au Q=  1.01088788E+03  # (SUSY scale)
  1  1    -4.61452863E+02   # A_u(Q)^DRbar
  2  2    -4.61450557E+02   # A_c(Q)^DRbar
  3  3    -3.54140872E+02   # A_t(Q)^DRbar
Block Ad Q=  1.01088788E+03  # (SUSY scale)
  1  1    -5.66689666E+02   # A_d(Q)^DRbar
  2  2    -5.66687829E+02   # A_s(Q)^DRbar
  3  3    -5.28988124E+02   # A_b(Q)^DRbar
Block Ae Q=  1.01088788E+03  # (SUSY scale)
  1  1    -1.20083102E+02   # A_e(Q)^DRbar
  2  2    -1.20080852E+02   # A_mu(Q)^DRbar
  3  3    -1.19447002E+02   # A_tau(Q)^DRbar
Block MSOFT Q=  1.01088788E+03  # soft SUSY breaking masses at Q
   1    8.34283899E+01  # M_1
   2    1.55130265E+02  # M_2
   3    4.49594933E+02  # M_3
  21    1.88767725E+06  # M^2_(H,d)
  22   -6.46386847E+04  # M^2_(H,u)
  31    0.00000000E+00  # M_(L,11)
  32    0.00000000E+00  # M_(L,22)
  33    0.00000000E+00  # M_(L,33)
  34    0.00000000E+00  # M_(E,11)
  35    0.00000000E+00  # M_(E,22)
  36    0.00000000E+00  # M_(E,33)
  41    0.00000000E+00  # M_(Q,11)
  42    0.00000000E+00  # M_(Q,22)
  43    0.00000000E+00  # M_(Q,33)
  44    0.00000000E+00  # M_(U,11)
  45    0.00000000E+00  # M_(U,22)
  46    0.00000000E+00  # M_(U,33)
  47    0.00000000E+00  # M_(D,11)
  48    0.00000000E+00  # M_(D,22)
  49    0.00000000E+00  # M_(D,33)
Block RVKAPPA Q=  1.01088788E+03  # bilinear RP parameters at Q
         1     1.08781607E-01  # epsilon_1
         2    -1.13736517E-01  # epsilon_2
         3     1.13887694E-01  # epsilon_3
Block RVD Q=  1.01088788E+03  # bilinear RP parameters at Q
         1     7.00837100E+01  # Re( B_1 epsilon_1)
         2    -7.44956257E+01  # Re( B_2 epsilon_2)
         3     7.16309575E+01  # Re( B_3 epsilon_3)
Block RVSNVEV Q=  1.01088788E+03  # sneutrino vevs at Q
         1    -8.54655771E-03  # v_L_1
         2     9.09261029E-03  # v_L_2
         3    -8.80498060E-03  # v_L_3
Block SPhenoRP  # additional RP parameters
         4     2.13372440E-03  # Lambda_1 = v_d epsilon_1 + mu v_L1
         5     4.76879736E-02  # Lambda_2 = v_d epsilon_2 + mu v_L2
         6     4.76879736E-02  # Lambda_3 = v_d epsilon_3 + mu v_L3
         7     2.36210821E-03  # m^2_atm [eV^2]
         8     7.68426817E-05  # m^2_sol [eV^2]
         9     8.71339654E-01  # tan^2 theta_atm
        10     4.62497806E-01  # tan^2 theta_sol
        11     2.98703529E-03  # U_e3^2
        15     2.50376960E+01  # v_d
        16     2.50376960E+02  # v_u
Block MASS  # Mass spectrum
#   PDG code      mass          particle
         6     1.72500000E+02  # m_t(pole)
        23     9.11876000E+01  # m_Z(pole)
        24     8.03094851E+01  # W+
        25     1.13528321E+02  # leightest neutral scalar
   1000016     1.39310237E+03  # 2nd neutral scalar
   1000014     1.39897801E+03  # 3rd neutral scalar
   1000012     1.39899882E+03  # 4th neutral scalar
        35     1.41919055E+03  # 5th neutral scalar
   1000019     1.39310237E+03  # leightest pseudoscalar
   1000018     1.39897801E+03  # 2nd pseudoscalar
   1000017     1.39899882E+03  # 3rd pseudoscalar
        36     1.41906296E+03  # 4th pseudoscalar
   1000015     1.38851620E+03  # leightest charged scalar
   2000015     1.39630582E+03  # 2nd charged scalar
   1000013     1.40089128E+03  # 3rd charged scalar
   1000011     1.40095495E+03  # 4th charged scalar
   2000011     1.40159602E+03  # 5th charged scalar
   2000013     1.40159722E+03  # 6th charged scalar
        37     1.42171666E+03  # 7th charged scalar
   1000001     1.44553604E+03  # ~d_L
   2000001     1.44408485E+03  # ~d_R
   1000002     1.44349448E+03  # ~u_L
   2000002     1.44327375E+03  # ~u_R
   1000003     1.44553224E+03  # ~s_L
   2000003     1.44407615E+03  # ~s_R
   1000004     1.44353794E+03  # ~c_L
   2000004     1.44321500E+03  # ~c_R
   1000005     1.17884668E+03  # ~b_1
   2000005     1.43166034E+03  # ~b_2
   1000006     8.59414913E+02  # ~t_1
   2000006     1.18905806E+03  # ~t_2
   1000021     5.53567799E+02  # ~g
        12     3.01394381E-14  # nu_1
        14     8.76604757E-12  # nu_2
        16     4.93857449E-11  # nu_3
   1000022     7.99752309E+01  # chi_10
   1000023     1.49909963E+02  # chi_20
   1000025     3.34644593E+02  # chi_30
   1000035     3.53062828E+02  # chi_40
       -11     5.10998910E-04  # e+
       -13     1.05658000E-01  # mu+
       -15     1.77700000E+00  # tau+
   1000024     1.49435439E+02  # chi_1+
   1000037     3.54078236E+02  # chi_2+
# Higgs mixing
Block alpha # Effective Higgs mixing angle
          -1.04476342E-01   # alpha
Block Hmix Q=  1.01088788E+03  # Higgs mixing parameters
   1    3.24130168E+02  # mu
   2    9.63746739E+00  # tan[beta](Q)
   3    2.43617099E+02  # v(Q)
   4    1.98672794E+06  # m^2_A(Q)
Block staumix  # stau mixing matrix
   1  1     2.78860008E-01   # R_sta(1,1)
   1  2     9.60331763E-01   # R_sta(1,2)
   2  1    -9.60331763E-01   # R_sta(2,1)
   2  2     2.78860008E-01   # R_sta(2,2)
Block stopmix # stop mixing matrix
   1  1     9.90457862E-02   # Re[R_st(1,1)]
   1  2     9.95082877E-01   # Re[R_st(1,2)]
   2  1    -9.95082877E-01   # Re[R_st(2,1)]
   2  2     9.90457862E-02   # Re[R_st(2,2)]
Block sbotmix # sbottom mixing matrix
   1  1     9.99904799E-01   # Re[R_sb(1,1)]
   1  2     1.37983126E-02   # Re[R_sb(1,2)]
   2  1    -1.37983126E-02   # Re[R_sb(2,1)]
   2  2     9.99904799E-01   # Re[R_sb(2,2)]
Block Nmix # neutralino mixing matrix
   1  1    -9.82876927E-01   # Re[N(1,1)]
   1  2     6.66582886E-02   # Re[N(1,2)]
   1  3    -1.62710943E-01   # Re[N(1,3)]
   1  4     5.50887285E-02   # Re[N(1,4)]
   2  1    -1.18477348E-01   # Re[N(2,1)]
   2  2    -9.41037865E-01   # Re[N(2,2)]
   2  3     2.79806804E-01   # Re[N(2,3)]
   2  4    -1.48724602E-01   # Re[N(2,4)]
   3  1     6.78589421E-02   # Re[N(3,1)]
   3  2    -1.02066679E-01   # Re[N(3,2)]
   3  3    -6.92442108E-01   # Re[N(3,3)]
   3  4    -7.10986276E-01   # Re[N(3,4)]
   4  1     1.23738549E-01   # Re[N(4,1)]
   4  2    -3.15573767E-01   # Re[N(4,2)]
   4  3    -6.44792392E-01   # Re[N(4,3)]
   4  4     6.85087396E-01   # Re[N(4,4)]
Block Umix # chargino mixing matrix
   1  1    -9.10255649E-01   # Re[U(1,1)]
   1  2     4.14046603E-01   # Re[U(1,2)]
   2  1    -4.14046680E-01   # Re[U(2,1)]
   2  2    -9.10255480E-01   # Re[U(2,2)]
Block Vmix # chargino mixing matrix
   1  1    -9.77221523E-01   # Re[V(1,1)]
   1  2     2.12221804E-01   # Re[V(1,2)]
   2  1    -2.12221804E-01   # Re[V(2,1)]
   2  2    -9.77221523E-01   # Re[V(2,2)]
DECAY   2000001     6.44623520E+01   # ~d_R
#    BR                NDA      ID1      ID2
     1.24578168E-02    2     1000022         1   # BR(~d_R -> chi^0_1 d)
     1.84480476E-04    2     1000023         1   # BR(~d_R -> chi^0_2 d)
     5.81354288E-05    2     1000025         1   # BR(~d_R -> chi^0_3 d)
     1.79720303E-04    2     1000035         1   # BR(~d_R -> chi^0_4 d)
     9.87118926E-01    2     1000021         1   # BR(~d_R -> ~g d)
DECAY   1000001     8.11482636E+01   # ~d_L
#    BR                NDA      ID1      ID2
     4.56479362E-03    2     1000022         1   # BR(~d_L -> chi^0_1 d)
     6.00808943E-02    2     1000023         1   # BR(~d_L -> chi^0_2 d)
     9.46203766E-04    2     1000025         1   # BR(~d_L -> chi^0_3 d)
     7.82342075E-03    2     1000035         1   # BR(~d_L -> chi^0_4 d)
     1.18899248E-01    2    -1000024         2   # BR(~d_L -> chi^-_1 u)
     2.22096423E-02    2    -1000037         2   # BR(~d_L -> chi^-_2 u)
     7.85475798E-01    2     1000021         1   # BR(~d_L -> ~g d)
DECAY   2000003     6.44998826E+01   # ~s_R
#    BR                NDA      ID1      ID2
     1.24412416E-02    2     1000022         3   # BR(~s_R -> chi^0_1 s)
     3.66841105E-04    2     1000023         3   # BR(~s_R -> chi^0_2 s)
     5.72036086E-05    2     1000025         3   # BR(~s_R -> chi^0_3 s)
     1.90187874E-04    2     1000035         3   # BR(~s_R -> chi^0_4 s)
     3.64730398E-04    2    -1000024         4   # BR(~s_R -> chi^-_1 c)
     3.92144690E-05    2    -1000037         4   # BR(~s_R -> chi^-_2 c)
     9.86540581E-01    2     1000021         3   # BR(~s_R -> ~g s)
DECAY   1000003     8.11106972E+01   # ~s_L
#    BR                NDA      ID1      ID2
     4.57442193E-03    2     1000022         3   # BR(~s_L -> chi^0_1 s)
     5.99637805E-02    2     1000023         3   # BR(~s_L -> chi^0_2 s)
     9.49885384E-04    2     1000025         3   # BR(~s_L -> chi^0_3 s)
     7.82076218E-03    2     1000035         3   # BR(~s_L -> chi^0_4 s)
     1.18664770E-01    2    -1000024         4   # BR(~s_L -> chi^-_1 c)
     2.21951286E-02    2    -1000037         4   # BR(~s_L -> chi^-_2 c)
     7.85831251E-01    2     1000021         3   # BR(~s_L -> ~g s)
DECAY   1000005     7.29274768E+01   # ~b_1
#    BR                NDA      ID1      ID2
     4.35354537E-03    2     1000022         5   # BR(~b_1 -> chi^0_1 b)
     5.45277549E-02    2     1000023         5   # BR(~b_1 -> chi^0_2 b)
     3.21049070E-03    2     1000025         5   # BR(~b_1 -> chi^0_3 b)
     8.62396164E-03    2     1000035         5   # BR(~b_1 -> chi^0_4 b)
     1.09972073E-01    2    -1000024         6   # BR(~b_1 -> chi^-_1 t)
     2.11461084E-01    2    -1000037         6   # BR(~b_1 -> chi^-_2 t)
     5.94772341E-01    2     1000021         5   # BR(~b_1 -> ~g b)
     1.30787464E-02    2     1000006       -24   # BR(~b_1 -> ~t_1 W^-)
DECAY   2000005     6.45019226E+01   # ~b_2
#    BR                NDA      ID1      ID2
     1.24916759E-02    2     1000022         5   # BR(~b_2 -> chi^0_1 b)
     6.89334665E-04    2     1000023         5   # BR(~b_2 -> chi^0_2 b)
     3.68762012E-03    2     1000025         5   # BR(~b_2 -> chi^0_3 b)
     3.37952123E-03    2     1000035         5   # BR(~b_2 -> chi^0_4 b)
     1.00539783E-03    2    -1000024         6   # BR(~b_2 -> chi^-_1 t)
     6.37068983E-03    2    -1000037         6   # BR(~b_2 -> chi^-_2 t)
     9.72064701E-01    2     1000021         5   # BR(~b_2 -> ~g b)
     1.37470870E-05    2     1000006       -24   # BR(~b_2 -> ~t_1 W^-)
     1.37048828E-04    2     2000006       -24   # BR(~b_2 -> ~t_2 W^-)
     7.63081923E-05    2     1000005        23   # BR(~b_2 -> ~b_1 Z)
     8.39493058E-05    2     1000005        25   # BR(~b_2 -> ~b_1 S^0_1)
DECAY   2000002     6.68907940E+01   # ~u_R
#    BR                NDA      ID1      ID2
     4.79948665E-02    2     1000022         2   # BR(~u_R -> chi^0_1 u)
     7.09236571E-04    2     1000023         2   # BR(~u_R -> chi^0_2 u)
     2.23954015E-04    2     1000025         2   # BR(~u_R -> chi^0_3 u)
     6.92210509E-04    2     1000035         2   # BR(~u_R -> chi^0_4 u)
     9.50379456E-01    2     1000021         2   # BR(~u_R -> ~g u)
DECAY   1000002     8.11287410E+01   # ~u_L
#    BR                NDA      ID1      ID2
     1.02074991E-03    2     1000022         2   # BR(~u_L -> chi^0_1 u)
     6.60768355E-02    2     1000023         2   # BR(~u_L -> chi^0_2 u)
     5.73238456E-04    2     1000025         2   # BR(~u_L -> chi^0_3 u)
     5.84252023E-03    2     1000035         2   # BR(~u_L -> chi^0_4 u)
     1.36868732E-01    2     1000024         1   # BR(~u_L -> chi^+_1 d)
     5.82582915E-03    2     1000037         1   # BR(~u_L -> chi^+_2 d)
     7.83792095E-01    2     1000021         2   # BR(~u_L -> ~g u)
DECAY   2000004     6.91688388E+01   # ~c_R
#    BR                NDA      ID1      ID2
     3.92944408E-02    2     1000022         4   # BR(~c_R -> chi^0_1 c)
     1.28716099E-02    2     1000023         4   # BR(~c_R -> chi^0_2 c)
     3.38252569E-04    2     1000025         4   # BR(~c_R -> chi^0_3 c)
     1.52616300E-03    2     1000035         4   # BR(~c_R -> chi^0_4 c)
     2.54735368E-02    2     1000024         3   # BR(~c_R -> chi^+_1 s)
     9.51687306E-04    2     1000037         3   # BR(~c_R -> chi^+_2 s)
     9.19544310E-01    2     1000021         4   # BR(~c_R -> ~g c)
DECAY   1000004     7.88504219E+01   # ~c_L
#    BR                NDA      ID1      ID2
     7.29551742E-03    2     1000022         4   # BR(~c_L -> chi^0_1 c)
     5.72962523E-02    2     1000023         4   # BR(~c_L -> chi^0_2 c)
     4.87533528E-04    2     1000025         4   # BR(~c_L -> chi^0_3 c)
     5.26393884E-03    2     1000035         4   # BR(~c_L -> chi^0_4 c)
     1.18477802E-01    2     1000024         3   # BR(~c_L -> chi^+_1 s)
     5.16569280E-03    2     1000037         3   # BR(~c_L -> chi^+_2 s)
     8.06013263E-01    2     1000021         4   # BR(~c_L -> ~g c)
DECAY   1000006     3.42426745E+01   # ~t_1
#    BR                NDA      ID1      ID2
     5.19832348E-02    2     1000022         6   # BR(~t_1 -> chi^0_1 t)
     1.37318103E-02    2     1000023         6   # BR(~t_1 -> chi^0_2 t)
     1.31863161E-01    2     1000025         6   # BR(~t_1 -> chi^0_3 t)
     1.01224877E-01    2     1000035         6   # BR(~t_1 -> chi^0_4 t)
     2.84267178E-02    2     1000024         5   # BR(~t_1 -> chi^+_1 b)
     2.38569329E-01    2     1000037         5   # BR(~t_1 -> chi^+_2 b)
     4.34200870E-01    2     1000021         6   # BR(~t_1 -> ~g t)
DECAY   2000006     6.96360951E+01   # ~t_2
#    BR                NDA      ID1      ID2
     1.16931823E-03    2     1000022         6   # BR(~t_2 -> chi^0_1 t)
     6.03475560E-02    2     1000023         6   # BR(~t_2 -> chi^0_2 t)
     1.02582588E-01    2     1000025         6   # BR(~t_2 -> chi^0_3 t)
     1.11724575E-01    2     1000035         6   # BR(~t_2 -> chi^0_4 t)
     1.22344514E-01    2     1000024         5   # BR(~t_2 -> chi^+_1 b)
     1.80709501E-02    2     1000037         5   # BR(~t_2 -> chi^+_2 b)
     5.70534929E-01    2     1000021         6   # BR(~t_2 -> ~g t)
     7.36759893E-03    2     1000006        23   # BR(~t_2 -> ~t_1 Z)
     5.85796788E-03    2     1000006        25   # BR(~t_2 -> ~t_1 S^0_1)
DECAY   1000024     4.82536896E-05   # chi^+_1
#    BR                NDA      ID1      ID2
#    BR                NDA      ID1      ID2       ID3
     5.00254501E-01    3     1000022        -1         2   # BR(chi^+_1 -> chi^0_1 d_bar u)
     4.99745488E-01    3     1000022        -3         4   # BR(chi^+_1 -> chi^0_1 s_bar c)
DECAY   1000037     1.80924553E+00   # chi^+_2
#    BR                NDA      ID1      ID2
     8.86138964E-02    2     1000022        24   # BR(chi^+_2 -> chi^0_1 W^+)
     3.66238867E-01    2     1000023        24   # BR(chi^+_2 -> chi^0_2 W^+)
     3.22825408E-01    2     1000024        23   # BR(chi^+_2 -> chi^+_1 Z)
     2.22266277E-01    2     1000024        25   # BR(chi^+_2 -> chi^+_1 S^0_1)
#    BR                NDA      ID1      ID2       ID3
     4.11809542E-05    3     1000022        -5         6   # BR(chi^+_2 -> chi^0_1 b_bar t)
     1.22849595E-05    3     1000023        -5         6   # BR(chi^+_2 -> chi^0_2 b_bar t)
DECAY   1000022     1.20418728E-15   # chi^0_1
#    BR                NDA      ID1      ID2
     2.05618444E-04    2          16        22   # BR(chi^0_1 -> nu_3 photon)
#    BR                NDA      ID1      ID2       ID3
     1.23204659E-05    3          14         2        -2   # BR(chi^0_1 -> nu_2 u u_bar)
     1.22719921E-05    3          14         4        -4   # BR(chi^0_1 -> nu_2 c c_bar)
     1.59541223E-05    3          14         1        -1   # BR(chi^0_1 -> nu_2 d d_bar)
     2.79127962E-05    3          14         3        -3   # BR(chi^0_1 -> nu_2 s s_bar)
     3.01678291E-02    3          14         5        -5   # BR(chi^0_1 -> nu_2 b b_bar)
     2.71401661E-02    3          16         2        -2   # BR(chi^0_1 -> nu_3 u u_bar)
     2.70428701E-02    3          16         4        -4   # BR(chi^0_1 -> nu_3 c c_bar)
     3.50704358E-02    3          16         1        -1   # BR(chi^0_1 -> nu_3 d d_bar)
     3.50695491E-02    3          16         3        -3   # BR(chi^0_1 -> nu_3 s s_bar)
     3.33866091E-02    3          16         5        -5   # BR(chi^0_1 -> nu_3 b b_bar)
     2.50748996E-04    3         -11         1        -2   # BR(chi^0_1 -> e^+ d u_bar)
     2.50748996E-04    3          11        -1         2   # BR(chi^0_1 -> e^- d_bar u)
     2.51608279E-04    3         -11         3        -4   # BR(chi^0_1 -> e^+ s c_bar)
     2.51608279E-04    3          11        -3         4   # BR(chi^0_1 -> e^- s_bar c)
     6.05262626E-02    3         -13         1        -2   # BR(chi^0_1 -> mu^+ d u_bar)
     6.05262626E-02    3          13        -1         2   # BR(chi^0_1 -> mu^- d_bar u)
     6.04707667E-02    3         -13         3        -4   # BR(chi^0_1 -> mu^+ s c_bar)
     6.04707667E-02    3          13        -3         4   # BR(chi^0_1 -> mu^- s_bar c)
     6.10974465E-02    3         -15         1        -2   # BR(chi^0_1 -> tau^+ d u_bar)
     6.10974465E-02    3          15        -1         2   # BR(chi^0_1 -> tau^- d_bar u)
     6.10349779E-02    3         -15         3        -4   # BR(chi^0_1 -> tau^+ s c_bar)
     6.10349779E-02    3          15        -3         4   # BR(chi^0_1 -> tau^- s_bar c)
     7.28124610E-06    3          14        12        12   # BR(chi^0_1 -> nu_2 nu_1 nu_1)
     1.38484659E-05    3          14        14        14   # BR(chi^0_1 -> nu_2 nu_2 nu_2)
     1.60863344E-02    3          16        12        12   # BR(chi^0_1 -> nu_3 nu_1 nu_1)
     1.60863964E-02    3          16        14        14   # BR(chi^0_1 -> nu_3 nu_2 nu_2)
     7.27685751E-06    3          16        16        14   # BR(chi^0_1 -> nu_3 nu_3 nu_2)
     3.05991564E-02    3          16        16        16   # BR(chi^0_1 -> nu_3 nu_3 nu_3)
     1.12976083E-04    3          12       -11        11   # BR(chi^0_1 -> nu_1 e^+ e^-)
     1.37982467E-02    3          12       -13        11   # BR(chi^0_1 -> nu_1 mu^+ e^-)
     1.37982467E-02    3          12       -11        13   # BR(chi^0_1 -> nu_1 e^+ mu^-)
     5.84268675E-03    3          12       -13        13   # BR(chi^0_1 -> nu_1 mu^+ mu^-)
     1.43481687E-02    3          12       -15        11   # BR(chi^0_1 -> nu_1 tau^+ e^-)
     1.43481687E-02    3          12       -11        15   # BR(chi^0_1 -> nu_1 e^+ tau^-)
     7.13525066E-03    3          12       -15        13   # BR(chi^0_1 -> nu_1 tau^+ mu^-)
     7.13525066E-03    3          12       -13        15   # BR(chi^0_1 -> nu_1 mu^+ tau^-)
     7.56457072E-03    3          12       -15        15   # BR(chi^0_1 -> nu_1 tau^+ tau^-)
     7.23084211E-05    3          14       -11        11   # BR(chi^0_1 -> nu_2 e^+ e^-)
     6.41149110E-03    3          14       -13        11   # BR(chi^0_1 -> nu_2 mu^+ e^-)
     6.41149110E-03    3          14       -11        13   # BR(chi^0_1 -> nu_2 e^+ mu^-)
     1.55642123E-02    3          14       -13        13   # BR(chi^0_1 -> nu_2 mu^+ mu^-)
     7.16679702E-03    3          14       -15        11   # BR(chi^0_1 -> nu_2 tau^+ e^-)
     7.16679702E-03    3          14       -11        15   # BR(chi^0_1 -> nu_2 e^+ tau^-)
     1.50560638E-02    3          14       -15        13   # BR(chi^0_1 -> nu_2 tau^+ mu^-)
     1.50560638E-02    3          14       -13        15   # BR(chi^0_1 -> nu_2 mu^+ tau^-)
     2.10149541E-02    3          14       -15        15   # BR(chi^0_1 -> nu_2 tau^+ tau^-)
     7.91709543E-03    3          16       -11        11   # BR(chi^0_1 -> nu_3 e^+ e^-)
     1.03103910E-04    3          16       -13        11   # BR(chi^0_1 -> nu_3 mu^+ e^-)
     1.03103910E-04    3          16       -11        13   # BR(chi^0_1 -> nu_3 e^+ mu^-)
     1.26613739E-02    3          16       -13        13   # BR(chi^0_1 -> nu_3 mu^+ mu^-)
     1.38747044E-03    3          16       -15        11   # BR(chi^0_1 -> nu_3 tau^+ e^-)
     1.38747044E-03    3          16       -11        15   # BR(chi^0_1 -> nu_3 e^+ tau^-)
     2.23095632E-02    3          16       -15        13   # BR(chi^0_1 -> nu_3 tau^+ mu^-)
     2.23095632E-02    3          16       -13        15   # BR(chi^0_1 -> nu_3 mu^+ tau^-)
     1.55996527E-02    3          16       -15        15   # BR(chi^0_1 -> nu_3 tau^+ tau^-)
DECAY   1000023     7.71896240E-06   # chi^0_2
#    BR                NDA      ID1      ID2
     2.84472352E-03    2     1000022        22   # BR(chi^0_2 -> chi^0_1 photon)
#    BR                NDA      ID1      ID2       ID3
     1.19450897E-01    3     1000022         2        -2   # BR(chi^0_2 -> chi^0_1 u u_bar)
     1.19052921E-01    3     1000022         4        -4   # BR(chi^0_2 -> chi^0_1 c c_bar)
     1.55991603E-01    3     1000022         1        -1   # BR(chi^0_2 -> chi^0_1 d d_bar)
     1.55988752E-01    3     1000022         3        -3   # BR(chi^0_2 -> chi^0_1 s s_bar)
     1.53441875E-01    3     1000022         5        -5   # BR(chi^0_2 -> chi^0_1 b b_bar)
     6.54285253E-02    3     1000022        12        12   # BR(chi^0_2 -> chi^0_1 nu_1 nu_1)
     6.54245374E-02    3     1000022        14        14   # BR(chi^0_2 -> chi^0_1 nu_2 nu_2)
     6.54166243E-02    3     1000022        16        16   # BR(chi^0_2 -> chi^0_1 nu_3 nu_3)
     3.23748310E-02    3     1000022       -11        11   # BR(chi^0_2 -> chi^0_1 e^+ e^-)
     3.23743866E-02    3     1000022       -13        13   # BR(chi^0_2 -> chi^0_1 mu^+ mu^-)
     3.22102298E-02    3     1000022       -15        15   # BR(chi^0_2 -> chi^0_1 tau^+ tau^-)
DECAY   1000025     1.78626366E+00   # chi^0_3
#    BR                NDA      ID1      ID2
     3.07305164E-01    2     1000024       -24   # BR(chi^0_3 -> chi^+_1 W^-)
     3.07305164E-01    2    -1000024        24   # BR(chi^0_3 -> chi^-_1 W^+)
     1.18399666E-01    2     1000022        23   # BR(chi^0_3 -> chi^0_1 Z)
     2.27940076E-01    2     1000023        23   # BR(chi^0_3 -> chi^0_2 Z)
     2.38747256E-02    2     1000022        25   # BR(chi^0_3 -> chi^0_1 S^0_1)
     1.51580899E-02    2     1000023        25   # BR(chi^0_3 -> chi^0_2 S^0_1)
     1.59858746E-05    2     1000023        22   # BR(chi^0_3 -> chi^0_2 photon)
#    BR                NDA      ID1      ID2       ID3
DECAY   1000035     2.08808790E+00   # chi^0_4
#    BR                NDA      ID1      ID2
     3.57641635E-01    2     1000024       -24   # BR(chi^0_4 -> chi^+_1 W^-)
     3.57641635E-01    2    -1000024        24   # BR(chi^0_4 -> chi^-_1 W^+)
     3.06483257E-02    2     1000022        23   # BR(chi^0_4 -> chi^0_1 Z)
     2.98633262E-02    2     1000023        23   # BR(chi^0_4 -> chi^0_2 Z)
     7.62021936E-02    2     1000022        25   # BR(chi^0_4 -> chi^0_1 S^0_1)
     1.47961407E-01    2     1000023        25   # BR(chi^0_4 -> chi^0_2 S^0_1)
     2.23092592E-05    2     1000023        22   # BR(chi^0_4 -> chi^0_2 photon)
#    BR                NDA      ID1      ID2       ID3
     8.76328665E-06    3     1000024         5        -6   # BR(chi^0_4 -> chi^+_1 b t_bar)
     8.76328665E-06    3    -1000024        -5         6   # BR(chi^0_4 -> chi^-_1 b_bar t)
DECAY   1000021     5.16388971E-04   # ~g
#    BR                NDA      ID1      ID2
     2.20224833E-04    2     1000022        21   # BR(~g -> chi^0_1 g)
     6.17495829E-03    2     1000023        21   # BR(~g -> chi^0_2 g)
     3.69157825E-02    2     1000025        21   # BR(~g -> chi^0_3 g)
     2.80451428E-02    2     1000035        21   # BR(~g -> chi^0_4 g)
#    BR                NDA      ID1      ID2       ID3
     3.82262646E-02    3     1000022         2        -2   # BR(~g -> chi^0_1 u u_bar)
     3.82226242E-02    3     1000022         4        -4   # BR(~g -> chi^0_1 c c_bar)
     3.04205667E-02    3     1000022         6        -6   # BR(~g -> chi^0_1 t t_bar)
     1.35586042E-02    3     1000022         1        -1   # BR(~g -> chi^0_1 d d_bar)
     1.35590505E-02    3     1000022         3        -3   # BR(~g -> chi^0_1 s s_bar)
     2.04028587E-02    3     1000022         5        -5   # BR(~g -> chi^0_1 b b_bar)
     4.84558699E-02    3     1000023         2        -2   # BR(~g -> chi^0_2 u u_bar)
     4.84492510E-02    3     1000023         4        -4   # BR(~g -> chi^0_2 c c_bar)
     1.11914361E-03    3     1000023         6        -6   # BR(~g -> chi^0_2 t t_bar)
     4.34608639E-02    3     1000023         1        -1   # BR(~g -> chi^0_2 d d_bar)
     4.34622017E-02    3     1000023         3        -3   # BR(~g -> chi^0_2 s s_bar)
     1.06384424E-01    3     1000023         5        -5   # BR(~g -> chi^0_2 b b_bar)
     2.69516870E-05    3     1000025         2        -2   # BR(~g -> chi^0_3 u u_bar)
     2.73227897E-05    3     1000025         4        -4   # BR(~g -> chi^0_3 c c_bar)
     3.50193069E-05    3     1000025         1        -1   # BR(~g -> chi^0_3 d d_bar)
     3.52722484E-05    3     1000025         3        -3   # BR(~g -> chi^0_3 s s_bar)
     1.07453256E-03    3     1000025         5        -5   # BR(~g -> chi^0_3 b b_bar)
     4.46306179E-04    3     1000035         2        -2   # BR(~g -> chi^0_4 u u_bar)
     4.47076999E-04    3     1000035         4        -4   # BR(~g -> chi^0_4 c c_bar)
     5.50074760E-04    3     1000035         1        -1   # BR(~g -> chi^0_4 d d_bar)
     5.50235080E-04    3     1000035         3        -3   # BR(~g -> chi^0_4 s s_bar)
     2.09405843E-03    3     1000035         5        -5   # BR(~g -> chi^0_4 b b_bar)
     9.28196541E-02    3     1000024         1        -2   # BR(~g -> chi^+_1 d u_bar)
     9.28196541E-02    3    -1000024        -1         2   # BR(~g -> chi^-_1 d_bar u)
     9.28148670E-02    3     1000024         3        -4   # BR(~g -> chi^+_1 s c_bar)
     9.28148670E-02    3    -1000024        -3         4   # BR(~g -> chi^-_1 s_bar c)
     5.08618031E-02    3     1000024         5        -6   # BR(~g -> chi^+_1 b t_bar)
     5.08618031E-02    3    -1000024        -5         6   # BR(~g -> chi^-_1 b_bar t)
     8.92671307E-04    3     1000037         1        -2   # BR(~g -> chi^+_2 d u_bar)
     8.92671307E-04    3    -1000037        -1         2   # BR(~g -> chi^-_2 d_bar u)
     8.93396379E-04    3     1000037         3        -4   # BR(~g -> chi^+_2 s c_bar)
     8.93396379E-04    3    -1000037        -3         4   # BR(~g -> chi^-_2 s_bar c)
     5.35259790E-04    3     1000037         5        -6   # BR(~g -> chi^+_2 b t_bar)
     5.35259790E-04    3    -1000037        -5         6   # BR(~g -> chi^-_2 b_bar t)
DECAY        25     1.78386430E-03   # S^0_1
#    BR                NDA      ID1      ID2
     3.60798513E-04    2           3        -3   # BR(S^0_1 -> s s_bar)
     8.11231623E-01    2           5        -5   # BR(S^0_1 -> b b_bar)
     5.66959264E-02    2           4        -4   # BR(S^0_1 -> c c_bar)
     4.41762396E-04    2         -13        13   # BR(S^0_1 -> mu^+ mu^-)
     1.24763006E-01    2         -15        15   # BR(S^0_1 -> tau^+ tau^-)
# writing decays into V V* as 3-body decays
#    BR                NDA      ID1      ID2       ID3
     0.00000000E+00    3          24        11        12   # BR(S^0_1 -> W^+ d u)
     0.00000000E+00    3          24        13        14   # BR(S^0_1 -> W^+ s c)
     0.00000000E+00    3          24        15        16   # BR(S^0_1 -> W^+ b t)
     0.00000000E+00    3          24         1        -2   # BR(S^0_1 -> W^+ ~c_L ~u^*_R)
     0.00000000E+00    3          24         3        -4   # BR(S^0_1 -> W^+ ~t_1 ~u^*_L)
     0.00000000E+00    3         -24       -11       -12   # BR(S^0_1 -> W^- d_bar u_bar)
     0.00000000E+00    3         -24       -13       -14   # BR(S^0_1 -> W^- s_bar c_bar)
     0.00000000E+00    3         -24       -15       -16   # BR(S^0_1 -> W^- b_bar t_bar)
     0.00000000E+00    3         -24        -1         2   # BR(S^0_1 -> W^- ~c^*_L ~u_R)
     0.00000000E+00    3         -24        -3         4   # BR(S^0_1 -> W^- ~t^*_1 ~u_L)
     2.27700861E-04    3          23        11       -11   # BR(S^0_1 -> Z d d_bar)
     2.27700861E-04    3          23        13       -13   # BR(S^0_1 -> Z s s_bar)
     1.95172167E-04    3          23        15       -15   # BR(S^0_1 -> Z b b_bar)
     1.30114778E-03    3          23        12       -12   # BR(S^0_1 -> Z u u_bar)
     9.10803445E-04    3          23         1        -1   # BR(S^0_1 -> Z ~u_R ~u^*_R)
     9.10803445E-04    3          23         3        -3   # BR(S^0_1 -> Z ~u_L ~u^*_L)
     9.10803445E-04    3          23         5        -5   # BR(S^0_1 -> Z ~c_R ~c^*_R)
     9.10803445E-04    3          23         2        -2   # BR(S^0_1 -> Z ~u_R ~u^*_R)
     9.10803445E-04    3          23         4        -4   # BR(S^0_1 -> Z ~u_L ~u^*_L)
DECAY   1000016     1.87043345E+01   # S^0_2
#    BR                NDA      ID1      ID2
     2.02670199E-02    2          12   1000022   # BR(S^0_2 -> nu_1 chi^0_1)
     3.93662300E-02    2          12   1000023   # BR(S^0_2 -> nu_1 chi^0_2)
     1.01567139E-03    2          12   1000025   # BR(S^0_2 -> nu_1 chi^0_3)
     7.25024972E-03    2          12   1000035   # BR(S^0_2 -> nu_1 chi^0_4)
     3.42492844E-02    2          14   1000022   # BR(S^0_2 -> nu_2 chi^0_1)
     6.65250844E-02    2          14   1000023   # BR(S^0_2 -> nu_2 chi^0_2)
     1.71638546E-03    2          14   1000025   # BR(S^0_2 -> nu_2 chi^0_3)
     1.22522140E-02    2          14   1000035   # BR(S^0_2 -> nu_2 chi^0_4)
     6.21661569E-02    2          16   1000022   # BR(S^0_2 -> nu_3 chi^0_1)
     1.20750226E-01    2          16   1000023   # BR(S^0_2 -> nu_3 chi^0_2)
     3.11542533E-03    2          16   1000025   # BR(S^0_2 -> nu_3 chi^0_3)
     2.22390941E-02    2          16   1000035   # BR(S^0_2 -> nu_3 chi^0_4)
     2.87210694E-01    2         -15  -1000024   # BR(S^0_2 -> tau^+ chi^-_1)
     2.87210694E-01    2          15   1000024   # BR(S^0_2 -> tau^- chi^+_1)
     1.73327719E-02    2         -15  -1000037   # BR(S^0_2 -> tau^+ chi^-_2)
     1.73327719E-02    2          15   1000037   # BR(S^0_2 -> tau^- chi^+_2)
DECAY   1000014     1.85462157E+01   # S^0_3
#    BR                NDA      ID1      ID2
     1.70931583E-02    2          12   1000022   # BR(S^0_3 -> nu_1 chi^0_1)
     3.32060690E-02    2          12   1000023   # BR(S^0_3 -> nu_1 chi^0_2)
     8.57447037E-04    2          12   1000025   # BR(S^0_3 -> nu_1 chi^0_3)
     6.12154308E-03    2          12   1000035   # BR(S^0_3 -> nu_1 chi^0_4)
     4.62232475E-02    2          14   1000022   # BR(S^0_3 -> nu_2 chi^0_1)
     8.97957133E-02    2          14   1000023   # BR(S^0_3 -> nu_2 chi^0_2)
     2.31870470E-03    2          14   1000025   # BR(S^0_3 -> nu_2 chi^0_3)
     1.65538513E-02    2          14   1000035   # BR(S^0_3 -> nu_2 chi^0_4)
     5.48637261E-02    2          16   1000022   # BR(S^0_3 -> nu_3 chi^0_1)
     1.06581162E-01    2          16   1000023   # BR(S^0_3 -> nu_3 chi^0_2)
     2.75213851E-03    2          16   1000025   # BR(S^0_3 -> nu_3 chi^0_3)
     1.96482509E-02    2          16   1000035   # BR(S^0_3 -> nu_3 chi^0_4)
     2.89726344E-01    2         -13  -1000024   # BR(S^0_3 -> mu^+ chi^-_1)
     2.89726344E-01    2          13   1000024   # BR(S^0_3 -> mu^- chi^+_1)
     1.22661388E-02    2         -13  -1000037   # BR(S^0_3 -> mu^+ chi^-_2)
     1.22661388E-02    2          13   1000037   # BR(S^0_3 -> mu^- chi^+_2)
DECAY   1000012     1.85456496E+01   # S^0_4
#    BR                NDA      ID1      ID2
     8.05634924E-02    2          12   1000022   # BR(S^0_4 -> nu_1 chi^0_1)
     1.56506958E-01    2          12   1000023   # BR(S^0_4 -> nu_1 chi^0_2)
     4.04133411E-03    2          12   1000025   # BR(S^0_4 -> nu_1 chi^0_3)
     2.88521746E-02    2          12   1000035   # BR(S^0_4 -> nu_1 chi^0_4)
     3.72696909E-02    2          14   1000022   # BR(S^0_4 -> nu_2 chi^0_1)
     7.24020990E-02    2          14   1000023   # BR(S^0_4 -> nu_2 chi^0_2)
     1.86957229E-03    2          14   1000025   # BR(S^0_4 -> nu_2 chi^0_3)
     1.33473811E-02    2          14   1000035   # BR(S^0_4 -> nu_2 chi^0_4)
     3.52336928E-04    2          16   1000022   # BR(S^0_4 -> nu_3 chi^0_1)
     6.84468600E-04    2          16   1000023   # BR(S^0_4 -> nu_3 chi^0_2)
     1.76743985E-05    2          16   1000025   # BR(S^0_4 -> nu_3 chi^0_3)
     1.26182298E-04    2          16   1000035   # BR(S^0_4 -> nu_3 chi^0_4)
     2.89735397E-01    2         -11  -1000024   # BR(S^0_4 -> e^+ chi^-_1)
     2.89735397E-01    2          11   1000024   # BR(S^0_4 -> e^- chi^+_1)
     1.22479100E-02    2         -11  -1000037   # BR(S^0_4 -> e^+ chi^-_2)
     1.22479100E-02    2          11   1000037   # BR(S^0_4 -> e^- chi^+_2)
DECAY        35     1.98117811E+01   # S^0_5
#    BR                NDA      ID1      ID2
     4.07895049E-05    2           3        -3   # BR(S^0_5 -> s s_bar)
     9.20541247E-02    2           5        -5   # BR(S^0_5 -> b b_bar)
     3.58563974E-02    2           6        -6   # BR(S^0_5 -> t t_bar)
     5.70436200E-03    2     1000022   1000022   # BR(S^0_5 -> chi^0_1 chi^0_1)
     2.68094674E-02    2     1000022   1000023   # BR(S^0_5 -> chi^0_1 chi^0_2)
     5.34943513E-02    2     1000022   1000025   # BR(S^0_5 -> chi^0_1 chi^0_3)
     2.08874758E-02    2     1000022   1000035   # BR(S^0_5 -> chi^0_1 chi^0_4)
     3.07862145E-02    2     1000023   1000023   # BR(S^0_5 -> chi^0_2 chi^0_2)
     1.04011512E-01    2     1000023   1000025   # BR(S^0_5 -> chi^0_2 chi^0_3)
     3.59263552E-02    2     1000023   1000035   # BR(S^0_5 -> chi^0_2 chi^0_4)
     5.00579518E-03    2     1000025   1000025   # BR(S^0_5 -> chi^0_3 chi^0_3)
     3.77819951E-02    2     1000025   1000035   # BR(S^0_5 -> chi^0_3 chi^0_4)
     1.93957580E-02    2     1000035   1000035   # BR(S^0_5 -> chi^0_4 chi^0_4)
     4.86878384E-05    2         -13        13   # BR(S^0_5 -> mu^+ mu^-)
     1.37705084E-02    2         -15        15   # BR(S^0_5 -> tau^+ tau^-)
     8.08578957E-02    2     1000024  -1000024   # BR(S^0_5 -> chi^+_1 chi^-_1)
     2.14366111E-01    2     1000024  -1000037   # BR(S^0_5 -> chi^+_1 chi^-_2)
     2.14366111E-01    2    -1000024   1000037   # BR(S^0_5 -> chi^-_1 chi^+_2)
     8.80915854E-03    2     1000037  -1000037   # BR(S^0_5 -> chi^+_2 chi^-_2)
     2.61219385E-05    2          23        23   # BR(S^0_5 -> Z Z)
DECAY   1000019     1.87043345E+01   # P^0_1
#    BR                NDA      ID1      ID2
     2.02670198E-02    2          12   1000022   # BR(P^0_1 -> nu_1 chi^0_1)
     3.93662300E-02    2          12   1000023   # BR(P^0_1 -> nu_1 chi^0_2)
     1.01567139E-03    2          12   1000025   # BR(P^0_1 -> nu_1 chi^0_3)
     7.25024971E-03    2          12   1000035   # BR(P^0_1 -> nu_1 chi^0_4)
     3.42492845E-02    2          14   1000022   # BR(P^0_1 -> nu_2 chi^0_1)
     6.65250845E-02    2          14   1000023   # BR(P^0_1 -> nu_2 chi^0_2)
     1.71638547E-03    2          14   1000025   # BR(P^0_1 -> nu_2 chi^0_3)
     1.22522140E-02    2          14   1000035   # BR(P^0_1 -> nu_2 chi^0_4)
     6.21661568E-02    2          16   1000022   # BR(P^0_1 -> nu_3 chi^0_1)
     1.20750226E-01    2          16   1000023   # BR(P^0_1 -> nu_3 chi^0_2)
     3.11542533E-03    2          16   1000025   # BR(P^0_1 -> nu_3 chi^0_3)
     2.22390941E-02    2          16   1000035   # BR(P^0_1 -> nu_3 chi^0_4)
     2.87210694E-01    2         -15  -1000024   # BR(P^0_1 -> tau^+ chi^-_1)
     2.87210694E-01    2          15   1000024   # BR(P^0_1 -> tau^- chi^+_1)
     1.73327719E-02    2         -15  -1000037   # BR(P^0_1 -> tau^+ chi^-_2)
     1.73327719E-02    2          15   1000037   # BR(P^0_1 -> tau^- chi^+_2)
DECAY   1000018     1.85462157E+01   # P^0_2
#    BR                NDA      ID1      ID2
     1.70931518E-02    2          12   1000022   # BR(P^0_2 -> nu_1 chi^0_1)
     3.32060563E-02    2          12   1000023   # BR(P^0_2 -> nu_1 chi^0_2)
     8.57446709E-04    2          12   1000025   # BR(P^0_2 -> nu_1 chi^0_3)
     6.12154074E-03    2          12   1000035   # BR(P^0_2 -> nu_1 chi^0_4)
     4.62232548E-02    2          14   1000022   # BR(P^0_2 -> nu_2 chi^0_1)
     8.97957274E-02    2          14   1000023   # BR(P^0_2 -> nu_2 chi^0_2)
     2.31870507E-03    2          14   1000025   # BR(P^0_2 -> nu_2 chi^0_3)
     1.65538539E-02    2          14   1000035   # BR(P^0_2 -> nu_2 chi^0_4)
     5.48637254E-02    2          16   1000022   # BR(P^0_2 -> nu_3 chi^0_1)
     1.06581160E-01    2          16   1000023   # BR(P^0_2 -> nu_3 chi^0_2)
     2.75213848E-03    2          16   1000025   # BR(P^0_2 -> nu_3 chi^0_3)
     1.96482506E-02    2          16   1000035   # BR(P^0_2 -> nu_3 chi^0_4)
     2.89726344E-01    2         -13  -1000024   # BR(P^0_2 -> mu^+ chi^-_1)
     2.89726344E-01    2          13   1000024   # BR(P^0_2 -> mu^- chi^+_1)
     1.22661388E-02    2         -13  -1000037   # BR(P^0_2 -> mu^+ chi^-_2)
     1.22661388E-02    2          13   1000037   # BR(P^0_2 -> mu^- chi^+_2)
DECAY   1000017     1.85456496E+01   # P^0_3
#    BR                NDA      ID1      ID2
     8.05634989E-02    2          12   1000022   # BR(P^0_3 -> nu_1 chi^0_1)
     1.56506971E-01    2          12   1000023   # BR(P^0_3 -> nu_1 chi^0_2)
     4.04133444E-03    2          12   1000025   # BR(P^0_3 -> nu_1 chi^0_3)
     2.88521770E-02    2          12   1000035   # BR(P^0_3 -> nu_1 chi^0_4)
     3.72696836E-02    2          14   1000022   # BR(P^0_3 -> nu_2 chi^0_1)
     7.24020848E-02    2          14   1000023   # BR(P^0_3 -> nu_2 chi^0_2)
     1.86957193E-03    2          14   1000025   # BR(P^0_3 -> nu_2 chi^0_3)
     1.33473784E-02    2          14   1000035   # BR(P^0_3 -> nu_2 chi^0_4)
     3.52337698E-04    2          16   1000022   # BR(P^0_3 -> nu_3 chi^0_1)
     6.84470095E-04    2          16   1000023   # BR(P^0_3 -> nu_3 chi^0_2)
     1.76744371E-05    2          16   1000025   # BR(P^0_3 -> nu_3 chi^0_3)
     1.26182574E-04    2          16   1000035   # BR(P^0_3 -> nu_3 chi^0_4)
     2.89735397E-01    2         -11  -1000024   # BR(P^0_3 -> e^+ chi^-_1)
     2.89735397E-01    2          11   1000024   # BR(P^0_3 -> e^- chi^+_1)
     1.22479100E-02    2         -11  -1000037   # BR(P^0_3 -> e^+ chi^-_2)
     1.22479100E-02    2          11   1000037   # BR(P^0_3 -> e^- chi^+_2)
DECAY        36     1.98230954E+01   # P^0_4
#    BR                NDA      ID1      ID2
     4.07711017E-05    2           3        -3   # BR(P^0_4 -> s s_bar)
     9.20125417E-02    2           5        -5   # BR(P^0_4 -> b b_bar)
     3.65004213E-02    2           6        -6   # BR(P^0_4 -> t t_bar)
     6.58671755E-03    2     1000022   1000022   # BR(P^0_4 -> chi^0_1 chi^0_1)
     3.27220221E-02    2     1000022   1000023   # BR(P^0_4 -> chi^0_1 chi^0_2)
     3.22689876E-02    2     1000022   1000025   # BR(P^0_4 -> chi^0_1 chi^0_3)
     3.62162384E-02    2     1000022   1000035   # BR(P^0_4 -> chi^0_1 chi^0_4)
     3.97938821E-02    2     1000023   1000023   # BR(P^0_4 -> chi^0_2 chi^0_2)
     5.88053547E-02    2     1000023   1000025   # BR(P^0_4 -> chi^0_2 chi^0_3)
     6.54977324E-02    2     1000023   1000035   # BR(P^0_4 -> chi^0_2 chi^0_4)
     4.24845310E-03    2     1000025   1000025   # BR(P^0_4 -> chi^0_3 chi^0_3)
     2.37128676E-02    2     1000025   1000035   # BR(P^0_4 -> chi^0_3 chi^0_4)
     3.96425826E-02    2     1000035   1000035   # BR(P^0_4 -> chi^0_4 chi^0_4)
     4.86659274E-05    2         -13        13   # BR(P^0_4 -> mu^+ mu^-)
     1.37643972E-02    2         -15        15   # BR(P^0_4 -> tau^+ tau^-)
     1.02491633E-01    2     1000024  -1000024   # BR(P^0_4 -> chi^+_1 chi^-_1)
     1.94000098E-01    2     1000024  -1000037   # BR(P^0_4 -> chi^+_1 chi^-_2)
     1.94000098E-01    2    -1000024   1000037   # BR(P^0_4 -> chi^-_1 chi^+_2)
     2.75957761E-02    2     1000037  -1000037   # BR(P^0_4 -> chi^+_2 chi^-_2)
     4.99663514E-05    2          25        23   # BR(P^0_4 -> S^0_1 Z)
DECAY  -1000015     8.66658285E+00   # S^+_1
#    BR                NDA      ID1      ID2
     7.54682913E-01    2         -15   1000022   # BR(S^+_1 -> tau^+ chi^0_1)
     8.94567408E-02    2         -15   1000023   # BR(S^+_1 -> tau^+ chi^0_2)
     9.55630035E-03    2         -15   1000025   # BR(S^+_1 -> tau^+ chi^0_3)
     7.04179178E-03    2         -15   1000035   # BR(S^+_1 -> tau^+ chi^0_4)
     2.41610232E-02    2     1000024        12   # BR(S^+_1 -> chi^+_1 nu_1)
     4.08298289E-02    2     1000024        14   # BR(S^+_1 -> chi^+_1 nu_2)
     7.41104534E-02    2     1000024        16   # BR(S^+_1 -> chi^+_1 nu_3)
     2.79524881E-05    2     1000037        12   # BR(S^+_1 -> chi^+_2 nu_1)
     4.72376870E-05    2     1000037        14   # BR(S^+_1 -> chi^+_2 nu_2)
     8.57402681E-05    2     1000037        16   # BR(S^+_1 -> chi^+_2 nu_3)
DECAY  -2000015     1.76391335E+01   # S^+_2
#    BR                NDA      ID1      ID2
     1.00767218E-01    2         -15   1000022   # BR(S^+_2 -> tau^+ chi^0_1)
     2.85923283E-01    2         -15   1000023   # BR(S^+_2 -> tau^+ chi^0_2)
     1.14429679E-02    2         -15   1000025   # BR(S^+_2 -> tau^+ chi^0_3)
     3.16236079E-02    2         -15   1000035   # BR(S^+_2 -> tau^+ chi^0_4)
     8.01383902E-02    2     1000024        12   # BR(S^+_2 -> chi^+_1 nu_1)
     1.35426010E-01    2     1000024        14   # BR(S^+_2 -> chi^+_1 nu_2)
     2.45812938E-01    2     1000024        16   # BR(S^+_2 -> chi^+_1 nu_3)
     1.89092726E-02    2     1000037        12   # BR(S^+_2 -> chi^+_2 nu_1)
     3.19548237E-02    2     1000037        14   # BR(S^+_2 -> chi^+_2 nu_2)
     5.80014631E-02    2     1000037        16   # BR(S^+_2 -> chi^+_2 nu_3)
DECAY  -1000013     1.65686445E+01   # S^+_3
#    BR                NDA      ID1      ID2
     1.40394795E-01    2         -13   1000022   # BR(S^+_3 -> mu^+ chi^0_1)
     2.87182703E-01    2         -13   1000023   # BR(S^+_3 -> mu^+ chi^0_2)
     1.20548520E-03    2         -13   1000025   # BR(S^+_3 -> mu^+ chi^0_3)
     1.65745227E-02    2         -13   1000035   # BR(S^+_3 -> mu^+ chi^0_4)
     6.78831375E-02    2     1000024        12   # BR(S^+_3 -> chi^+_1 nu_1)
     1.83632688E-01    2     1000024        14   # BR(S^+_3 -> chi^+_1 nu_2)
     2.17935017E-01    2     1000024        16   # BR(S^+_3 -> chi^+_1 nu_3)
     1.23188232E-02    2     1000037        12   # BR(S^+_3 -> chi^+_2 nu_1)
     3.33239630E-02    2     1000037        14   # BR(S^+_3 -> chi^+_2 nu_2)
     3.95488470E-02    2     1000037        16   # BR(S^+_3 -> chi^+_2 nu_3)
DECAY  -1000011     1.84734449E+01   # S^+_4
#    BR                NDA      ID1      ID2
     7.35869936E-02    2         -11   1000022   # BR(S^+_4 -> e^+ chi^0_1)
     3.08334791E-01    2         -11   1000023   # BR(S^+_4 -> e^+ chi^0_2)
     1.24448145E-03    2         -11   1000025   # BR(S^+_4 -> e^+ chi^0_3)
     1.75877187E-02    2         -11   1000035   # BR(S^+_4 -> e^+ chi^0_4)
     3.44585531E-01    2     1000024        12   # BR(S^+_4 -> chi^+_1 nu_1)
     1.59378948E-01    2     1000024        14   # BR(S^+_4 -> chi^+_1 nu_2)
     1.50922896E-03    2     1000024        16   # BR(S^+_4 -> chi^+_1 nu_3)
     6.39253460E-02    2     1000037        12   # BR(S^+_4 -> chi^+_2 nu_1)
     2.95669599E-02    2     1000037        14   # BR(S^+_4 -> chi^+_2 nu_2)
     2.79984681E-04    2     1000037        16   # BR(S^+_4 -> chi^+_2 nu_3)
DECAY  -2000011     7.24872251E+00   # S^+_5
#    BR                NDA      ID1      ID2
     9.67371575E-01    2         -11   1000022   # BR(S^+_5 -> e^+ chi^0_1)
     1.42839127E-02    2         -11   1000023   # BR(S^+_5 -> e^+ chi^0_2)
     4.48472649E-03    2         -11   1000025   # BR(S^+_5 -> e^+ chi^0_3)
     1.38502774E-02    2         -11   1000035   # BR(S^+_5 -> e^+ chi^0_4)
     5.38587784E-06    2     1000024        12   # BR(S^+_5 -> chi^+_1 nu_1)
     2.49078655E-06    2     1000024        14   # BR(S^+_5 -> chi^+_1 nu_2)
     1.09610593E-06    2     1000037        12   # BR(S^+_5 -> chi^+_2 nu_1)
DECAY  -2000013     9.15627555E+00   # S^+_6
#    BR                NDA      ID1      ID2
     6.60199093E-01    2         -13   1000022   # BR(S^+_6 -> mu^+ chi^0_1)
     1.13768659E-01    2         -13   1000023   # BR(S^+_6 -> mu^+ chi^0_2)
     3.96916340E-03    2         -13   1000025   # BR(S^+_6 -> mu^+ chi^0_3)
     1.65344978E-02    2         -13   1000035   # BR(S^+_6 -> mu^+ chi^0_4)
     2.46375924E-02    2     1000024        12   # BR(S^+_6 -> chi^+_1 nu_1)
     6.66598658E-02    2     1000024        14   # BR(S^+_6 -> chi^+_1 nu_2)
     7.91073072E-02    2     1000024        16   # BR(S^+_6 -> chi^+_1 nu_3)
     5.07830631E-03    2     1000037        12   # BR(S^+_6 -> chi^+_2 nu_1)
     1.37399168E-02    2     1000037        14   # BR(S^+_6 -> chi^+_2 nu_2)
     1.63055914E-02    2     1000037        16   # BR(S^+_6 -> chi^+_2 nu_3)
DECAY        37     1.93800804E+01   # S^+_7
#    BR                NDA      ID1      ID2
     3.68858423E-05    2          -3         4   # BR(S^+_7 -> s_bar c)
     1.11315968E-01    2          -5         6   # BR(S^+_7 -> b_bar t)
     7.21077106E-06    2         -13        12   # BR(S^+_7 -> mu^+ nu_1)
     1.95087377E-05    2         -13        14   # BR(S^+_7 -> mu^+ nu_2)
     2.31519748E-05    2         -13        16   # BR(S^+_7 -> mu^+ nu_3)
     2.45001369E-03    2         -15        12   # BR(S^+_7 -> tau^+ nu_1)
     4.14029269E-03    2         -15        14   # BR(S^+_7 -> tau^+ nu_2)
     7.51506375E-03    2         -15        16   # BR(S^+_7 -> tau^+ nu_3)
     5.04979606E-02    2     1000024   1000022   # BR(S^+_7 -> chi^+_1 chi^0_1)
     5.76781211E-04    2     1000024   1000023   # BR(S^+_7 -> chi^+_1 chi^0_2)
     2.23835694E-01    2     1000024   1000025   # BR(S^+_7 -> chi^+_1 chi^0_3)
     2.27451105E-01    2     1000024   1000035   # BR(S^+_7 -> chi^+_1 chi^0_4)
     3.20209885E-02    2     1000037   1000022   # BR(S^+_7 -> chi^+_2 chi^0_1)
     3.07297597E-01    2     1000037   1000023   # BR(S^+_7 -> chi^+_2 chi^0_2)
     2.80325886E-02    2     1000037   1000025   # BR(S^+_7 -> chi^+_2 chi^0_3)
     4.72859897E-03    2     1000037   1000035   # BR(S^+_7 -> chi^+_2 chi^0_4)
     5.04598601E-05    2          25        24   # BR(S^+_7 -> S^0_1 W^+)
Block SPhenoLowEnergy  # low energy observables
    1    0.00000000E+00   # BR(b -> s gamma)
    2    0.00000000E+00   # BR(b -> s mu+ mu-)
    3    0.00000000E+00   # BR(b -> s nu nu)
    4    0.00000000E+00   # BR(Bd -> mu+ mu-)
    5    0.00000000E+00   # BR(Bs -> mu+ mu-)
    6    0.00000000E+00   # BR(B_u -> tau nu)
    7    0.00000000E+00   # BR(B_u -> tau nu)/BR(B_u -> tau nu)_SM
    8    0.00000000E+00   # |Delta(M_Bd)| [ps^-1] 
    9    0.00000000E+00   # |Delta(M_Bs)| [ps^-1] 
   20    0.00000000E+00   # Delta(g-2)_electron/2
   21    0.00000000E+00   # Delta(g-2)_muon/2
   22    0.00000000E+00   # Delta(g-2)_tau/2
   23    0.00000000E+00   # electric dipole moment of the electron
   24    0.00000000E+00   # electric dipole moment of the muon
   25    0.00000000E+00   # electric dipole moment of the tau
   26    0.00000000E+00   # Br(mu -> e gamma)
   27    0.00000000E+00   # Br(tau -> e gamma)
   28    0.00000000E+00   # Br(tau -> mu gamma)
   29    0.00000000E+00   # Br(mu -> 3 e)
   30    0.00000000E+00   # Br(tau -> 3 e)
   31    0.00000000E+00   # Br(tau -> 3 mu)
   39    0.00000000E+00   # Delta(rho_parameter)
   40    0.00000000E+00   # BR(Z -> e mu)
   41    0.00000000E+00   # BR(Z -> e tau)
   42    0.00000000E+00   # BR(Z -> mu tau)
