  65
  401    427.2785    0.16281E-24
  402    420.7399    0.15509E-24
  403    427.2786    0.16281E-24
  404    420.7423    0.15509E-24
  405    391.6754    0.23519E-24
  406    280.3164    0.42749E-24
  407    427.2785    0.16281E-24
  408    420.7399    0.15509E-24
  409    427.2786    0.16281E-24
  410    420.7423    0.15509E-24
  411    391.6754    0.23519E-24
  412    280.3164    0.42749E-24
  413    410.5630    0.30618E-23
  414    410.0203    0.76659E-24
  415    410.5630    0.30618E-23
  416    410.0228    0.76661E-24
  417    410.7464    0.17167E-23
  418    468.1067    0.14817E-24
  419    410.5630    0.30618E-23
  420    410.0203    0.76659E-24
  421    410.5630    0.30618E-23
  422    410.0228    0.76661E-24
  423    410.7464    0.17167E-23
  424    468.1067    0.14817E-24
  425    158.0880    0.14256E-23
  426    139.9168    0.18894E-23
  427    158.0880    0.14256E-23
  428    139.9168    0.18894E-23
  429    117.7206    0.24316E-23
  430    139.0685    0.19537E-23
  431    158.0880    0.14256E-23
  432    139.9168    0.18894E-23
  433    158.0880    0.14256E-23
  434    139.9168    0.18894E-23
  435    117.7206    0.24316E-23
  436    139.0685    0.19537E-23
  437    118.1274    0.23714E-23
  438      0.0000    0.10000E+31
  439    118.1274    0.23714E-23
  440      0.0000    0.10000E+31
  441    158.0077    0.14408E-23
  442      0.0000    0.10000E+31
  443    118.1274    0.23714E-23
  444      0.0000    0.10000E+31
  445    118.1274    0.23714E-23
  446      0.0000    0.10000E+31
  447    158.0077    0.14408E-23
  448      0.0000    0.10000E+31
  449    452.4167    0.20734E-24
  450     63.2531    0.10000E+31
  451    115.9689    0.22042E-19
  452   -279.8145    0.41159E-24
  453    313.7090    0.24951E-24
  454    112.8993    0.10055E-19
  455    308.5492    0.25118E-24
  456    112.8993    0.10055E-19
  457    308.5492    0.25118E-24
  203     93.6022    0.16563E-21
  204    336.7472    0.15636E-23
  205    329.8170    0.68118E-24
  206    341.2014    0.48049E-24
  207    341.2014    0.48049E-24
  458      0.0000    0.10000E+31
    6    172.5000    0.57395E-24
   12    172.5000    0.57395E-24
   6
   401  0.53910699E-01     0   450     1     0     0     0
   401  0.28061345E+00     0   451     1     0     0     0
   401  0.12992320E-02     0   452     1     0     0     0
   401  0.15393374E-01     0   453     1     0     0     0
   401  0.60521227E+00     0   456     2     0     0     0
   401  0.43570995E-01     0   457     2     0     0     0
   6
   402  0.18366980E-04     0   450     2     0     0     0
   402  0.32292929E+00     0   451     2     0     0     0
   402  0.71143202E-03     0   452     2     0     0     0
   402  0.10015272E-01     0   453     2     0     0     0
   402  0.64903259E+00     0   454     1     0     0     0
   402  0.17293068E-01     0   455     1     0     0     0
   6
   403  0.53911649E-01     0   450     3     0     0     0
   403  0.28061840E+00     0   451     3     0     0     0
   403  0.12992555E-02     0   452     3     0     0     0
   403  0.15393655E-01     0   453     3     0     0     0
   403  0.60520905E+00     0   456     4     0     0     0
   403  0.43567993E-01     0   457     4     0     0     0
   6
   404  0.18366711E-04     0   450     4     0     0     0
   404  0.32292417E+00     0   451     4     0     0     0
   404  0.71140222E-03     0   452     4     0     0     0
   404  0.10014573E-01     0   453     4     0     0     0
   404  0.64903790E+00     0   454     3     0     0     0
   404  0.17293634E-01     0   455     3     0     0     0
   6
   405  0.74553743E-01     0   450     5     0     0     0
   405  0.34580430E+00     0   451     5     0     0     0
   405  0.13071240E-02     0   452     5     0     0     0
   405  0.11095855E-01     0   453     5     0     0     0
   405  0.39129055E+00     0   456     6     0     0     0
   405  0.17594846E+00     0   199   406     0     0     0
   2
   406  0.85723624E-01     0   450     6     0     0     0
   406  0.91427636E+00     0   454     5     0     0     0
   6
   407  0.53910699E-01     0   450     7     0     0     0
   407  0.28061345E+00     0   451     7     0     0     0
   407  0.12992320E-02     0   452     7     0     0     0
   407  0.15393374E-01     0   453     7     0     0     0
   407  0.60521227E+00     0   454     8     0     0     0
   407  0.43570995E-01     0   455     8     0     0     0
   6
   408  0.18366980E-04     0   450     8     0     0     0
   408  0.32292929E+00     0   451     8     0     0     0
   408  0.71143202E-03     0   452     8     0     0     0
   408  0.10015272E-01     0   453     8     0     0     0
   408  0.64903259E+00     0   456     7     0     0     0
   408  0.17293068E-01     0   457     7     0     0     0
   6
   409  0.53911649E-01     0   450     9     0     0     0
   409  0.28061840E+00     0   451     9     0     0     0
   409  0.12992555E-02     0   452     9     0     0     0
   409  0.15393655E-01     0   453     9     0     0     0
   409  0.60520905E+00     0   454    10     0     0     0
   409  0.43567993E-01     0   455    10     0     0     0
   6
   410  0.18366711E-04     0   450    10     0     0     0
   410  0.32292417E+00     0   451    10     0     0     0
   410  0.71140222E-03     0   452    10     0     0     0
   410  0.10014573E-01     0   453    10     0     0     0
   410  0.64903790E+00     0   456     9     0     0     0
   410  0.17293634E-01     0   457     9     0     0     0
   6
   411  0.74553743E-01     0   450    11     0     0     0
   411  0.34580430E+00     0   451    11     0     0     0
   411  0.13071240E-02     0   452    11     0     0     0
   411  0.11095855E-01     0   453    11     0     0     0
   411  0.39129055E+00     0   454    12     0     0     0
   411  0.17594846E+00     0   198   412     0     0     0
   2
   412  0.85723624E-01     0   450    12     0     0     0
   412  0.91427636E+00     0   456    11     0     0     0
   4
   413  0.93388599E+00     0   450     1     0     0     0
   413  0.60973994E-01     0   451     1     0     0     0
   413  0.97689789E-03     0   452     1     0     0     0
   413  0.41630929E-02     0   453     1     0     0     0
   4
   414  0.93393725E+00     0   450     2     0     0     0
   414  0.60957178E-01     0   451     2     0     0     0
   414  0.97259303E-03     0   452     2     0     0     0
   414  0.41329702E-02     0   453     2     0     0     0
   4
   415  0.93388599E+00     0   450     3     0     0     0
   415  0.60973998E-01     0   451     3     0     0     0
   415  0.97689836E-03     0   452     3     0     0     0
   415  0.41630962E-02     0   453     3     0     0     0
   4
   416  0.93393761E+00     0   450     4     0     0     0
   416  0.60957119E-01     0   451     4     0     0     0
   416  0.97256131E-03     0   452     4     0     0     0
   416  0.41326811E-02     0   453     4     0     0     0
   6
   417  0.49785063E+00     0   450     5     0     0     0
   417  0.15190877E+00     0   451     5     0     0     0
   417  0.11774462E-01     0   452     5     0     0     0
   417  0.23199067E-01     0   453     5     0     0     0
   417  0.14745212E+00     0   456     6     0     0     0
   417  0.16781494E+00     0   199   406     0     0     0
   7
   418  0.19642279E+00     0   454     5     0     0     0
   418  0.31801891E+00     0   455     5     0     0     0
   418  0.30037245E+00     0   200   406     0     0     0
   418  0.44614442E-01     0   203   406     0     0     0
   418  0.20135105E-01     0   450     6     0     0     0
   418  0.10090204E+00     0   451     6     0     0     0
   418  0.19534271E-01     0   452     6     0     0     0
   4
   419  0.93388599E+00     0   450     7     0     0     0
   419  0.60973994E-01     0   451     7     0     0     0
   419  0.97689789E-03     0   452     7     0     0     0
   419  0.41630929E-02     0   453     7     0     0     0
   4
   420  0.93393725E+00     0   450     8     0     0     0
   420  0.60957178E-01     0   451     8     0     0     0
   420  0.97259303E-03     0   452     8     0     0     0
   420  0.41329702E-02     0   453     8     0     0     0
   4
   421  0.93388599E+00     0   450     9     0     0     0
   421  0.60973998E-01     0   451     9     0     0     0
   421  0.97689836E-03     0   452     9     0     0     0
   421  0.41630962E-02     0   453     9     0     0     0
   4
   422  0.93393761E+00     0   450    10     0     0     0
   422  0.60957119E-01     0   451    10     0     0     0
   422  0.97256131E-03     0   452    10     0     0     0
   422  0.41326811E-02     0   453    10     0     0     0
   6
   423  0.49785063E+00     0   450    11     0     0     0
   423  0.15190877E+00     0   451    11     0     0     0
   423  0.11774462E-01     0   452    11     0     0     0
   423  0.23199067E-01     0   453    11     0     0     0
   423  0.14745212E+00     0   454    12     0     0     0
   423  0.16781494E+00     0   198   412     0     0     0
   7
   424  0.19642279E+00     0   456    11     0     0     0
   424  0.31801891E+00     0   457    11     0     0     0
   424  0.30037245E+00     0   200   412     0     0     0
   424  0.44614442E-01     0   203   412     0     0     0
   424  0.20135105E-01     0   450    12     0     0     0
   424  0.10090204E+00     0   451    12     0     0     0
   424  0.19534271E-01     0   452    12     0     0     0
   3
   425  0.11915299E+00     0   450   121     0     0     0
   425  0.33680865E+00     0   451   121     0     0     0
   425  0.54403836E+00     0   456   122     0     0     0
   3
   426  0.53195179E+00     0   450   122     0     0     0
   426  0.96364893E-01     0   451   122     0     0     0
   426  0.37168336E+00     0   454   121     0     0     0
   3
   427  0.11915294E+00     0   450   123     0     0     0
   427  0.33680782E+00     0   451   123     0     0     0
   427  0.54403925E+00     0   456   124     0     0     0
   3
   428  0.53195357E+00     0   450   124     0     0     0
   428  0.96365221E-01     0   451   124     0     0     0
   428  0.37168121E+00     0   454   123     0     0     0
   2
   429  0.99943024E+00     0   450   125     0     0     0
   429  0.56977686E-03     0   456   126     0     0     0
   3
   430  0.54331368E+00     0   450   126     0     0     0
   430  0.93796037E-01     0   451   126     0     0     0
   430  0.36289033E+00     0   454   125     0     0     0
   3
   431  0.11915299E+00     0   450   127     0     0     0
   431  0.33680865E+00     0   451   127     0     0     0
   431  0.54403836E+00     0   454   128     0     0     0
   3
   432  0.53195179E+00     0   450   128     0     0     0
   432  0.96364893E-01     0   451   128     0     0     0
   432  0.37168336E+00     0   456   127     0     0     0
   3
   433  0.11915294E+00     0   450   129     0     0     0
   433  0.33680782E+00     0   451   129     0     0     0
   433  0.54403925E+00     0   454   130     0     0     0
   3
   434  0.53195357E+00     0   450   130     0     0     0
   434  0.96365221E-01     0   451   130     0     0     0
   434  0.37168121E+00     0   456   129     0     0     0
   2
   435  0.99943024E+00     0   450   131     0     0     0
   435  0.56977686E-03     0   454   132     0     0     0
   3
   436  0.54331368E+00     0   450   132     0     0     0
   436  0.93796037E-01     0   451   132     0     0     0
   436  0.36289033E+00     0   456   131     0     0     0
   2
   437  0.99981064E+00     0   450   121     0     0     0
   437  0.18936380E-03     0   451   121     0     0     0
   0
   2
   439  0.99981087E+00     0   450   123     0     0     0
   439  0.18914374E-03     0   451   123     0     0     0
   0
   3
   441  0.13879141E+00     0   450   125     0     0     0
   441  0.32929632E+00     0   451   125     0     0     0
   441  0.53191227E+00     0   456   126     0     0     0
   0
   2
   443  0.99981064E+00     0   450   127     0     0     0
   443  0.18936380E-03     0   451   127     0     0     0
   0
   2
   445  0.99981087E+00     0   450   129     0     0     0
   445  0.18914374E-03     0   451   129     0     0     0
   0
   3
   447  0.13879141E+00     0   450   131     0     0     0
   447  0.32929632E+00     0   451   131     0     0     0
   447  0.53191227E+00     0   454   132     0     0     0
   0
  26
   449  0.23929286E-02     0   454     5    12     0     0
   449  0.23929286E-02     0   456     6    11     0     0
   449  0.43115107E-03     0   450     6    12     0     0
   449  0.28049932E-04     0   451    13     0     0     0
   449  0.61910127E-04     0   452    13     0     0     0
   449  0.61638246E-04     0   453    13     0     0     0
   449  0.32617375E-01     0   408     2     0     0     0
   449  0.32617375E-01     0   402     8     0     0     0
   449  0.20850424E-01     0   407     1     0     0     0
   449  0.20850424E-01     0   401     7     0     0     0
   449  0.57002630E-01     0   420     2     0     0     0
   449  0.57002630E-01     0   414     8     0     0     0
   449  0.55622742E-01     0   419     1     0     0     0
   449  0.55622742E-01     0   413     7     0     0     0
   449  0.20849712E-01     0   409     3     0     0     0
   449  0.20849712E-01     0   403     9     0     0     0
   449  0.55622019E-01     0   421     3     0     0     0
   449  0.55622019E-01     0   415     9     0     0     0
   449  0.32585129E-01     0   410     4     0     0     0
   449  0.32585129E-01     0   404    10     0     0     0
   449  0.56970254E-01     0   422     4     0     0     0
   449  0.56970254E-01     0   416    10     0     0     0
   449  0.10725138E+00     0   411     5     0     0     0
   449  0.10725138E+00     0   405    11     0     0     0
   449  0.57944033E-01     0   423     5     0     0     0
   449  0.57944033E-01     0   417    11     0     0     0
   0
  16
   451  0.32449266E-03     0   450    59     0     0     0
   451  0.12204224E-04     0   456     2     7     0     0
   451  0.12204224E-04     0   454     1     8     0     0
   451  0.12204224E-04     0   456     4     9     0     0
   451  0.12204224E-04     0   454     3    10     0     0
   451  0.57266764E-02     0   450     2     8     0     0
   451  0.10468127E-01     0   450     1     7     0     0
   451  0.10468125E-01     0   450     3     9     0     0
   451  0.57266671E-02     0   450     4    10     0     0
   451  0.10856090E-01     0   450     5    11     0     0
   451  0.21153595E+00     0   450   121   127     0     0
   451  0.21153456E+00     0   450   123   129     0     0
   451  0.25059325E+00     0   450   125   131     0     0
   451  0.92546865E-01     0   450   122   128     0     0
   451  0.92546865E-01     0   450   124   130     0     0
   451  0.97623512E-01     0   450   126   132     0     0
  24
   452  0.30564710E+00     0   454   199     0     0     0
   452  0.30564710E+00     0   456   198     0     0     0
   452  0.16805346E+00     0   450   200     0     0     0
   452  0.17218408E+00     0   451   200     0     0     0
   452  0.14640962E-01     0   450   203     0     0     0
   452  0.68698958E-02     0   451   203     0     0     0
   452  0.48761826E-03     0   425   127     0     0     0
   452  0.48761826E-03     0   431   121     0     0     0
   452  0.48761797E-03     0   427   129     0     0     0
   452  0.48761797E-03     0   433   123     0     0     0
   452  0.94847381E-03     0   437   127     0     0     0
   452  0.94847381E-03     0   443   121     0     0     0
   452  0.94847346E-03     0   439   129     0     0     0
   452  0.94847346E-03     0   445   123     0     0     0
   452  0.11372889E-02     0   429   131     0     0     0
   452  0.11372889E-02     0   435   125     0     0     0
   452  0.11998744E-02     0   441   131     0     0     0
   452  0.11998744E-02     0   447   125     0     0     0
   452  0.27490493E-02     0   426   128     0     0     0
   452  0.27490493E-02     0   432   122     0     0     0
   452  0.27490493E-02     0   428   130     0     0     0
   452  0.27490493E-02     0   434   124     0     0     0
   452  0.27712549E-02     0   430   132     0     0     0
   452  0.27712549E-02     0   436   126     0     0     0
  24
   453  0.25372344E+00     0   454   199     0     0     0
   453  0.25372344E+00     0   456   198     0     0     0
   453  0.12961536E-01     0   450   200     0     0     0
   453  0.77290037E-02     0   451   200     0     0     0
   453  0.76905556E-01     0   450   203     0     0     0
   453  0.89389563E-01     0   451   203     0     0     0
   453  0.12056804E-01     0   425   127     0     0     0
   453  0.12056804E-01     0   431   121     0     0     0
   453  0.12056799E-01     0   427   129     0     0     0
   453  0.12056799E-01     0   433   123     0     0     0
   453  0.49610985E-02     0   437   127     0     0     0
   453  0.49610985E-02     0   443   121     0     0     0
   453  0.49610971E-02     0   439   129     0     0     0
   453  0.49610971E-02     0   445   123     0     0     0
   453  0.44757565E-02     0   429   131     0     0     0
   453  0.44757565E-02     0   435   125     0     0     0
   453  0.12889730E-01     0   441   131     0     0     0
   453  0.12889730E-01     0   447   125     0     0     0
   453  0.33726547E-01     0   426   128     0     0     0
   453  0.33726547E-01     0   432   122     0     0     0
   453  0.33726547E-01     0   428   130     0     0     0
   453  0.33726547E-01     0   434   124     0     0     0
   453  0.33929355E-01     0   430   132     0     0     0
   453  0.33929355E-01     0   436   126     0     0     0
   5
   454  0.24482840E+00     0   450     2     7     0     0
   454  0.24482840E+00     0   450     4     9     0     0
   454  0.16605647E+00     0   450   127   122     0     0
   454  0.16605648E+00     0   450   129   124     0     0
   454  0.17823026E+00     0   450   131   126     0     0
  14
   455  0.17912455E-01     0   450   198     0     0     0
   455  0.30738580E+00     0   451   198     0     0     0
   455  0.37028044E-01     0   406    11     0     0     0
   455  0.30335251E-01     0   426   127     0     0     0
   455  0.30335248E-01     0   428   129     0     0     0
   455  0.31006066E-01     0   430   131     0     0     0
   455  0.57648946E-01     0   431   122     0     0     0
   455  0.57648927E-01     0   433   124     0     0     0
   455  0.24323075E-03     0   435   126     0     0     0
   455  0.58028378E-01     0   447   126     0     0     0
   455  0.23050256E+00     0   454   200     0     0     0
   455  0.11253614E-04     0   454     2     8     0     0
   455  0.11253604E-04     0   454     4    10     0     0
   455  0.14190258E+00     0   454   203     0     0     0
   5
   456  0.24482840E+00     0   450     8     1     0     0
   456  0.24482840E+00     0   450    10     3     0     0
   456  0.16605647E+00     0   450   121   128     0     0
   456  0.16605648E+00     0   450   123   130     0     0
   456  0.17823026E+00     0   450   125   132     0     0
  14
   457  0.17912455E-01     0   450   199     0     0     0
   457  0.30738580E+00     0   451   199     0     0     0
   457  0.37028044E-01     0   412     5     0     0     0
   457  0.30335251E-01     0   432   121     0     0     0
   457  0.30335248E-01     0   434   123     0     0     0
   457  0.31006066E-01     0   436   125     0     0     0
   457  0.57648946E-01     0   425   128     0     0     0
   457  0.57648927E-01     0   427   130     0     0     0
   457  0.24323075E-03     0   429   132     0     0     0
   457  0.58028378E-01     0   441   132     0     0     0
   457  0.23050256E+00     0   456   200     0     0     0
   457  0.11253614E-04     0   456     8     2     0     0
   457  0.11253604E-04     0   456    10     4     0     0
   457  0.14190258E+00     0   456   203     0     0     0
  17
   203  0.21684667E-03     0   123   129     0     0     0
   203  0.61974417E-01     0   125   131     0     0     0
   203  0.26128874E-02     0     3     9     0     0     0
   203  0.88173652E+00     0     5    11     0     0     0
   203  0.30361295E-01     0     4    10     0     0     0
   203  0.92392560E-03     0    59    59     0     0     0
   203  0.21598838E-01     0    13    13     0     0     0
   203  0.31959986E-04     0   198   121   128     0     0
   203  0.31959986E-04     0   198   123   130     0     0
   203  0.31959986E-04     0   198   125   132     0     0
   203  0.95879957E-04     0   198     8     1     0     0
   203  0.95879957E-04     0   198    10     3     0     0
   203  0.31959986E-04     0   199   127   122     0     0
   203  0.31959986E-04     0   199   129   124     0     0
   203  0.31959986E-04     0   199   131   126     0     0
   203  0.95879957E-04     0   199     2     7     0     0
   203  0.95879957E-04     0   199     4     9     0     0
  25
   204  0.50032002E-04     0   123   129     0     0     0
   204  0.14327546E-01     0   125   131     0     0     0
   204  0.59253152E-03     0     3     9     0     0     0
   204  0.10081103E+00     0     5    11     0     0     0
   204  0.12395669E-03     0     4    10     0     0     0
   204  0.23244751E-04     0    59    59     0     0     0
   204  0.33623918E-02     0    13    13     0     0     0
   204  0.41787621E-01     0   198   199     0     0     0
   204  0.19522633E-01     0   200   200     0     0     0
   204  0.68704858E-01     0   450   450     0     0     0
   204  0.13705882E+00     0   450   451     0     0     0
   204  0.57305109E-01     0   451   451     0     0     0
   204  0.26659766E+00     0   454   456     0     0     0
   204  0.13003755E+00     0   203   203     0     0     0
   204  0.64922082E-02     0   425   431     0     0     0
   204  0.10073533E-01     0   437   443     0     0     0
   204  0.64919041E-02     0   427   433     0     0     0
   204  0.10073001E-01     0   439   445     0     0     0
   204  0.10138506E-01     0   429   435     0     0     0
   204  0.63309390E-02     0   441   447     0     0     0
   204  0.13537149E-04     0   429   447     0     0     0
   204  0.13537149E-04     0   441   435     0     0     0
   204  0.36526140E-01     0   426   432     0     0     0
   204  0.36526140E-01     0   428   434     0     0     0
   204  0.37015572E-01     0   430   436     0     0     0
  11
   205  0.22042110E-04     0   123   129     0     0     0
   205  0.63128332E-02     0   125   131     0     0     0
   205  0.26110787E-03     0     3     9     0     0     0
   205  0.44444188E-01     0     5    11     0     0     0
   205  0.41347750E-04     0     4    10     0     0     0
   205  0.87079534E-03     0    13    13     0     0     0
   205  0.76124318E-01     0   450   450     0     0     0
   205  0.19858152E+00     0   450   451     0     0     0
   205  0.12702088E+00     0   451   451     0     0     0
   205  0.53249598E+00     0   454   456     0     0     0
   205  0.13824993E-01     0   203   200     0     0     0
  11
   206  0.16084232E-04     0   124   129     0     0     0
   206  0.46065212E-02     0   126   131     0     0     0
   206  0.20063517E-03     0     4     9     0     0     0
   206  0.80392730E+00     0     6    11     0     0     0
   206  0.13801570E+00     0   454   450     0     0     0
   206  0.10561561E-01     0   454   451     0     0     0
   206  0.11905754E-01     0   203   198     0     0     0
   206  0.10197628E-01     0   431   426     0     0     0
   206  0.10197452E-01     0   433   428     0     0     0
   206  0.44909847E-03     0   435   430     0     0     0
   206  0.99222390E-02     0   447   430     0     0     0
  11
   207  0.16084232E-04     0   130   123     0     0     0
   207  0.46065212E-02     0   132   125     0     0     0
   207  0.20063517E-03     0    10     3     0     0     0
   207  0.80392730E+00     0    12     5     0     0     0
   207  0.13801570E+00     0   456   450     0     0     0
   207  0.10561561E-01     0   456   451     0     0     0
   207  0.11905754E-01     0   203   199     0     0     0
   207  0.10197628E-01     0   425   432     0     0     0
   207  0.10197452E-01     0   427   434     0     0     0
   207  0.44909847E-03     0   429   436     0     0     0
   207  0.99222390E-02     0   441   436     0     0     0
   0
   5
     6  0.33333334E+00   100     2     7     5     0     0
     6  0.33333334E+00   100     4     9     5     0     0
     6  0.11111111E+00   100   122   127     5     0     0
     6  0.11111111E+00   100   124   129     5     0     0
     6  0.11111111E+00   100   126   131     5     0     0
   5
    12  0.33333334E+00   100     8     1    11     0     0
    12  0.33333334E+00   100    10     3    11     0     0
    12  0.11111111E+00   100   128   121    11     0     0
    12  0.11111111E+00   100   130   123    11     0     0
    12  0.11111111E+00   100   132   125    11     0     0
      3.00000000     -0.36634284
      0.95281523     -0.18135013      0.21545547     -0.11328870
     -0.25829279     -0.90469164      0.28195062     -0.18794075
      0.05618107     -0.08432774     -0.69415414     -0.71265876
      0.14923736     -0.37620994     -0.62628496      0.66630417
     -0.95026785      0.31143376     -0.31143376     -0.95026785
     -0.88665134      0.46243858     -0.46243858     -0.88665134
     -0.93295324     -0.23714659     -1.42037880
   -330.11175537   -529.33459473   -115.17456055
    276.96389771
    T
