  65
  401   1011.2758    0.70488E-25
  402   1008.1195    0.69551E-25
  403   1011.2659    0.70489E-25
  404   1008.1105    0.69552E-25
  405    883.5502    0.69531E-25
  406    774.2648    0.11717E-24
  407   1011.2758    0.70488E-25
  408   1008.1195    0.69551E-25
  409   1011.2659    0.70489E-25
  410   1008.1105    0.69552E-25
  411    883.5502    0.69531E-25
  412    774.2648    0.11717E-24
  413    968.3484    0.13151E-23
  414    971.4475    0.32753E-24
  415    968.3145    0.13151E-23
  416    971.4445    0.32753E-24
  417    937.5005    0.62650E-25
  418    954.2409    0.41380E-25
  419    968.3484    0.13151E-23
  420    971.4475    0.32753E-24
  421    968.3145    0.13151E-23
  422    971.4445    0.32753E-24
  423    937.5005    0.62650E-25
  424    954.2409    0.41380E-25
  425    325.4928    0.38569E-23
  426    315.5499    0.38642E-23
  427    325.5245    0.38558E-23
  428    315.5825    0.38629E-23
  429     57.7167    0.31937E-11
  430    303.8741    0.31339E-24
  431    325.4928    0.38569E-23
  432    315.5499    0.38642E-23
  433    325.5245    0.38558E-23
  434    315.5825    0.38629E-23
  435     57.7167    0.31937E-11
  436    303.8741    0.31339E-24
  437    185.0468    0.38966E-22
  438      0.0000    0.10000E+31
  439    185.5647    0.22864E-20
  440      0.0000    0.10000E+31
  441    340.2419    0.31211E-24
  442      0.0000    0.10000E+31
  443    185.0468    0.38966E-22
  444      0.0000    0.10000E+31
  445    185.5647    0.22864E-20
  446      0.0000    0.10000E+31
  447    340.2419    0.31211E-24
  448      0.0000    0.10000E+31
  449   1103.4200    0.40904E-25
  450    197.1129    0.84403E-24
  451    369.7406    0.66930E-24
  452   -593.8589    0.16262E-24
  453    607.2843    0.14381E-24
  454    369.8197    0.67217E-24
  455    607.8319    0.14753E-24
  456    369.8197    0.67217E-24
  457    607.8319    0.14753E-24
  203    117.7331    0.18009E-23
  204    451.1529    0.25821E-25
  205    450.9670    0.25803E-25
  206    460.2608    0.32254E-25
  207    460.2608    0.32254E-25
  458      0.0000    0.10000E+31
    6    173.3000    0.56017E-24
   12    173.3000    0.56017E-24
   6
   401  0.16355587E-01     0   450     1     0     0     0
   401  0.31480610E+00     0   451     1     0     0     0
   401  0.78792166E-03     0   452     1     0     0     0
   401  0.13162498E-01     0   453     1     0     0     0
   401  0.62000537E+00     0   456     2     0     0     0
   401  0.34882549E-01     0   457     2     0     0     0
   6
   402  0.11695986E-01     0   450     2     0     0     0
   402  0.31786960E+00     0   451     2     0     0     0
   402  0.46772498E-03     0   452     2     0     0     0
   402  0.10290558E-01     0   453     2     0     0     0
   402  0.64554995E+00     0   454     1     0     0     0
   402  0.14126107E-01     0   455     1     0     0     0
   6
   403  0.16355725E-01     0   450     3     0     0     0
   403  0.31480736E+00     0   451     3     0     0     0
   403  0.78791357E-03     0   452     3     0     0     0
   403  0.13162341E-01     0   453     3     0     0     0
   403  0.62000489E+00     0   456     4     0     0     0
   403  0.34881823E-01     0   457     4     0     0     0
   6
   404  0.11696013E-01     0   450     4     0     0     0
   404  0.31786877E+00     0   451     4     0     0     0
   404  0.46771576E-03     0   452     4     0     0     0
   404  0.10290335E-01     0   453     4     0     0     0
   404  0.64555126E+00     0   454     3     0     0     0
   404  0.14125926E-01     0   455     3     0     0     0
   7
   405  0.56942858E-01     0   450     5     0     0     0
   405  0.24063803E+00     0   451     5     0     0     0
   405  0.10745711E+00     0   452     5     0     0     0
   405  0.70856459E-01     0   453     5     0     0     0
   405  0.38472256E+00     0   456     6     0     0     0
   405  0.11451451E+00     0   457     6     0     0     0
   405  0.24868431E-01     0   199   406     0     0     0
   5
   406  0.20436099E+00     0   450     6     0     0     0
   406  0.13144933E+00     0   451     6     0     0     0
   406  0.82756735E-01     0   452     6     0     0     0
   406  0.35534433E+00     0   454     5     0     0     0
   406  0.22608857E+00     0   455     5     0     0     0
   6
   407  0.16355587E-01     0   450     7     0     0     0
   407  0.31480610E+00     0   451     7     0     0     0
   407  0.78792166E-03     0   452     7     0     0     0
   407  0.13162498E-01     0   453     7     0     0     0
   407  0.62000537E+00     0   454     8     0     0     0
   407  0.34882549E-01     0   455     8     0     0     0
   6
   408  0.11695986E-01     0   450     8     0     0     0
   408  0.31786960E+00     0   451     8     0     0     0
   408  0.46772498E-03     0   452     8     0     0     0
   408  0.10290558E-01     0   453     8     0     0     0
   408  0.64554995E+00     0   456     7     0     0     0
   408  0.14126107E-01     0   457     7     0     0     0
   6
   409  0.16355725E-01     0   450     9     0     0     0
   409  0.31480736E+00     0   451     9     0     0     0
   409  0.78791357E-03     0   452     9     0     0     0
   409  0.13162341E-01     0   453     9     0     0     0
   409  0.62000489E+00     0   454    10     0     0     0
   409  0.34881823E-01     0   455    10     0     0     0
   6
   410  0.11696013E-01     0   450    10     0     0     0
   410  0.31786877E+00     0   451    10     0     0     0
   410  0.46771576E-03     0   452    10     0     0     0
   410  0.10290335E-01     0   453    10     0     0     0
   410  0.64555126E+00     0   456     9     0     0     0
   410  0.14125926E-01     0   457     9     0     0     0
   7
   411  0.56942858E-01     0   450    11     0     0     0
   411  0.24063803E+00     0   451    11     0     0     0
   411  0.10745711E+00     0   452    11     0     0     0
   411  0.70856459E-01     0   453    11     0     0     0
   411  0.38472256E+00     0   454    12     0     0     0
   411  0.11451451E+00     0   455    12     0     0     0
   411  0.24868431E-01     0   198   412     0     0     0
   5
   412  0.20436099E+00     0   450    12     0     0     0
   412  0.13144933E+00     0   451    12     0     0     0
   412  0.82756735E-01     0   452    12     0     0     0
   412  0.35534433E+00     0   456    11     0     0     0
   412  0.22608857E+00     0   457    11     0     0     0
   4
   413  0.99593461E+00     0   450     1     0     0     0
   413  0.10963227E-02     0   451     1     0     0     0
   413  0.62107918E-03     0   452     1     0     0     0
   413  0.23480486E-02     0   453     1     0     0     0
   4
   414  0.99591035E+00     0   450     2     0     0     0
   414  0.10980762E-02     0   451     2     0     0     0
   414  0.62549853E-03     0   452     2     0     0     0
   414  0.23661202E-02     0   453     2     0     0     0
   4
   415  0.99593478E+00     0   450     3     0     0     0
   415  0.10963032E-02     0   451     3     0     0     0
   415  0.62103051E-03     0   452     3     0     0     0
   415  0.23478498E-02     0   453     3     0     0     0
   4
   416  0.99591029E+00     0   450     4     0     0     0
   416  0.10980732E-02     0   451     4     0     0     0
   416  0.62549050E-03     0   452     4     0     0     0
   416  0.23660869E-02     0   453     4     0     0     0
   7
   417  0.13874314E-01     0   450     5     0     0     0
   417  0.53244319E-01     0   451     5     0     0     0
   417  0.13957359E+00     0   452     5     0     0     0
   417  0.15271236E+00     0   453     5     0     0     0
   417  0.76511182E-01     0   456     6     0     0     0
   417  0.45781511E+00     0   457     6     0     0     0
   417  0.10626909E+00     0   199   406     0     0     0
   8
   418  0.22132774E+00     0   454     5     0     0     0
   418  0.24152237E+00     0   455     5     0     0     0
   418  0.80900528E-01     0   200   406     0     0     0
   418  0.37274070E-01     0   203   406     0     0     0
   418  0.23785755E-01     0   450     6     0     0     0
   418  0.87656617E-01     0   451     6     0     0     0
   418  0.93376629E-01     0   452     6     0     0     0
   418  0.21415627E+00     0   453     6     0     0     0
   4
   419  0.99593461E+00     0   450     7     0     0     0
   419  0.10963227E-02     0   451     7     0     0     0
   419  0.62107918E-03     0   452     7     0     0     0
   419  0.23480486E-02     0   453     7     0     0     0
   4
   420  0.99591035E+00     0   450     8     0     0     0
   420  0.10980762E-02     0   451     8     0     0     0
   420  0.62549853E-03     0   452     8     0     0     0
   420  0.23661202E-02     0   453     8     0     0     0
   4
   421  0.99593478E+00     0   450     9     0     0     0
   421  0.10963032E-02     0   451     9     0     0     0
   421  0.62103051E-03     0   452     9     0     0     0
   421  0.23478498E-02     0   453     9     0     0     0
   4
   422  0.99591029E+00     0   450    10     0     0     0
   422  0.10980732E-02     0   451    10     0     0     0
   422  0.62549050E-03     0   452    10     0     0     0
   422  0.23660869E-02     0   453    10     0     0     0
   7
   423  0.13874314E-01     0   450    11     0     0     0
   423  0.53244319E-01     0   451    11     0     0     0
   423  0.13957359E+00     0   452    11     0     0     0
   423  0.15271236E+00     0   453    11     0     0     0
   423  0.76511182E-01     0   454    12     0     0     0
   423  0.45781511E+00     0   455    12     0     0     0
   423  0.10626909E+00     0   198   412     0     0     0
   8
   424  0.22132774E+00     0   456    11     0     0     0
   424  0.24152237E+00     0   457    11     0     0     0
   424  0.80900528E-01     0   200   412     0     0     0
   424  0.37274070E-01     0   203   412     0     0     0
   424  0.23785755E-01     0   450    12     0     0     0
   424  0.87656617E-01     0   451    12     0     0     0
   424  0.93376629E-01     0   452    12     0     0     0
   424  0.21415627E+00     0   453    12     0     0     0
   4
   425  0.91379577E+00     0   450   121     0     0     0
   425  0.14974461E-03     0   429   121   131     0     0
   425  0.44283178E-03     0   435   121   125     0     0
   425  0.85611597E-01     0   121   130     0     0     0
   5
   426  0.91492140E+00     0   450   122     0     0     0
   426  0.98625256E-04     0   429   122   131     0     0
   426  0.32843181E-03     0   435   122   125     0     0
   426  0.14978920E-02     0   435   121   126     0     0
   426  0.83153702E-01     0   129   121     0     0     0
   4
   427  0.91381323E+00     0   450   123     0     0     0
   427  0.14982869E-03     0   429   123   131     0     0
   427  0.44296202E-03     0   435   123   125     0     0
   427  0.85593991E-01     0   121   128     0     0     0
   5
   428  0.91494089E+00     0   450   124     0     0     0
   428  0.98677432E-04     0   429   124   131     0     0
   428  0.32851659E-03     0   435   124   125     0     0
   428  0.14983790E-02     0   435   123   126     0     0
   428  0.83133511E-01     0   127   121     0     0     0
   3
   429  0.81903249E-01     0   125   130     0     0     0
   429  0.45861453E+00     0   125   124     0     0     0
   429  0.45948222E+00     0   123   126     0     0     0
   3
   430  0.64472780E-01     0   450   126     0     0     0
   430  0.93550581E+00     0   198   429     0     0     0
   430  0.21488613E-04     0   429   126   131     0     0
   4
   431  0.91379577E+00     0   450   127     0     0     0
   431  0.14974461E-03     0   435   127   125     0     0
   431  0.44283178E-03     0   429   127   131     0     0
   431  0.85611597E-01     0   127   124     0     0     0
   5
   432  0.91492140E+00     0   450   128     0     0     0
   432  0.98625256E-04     0   435   128   125     0     0
   432  0.32843181E-03     0   429   128   131     0     0
   432  0.14978920E-02     0   429   127   132     0     0
   432  0.83153702E-01     0   123   127     0     0     0
   4
   433  0.91381323E+00     0   450   129     0     0     0
   433  0.14982869E-03     0   435   129   125     0     0
   433  0.44296202E-03     0   429   129   131     0     0
   433  0.85593991E-01     0   127   122     0     0     0
   5
   434  0.91494089E+00     0   450   130     0     0     0
   434  0.98677432E-04     0   435   130   125     0     0
   434  0.32851659E-03     0   429   130   131     0     0
   434  0.14983790E-02     0   429   129   132     0     0
   434  0.83133511E-01     0   121   127     0     0     0
   3
   435  0.81903249E-01     0   131   124     0     0     0
   435  0.45861453E+00     0   131   130     0     0     0
   435  0.45948222E+00     0   129   132     0     0     0
   3
   436  0.64472780E-01     0   450   132     0     0     0
   436  0.93550581E+00     0   199   435     0     0     0
   436  0.21488613E-04     0   435   132   125     0     0
   4
   437  0.54129856E-02     0   429   121   131     0     0
   437  0.11155878E-01     0   435   121   125     0     0
   437  0.49171540E+00     0   123   122     0     0     0
   437  0.49171567E+00     0   121   124     0     0     0
   0
   3
   439  0.32846385E+00     0   429   123   131     0     0
   439  0.67152154E+00     0   435   123   125     0     0
   439  0.14573649E-04     0   429   124   132     0     0
   0
   3
   441  0.11869209E+00     0   450   125     0     0     0
   441  0.56722885E+00     0   200   429     0     0     0
   441  0.31407905E+00     0   203   429     0     0     0
   0
   4
   443  0.54129856E-02     0   435   127   125     0     0
   443  0.11155878E-01     0   429   127   131     0     0
   443  0.49171540E+00     0   129   128     0     0     0
   443  0.49171567E+00     0   127   130     0     0     0
   0
   3
   445  0.32846385E+00     0   435   129   125     0     0
   445  0.67152154E+00     0   429   129   131     0     0
   445  0.14573649E-04     0   435   130   126     0     0
   0
   3
   447  0.11869209E+00     0   450   131     0     0     0
   447  0.56722885E+00     0   200   435     0     0     0
   447  0.31407905E+00     0   203   435     0     0     0
   0
  32
   449  0.15091094E-02     0   454     5    12     0     0
   449  0.15091094E-02     0   456     6    11     0     0
   449  0.11778777E-02     0   455     5    12     0     0
   449  0.11778777E-02     0   457     6    11     0     0
   449  0.30204738E-03     0   450     6    12     0     0
   449  0.10916136E-02     0   451     6    12     0     0
   449  0.53049913E-04     0   452    13     0     0     0
   449  0.66421670E-03     0   452     6    12     0     0
   449  0.41076808E-04     0   453    13     0     0     0
   449  0.24542531E-02     0   453     6    12     0     0
   449  0.21349689E-01     0   408     2     0     0     0
   449  0.21349689E-01     0   402     8     0     0     0
   449  0.20018641E-01     0   407     1     0     0     0
   449  0.20018641E-01     0   401     7     0     0     0
   449  0.39532132E-01     0   420     2     0     0     0
   449  0.39532132E-01     0   414     8     0     0     0
   449  0.41286964E-01     0   419     1     0     0     0
   449  0.41286964E-01     0   413     7     0     0     0
   449  0.20022692E-01     0   409     3     0     0     0
   449  0.20022692E-01     0   403     9     0     0     0
   449  0.41306354E-01     0   421     3     0     0     0
   449  0.41306354E-01     0   415     9     0     0     0
   449  0.21351609E-01     0   410     4     0     0     0
   449  0.21351609E-01     0   404    10     0     0     0
   449  0.39532050E-01     0   422     4     0     0     0
   449  0.39532050E-01     0   416    10     0     0     0
   449  0.98095298E-01     0   411     5     0     0     0
   449  0.98095298E-01     0   405    11     0     0     0
   449  0.62380679E-01     0   423     5     0     0     0
   449  0.62380679E-01     0   417    11     0     0     0
   449  0.90133749E-01     0   412     6     0     0     0
   449  0.90133749E-01     0   406    12     0     0     0
   6
   450  0.89755049E-02     0   437   127     0     0     0
   450  0.89755049E-02     0   443   121     0     0     0
   450  0.82435776E-02     0   439   129     0     0     0
   450  0.82435776E-02     0   445   123     0     0     0
   450  0.48278096E+00     0   429   131     0     0     0
   450  0.48278096E+00     0   435   125     0     0     0
  20
   451  0.16210757E-02     0   450   200     0     0     0
   451  0.11637733E-01     0   450   203     0     0     0
   451  0.38985465E-01     0   425   127     0     0     0
   451  0.38985465E-01     0   431   121     0     0     0
   451  0.38933150E-01     0   427   129     0     0     0
   451  0.38933150E-01     0   433   123     0     0     0
   451  0.73813240E-03     0   437   127     0     0     0
   451  0.73813240E-03     0   443   121     0     0     0
   451  0.73536980E-03     0   439   129     0     0     0
   451  0.73536980E-03     0   445   123     0     0     0
   451  0.22101891E+00     0   429   131     0     0     0
   451  0.22101891E+00     0   435   125     0     0     0
   451  0.14046840E-01     0   441   131     0     0     0
   451  0.14046840E-01     0   447   125     0     0     0
   451  0.52217271E-01     0   426   128     0     0     0
   451  0.52217271E-01     0   432   122     0     0     0
   451  0.52159391E-01     0   428   130     0     0     0
   451  0.52159391E-01     0   434   124     0     0     0
   451  0.74536145E-01     0   430   132     0     0     0
   451  0.74536145E-01     0   436   126     0     0     0
  27
   452  0.21901390E+00     0   454   199     0     0     0
   452  0.21901390E+00     0   456   198     0     0     0
   452  0.77505216E-01     0   450   200     0     0     0
   452  0.18786490E+00     0   451   200     0     0     0
   452  0.37765803E-03     0   450     5    11     0     0
   452  0.34525954E-04     0   450   125   131     0     0
   452  0.48787431E-04     0   451     5    11     0     0
   452  0.15951188E-01     0   450   203     0     0     0
   452  0.71971659E-02     0   451   203     0     0     0
   452  0.19006795E-03     0   425   127     0     0     0
   452  0.19006795E-03     0   431   121     0     0     0
   452  0.19003620E-03     0   427   129     0     0     0
   452  0.19003620E-03     0   433   123     0     0     0
   452  0.44390562E-03     0   437   127     0     0     0
   452  0.44390562E-03     0   443   121     0     0     0
   452  0.44337075E-03     0   439   129     0     0     0
   452  0.44337075E-03     0   445   123     0     0     0
   452  0.84445551E-01     0   429   131     0     0     0
   452  0.84445551E-01     0   435   125     0     0     0
   452  0.47865953E-01     0   441   131     0     0     0
   452  0.47865953E-01     0   447   125     0     0     0
   452  0.95413881E-03     0   426   128     0     0     0
   452  0.95413881E-03     0   432   122     0     0     0
   452  0.95398357E-03     0   428   130     0     0     0
   452  0.95398357E-03     0   434   124     0     0     0
   452  0.10094472E-02     0   430   132     0     0     0
   452  0.10094472E-02     0   436   126     0     0     0
  27
   453  0.21637604E+00     0   454   199     0     0     0
   453  0.21637604E+00     0   456   198     0     0     0
   453  0.16395867E-01     0   450   200     0     0     0
   453  0.11351006E-01     0   451   200     0     0     0
   453  0.38537086E-03     0   450     5    11     0     0
   453  0.35830504E-04     0   450   125   131     0     0
   453  0.46582943E-04     0   451     5    11     0     0
   453  0.61692432E-01     0   450   203     0     0     0
   453  0.15338854E+00     0   451   203     0     0     0
   453  0.62432401E-02     0   425   127     0     0     0
   453  0.62432401E-02     0   431   121     0     0     0
   453  0.62422613E-02     0   427   129     0     0     0
   453  0.62422613E-02     0   433   123     0     0     0
   453  0.16201023E-02     0   437   127     0     0     0
   453  0.16201023E-02     0   443   121     0     0     0
   453  0.16182440E-02     0   439   129     0     0     0
   453  0.16182440E-02     0   445   123     0     0     0
   453  0.50517332E-01     0   429   131     0     0     0
   453  0.50517332E-01     0   435   125     0     0     0
   453  0.56512833E-01     0   441   131     0     0     0
   453  0.56512833E-01     0   447   125     0     0     0
   453  0.12841607E-01     0   426   128     0     0     0
   453  0.12841607E-01     0   432   122     0     0     0
   453  0.12839644E-01     0   428   130     0     0     0
   453  0.12839644E-01     0   434   124     0     0     0
   453  0.13540815E-01     0   430   132     0     0     0
   453  0.13540815E-01     0   436   126     0     0     0
   8
   454  0.13148718E-01     0   450   198     0     0     0
   454  0.11300457E+00     0   426   127     0     0     0
   454  0.11287934E+00     0   428   129     0     0     0
   454  0.16776003E+00     0   430   131     0     0     0
   454  0.73161386E-01     0   431   122     0     0     0
   454  0.73063575E-01     0   433   124     0     0     0
   454  0.42237517E+00     0   435   126     0     0     0
   454  0.24607256E-01     0   447   126     0     0     0
  12
   455  0.26659800E-04     0   450   131   126     0     0
   455  0.74947745E-01     0   450   198     0     0     0
   455  0.22578470E+00     0   451   198     0     0     0
   455  0.11899292E-01     0   426   127     0     0     0
   455  0.11897475E-01     0   428   129     0     0     0
   455  0.10347080E+00     0   430   131     0     0     0
   455  0.27358662E-01     0   431   122     0     0     0
   455  0.27354382E-01     0   433   124     0     0     0
   455  0.77603191E-01     0   435   126     0     0     0
   455  0.64744577E-01     0   447   126     0     0     0
   455  0.20632267E+00     0   454   200     0     0     0
   455  0.16858979E+00     0   454   203     0     0     0
   8
   456  0.13148718E-01     0   450   199     0     0     0
   456  0.11300457E+00     0   432   121     0     0     0
   456  0.11287934E+00     0   434   123     0     0     0
   456  0.16776003E+00     0   436   125     0     0     0
   456  0.73161386E-01     0   425   128     0     0     0
   456  0.73063575E-01     0   427   130     0     0     0
   456  0.42237517E+00     0   429   132     0     0     0
   456  0.24607256E-01     0   441   132     0     0     0
  12
   457  0.26659800E-04     0   450   125   132     0     0
   457  0.74947745E-01     0   450   199     0     0     0
   457  0.22578470E+00     0   451   199     0     0     0
   457  0.11899292E-01     0   432   121     0     0     0
   457  0.11897475E-01     0   434   123     0     0     0
   457  0.10347080E+00     0   436   125     0     0     0
   457  0.27358662E-01     0   425   128     0     0     0
   457  0.27354382E-01     0   427   130     0     0     0
   457  0.77603191E-01     0   429   132     0     0     0
   457  0.64744577E-01     0   441   132     0     0     0
   457  0.20632267E+00     0   456   200     0     0     0
   457  0.16858979E+00     0   456   203     0     0     0
  20
   203  0.75475877E-03     0   125   131     0     0     0
   203  0.31683358E-04     0     3     9     0     0     0
   203  0.12486809E-01     0     5    11     0     0     0
   203  0.55576075E-03     0     4    10     0     0     0
   203  0.24902158E-04     0    59    59     0     0     0
   203  0.46129184E-03     0    13    13     0     0     0
   203  0.51799634E-04     0   198   121   128     0     0
   203  0.51799634E-04     0   198   123   130     0     0
   203  0.51799634E-04     0   198   125   132     0     0
   203  0.15539890E-03     0   198     8     1     0     0
   203  0.15539890E-03     0   198    10     3     0     0
   203  0.51799634E-04     0   199   127   122     0     0
   203  0.51799634E-04     0   199   129   124     0     0
   203  0.51799634E-04     0   199   131   126     0     0
   203  0.15539890E-03     0   199     2     7     0     0
   203  0.15539890E-03     0   199     4     9     0     0
   203  0.11241058E-04     0   200     1     7     0     0
   203  0.11241058E-04     0   200     3     9     0     0
   203  0.11241058E-04     0   200     5    11     0     0
   203  0.98471868E+00     0   429   435     0     0     0
  10
   204  0.16834584E-03     0   123   129     0     0     0
   204  0.48212357E-01     0   125   131     0     0     0
   204  0.19878009E-02     0     3     9     0     0     0
   204  0.65328801E+00     0     5    11     0     0     0
   204  0.30375674E-03     0     6    12     0     0     0
   204  0.22367722E-04     0    13    13     0     0     0
   204  0.39624105E-04     0   450   450     0     0     0
   204  0.17228395E+00     0   429   435     0     0     0
   204  0.61846819E-01     0   429   447     0     0     0
   204  0.61846819E-01     0   441   435     0     0     0
  10
   205  0.16817419E-03     0   123   129     0     0     0
   205  0.48166174E-01     0   125   131     0     0     0
   205  0.19857818E-02     0     3     9     0     0     0
   205  0.65282053E+00     0     5    11     0     0     0
   205  0.62285247E-03     0     6    12     0     0     0
   205  0.29842493E-04     0    13    13     0     0     0
   205  0.17416557E-03     0   450   450     0     0     0
   205  0.17246670E+00     0   429   435     0     0     0
   205  0.61782986E-01     0   429   447     0     0     0
   205  0.61782986E-01     0   441   435     0     0     0
   5
   206  0.21455012E-03     0   124   129     0     0     0
   206  0.61448615E-01     0   126   131     0     0     0
   206  0.23119270E-02     0     4     9     0     0     0
   206  0.55839252E+00     0     6    11     0     0     0
   206  0.37763238E+00     0   435   430     0     0     0
   5
   207  0.21455012E-03     0   130   123     0     0     0
   207  0.61448615E-01     0   132   125     0     0     0
   207  0.23119270E-02     0    10     3     0     0     0
   207  0.55839252E+00     0    12     5     0     0     0
   207  0.37763238E+00     0   429   436     0     0     0
   0
   5
     6  0.33333334E+00   100     2     7     5     0     0
     6  0.33333334E+00   100     4     9     5     0     0
     6  0.11111111E+00   100   122   127     5     0     0
     6  0.11111111E+00   100   124   129     5     0     0
     6  0.11111111E+00   100   126   131     5     0     0
   5
    12  0.33333334E+00   100     8     1    11     0     0
    12  0.33333334E+00   100    10     3    11     0     0
    12  0.11111111E+00   100   128   121    11     0     0
    12  0.11111111E+00   100   130   123    11     0     0
    12  0.11111111E+00   100   132   125    11     0     0
     36.22000122     -0.02933761
      0.99565667     -0.01448607      0.08656852     -0.03104535
     -0.03706985     -0.96603078      0.21506469     -0.13841140
      0.03820095     -0.05645908     -0.70276761     -0.70814598
     -0.07638240      0.25176820      0.67258519     -0.69167024
     -0.98036498      0.19719161     -0.19719161     -0.98036498
     -0.95195591      0.30623510     -0.30623510     -0.95195591
     -1.07195592     -0.70945466     -1.17096257
   -837.87402344   5670.06982422  -1727.85998535
    589.59002686
    F
  0.00000000E+00  0.00000000E+00  0.00000000E+00  0.47499899E-01 -0.95265801E-20  0.00000000E+00  0.00000000E+00  0.00000000E+00 -0.55392699E-19 -0.47499899E-01  0.95265801E-20 -0.00000000E+00  0.00000000E+00  0.00000000E+00  0.00000000E+00  0.00000000E+00  0.00000000E+00  0.31177299E-06 -0.00000000E+00 -0.00000000E+00  0.55392699E-19 -0.00000000E+00 -0.00000000E+00 -0.31177299E-06  0.00000000E+00  0.00000000E+00  0.00000000E+00
 -0.81443899E-22  0.84077908E-44  0.00000000E+00  0.00000000E+00 -0.17831900E-20  0.00000000E+00  0.00000000E+00  0.00000000E+00 -0.68729901E-19  0.45840101E-09 -0.50188002E-31  0.00000000E+00 -0.23507499E-32  0.10036600E-07  0.00000000E+00  0.00000000E+00  0.00000000E+00  0.38684101E-06  0.00000000E+00  0.00000000E+00  0.00000000E+00  0.00000000E+00  0.00000000E+00  0.00000000E+00  0.00000000E+00  0.00000000E+00  0.00000000E+00
  0.00000000E+00  0.00000000E+00  0.00000000E+00  0.00000000E+00  0.00000000E+00  0.00000000E+00  0.00000000E+00  0.00000000E+00  0.00000000E+00  0.00000000E+00  0.00000000E+00  0.00000000E+00  0.00000000E+00  0.00000000E+00  0.00000000E+00  0.00000000E+00  0.00000000E+00  0.00000000E+00  0.00000000E+00  0.00000000E+00  0.00000000E+00  0.00000000E+00  0.00000000E+00  0.00000000E+00  0.00000000E+00  0.00000000E+00  0.00000000E+00
