#  ISAJET SUSY parameters in SUSY Les Houches Accord 2 format
#  Created by ISALHA 2.0 Last revision: C. Balazs 21 Apr 2009
Block SPINFO   # Program information
     1   ISASUGRA from ISAJET          # Spectrum Calculator
     2   7.80   29-OCT-2009 12:50:36   # Version number
Block MODSEL   # Model selection
     1     0   #   MsR(Q)          MbR(Q)                          
Block SMINPUTS   # Standard Model inputs
     1     1.27837601E+02   # alpha_em^(-1)
     2     1.16570000E-05   # G_Fermi
     3     1.17200002E-01   # alpha_s(M_Z)
     4     9.11699982E+01   # m_{Z}(pole)
     5     4.19999981E+00   # m_{b}(m_{b})
     6     1.72500000E+02   # m_{top}(pole)
     7     1.77699995E+00   # m_{tau}(pole)
Block MINPAR   # SUSY breaking input parameters
Block MASS   # Scalar and gaugino mass spectrum
#  PDG code   mass                 particle
        24     8.04229965E+01   #  W^+
        25     1.20300003E+02   #  h^0            
        35     2.51769946E+03   #  H^0            
        36     2.50000000E+03   #  A^0            
        37     2.51645581E+03   #  H^+            
   1000001     1.00140430E+03   #  dnl            
   1000002     9.98851196E+02   #  upl            
   1000003     1.00140430E+03   #  stl            
   1000004     9.98852112E+02   #  chl            
   1000005     1.00024969E+03   #  b1             
   1000006     1.00906799E+03   #  t1             
   1000011     2.50035645E+03   #  el-            
   1000012     2.49933496E+03   #  nuel           
   1000013     2.50035645E+03   #  mul-           
   1000014     2.49933496E+03   #  numl           
   1000015     2.50029565E+03   #  tau1           
   1000016     2.49933496E+03   #  nutl           
   1000021     1.20000000E+03   #  glss           
   1000022     4.99348389E+02   #  z1ss           
   1000023     2.42860034E+03   #  z2ss           
   1000024     2.42832593E+03   #  w1ss           
   1000025    -2.50038916E+03   #  z3ss           
   1000035     2.57244043E+03   #  z4ss           
   1000037     2.57219092E+03   #  w2ss           
   2000001     1.00025708E+03   #  dnr            
   2000002     9.99485657E+02   #  upr            
   2000003     1.00025714E+03   #  str            
   2000004     9.99486572E+02   #  chr            
   2000005     1.00141937E+03   #  b2             
   2000006     1.00974225E+03   #  t2             
   2000011     2.50030859E+03   #  er-            
   2000013     2.50030859E+03   #  mur-           
   2000015     2.50037036E+03   #  tau2           
Block ALPHA   # Effective Higgs mixing parameter
         -3.22586089E-01   # alpha
Block STOPMIX   # stop mixing matrix
  1  1     7.15469003E-01   # O_{11}
  1  2     6.98644459E-01   # O_{12}
  2  1    -6.98644459E-01   # O_{21}
  2  2     7.15469003E-01   # O_{22}
Block SBOTMIX   # sbottom mixing matrix
  1  1     5.52335052E-07   # O_{11}
  1  2    -1.00000000E+00   # O_{12}
  2  1     1.00000000E+00   # O_{21}
  2  2     5.52335052E-07   # O_{22}
Block STAUMIX   # stau mixing matrix
  1  1     2.81731172E-06   # O_{11}
  1  2    -1.00000000E+00   # O_{12}
  2  1     1.00000000E+00   # O_{21}
  2  2     2.81731172E-06   # O_{22}
Block NMIX   # neutralino mixing matrix
  1  1     9.99782503E-01   #
  1  2    -5.92538971E-04   #
  1  3     1.86497718E-02   #
  1  4    -9.32106376E-03   #
  2  1     1.44137088E-02   #
  2  2     7.08370090E-01   #
  2  3    -5.02602518E-01   #
  2  4     4.95373696E-01   #
  3  1    -6.59014285E-03   #
  3  2     7.19456375E-03   #
  3  3     7.06963241E-01   #
  3  4     7.07183182E-01   #
  4  1     1.35595864E-02   #
  4  2    -7.05804527E-01   #
  4  3    -4.97238696E-01   #
  4  4     5.04390895E-01   #
Block UMIX   # chargino U mixing matrix
  1  1    -7.02002406E-01   # U_{11}
  1  2     7.12174535E-01   # U_{12}
  2  1    -7.12174535E-01   # U_{21}
  2  2    -7.02002406E-01   # U_{22}
Block VMIX   # chargino V mixing matrix
  1  1    -7.12174356E-01   # V_{11}
  1  2     7.02002585E-01   # V_{12}
  2  1    -7.02002585E-01   # V_{21}
  2  2    -7.12174356E-01   # V_{22}
Block GAUGE Q=  0.00000000E+00   #
     1     0.00000000E+00   # g`
     2     0.00000000E+00   # g_2
     3     0.00000000E+00   # g_3
Block YU Q=  0.00000000E+00   #
  3  3     0.00000000E+00   # y_t
Block YD Q=  0.00000000E+00   #
  3  3     0.00000000E+00   # y_b
Block YE Q=  0.00000000E+00   #
  3  3     0.00000000E+00   # y_tau
Block HMIX Q=  0.00000000E+00   # Higgs mixing parameters
     1     0.00000000E+00   # mu(Q)
     2     0.00000000E+00   # tan(beta)(M_GUT)
     3     0.00000000E+00   # Higgs vev at Q
     4     6.25000000E+06   # m_A^2(Q)
Block MSOFT Q=  0.00000000E+00   # DRbar SUSY breaking parameters
     1     0.00000000E+00   # M_1(Q)          
     2     0.00000000E+00   # M_2(Q)          
     3     0.00000000E+00   # M_3(Q)          
    31     0.00000000E+00   # MeL(Q)          
    32     0.00000000E+00   # MmuL(Q)         
    33     0.00000000E+00   # MtauL(Q)        
    34     0.00000000E+00   # MeR(Q)          
    35     0.00000000E+00   # MmuR(Q)         
    36     0.00000000E+00   # MtauR(Q)        
    41     0.00000000E+00   # MqL1(Q)         
    42     0.00000000E+00   # MqL2(Q)         
    43     0.00000000E+00   # MqL3(Q)         
    44     0.00000000E+00   # MuR(Q)          
    45     0.00000000E+00   # McR(Q)          
    46     0.00000000E+00   # MtR(Q)          
    47     0.00000000E+00   # MdR(Q)          
    48     0.00000000E+00   # MsR(Q)          
    49     0.00000000E+00   # MbR(Q)          
Block AU Q=  0.00000000E+00   #
  1  1     0.00000000E+00   # A_u
  2  2     0.00000000E+00   # A_c
  3  3     0.00000000E+00   # A_t
Block AD Q=  0.00000000E+00   #
  1  1     0.00000000E+00   # A_d
  2  2     0.00000000E+00   # A_s
  3  3     0.00000000E+00   # A_b
Block AE Q=  0.00000000E+00   #
  1  1     0.00000000E+00   # A_e
  2  2     0.00000000E+00   # A_mu
  3  3     0.00000000E+00   # A_tau
#         PDG         Width
DECAY   1000021  2.73729630E+01   # GLSS  decays
#          BR          NDA       ID1       ID2       ID3       ID4
      4.67434078E-02    2     -1000002         2                       # GLSS   -->  UBL    UP                 
      4.67434078E-02    2      1000002        -2                       # GLSS   -->  UPL    UB                 
      4.56702076E-02    2     -1000001         1                       # GLSS   -->  DBL    DN                 
      4.56702076E-02    2      1000001        -1                       # GLSS   -->  DNL    DB                 
      4.64758016E-02    2     -2000002         2                       # GLSS   -->  UBR    UP                 
      4.64758016E-02    2      2000002        -2                       # GLSS   -->  UPR    UB                 
      4.61512245E-02    2     -2000001         1                       # GLSS   -->  DBR    DN                 
      4.61512245E-02    2      2000001        -1                       # GLSS   -->  DNR    DB                 
      4.56701890E-02    2     -1000003         3                       # GLSS   -->  SBL    ST                 
      4.56701890E-02    2      1000003        -3                       # GLSS   -->  STL    SB                 
      4.61511910E-02    2     -2000003         3                       # GLSS   -->  SBR    ST                 
      4.61511910E-02    2      2000003        -3                       # GLSS   -->  STR    SB                 
      4.67421450E-02    2     -1000004         4                       # GLSS   -->  CBL    CH                 
      4.67421450E-02    2      1000004        -4                       # GLSS   -->  CHL    CB                 
      4.64745462E-02    2     -2000004         4                       # GLSS   -->  CBR    CH                 
      4.64745462E-02    2      2000004        -4                       # GLSS   -->  CHR    CB                 
      4.61423956E-02    2     -1000005         5                       # GLSS   -->  BB1    BT                 
      4.61423956E-02    2      1000005        -5                       # GLSS   -->  BT1    BB                 
      4.56519201E-02    2     -2000005         5                       # GLSS   -->  BB2    BT                 
      4.56519201E-02    2      2000005        -5                       # GLSS   -->  BT2    BB                 
      1.62180373E-03    2     -1000006         6                       # GLSS   -->  TB1    TP                 
      1.62180373E-03    2      1000006        -6                       # GLSS   -->  TP1    TB                 
      3.65051664E-02    2     -2000006         6                       # GLSS   -->  TB2    TP                 
      3.65051664E-02    2      2000006        -6                       # GLSS   -->  TP2    TB                 
      2.86667294E-08    2      1000039        21                       # GLSS   -->  GVSS   GL                 
#         PDG         Width
DECAY   1000002  7.88507387E-02   # UPL   decays
#          BR          NDA       ID1       ID2       ID3       ID4
      1.00000000E+00    2      1000022         2                       # UPL    -->  Z1SS   UP                 
#         PDG         Width
DECAY   1000001  8.03538561E-02   # DNL   decays
#          BR          NDA       ID1       ID2       ID3       ID4
      1.00000000E+00    2      1000022         1                       # DNL    -->  Z1SS   DN                 
#         PDG         Width
DECAY   1000003  8.03538561E-02   # STL   decays
#          BR          NDA       ID1       ID2       ID3       ID4
      1.00000000E+00    2      1000022         3                       # STL    -->  Z1SS   ST                 
#         PDG         Width
DECAY   1000004  7.88503885E-02   # CHL   decays
#          BR          NDA       ID1       ID2       ID3       ID4
      1.00000000E+00    2      1000022         4                       # CHL    -->  Z1SS   CH                 
#         PDG         Width
DECAY   1000005  3.18448335E-01   # BT1   decays
#          BR          NDA       ID1       ID2       ID3       ID4
      1.00000000E+00    2      1000022         5                       # BT1    -->  Z1SS   BT                 
#         PDG         Width
DECAY   1000006  6.92017674E-01   # TP1   decays
#          BR          NDA       ID1       ID2       ID3       ID4
      2.49429547E-07    2      1000022         4                       # TP1    -->  Z1SS   CH                 
      9.99999762E-01    2      1000022         6                       # TP1    -->  Z1SS   TP                 
#         PDG         Width
DECAY   2000002  1.27169561E+00   # UPR   decays
#          BR          NDA       ID1       ID2       ID3       ID4
      1.00000000E+00    2      1000022         2                       # UPR    -->  Z1SS   UP                 
#         PDG         Width
DECAY   2000001  3.18495721E-01   # DNR   decays
#          BR          NDA       ID1       ID2       ID3       ID4
      1.00000000E+00    2      1000022         1                       # DNR    -->  Z1SS   DN                 
#         PDG         Width
DECAY   2000003  3.18495810E-01   # STR   decays
#          BR          NDA       ID1       ID2       ID3       ID4
      1.00000000E+00    2      1000022         3                       # STR    -->  Z1SS   ST                 
#         PDG         Width
DECAY   2000004  1.27169001E+00   # CHR   decays
#          BR          NDA       ID1       ID2       ID3       ID4
      1.00000000E+00    2      1000022         4                       # CHR    -->  Z1SS   CH                 
#         PDG         Width
DECAY   2000005  8.03476572E-02   # BT2   decays
#          BR          NDA       ID1       ID2       ID3       ID4
      1.00000000E+00    2      1000022         5                       # BT2    -->  Z1SS   BT                 
#         PDG         Width
DECAY   2000006  5.41496933E-01   # TP2   decays
#          BR          NDA       ID1       ID2       ID3       ID4
      3.18763881E-07    2      1000022         4                       # TP2    -->  Z1SS   CH                 
      9.99999642E-01    2      1000022         6                       # TP2    -->  Z1SS   TP                 
#         PDG         Width
DECAY   1000011  2.97398496E+00   # EL-   decays
#          BR          NDA       ID1       ID2       ID3       ID4
      9.82930541E-01    2      1000022        11                       # EL-    -->  Z1SS   E-                 
      5.81134157E-03    2      1000023        11                       # EL-    -->  Z2SS   E-                 
      1.12478519E-02    2     -1000024        12                       # EL-    -->  W1SS-  NUE                
      1.03625034E-05    2           11   1000039                       # EL-    -->  E-     GVSS               
#         PDG         Width
DECAY   1000013  2.97398496E+00   # MUL-  decays
#          BR          NDA       ID1       ID2       ID3       ID4
      9.82930541E-01    2      1000022        13                       # MUL-   -->  Z1SS   MU-                
      5.81133505E-03    2      1000023        13                       # MUL-   -->  Z2SS   MU-                
      1.12478519E-02    2     -1000024        14                       # MUL-   -->  W1SS-  NUM                
      1.03625034E-05    2           13   1000039                       # MUL-   -->  MU-    GVSS               
#         PDG         Width
DECAY   1000015  1.17179670E+01   # TAU1- decays
#          BR          NDA       ID1       ID2       ID3       ID4
      9.99986231E-01    2      1000022        15                       # TAU1-  -->  Z1SS   TAU-               
      4.21355844E-06    2      1000023        15                       # TAU1-  -->  Z2SS   TAU-               
      6.91411151E-06    2     -1000024        16                       # TAU1-  -->  W1SS-  NUT                
      2.62964727E-06    2           15   1000039                       # TAU1-  -->  TAU-   GVSS               
#         PDG         Width
DECAY   1000012  2.98404694E+00   # NUEL  decays
#          BR          NDA       ID1       ID2       ID3       ID4
      9.83382225E-01    2      1000022        12                       # NUEL   -->  Z1SS   NUE                
      5.38614905E-03    2      1000023        12                       # NUEL   -->  Z2SS   NUE                
      1.12213083E-02    2      1000024        11                       # NUEL   -->  W1SS+  E-                 
      1.03064804E-05    2           12   1000039                       # NUEL   -->  NUE    GVSS               
#         PDG         Width
DECAY   1000014  2.98404694E+00   # NUML  decays
#          BR          NDA       ID1       ID2       ID3       ID4
      9.83382225E-01    2      1000022        14                       # NUML   -->  Z1SS   NUM                
      5.38614905E-03    2      1000023        14                       # NUML   -->  Z2SS   NUM                
      1.12212971E-02    2      1000024        13                       # NUML   -->  W1SS+  MU-                
      1.03064804E-05    2           14   1000039                       # NUML   -->  NUM    GVSS               
#         PDG         Width
DECAY   1000016  2.98403478E+00   # NUTL  decays
#          BR          NDA       ID1       ID2       ID3       ID4
      9.83386219E-01    2      1000022        16                       # NUTL   -->  Z1SS   NUT                
      5.38617093E-03    2      1000023        16                       # NUTL   -->  Z2SS   NUT                
      1.12173147E-02    2      1000024        15                       # NUTL   -->  W1SS+  TAU-               
      1.03065222E-05    2           16   1000039                       # NUTL   -->  NUT    GVSS               
#         PDG         Width
DECAY   2000011  1.17179203E+01   # ER-   decays
#          BR          NDA       ID1       ID2       ID3       ID4
      9.99996662E-01    2      1000022        11                       # ER-    -->  Z1SS   E-                 
      7.20707249E-07    2      1000023        11                       # ER-    -->  Z2SS   E-                 
      3.05777338E-40    3      1000015        12       -16             # ER-    -->  TAU1-  NUE    ANUT        
      2.62973072E-06    2           11   1000039                       # ER-    -->  E-     GVSS               
#         PDG         Width
DECAY   2000013  1.17179203E+01   # MUR-  decays
#          BR          NDA       ID1       ID2       ID3       ID4
      9.99996662E-01    2      1000022        13                       # MUR-   -->  Z1SS   MU-                
      7.20706510E-07    2      1000023        13                       # MUR-   -->  Z2SS   MU-                
      1.31006449E-35    3      1000015        14       -16             # MUR-   -->  TAU1-  NUM    ANUT        
      2.62973072E-06    2           13   1000039                       # MUR-   -->  MU-    GVSS               
#         PDG         Width
DECAY   2000015  2.97400331E+00   # TAU2- decays
#          BR          NDA       ID1       ID2       ID3       ID4
      9.82936502E-01    2      1000022        15                       # TAU2-  -->  Z1SS   TAU-               
      5.81148313E-03    2      1000023        15                       # TAU2-  -->  Z2SS   TAU-               
      1.12520037E-02    2     -1000024        16                       # TAU2-  -->  W1SS-  NUT                
#         PDG         Width
DECAY   1000022  9.67055946E-09   # Z1SS  decays
#          BR          NDA       ID1       ID2       ID3       ID4
      7.76693523E-01    2      1000039        22                       # Z1SS   -->  GVSS   GM                 
      1.77598726E-02    3      1000039        11       -11             # Z1SS   -->  GVSS   E-     E+          
      2.05543175E-01    2      1000039        23                       # Z1SS   -->  GVSS   Z0                 
      3.41647251E-06    2      1000039        25                       # Z1SS   -->  GVSS   HL0                
#         PDG         Width
DECAY   1000023  1.05651764E+02   # Z2SS  decays
#          BR          NDA       ID1       ID2       ID3       ID4
      8.26841529E-08    2      1000022        22                       # Z2SS   -->  Z1SS   GM                 
      8.89883901E-04    2      1000022        23                       # Z2SS   -->  Z1SS   Z0                 
      2.65705697E-08    3      1000022         5        -5             # Z2SS   -->  Z1SS   BT     BB          
      5.85425869E-06    3      1000022        11       -11             # Z2SS   -->  Z1SS   E-     E+          
      5.85425869E-06    3      1000022        13       -13             # Z2SS   -->  Z1SS   MU-    MU+         
      5.93996629E-06    3      1000022        15       -15             # Z2SS   -->  Z1SS   TAU-   TAU+        
      5.63851700E-06    3      1000022        12       -12             # Z2SS   -->  Z1SS   NUE    ANUE        
      5.63851700E-06    3      1000022        14       -14             # Z2SS   -->  Z1SS   NUM    ANUM        
      5.63851700E-06    3      1000022        16       -16             # Z2SS   -->  Z1SS   NUT    ANUT        
      8.51757266E-03    2      1000022        25                       # Z2SS   -->  Z1SS   HL0                
      5.06492741E-02    2      1000002        -2                       # Z2SS   -->  UPL    UB                 
      5.06492741E-02    2     -1000002         2                       # Z2SS   -->  UBL    UP                 
      4.97956648E-02    2      1000001        -1                       # Z2SS   -->  DNL    DB                 
      4.97956648E-02    2     -1000001         1                       # Z2SS   -->  DBL    DN                 
      4.97956648E-02    2      1000003        -3                       # Z2SS   -->  STL    SB                 
      4.97956648E-02    2     -1000003         3                       # Z2SS   -->  SBL    ST                 
      5.06492294E-02    2      1000004        -4                       # Z2SS   -->  CHL    CB                 
      5.06492294E-02    2     -1000004         4                       # Z2SS   -->  CBL    CH                 
      1.11725340E-05    2      2000002        -2                       # Z2SS   -->  UPR    UB                 
      1.11725340E-05    2     -2000002         2                       # Z2SS   -->  UBR    UP                 
      2.79137430E-06    2      2000001        -1                       # Z2SS   -->  DNR    DB                 
      2.79137430E-06    2     -2000001         1                       # Z2SS   -->  DBR    DN                 
      2.79137430E-06    2      2000003        -3                       # Z2SS   -->  STR    SB                 
      2.79137430E-06    2     -2000003         3                       # Z2SS   -->  SBR    ST                 
      1.11725230E-05    2      2000004        -4                       # Z2SS   -->  CHR    CB                 
      1.11725230E-05    2     -2000004         4                       # Z2SS   -->  CBR    CH                 
      3.05188762E-04    2      1000005        -5                       # Z2SS   -->  BT1    BB                 
      3.05188762E-04    2     -1000005         5                       # Z2SS   -->  BB1    BT                 
      5.01358621E-02    2      2000005        -5                       # Z2SS   -->  BT2    BB                 
      5.01358621E-02    2     -2000005         5                       # Z2SS   -->  BB2    BT                 
      2.01967582E-01    2      1000006        -6                       # Z2SS   -->  TP1    TB                 
      2.01967582E-01    2     -1000006         6                       # Z2SS   -->  TB1    TP                 
      4.19524200E-02    2      2000006        -6                       # Z2SS   -->  TP2    TB                 
      4.19524200E-02    2     -2000006         6                       # Z2SS   -->  TB2    TP                 
      3.15704654E-08    2      1000039        22                       # Z2SS   -->  GVSS   GM                 
      8.04679157E-10    3      1000039        11       -11             # Z2SS   -->  GVSS   E-     E+          
      1.44071294E-07    2      1000039        23                       # Z2SS   -->  GVSS   Z0                 
      1.20360788E-08    2      1000039        25                       # Z2SS   -->  GVSS   HL0                
#         PDG         Width
DECAY   1000025  8.01297531E+01   # Z3SS  decays
#          BR          NDA       ID1       ID2       ID3       ID4
      1.65349245E-08    2      1000022        22                       # Z3SS   -->  Z1SS   GM                 
      6.55176746E-11    2      1000023        22                       # Z3SS   -->  Z2SS   GM                 
      1.05945755E-05    3     -1000024         2        -1             # Z3SS   -->  W1SS-  UP     DB          
      3.53152518E-06    3     -1000024        12       -11             # Z3SS   -->  W1SS-  NUE    E+          
      3.53152518E-06    3     -1000024        14       -13             # Z3SS   -->  W1SS-  NUM    MU+         
      1.05945755E-05    3      1000024         1        -2             # Z3SS   -->  W1SS+  DN     UB          
      3.53152518E-06    3      1000024        11       -12             # Z3SS   -->  W1SS+  E-     ANUE        
      3.53152518E-06    3      1000024        13       -14             # Z3SS   -->  W1SS+  MU-    ANUM        
      1.05945755E-05    3     -1000024         4        -3             # Z3SS   -->  W1SS-  CH     SB          
      3.53152518E-06    3     -1000024        16       -15             # Z3SS   -->  W1SS-  NUT    TAU+        
      1.05945755E-05    3      1000024         3        -4             # Z3SS   -->  W1SS+  ST     CB          
      3.53152518E-06    3      1000024        15       -16             # Z3SS   -->  W1SS+  TAU-   ANUT        
      2.22259182E-02    2      1000022        23                       # Z3SS   -->  Z1SS   Z0                 
      8.17184187E-08    3      1000022         5        -5             # Z3SS   -->  Z1SS   BT     BB          
      1.07268958E-08    3      1000022        15       -15             # Z3SS   -->  Z1SS   TAU-   TAU+        
      2.34415324E-06    3      1000023         2        -2             # Z3SS   -->  Z2SS   UP     UB          
      3.02280114E-06    3      1000023         1        -1             # Z3SS   -->  Z2SS   DN     DB          
      3.02280114E-06    3      1000023         3        -3             # Z3SS   -->  Z2SS   ST     SB          
      2.34415324E-06    3      1000023         4        -4             # Z3SS   -->  Z2SS   CH     CB          
      2.92020673E-06    3      1000023         5        -5             # Z3SS   -->  Z2SS   BT     BB          
      6.85720920E-07    3      1000023        11       -11             # Z3SS   -->  Z2SS   E-     E+          
      6.85720920E-07    3      1000023        13       -13             # Z3SS   -->  Z2SS   MU-    MU+         
      6.81428219E-07    3      1000023        15       -15             # Z3SS   -->  Z2SS   TAU-   TAU+        
      1.36436893E-06    3      1000023        12       -12             # Z3SS   -->  Z2SS   NUE    ANUE        
      1.36436893E-06    3      1000023        14       -14             # Z3SS   -->  Z2SS   NUM    ANUM        
      1.36436893E-06    3      1000023        16       -16             # Z3SS   -->  Z2SS   NUT    ANUT        
      2.42522871E-03    2      1000022        25                       # Z3SS   -->  Z1SS   HL0                
      4.98832742E-06    2      1000002        -2                       # Z3SS   -->  UPL    UB                 
      4.98832742E-06    2     -1000002         2                       # Z3SS   -->  UBL    UP                 
      9.80437289E-06    2      1000001        -1                       # Z3SS   -->  DNL    DB                 
      9.80437289E-06    2     -1000001         1                       # Z3SS   -->  DBL    DN                 
      9.80437289E-06    2      1000003        -3                       # Z3SS   -->  STL    SB                 
      9.80437289E-06    2     -1000003         3                       # Z3SS   -->  SBL    ST                 
      4.98832378E-06    2      1000004        -4                       # Z3SS   -->  CHL    CB                 
      4.98832378E-06    2     -1000004         4                       # Z3SS   -->  CBL    CH                 
      3.24407665E-06    2      2000002        -2                       # Z3SS   -->  UPR    UB                 
      3.24407665E-06    2     -2000002         2                       # Z3SS   -->  UBR    UP                 
      8.10542815E-07    2      2000001        -1                       # Z3SS   -->  DNR    DB                 
      8.10542815E-07    2     -2000001         1                       # Z3SS   -->  DBR    DN                 
      8.10542701E-07    2      2000003        -3                       # Z3SS   -->  STR    SB                 
      8.10542701E-07    2     -2000003         3                       # Z3SS   -->  SBR    ST                 
      3.24407370E-06    2      2000004        -4                       # Z3SS   -->  CHR    CB                 
      3.24407370E-06    2     -2000004         4                       # Z3SS   -->  CBR    CH                 
      8.32940568E-04    2      1000005        -5                       # Z3SS   -->  BT1    BB                 
      8.32940568E-04    2     -1000005         5                       # Z3SS   -->  BB1    BT                 
      8.41805071E-04    2      2000005        -5                       # Z3SS   -->  BT2    BB                 
      8.41805071E-04    2     -2000005         5                       # Z3SS   -->  BB2    BT                 
      2.05135822E-01    2      1000006        -6                       # Z3SS   -->  TP1    TB                 
      2.05135822E-01    2     -1000006         6                       # Z3SS   -->  TB1    TP                 
      2.80784339E-01    2      2000006        -6                       # Z3SS   -->  TP2    TB                 
      2.80784339E-01    2     -2000006         6                       # Z3SS   -->  TB2    TP                 
      5.73176237E-16    2      1000011       -11                       # Z3SS   -->  EL-    E+                 
      5.73176237E-16    2     -1000011        11                       # Z3SS   -->  EL+    E-                 
      1.43200051E-14    2      2000011       -11                       # Z3SS   -->  ER-    E+                 
      1.43200051E-14    2     -2000011        11                       # Z3SS   -->  ER+    E-                 
      5.46181069E-12    2      1000012       -12                       # Z3SS   -->  NUEL   ANUE               
      5.46181069E-12    2     -1000012        12                       # Z3SS   -->  ANUEL  NUE                
      5.46181069E-12    2      1000014       -14                       # Z3SS   -->  NUML   ANUM               
      5.46181069E-12    2     -1000014        14                       # Z3SS   -->  ANUML  NUM                
      5.46181069E-12    2      1000016       -16                       # Z3SS   -->  NUTL   ANUT               
      5.46181069E-12    2     -1000016        16                       # Z3SS   -->  ANUTL  NUT                
      2.05231318E-12    2      1000039        22                       # Z3SS   -->  GVSS   GM                 
      5.24091912E-14    3      1000039        11       -11             # Z3SS   -->  GVSS   E-     E+          
      3.83129439E-08    2      1000039        23                       # Z3SS   -->  GVSS   Z0                 
      1.52567054E-07    2      1000039        25                       # Z3SS   -->  GVSS   HL0                
      1.44377550E-21    2      1000039        36                       # Z3SS   -->  GVSS   HA0                
#         PDG         Width
DECAY   1000035  1.09824005E+02   # Z4SS  decays
#          BR          NDA       ID1       ID2       ID3       ID4
      5.56831159E-09    2      1000022        22                       # Z4SS   -->  Z1SS   GM                 
      3.76897347E-10    2      1000023        22                       # Z4SS   -->  Z2SS   GM                 
      1.26715605E-09    2      1000025        22                       # Z4SS   -->  Z3SS   GM                 
      9.21661872E-03    2      1000024       -24                       # Z4SS   -->  W1SS+  W-                 
      9.21661872E-03    2     -1000024        24                       # Z4SS   -->  W1SS-  W+                 
      9.53442708E-04    2      1000022        23                       # Z4SS   -->  Z1SS   Z0                 
      2.42173975E-10    2      1000023        23                       # Z4SS   -->  Z2SS   Z0                 
      3.42164803E-08    3      1000022         5        -5             # Z4SS   -->  Z1SS   BT     BB          
      4.49146009E-09    3      1000022        15       -15             # Z4SS   -->  Z1SS   TAU-   TAU+        
      2.30452995E-16    3      1000023         5        -5             # Z4SS   -->  Z2SS   BT     BB          
      3.05688599E-17    3      1000023        15       -15             # Z4SS   -->  Z2SS   TAU-   TAU+        
      1.76497315E-06    3      1000025         2        -2             # Z4SS   -->  Z3SS   UP     UB          
      2.27594455E-06    3      1000025         1        -1             # Z4SS   -->  Z3SS   DN     DB          
      2.27594455E-06    3      1000025         3        -3             # Z4SS   -->  Z3SS   ST     SB          
      1.76497315E-06    3      1000025         4        -4             # Z4SS   -->  Z3SS   CH     CB          
      2.20134871E-06    3      1000025         5        -5             # Z4SS   -->  Z3SS   BT     BB          
      5.16296836E-07    3      1000025        11       -11             # Z4SS   -->  Z3SS   E-     E+          
      5.16296836E-07    3      1000025        13       -13             # Z4SS   -->  Z3SS   MU-    MU+         
      5.13320231E-07    3      1000025        15       -15             # Z4SS   -->  Z3SS   TAU-   TAU+        
      1.02726835E-06    3      1000025        12       -12             # Z4SS   -->  Z3SS   NUE    ANUE        
      1.02726835E-06    3      1000025        14       -14             # Z4SS   -->  Z3SS   NUM    ANUM        
      1.02726835E-06    3      1000025        16       -16             # Z4SS   -->  Z3SS   NUT    ANUT        
      7.75862299E-03    2      1000022        25                       # Z4SS   -->  Z1SS   HL0                
      1.17880433E-07    2      1000023        25                       # Z4SS   -->  Z2SS   HL0                
      5.27606271E-02    2      1000002        -2                       # Z4SS   -->  UPL    UB                 
      5.27606271E-02    2     -1000002         2                       # Z4SS   -->  UBL    UP                 
      5.34114689E-02    2      1000001        -1                       # Z4SS   -->  DNL    DB                 
      5.34114689E-02    2     -1000001         1                       # Z4SS   -->  DBL    DN                 
      5.34114689E-02    2      1000003        -3                       # Z4SS   -->  STL    SB                 
      5.34114689E-02    2     -1000003         3                       # Z4SS   -->  SBL    ST                 
      5.27605861E-02    2      1000004        -4                       # Z4SS   -->  CHL    CB                 
      5.27605861E-02    2     -1000004         4                       # Z4SS   -->  CBL    CH                 
      1.05270001E-05    2      2000002        -2                       # Z4SS   -->  UPR    UB                 
      1.05270001E-05    2     -2000002         2                       # Z4SS   -->  UBR    UP                 
      2.63030483E-06    2      2000001        -1                       # Z4SS   -->  DNR    DB                 
      2.63030483E-06    2     -2000001         1                       # Z4SS   -->  DBR    DN                 
      2.63030438E-06    2      2000003        -3                       # Z4SS   -->  STR    SB                 
      2.63030438E-06    2     -2000003         3                       # Z4SS   -->  SBR    ST                 
      1.05269919E-05    2      2000004        -4                       # Z4SS   -->  CHR    CB                 
      1.05269919E-05    2     -2000004         4                       # Z4SS   -->  CBR    CH                 
      3.17816972E-04    2      1000005        -5                       # Z4SS   -->  BT1    BB                 
      3.17816972E-04    2     -1000005         5                       # Z4SS   -->  BB1    BT                 
      5.36883809E-02    2      2000005        -5                       # Z4SS   -->  BT2    BB                 
      5.36883809E-02    2     -2000005         5                       # Z4SS   -->  BB2    BT                 
      5.38527519E-02    2      1000006        -6                       # Z4SS   -->  TP1    TB                 
      5.38527519E-02    2     -1000006         6                       # Z4SS   -->  TB1    TP                 
      1.65733665E-01    2      2000006        -6                       # Z4SS   -->  TP2    TB                 
      1.65733665E-01    2     -2000006         6                       # Z4SS   -->  TB2    TP                 
      7.34125424E-05    2      1000011       -11                       # Z4SS   -->  EL-    E+                 
      7.34125424E-05    2     -1000011        11                       # Z4SS   -->  EL+    E-                 
      7.34124696E-05    2      1000013       -13                       # Z4SS   -->  MUL-   MU+                
      7.34124696E-05    2     -1000013        13                       # Z4SS   -->  MUL+   MU-                
      3.34865078E-08    2      2000011       -11                       # Z4SS   -->  ER-    E+                 
      3.34865078E-08    2     -2000011        11                       # Z4SS   -->  ER+    E-                 
      3.34864723E-08    2      2000013       -13                       # Z4SS   -->  MUR-   MU+                
      3.34864723E-08    2     -2000013        13                       # Z4SS   -->  MUR+   MU-                
      2.05396361E-07    2      1000015       -15                       # Z4SS   -->  TAU1-  TAU+               
      2.05396361E-07    2     -1000015        15                       # Z4SS   -->  TAU1+  TAU-               
      7.33588749E-05    2      2000015       -15                       # Z4SS   -->  TAU2-  TAU+               
      7.33588749E-05    2     -2000015        15                       # Z4SS   -->  TAU2+  TAU-               
      7.87339377E-05    2      1000012       -12                       # Z4SS   -->  NUEL   ANUE               
      7.87339377E-05    2     -1000012        12                       # Z4SS   -->  ANUEL  NUE                
      7.87339377E-05    2      1000014       -14                       # Z4SS   -->  NUML   ANUM               
      7.87339377E-05    2     -1000014        14                       # Z4SS   -->  ANUML  NUM                
      7.87339377E-05    2      1000016       -16                       # Z4SS   -->  NUTL   ANUT               
      7.87339377E-05    2     -1000016        16                       # Z4SS   -->  ANUTL  NUT                
      3.48157592E-08    2      1000039        22                       # Z4SS   -->  GVSS   GM                 
      8.90717555E-10    3      1000039        11       -11             # Z4SS   -->  GVSS   E-     E+          
      1.90785642E-07    2      1000039        23                       # Z4SS   -->  GVSS   Z0                 
      1.64927627E-08    2      1000039        25                       # Z4SS   -->  GVSS   HL0                
      2.02739287E-13    2      1000039        35                       # Z4SS   -->  GVSS   HH0                
      1.49880081E-13    2      1000039        36                       # Z4SS   -->  GVSS   HA0                
#         PDG         Width
DECAY   1000024  1.05771149E+02   # W1SS+ decays
#          BR          NDA       ID1       ID2       ID3       ID4
      1.14108097E-05    3      1000022       -11        12             # W1SS+  -->  Z1SS   E+     NUE         
      1.14108097E-05    3      1000022       -13        14             # W1SS+  -->  Z1SS   MU+    NUM         
      1.14969598E-05    3      1000022       -15        16             # W1SS+  -->  Z1SS   TAU+   NUT         
      9.40623321E-03    2      1000022        24                       # W1SS+  -->  Z1SS   W+                 
      1.01494826E-01    2      1000002        -1                       # W1SS+  -->  UPL    DB                 
      9.84107628E-02    2     -1000001         2                       # W1SS+  -->  DBL    UP                 
      1.01494759E-01    2      1000004        -3                       # W1SS+  -->  CHL    SB                 
      9.86161754E-02    2     -1000003         4                       # W1SS+  -->  SBL    CH                 
      2.68025964E-01    2      1000006        -5                       # W1SS+  -->  TP1    BB                 
      6.00739755E-03    2      2000006        -5                       # W1SS+  -->  TP2    BB                 
      6.05375331E-04    2     -1000005         6                       # W1SS+  -->  BB1    TP                 
      3.15904200E-01    2     -2000005         6                       # W1SS+  -->  BB2    TP                 
#         PDG         Width
DECAY   1000037  1.09926163E+02   # W2SS+ decays
#          BR          NDA       ID1       ID2       ID3       ID4
      4.37210401E-09    3      1000022       -15        16             # W2SS+  -->  Z1SS   TAU+   NUT         
      8.64416454E-03    2      1000022        24                       # W2SS+  -->  Z1SS   W+                 
      6.68871967E-14    3      1000023       -15        16             # W2SS+  -->  Z2SS   TAU+   NUT         
      9.26550012E-03    2      1000023        24                       # W2SS+  -->  Z2SS   W+                 
      7.52723099E-06    3      1000025         2        -1             # W2SS+  -->  Z3SS   UP     DB          
      7.52723099E-06    3      1000025         4        -3             # W2SS+  -->  Z3SS   CH     SB          
      2.50907692E-06    3      1000025       -11        12             # W2SS+  -->  Z3SS   E+     NUE         
      2.50907692E-06    3      1000025       -13        14             # W2SS+  -->  Z3SS   MU+    NUM         
      2.50907692E-06    3      1000025       -15        16             # W2SS+  -->  Z3SS   TAU+   NUT         
      1.05011068E-01    2      1000002        -1                       # W2SS+  -->  UPL    DB                 
      1.07879929E-01    2     -1000001         2                       # W2SS+  -->  DBL    UP                 
      1.05011001E-01    2      1000004        -3                       # W2SS+  -->  CHL    SB                 
      1.08076230E-01    2     -1000003         4                       # W2SS+  -->  SBL    CH                 
      5.67691680E-03    2      1000006        -5                       # W2SS+  -->  TP1    BB                 
      2.88459837E-01    2      2000006        -5                       # W2SS+  -->  TP2    BB                 
      6.26843888E-04    2     -1000005         6                       # W2SS+  -->  BB1    TP                 
      2.52820790E-01    2     -2000005         6                       # W2SS+  -->  BB2    TP                 
      1.51386295E-04    2      1000012       -11                       # W2SS+  -->  NUEL   E+                 
      1.51386135E-04    2      1000014       -13                       # W2SS+  -->  NUML   MU+                
      1.51335727E-04    2      1000016       -15                       # W2SS+  -->  NUTL   TAU+               
      1.51527594E-04    2     -1000011        12                       # W2SS+  -->  EL+    NUE                
      1.51527594E-04    2     -1000013        14                       # W2SS+  -->  MUL+   NUM                
      3.47711250E-07    2     -1000015        16                       # W2SS+  -->  TAU1+  NUT                
      1.51469751E-04    2     -2000015        16                       # W2SS+  -->  TAU2+  NUT                
      7.59572769E-03    2      1000024        23                       # W2SS+  -->  W1SS+  Z0                 
      5.50573873E-07    2      1000024        25                       # W2SS+  -->  W1SS+  HL0                
#         PDG         Width
DECAY        25  4.47502313E-03   # HL0   decays
#          BR          NDA       ID1       ID2       ID3       ID4
      4.59132243E-09    2           11       -11                       # HL0    -->  E-     E+                 
      1.93853048E-04    2           13       -13                       # HL0    -->  MU-    MU+                
      5.54500595E-02    2           15       -15                       # HL0    -->  TAU-   TAU+               
      5.75870672E-06    2            1        -1                       # HL0    -->  DN     DB                 
      2.32680631E-03    2            3        -3                       # HL0    -->  ST     SB                 
      7.57920325E-01    2            5        -5                       # HL0    -->  BT     BB                 
      1.83237466E-06    2            2        -2                       # HL0    -->  UP     UB                 
      3.42571922E-02    2            4        -4                       # HL0    -->  CH     CB                 
      1.99574349E-03    2           22        22                       # HL0    -->  GM     GM                 
      4.08128239E-02    2           21        21                       # HL0    -->  GL     GL                 
      5.42808371E-03    3           24        11       -12             # HL0    -->  W+     E-     ANUE        
      5.42808371E-03    3           24        13       -14             # HL0    -->  W+     MU-    ANUM        
      5.42808371E-03    3           24        15       -16             # HL0    -->  W+     TAU-   ANUT        
      1.62842516E-02    3           24        -2         1             # HL0    -->  W+     UB     DN          
      1.62842516E-02    3           24        -4         3             # HL0    -->  W+     CB     ST          
      5.42808371E-03    3          -24       -11        12             # HL0    -->  W-     E+     NUE         
      5.42808371E-03    3          -24       -13        14             # HL0    -->  W-     MU+    NUM         
      5.42808371E-03    3          -24       -15        16             # HL0    -->  W-     TAU+   NUT         
      1.62842516E-02    3          -24         2        -1             # HL0    -->  W-     UP     DB          
      1.62842516E-02    3          -24         4        -3             # HL0    -->  W-     CH     SB          
      6.38119294E-04    3           23        12       -12             # HL0    -->  Z0     NUE    ANUE        
      6.38119294E-04    3           23        14       -14             # HL0    -->  Z0     NUM    ANUM        
      6.38119294E-04    3           23        16       -16             # HL0    -->  Z0     NUT    ANUT        
      3.21159023E-04    3           23        11       -11             # HL0    -->  Z0     E-     E+          
      3.21159023E-04    3           23        13       -13             # HL0    -->  Z0     MU-    MU+         
      3.21159023E-04    3           23        15       -15             # HL0    -->  Z0     TAU-   TAU+        
      1.10026356E-03    3           23         2        -2             # HL0    -->  Z0     UP     UB          
      1.10026356E-03    3           23         4        -4             # HL0    -->  Z0     CH     CB          
      1.41741056E-03    3           23         1        -1             # HL0    -->  Z0     DN     DB          
      1.41741056E-03    3           23         3        -3             # HL0    -->  Z0     ST     SB          
      1.41741056E-03    3           23         5        -5             # HL0    -->  Z0     BT     BB          
#         PDG         Width
DECAY        35  9.08431244E+01   # HH0   decays
#          BR          NDA       ID1       ID2       ID3       ID4
      4.23648165E-11    2           11       -11                       # HH0    -->  E-     E+                 
      1.78871892E-06    2           13       -13                       # HH0    -->  MU-    MU+                
      5.12314960E-04    2           15       -15                       # HH0    -->  TAU-   TAU+               
      5.15367979E-08    2            1        -1                       # HH0    -->  DN     DB                 
      2.08234724E-05    2            3        -3                       # HH0    -->  ST     SB                 
      4.63109557E-03    2            5        -5                       # HH0    -->  BT     BB                 
      2.04717382E-10    2            2        -2                       # HH0    -->  UP     UB                 
      2.59996000E-06    2            4        -4                       # HH0    -->  CH     CB                 
      1.34268552E-01    2            6        -6                       # HH0    -->  TP     TB                 
      3.06851263E-07    2           22        22                       # HH0    -->  GM     GM                 
      4.12624213E-05    2           21        21                       # HH0    -->  GL     GL                 
      3.96613141E-05    2           24       -24                       # HH0    -->  W+     W-                 
      2.03221553E-05    2           23        23                       # HH0    -->  Z0     Z0                 
      1.18542157E-05    2      1000022   1000022                       # HH0    -->  Z1SS   Z1SS               
      2.53127366E-02    2           25        25                       # HH0    -->  HL0    HL0                
      3.17100239E-05    2      1000002  -1000002                       # HH0    -->  UPL    UBL                
      6.35394326E-06    2      2000002  -2000002                       # HH0    -->  UPR    UBR                
      3.16878650E-05    2      1000004  -1000004                       # HH0    -->  CHL    CBL                
      6.34404523E-06    2      2000004  -2000004                       # HH0    -->  CHR    CBR                
      4.72953179E-05    2      1000001  -1000001                       # HH0    -->  DNL    DBL                
      1.58639034E-06    2      2000001  -2000001                       # HH0    -->  DNR    DBR                
      4.73005675E-05    2      1000003  -1000003                       # HH0    -->  STL    SBL                
      1.58542935E-06    2      2000003  -2000003                       # HH0    -->  STR    SBR                
      1.40392001E-06    2      1000005  -1000005                       # HH0    -->  BT1    BB1                
      4.83289041E-05    2      2000005  -2000005                       # HH0    -->  BT2    BB2                
      1.25309583E-02    2      1000005  -2000005                       # HH0    -->  BT1    BB2                
      1.25309583E-02    2      2000005  -1000005                       # HH0    -->  BT2    BB1                
      4.27662581E-01    2      1000006  -1000006                       # HH0    -->  TP1    TB1                
      3.81632507E-01    2      2000006  -2000006                       # HH0    -->  TP2    TB2                
      2.77996325E-04    2      1000006  -2000006                       # HH0    -->  TP1    TB2                
      2.77996325E-04    2      2000006  -1000006                       # HH0    -->  TP2    TB1                
#         PDG         Width
DECAY        36  8.80572357E+01   # HA0   decays
#          BR          NDA       ID1       ID2       ID3       ID4
      4.34220888E-11    2           11       -11                       # HA0    -->  E-     E+                 
      1.83335897E-06    2           13       -13                       # HA0    -->  MU-    MU+                
      5.25101554E-04    2           15       -15                       # HA0    -->  TAU-   TAU+               
      5.28255661E-08    2            1        -1                       # HA0    -->  DN     DB                 
      2.13442017E-05    2            3        -3                       # HA0    -->  ST     SB                 
      4.75054746E-03    2            5        -5                       # HA0    -->  BT     BB                 
      2.08672399E-10    2            2        -2                       # HA0    -->  UP     UB                 
      2.65220774E-06    2            4        -4                       # HA0    -->  CH     CB                 
      1.38945684E-01    2            6        -6                       # HA0    -->  TP     TB                 
      3.14379690E-07    2           22        22                       # HA0    -->  GM     GM                 
      4.10957291E-05    2           21        21                       # HA0    -->  GL     GL                 
      2.82468864E-05    2      1000022   1000022                       # HA0    -->  Z1SS   Z1SS               
      4.03915292E-05    2           25        23                       # HA0    -->  HL0    Z0                 
      5.22258958E-10    2      1000002  -2000002                       # HA0    -->  UPL    UBR                
      5.22258958E-10    2      2000002  -1000002                       # HA0    -->  UPR    UBL                
      3.03512516E-05    2      1000004  -2000004                       # HA0    -->  CHL    CBR                
      3.03512516E-05    2      2000004  -1000004                       # HA0    -->  CHR    CBL                
      1.62740943E-09    2      1000001  -2000001                       # HA0    -->  DNL    DBR                
      1.62740943E-09    2      2000001  -1000001                       # HA0    -->  DNR    DBL                
      6.57555688E-07    2      1000003  -2000003                       # HA0    -->  STL    SBR                
      6.57555688E-07    2      2000003  -1000003                       # HA0    -->  STR    SBL                
      1.28590381E-02    2      1000005  -2000005                       # HA0    -->  BT1    BB2                
      1.28590381E-02    2      2000005  -1000005                       # HA0    -->  BT2    BB1                
      4.14931327E-01    2      1000006  -2000006                       # HA0    -->  TP1    TB2                
      4.14931327E-01    2      2000006  -1000006                       # HA0    -->  TP2    TB1                
#         PDG         Width
DECAY        37  8.80608444E+01   # H+    decays
#          BR          NDA       ID1       ID2       ID3       ID4
      4.37061151E-11    2           12       -11                       # H+     -->  NUE    E+                 
      1.84535111E-06    2           14       -13                       # H+     -->  NUM    MU+                
      5.28536271E-04    2           16       -15                       # H+     -->  NUT    TAU+               
      4.94087899E-08    2            2        -1                       # H+     -->  UP     DB                 
      2.23542411E-05    2            4        -3                       # H+     -->  CH     SB                 
      1.33186951E-01    2            6        -5                       # H+     -->  TP     BB                 
      4.06976978E-05    2           25        24                       # H+     -->  HL0    W+                 
      8.05109594E-05    2      1000002  -1000001                       # H+     -->  UPL    DBL                
      3.27799987E-09    2      2000002  -2000001                       # H+     -->  UPR    DBR                
      8.04807787E-05    2      1000004  -1000003                       # H+     -->  CHL    SBL                
      1.32447667E-06    2      2000004  -2000003                       # H+     -->  CHR    SBR                
      1.36373146E-02    2      1000006  -1000005                       # H+     -->  TP1    BB1                
      4.16639298E-01    2      1000006  -2000005                       # H+     -->  TP1    BB2                
      1.20383417E-02    2      2000006  -1000005                       # H+     -->  TP2    BB1                
      4.23742265E-01    2      2000006  -2000005                       # H+     -->  TP2    BB2                
