#  ISAJET SUSY parameters in SUSY Les Houches Accord 2 format
#  Created by ISALHA 2.0 Last revision: C. Balazs 21 Apr 2009
Block SPINFO   # Program information
     1   ISASUGRA from ISAJET          # Spectrum Calculator
     2   7.80   29-OCT-2009 12:50:36   # Version number
Block MODSEL   # Model selection
     1     1   # Minimal supergravity (mSUGRA) model               
Block SMINPUTS   # Standard Model inputs
     1     1.27836647E+02   # alpha_em^(-1)
     2     1.16570000E-05   # G_Fermi
     3     1.17200002E-01   # alpha_s(M_Z)
     4     9.11699982E+01   # m_{Z}(pole)
     5     4.19999981E+00   # m_{b}(m_{b})
     6     1.72500000E+02   # m_{top}(pole)
     7     1.77699995E+00   # m_{tau}(pole)
Block MINPAR   # SUSY breaking input parameters
     1     1.86000000E+03   # m_0
     2     2.70000000E+02   # m_{1/2}
     3     1.00000000E+01   # tan(beta)
     4     1.00000000E+00   # sign(mu)
     5     0.00000000E+00   # A_0
Block EXTPAR   # Non-universal SUSY breaking parameters
     0     2.30203525E+16   # Input scale
Block MASS   # Scalar and gaugino mass spectrum
#  PDG code   mass                 particle
        24     8.04229965E+01   #  W^+
        25     1.14105759E+02   #  h^0            
        35     1.88519800E+03   #  H^0            
        36     1.87277991E+03   #  A^0            
        37     1.88699036E+03   #  H^+            
   1000001     1.92439014E+03   #  dnl            
   1000002     1.92272302E+03   #  upl            
   1000003     1.92439014E+03   #  stl            
   1000004     1.92272351E+03   #  chl            
   1000005     1.58218420E+03   #  b1             
   1000006     1.14587952E+03   #  t1             
   1000011     1.86484729E+03   #  el-            
   1000012     1.86365747E+03   #  nuel           
   1000013     1.86484729E+03   #  mul-           
   1000014     1.86365747E+03   #  numl           
   1000015     1.84353674E+03   #  tau1           
   1000016     1.85524634E+03   #  nutl           
   1000021     7.42549255E+02   #  glss           
   1000022     1.10891388E+02   #  z1ss           
   1000023     2.06835770E+02   #  z2ss           
   1000024     2.07770050E+02   #  w1ss           
   1000025    -3.76758209E+02   #  z3ss           
   1000035     3.98027100E+02   #  z4ss           
   1000037     3.96950867E+02   #  w2ss           
   2000001     1.92575854E+03   #  dnr            
   2000002     1.92486316E+03   #  upr            
   2000003     1.92575854E+03   #  str            
   2000004     1.92486365E+03   #  chr            
   2000005     1.90627832E+03   #  b2             
   2000006     1.59246082E+03   #  t2             
   2000011     1.86099988E+03   #  er-            
   2000013     1.86099988E+03   #  mur-           
   2000015     1.85645972E+03   #  tau2           
Block ALPHA   # Effective Higgs mixing parameter
         -1.00251019E-01   # alpha
Block STOPMIX   # stop mixing matrix
  1  1     4.95774820E-02   # O_{11}
  1  2     9.98770297E-01   # O_{12}
  2  1    -9.98770297E-01   # O_{21}
  2  2     4.95774820E-02   # O_{22}
Block SBOTMIX   # sbottom mixing matrix
  1  1     9.99938548E-01   # O_{11}
  1  2     1.10843144E-02   # O_{12}
  2  1    -1.10843144E-02   # O_{21}
  2  2     9.99938548E-01   # O_{22}
Block STAUMIX   # stau mixing matrix
  1  1     1.84445232E-01   # O_{11}
  1  2     9.82842803E-01   # O_{12}
  2  1    -9.82842803E-01   # O_{21}
  2  2     1.84445232E-01   # O_{22}
Block NMIX   # neutralino mixing matrix
  1  1     9.87425387E-01   #
  1  2    -4.85183150E-02   #
  1  3     1.40321523E-01   #
  1  4    -5.42876571E-02   #
  2  1    -9.65274200E-02   #
  2  2    -9.36044276E-01   #
  2  3     2.85060078E-01   #
  2  4    -1.82330638E-01   #
  3  1    -5.61232418E-02   #
  3  2     7.98032060E-02   #
  3  3     6.97266042E-01   #
  3  4     7.10142136E-01   #
  4  1    -1.11910410E-01   #
  4  2     3.39262038E-01   #
  4  3     6.42550409E-01   #
  4  4    -6.77869320E-01   #
Block UMIX   # chargino U mixing matrix
  1  1    -9.15073514E-01   # U_{11}
  1  2     4.03287023E-01   # U_{12}
  2  1    -4.03287023E-01   # U_{21}
  2  2    -9.15073514E-01   # U_{22}
Block VMIX   # chargino V mixing matrix
  1  1    -9.66613412E-01   # V_{11}
  1  2     2.56239265E-01   # V_{12}
  2  1    -2.56239265E-01   # V_{21}
  2  2    -9.66613412E-01   # V_{22}
Block GAUGE Q=  1.33134473E+03   #
     1     3.57523352E-01   # g`
     2     6.52384341E-01   # g_2
     3     1.21927297E+00   # g_3
Block YU Q=  1.33134473E+03   #
  3  3     8.58729243E-01   # y_t
Block YD Q=  1.33134473E+03   #
  3  3     1.33171096E-01   # y_b
Block YE Q=  1.33134473E+03   #
  3  3     1.01740509E-01   # y_tau
Block HMIX Q=  1.33134473E+03   # Higgs mixing parameters
     1     3.66271637E+02   # mu(Q)
     2     1.00000000E+01   # tan(beta)(M_GUT)
     3     2.51350449E+02   # Higgs vev at Q
     4     3.50730450E+06   # m_A^2(Q)
Block MSOFT Q=  1.33134473E+03   # DRbar SUSY breaking parameters
     1     1.14068619E+02   # M_1(Q)          
     2     2.11358749E+02   # M_2(Q)          
     3     6.29618347E+02   # M_3(Q)          
    31     1.85852954E+03   # MeL(Q)          
    32     1.85852954E+03   # MmuL(Q)         
    33     1.85031152E+03   # MtauL(Q)        
    34     1.85871118E+03   # MeR(Q)          
    35     1.85871118E+03   # MmuR(Q)         
    36     1.84217004E+03   # MtauR(Q)        
    41     1.89020483E+03   # MqL1(Q)         
    42     1.89020483E+03   # MqL2(Q)         
    43     1.55596558E+03   # MqL3(Q)         
    44     1.89191821E+03   # MuR(Q)          
    45     1.89191821E+03   # McR(Q)          
    46     1.13915039E+03   # MtR(Q)          
    47     1.89230762E+03   # MdR(Q)          
    48     1.89230762E+03   # MsR(Q)          
    49     1.87866833E+03   # MbR(Q)          
Block AU Q=  1.33134473E+03   #
  1  1    -4.60674103E+02   # A_u
  2  2    -4.60674103E+02   # A_c
  3  3    -4.60674103E+02   # A_t
Block AD Q=  1.33134473E+03   #
  1  1    -6.82993530E+02   # A_d
  2  2    -6.82993530E+02   # A_s
  3  3    -6.82993530E+02   # A_b
Block AE Q=  1.33134473E+03   #
  1  1    -1.59671677E+02   # A_e
  2  2    -1.59671677E+02   # A_mu
  3  3    -1.59671677E+02   # A_tau
#  ISAJET decay tables in SUSY Les Houches accord format
#  Created by ISALHD. Last revision: C. Balazs, 2005 May 25
Block DCINFO                           # Program information
     1   ISASUGRA from ISAJET          # Spectrum Calculator
     2   7.80   29-OCT-2009 12:50:36   # Version number
#         PDG         Width
DECAY         6  1.14680779E+00   # TP    decays
#          BR          NDA       ID1       ID2       ID3       ID4
      3.33333343E-01    3            2        -1         5             # TP     -->  UP     DB     BT          
      3.33333343E-01    3            4        -3         5             # TP     -->  CH     SB     BT          
      1.11111112E-01    3          -11        12         5             # TP     -->  E+     NUE    BT          
      1.11111112E-01    3          -13        14         5             # TP     -->  MU+    NUM    BT          
      1.11111112E-01    3          -15        16         5             # TP     -->  TAU+   NUT    BT          
#         PDG         Width
DECAY   1000021  1.00259611E-03   # GLSS  decays
#          BR          NDA       ID1       ID2       ID3       ID4
      6.81186467E-02    3      1000024         1        -2             # GLSS   -->  W1SS+  DN     UB          
      6.81186467E-02    3     -1000024         2        -1             # GLSS   -->  W1SS-  UP     DB          
      6.81186020E-02    3      1000024         3        -4             # GLSS   -->  W1SS+  ST     CB          
      6.81186020E-02    3     -1000024         4        -3             # GLSS   -->  W1SS-  CH     SB          
      6.39618635E-02    3      1000024         5        -6             # GLSS   -->  W1SS+  BT     TB          
      6.39618635E-02    3     -1000024         6        -5             # GLSS   -->  W1SS-  TP     BB          
      2.06770934E-03    3      1000037         1        -2             # GLSS   -->  W2SS+  DN     UB          
      2.06770934E-03    3     -1000037         2        -1             # GLSS   -->  W2SS-  UP     DB          
      2.06770864E-03    3      1000037         3        -4             # GLSS   -->  W2SS+  ST     CB          
      2.06770864E-03    3     -1000037         4        -3             # GLSS   -->  W2SS-  CH     SB          
      6.23375364E-02    3      1000037         5        -6             # GLSS   -->  W2SS+  BT     TB          
      6.23375364E-02    3     -1000037         6        -5             # GLSS   -->  W2SS-  TP     BB          
      4.61943273E-05    2      1000022        21                       # GLSS   -->  Z1SS   GL                 
      2.79407930E-02    3      1000022         2        -2             # GLSS   -->  Z1SS   UP     UB          
      9.46463365E-03    3      1000022         1        -1             # GLSS   -->  Z1SS   DN     DB          
      9.46463365E-03    3      1000022         3        -3             # GLSS   -->  Z1SS   ST     SB          
      2.79407594E-02    3      1000022         4        -4             # GLSS   -->  Z1SS   CH     CB          
      1.36139104E-02    3      1000022         5        -5             # GLSS   -->  Z1SS   BT     BB          
      7.59567991E-02    3      1000022         6        -6             # GLSS   -->  Z1SS   TP     TB          
      4.91135009E-03    2      1000023        21                       # GLSS   -->  Z2SS   GL                 
      3.53878923E-02    3      1000023         2        -2             # GLSS   -->  Z2SS   UP     UB          
      3.25599499E-02    3      1000023         1        -1             # GLSS   -->  Z2SS   DN     DB          
      3.25599499E-02    3      1000023         3        -3             # GLSS   -->  Z2SS   ST     SB          
      3.53878513E-02    3      1000023         4        -4             # GLSS   -->  Z2SS   CH     CB          
      7.70618841E-02    3      1000023         5        -5             # GLSS   -->  Z2SS   BT     BB          
      1.09538045E-02    3      1000023         6        -6             # GLSS   -->  Z2SS   TP     TB          
      3.41034196E-02    2      1000025        21                       # GLSS   -->  Z3SS   GL                 
      2.87983767E-05    3      1000025         2        -2             # GLSS   -->  Z3SS   UP     UB          
      3.75833588E-05    3      1000025         1        -1             # GLSS   -->  Z3SS   DN     DB          
      3.75833588E-05    3      1000025         3        -3             # GLSS   -->  Z3SS   ST     SB          
      2.87983457E-05    3      1000025         4        -4             # GLSS   -->  Z3SS   CH     CB          
      1.79634267E-03    3      1000025         5        -5             # GLSS   -->  Z3SS   BT     BB          
      4.18661017E-04    3      1000025         6        -6             # GLSS   -->  Z3SS   TP     TB          
      2.83236355E-02    2      1000035        21                       # GLSS   -->  Z4SS   GL                 
      1.00134418E-03    3      1000035         2        -2             # GLSS   -->  Z4SS   UP     UB          
      1.20759802E-03    3      1000035         1        -1             # GLSS   -->  Z4SS   DN     DB          
      1.20759802E-03    3      1000035         3        -3             # GLSS   -->  Z4SS   ST     SB          
      1.00134301E-03    3      1000035         4        -4             # GLSS   -->  Z4SS   CH     CB          
      4.21293266E-03    3      1000035         5        -5             # GLSS   -->  Z4SS   BT     BB          
#         PDG         Width
DECAY   1000002  1.03969971E+02   # UPL   decays
#          BR          NDA       ID1       ID2       ID3       ID4
      1.35520205E-03    2      1000022         2                       # UPL    -->  Z1SS   UP                 
      6.91768080E-02    2      1000023         2                       # UPL    -->  Z2SS   UP                 
      3.47892812E-04    2      1000025         2                       # UPL    -->  Z3SS   UP                 
      7.24607473E-03    2      1000035         2                       # UPL    -->  Z4SS   UP                 
      7.70417690E-01    2      1000021         2                       # UPL    -->  GLSS   UP                 
      1.42086998E-01    2      1000024         1                       # UPL    -->  W1SS+  DN                 
      9.36933141E-03    2      1000037         1                       # UPL    -->  W2SS+  DN                 
#         PDG         Width
DECAY   1000001  1.03998405E+02   # DNL   decays
#          BR          NDA       ID1       ID2       ID3       ID4
      4.07247059E-03    2      1000022         1                       # DNL    -->  Z1SS   DN                 
      6.41817674E-02    2      1000023         1                       # DNL    -->  Z2SS   DN                 
      5.84573543E-04    2      1000025         1                       # DNL    -->  Z3SS   DN                 
      9.23718419E-03    2      1000035         1                       # DNL    -->  Z4SS   DN                 
      7.71278679E-01    2      1000021         1                       # DNL    -->  GLSS   DN                 
      1.27419546E-01    2     -1000024         2                       # DNL    -->  W1SS-  UP                 
      2.32257824E-02    2     -1000037         2                       # DNL    -->  W2SS-  UP                 
#         PDG         Width
DECAY   1000003  1.03998398E+02   # STL   decays
#          BR          NDA       ID1       ID2       ID3       ID4
      4.07247106E-03    2      1000022         3                       # STL    -->  Z1SS   ST                 
      6.41817749E-02    2      1000023         3                       # STL    -->  Z2SS   ST                 
      5.84573601E-04    2      1000025         3                       # STL    -->  Z3SS   ST                 
      9.23718512E-03    2      1000035         3                       # STL    -->  Z4SS   ST                 
      7.71278739E-01    2      1000021         3                       # STL    -->  GLSS   ST                 
      1.27419427E-01    2     -1000024         4                       # STL    -->  W1SS-  CH                 
      2.32257601E-02    2     -1000037         4                       # STL    -->  W2SS-  CH                 
#         PDG         Width
DECAY   1000004  1.03969879E+02   # CHL   decays
#          BR          NDA       ID1       ID2       ID3       ID4
      1.35520217E-03    2      1000022         4                       # CHL    -->  Z1SS   CH                 
      6.91768155E-02    2      1000023         4                       # CHL    -->  Z2SS   CH                 
      3.47892812E-04    2      1000025         4                       # CHL    -->  Z3SS   CH                 
      7.24607566E-03    2      1000035         4                       # CHL    -->  Z4SS   CH                 
      7.70417571E-01    2      1000021         4                       # CHL    -->  GLSS   CH                 
      1.42087147E-01    2      1000024         3                       # CHL    -->  W1SS+  ST                 
      9.36934259E-03    2      1000037         3                       # CHL    -->  W2SS+  ST                 
#         PDG         Width
DECAY   1000005  9.62407532E+01   # BT1   decays
#          BR          NDA       ID1       ID2       ID3       ID4
      3.76177253E-03    2      1000022         5                       # BT1    -->  Z1SS   BT                 
      5.69534115E-02    2      1000023         5                       # BT1    -->  Z2SS   BT                 
      3.08180973E-03    2      1000025         5                       # BT1    -->  Z3SS   BT                 
      9.96061508E-03    2      1000035         5                       # BT1    -->  Z4SS   BT                 
      5.86202145E-01    2      1000021         5                       # BT1    -->  GLSS   BT                 
      1.21457189E-01    2     -1000024         6                       # BT1    -->  W1SS-  TP                 
      2.11873665E-01    2     -1000037         6                       # BT1    -->  W2SS-  TP                 
      6.70942338E-03    2          -24   1000006                       # BT1    -->  W-     TP1                
#         PDG         Width
DECAY   1000006  4.83494797E+01   # TP1   decays
#          BR          NDA       ID1       ID2       ID3       ID4
      4.32216138E-01    2      1000021         6                       # TP1    -->  GLSS   TP                 
      4.98962365E-02    2      1000022         6                       # TP1    -->  Z1SS   TP                 
      1.33938147E-02    2      1000023         6                       # TP1    -->  Z2SS   TP                 
      1.30579889E-01    2      1000025         6                       # TP1    -->  Z3SS   TP                 
      1.09682083E-01    2      1000035         6                       # TP1    -->  Z4SS   TP                 
      2.69241016E-02    2      1000024         5                       # TP1    -->  W1SS+  BT                 
      2.37307832E-01    2      1000037         5                       # TP1    -->  W2SS+  BT                 
#         PDG         Width
DECAY   2000002  8.45599976E+01   # UPR   decays
#          BR          NDA       ID1       ID2       ID3       ID4
      4.98393364E-02    2      1000022         2                       # UPR    -->  Z1SS   UP                 
      4.68451966E-04    2      1000023         2                       # UPR    -->  Z2SS   UP                 
      1.49901447E-04    2      1000025         2                       # UPR    -->  Z3SS   UP                 
      5.90520271E-04    2      1000035         2                       # UPR    -->  Z4SS   UP                 
      9.48951781E-01    2      1000021         2                       # UPR    -->  GLSS   UP                 
#         PDG         Width
DECAY   2000001  8.13828659E+01   # DNR   decays
#          BR          NDA       ID1       ID2       ID3       ID4
      1.29523594E-02    2      1000022         1                       # DNR    -->  Z1SS   DN                 
      1.21744248E-04    2      1000023         1                       # DNR    -->  Z2SS   DN                 
      3.89593697E-05    2      1000025         1                       # DNR    -->  Z3SS   DN                 
      1.53477537E-04    2      1000035         1                       # DNR    -->  Z4SS   DN                 
      9.86733496E-01    2      1000021         1                       # DNR    -->  GLSS   DN                 
#         PDG         Width
DECAY   2000003  8.13828659E+01   # STR   decays
#          BR          NDA       ID1       ID2       ID3       ID4
      1.29523594E-02    2      1000022         3                       # STR    -->  Z1SS   ST                 
      1.21744248E-04    2      1000023         3                       # STR    -->  Z2SS   ST                 
      3.89593697E-05    2      1000025         3                       # STR    -->  Z3SS   ST                 
      1.53477537E-04    2      1000035         3                       # STR    -->  Z4SS   ST                 
      9.86733496E-01    2      1000021         3                       # STR    -->  GLSS   ST                 
#         PDG         Width
DECAY   2000004  8.45599213E+01   # CHR   decays
#          BR          NDA       ID1       ID2       ID3       ID4
      4.98393402E-02    2      1000022         4                       # CHR    -->  Z1SS   CH                 
      4.68452025E-04    2      1000023         4                       # CHR    -->  Z2SS   CH                 
      1.49901462E-04    2      1000025         4                       # CHR    -->  Z3SS   CH                 
      5.90520503E-04    2      1000035         4                       # CHR    -->  Z4SS   CH                 
      9.48951781E-01    2      1000021         4                       # CHR    -->  GLSS   CH                 
#         PDG         Width
DECAY   2000005  8.13995895E+01   # BT2   decays
#          BR          NDA       ID1       ID2       ID3       ID4
      1.29302768E-02    2      1000022         5                       # BT2    -->  Z1SS   BT                 
      6.55698299E-04    2      1000023         5                       # BT2    -->  Z2SS   BT                 
      3.95219401E-03    2      1000025         5                       # BT2    -->  Z3SS   BT                 
      3.56120290E-03    2      1000035         5                       # BT2    -->  Z4SS   BT                 
      9.70435500E-01    2      1000021         5                       # BT2    -->  GLSS   BT                 
      1.04577316E-03    2     -1000024         6                       # BT2    -->  W1SS-  TP                 
      6.86410628E-03    2     -1000037         6                       # BT2    -->  W2SS-  TP                 
      4.27978330E-06    2          -24   1000006                       # BT2    -->  W-     TP1                
      1.68961415E-04    2          -24   2000006                       # BT2    -->  W-     TP2                
      9.16358767E-05    2           23   1000005                       # BT2    -->  Z0     BT1                
      2.90198950E-04    2           25   1000005                       # BT2    -->  HL0    BT1                
#         PDG         Width
DECAY   2000006  9.48425522E+01   # TP2   decays
#          BR          NDA       ID1       ID2       ID3       ID4
      5.72150886E-01    2      1000021         6                       # TP2    -->  GLSS   TP                 
      1.23940945E-01    2      1000024         5                       # TP2    -->  W1SS+  BT                 
      1.71430651E-02    2      1000037         5                       # TP2    -->  W2SS+  BT                 
      3.61506804E-03    2           23   1000006                       # TP2    -->  Z0     TP1                
      7.34528154E-03    2           25   1000006                       # TP2    -->  HL0    TP1                
      1.58019352E-03    2      1000022         6                       # TP2    -->  Z1SS   TP                 
      6.47742301E-02    2      1000023         6                       # TP2    -->  Z2SS   TP                 
      1.03514098E-01    2      1000025         6                       # TP2    -->  Z3SS   TP                 
      1.05936170E-01    2      1000035         6                       # TP2    -->  Z4SS   TP                 
#         PDG         Width
DECAY   1000011  2.51132812E+01   # EL-   decays
#          BR          NDA       ID1       ID2       ID3       ID4
      7.57993758E-02    2      1000022        11                       # EL-    -->  Z1SS   E-                 
      2.98317671E-01    2      1000023        11                       # EL-    -->  Z2SS   E-                 
      6.89253677E-04    2      1000025        11                       # EL-    -->  Z3SS   E-                 
      2.19671261E-02    2      1000035        11                       # EL-    -->  Z4SS   E-                 
      5.10557353E-01    2     -1000024        12                       # EL-    -->  W1SS-  NUE                
      9.26692709E-02    2     -1000037        12                       # EL-    -->  W2SS-  NUE                
#         PDG         Width
DECAY   1000013  2.51132812E+01   # MUL-  decays
#          BR          NDA       ID1       ID2       ID3       ID4
      7.57993758E-02    2      1000022        13                       # MUL-   -->  Z1SS   MU-                
      2.98317671E-01    2      1000023        13                       # MUL-   -->  Z2SS   MU-                
      6.89253677E-04    2      1000025        13                       # MUL-   -->  Z3SS   MU-                
      2.19671261E-02    2      1000035        13                       # MUL-   -->  Z4SS   MU-                
      5.10557353E-01    2     -1000024        14                       # MUL-   -->  W1SS-  NUM                
      9.26692709E-02    2     -1000037        14                       # MUL-   -->  W2SS-  NUM                
#         PDG         Width
DECAY   1000015  1.05758438E+01   # TAU1- decays
#          BR          NDA       ID1       ID2       ID3       ID4
      8.40760648E-01    2      1000022        15                       # TAU1-  -->  Z1SS   TAU-               
      4.93102223E-02    2      1000023        15                       # TAU1-  -->  Z2SS   TAU-               
      1.49850212E-02    2      1000025        15                       # TAU1-  -->  Z3SS   TAU-               
      1.14889443E-02    2      1000035        15                       # TAU1-  -->  Z4SS   TAU-               
      7.70523176E-02    2     -1000024        16                       # TAU1-  -->  W1SS-  NUT                
      6.40276540E-03    2     -1000037        16                       # TAU1-  -->  W2SS-  NUT                
#         PDG         Width
DECAY   1000012  2.51613407E+01   # NUEL  decays
#          BR          NDA       ID1       ID2       ID3       ID4
      1.08211584E-01    2      1000022        12                       # NUEL   -->  Z1SS   NUE                
      2.37132728E-01    2      1000023        12                       # NUEL   -->  Z2SS   NUE                
      3.51156737E-03    2      1000025        12                       # NUEL   -->  Z3SS   NUE                
      4.56125364E-02    2      1000035        12                       # NUEL   -->  Z4SS   NUE                
      5.68220377E-01    2      1000024        11                       # NUEL   -->  W1SS+  E-                 
      3.73111404E-02    2      1000037        11                       # NUEL   -->  W2SS+  E-                 
#         PDG         Width
DECAY   1000014  2.51613407E+01   # NUML  decays
#          BR          NDA       ID1       ID2       ID3       ID4
      1.08211584E-01    2      1000022        14                       # NUML   -->  Z1SS   NUM                
      2.37132728E-01    2      1000023        14                       # NUML   -->  Z2SS   NUM                
      3.51156737E-03    2      1000025        14                       # NUML   -->  Z3SS   NUM                
      4.56125364E-02    2      1000035        14                       # NUML   -->  Z4SS   NUM                
      5.68220377E-01    2      1000024        13                       # NUML   -->  W1SS+  MU-                
      3.73111404E-02    2      1000037        13                       # NUML   -->  W2SS+  MU-                
#         PDG         Width
DECAY   1000016  2.54081306E+01   # NUTL  decays
#          BR          NDA       ID1       ID2       ID3       ID4
      1.06670007E-01    2      1000022        16                       # NUTL   -->  Z1SS   NUT                
      2.33716637E-01    2      1000023        16                       # NUTL   -->  Z2SS   NUT                
      3.45908431E-03    2      1000025        16                       # NUTL   -->  Z3SS   NUT                
      4.49265838E-02    2      1000035        16                       # NUTL   -->  Z4SS   NUT                
      5.62503040E-01    2      1000024        15                       # NUTL   -->  W1SS+  TAU-               
      4.87246513E-02    2      1000037        15                       # NUTL   -->  W2SS+  TAU-               
      8.51876625E-11    3      1000015        16       -15             # NUTL   -->  TAU1-  NUT    TAU+        
      8.51876625E-11    3      1000015        12       -11             # NUTL   -->  TAU1-  NUE    E+          
      8.51876625E-11    3      1000015        14       -13             # NUTL   -->  TAU1-  NUM    MU+         
      2.55562987E-10    3      1000015         2        -1             # NUTL   -->  TAU1-  UP     DB          
      2.55562987E-10    3      1000015         4        -3             # NUTL   -->  TAU1-  CH     SB          
#         PDG         Width
DECAY   2000011  9.38495827E+00   # ER-   decays
#          BR          NDA       ID1       ID2       ID3       ID4
      9.76409137E-01    2      1000022        11                       # ER-    -->  Z1SS   E-                 
      9.16680600E-03    2      1000023        11                       # ER-    -->  Z2SS   E-                 
      2.92178616E-03    2      1000025        11                       # ER-    -->  Z3SS   E-                 
      1.15022752E-02    2      1000035        11                       # ER-    -->  Z4SS   E-                 
#         PDG         Width
DECAY   2000013  9.38495827E+00   # MUR-  decays
#          BR          NDA       ID1       ID2       ID3       ID4
      9.76409137E-01    2      1000022        13                       # MUR-   -->  Z1SS   MU-                
      9.16680600E-03    2      1000023        13                       # MUR-   -->  Z2SS   MU-                
      2.92178616E-03    2      1000025        13                       # MUR-   -->  Z3SS   MU-                
      1.15022752E-02    2      1000035        13                       # MUR-   -->  Z4SS   MU-                
#         PDG         Width
DECAY   2000015  2.48051167E+01   # TAU2- decays
#          BR          NDA       ID1       ID2       ID3       ID4
      8.45117941E-02    2      1000022        15                       # TAU2-  -->  Z1SS   TAU-               
      2.85418004E-01    2      1000023        15                       # TAU2-  -->  Z2SS   TAU-               
      9.71908681E-03    2      1000025        15                       # TAU2-  -->  Z3SS   TAU-               
      3.36153582E-02    2      1000035        15                       # TAU2-  -->  Z4SS   TAU-               
      4.83913451E-01    2     -1000024        16                       # TAU2-  -->  W1SS-  NUT                
      1.02822334E-01    2     -1000037        16                       # TAU2-  -->  W2SS-  NUT                
#         PDG         Width
DECAY   1000023  7.34993606E-04   # Z2SS  decays
#          BR          NDA       ID1       ID2       ID3       ID4
      3.55971606E-05    2      1000022        22                       # Z2SS   -->  Z1SS   GM                 
      9.99890208E-01    2      1000022        23                       # Z2SS   -->  Z1SS   Z0                 
      1.74773319E-07    3      1000022         2        -2             # Z2SS   -->  Z1SS   UP     UB          
      4.18319786E-07    3      1000022         1        -1             # Z2SS   -->  Z1SS   DN     DB          
      4.18319786E-07    3      1000022         3        -3             # Z2SS   -->  Z1SS   ST     SB          
      1.74773135E-07    3      1000022         4        -4             # Z2SS   -->  Z1SS   CH     CB          
      5.66122981E-05    3      1000022         5        -5             # Z2SS   -->  Z1SS   BT     BB          
      8.96228016E-07    3      1000022        11       -11             # Z2SS   -->  Z1SS   E-     E+          
      8.96228016E-07    3      1000022        13       -13             # Z2SS   -->  Z1SS   MU-    MU+         
      1.18965781E-05    3      1000022        15       -15             # Z2SS   -->  Z1SS   TAU-   TAU+        
      9.70584892E-07    3      1000022        12       -12             # Z2SS   -->  Z1SS   NUE    ANUE        
      9.70584892E-07    3      1000022        14       -14             # Z2SS   -->  Z1SS   NUM    ANUM        
      9.88441229E-07    3      1000022        16       -16             # Z2SS   -->  Z1SS   NUT    ANUT        
#         PDG         Width
DECAY   1000025  1.66974354E+00   # Z3SS  decays
#          BR          NDA       ID1       ID2       ID3       ID4
      8.51873807E-08    2      1000022        22                       # Z3SS   -->  Z1SS   GM                 
      8.78160108E-07    2      1000023        22                       # Z3SS   -->  Z2SS   GM                 
      2.98018575E-01    2      1000024       -24                       # Z3SS   -->  W1SS+  W-                 
      2.98018575E-01    2     -1000024        24                       # Z3SS   -->  W1SS-  W+                 
      1.30408600E-01    2      1000022        23                       # Z3SS   -->  Z1SS   Z0                 
      2.41503090E-01    2      1000023        23                       # Z3SS   -->  Z2SS   Z0                 
      1.59642383E-10    3      1000022         2        -2             # Z3SS   -->  Z1SS   UP     UB          
      7.93965033E-11    3      1000022         1        -1             # Z3SS   -->  Z1SS   DN     DB          
      7.93965033E-11    3      1000022         3        -3             # Z3SS   -->  Z1SS   ST     SB          
      1.59642216E-10    3      1000022         4        -4             # Z3SS   -->  Z1SS   CH     CB          
      8.61710969E-09    3      1000022         5        -5             # Z3SS   -->  Z1SS   BT     BB          
      3.18623627E-10    3      1000022        11       -11             # Z3SS   -->  Z1SS   E-     E+          
      3.18623627E-10    3      1000022        13       -13             # Z3SS   -->  Z1SS   MU-    MU+         
      6.59360078E-09    3      1000022        15       -15             # Z3SS   -->  Z1SS   TAU-   TAU+        
      2.67684513E-10    3      1000022        12       -12             # Z3SS   -->  Z1SS   NUE    ANUE        
      2.67684513E-10    3      1000022        14       -14             # Z3SS   -->  Z1SS   NUM    ANUM        
      2.72680711E-10    3      1000022        16       -16             # Z3SS   -->  Z1SS   NUT    ANUT        
      1.24820640E-10    3      1000023         2        -2             # Z3SS   -->  Z2SS   UP     UB          
      1.93284111E-10    3      1000023         1        -1             # Z3SS   -->  Z2SS   DN     DB          
      1.93284111E-10    3      1000023         3        -3             # Z3SS   -->  Z2SS   ST     SB          
      1.24820487E-10    3      1000023         4        -4             # Z3SS   -->  Z2SS   CH     CB          
      8.23254442E-09    3      1000023         5        -5             # Z3SS   -->  Z2SS   BT     BB          
      2.55731044E-11    3      1000023        11       -11             # Z3SS   -->  Z2SS   E-     E+          
      2.55731044E-11    3      1000023        13       -13             # Z3SS   -->  Z2SS   MU-    MU+         
      1.11238796E-09    3      1000023        15       -15             # Z3SS   -->  Z2SS   TAU-   TAU+        
      1.02494700E-10    3      1000023        12       -12             # Z3SS   -->  Z2SS   NUE    ANUE        
      1.02494700E-10    3      1000023        14       -14             # Z3SS   -->  Z2SS   NUM    ANUM        
      1.04417974E-10    3      1000023        16       -16             # Z3SS   -->  Z2SS   NUT    ANUT        
      2.28192620E-02    2      1000022        25                       # Z3SS   -->  Z1SS   HL0                
      9.23103560E-03    2      1000023        25                       # Z3SS   -->  Z2SS   HL0                
#         PDG         Width
DECAY   1000035  2.06000853E+00   # Z4SS  decays
#          BR          NDA       ID1       ID2       ID3       ID4
      3.61535157E-08    2      1000022        22                       # Z4SS   -->  Z1SS   GM                 
      2.91518973E-07    2      1000023        22                       # Z4SS   -->  Z2SS   GM                 
      7.74892595E-09    2      1000025        22                       # Z4SS   -->  Z3SS   GM                 
      3.51399302E-01    2      1000024       -24                       # Z4SS   -->  W1SS+  W-                 
      3.51399302E-01    2     -1000024        24                       # Z4SS   -->  W1SS-  W+                 
      3.91867826E-13    3     -1000037         2        -1             # Z4SS   -->  W2SS-  UP     DB          
      1.30622604E-13    3     -1000037        12       -11             # Z4SS   -->  W2SS-  NUE    E+          
      1.30622604E-13    3     -1000037        14       -13             # Z4SS   -->  W2SS-  NUM    MU+         
      3.91867826E-13    3      1000037         1        -2             # Z4SS   -->  W2SS+  DN     UB          
      1.30622604E-13    3      1000037        11       -12             # Z4SS   -->  W2SS+  E-     ANUE        
      1.30622604E-13    3      1000037        13       -14             # Z4SS   -->  W2SS+  MU-    ANUM        
      2.44711824E-02    2      1000022        23                       # Z4SS   -->  Z1SS   Z0                 
      1.72081403E-02    2      1000023        23                       # Z4SS   -->  Z2SS   Z0                 
      2.11447815E-09    3      1000022         2        -2             # Z4SS   -->  Z1SS   UP     UB          
      2.80267076E-09    3      1000022         1        -1             # Z4SS   -->  Z1SS   DN     DB          
      2.80267076E-09    3      1000022         3        -3             # Z4SS   -->  Z1SS   ST     SB          
      2.11447593E-09    3      1000022         4        -4             # Z4SS   -->  Z1SS   CH     CB          
      1.15367262E-08    3      1000022         5        -5             # Z4SS   -->  Z1SS   BT     BB          
      5.56145086E-09    3      1000022        11       -11             # Z4SS   -->  Z1SS   E-     E+          
      5.56145086E-09    3      1000022        13       -13             # Z4SS   -->  Z1SS   MU-    MU+         
      1.12183907E-08    3      1000022        15       -15             # Z4SS   -->  Z1SS   TAU-   TAU+        
      8.50206039E-09    3      1000022        12       -12             # Z4SS   -->  Z1SS   NUE    ANUE        
      8.50206039E-09    3      1000022        14       -14             # Z4SS   -->  Z1SS   NUM    ANUM        
      8.66062511E-09    3      1000022        16       -16             # Z4SS   -->  Z1SS   NUT    ANUT        
      9.75302950E-09    3      1000023         2        -2             # Z4SS   -->  Z2SS   UP     UB          
      1.14744925E-08    3      1000023         1        -1             # Z4SS   -->  Z2SS   DN     DB          
      1.14744925E-08    3      1000023         3        -3             # Z4SS   -->  Z2SS   ST     SB          
      9.75302061E-09    3      1000023         4        -4             # Z4SS   -->  Z2SS   CH     CB          
      3.26679448E-08    3      1000023         5        -5             # Z4SS   -->  Z2SS   BT     BB          
      3.01576786E-09    3      1000023        11       -11             # Z4SS   -->  Z2SS   E-     E+          
      3.01576786E-09    3      1000023        13       -13             # Z4SS   -->  Z2SS   MU-    MU+         
      3.98973565E-09    3      1000023        15       -15             # Z4SS   -->  Z2SS   TAU-   TAU+        
      5.00558794E-09    3      1000023        12       -12             # Z4SS   -->  Z2SS   NUE    ANUE        
      5.00558794E-09    3      1000023        14       -14             # Z4SS   -->  Z2SS   NUM    ANUM        
      5.09956655E-09    3      1000023        16       -16             # Z4SS   -->  Z2SS   NUT    ANUT        
      2.20140379E-07    3      1000025         2        -2             # Z4SS   -->  Z3SS   UP     UB          
      2.83943706E-07    3      1000025         1        -1             # Z4SS   -->  Z3SS   DN     DB          
      2.83943706E-07    3      1000025         3        -3             # Z4SS   -->  Z3SS   ST     SB          
      2.20140379E-07    3      1000025         4        -4             # Z4SS   -->  Z3SS   CH     CB          
      1.52253847E-07    3      1000025         5        -5             # Z4SS   -->  Z3SS   BT     BB          
      6.44089866E-08    3      1000025        11       -11             # Z4SS   -->  Z3SS   E-     E+          
      6.44089866E-08    3      1000025        13       -13             # Z4SS   -->  Z3SS   MU-    MU+         
      5.84865596E-08    3      1000025        15       -15             # Z4SS   -->  Z3SS   TAU-   TAU+        
      1.28119254E-07    3      1000025        12       -12             # Z4SS   -->  Z3SS   NUE    ANUE        
      1.28119254E-07    3      1000025        14       -14             # Z4SS   -->  Z3SS   NUM    ANUM        
      1.28119026E-07    3      1000025        16       -16             # Z4SS   -->  Z3SS   NUT    ANUT        
      8.73389468E-02    2      1000022        25                       # Z4SS   -->  Z1SS   HL0                
      1.68180972E-01    2      1000023        25                       # Z4SS   -->  Z2SS   HL0                
#         PDG         Width
DECAY   1000024  5.00341132E-03   # W1SS+ decays
#          BR          NDA       ID1       ID2       ID3       ID4
      8.40825365E-08    3      1000022         2        -1             # W1SS+  -->  Z1SS   UP     DB          
      8.40825152E-08    3      1000022         4        -3             # W1SS+  -->  Z1SS   CH     SB          
      2.87276436E-07    3      1000022       -11        12             # W1SS+  -->  Z1SS   E+     NUE         
      2.87276436E-07    3      1000022       -13        14             # W1SS+  -->  Z1SS   MU+    NUM         
      3.00083826E-07    3      1000022       -15        16             # W1SS+  -->  Z1SS   TAU+   NUT         
      9.99998987E-01    2      1000022        24                       # W1SS+  -->  Z1SS   W+                 
      7.18873086E-11    3      1000023       -11        12             # W1SS+  -->  Z2SS   E+     NUE         
      7.18873086E-11    3      1000023       -13        14             # W1SS+  -->  Z2SS   MU+    NUM         
#         PDG         Width
DECAY   1000037  1.77314472E+00   # W2SS+ decays
#          BR          NDA       ID1       ID2       ID3       ID4
      4.01864897E-09    3      1000022         2        -1             # W2SS+  -->  Z1SS   UP     DB          
      4.01864808E-09    3      1000022         4        -3             # W2SS+  -->  Z1SS   CH     SB          
      1.07273586E-08    3      1000022       -11        12             # W2SS+  -->  Z1SS   E+     NUE         
      1.07273586E-08    3      1000022       -13        14             # W2SS+  -->  Z1SS   MU+    NUM         
      1.74150276E-08    3      1000022       -15        16             # W2SS+  -->  Z1SS   TAU+   NUT         
      9.66776386E-02    2      1000022        24                       # W2SS+  -->  Z1SS   W+                 
      9.37385636E-09    3      1000023         2        -1             # W2SS+  -->  Z2SS   UP     DB          
      9.37385636E-09    3      1000023         4        -3             # W2SS+  -->  Z2SS   CH     SB          
      3.97839406E-09    3      1000023       -11        12             # W2SS+  -->  Z2SS   E+     NUE         
      3.97839406E-09    3      1000023       -13        14             # W2SS+  -->  Z2SS   MU+    NUM         
      5.74955061E-09    3      1000023       -15        16             # W2SS+  -->  Z2SS   TAU+   NUT         
      3.54185581E-01    2      1000023        24                       # W2SS+  -->  Z2SS   W+                 
      7.06569836E-07    3      1000025         2        -1             # W2SS+  -->  Z3SS   UP     DB          
      7.06569836E-07    3      1000025         4        -3             # W2SS+  -->  Z3SS   CH     SB          
      2.35510910E-07    3      1000025       -11        12             # W2SS+  -->  Z3SS   E+     NUE         
      2.35510910E-07    3      1000025       -13        14             # W2SS+  -->  Z3SS   MU+    NUM         
      2.35522606E-07    3      1000025       -15        16             # W2SS+  -->  Z3SS   TAU+   NUT         
      3.14570338E-01    2      1000024        23                       # W2SS+  -->  W1SS+  Z0                 
      9.88419835E-09    3      1000024         1        -1             # W2SS+  -->  W1SS+  DN     DB          
      9.88418680E-09    3      1000024         3        -3             # W2SS+  -->  W1SS+  ST     SB          
      2.18644853E-08    3      1000024         2        -2             # W2SS+  -->  W1SS+  UP     UB          
      2.18644853E-08    3      1000024         4        -4             # W2SS+  -->  W1SS+  CH     CB          
      8.29306313E-09    3      1000024        12       -12             # W2SS+  -->  W1SS+  NUE    ANUE        
      8.29306313E-09    3      1000024        14       -14             # W2SS+  -->  W1SS+  NUM    ANUM        
      8.69467343E-09    3      1000024        16       -16             # W2SS+  -->  W1SS+  NUT    ANUT        
      3.74551679E-09    3      1000024        11       -11             # W2SS+  -->  W1SS+  E-     E+          
      3.74551679E-09    3      1000024        13       -13             # W2SS+  -->  W1SS+  MU-    MU+         
      3.81587073E-09    3      1000024        15       -15             # W2SS+  -->  W1SS+  TAU-   TAU+        
      2.34564319E-01    2      1000024        25                       # W2SS+  -->  W1SS+  HL0                
#         PDG         Width
DECAY        25  4.02894104E-03   # HL0   decays
#          BR          NDA       ID1       ID2       ID3       ID4
      4.86915042E-09    2           11       -11                       # HL0    -->  E-     E+                 
      2.05583259E-04    2           13       -13                       # HL0    -->  MU-    MU+                
      5.87968342E-02    2           15       -15                       # HL0    -->  TAU-   TAU+               
      6.11201449E-06    2            1        -1                       # HL0    -->  DN     DB                 
      2.46956013E-03    2            3        -3                       # HL0    -->  ST     SB                 
      8.10467660E-01    2            5        -5                       # HL0    -->  BT     BB                 
      1.93284109E-06    2            2        -2                       # HL0    -->  UP     UB                 
      3.64293121E-02    2            4        -4                       # HL0    -->  CH     CB                 
      1.81982294E-03    2           22        22                       # HL0    -->  GM     GM                 
      3.84717472E-02    2           21        21                       # HL0    -->  GL     GL                 
      2.66489922E-03    3           24        11       -12             # HL0    -->  W+     E-     ANUE        
      2.66489922E-03    3           24        13       -14             # HL0    -->  W+     MU-    ANUM        
      2.66489922E-03    3           24        15       -16             # HL0    -->  W+     TAU-   ANUT        
      7.99469650E-03    3           24        -2         1             # HL0    -->  W+     UB     DN          
      7.99469650E-03    3           24        -4         3             # HL0    -->  W+     CB     ST          
      2.66489922E-03    3          -24       -11        12             # HL0    -->  W-     E+     NUE         
      2.66489922E-03    3          -24       -13        14             # HL0    -->  W-     MU+    NUM         
      2.66489922E-03    3          -24       -15        16             # HL0    -->  W-     TAU+   NUT         
      7.99469650E-03    3          -24         2        -1             # HL0    -->  W-     UP     DB          
      7.99469650E-03    3          -24         4        -3             # HL0    -->  W-     CH     SB          
      2.30006481E-04    3           23        12       -12             # HL0    -->  Z0     NUE    ANUE        
      2.30006481E-04    3           23        14       -14             # HL0    -->  Z0     NUM    ANUM        
      2.30006481E-04    3           23        16       -16             # HL0    -->  Z0     NUT    ANUT        
      1.15759954E-04    3           23        11       -11             # HL0    -->  Z0     E-     E+          
      1.15759954E-04    3           23        13       -13             # HL0    -->  Z0     MU-    MU+         
      1.15759954E-04    3           23        15       -15             # HL0    -->  Z0     TAU-   TAU+        
      3.96583782E-04    3           23         2        -2             # HL0    -->  Z0     UP     UB          
      3.96583782E-04    3           23         4        -4             # HL0    -->  Z0     CH     CB          
      5.10897604E-04    3           23         1        -1             # HL0    -->  Z0     DN     DB          
      5.10897604E-04    3           23         3        -3             # HL0    -->  Z0     ST     SB          
      5.10897604E-04    3           23         5        -5             # HL0    -->  Z0     BT     BB          
#         PDG         Width
DECAY        35  2.70757580E+01   # HH0   decays
#          BR          NDA       ID1       ID2       ID3       ID4
      1.18309218E-09    2           11       -11                       # HH0    -->  E-     E+                 
      4.99522866E-05    2           13       -13                       # HH0    -->  MU-    MU+                
      1.43070249E-02    2           15       -15                       # HH0    -->  TAU-   TAU+               
      1.44221508E-06    2            1        -1                       # HH0    -->  DN     DB                 
      5.82727953E-04    2            3        -3                       # HH0    -->  ST     SB                 
      7.90470839E-02    2            5        -5                       # HH0    -->  BT     BB                 
      4.66906999E-11    2            2        -2                       # HH0    -->  UP     UB                 
      6.12032238E-07    2            4        -4                       # HH0    -->  CH     CB                 
      3.10795009E-02    2            6        -6                       # HH0    -->  TP     TB                 
      2.07492491E-07    2           22        22                       # HH0    -->  GM     GM                 
      1.02402901E-05    2           21        21                       # HH0    -->  GL     GL                 
      2.70081764E-05    2           24       -24                       # HH0    -->  W+     W-                 
      1.38198702E-05    2           23        23                       # HH0    -->  Z0     Z0                 
      3.61284264E-03    2      1000022   1000022                       # HH0    -->  Z1SS   Z1SS               
      2.12583113E-02    2      1000022   1000023                       # HH0    -->  Z1SS   Z2SS               
      5.25429100E-02    2      1000022   1000025                       # HH0    -->  Z1SS   Z3SS               
      2.08707042E-02    2      1000022   1000035                       # HH0    -->  Z1SS   Z4SS               
      2.98897121E-02    2      1000023   1000023                       # HH0    -->  Z2SS   Z2SS               
      1.14878416E-01    2      1000023   1000025                       # HH0    -->  Z2SS   Z3SS               
      3.92913446E-02    2      1000023   1000035                       # HH0    -->  Z2SS   Z4SS               
      3.23342276E-03    2      1000025   1000025                       # HH0    -->  Z3SS   Z3SS               
      3.65230590E-02    2      1000025   1000035                       # HH0    -->  Z3SS   Z4SS               
      2.29021609E-02    2      1000035   1000035                       # HH0    -->  Z4SS   Z4SS               
      7.22311884E-02    2      1000024  -1000024                       # HH0    -->  W1SS+  W1SS-              
      1.65092349E-02    2      1000037  -1000037                       # HH0    -->  W2SS+  W2SS-              
      2.20521003E-01    2      1000024  -1000037                       # HH0    -->  W1SS+  W2SS-              
      2.20521003E-01    2     -1000024   1000037                       # HH0    -->  W1SS-  W2SS+              
      9.50415488E-05    2           25        25                       # HH0    -->  HL0    HL0                
#         PDG         Width
DECAY        36  2.68760223E+01   # HA0   decays
#          BR          NDA       ID1       ID2       ID3       ID4
      1.18417176E-09    2           11       -11                       # HA0    -->  E-     E+                 
      4.99978705E-05    2           13       -13                       # HA0    -->  MU-    MU+                
      1.43201305E-02    2           15       -15                       # HA0    -->  TAU-   TAU+               
      1.44360138E-06    2            1        -1                       # HA0    -->  DN     DB                 
      5.83287969E-04    2            3        -3                       # HA0    -->  ST     SB                 
      7.91240036E-02    2            5        -5                       # HA0    -->  BT     BB                 
      4.61906138E-11    2            2        -2                       # HA0    -->  UP     UB                 
      6.05921059E-07    2            4        -4                       # HA0    -->  CH     CB                 
      3.15990336E-02    2            6        -6                       # HA0    -->  TP     TB                 
      5.12771180E-07    2           22        22                       # HA0    -->  GM     GM                 
      1.67362214E-05    2           21        21                       # HA0    -->  GL     GL                 
      4.28257091E-03    2      1000022   1000022                       # HA0    -->  Z1SS   Z1SS               
      2.70453561E-02    2      1000022   1000023                       # HA0    -->  Z1SS   Z2SS               
      3.24474238E-02    2      1000022   1000025                       # HA0    -->  Z1SS   Z3SS               
      3.52546312E-02    2      1000022   1000035                       # HA0    -->  Z1SS   Z4SS               
      4.06273045E-02    2      1000023   1000023                       # HA0    -->  Z2SS   Z2SS               
      6.69424459E-02    2      1000023   1000025                       # HA0    -->  Z2SS   Z3SS               
      6.91831708E-02    2      1000023   1000035                       # HA0    -->  Z2SS   Z4SS               
      2.55324412E-03    2      1000025   1000025                       # HA0    -->  Z3SS   Z3SS               
      2.38024108E-02    2      1000025   1000035                       # HA0    -->  Z3SS   Z4SS               
      4.26078439E-02    2      1000035   1000035                       # HA0    -->  Z4SS   Z4SS               
      9.67271104E-02    2      1000024  -1000024                       # HA0    -->  W1SS+  W1SS-              
      3.93382758E-02    2      1000037  -1000037                       # HA0    -->  W2SS+  W2SS-              
      1.96732789E-01    2      1000024  -1000037                       # HA0    -->  W1SS+  W2SS-              
      1.96732789E-01    2     -1000024   1000037                       # HA0    -->  W1SS-  W2SS+              
      2.68266213E-05    2           25        23                       # HA0    -->  HL0    Z0                 
#         PDG         Width
DECAY        37  2.67824745E+01   # H+    decays
#          BR          NDA       ID1       ID2       ID3       ID4
      1.19732479E-09    2           12       -11                       # H+     -->  NUE    E+                 
      5.05532080E-05    2           14       -13                       # H+     -->  NUM    MU+                
      1.44791892E-02    2           16       -15                       # H+     -->  NUT    TAU+               
      1.34826632E-06    2            2        -1                       # H+     -->  UP     DB                 
      5.45315270E-04    2            4        -3                       # H+     -->  CH     SB                 
      1.01836324E-01    2            6        -5                       # H+     -->  TP     BB                 
      4.14520651E-02    2      1000024   1000022                       # H+     -->  W1SS+  Z1SS               
      2.51669961E-04    2      1000024   1000023                       # H+     -->  W1SS+  Z2SS               
      2.28715643E-01    2      1000024   1000025                       # H+     -->  W1SS+  Z3SS               
      2.37391278E-01    2      1000024   1000035                       # H+     -->  W1SS+  Z4SS               
      3.76696140E-02    2      1000037   1000022                       # H+     -->  W2SS+  Z1SS               
      3.03276509E-01    2      1000037   1000023                       # H+     -->  W2SS+  Z2SS               
      3.12534496E-02    2      1000037   1000025                       # H+     -->  W2SS+  Z3SS               
      3.04973405E-03    2      1000037   1000035                       # H+     -->  W2SS+  Z4SS               
      2.72293782E-05    2           25        24                       # H+     -->  HL0    W+                 
