  65
  401    413.5182    0.16926E-24
  402    406.7489    0.16073E-24
  403    413.5182    0.16927E-24
  404    406.7513    0.16073E-24
  405    379.3945    0.25460E-24
  406    270.2362    0.43914E-24
  407    413.5182    0.16926E-24
  408    406.7489    0.16073E-24
  409    413.5182    0.16927E-24
  410    406.7513    0.16073E-24
  411    379.3945    0.25460E-24
  412    270.2362    0.43914E-24
  413    396.9593    0.31711E-23
  414    396.3140    0.79425E-24
  415    396.9593    0.31711E-23
  416    396.3166    0.79427E-24
  417    396.9979    0.16697E-23
  418    457.5407    0.15290E-24
  419    396.9593    0.31711E-23
  420    396.3140    0.79425E-24
  421    396.9593    0.31711E-23
  422    396.3166    0.79427E-24
  423    396.9979    0.16697E-23
  424    457.5407    0.15290E-24
  425    144.9642    0.19185E-23
  426    124.9352    0.28868E-23
  427    144.9642    0.19185E-23
  428    124.9352    0.28868E-23
  429    102.1537    0.34347E-23
  430    123.9651    0.30297E-23
  431    144.9642    0.19185E-23
  432    124.9352    0.28868E-23
  433    144.9642    0.19185E-23
  434    124.9352    0.28868E-23
  435    102.1537    0.34347E-23
  436    123.9651    0.30297E-23
  437    102.5458    0.33353E-23
  438      0.0000    0.10000E+31
  439    102.5458    0.33353E-23
  440      0.0000    0.10000E+31
  441    144.8280    0.19391E-23
  442      0.0000    0.10000E+31
  443    102.5458    0.33353E-23
  444      0.0000    0.10000E+31
  445    102.5458    0.33353E-23
  446      0.0000    0.10000E+31
  447    144.8280    0.19391E-23
  448      0.0000    0.10000E+31
  449    440.2383    0.19010E-24
  450     60.7502    0.10000E+31
  451    111.5179    0.20373E-21
  452   -271.2179    0.43338E-24
  453    305.8575    0.24960E-24
  454    108.1441    0.32903E-20
  455    300.6225    0.25102E-24
  456    108.1441    0.32903E-20
  457    300.6225    0.25102E-24
  203     93.1571    0.16283E-21
  204    321.6967    0.15302E-23
  205    314.6218    0.69303E-24
  206    326.3371    0.51949E-24
  207    326.3371    0.51949E-24
  458      0.0000    0.10000E+31
    6    172.5000    0.57395E-24
   12    172.5000    0.57395E-24
   6
   401  0.57672765E-01     0   450     1     0     0     0
   401  0.27726322E+00     0   451     1     0     0     0
   401  0.13867407E-02     0   452     1     0     0     0
   401  0.15521808E-01     0   453     1     0     0     0
   401  0.60380048E+00     0   456     2     0     0     0
   401  0.44354971E-01     0   457     2     0     0     0
   6
   402  0.15355730E-03     0   450     2     0     0     0
   402  0.32222602E+00     0   451     2     0     0     0
   402  0.75330114E-03     0   452     2     0     0     0
   402  0.99681802E-02     0   453     2     0     0     0
   402  0.64960670E+00     0   454     1     0     0     0
   402  0.17292246E-01     0   455     1     0     0     0
   6
   403  0.57673864E-01     0   450     3     0     0     0
   403  0.27726853E+00     0   451     3     0     0     0
   403  0.13867676E-02     0   452     3     0     0     0
   403  0.15522110E-01     0   453     3     0     0     0
   403  0.60379714E+00     0   456     4     0     0     0
   403  0.44351581E-01     0   457     4     0     0     0
   6
   404  0.15355489E-03     0   450     4     0     0     0
   404  0.32222056E+00     0   451     4     0     0     0
   404  0.75326703E-03     0   452     4     0     0     0
   404  0.99673979E-02     0   453     4     0     0     0
   404  0.64961237E+00     0   454     3     0     0     0
   404  0.17292866E-01     0   455     3     0     0     0
   6
   405  0.83115906E-01     0   450     5     0     0     0
   405  0.35287106E+00     0   451     5     0     0     0
   405  0.13660116E-02     0   452     5     0     0     0
   405  0.11293846E-01     0   453     5     0     0     0
   405  0.38358307E+00     0   456     6     0     0     0
   405  0.16777012E+00     0   199   406     0     0     0
   2
   406  0.71616657E-01     0   450     6     0     0     0
   406  0.92838335E+00     0   454     5     0     0     0
   6
   407  0.57672765E-01     0   450     7     0     0     0
   407  0.27726322E+00     0   451     7     0     0     0
   407  0.13867407E-02     0   452     7     0     0     0
   407  0.15521808E-01     0   453     7     0     0     0
   407  0.60380048E+00     0   454     8     0     0     0
   407  0.44354971E-01     0   455     8     0     0     0
   6
   408  0.15355730E-03     0   450     8     0     0     0
   408  0.32222602E+00     0   451     8     0     0     0
   408  0.75330114E-03     0   452     8     0     0     0
   408  0.99681802E-02     0   453     8     0     0     0
   408  0.64960670E+00     0   456     7     0     0     0
   408  0.17292246E-01     0   457     7     0     0     0
   6
   409  0.57673864E-01     0   450     9     0     0     0
   409  0.27726853E+00     0   451     9     0     0     0
   409  0.13867676E-02     0   452     9     0     0     0
   409  0.15522110E-01     0   453     9     0     0     0
   409  0.60379714E+00     0   454    10     0     0     0
   409  0.44351581E-01     0   455    10     0     0     0
   6
   410  0.15355489E-03     0   450    10     0     0     0
   410  0.32222056E+00     0   451    10     0     0     0
   410  0.75326703E-03     0   452    10     0     0     0
   410  0.99673979E-02     0   453    10     0     0     0
   410  0.64961237E+00     0   456     9     0     0     0
   410  0.17292866E-01     0   457     9     0     0     0
   6
   411  0.83115906E-01     0   450    11     0     0     0
   411  0.35287106E+00     0   451    11     0     0     0
   411  0.13660116E-02     0   452    11     0     0     0
   411  0.11293846E-01     0   453    11     0     0     0
   411  0.38358307E+00     0   454    12     0     0     0
   411  0.16777012E+00     0   198   412     0     0     0
   2
   412  0.71616657E-01     0   450    12     0     0     0
   412  0.92838335E+00     0   456    11     0     0     0
   4
   413  0.92585039E+00     0   450     1     0     0     0
   413  0.68974502E-01     0   451     1     0     0     0
   413  0.10335369E-02     0   452     1     0     0     0
   413  0.41415631E-02     0   453     1     0     0     0
   4
   414  0.92591721E+00     0   450     2     0     0     0
   414  0.68951748E-01     0   451     2     0     0     0
   414  0.10278821E-02     0   452     2     0     0     0
   414  0.41031539E-02     0   453     2     0     0     0
   4
   415  0.92585039E+00     0   450     3     0     0     0
   415  0.68974502E-01     0   451     3     0     0     0
   415  0.10335371E-02     0   452     3     0     0     0
   415  0.41415649E-02     0   453     3     0     0     0
   4
   416  0.92591763E+00     0   450     4     0     0     0
   416  0.68951681E-01     0   451     4     0     0     0
   416  0.10278457E-02     0   452     4     0     0     0
   416  0.41028252E-02     0   453     4     0     0     0
   6
   417  0.46175644E+00     0   450     5     0     0     0
   417  0.16933094E+00     0   451     5     0     0     0
   417  0.11661835E-01     0   452     5     0     0     0
   417  0.23399951E-01     0   453     5     0     0     0
   417  0.16096394E+00     0   456     6     0     0     0
   417  0.17288689E+00     0   199   406     0     0     0
   7
   418  0.18848132E+00     0   454     5     0     0     0
   418  0.33042046E+00     0   455     5     0     0     0
   418  0.30444250E+00     0   200   406     0     0     0
   418  0.41353550E-01     0   203   406     0     0     0
   418  0.19185388E-01     0   450     6     0     0     0
   418  0.99144645E-01     0   451     6     0     0     0
   418  0.16972149E-01     0   452     6     0     0     0
   4
   419  0.92585039E+00     0   450     7     0     0     0
   419  0.68974502E-01     0   451     7     0     0     0
   419  0.10335369E-02     0   452     7     0     0     0
   419  0.41415631E-02     0   453     7     0     0     0
   4
   420  0.92591721E+00     0   450     8     0     0     0
   420  0.68951748E-01     0   451     8     0     0     0
   420  0.10278821E-02     0   452     8     0     0     0
   420  0.41031539E-02     0   453     8     0     0     0
   4
   421  0.92585039E+00     0   450     9     0     0     0
   421  0.68974502E-01     0   451     9     0     0     0
   421  0.10335371E-02     0   452     9     0     0     0
   421  0.41415649E-02     0   453     9     0     0     0
   4
   422  0.92591763E+00     0   450    10     0     0     0
   422  0.68951681E-01     0   451    10     0     0     0
   422  0.10278457E-02     0   452    10     0     0     0
   422  0.41028252E-02     0   453    10     0     0     0
   6
   423  0.46175644E+00     0   450    11     0     0     0
   423  0.16933094E+00     0   451    11     0     0     0
   423  0.11661835E-01     0   452    11     0     0     0
   423  0.23399951E-01     0   453    11     0     0     0
   423  0.16096394E+00     0   454    12     0     0     0
   423  0.17288689E+00     0   198   412     0     0     0
   7
   424  0.18848132E+00     0   456    11     0     0     0
   424  0.33042046E+00     0   457    11     0     0     0
   424  0.30444250E+00     0   200   412     0     0     0
   424  0.41353550E-01     0   203   412     0     0     0
   424  0.19185388E-01     0   450    12     0     0     0
   424  0.99144645E-01     0   451    12     0     0     0
   424  0.16972149E-01     0   452    12     0     0     0
   3
   425  0.12976725E+00     0   450   121     0     0     0
   425  0.32658538E+00     0   451   121     0     0     0
   425  0.54364735E+00     0   456   122     0     0     0
   3
   426  0.68577570E+00     0   450   122     0     0     0
   426  0.53350642E-01     0   451   122     0     0     0
   426  0.26087365E+00     0   454   121     0     0     0
   3
   427  0.12976719E+00     0   450   123     0     0     0
   427  0.32658410E+00     0   451   123     0     0     0
   427  0.54364872E+00     0   456   124     0     0     0
   3
   428  0.68577969E+00     0   450   124     0     0     0
   428  0.53350955E-01     0   451   124     0     0     0
   428  0.26086932E+00     0   454   123     0     0     0
   1
   429  0.10000000E+01     0   450   125     0     0     0
   3
   430  0.70721561E+00     0   450   126     0     0     0
   430  0.48924744E-01     0   451   126     0     0     0
   430  0.24385966E+00     0   454   125     0     0     0
   3
   431  0.12976725E+00     0   450   127     0     0     0
   431  0.32658538E+00     0   451   127     0     0     0
   431  0.54364735E+00     0   454   128     0     0     0
   3
   432  0.68577570E+00     0   450   128     0     0     0
   432  0.53350642E-01     0   451   128     0     0     0
   432  0.26087365E+00     0   456   127     0     0     0
   3
   433  0.12976719E+00     0   450   129     0     0     0
   433  0.32658410E+00     0   451   129     0     0     0
   433  0.54364872E+00     0   454   130     0     0     0
   3
   434  0.68577969E+00     0   450   130     0     0     0
   434  0.53350955E-01     0   451   130     0     0     0
   434  0.26086932E+00     0   456   129     0     0     0
   1
   435  0.10000000E+01     0   450   131     0     0     0
   3
   436  0.70721561E+00     0   450   132     0     0     0
   436  0.48924744E-01     0   451   132     0     0     0
   436  0.24385966E+00     0   456   131     0     0     0
   1
   437  0.10000000E+01     0   450   121     0     0     0
   0
   1
   439  0.10000000E+01     0   450   123     0     0     0
   0
   3
   441  0.15350917E+00     0   450   125     0     0     0
   441  0.31726372E+00     0   451   125     0     0     0
   441  0.52922708E+00     0   456   126     0     0     0
   0
   1
   443  0.10000000E+01     0   450   127     0     0     0
   0
   1
   445  0.10000000E+01     0   450   129     0     0     0
   0
   3
   447  0.15350917E+00     0   450   131     0     0     0
   447  0.31726372E+00     0   451   131     0     0     0
   447  0.52922708E+00     0   454   132     0     0     0
   0
  26
   449  0.82520628E-03     0   454     5    12     0     0
   449  0.82520628E-03     0   456     6    11     0     0
   449  0.97605902E-04     0   450     6    12     0     0
   449  0.23683075E-04     0   451    13     0     0     0
   449  0.54826221E-04     0   452    13     0     0     0
   449  0.52510633E-04     0   453    13     0     0     0
   449  0.34240324E-01     0   408     2     0     0     0
   449  0.34240324E-01     0   402     8     0     0     0
   449  0.22146877E-01     0   407     1     0     0     0
   449  0.22146877E-01     0   401     7     0     0     0
   449  0.57459805E-01     0   420     2     0     0     0
   449  0.57459805E-01     0   414     8     0     0     0
   449  0.55870064E-01     0   419     1     0     0     0
   449  0.55870064E-01     0   413     7     0     0     0
   449  0.22146242E-01     0   409     3     0     0     0
   449  0.22146242E-01     0   403     9     0     0     0
   449  0.55869460E-01     0   421     3     0     0     0
   449  0.55869460E-01     0   415     9     0     0     0
   449  0.34209855E-01     0   410     4     0     0     0
   449  0.34209855E-01     0   404    10     0     0     0
   449  0.57429142E-01     0   422     4     0     0     0
   449  0.57429142E-01     0   416    10     0     0     0
   449  0.10089898E+00     0   411     5     0     0     0
   449  0.10089898E+00     0   405    11     0     0     0
   449  0.58789726E-01     0   423     5     0     0     0
   449  0.58789726E-01     0   417    11     0     0     0
   0
  17
   451  0.46812725E-04     0   450     2     8     0     0
   451  0.88071858E-04     0   450     1     7     0     0
   451  0.88071851E-04     0   450     3     9     0     0
   451  0.46812642E-04     0   450     4    10     0     0
   451  0.90769085E-04     0   450     5    11     0     0
   451  0.20335887E-03     0   450   121   127     0     0
   451  0.20335839E-03     0   450   123   129     0     0
   451  0.21892205E-03     0   450   125   131     0     0
   451  0.16433004E-02     0   450   122   128     0     0
   451  0.16433004E-02     0   450   124   130     0     0
   451  0.17794386E-02     0   450   126   132     0     0
   451  0.15748847E+00     0   437   127     0     0     0
   451  0.15748847E+00     0   443   121     0     0     0
   451  0.15747648E+00     0   439   129     0     0     0
   451  0.15747648E+00     0   445   123     0     0     0
   451  0.18200892E+00     0   429   131     0     0     0
   451  0.18200892E+00     0   435   125     0     0     0
  24
   452  0.30466077E+00     0   454   199     0     0     0
   452  0.30466077E+00     0   456   198     0     0     0
   452  0.17313951E+00     0   450   200     0     0     0
   452  0.16380763E+00     0   451   200     0     0     0
   452  0.15042473E-01     0   450   203     0     0     0
   452  0.66028740E-02     0   451   203     0     0     0
   452  0.58386143E-03     0   425   127     0     0     0
   452  0.58386143E-03     0   431   121     0     0     0
   452  0.58386108E-03     0   427   129     0     0     0
   452  0.58386108E-03     0   433   123     0     0     0
   452  0.11220690E-02     0   437   127     0     0     0
   452  0.11220690E-02     0   443   121     0     0     0
   452  0.11220684E-02     0   439   129     0     0     0
   452  0.11220684E-02     0   445   123     0     0     0
   452  0.13048149E-02     0   429   131     0     0     0
   452  0.13048149E-02     0   435   125     0     0     0
   452  0.14006225E-02     0   441   131     0     0     0
   452  0.14006225E-02     0   447   125     0     0     0
   452  0.32993820E-02     0   426   128     0     0     0
   452  0.32993818E-02     0   432   122     0     0     0
   452  0.32993820E-02     0   428   130     0     0     0
   452  0.32993818E-02     0   434   124     0     0     0
   452  0.33269348E-02     0   430   132     0     0     0
   452  0.33269348E-02     0   436   126     0     0     0
  25
   453  0.24506928E+00     0   454   199     0     0     0
   453  0.24506928E+00     0   456   198     0     0     0
   453  0.12971439E-01     0   450   200     0     0     0
   453  0.72933673E-02     0   451   200     0     0     0
   453  0.10446069E-04     0   451     5    11     0     0
   453  0.74566692E-01     0   450   203     0     0     0
   453  0.80787614E-01     0   451   203     0     0     0
   453  0.13164414E-01     0   425   127     0     0     0
   453  0.13164414E-01     0   431   121     0     0     0
   453  0.13164409E-01     0   427   129     0     0     0
   453  0.13164409E-01     0   433   123     0     0     0
   453  0.53934949E-02     0   437   127     0     0     0
   453  0.53934949E-02     0   443   121     0     0     0
   453  0.53934935E-02     0   439   129     0     0     0
   453  0.53934935E-02     0   445   123     0     0     0
   453  0.48647155E-02     0   429   131     0     0     0
   453  0.48647155E-02     0   435   125     0     0     0
   453  0.14057122E-01     0   441   131     0     0     0
   453  0.14057122E-01     0   447   125     0     0     0
   453  0.36949661E-01     0   426   128     0     0     0
   453  0.36949664E-01     0   432   122     0     0     0
   453  0.36949661E-01     0   428   130     0     0     0
   453  0.36949664E-01     0   434   124     0     0     0
   453  0.37178960E-01     0   430   132     0     0     0
   453  0.37178960E-01     0   436   126     0     0     0
   6
   454  0.69945499E-01     0   450     2     7     0     0
   454  0.69945492E-01     0   450     4     9     0     0
   454  0.66249706E-01     0   450   127   122     0     0
   454  0.66249706E-01     0   450   129   124     0     0
   454  0.69052711E-01     0   450   131   126     0     0
   454  0.65855688E+00     0   435   126     0     0     0
  14
   455  0.14957199E-01     0   450   198     0     0     0
   455  0.29796067E+00     0   451   198     0     0     0
   455  0.42458545E-01     0   406    11     0     0     0
   455  0.33176232E-01     0   426   127     0     0     0
   455  0.33176232E-01     0   428   129     0     0     0
   455  0.33891071E-01     0   430   131     0     0     0
   455  0.63355394E-01     0   431   122     0     0     0
   455  0.63355364E-01     0   433   124     0     0     0
   455  0.32079846E-03     0   435   126     0     0     0
   455  0.63726433E-01     0   447   126     0     0     0
   455  0.22087450E+00     0   454   200     0     0     0
   455  0.12062558E-04     0   454     2     8     0     0
   455  0.12062553E-04     0   454     4    10     0     0
   455  0.13272341E+00     0   454   203     0     0     0
   6
   456  0.69945499E-01     0   450     8     1     0     0
   456  0.69945492E-01     0   450    10     3     0     0
   456  0.66249706E-01     0   450   121   128     0     0
   456  0.66249706E-01     0   450   123   130     0     0
   456  0.69052711E-01     0   450   125   132     0     0
   456  0.65855688E+00     0   429   132     0     0     0
  14
   457  0.14957199E-01     0   450   199     0     0     0
   457  0.29796067E+00     0   451   199     0     0     0
   457  0.42458545E-01     0   412     5     0     0     0
   457  0.33176232E-01     0   432   121     0     0     0
   457  0.33176232E-01     0   434   123     0     0     0
   457  0.33891071E-01     0   436   125     0     0     0
   457  0.63355394E-01     0   425   128     0     0     0
   457  0.63355364E-01     0   427   130     0     0     0
   457  0.32079846E-03     0   429   132     0     0     0
   457  0.63726433E-01     0   441   132     0     0     0
   457  0.22087450E+00     0   456   200     0     0     0
   457  0.12062558E-04     0   456     8     2     0     0
   457  0.12062553E-04     0   456    10     4     0     0
   457  0.13272341E+00     0   456   203     0     0     0
  17
   203  0.21705328E-03     0   123   129     0     0     0
   203  0.62032185E-01     0   125   131     0     0     0
   203  0.26155764E-02     0     3     9     0     0     0
   203  0.88323015E+00     0     5    11     0     0     0
   203  0.29629657E-01     0     4    10     0     0     0
   203  0.89093862E-03     0    59    59     0     0     0
   203  0.20904439E-01     0    13    13     0     0     0
   203  0.26669572E-04     0   198   121   128     0     0
   203  0.26669572E-04     0   198   123   130     0     0
   203  0.26669572E-04     0   198   125   132     0     0
   203  0.80008715E-04     0   198     8     1     0     0
   203  0.80008715E-04     0   198    10     3     0     0
   203  0.26669572E-04     0   199   127   122     0     0
   203  0.26669572E-04     0   199   129   124     0     0
   203  0.26669572E-04     0   199   131   126     0     0
   203  0.80008715E-04     0   199     2     7     0     0
   203  0.80008715E-04     0   199     4     9     0     0
  25
   204  0.46616427E-04     0   123   129     0     0     0
   204  0.13349223E-01     0   125   131     0     0     0
   204  0.55237027E-03     0     3     9     0     0     0
   204  0.94449766E-01     0     5    11     0     0     0
   204  0.11934497E-03     0     4    10     0     0     0
   204  0.19343790E-04     0    59    59     0     0     0
   204  0.26928787E-02     0    13    13     0     0     0
   204  0.41681148E-01     0   198   199     0     0     0
   204  0.19311942E-01     0   200   200     0     0     0
   204  0.70941411E-01     0   450   450     0     0     0
   204  0.13167143E+00     0   450   451     0     0     0
   204  0.50954290E-01     0   451   451     0     0     0
   204  0.25520217E+00     0   454   456     0     0     0
   204  0.13094722E+00     0   203   203     0     0     0
   204  0.84632197E-02     0   425   431     0     0     0
   204  0.11276607E-01     0   437   443     0     0     0
   204  0.84628277E-02     0   427   433     0     0     0
   204  0.11276016E-01     0   439   445     0     0     0
   204  0.11331758E-01     0   429   435     0     0     0
   204  0.82629137E-02     0   441   447     0     0     0
   204  0.14222595E-04     0   429   447     0     0     0
   204  0.14222595E-04     0   441   435     0     0     0
   204  0.42819429E-01     0   426   432     0     0     0
   204  0.42819429E-01     0   428   434     0     0     0
   204  0.43320201E-01     0   430   436     0     0     0
  11
   205  0.21392287E-04     0   123   129     0     0     0
   205  0.61266893E-02     0   125   131     0     0     0
   205  0.25354794E-03     0     3     9     0     0     0
   205  0.43375969E-01     0     5    11     0     0     0
   205  0.40404630E-04     0     4    10     0     0     0
   205  0.64955029E-03     0    13    13     0     0     0
   205  0.82379758E-01     0   450   450     0     0     0
   205  0.20049965E+00     0   450   451     0     0     0
   205  0.11957283E+00     0   451   451     0     0     0
   205  0.53328151E+00     0   454   456     0     0     0
   205  0.13798701E-01     0   203   200     0     0     0
  11
   206  0.16632237E-04     0   124   129     0     0     0
   206  0.47634467E-02     0   126   131     0     0     0
   206  0.20763838E-03     0     4     9     0     0     0
   206  0.78239220E+00     0     6    11     0     0     0
   206  0.14685021E+00     0   454   450     0     0     0
   206  0.12719307E-01     0   454   451     0     0     0
   206  0.12967806E-01     0   203   198     0     0     0
   206  0.13299288E-01     0   431   426     0     0     0
   206  0.13299057E-01     0   433   428     0     0     0
   206  0.57359022E-03     0   435   430     0     0     0
   206  0.12910796E-01     0   447   430     0     0     0
  11
   207  0.16632237E-04     0   130   123     0     0     0
   207  0.47634467E-02     0   132   125     0     0     0
   207  0.20763838E-03     0    10     3     0     0     0
   207  0.78239220E+00     0    12     5     0     0     0
   207  0.14685021E+00     0   456   450     0     0     0
   207  0.12719307E-01     0   456   451     0     0     0
   207  0.12967806E-01     0   203   199     0     0     0
   207  0.13299288E-01     0   425   432     0     0     0
   207  0.13299057E-01     0   427   434     0     0     0
   207  0.57359022E-03     0   429   436     0     0     0
   207  0.12910796E-01     0   441   436     0     0     0
   0
   5
     6  0.33333334E+00   100     2     7     5     0     0
     6  0.33333334E+00   100     4     9     5     0     0
     6  0.11111111E+00   100   122   127     5     0     0
     6  0.11111111E+00   100   124   129     5     0     0
     6  0.11111111E+00   100   126   131     5     0     0
   5
    12  0.33333334E+00   100     8     1    11     0     0
    12  0.33333334E+00   100    10     3    11     0     0
    12  0.11111111E+00   100   128   121    11     0     0
    12  0.11111111E+00   100   130   123    11     0     0
    12  0.11111111E+00   100   132   125    11     0     0
      3.00000000     -0.37074110
      0.94773680     -0.19323394      0.22482991     -0.11792823
     -0.27426636     -0.89900774      0.28432378     -0.18900533
      0.05799757     -0.08705407     -0.69329566     -0.71302116
      0.15234549     -0.38323271     -0.62285864      0.66480869
     -0.94845027      0.31692603     -0.31692603     -0.94845027
     -0.88154709      0.47209606     -0.47209606     -0.88154709
     -0.92535424     -0.26029739     -1.41721022
   -321.79675293   -516.34100342   -112.10099030
    268.26052856
    T
