#  ISAJET SUSY parameters in SUSY Les Houches Accord 2 format
#  Created by ISALHA 2.0 Last revision: C. Balazs 21 Apr 2009
Block SPINFO   # Program information
     1   ISASUGRA from ISAJET          # Spectrum Calculator
     2   7.80   29-OCT-2009 12:50:36   # Version number
Block MODSEL   # Model selection
     1     1   # Minimal supergravity (mSUGRA) model               
Block SMINPUTS   # Standard Model inputs
     1     1.27837395E+02   # alpha_em^(-1)
     2     1.16570000E-05   # G_Fermi
     3     1.17200002E-01   # alpha_s(M_Z)
     4     9.11699982E+01   # m_{Z}(pole)
     5     4.19999981E+00   # m_{b}(m_{b})
     6     1.72500000E+02   # m_{top}(pole)
     7     1.77699995E+00   # m_{tau}(pole)
Block MINPAR   # SUSY breaking input parameters
     1     2.96000000E+03   # m_0
     2     2.10000000E+02   # m_{1/2}
     3     1.00000000E+01   # tan(beta)
     4     1.00000000E+00   # sign(mu)
     5     0.00000000E+00   # A_0
Block EXTPAR   # Non-universal SUSY breaking parameters
     0     2.45009459E+16   # Input scale
Block MASS   # Scalar and gaugino mass spectrum
#  PDG code   mass                 particle
        24     8.04229965E+01   #  W^+
        25     1.16734741E+02   #  h^0            
        35     2.94126050E+03   #  H^0            
        36     2.92197290E+03   #  A^0            
        37     2.94234448E+03   #  H^+            
   1000001     2.96172778E+03   #  dnl            
   1000002     2.96064331E+03   #  upl            
   1000003     2.96172778E+03   #  stl            
   1000004     2.96064355E+03   #  chl            
   1000005     2.41658179E+03   #  b1             
   1000006     1.71236401E+03   #  t1             
   1000011     2.95729224E+03   #  el-            
   1000012     2.95732227E+03   #  nuel           
   1000013     2.95729224E+03   #  mul-           
   1000014     2.95732227E+03   #  numl           
   1000015     2.93093530E+03   #  tau1           
   1000016     2.94385620E+03   #  nutl           
   1000021     6.25587830E+02   #  glss           
   1000022     8.24843979E+01   #  z1ss           
   1000023     1.43200623E+02   #  z2ss           
   1000024     1.43433319E+02   #  w1ss           
   1000025    -2.31409088E+02   #  z3ss           
   1000035     2.73133789E+02   #  z4ss           
   1000037     2.69139069E+02   #  w2ss           
   2000001     2.97279150E+03   #  dnr            
   2000002     2.97094385E+03   #  upr            
   2000003     2.97279150E+03   #  str            
   2000004     2.97094385E+03   #  chr            
   2000005     2.94462500E+03   #  b2             
   2000006     2.42633130E+03   #  t2             
   2000011     2.95800830E+03   #  er-            
   2000013     2.95800830E+03   #  mur-           
   2000015     2.94330176E+03   #  tau2           
Block ALPHA   # Effective Higgs mixing parameter
         -9.99193490E-02   # alpha
Block STOPMIX   # stop mixing matrix
  1  1     1.53024942E-02   # O_{11}
  1  2     9.99882936E-01   # O_{12}
  2  1    -9.99882936E-01   # O_{21}
  2  2     1.53024942E-02   # O_{22}
Block SBOTMIX   # sbottom mixing matrix
  1  1     9.99990463E-01   # O_{11}
  1  2     4.37149638E-03   # O_{12}
  2  1    -4.37149638E-03   # O_{21}
  2  2     9.99990463E-01   # O_{22}
Block STAUMIX   # stau mixing matrix
  1  1     1.20427690E-01   # O_{11}
  1  2     9.92722094E-01   # O_{12}
  2  1    -9.92722094E-01   # O_{21}
  2  2     1.20427690E-01   # O_{22}
Block NMIX   # neutralino mixing matrix
  1  1     9.45180237E-01   #
  1  2    -1.32120579E-01   #
  1  3     2.71344632E-01   #
  1  4    -1.24702856E-01   #
  2  1    -2.74127662E-01   #
  2  2    -8.09248865E-01   #
  2  3     4.20712829E-01   #
  2  4    -3.04911554E-01   #
  3  1    -8.58694911E-02   #
  3  2     1.15118824E-01   #
  3  3     6.83897734E-01   #
  3  4     7.15302765E-01   #
  4  1    -1.55290201E-01   #
  4  2     5.60720980E-01   #
  4  3     5.30713499E-01   #
  4  4    -6.16295516E-01   #
Block UMIX   # chargino U mixing matrix
  1  1    -7.65650570E-01   # U_{11}
  1  2     6.43256724E-01   # U_{12}
  2  1    -6.43256724E-01   # U_{21}
  2  2    -7.65650570E-01   # U_{22}
Block VMIX   # chargino V mixing matrix
  1  1    -8.89381230E-01   # V_{11}
  1  2     4.57166344E-01   # V_{12}
  2  1    -4.57166344E-01   # V_{21}
  2  2    -8.89381230E-01   # V_{22}
Block GAUGE Q=  2.03452368E+03   #
     1     3.57520401E-01   # g`
     2     6.52393997E-01   # g_2
     3     1.21947932E+00   # g_3
Block YU Q=  2.03452368E+03   #
  3  3     8.50718558E-01   # y_t
Block YD Q=  2.03452368E+03   #
  3  3     1.30611464E-01   # y_b
Block YE Q=  2.03452368E+03   #
  3  3     1.02015927E-01   # y_tau
Block HMIX Q=  2.03452368E+03   # Higgs mixing parameters
     1     2.18799561E+02   # mu(Q)
     2     1.00000000E+01   # tan(beta)(M_GUT)
     3     2.51741180E+02   # Higgs vev at Q
     4     8.53792600E+06   # m_A^2(Q)
Block MSOFT Q=  2.03452368E+03   # DRbar SUSY breaking parameters
     1     8.95359116E+01   # M_1(Q)          
     2     1.65094559E+02   # M_2(Q)          
     3     5.02450226E+02   # M_3(Q)          
    31     2.94748901E+03   # MeL(Q)          
    32     2.94748901E+03   # MmuL(Q)         
    33     2.93437183E+03   # MtauL(Q)        
    34     2.95481982E+03   # MeR(Q)          
    35     2.95481982E+03   # MmuR(Q)         
    36     2.92863916E+03   # MtauR(Q)        
    41     2.91935156E+03   # MqL1(Q)         
    42     2.91935156E+03   # MqL2(Q)         
    43     2.38759668E+03   # MqL3(Q)         
    44     2.92926440E+03   # MuR(Q)          
    45     2.92926440E+03   # McR(Q)          
    46     1.73366235E+03   # MtR(Q)          
    47     2.93076782E+03   # MdR(Q)          
    48     2.93076782E+03   # MsR(Q)          
    49     2.90710449E+03   # MbR(Q)          
Block AU Q=  2.03452368E+03   #
  1  1    -3.49366364E+02   # A_u
  2  2    -3.49366364E+02   # A_c
  3  3    -3.49366364E+02   # A_t
Block AD Q=  2.03452368E+03   #
  1  1    -5.14807434E+02   # A_d
  2  2    -5.14807434E+02   # A_s
  3  3    -5.14807434E+02   # A_b
Block AE Q=  2.03452368E+03   #
  1  1    -1.23146759E+02   # A_e
  2  2    -1.23146759E+02   # A_mu
  3  3    -1.23146759E+02   # A_tau
#  ISAJET decay tables in SUSY Les Houches accord format
#  Created by ISALHD. Last revision: C. Balazs, 2005 May 25
Block DCINFO                           # Program information
     1   ISASUGRA from ISAJET          # Spectrum Calculator
     2   7.80   29-OCT-2009 12:50:36   # Version number
#         PDG         Width
DECAY         6  1.14680779E+00   # TP    decays
#          BR          NDA       ID1       ID2       ID3       ID4
      3.33333343E-01    3            2        -1         5             # TP     -->  UP     DB     BT          
      3.33333343E-01    3            4        -3         5             # TP     -->  CH     SB     BT          
      1.11111112E-01    3          -11        12         5             # TP     -->  E+     NUE    BT          
      1.11111112E-01    3          -13        14         5             # TP     -->  MU+    NUM    BT          
      1.11111112E-01    3          -15        16         5             # TP     -->  TAU+   NUT    BT          
#         PDG         Width
DECAY   1000021  9.07562717E-05   # GLSS  decays
#          BR          NDA       ID1       ID2       ID3       ID4
      4.73447554E-02    3      1000024         1        -2             # GLSS   -->  W1SS+  DN     UB          
      4.73447554E-02    3     -1000024         2        -1             # GLSS   -->  W1SS-  UP     DB          
      4.73447479E-02    3      1000024         3        -4             # GLSS   -->  W1SS+  ST     CB          
      4.73447479E-02    3     -1000024         4        -3             # GLSS   -->  W1SS-  CH     SB          
      5.21948561E-02    3      1000024         5        -6             # GLSS   -->  W1SS+  BT     TB          
      5.21948561E-02    3     -1000024         6        -5             # GLSS   -->  W1SS-  TP     BB          
      8.93936213E-03    3      1000037         1        -2             # GLSS   -->  W2SS+  DN     UB          
      8.93936213E-03    3     -1000037         2        -1             # GLSS   -->  W2SS-  UP     DB          
      8.93936120E-03    3      1000037         3        -4             # GLSS   -->  W2SS+  ST     CB          
      8.93936120E-03    3     -1000037         4        -3             # GLSS   -->  W2SS-  CH     SB          
      9.88829434E-02    3      1000037         5        -6             # GLSS   -->  W2SS+  BT     TB          
      9.88829434E-02    3     -1000037         6        -5             # GLSS   -->  W2SS-  TP     BB          
      2.55396124E-03    2      1000022        21                       # GLSS   -->  Z1SS   GL                 
      1.94814373E-02    3      1000022         2        -2             # GLSS   -->  Z1SS   UP     UB          
      8.65978841E-03    3      1000022         1        -1             # GLSS   -->  Z1SS   DN     DB          
      8.65978841E-03    3      1000022         3        -3             # GLSS   -->  Z1SS   ST     SB          
      1.94814373E-02    3      1000022         4        -4             # GLSS   -->  Z1SS   CH     CB          
      1.45083796E-02    3      1000022         5        -5             # GLSS   -->  Z1SS   BT     BB          
      2.53610406E-02    3      1000022         6        -6             # GLSS   -->  Z1SS   TP     TB          
      2.36185733E-02    2      1000023        21                       # GLSS   -->  Z2SS   GL                 
      2.68771704E-02    3      1000023         2        -2             # GLSS   -->  Z2SS   UP     UB          
      2.02036090E-02    3      1000023         1        -1             # GLSS   -->  Z2SS   DN     DB          
      2.02036090E-02    3      1000023         3        -3             # GLSS   -->  Z2SS   ST     SB          
      2.68771667E-02    3      1000023         4        -4             # GLSS   -->  Z2SS   CH     CB          
      4.73530553E-02    3      1000023         5        -5             # GLSS   -->  Z2SS   BT     BB          
      2.03914996E-02    3      1000023         6        -6             # GLSS   -->  Z2SS   TP     TB          
      9.15142819E-02    2      1000025        21                       # GLSS   -->  Z3SS   GL                 
      1.19117743E-04    3      1000025         2        -2             # GLSS   -->  Z3SS   UP     UB          
      1.56180395E-04    3      1000025         1        -1             # GLSS   -->  Z3SS   DN     DB          
      1.56180395E-04    3      1000025         3        -3             # GLSS   -->  Z3SS   ST     SB          
      1.19117700E-04    3      1000025         4        -4             # GLSS   -->  Z3SS   CH     CB          
      3.16190184E-03    3      1000025         5        -5             # GLSS   -->  Z3SS   BT     BB          
      4.58003208E-03    3      1000025         6        -6             # GLSS   -->  Z3SS   TP     TB          
      5.71189709E-02    2      1000035        21                       # GLSS   -->  Z4SS   GL                 
      4.16095275E-03    3      1000035         2        -2             # GLSS   -->  Z4SS   UP     UB          
      4.91571100E-03    3      1000035         1        -1             # GLSS   -->  Z4SS   DN     DB          
      4.91571100E-03    3      1000035         3        -3             # GLSS   -->  Z4SS   ST     SB          
      4.16095136E-03    3      1000035         4        -4             # GLSS   -->  Z4SS   CH     CB          
      1.27809476E-02    3      1000035         5        -5             # GLSS   -->  Z4SS   BT     BB          
      6.17510581E-04    3      1000035         6        -6             # GLSS   -->  Z4SS   TP     TB          
#         PDG         Width
DECAY   1000002  1.86822006E+02   # UPL   decays
#          BR          NDA       ID1       ID2       ID3       ID4
      1.12195426E-04    2      1000022         2                       # UPL    -->  Z1SS   UP                 
      4.90453877E-02    2      1000023         2                       # UPL    -->  Z2SS   UP                 
      6.50887727E-04    2      1000025         2                       # UPL    -->  Z3SS   UP                 
      1.85785200E-02    2      1000035         2                       # UPL    -->  Z4SS   UP                 
      7.99153149E-01    2      1000021         2                       # UPL    -->  GLSS   UP                 
      1.05035253E-01    2      1000024         1                       # UPL    -->  W1SS+  DN                 
      2.74246391E-02    2      1000037         1                       # UPL    -->  W2SS+  DN                 
#         PDG         Width
DECAY   1000001  1.86828873E+02   # DNL   decays
#          BR          NDA       ID1       ID2       ID3       ID4
      6.20937627E-03    2      1000022         1                       # DNL    -->  Z1SS   DN                 
      3.82643640E-02    2      1000023         1                       # DNL    -->  Z2SS   DN                 
      1.12861709E-03    2      1000025         1                       # DNL    -->  Z3SS   DN                 
      2.27707643E-02    2      1000035         1                       # DNL    -->  Z4SS   DN                 
      7.99444079E-01    2      1000021         1                       # DNL    -->  GLSS   DN                 
      7.78690502E-02    2     -1000024         2                       # DNL    -->  W1SS-  UP                 
      5.43137155E-02    2     -1000037         2                       # DNL    -->  W2SS-  UP                 
#         PDG         Width
DECAY   1000003  1.86828873E+02   # STL   decays
#          BR          NDA       ID1       ID2       ID3       ID4
      6.20937627E-03    2      1000022         3                       # STL    -->  Z1SS   ST                 
      3.82643640E-02    2      1000023         3                       # STL    -->  Z2SS   ST                 
      1.12861709E-03    2      1000025         3                       # STL    -->  Z3SS   ST                 
      2.27707643E-02    2      1000035         3                       # STL    -->  Z4SS   ST                 
      7.99444079E-01    2      1000021         3                       # STL    -->  GLSS   ST                 
      7.78690204E-02    2     -1000024         4                       # STL    -->  W1SS-  CH                 
      5.43136969E-02    2     -1000037         4                       # STL    -->  W2SS-  CH                 
#         PDG         Width
DECAY   1000004  1.86821930E+02   # CHL   decays
#          BR          NDA       ID1       ID2       ID3       ID4
      1.12195441E-04    2      1000022         4                       # CHL    -->  Z1SS   CH                 
      4.90453877E-02    2      1000023         4                       # CHL    -->  Z2SS   CH                 
      6.50887843E-04    2      1000025         4                       # CHL    -->  Z3SS   CH                 
      1.85785256E-02    2      1000035         4                       # CHL    -->  Z4SS   CH                 
      7.99153149E-01    2      1000021         4                       # CHL    -->  GLSS   CH                 
      1.05035305E-01    2      1000024         3                       # CHL    -->  W1SS+  ST                 
      2.74246559E-02    2      1000037         3                       # CHL    -->  W2SS+  ST                 
#         PDG         Width
DECAY   1000005  1.82425537E+02   # BT1   decays
#          BR          NDA       ID1       ID2       ID3       ID4
      5.55531494E-03    2      1000022         5                       # BT1    -->  Z1SS   BT                 
      3.27632092E-02    2      1000023         5                       # BT1    -->  Z2SS   BT                 
      3.08365235E-03    2      1000025         5                       # BT1    -->  Z3SS   BT                 
      2.01142821E-02    2      1000035         5                       # BT1    -->  Z4SS   BT                 
      6.49276912E-01    2      1000021         5                       # BT1    -->  GLSS   BT                 
      1.01091832E-01    2     -1000024         6                       # BT1    -->  W1SS-  TP                 
      1.86688781E-01    2     -1000037         6                       # BT1    -->  W2SS-  TP                 
      1.42599118E-03    2          -24   1000006                       # BT1    -->  W-     TP1                
#         PDG         Width
DECAY   1000006  1.21798584E+02   # TP1   decays
#          BR          NDA       ID1       ID2       ID3       ID4
      5.99369645E-01    2      1000021         6                       # TP1    -->  GLSS   TP                 
      3.07079088E-02    2      1000022         6                       # TP1    -->  Z1SS   TP                 
      2.06041448E-02    2      1000023         6                       # TP1    -->  Z2SS   TP                 
      9.46770459E-02    2      1000025         6                       # TP1    -->  Z3SS   TP                 
      6.84599802E-02    2      1000035         6                       # TP1    -->  Z4SS   TP                 
      4.18919511E-02    2      1000024         5                       # TP1    -->  W1SS+  BT                 
      1.44289404E-01    2      1000037         5                       # TP1    -->  W2SS+  BT                 
#         PDG         Width
DECAY   2000002  1.56568802E+02   # UPR   decays
#          BR          NDA       ID1       ID2       ID3       ID4
      3.82617675E-02    2      1000022         2                       # UPR    -->  Z1SS   UP                 
      3.20841838E-03    2      1000023         2                       # UPR    -->  Z2SS   UP                 
      3.12462216E-04    2      1000025         2                       # UPR    -->  Z3SS   UP                 
      1.01700006E-03    2      1000035         2                       # UPR    -->  Z4SS   UP                 
      9.57200289E-01    2      1000021         2                       # UPR    -->  GLSS   UP                 
#         PDG         Width
DECAY   2000001  1.51645905E+02   # DNR   decays
#          BR          NDA       ID1       ID2       ID3       ID4
      9.88212787E-03    2      1000022         1                       # DNR    -->  Z1SS   DN                 
      8.28663120E-04    2      1000023         1                       # DNR    -->  Z2SS   DN                 
      8.07028118E-05    2      1000025         1                       # DNR    -->  Z3SS   DN                 
      2.62672576E-04    2      1000035         1                       # DNR    -->  Z4SS   DN                 
      9.88945842E-01    2      1000021         1                       # DNR    -->  GLSS   DN                 
#         PDG         Width
DECAY   2000003  1.51645905E+02   # STR   decays
#          BR          NDA       ID1       ID2       ID3       ID4
      9.88212787E-03    2      1000022         3                       # STR    -->  Z1SS   ST                 
      8.28663120E-04    2      1000023         3                       # STR    -->  Z2SS   ST                 
      8.07028118E-05    2      1000025         3                       # STR    -->  Z3SS   ST                 
      2.62672576E-04    2      1000035         3                       # STR    -->  Z4SS   ST                 
      9.88945842E-01    2      1000021         3                       # STR    -->  GLSS   ST                 
#         PDG         Width
DECAY   2000004  1.56568741E+02   # CHR   decays
#          BR          NDA       ID1       ID2       ID3       ID4
      3.82617712E-02    2      1000022         4                       # CHR    -->  Z1SS   CH                 
      3.20841814E-03    2      1000023         4                       # CHR    -->  Z2SS   CH                 
      3.12462216E-04    2      1000025         4                       # CHR    -->  Z3SS   CH                 
      1.01700006E-03    2      1000035         4                       # CHR    -->  Z4SS   CH                 
      9.57200408E-01    2      1000021         4                       # CHR    -->  GLSS   CH                 
#         PDG         Width
DECAY   2000005  1.52159103E+02   # BT2   decays
#          BR          NDA       ID1       ID2       ID3       ID4
      1.02240117E-02    2      1000022         5                       # BT2    -->  Z1SS   BT                 
      1.97434775E-03    2      1000023         5                       # BT2    -->  Z2SS   BT                 
      3.28104524E-03    2      1000025         5                       # BT2    -->  Z3SS   BT                 
      2.23497744E-03    2      1000035         5                       # BT2    -->  Z4SS   BT                 
      9.75378096E-01    2      1000021         5                       # BT2    -->  GLSS   BT                 
      2.67533888E-03    2     -1000024         6                       # BT2    -->  W1SS-  TP                 
      4.08800971E-03    2     -1000037         6                       # BT2    -->  W2SS-  TP                 
      1.40700934E-07    2          -24   1000006                       # BT2    -->  W-     TP1                
      6.65398475E-05    2          -24   2000006                       # BT2    -->  W-     TP2                
      3.51458075E-05    2           23   1000005                       # BT2    -->  Z0     BT1                
      4.24144673E-05    2           25   1000005                       # BT2    -->  HL0    BT1                
#         PDG         Width
DECAY   2000006  1.81944778E+02   # TP2   decays
#          BR          NDA       ID1       ID2       ID3       ID4
      6.45774186E-01    2      1000021         6                       # TP2    -->  GLSS   TP                 
      8.83360058E-02    2      1000024         5                       # TP2    -->  W1SS+  BT                 
      2.73821298E-02    2      1000037         5                       # TP2    -->  W2SS+  BT                 
      7.47048703E-04    2           23   1000006                       # TP2    -->  Z0     TP1                
      1.49752316E-03    2           25   1000006                       # TP2    -->  HL0    TP1                
      2.68407818E-03    2      1000022         6                       # TP2    -->  Z1SS   TP                 
      5.65281697E-02    2      1000023         6                       # TP2    -->  Z2SS   TP                 
      9.19351429E-02    2      1000025         6                       # TP2    -->  Z3SS   TP                 
      8.51156488E-02    2      1000035         6                       # TP2    -->  Z4SS   TP                 
#         PDG         Width
DECAY   1000011  4.07613297E+01   # EL-   decays
#          BR          NDA       ID1       ID2       ID3       ID4
      4.57546040E-02    2      1000022        11                       # EL-    -->  Z1SS   E-                 
      2.80081719E-01    2      1000023        11                       # EL-    -->  Z2SS   E-                 
      1.39174226E-03    2      1000025        11                       # EL-    -->  Z3SS   E-                 
      6.78392202E-02    2      1000035        11                       # EL-    -->  Z4SS   E-                 
      3.56371969E-01    2     -1000024        12                       # EL-    -->  W1SS-  NUE                
      2.48560756E-01    2     -1000037        12                       # EL-    -->  W2SS-  NUE                
#         PDG         Width
DECAY   1000013  4.07613297E+01   # MUL-  decays
#          BR          NDA       ID1       ID2       ID3       ID4
      4.57546040E-02    2      1000022        13                       # MUL-   -->  Z1SS   MU-                
      2.80081719E-01    2      1000023        13                       # MUL-   -->  Z2SS   MU-                
      1.39174226E-03    2      1000025        13                       # MUL-   -->  Z3SS   MU-                
      6.78392202E-02    2      1000035        13                       # MUL-   -->  Z4SS   MU-                
      3.56371969E-01    2     -1000024        14                       # MUL-   -->  W1SS-  NUM                
      2.48560756E-01    2     -1000037        14                       # MUL-   -->  W2SS-  NUM                
#         PDG         Width
DECAY   1000015  1.65006790E+01   # TAU1- decays
#          BR          NDA       ID1       ID2       ID3       ID4
      8.05764854E-01    2      1000022        15                       # TAU1-  -->  Z1SS   TAU-               
      9.45150778E-02    2      1000023        15                       # TAU1-  -->  Z2SS   TAU-               
      1.98805798E-02    2      1000025        15                       # TAU1-  -->  Z3SS   TAU-               
      2.04995368E-02    2      1000035        15                       # TAU1-  -->  Z4SS   TAU-               
      5.64225279E-02    2     -1000024        16                       # TAU1-  -->  W1SS-  NUT                
      2.91742571E-03    2     -1000037        16                       # TAU1-  -->  W2SS-  NUT                
#         PDG         Width
DECAY   1000012  4.08012314E+01   # NUEL  decays
#          BR          NDA       ID1       ID2       ID3       ID4
      1.29341841E-01    2      1000022        12                       # NUEL   -->  Z1SS   NUE                
      1.31710023E-01    2      1000023        12                       # NUEL   -->  Z2SS   NUE                
      7.93994404E-03    2      1000025        12                       # NUEL   -->  Z3SS   NUE                
      1.25186652E-01    2      1000035        12                       # NUEL   -->  Z4SS   NUE                
      4.80394274E-01    2      1000024        11                       # NUEL   -->  W1SS+  E-                 
      1.25427261E-01    2      1000037        11                       # NUEL   -->  W2SS+  E-                 
#         PDG         Width
DECAY   1000014  4.08012314E+01   # NUML  decays
#          BR          NDA       ID1       ID2       ID3       ID4
      1.29341841E-01    2      1000022        14                       # NUML   -->  Z1SS   NUM                
      1.31710023E-01    2      1000023        14                       # NUML   -->  Z2SS   NUM                
      7.93994404E-03    2      1000025        14                       # NUML   -->  Z3SS   NUM                
      1.25186652E-01    2      1000035        14                       # NUML   -->  Z4SS   NUM                
      4.80394274E-01    2      1000024        13                       # NUML   -->  W1SS+  MU-                
      1.25427261E-01    2      1000037        13                       # NUML   -->  W2SS+  MU-                
#         PDG         Width
DECAY   1000016  4.12438278E+01   # NUTL  decays
#          BR          NDA       ID1       ID2       ID3       ID4
      1.27369389E-01    2      1000022        16                       # NUTL   -->  Z1SS   NUT                
      1.29697710E-01    2      1000023        16                       # NUTL   -->  Z2SS   NUT                
      7.81808887E-03    2      1000025        16                       # NUTL   -->  Z3SS   NUT                
      1.23259895E-01    2      1000035        16                       # NUTL   -->  Z4SS   NUT                
      4.79424328E-01    2      1000024        15                       # NUTL   -->  W1SS+  TAU-               
      1.32430613E-01    2      1000037        15                       # NUTL   -->  W2SS+  TAU-               
      3.77774617E-11    3      1000015        16       -15             # NUTL   -->  TAU1-  NUT    TAU+        
      3.77774617E-11    3      1000015        12       -11             # NUTL   -->  TAU1-  NUE    E+          
      3.77774617E-11    3      1000015        14       -13             # NUTL   -->  TAU1-  NUM    MU+         
      1.13332385E-10    3      1000015         2        -1             # NUTL   -->  TAU1-  UP     DB          
      1.13332385E-10    3      1000015         4        -3             # NUTL   -->  TAU1-  CH     SB          
#         PDG         Width
DECAY   2000011  1.50115080E+01   # ER-   decays
#          BR          NDA       ID1       ID2       ID3       ID4
      8.93979251E-01    2      1000022        11                       # ER-    -->  Z1SS   E-                 
      7.49620646E-02    2      1000023        11                       # ER-    -->  Z2SS   E-                 
      7.29994150E-03    2      1000025        11                       # ER-    -->  Z3SS   E-                 
      2.37588007E-02    2      1000035        11                       # ER-    -->  Z4SS   E-                 
#         PDG         Width
DECAY   2000013  1.50115080E+01   # MUR-  decays
#          BR          NDA       ID1       ID2       ID3       ID4
      8.93979251E-01    2      1000022        13                       # MUR-   -->  Z1SS   MU-                
      7.49620646E-02    2      1000023        13                       # MUR-   -->  Z2SS   MU-                
      7.29994150E-03    2      1000025        13                       # MUR-   -->  Z3SS   MU-                
      2.37588007E-02    2      1000035        13                       # MUR-   -->  Z4SS   MU-                
#         PDG         Width
DECAY   2000015  4.08243904E+01   # TAU2- decays
#          BR          NDA       ID1       ID2       ID3       ID4
      4.77925725E-02    2      1000022        15                       # TAU2-  -->  Z1SS   TAU-               
      2.72883028E-01    2      1000023        15                       # TAU2-  -->  Z2SS   TAU-               
      1.04317712E-02    2      1000025        15                       # TAU2-  -->  Z3SS   TAU-               
      7.64369443E-02    2      1000035        15                       # TAU2-  -->  Z4SS   TAU-               
      3.37660700E-01    2     -1000024        16                       # TAU2-  -->  W1SS-  NUT                
      2.54794985E-01    2     -1000037        16                       # TAU2-  -->  W2SS-  NUT                
#         PDG         Width
DECAY   1000023  1.21640269E-05   # Z2SS  decays
#          BR          NDA       ID1       ID2       ID3       ID4
      3.43414163E-03    2      1000022        22                       # Z2SS   -->  Z1SS   GM                 
      1.18564434E-01    3      1000022         2        -2             # Z2SS   -->  Z1SS   UP     UB          
      1.53201580E-01    3      1000022         1        -1             # Z2SS   -->  Z1SS   DN     DB          
      1.53201580E-01    3      1000022         3        -3             # Z2SS   -->  Z1SS   ST     SB          
      1.18564434E-01    3      1000022         4        -4             # Z2SS   -->  Z1SS   CH     CB          
      1.45017207E-01    3      1000022         5        -5             # Z2SS   -->  Z1SS   BT     BB          
      3.42795439E-02    3      1000022        11       -11             # Z2SS   -->  Z1SS   E-     E+          
      3.42795439E-02    3      1000022        13       -13             # Z2SS   -->  Z1SS   MU-    MU+         
      3.40774506E-02    3      1000022        15       -15             # Z2SS   -->  Z1SS   TAU-   TAU+        
      6.84613660E-02    3      1000022        12       -12             # Z2SS   -->  Z1SS   NUE    ANUE        
      6.84613660E-02    3      1000022        14       -14             # Z2SS   -->  Z1SS   NUM    ANUM        
      6.84574321E-02    3      1000022        16       -16             # Z2SS   -->  Z1SS   NUT    ANUT        
#         PDG         Width
DECAY   1000025  1.88268661E-01   # Z3SS  decays
#          BR          NDA       ID1       ID2       ID3       ID4
      1.82832963E-07    2      1000022        22                       # Z3SS   -->  Z1SS   GM                 
      3.55111297E-06    2      1000023        22                       # Z3SS   -->  Z2SS   GM                 
      1.71919227E-01    2      1000024       -24                       # Z3SS   -->  W1SS+  W-                 
      1.71919227E-01    2     -1000024        24                       # Z3SS   -->  W1SS-  W+                 
      6.02585018E-01    2      1000022        23                       # Z3SS   -->  Z1SS   Z0                 
      2.95428647E-11    3      1000022         2        -2             # Z3SS   -->  Z1SS   UP     UB          
      2.67298631E-11    3      1000022         1        -1             # Z3SS   -->  Z1SS   DN     DB          
      2.67298631E-11    3      1000022         3        -3             # Z3SS   -->  Z1SS   ST     SB          
      2.95428647E-11    3      1000022         4        -4             # Z3SS   -->  Z1SS   CH     CB          
      8.72560302E-10    3      1000022         5        -5             # Z3SS   -->  Z1SS   BT     BB          
      5.39109452E-11    3      1000022        11       -11             # Z3SS   -->  Z1SS   E-     E+          
      5.39109452E-11    3      1000022        13       -13             # Z3SS   -->  Z1SS   MU-    MU+         
      5.30664679E-10    3      1000022        15       -15             # Z3SS   -->  Z1SS   TAU-   TAU+        
      5.85434340E-11    3      1000022        12       -12             # Z3SS   -->  Z1SS   NUE    ANUE        
      5.85434340E-11    3      1000022        14       -14             # Z3SS   -->  Z1SS   NUM    ANUM        
      5.96256655E-11    3      1000022        16       -16             # Z3SS   -->  Z1SS   NUT    ANUT        
      1.48513110E-03    3      1000023         2        -2             # Z3SS   -->  Z2SS   UP     UB          
      1.91448152E-03    3      1000023         1        -1             # Z3SS   -->  Z2SS   DN     DB          
      1.91448152E-03    3      1000023         3        -3             # Z3SS   -->  Z2SS   ST     SB          
      1.48513110E-03    3      1000023         4        -4             # Z3SS   -->  Z2SS   CH     CB          
      1.92538614E-03    3      1000023         5        -5             # Z3SS   -->  Z2SS   BT     BB          
      4.34344780E-04    3      1000023        11       -11             # Z3SS   -->  Z2SS   E-     E+          
      4.34344780E-04    3      1000023        13       -13             # Z3SS   -->  Z2SS   MU-    MU+         
      4.34410496E-04    3      1000023        15       -15             # Z3SS   -->  Z2SS   TAU-   TAU+        
      8.64405825E-04    3      1000023        12       -12             # Z3SS   -->  Z2SS   NUE    ANUE        
      8.64405825E-04    3      1000023        14       -14             # Z3SS   -->  Z2SS   NUM    ANUM        
      8.64407164E-04    3      1000023        16       -16             # Z3SS   -->  Z2SS   NUT    ANUT        
      4.09517363E-02    2      1000022        25                       # Z3SS   -->  Z1SS   HL0                
#         PDG         Width
DECAY   1000035  8.06258976E-01   # Z4SS  decays
#          BR          NDA       ID1       ID2       ID3       ID4
      1.64019283E-07    2      1000022        22                       # Z4SS   -->  Z1SS   GM                 
      1.11433246E-06    2      1000023        22                       # Z4SS   -->  Z2SS   GM                 
      2.47823920E-07    2      1000025        22                       # Z4SS   -->  Z3SS   GM                 
      4.28779632E-01    2      1000024       -24                       # Z4SS   -->  W1SS+  W-                 
      4.28779632E-01    2     -1000024        24                       # Z4SS   -->  W1SS-  W+                 
      8.87958373E-10    3     -1000037         2        -1             # Z4SS   -->  W2SS-  UP     DB          
      2.95986124E-10    3     -1000037        12       -11             # Z4SS   -->  W2SS-  NUE    E+          
      2.95986124E-10    3     -1000037        14       -13             # Z4SS   -->  W2SS-  NUM    MU+         
      8.87958373E-10    3      1000037         1        -2             # Z4SS   -->  W2SS+  DN     UB          
      2.95986124E-10    3      1000037        11       -12             # Z4SS   -->  W2SS+  E-     ANUE        
      2.95986124E-10    3      1000037        13       -14             # Z4SS   -->  W2SS+  MU-    ANUM        
      8.87958373E-10    3     -1000037         4        -3             # Z4SS   -->  W2SS-  CH     SB          
      2.95986124E-10    3     -1000037        16       -15             # Z4SS   -->  W2SS-  NUT    TAU+        
      8.87958373E-10    3      1000037         3        -4             # Z4SS   -->  W2SS+  ST     CB          
      2.95986124E-10    3      1000037        15       -16             # Z4SS   -->  W2SS+  TAU-   ANUT        
      3.25982533E-02    2      1000022        23                       # Z4SS   -->  Z1SS   Z0                 
      5.21854591E-03    2      1000023        23                       # Z4SS   -->  Z2SS   Z0                 
      1.62573219E-10    3      1000022         2        -2             # Z4SS   -->  Z1SS   UP     UB          
      8.04572575E-10    3      1000022         1        -1             # Z4SS   -->  Z1SS   DN     DB          
      8.04572575E-10    3      1000022         3        -3             # Z4SS   -->  Z1SS   ST     SB          
      1.62573219E-10    3      1000022         4        -4             # Z4SS   -->  Z1SS   CH     CB          
      1.80268744E-09    3      1000022         5        -5             # Z4SS   -->  Z1SS   BT     BB          
      5.38514566E-10    3      1000022        11       -11             # Z4SS   -->  Z1SS   E-     E+          
      5.38514566E-10    3      1000022        13       -13             # Z4SS   -->  Z1SS   MU-    MU+         
      6.80008827E-10    3      1000022        15       -15             # Z4SS   -->  Z1SS   TAU-   TAU+        
      1.46076973E-09    3      1000022        12       -12             # Z4SS   -->  Z1SS   NUE    ANUE        
      1.46076973E-09    3      1000022        14       -14             # Z4SS   -->  Z1SS   NUM    ANUM        
      1.48778978E-09    3      1000022        16       -16             # Z4SS   -->  Z1SS   NUT    ANUT        
      1.41448875E-09    3      1000023         2        -2             # Z4SS   -->  Z2SS   UP     UB          
      1.34657796E-09    3      1000023         1        -1             # Z4SS   -->  Z2SS   DN     DB          
      1.34657796E-09    3      1000023         3        -3             # Z4SS   -->  Z2SS   ST     SB          
      1.41448842E-09    3      1000023         4        -4             # Z4SS   -->  Z2SS   CH     CB          
      3.14642601E-09    3      1000023         5        -5             # Z4SS   -->  Z2SS   BT     BB          
      4.76067019E-10    3      1000023        11       -11             # Z4SS   -->  Z2SS   E-     E+          
      4.76067019E-10    3      1000023        13       -13             # Z4SS   -->  Z2SS   MU-    MU+         
      5.02839825E-10    3      1000023        15       -15             # Z4SS   -->  Z2SS   TAU-   TAU+        
      4.08718254E-10    3      1000023        12       -12             # Z4SS   -->  Z2SS   NUE    ANUE        
      4.08718254E-10    3      1000023        14       -14             # Z4SS   -->  Z2SS   NUM    ANUM        
      4.16287116E-10    3      1000023        16       -16             # Z4SS   -->  Z2SS   NUT    ANUT        
      1.15634639E-05    3      1000025         2        -2             # Z4SS   -->  Z3SS   UP     UB          
      1.49151447E-05    3      1000025         1        -1             # Z4SS   -->  Z3SS   DN     DB          
      1.49151447E-05    3      1000025         3        -3             # Z4SS   -->  Z3SS   ST     SB          
      1.15634639E-05    3      1000025         4        -4             # Z4SS   -->  Z3SS   CH     CB          
      1.27223520E-05    3      1000025         5        -5             # Z4SS   -->  Z3SS   BT     BB          
      3.38326686E-06    3      1000025        11       -11             # Z4SS   -->  Z3SS   E-     E+          
      3.38326686E-06    3      1000025        13       -13             # Z4SS   -->  Z3SS   MU-    MU+         
      3.29431896E-06    3      1000025        15       -15             # Z4SS   -->  Z3SS   TAU-   TAU+        
      6.72985834E-06    3      1000025        12       -12             # Z4SS   -->  Z3SS   NUE    ANUE        
      6.72985834E-06    3      1000025        14       -14             # Z4SS   -->  Z3SS   NUM    ANUM        
      6.72984697E-06    3      1000025        16       -16             # Z4SS   -->  Z3SS   NUT    ANUT        
      8.28410685E-02    2      1000022        25                       # Z4SS   -->  Z1SS   HL0                
      2.16854885E-02    2      1000023        25                       # Z4SS   -->  Z2SS   HL0                
#         PDG         Width
DECAY   1000024  1.39734824E-04   # W1SS+ decays
#          BR          NDA       ID1       ID2       ID3       ID4
      3.33417356E-01    3      1000022         2        -1             # W1SS+  -->  Z1SS   UP     DB          
      3.33417356E-01    3      1000022         4        -3             # W1SS+  -->  Z1SS   CH     SB          
      1.11054704E-01    3      1000022       -11        12             # W1SS+  -->  Z1SS   E+     NUE         
      1.11054704E-01    3      1000022       -13        14             # W1SS+  -->  Z1SS   MU+    NUM         
      1.11055925E-01    3      1000022       -15        16             # W1SS+  -->  Z1SS   TAU+   NUT         
      1.72179567E-12    3      1000023       -11        12             # W1SS+  -->  Z2SS   E+     NUE         
      1.72179567E-12    3      1000023       -13        14             # W1SS+  -->  Z2SS   MU+    NUM         
#         PDG         Width
DECAY   1000037  5.26013792E-01   # W2SS+ decays
#          BR          NDA       ID1       ID2       ID3       ID4
      1.04434383E-09    3      1000022         2        -1             # W2SS+  -->  Z1SS   UP     DB          
      1.04434372E-09    3      1000022         4        -3             # W2SS+  -->  Z1SS   CH     SB          
      1.73195480E-09    3      1000022       -11        12             # W2SS+  -->  Z1SS   E+     NUE         
      1.73195480E-09    3      1000022       -13        14             # W2SS+  -->  Z1SS   MU+    NUM         
      1.99502392E-09    3      1000022       -15        16             # W2SS+  -->  Z1SS   TAU+   NUT         
      6.50385171E-02    2      1000022        24                       # W2SS+  -->  Z1SS   W+                 
      1.33543410E-09    3      1000023         2        -1             # W2SS+  -->  Z2SS   UP     DB          
      1.33543387E-09    3      1000023         4        -3             # W2SS+  -->  Z2SS   CH     SB          
      6.22411733E-10    3      1000023       -11        12             # W2SS+  -->  Z2SS   E+     NUE         
      6.22411733E-10    3      1000023       -13        14             # W2SS+  -->  Z2SS   MU+    NUM         
      7.44592055E-10    3      1000023       -15        16             # W2SS+  -->  Z2SS   TAU+   NUT         
      5.51013470E-01    2      1000023        24                       # W2SS+  -->  Z2SS   W+                 
      4.15197428E-05    3      1000025         2        -1             # W2SS+  -->  Z3SS   UP     DB          
      4.15197428E-05    3      1000025         4        -3             # W2SS+  -->  Z3SS   CH     SB          
      1.38391106E-05    3      1000025       -11        12             # W2SS+  -->  Z3SS   E+     NUE         
      1.38391106E-05    3      1000025       -13        14             # W2SS+  -->  Z3SS   MU+    NUM         
      1.38393661E-05    3      1000025       -15        16             # W2SS+  -->  Z3SS   TAU+   NUT         
      3.27488393E-01    2      1000024        23                       # W2SS+  -->  W1SS+  Z0                 
      2.02511896E-09    3      1000024         1        -1             # W2SS+  -->  W1SS+  DN     DB          
      2.02511852E-09    3      1000024         3        -3             # W2SS+  -->  W1SS+  ST     SB          
      2.96699421E-09    3      1000024         2        -2             # W2SS+  -->  W1SS+  UP     UB          
      2.96699421E-09    3      1000024         4        -4             # W2SS+  -->  W1SS+  CH     CB          
      9.94975435E-10    3      1000024        12       -12             # W2SS+  -->  W1SS+  NUE    ANUE        
      9.94975435E-10    3      1000024        14       -14             # W2SS+  -->  W1SS+  NUM    ANUM        
      1.03144082E-09    3      1000024        16       -16             # W2SS+  -->  W1SS+  NUT    ANUT        
      6.78092638E-10    3      1000024        11       -11             # W2SS+  -->  W1SS+  E-     E+          
      6.78092638E-10    3      1000024        13       -13             # W2SS+  -->  W1SS+  MU-    MU+         
      6.90649593E-10    3      1000024        15       -15             # W2SS+  -->  W1SS+  TAU-   TAU+        
      5.63350283E-02    2      1000024        25                       # W2SS+  -->  W1SS+  HL0                
#         PDG         Width
DECAY        25  4.18283278E-03   # HL0   decays
#          BR          NDA       ID1       ID2       ID3       ID4
      4.76647566E-09    2           11       -11                       # HL0    -->  E-     E+                 
      2.01248215E-04    2           13       -13                       # HL0    -->  MU-    MU+                
      5.75607345E-02    2           15       -15                       # HL0    -->  TAU-   TAU+               
      5.98108136E-06    2            1        -1                       # HL0    -->  DN     DB                 
      2.41665659E-03    2            3        -3                       # HL0    -->  ST     SB                 
      7.90551126E-01    2            5        -5                       # HL0    -->  BT     BB                 
      1.90409730E-06    2            2        -2                       # HL0    -->  UP     UB                 
      3.57622840E-02    2            4        -4                       # HL0    -->  CH     CB                 
      1.95152510E-03    2           22        22                       # HL0    -->  GM     GM                 
      3.98596898E-02    2           21        21                       # HL0    -->  GL     GL                 
      3.68275982E-03    3           24        11       -12             # HL0    -->  W+     E-     ANUE        
      3.68275982E-03    3           24        13       -14             # HL0    -->  W+     MU-    ANUM        
      3.68275982E-03    3           24        15       -16             # HL0    -->  W+     TAU-   ANUT        
      1.10482788E-02    3           24        -2         1             # HL0    -->  W+     UB     DN          
      1.10482788E-02    3           24        -4         3             # HL0    -->  W+     CB     ST          
      3.68275982E-03    3          -24       -11        12             # HL0    -->  W-     E+     NUE         
      3.68275982E-03    3          -24       -13        14             # HL0    -->  W-     MU+    NUM         
      3.68275982E-03    3          -24       -15        16             # HL0    -->  W-     TAU+   NUT         
      1.10482788E-02    3          -24         2        -1             # HL0    -->  W-     UP     DB          
      1.10482788E-02    3          -24         4        -3             # HL0    -->  W-     CH     SB          
      3.69232293E-04    3           23        12       -12             # HL0    -->  Z0     NUE    ANUE        
      3.69232293E-04    3           23        14       -14             # HL0    -->  Z0     NUM    ANUM        
      3.69232293E-04    3           23        16       -16             # HL0    -->  Z0     NUT    ANUT        
      1.85830897E-04    3           23        11       -11             # HL0    -->  Z0     E-     E+          
      1.85830897E-04    3           23        13       -13             # HL0    -->  Z0     MU-    MU+         
      1.85830897E-04    3           23        15       -15             # HL0    -->  Z0     TAU-   TAU+        
      6.36640936E-04    3           23         2        -2             # HL0    -->  Z0     UP     UB          
      6.36640936E-04    3           23         4        -4             # HL0    -->  Z0     CH     CB          
      8.20150308E-04    3           23         1        -1             # HL0    -->  Z0     DN     DB          
      8.20150308E-04    3           23         3        -3             # HL0    -->  Z0     ST     SB          
      8.20150308E-04    3           23         5        -5             # HL0    -->  Z0     BT     BB          
#         PDG         Width
DECAY        35  4.52782669E+01   # HH0   decays
#          BR          NDA       ID1       ID2       ID3       ID4
      1.10386222E-09    2           11       -11                       # HH0    -->  E-     E+                 
      4.66070524E-05    2           13       -13                       # HH0    -->  MU-    MU+                
      1.33489445E-02    2           15       -15                       # HH0    -->  TAU-   TAU+               
      1.34141374E-06    2            1        -1                       # HH0    -->  DN     DB                 
      5.41999005E-04    2            3        -3                       # HH0    -->  ST     SB                 
      7.08874986E-02    2            5        -5                       # HH0    -->  BT     BB                 
      4.31385483E-11    2            2        -2                       # HH0    -->  UP     UB                 
      5.38829113E-07    2            4        -4                       # HH0    -->  CH     CB                 
      2.79810764E-02    2            6        -6                       # HH0    -->  TP     TB                 
      1.38028994E-07    2           22        22                       # HH0    -->  GM     GM                 
      5.82349230E-06    2           21        21                       # HH0    -->  GL     GL                 
      1.14373252E-05    2           24       -24                       # HH0    -->  W+     W-                 
      5.86313399E-06    2           23        23                       # HH0    -->  Z0     Z0                 
      1.53299114E-02    2      1000022   1000022                       # HH0    -->  Z1SS   Z1SS               
      4.83861864E-02    2      1000022   1000023                       # HH0    -->  Z1SS   Z2SS               
      5.43816984E-02    2      1000022   1000025                       # HH0    -->  Z1SS   Z3SS               
      5.05619869E-03    2      1000022   1000035                       # HH0    -->  Z1SS   Z4SS               
      3.52377109E-02    2      1000023   1000023                       # HH0    -->  Z2SS   Z2SS               
      5.05783297E-02    2      1000023   1000025                       # HH0    -->  Z2SS   Z3SS               
      8.45446426E-04    2      1000023   1000035                       # HH0    -->  Z2SS   Z4SS               
      7.84366112E-03    2      1000025   1000025                       # HH0    -->  Z3SS   Z3SS               
      8.48990530E-02    2      1000025   1000035                       # HH0    -->  Z3SS   Z4SS               
      4.71464135E-02    2      1000035   1000035                       # HH0    -->  Z4SS   Z4SS               
      1.53914303E-01    2      1000024  -1000024                       # HH0    -->  W1SS+  W1SS-              
      4.40677628E-02    2      1000037  -1000037                       # HH0    -->  W2SS+  W2SS-              
      1.69719785E-01    2      1000024  -1000037                       # HH0    -->  W1SS+  W2SS-              
      1.69719785E-01    2     -1000024   1000037                       # HH0    -->  W1SS-  W2SS+              
      4.24692080E-05    2           25        25                       # HH0    -->  HL0    HL0                
#         PDG         Width
DECAY        36  4.49805756E+01   # HA0   decays
#          BR          NDA       ID1       ID2       ID3       ID4
      1.10393661E-09    2           11       -11                       # HA0    -->  E-     E+                 
      4.66101919E-05    2           13       -13                       # HA0    -->  MU-    MU+                
      1.33498646E-02    2           15       -15                       # HA0    -->  TAU-   TAU+               
      1.34156392E-06    2            1        -1                       # HA0    -->  DN     DB                 
      5.42059715E-04    2            3        -3                       # HA0    -->  ST     SB                 
      7.08957613E-02    2            5        -5                       # HA0    -->  BT     BB                 
      4.29257636E-11    2            2        -2                       # HA0    -->  UP     UB                 
      5.36546338E-07    2            4        -4                       # HA0    -->  CH     CB                 
      2.81514656E-02    2            6        -6                       # HA0    -->  TP     TB                 
      6.20167953E-07    2           22        22                       # HA0    -->  GM     GM                 
      9.41688177E-06    2           21        21                       # HA0    -->  GL     GL                 
      1.84895620E-02    2      1000022   1000022                       # HA0    -->  Z1SS   Z1SS               
      6.23902120E-02    2      1000022   1000023                       # HA0    -->  Z1SS   Z2SS               
      3.31026427E-02    2      1000022   1000025                       # HA0    -->  Z1SS   Z3SS               
      1.09611452E-02    2      1000022   1000035                       # HA0    -->  Z1SS   Z4SS               
      4.75819074E-02    2      1000023   1000023                       # HA0    -->  Z2SS   Z2SS               
      2.87558939E-02    2      1000023   1000025                       # HA0    -->  Z2SS   Z3SS               
      2.59730476E-03    2      1000023   1000035                       # HA0    -->  Z2SS   Z4SS               
      5.28193871E-03    2      1000025   1000025                       # HA0    -->  Z3SS   Z3SS               
      6.25632480E-02    2      1000025   1000035                       # HA0    -->  Z3SS   Z4SS               
      7.79030919E-02    2      1000035   1000035                       # HA0    -->  Z4SS   Z4SS               
      1.98606789E-01    2      1000024  -1000024                       # HA0    -->  W1SS+  W1SS-              
      8.82622749E-02    2      1000037  -1000037                       # HA0    -->  W2SS+  W2SS-              
      1.25247464E-01    2      1000024  -1000037                       # HA0    -->  W1SS+  W2SS-              
      1.25247464E-01    2     -1000024   1000037                       # HA0    -->  W1SS-  W2SS+              
      1.13999940E-05    2           25        23                       # HA0    -->  HL0    Z0                 
#         PDG         Width
DECAY        37  4.49053192E+01   # H+    decays
#          BR          NDA       ID1       ID2       ID3       ID4
      1.11349607E-09    2           12       -11                       # H+     -->  NUE    E+                 
      4.70138111E-05    2           14       -13                       # H+     -->  NUM    MU+                
      1.34654660E-02    2           16       -15                       # H+     -->  NUT    TAU+               
      1.25386975E-06    2            2        -1                       # H+     -->  UP     DB                 
      5.07111545E-04    2            4        -3                       # H+     -->  CH     SB                 
      9.19719785E-02    2            6        -5                       # H+     -->  TP     BB                 
      8.03342760E-02    2      1000024   1000022                       # H+     -->  W1SS+  Z1SS               
      7.10290298E-03    2      1000024   1000023                       # H+     -->  W1SS+  Z2SS               
      1.67379424E-01    2      1000024   1000025                       # H+     -->  W1SS+  Z3SS               
      2.10102871E-01    2      1000024   1000035                       # H+     -->  W1SS+  Z4SS               
      8.53843230E-04    2      1000037   1000022                       # H+     -->  W2SS+  Z1SS               
      3.37350428E-01    2      1000037   1000023                       # H+     -->  W2SS+  Z2SS               
      8.71478021E-02    2      1000037   1000025                       # H+     -->  W2SS+  Z3SS               
      3.72412964E-03    2      1000037   1000035                       # H+     -->  W2SS+  Z4SS               
      1.15163266E-05    2           25        24                       # H+     -->  HL0    W+                 
