#  ISAJET SUSY parameters in Les Houches accord format
#  Created by ISALHA3. Last revision by C. Balazs on 2005 Jan. 10
Block SPINFO   # Program information
     1   ISASUGRA from ISAJET          # Spectrum Calculator
     2   7.79   16-DEC-2008 15:42:00   # Version number
Block MODSEL   # Model selection
     1     1   # Minimal supergravity (mSUGRA,CMSSM) model         
Block SMINPUTS   # Standard Model inputs
     1     1.27839333E+02   # alpha_em^(-1)
     2     1.16570000E-05   # G_Fermi
     3     1.17200002E-01   # alpha_s(M_Z)
     4     9.11699982E+01   # m_{Z}(pole)
     5     4.19999981E+00   # m_{b}(m_{b})
     6     1.72500000E+02   # m_{top}(pole)
     7     1.77699995E+00   # m_{tau}(pole)
Block MINPAR   # SUSY breaking input parameters
     1     3.20000000E+02   # m_0
     2     1.90000000E+02   # m_{1/2}
     3     3.00000000E+00   # tan(beta)
     4     1.00000000E+00   # sign(mu)
     5     0.00000000E+00   # A_0
#  
#  M_{GUT} =   0.25498667E+17
Block MASS   # Scalar and gaugino mass spectrum
#  PDG code   mass                 particle
        24     8.04229965E+01   #  W^+
        25     9.48726654E+01   #  h^0            
        35     5.05581238E+02   #  H^0            
        36     4.99199646E+02   #  A^0            
        37     5.08632111E+02   #  H^+            
   1000001     5.39400391E+02   #  dnl            
   1000002     5.34476257E+02   #  upl            
   1000003     5.39400452E+02   #  stl            
   1000004     5.34478027E+02   #  chl            
   1000005     4.76169220E+02   #  b1             
   1000006     3.47944550E+02   #  t1             
   1000011     3.46465454E+02   #  el-            
   1000012     3.38596741E+02   #  nuel           
   1000013     3.46465454E+02   #  mul-           
   1000014     3.38596741E+02   #  numl           
   1000015     3.28697510E+02   #  tau1           
   1000016     3.38376831E+02   #  nutl           
   1000021     4.89355408E+02   #  glss           
   1000022     7.00877151E+01   #  z1ss           
   1000023     1.29426147E+02   #  z2ss           
   1000024     1.27650787E+02   #  w1ss           
   1000025    -3.30367462E+02   #  z3ss           
   1000035     3.58742859E+02   #  z4ss           
   1000037     3.54293213E+02   #  w2ss           
   2000001     5.26312073E+02   #  dnr            
   2000002     5.25936279E+02   #  upr            
   2000003     5.26312134E+02   #  str            
   2000004     5.25938110E+02   #  chr            
   2000005     5.24548462E+02   #  b2             
   2000006     5.32365845E+02   #  t2             
   2000011     3.29420227E+02   #  er-            
   2000013     3.29420227E+02   #  mur-           
   2000015     3.46708984E+02   #  tau2           
#  Higgs mixing
Block ALPHA   # Effective Higgs mixing parameter
         -3.40966374E-01   # alpha
Block STOPMIX   # stop mixing matrix
  1  1     5.04933000E-01   # O_{11}
  1  2    -8.63158524E-01   # O_{12}
  2  1     8.63158524E-01   # O_{21}
  2  2     5.04933000E-01   # O_{22}
Block SBOTMIX   # sbottom mixing matrix
  1  1     9.96908188E-01   # O_{11}
  1  2    -7.85749406E-02   # O_{12}
  2  1     7.85749406E-02   # O_{21}
  2  2     9.96908188E-01   # O_{22}
Block STAUMIX   # stau mixing matrix
  1  1     1.62947208E-01   # O_{11}
  1  2    -9.86634791E-01   # O_{12}
  2  1     9.86634791E-01   # O_{21}
  2  2     1.62947208E-01   # O_{22}
Block NMIX   # neutralino mixing matrix
  1  1     9.71631587E-01   #
  1  2    -1.36356577E-01   #
  1  3     1.71829328E-01   #
  1  4    -8.83938223E-02   #
  2  1    -1.90778181E-01   #
  2  2    -9.34137046E-01   #
  2  3     2.52933502E-01   #
  2  4    -1.64367020E-01   #
  3  1     4.83077429E-02   #
  3  2    -7.35559314E-02   #
  3  3    -6.97416782E-01   #
  3  4    -7.11242318E-01   #
  4  1     1.31156102E-01   #
  4  2    -3.21534663E-01   #
  4  3    -6.48158252E-01   #
  4  4     6.77719891E-01   #
Block UMIX   # chargino U mixing matrix
  1  1    -9.18615520E-01   # U_{11}
  1  2     3.95152479E-01   # U_{12}
  2  1    -3.95152479E-01   # U_{21}
  2  2    -9.18615520E-01   # U_{22}
Block VMIX   # chargino V mixing matrix
  1  1    -9.65566814E-01   # V_{11}
  1  2     2.60155290E-01   # V_{12}
  2  1    -2.60155290E-01   # V_{21}
  2  2    -9.65566814E-01   # V_{22}
Block GAUGE Q=  4.03661499E+02   #
     1     3.57523769E-01   # g`
     2     6.52351975E-01   # g_2
     3     1.21925342E+00   # g_3
Block YU Q=  4.03661499E+02   #
  3  3     9.30470169E-01   # y_t
Block YD Q=  4.03661499E+02   #
  3  3     4.47495729E-02   # y_b
Block YE Q=  4.03661499E+02   #
  3  3     3.17414179E-02   # y_tau
Block HMIX Q=  4.03661499E+02   # Higgs mixing parameters
     1     3.27589569E+02   # mu(Q)
     2     3.00000000E+00   # tan(beta)(M_{GUT})
     3     2.50125900E+02   # Higgs vev at Q
     4     2.49200281E+05   # m_A^2(Q)
Block MSOFT Q=  4.03661499E+02   # DRbar SUSY breaking parameters
     1     7.68087006E+01   # M_1(Q)          
     2     1.45555527E+02   # M_2(Q)          
     3     4.50834656E+02   # M_3(Q)          
    31     3.43056671E+02   # MeL(Q)          
    32     3.43056671E+02   # MmuL(Q)         
    33     3.42842285E+02   # MtauL(Q)        
    34     3.26915985E+02   # MeR(Q)          
    35     3.26915985E+02   # MmuR(Q)         
    36     3.26605682E+02   # MtauR(Q)        
    41     5.12914795E+02   # MqL1(Q)         
    42     5.12914795E+02   # MqL2(Q)         
    43     4.52245911E+02   # MqL3(Q)         
    44     5.03082245E+02   # MuR(Q)          
    45     5.03082245E+02   # McR(Q)          
    46     3.60296448E+02   # MtR(Q)          
    47     5.01925476E+02   # MdR(Q)          
    48     5.01925476E+02   # MsR(Q)          
    49     5.05006226E+02   # MbR(Q)          
Block AU Q=  4.03661499E+02   #
  1  1    -3.41909973E+02   # A_u
  2  2    -3.41909973E+02   # A_c
  3  3    -3.41909973E+02   # A_t
Block AD Q=  4.03661499E+02   #
  1  1    -5.47908081E+02   # A_d
  2  2    -5.47908081E+02   # A_s
  3  3    -5.47908081E+02   # A_b
Block AE Q=  4.03661499E+02   #
  1  1    -1.20719574E+02   # A_e
  2  2    -1.20719574E+02   # A_mu
  3  3    -1.20719574E+02   # A_tau
#  ISAJET decay tables in SUSY Les Houches accord format
#  Created by ISALHD. Last revision: C. Balazs, 2005 May 25
Block DCINFO                           # Program information
     1   ISASUGRA from ISAJET          # Spectrum Calculator
     2   7.79   16-DEC-2008 15:42:00   # Version number
#         PDG         Width
DECAY         6  1.14680767E+00   # TP    decays
#          BR          NDA       ID1       ID2       ID3       ID4
      3.33333343E-01    3            2        -1         5             # TP     -->  UP     DB     BT          
      3.33333343E-01    3            4        -3         5             # TP     -->  CH     SB     BT          
      1.11111112E-01    3          -11        12         5             # TP     -->  E+     NUE    BT          
      1.11111112E-01    3          -13        14         5             # TP     -->  MU+    NUM    BT          
      1.11111112E-01    3          -15        16         5             # TP     -->  TAU+   NUT    BT          
#         PDG         Width
DECAY   1000021  6.21728972E-02   # GLSS  decays
#          BR          NDA       ID1       ID2       ID3       ID4
      6.74667358E-02    3      1000024         1        -2             # GLSS   -->  W1SS+  DN     UB          
      6.74667358E-02    3     -1000024         2        -1             # GLSS   -->  W1SS-  UP     DB          
      6.74657151E-02    3      1000024         3        -4             # GLSS   -->  W1SS+  ST     CB          
      6.74657151E-02    3     -1000024         4        -3             # GLSS   -->  W1SS-  CH     SB          
      9.24007595E-03    3      1000024         5        -6             # GLSS   -->  W1SS+  BT     TB          
      9.24007595E-03    3     -1000024         6        -5             # GLSS   -->  W1SS-  TP     BB          
      4.86378238E-04    3      1000037         1        -2             # GLSS   -->  W2SS+  DN     UB          
      4.86378238E-04    3     -1000037         2        -1             # GLSS   -->  W2SS-  UP     DB          
      4.86370525E-04    3      1000037         3        -4             # GLSS   -->  W2SS+  ST     CB          
      4.86370525E-04    3     -1000037         4        -3             # GLSS   -->  W2SS-  CH     SB          
      1.42507721E-04    2      1000022        21                       # GLSS   -->  Z1SS   GL                 
      2.71165930E-02    3      1000022         2        -2             # GLSS   -->  Z1SS   UP     UB          
      1.10053616E-02    3      1000022         1        -1             # GLSS   -->  Z1SS   DN     DB          
      1.10053504E-02    3      1000022         3        -3             # GLSS   -->  Z1SS   ST     SB          
      2.71157809E-02    3      1000022         4        -4             # GLSS   -->  Z1SS   CH     CB          
      6.86859386E-03    3      1000022         5        -5             # GLSS   -->  Z1SS   BT     BB          
      4.72172257E-03    3      1000022         6        -6             # GLSS   -->  Z1SS   TP     TB          
      6.15541474E-04    2      1000023        21                       # GLSS   -->  Z2SS   GL                 
      3.75397429E-02    3      1000023         2        -2             # GLSS   -->  Z2SS   UP     UB          
      2.95123793E-02    3      1000023         1        -1             # GLSS   -->  Z2SS   DN     DB          
      2.95123532E-02    3      1000023         3        -3             # GLSS   -->  Z2SS   ST     SB          
      3.75387147E-02    3      1000023         4        -4             # GLSS   -->  Z2SS   CH     CB          
      2.99676030E-04    3      1000023         5        -5             # GLSS   -->  Z2SS   BT     BB          
      2.84861220E-04    3      1000023         6        -6             # GLSS   -->  Z2SS   TP     TB          
      1.91539107E-03    2      1000025        21                       # GLSS   -->  Z3SS   GL                 
      1.01906371E-05    3      1000025         2        -2             # GLSS   -->  Z3SS   UP     UB          
      1.14082040E-05    3      1000025         1        -1             # GLSS   -->  Z3SS   DN     DB          
      1.14081877E-05    3      1000025         3        -3             # GLSS   -->  Z3SS   ST     SB          
      1.01901796E-05    3      1000025         4        -4             # GLSS   -->  Z3SS   CH     CB          
      2.26249977E-05    3      1000025         5        -5             # GLSS   -->  Z3SS   BT     BB          
      1.77594740E-03    2      1000035        21                       # GLSS   -->  Z4SS   GL                 
      2.11583712E-04    3      1000035         2        -2             # GLSS   -->  Z4SS   UP     UB          
      2.32534061E-04    3      1000035         1        -1             # GLSS   -->  Z4SS   DN     DB          
      2.32533712E-04    3      1000035         3        -3             # GLSS   -->  Z4SS   ST     SB          
      2.11574967E-04    3      1000035         4        -4             # GLSS   -->  Z4SS   CH     CB          
      2.62327048E-05    3      1000035         5        -5             # GLSS   -->  Z4SS   BT     BB          
      2.40879327E-01    2     -1000005         5                       # GLSS   -->  BB1    BT                 
      2.40879327E-01    2      1000005        -5                       # GLSS   -->  BT1    BB                 
#         PDG         Width
DECAY   1000002  6.68287182E+00   # UPL   decays
#          BR          NDA       ID1       ID2       ID3       ID4
      5.64165821E-04    2      1000022         2                       # UPL    -->  Z1SS   UP                 
      2.80167013E-01    2      1000023         2                       # UPL    -->  Z2SS   UP                 
      5.38203341E-04    2      1000025         2                       # UPL    -->  Z3SS   UP                 
      8.99662450E-03    2      1000035         2                       # UPL    -->  Z4SS   UP                 
      1.37255043E-01    2      1000021         2                       # UPL    -->  GLSS   UP                 
      5.58158219E-01    2      1000024         1                       # UPL    -->  W1SS+  DN                 
      1.43207302E-02    2      1000037         1                       # UPL    -->  W2SS+  DN                 
#         PDG         Width
DECAY   1000001  6.68892336E+00   # DNL   decays
#          BR          NDA       ID1       ID2       ID3       ID4
      3.24226990E-02    2      1000022         1                       # DNL    -->  Z1SS   DN                 
      2.43758902E-01    2      1000023         1                       # DNL    -->  Z2SS   DN                 
      9.00074549E-04    2      1000025         1                       # DNL    -->  Z3SS   DN                 
      1.26061058E-02    2      1000035         1                       # DNL    -->  Z4SS   DN                 
      1.65532842E-01    2      1000021         1                       # DNL    -->  GLSS   DN                 
      5.10510087E-01    2     -1000024         2                       # DNL    -->  W1SS-  UP                 
      3.42693105E-02    2     -1000037         2                       # DNL    -->  W2SS-  UP                 
#         PDG         Width
DECAY   1000003  6.68886995E+00   # STL   decays
#          BR          NDA       ID1       ID2       ID3       ID4
      3.24229598E-02    2      1000022         3                       # STL    -->  Z1SS   ST                 
      2.43760884E-01    2      1000023         3                       # STL    -->  Z2SS   ST                 
      9.00082057E-04    2      1000025         3                       # STL    -->  Z3SS   ST                 
      1.26062119E-02    2      1000035         3                       # STL    -->  Z4SS   ST                 
      1.65534541E-01    2      1000021         3                       # STL    -->  GLSS   ST                 
      5.10507107E-01    2     -1000024         4                       # STL    -->  W1SS-  CH                 
      3.42682675E-02    2     -1000037         4                       # STL    -->  W2SS-  CH                 
#         PDG         Width
DECAY   1000004  6.68248510E+00   # CHL   decays
#          BR          NDA       ID1       ID2       ID3       ID4
      5.64193062E-04    2      1000022         4                       # CHL    -->  Z1SS   CH                 
      2.80180335E-01    2      1000023         4                       # CHL    -->  Z2SS   CH                 
      5.38222666E-04    2      1000025         4                       # CHL    -->  Z3SS   CH                 
      8.99689272E-03    2      1000035         4                       # CHL    -->  Z4SS   CH                 
      1.37205809E-01    2      1000021         4                       # CHL    -->  GLSS   CH                 
      5.58192790E-01    2      1000024         3                       # CHL    -->  W1SS+  ST                 
      1.43217538E-02    2      1000037         3                       # CHL    -->  W2SS+  ST                 
#         PDG         Width
DECAY   1000005  4.47826672E+00   # BT1   decays
#          BR          NDA       ID1       ID2       ID3       ID4
      4.32482474E-02    2      1000022         5                       # BT1    -->  Z1SS   BT                 
      3.09800297E-01    2      1000023         5                       # BT1    -->  Z2SS   BT                 
      1.21757039E-03    2      1000025         5                       # BT1    -->  Z3SS   BT                 
      1.00576514E-02    2      1000035         5                       # BT1    -->  Z4SS   BT                 
      4.48242188E-01    2     -1000024         6                       # BT1    -->  W1SS-  TP                 
      1.87434033E-01    2          -24   1000006                       # BT1    -->  W-     TP1                
#         PDG         Width
DECAY   1000006  1.99948502E+00   # TP1   decays
#          BR          NDA       ID1       ID2       ID3       ID4
      1.65073499E-01    2      1000022         6                       # TP1    -->  Z1SS   TP                 
      1.24099091E-01    2      1000023         6                       # TP1    -->  Z2SS   TP                 
      7.10827410E-01    2      1000024         5                       # TP1    -->  W1SS+  BT                 
#         PDG         Width
DECAY   2000002  1.75129330E+00   # UPR   decays
#          BR          NDA       ID1       ID2       ID3       ID4
      6.18343711E-01    2      1000022         2                       # UPR    -->  Z1SS   UP                 
      2.18065549E-02    2      1000023         2                       # UPR    -->  Z2SS   UP                 
      5.80692722E-04    2      1000025         2                       # UPR    -->  Z3SS   UP                 
      3.33921961E-03    2      1000035         2                       # UPR    -->  Z4SS   UP                 
      3.55929822E-01    2      1000021         2                       # UPR    -->  GLSS   UP                 
#         PDG         Width
DECAY   2000001  9.17478919E-01   # DNR   decays
#          BR          NDA       ID1       ID2       ID3       ID4
      2.95301259E-01    2      1000022         1                       # DNR    -->  Z1SS   DN                 
      1.04154954E-02    2      1000023         1                       # DNR    -->  Z2SS   DN                 
      2.77822313E-04    2      1000025         1                       # DNR    -->  Z3SS   DN                 
      1.59858633E-03    2      1000035         1                       # DNR    -->  Z4SS   DN                 
      6.92406833E-01    2      1000021         1                       # DNR    -->  GLSS   DN                 
#         PDG         Width
DECAY   2000003  9.17480946E-01   # STR   decays
#          BR          NDA       ID1       ID2       ID3       ID4
      2.95300663E-01    2      1000022         3                       # STR    -->  Z1SS   ST                 
      1.04154749E-02    2      1000023         3                       # STR    -->  Z2SS   ST                 
      2.77821789E-04    2      1000025         3                       # STR    -->  Z3SS   ST                 
      1.59858377E-03    2      1000035         3                       # STR    -->  Z4SS   ST                 
      6.92407489E-01    2      1000021         3                       # STR    -->  GLSS   ST                 
#         PDG         Width
DECAY   2000004  1.75088429E+00   # CHR   decays
#          BR          NDA       ID1       ID2       ID3       ID4
      6.18482113E-01    2      1000022         4                       # CHR    -->  Z1SS   CH                 
      2.18114201E-02    2      1000023         4                       # CHR    -->  Z2SS   CH                 
      5.80814842E-04    2      1000025         4                       # CHR    -->  Z3SS   CH                 
      3.33989784E-03    2      1000035         4                       # CHR    -->  Z4SS   CH                 
      3.55785757E-01    2      1000021         4                       # CHR    -->  GLSS   CH                 
#         PDG         Width
DECAY   2000005  8.78958642E-01   # BT2   decays
#          BR          NDA       ID1       ID2       ID3       ID4
      3.03075075E-01    2      1000022         5                       # BT2    -->  Z1SS   BT                 
      1.59366690E-02    2      1000023         5                       # BT2    -->  Z2SS   BT                 
      5.57987439E-03    2      1000025         5                       # BT2    -->  Z3SS   BT                 
      8.04364309E-03    2      1000035         5                       # BT2    -->  Z4SS   BT                 
      6.38799012E-01    2      1000021         5                       # BT2    -->  GLSS   BT                 
      7.98355229E-03    2     -1000024         6                       # BT2    -->  W1SS-  TP                 
      2.05821414E-02    2          -24   1000006                       # BT2    -->  W-     TP1                
#         PDG         Width
DECAY   2000006  5.80224991E+00   # TP2   decays
#          BR          NDA       ID1       ID2       ID3       ID4
      2.88020432E-01    2      1000024         5                       # TP2    -->  W1SS+  BT                 
      2.01515138E-01    2      1000037         5                       # TP2    -->  W2SS+  BT                 
      1.97834447E-01    2           23   1000006                       # TP2    -->  Z0     TP1                
      8.05936083E-02    2           25   1000006                       # TP2    -->  HL0    TP1                
      1.58282630E-02    2      1000022         6                       # TP2    -->  Z1SS   TP                 
      1.28679320E-01    2      1000023         6                       # TP2    -->  Z2SS   TP                 
      3.94357666E-02    2      1000025         6                       # TP2    -->  Z3SS   TP                 
      4.80930209E-02    2      1000035         6                       # TP2    -->  Z4SS   TP                 
#         PDG         Width
DECAY   1000011  3.21622419E+00   # EL-   decays
#          BR          NDA       ID1       ID2       ID3       ID4
      6.59605488E-02    2      1000022        11                       # EL-    -->  Z1SS   E-                 
      3.62413079E-01    2      1000023        11                       # EL-    -->  Z2SS   E-                 
      8.25430197E-06    2      1000025        11                       # EL-    -->  Z3SS   E-                 
      5.71618140E-01    2     -1000024        12                       # EL-    -->  W1SS-  NUE                
      9.28057978E-12    3      1000015        11       -15             # EL-    -->  TAU1-  E-     TAU+        
      8.26667380E-12    3     -1000015        11        15             # EL-    -->  TAU1+  E-     TAU-        
#         PDG         Width
DECAY   1000013  3.21622419E+00   # MUL-  decays
#          BR          NDA       ID1       ID2       ID3       ID4
      6.59605414E-02    2      1000022        13                       # MUL-   -->  Z1SS   MU-                
      3.62413049E-01    2      1000023        13                       # MUL-   -->  Z2SS   MU-                
      8.25411826E-06    2      1000025        13                       # MUL-   -->  Z3SS   MU-                
      5.71618199E-01    2     -1000024        14                       # MUL-   -->  W1SS-  NUM                
      9.28058064E-12    3      1000015        13       -15             # MUL-   -->  TAU1-  MU-    TAU+        
      8.26667380E-12    3     -1000015        13        15             # MUL-   -->  TAU1+  MU-    TAU-        
#         PDG         Width
DECAY   1000015  1.54182303E+00   # TAU1- decays
#          BR          NDA       ID1       ID2       ID3       ID4
      9.13778663E-01    2      1000022        15                       # TAU1-  -->  Z1SS   TAU-               
      4.92611527E-02    2      1000023        15                       # TAU1-  -->  Z2SS   TAU-               
      3.69601920E-02    2     -1000024        16                       # TAU1-  -->  W1SS-  NUT                
#         PDG         Width
DECAY   1000012  3.25736451E+00   # NUEL  decays
#          BR          NDA       ID1       ID2       ID3       ID4
      1.80152804E-01    2      1000022        12                       # NUEL   -->  Z1SS   NUE                
      2.19400018E-01    2      1000023        12                       # NUEL   -->  Z2SS   NUE                
      1.01100795E-05    2      1000025        12                       # NUEL   -->  Z3SS   NUE                
      6.00437105E-01    2      1000024        11                       # NUEL   -->  W1SS+  E-                 
      7.89829411E-13    3      1000015        12       -15             # NUEL   -->  TAU1-  NUE    TAU+        
      6.83438224E-13    3     -1000015        12        15             # NUEL   -->  TAU1+  NUE    TAU-        
      1.14208258E-13    3     -1000015        11        16             # NUEL   -->  TAU1+  E-     NUT         
#         PDG         Width
DECAY   1000014  3.25736427E+00   # NUML  decays
#          BR          NDA       ID1       ID2       ID3       ID4
      1.80152819E-01    2      1000022        14                       # NUML   -->  Z1SS   NUM                
      2.19400033E-01    2      1000023        14                       # NUML   -->  Z2SS   NUM                
      1.01100804E-05    2      1000025        14                       # NUML   -->  Z3SS   NUM                
      6.00437045E-01    2      1000024        13                       # NUML   -->  W1SS+  MU-                
      7.89829465E-13    3      1000015        14       -15             # NUML   -->  TAU1-  NUM    TAU+        
      6.83438278E-13    3     -1000015        14        15             # NUML   -->  TAU1+  NUM    TAU-        
      1.14212744E-13    3     -1000015        13        16             # NUML   -->  TAU1+  MU-    NUT         
#         PDG         Width
DECAY   1000016  3.25430942E+00   # NUTL  decays
#          BR          NDA       ID1       ID2       ID3       ID4
      1.80183828E-01    2      1000022        16                       # NUTL   -->  Z1SS   NUT                
      2.19365701E-01    2      1000023        16                       # NUTL   -->  Z2SS   NUT                
      9.59833687E-06    2      1000025        16                       # NUTL   -->  Z3SS   NUT                
      6.00440860E-01    2      1000024        15                       # NUTL   -->  W1SS+  TAU-               
      6.97459939E-13    3     -1000015        16        15             # NUTL   -->  TAU1+  NUT    TAU-        
      1.93082911E-10    3      1000015        16       -15             # NUTL   -->  TAU1-  NUT    TAU+        
      1.92480906E-10    3      1000015        12       -11             # NUTL   -->  TAU1-  NUE    E+          
      1.92480906E-10    3      1000015        14       -13             # NUTL   -->  TAU1-  NUM    MU+         
      5.77442705E-10    3      1000015         2        -1             # NUTL   -->  TAU1-  UP     DB          
      5.77442705E-10    3      1000015         4        -3             # NUTL   -->  TAU1-  CH     SB          
#         PDG         Width
DECAY   2000011  1.48544526E+00   # ER-   decays
#          BR          NDA       ID1       ID2       ID3       ID4
      9.70642626E-01    2      1000022        11                       # ER-    -->  Z1SS   E-                 
      2.93574054E-02    2      1000023        11                       # ER-    -->  Z2SS   E-                 
      2.64654281E-29    3      1000015        12       -16             # ER-    -->  TAU1-  NUE    ANUT        
#         PDG         Width
DECAY   2000013  1.48544490E+00   # MUR-  decays
#          BR          NDA       ID1       ID2       ID3       ID4
      9.70642626E-01    2      1000022        13                       # MUR-   -->  Z1SS   MU-                
      2.93574017E-02    2      1000023        13                       # MUR-   -->  Z2SS   MU-                
      1.12766749E-24    3      1000015        14       -16             # MUR-   -->  TAU1-  NUM    ANUT        
#         PDG         Width
DECAY   2000015  3.15471911E+00   # TAU2- decays
#          BR          NDA       ID1       ID2       ID3       ID4
      7.72408471E-02    2      1000022        15                       # TAU2-  -->  Z1SS   TAU-               
      3.58788133E-01    2      1000023        15                       # TAU2-  -->  Z2SS   TAU-               
      2.15290329E-05    2      1000025        15                       # TAU2-  -->  Z3SS   TAU-               
      5.63949466E-01    2     -1000024        16                       # TAU2-  -->  W1SS-  NUT                
#         PDG         Width
DECAY   1000023  1.33374795E-06   # Z2SS  decays
#          BR          NDA       ID1       ID2       ID3       ID4
      3.31348157E-04    2      1000022        22                       # Z2SS   -->  Z1SS   GM                 
      1.93501364E-05    3     -1000024         2        -1             # Z2SS   -->  W1SS-  UP     DB          
      6.45004548E-06    3     -1000024        12       -11             # Z2SS   -->  W1SS-  NUE    E+          
      6.45004548E-06    3     -1000024        14       -13             # Z2SS   -->  W1SS-  NUM    MU+         
      1.93501364E-05    3      1000024         1        -2             # Z2SS   -->  W1SS+  DN     UB          
      6.45004548E-06    3      1000024        11       -12             # Z2SS   -->  W1SS+  E-     ANUE        
      6.45004548E-06    3      1000024        13       -14             # Z2SS   -->  W1SS+  MU-    ANUM        
      1.41394466E-01    3      1000022         2        -2             # Z2SS   -->  Z1SS   UP     UB          
      2.28714645E-01    3      1000022         1        -1             # Z2SS   -->  Z1SS   DN     DB          
      2.28714645E-01    3      1000022         3        -3             # Z2SS   -->  Z1SS   ST     SB          
      1.41394332E-01    3      1000022         4        -4             # Z2SS   -->  Z1SS   CH     CB          
      2.45153353E-01    3      1000022         5        -5             # Z2SS   -->  Z1SS   BT     BB          
      2.05887808E-03    3      1000022        11       -11             # Z2SS   -->  Z1SS   E-     E+          
      2.05887808E-03    3      1000022        13       -13             # Z2SS   -->  Z1SS   MU-    MU+         
      4.42835595E-03    3      1000022        15       -15             # Z2SS   -->  Z1SS   TAU-   TAU+        
      1.90013926E-03    3      1000022        12       -12             # Z2SS   -->  Z1SS   NUE    ANUE        
      1.90013926E-03    3      1000022        14       -14             # Z2SS   -->  Z1SS   NUM    ANUM        
      1.88633054E-03    3      1000022        16       -16             # Z2SS   -->  Z1SS   NUT    ANUT        
#         PDG         Width
DECAY   1000025  2.17955399E+00   # Z3SS  decays
#          BR          NDA       ID1       ID2       ID3       ID4
      4.31527184E-07    2      1000022        22                       # Z3SS   -->  Z1SS   GM                 
      1.73400096E-07    2      1000023        22                       # Z3SS   -->  Z2SS   GM                 
      3.11498821E-01    2      1000024       -24                       # Z3SS   -->  W1SS+  W-                 
      3.11498821E-01    2     -1000024        24                       # Z3SS   -->  W1SS-  W+                 
      1.40040115E-01    2      1000022        23                       # Z3SS   -->  Z1SS   Z0                 
      2.12963253E-01    2      1000023        23                       # Z3SS   -->  Z2SS   Z0                 
      1.67519634E-08    3      1000022         2        -2             # Z3SS   -->  Z1SS   UP     UB          
      1.64444351E-08    3      1000022         1        -1             # Z3SS   -->  Z1SS   DN     DB          
      1.64444280E-08    3      1000022         3        -3             # Z3SS   -->  Z1SS   ST     SB          
      1.67516667E-08    3      1000022         4        -4             # Z3SS   -->  Z1SS   CH     CB          
      1.50797220E-07    3      1000022         5        -5             # Z3SS   -->  Z1SS   BT     BB          
      4.92117813E-08    3      1000022        11       -11             # Z3SS   -->  Z1SS   E-     E+          
      4.92117813E-08    3      1000022        13       -13             # Z3SS   -->  Z1SS   MU-    MU+         
      1.94557444E-07    3      1000022        15       -15             # Z3SS   -->  Z1SS   TAU-   TAU+        
      8.50560468E-07    3      1000022        12       -12             # Z3SS   -->  Z1SS   NUE    ANUE        
      8.50560468E-07    3      1000022        14       -14             # Z3SS   -->  Z1SS   NUM    ANUM        
      8.58655653E-07    3      1000022        16       -16             # Z3SS   -->  Z1SS   NUT    ANUT        
      3.97705406E-08    3      1000023         2        -2             # Z3SS   -->  Z2SS   UP     UB          
      5.26048041E-08    3      1000023         1        -1             # Z3SS   -->  Z2SS   DN     DB          
      5.26047721E-08    3      1000023         3        -3             # Z3SS   -->  Z2SS   ST     SB          
      3.97698479E-08    3      1000023         4        -4             # Z3SS   -->  Z2SS   CH     CB          
      2.82696334E-07    3      1000023         5        -5             # Z3SS   -->  Z2SS   BT     BB          
      1.77041443E-07    3      1000023        11       -11             # Z3SS   -->  Z2SS   E-     E+          
      1.77041443E-07    3      1000023        13       -13             # Z3SS   -->  Z2SS   MU-    MU+         
      6.13898465E-07    3      1000023        15       -15             # Z3SS   -->  Z2SS   TAU-   TAU+        
      7.17617525E-07    3      1000023        12       -12             # Z3SS   -->  Z2SS   NUE    ANUE        
      7.17617525E-07    3      1000023        14       -14             # Z3SS   -->  Z2SS   NUM    ANUM        
      7.25571795E-07    3      1000023        16       -16             # Z3SS   -->  Z2SS   NUT    ANUT        
      1.39914174E-02    2      1000022        25                       # Z3SS   -->  Z1SS   HL0                
      1.00001739E-02    2      1000023        25                       # Z3SS   -->  Z2SS   HL0                
      2.94959932E-08    2      2000011       -11                       # Z3SS   -->  ER-    E+                 
      2.94959932E-08    2     -2000011        11                       # Z3SS   -->  ER+    E-                 
      2.93147355E-08    2      2000013       -13                       # Z3SS   -->  MUR-   MU+                
      2.93147355E-08    2     -2000013        13                       # Z3SS   -->  MUR+   MU-                
#         PDG         Width
DECAY   1000035  2.38021445E+00   # Z4SS  decays
#          BR          NDA       ID1       ID2       ID3       ID4
      7.49599565E-07    2      1000022        22                       # Z4SS   -->  Z1SS   GM                 
      4.98440954E-07    2      1000023        22                       # Z4SS   -->  Z2SS   GM                 
      8.59718607E-09    2      1000025        22                       # Z4SS   -->  Z3SS   GM                 
      3.48503321E-01    2      1000024       -24                       # Z4SS   -->  W1SS+  W-                 
      3.48503321E-01    2     -1000024        24                       # Z4SS   -->  W1SS-  W+                 
      3.71874670E-10    3     -1000037         2        -1             # Z4SS   -->  W2SS-  UP     DB          
      1.23958219E-10    3     -1000037        12       -11             # Z4SS   -->  W2SS-  NUE    E+          
      1.23958219E-10    3     -1000037        14       -13             # Z4SS   -->  W2SS-  NUM    MU+         
      3.71874670E-10    3      1000037         1        -2             # Z4SS   -->  W2SS+  DN     UB          
      1.23958219E-10    3      1000037        11       -12             # Z4SS   -->  W2SS+  E-     ANUE        
      1.23958219E-10    3      1000037        13       -14             # Z4SS   -->  W2SS+  MU-    ANUM        
      3.71874670E-10    3     -1000037         4        -3             # Z4SS   -->  W2SS-  CH     SB          
      1.23958219E-10    3     -1000037        16       -15             # Z4SS   -->  W2SS-  NUT    TAU+        
      3.71874670E-10    3      1000037         3        -4             # Z4SS   -->  W2SS+  ST     CB          
      1.23958219E-10    3      1000037        15       -16             # Z4SS   -->  W2SS+  TAU-   ANUT        
      1.60046965E-02    2      1000022        23                       # Z4SS   -->  Z1SS   Z0                 
      1.33064082E-02    2      1000023        23                       # Z4SS   -->  Z2SS   Z0                 
      3.42569450E-07    3      1000022         2        -2             # Z4SS   -->  Z1SS   UP     UB          
      7.57110513E-07    3      1000022         1        -1             # Z4SS   -->  Z1SS   DN     DB          
      7.57109945E-07    3      1000022         3        -3             # Z4SS   -->  Z1SS   ST     SB          
      3.42563339E-07    3      1000022         4        -4             # Z4SS   -->  Z1SS   CH     CB          
      1.52826271E-06    3      1000022         5        -5             # Z4SS   -->  Z1SS   BT     BB          
      7.20213311E-09    3      1000022        15       -15             # Z4SS   -->  Z1SS   TAU-   TAU+        
      3.33409207E-06    3      1000023         2        -2             # Z4SS   -->  Z2SS   UP     UB          
      3.68196493E-06    3      1000023         1        -1             # Z4SS   -->  Z2SS   DN     DB          
      3.68196311E-06    3      1000023         3        -3             # Z4SS   -->  Z2SS   ST     SB          
      3.33403318E-06    3      1000023         4        -4             # Z4SS   -->  Z2SS   CH     CB          
      7.44610816E-06    3      1000023         5        -5             # Z4SS   -->  Z2SS   BT     BB          
      3.43588247E-09    3      1000023        15       -15             # Z4SS   -->  Z2SS   TAU-   TAU+        
      8.00840553E-07    3      1000025         2        -2             # Z4SS   -->  Z3SS   UP     UB          
      1.03738762E-06    3      1000025         1        -1             # Z4SS   -->  Z3SS   DN     DB          
      1.03738762E-06    3      1000025         3        -3             # Z4SS   -->  Z3SS   ST     SB          
      8.00840553E-07    3      1000025         4        -4             # Z4SS   -->  Z3SS   CH     CB          
      7.33430738E-07    3      1000025         5        -5             # Z4SS   -->  Z3SS   BT     BB          
      2.34735623E-07    3      1000025        11       -11             # Z4SS   -->  Z3SS   E-     E+          
      2.34735623E-07    3      1000025        13       -13             # Z4SS   -->  Z3SS   MU-    MU+         
      2.21738105E-07    3      1000025        15       -15             # Z4SS   -->  Z3SS   TAU-   TAU+        
      4.67050086E-07    3      1000025        12       -12             # Z4SS   -->  Z3SS   NUE    ANUE        
      4.67050086E-07    3      1000025        14       -14             # Z4SS   -->  Z3SS   NUM    ANUM        
      4.67050086E-07    3      1000025        16       -16             # Z4SS   -->  Z3SS   NUT    ANUT        
      1.02498569E-01    2      1000022        25                       # Z4SS   -->  Z1SS   HL0                
      1.66136220E-01    2      1000023        25                       # Z4SS   -->  Z2SS   HL0                
      8.93358883E-05    2      1000011       -11                       # Z4SS   -->  EL-    E+                 
      8.93358883E-05    2     -1000011        11                       # Z4SS   -->  EL+    E-                 
      8.93327306E-05    2      1000013       -13                       # Z4SS   -->  MUL-   MU+                
      8.93327306E-05    2     -1000013        13                       # Z4SS   -->  MUL+   MU-                
      1.62094613E-04    2      2000011       -11                       # Z4SS   -->  ER-    E+                 
      1.62094613E-04    2     -2000011        11                       # Z4SS   -->  ER+    E-                 
      1.62093667E-04    2      2000013       -13                       # Z4SS   -->  MUR-   MU+                
      1.62093667E-04    2     -2000013        13                       # Z4SS   -->  MUR+   MU-                
      1.47912448E-04    2      1000015       -15                       # Z4SS   -->  TAU1-  TAU+               
      1.47912448E-04    2     -1000015        15                       # Z4SS   -->  TAU1+  TAU-               
      8.70349177E-05    2      2000015       -15                       # Z4SS   -->  TAU2-  TAU+               
      8.70349177E-05    2     -2000015        15                       # Z4SS   -->  TAU2+  TAU-               
      5.85657719E-04    2      1000012       -12                       # Z4SS   -->  NUEL   ANUE               
      5.85657719E-04    2     -1000012        12                       # Z4SS   -->  ANUEL  NUE                
      5.85657719E-04    2      1000014       -14                       # Z4SS   -->  NUML   ANUM               
      5.85657719E-04    2     -1000014        14                       # Z4SS   -->  ANUML  NUM                
      5.98135812E-04    2      1000016       -16                       # Z4SS   -->  NUTL   ANUT               
      5.98135812E-04    2     -1000016        16                       # Z4SS   -->  ANUTL  NUT                
#         PDG         Width
DECAY   1000024  6.21479267E-05   # W1SS+ decays
#          BR          NDA       ID1       ID2       ID3       ID4
      3.32545877E-01    3      1000022         2        -1             # W1SS+  -->  Z1SS   UP     DB          
      3.32545877E-01    3      1000022         4        -3             # W1SS+  -->  Z1SS   CH     SB          
      1.11629546E-01    3      1000022       -11        12             # W1SS+  -->  Z1SS   E+     NUE         
      1.11629546E-01    3      1000022       -13        14             # W1SS+  -->  Z1SS   MU+    NUM         
      1.11649208E-01    3      1000022       -15        16             # W1SS+  -->  Z1SS   TAU+   NUT         
#         PDG         Width
DECAY   1000037  2.38142633E+00   # W2SS+ decays
#          BR          NDA       ID1       ID2       ID3       ID4
      7.44958186E-07    3      1000022         2        -1             # W2SS+  -->  Z1SS   UP     DB          
      7.44957333E-07    3      1000022         4        -3             # W2SS+  -->  Z1SS   CH     SB          
      1.69363967E-09    3      1000022       -15        16             # W2SS+  -->  Z1SS   TAU+   NUT         
      4.02902253E-02    2      1000022        24                       # W2SS+  -->  Z1SS   W+                 
      3.14853742E-06    3      1000023         2        -1             # W2SS+  -->  Z2SS   UP     DB          
      3.14852105E-06    3      1000023         4        -3             # W2SS+  -->  Z2SS   CH     SB          
      1.08932552E-08    3      1000023       -15        16             # W2SS+  -->  Z2SS   TAU+   NUT         
      4.01852161E-01    2      1000023        24                       # W2SS+  -->  Z2SS   W+                 
      1.21729693E-06    3      1000025         2        -1             # W2SS+  -->  Z3SS   UP     DB          
      1.21729693E-06    3      1000025         4        -3             # W2SS+  -->  Z3SS   CH     SB          
      4.05490056E-07    3      1000025       -11        12             # W2SS+  -->  Z3SS   E+     NUE         
      4.05490056E-07    3      1000025       -13        14             # W2SS+  -->  Z3SS   MU+    NUM         
      4.05490056E-07    3      1000025       -15        16             # W2SS+  -->  Z3SS   TAU+   NUT         
      1.69177644E-03    2      1000006        -5                       # W2SS+  -->  TP1    BB                 
      3.18188424E-04    2      1000012       -11                       # W2SS+  -->  NUEL   E+                 
      3.18181614E-04    2      1000014       -13                       # W2SS+  -->  NUML   MU+                
      3.21965897E-04    2      1000016       -15                       # W2SS+  -->  NUTL   TAU+               
      1.86735808E-04    2     -1000011        12                       # W2SS+  -->  EL+    NUE                
      1.86735808E-04    2     -1000013        14                       # W2SS+  -->  MUL+   NUM                
      4.62304979E-06    2     -1000015        16                       # W2SS+  -->  TAU1+  NUT                
      1.77316251E-04    2     -2000015        16                       # W2SS+  -->  TAU2+  NUT                
      3.23479831E-01    2      1000024        23                       # W2SS+  -->  W1SS+  Z0                 
      3.41929695E-06    3      1000024         1        -1             # W2SS+  -->  W1SS+  DN     DB          
      3.41923646E-06    3      1000024         3        -3             # W2SS+  -->  W1SS+  ST     SB          
      6.80203857E-06    3      1000024         2        -2             # W2SS+  -->  W1SS+  UP     UB          
      6.80203402E-06    3      1000024         4        -4             # W2SS+  -->  W1SS+  CH     CB          
      2.31140330E-01    2      1000024        25                       # W2SS+  -->  W1SS+  HL0                
#         PDG         Width
DECAY        25  3.53757106E-03   # HL0   decays
#          BR          NDA       ID1       ID2       ID3       ID4
      5.09631848E-09    2           11       -11                       # HL0    -->  E-     E+                 
      2.15174165E-04    2           13       -13                       # HL0    -->  MU-    MU+                
      6.14999495E-02    2           15       -15                       # HL0    -->  TAU-   TAU+               
      6.41549013E-06    2            1        -1                       # HL0    -->  DN     DB                 
      2.59217736E-03    2            3        -3                       # HL0    -->  ST     SB                 
      8.73104513E-01    2            5        -5                       # HL0    -->  BT     BB                 
      1.81161408E-06    2            2        -2                       # HL0    -->  UP     UB                 
      3.51406038E-02    2            4        -4                       # HL0    -->  CH     CB                 
      1.09982502E-03    2           22        22                       # HL0    -->  GM     GM                 
      2.53372751E-02    2           21        21                       # HL0    -->  GL     GL                 
      5.56774794E-05    3           24        11       -12             # HL0    -->  W+     E-     ANUE        
      5.56774794E-05    3           24        13       -14             # HL0    -->  W+     MU-    ANUM        
      5.56774794E-05    3           24        15       -16             # HL0    -->  W+     TAU-   ANUT        
      1.67032442E-04    3           24        -2         1             # HL0    -->  W+     UB     DN          
      1.67032442E-04    3           24        -4         3             # HL0    -->  W+     CB     ST          
      5.56774794E-05    3          -24       -11        12             # HL0    -->  W-     E+     NUE         
      5.56774794E-05    3          -24       -13        14             # HL0    -->  W-     MU+    NUM         
      5.56774794E-05    3          -24       -15        16             # HL0    -->  W-     TAU+   NUT         
      1.67032442E-04    3          -24         2        -1             # HL0    -->  W-     UP     DB          
      1.67032442E-04    3          -24         4        -3             # HL0    -->  W-     CH     SB          
#         PDG         Width
DECAY        35  3.47464609E+00   # HH0   decays
#          BR          NDA       ID1       ID2       ID3       ID4
      2.19620849E-10    2           11       -11                       # HH0    -->  E-     E+                 
      9.27278688E-06    2           13       -13                       # HH0    -->  MU-    MU+                
      2.65567191E-03    2           15       -15                       # HH0    -->  TAU-   TAU+               
      2.70688304E-07    2            1        -1                       # HH0    -->  DN     DB                 
      1.09371780E-04    2            3        -3                       # HH0    -->  ST     SB                 
      1.68249607E-02    2            5        -5                       # HH0    -->  BT     BB                 
      1.21160237E-09    2            2        -2                       # HH0    -->  UP     UB                 
      1.85635254E-05    2            4        -4                       # HH0    -->  CH     CB                 
      4.46265161E-01    2            6        -6                       # HH0    -->  TP     TB                 
      8.49511162E-06    2           22        22                       # HH0    -->  GM     GM                 
      8.07175296E-04    2           21        21                       # HH0    -->  GL     GL                 
      3.83996917E-03    2           24       -24                       # HH0    -->  W+     W-                 
      1.88808411E-03    2           23        23                       # HH0    -->  Z0     Z0                 
      8.55661742E-03    2      1000022   1000022                       # HH0    -->  Z1SS   Z1SS               
      2.55577937E-02    2      1000022   1000023                       # HH0    -->  Z1SS   Z2SS               
      8.11209604E-02    2      1000022   1000025                       # HH0    -->  Z1SS   Z3SS               
      3.15480237E-03    2      1000022   1000035                       # HH0    -->  Z1SS   Z4SS               
      1.79610830E-02    2      1000023   1000023                       # HH0    -->  Z2SS   Z2SS               
      1.03137843E-01    2      1000023   1000025                       # HH0    -->  Z2SS   Z3SS               
      5.83836052E-04    2      1000023   1000035                       # HH0    -->  Z2SS   Z4SS               
      6.16089217E-02    2      1000024  -1000024                       # HH0    -->  W1SS+  W1SS-              
      1.07289411E-01    2      1000024  -1000037                       # HH0    -->  W1SS+  W2SS-              
      1.07289411E-01    2     -1000024   1000037                       # HH0    -->  W1SS-  W2SS+              
      1.13123013E-02    2           25        25                       # HH0    -->  HL0    HL0                
#         PDG         Width
DECAY        36  4.39136791E+00   # HA0   decays
#          BR          NDA       ID1       ID2       ID3       ID4
      1.73864215E-10    2           11       -11                       # HA0    -->  E-     E+                 
      7.34086007E-06    2           13       -13                       # HA0    -->  MU-    MU+                
      2.10248167E-03    2           15       -15                       # HA0    -->  TAU-   TAU+               
      2.14318064E-07    2            1        -1                       # HA0    -->  DN     DB                 
      8.65953480E-05    2            3        -3                       # HA0    -->  ST     SB                 
      1.33237708E-02    2            5        -5                       # HA0    -->  BT     BB                 
      8.46602732E-10    2            2        -2                       # HA0    -->  UP     UB                 
      1.29922837E-05    2            4        -4                       # HA0    -->  CH     CB                 
      5.54006159E-01    2            6        -6                       # HA0    -->  TP     TB                 
      1.23021482E-06    2           22        22                       # HA0    -->  GM     GM                 
      5.51105011E-04    2           21        21                       # HA0    -->  GL     GL                 
      1.50534287E-02    2      1000022   1000022                       # HA0    -->  Z1SS   Z1SS               
      5.38272224E-02    2      1000022   1000023                       # HA0    -->  Z1SS   Z2SS               
      6.50797039E-03    2      1000022   1000025                       # HA0    -->  Z1SS   Z3SS               
      3.07423789E-02    2      1000022   1000035                       # HA0    -->  Z1SS   Z4SS               
      4.79596741E-02    2      1000023   1000023                       # HA0    -->  Z2SS   Z2SS               
      2.86722207E-03    2      1000023   1000025                       # HA0    -->  Z2SS   Z3SS               
      2.29966622E-02    2      1000023   1000035                       # HA0    -->  Z2SS   Z4SS               
      1.57438412E-01    2      1000024  -1000024                       # HA0    -->  W1SS+  W1SS-              
      4.48799618E-02    2      1000024  -1000037                       # HA0    -->  W1SS+  W2SS-              
      4.48799618E-02    2     -1000024   1000037                       # HA0    -->  W1SS-  W2SS+              
      2.75520002E-03    2           25        23                       # HA0    -->  HL0    Z0                 
#         PDG         Width
DECAY        37  3.87224817E+00   # H+    decays
#          BR          NDA       ID1       ID2       ID3       ID4
      2.00898326E-10    2           12       -11                       # H+     -->  NUE    E+                 
      8.48228865E-06    2           14       -13                       # H+     -->  NUM    MU+                
      2.42939848E-03    2           16       -15                       # H+     -->  NUT    TAU+               
      2.27111087E-07    2            2        -1                       # H+     -->  UP     DB                 
      1.05082596E-04    2            4        -3                       # H+     -->  CH     SB                 
      5.72624981E-01    2            6        -5                       # H+     -->  TP     BB                 
      6.46287799E-02    2      1000024   1000022                       # H+     -->  W1SS+  Z1SS               
      2.74140248E-03    2      1000024   1000023                       # H+     -->  W1SS+  Z2SS               
      1.36099845E-01    2      1000024   1000025                       # H+     -->  W1SS+  Z3SS               
      8.51298198E-02    2      1000024   1000035                       # H+     -->  W1SS+  Z4SS               
      1.24821691E-02    2      1000037   1000022                       # H+     -->  W2SS+  Z1SS               
      1.20376669E-01    2      1000037   1000023                       # H+     -->  W2SS+  Z2SS               
      3.37314000E-03    2           25        24                       # H+     -->  HL0    W+                 
