#
#                              ======================
#                              | THE SUSYHIT OUTPUT |
#                              ======================
#
#
#              ------------------------------------------------------
#              |     This is the output of the SUSY-HIT package     |
#              |  created by A.Djouadi, M.Muehlleitner and M.Spira. |
#              |  In case of problems with SUSY-HIT email to        |
#              |           margarete.muehlleitner@cern.ch           |
#              |           michael.spira@psi.ch                     |
#              |           abdelhak.djouadi@cern.ch                 |
#              ------------------------------------------------------
#
#              ------------------------------------------------------
#              |  SUSY Les Houches Accord - MSSM Spectrum + Decays  |
#              |              based on the decay programs           |
#              |                                                    |
#              |                     SDECAY 1.3b                    |
#              |                                                    |
#              |  Authors: M.Muhlleitner, A.Djouadi and Y.Mambrini  |
#              |  Ref.:    Comput.Phys.Commun.168(2005)46           |
#              |           [hep-ph/0311167]                         |
#              |                                                    |
#              |                     HDECAY 3.4                     |
#              |                                                    |
#              |  By: A.Djouadi,J.Kalinowski,M.Muhlleitner,M.Spira  |
#              |  Ref.:    Comput.Phys.Commun.108(1998)56           |
#              |           [hep-ph/9704448]                         |
#              |                                                    |
#              |                                                    |
#              |  If not stated otherwise all DRbar couplings and   |
#              |  soft SUSY breaking masses are given at the scale  |
#              |  Q=  0.91187600E+02
#              |                                                    |
#              ------------------------------------------------------
#
#
BLOCK DCINFO  # Decay Program information
     1   SDECAY/HDECAY # decay calculator
     2   1.3b  /3.4    # version number
#
BLOCK SPINFO  # Spectrum calculator information
     1   SuSpect     # RGE +Spectrum calculator            
     2   2.41         # version number                     
#
BLOCK MODSEL  # Model selection
     1     0   # #general MSSM low scale                           
#
BLOCK SMINPUTS  # Standard Model inputs
         1     1.27934000E+02   # alpha_em^-1(M_Z)^MSbar
         2     1.16639000E-05   # G_F [GeV^-2]
         3     1.17200000E-01   # alpha_S(M_Z)^MSbar
         4     9.11870000E+01   # M_Z pole mass
         5     4.25000000E+00   # mb(mb)^MSbar
         6     1.75000000E+02   # mt pole mass
         7     1.77700000E+00   # mtau pole mass
#
BLOCK MINPAR  # Input parameters - minimal models
#
BLOCK EXTPAR  # Input parameters - non-minimal models
         0     9.11876000E+01   # EWSB                
         1     3.61000000E+02   # M_1                 
         2     2.50000000E+03   # M_2                 
         3     2.50000000E+03   # M_3                 
        11     0.00000000E+00   # A_t                 
        12     0.00000000E+00   # A_b                 
        13     0.00000000E+00   # A_tau               
        14     0.00000000E+00   # A_u                 
        15     0.00000000E+00   # A_d                 
        16     0.00000000E+00   # A_e                 
        23    -3.50000000E+02   # mu(EWSB)            
        25     1.50000000E+00   # tanbeta(in)         
        26     2.00000000E+03   # MA_pole             
        31     2.50000000E+03   # M_eL                
        32     2.50000000E+03   # M_muL               
        33     2.50000000E+03   # M_tauL              
        34     2.50000000E+03   # M_eR                
        35     2.50000000E+03   # M_muR               
        36     2.50000000E+03   # M_tauR              
        41     1.00000000E+03   # M_q1L               
        42     1.00000000E+03   # M_q2L               
        43     1.00000000E+03   # M_q3L               
        44     2.50000000E+03   # M_uR                
        45     2.50000000E+03   # M_cR                
        46     2.50000000E+03   # M_tR                
        47     1.00000000E+03   # M_dR                
        48     1.00000000E+03   # M_sR                
        49     1.02500000E+03   # M_bR                
#
BLOCK MASS  # Mass Spectrum
# PDG code           mass       particle
        24     8.05459459E+01   # W+
        25     1.15000000E+02   # h
        35     2.00391322E+03   # H
        36     2.00000000E+03   # A
        37     2.00195035E+03   # H+
         5     4.87877839E+00   # b-quark pole mass calculated from mb(mb)_Msbar
   1000001     1.00067510E+03   # ~d_L
   2000001     1.00012707E+03   # ~d_R
   1000002     9.99451596E+02   # ~u_L
   2000002     2.49989834E+03   # ~u_R
   1000003     1.00067510E+03   # ~s_L
   2000003     1.00012707E+03   # ~s_R
   1000004     9.99451596E+02   # ~c_L
   2000004     2.49989834E+03   # ~c_R
   1000005     1.00065791E+03   # ~b_1
   2000005     1.02514811E+03   # ~b_2
   1000006     1.01171108E+03   # ~t_1
   2000006     2.50492798E+03   # ~t_2
   1000011     2.50016847E+03   # ~e_L
   2000011     2.50015248E+03   # ~e_R
   1000012     2.49967902E+03   # ~nu_eL
   1000013     2.50016847E+03   # ~mu_L
   2000013     2.50015248E+03   # ~mu_R
   1000014     2.49967902E+03   # ~nu_muL
   1000015     2.49997448E+03   # ~tau_1
   2000015     2.50034772E+03   # ~tau_2
   1000016     2.49967902E+03   # ~nu_tauL
   1000021     2.50000000E+03   # ~g
   1000022     3.45693604E+02   # ~chi_10
   1000023    -3.54807234E+02   # ~chi_20
   1000025     3.67854244E+02   # ~chi_30
   1000035     2.50225939E+03   # ~chi_40
   1000024     3.52031211E+02   # ~chi_1+
   1000037     2.50225884E+03   # ~chi_2+
   1000039     3.02600000E-08   # ~gravitino
#
BLOCK NMIX  # Neutralino Mixing Matrix
  1  1     4.34156761E-01   # N_11
  1  2    -5.52635752E-03   # N_12
  1  3    -6.56376557E-01   # N_13
  1  4    -6.16966110E-01   # N_14
  2  1     6.08734615E-02   # N_21
  2  2    -2.73447677E-02   # N_22
  2  3     7.04567451E-01   # N_23
  2  4    -7.06492316E-01   # N_24
  3  1     8.98778049E-01   # N_31
  3  2     5.17633163E-03   # N_32
  3  3     2.69353763E-01   # N_33
  3  4     3.45860917E-01   # N_34
  4  1     5.88734137E-04   # N_41
  4  2    -9.99597383E-01   # N_42
  4  3    -1.42503348E-02   # N_43
  4  4     2.45286100E-02   # N_44
#
BLOCK UMIX  # Chargino Mixing Matrix U
  1  1    -2.01402493E-02   # U_11
  1  2     9.99797165E-01   # U_12
  2  1     9.99797165E-01   # U_21
  2  2     2.01402493E-02   # U_22
#
BLOCK VMIX  # Chargino Mixing Matrix V
  1  1     3.46856535E-02   # V_11
  1  2    -9.99398272E-01   # V_12
  2  1     9.99398272E-01   # V_21
  2  2     3.46856535E-02   # V_22
#
BLOCK STOPMIX  # Stop Mixing Matrix
  1  1     9.99975402E-01   # cos(theta_t)
  1  2    -7.01394290E-03   # sin(theta_t)
  2  1     7.01394290E-03   # -sin(theta_t)
  2  2     9.99975402E-01   # cos(theta_t)
#
BLOCK SBOTMIX  # Sbottom Mixing Matrix
  1  1     9.99577155E-01   # cos(theta_b)
  1  2    -2.90776753E-02   # sin(theta_b)
  2  1     2.90776753E-02   # -sin(theta_b)
  2  2     9.99577155E-01   # cos(theta_b)
#
BLOCK STAUMIX  # Stau Mixing Matrix
  1  1    -6.91802597E-01   # cos(theta_tau)
  1  2     7.22086675E-01   # sin(theta_tau)
  2  1    -7.22086675E-01   # -sin(theta_tau)
  2  2    -6.91802597E-01   # cos(theta_tau)
#
BLOCK ALPHA  # Higgs mixing
          -5.89807918E-01   # Mixing angle in the neutral Higgs boson sector
#
BLOCK HMIX Q=  9.11876000E+01  # DRbar Higgs Parameters
         1    -3.50000000E+02   # mu(Q)               
         2     1.49999979E+00   # tanbeta(Q)          
         3     2.51755972E+02   # vev(Q)              
         4     4.02207638E+06   # MA^2(Q)             
#
BLOCK GAUGE Q=  9.11876000E+01  # The gauge couplings
     1     3.53705716E-01   # gprime(Q) DRbar
     2     6.33678575E-01   # g(Q) DRbar
     3     1.09915960E+00   # g3(Q) DRbar
#
BLOCK AU Q=  9.11876000E+01  # The trilinear couplings
  1  1     0.00000000E+00   # A_u(Q) DRbar
  2  2     0.00000000E+00   # A_c(Q) DRbar
  3  3     0.00000000E+00   # A_t(Q) DRbar
#
BLOCK AD Q=  9.11876000E+01  # The trilinear couplings
  1  1     0.00000000E+00   # A_d(Q) DRbar
  2  2     0.00000000E+00   # A_s(Q) DRbar
  3  3     0.00000000E+00   # A_b(Q) DRbar
#
BLOCK AE Q=  9.11876000E+01  # The trilinear couplings
  1  1     0.00000000E+00   # A_e(Q) DRbar
  2  2     0.00000000E+00   # A_mu(Q) DRbar
  3  3     0.00000000E+00   # A_tau(Q) DRbar
#
BLOCK Yu Q=  9.11876000E+01  # The Yukawa couplings
  1  1     0.00000000E+00   # y_u(Q) DRbar
  2  2     0.00000000E+00   # y_c(Q) DRbar
  3  3     1.06563643E+00   # y_t(Q) DRbar
#
BLOCK Yd Q=  9.11876000E+01  # The Yukawa couplings
  1  1     0.00000000E+00   # y_d(Q) DRbar
  2  2     0.00000000E+00   # y_s(Q) DRbar
  3  3     2.78153334E-02   # y_b(Q) DRbar
#
BLOCK Ye Q=  9.11876000E+01  # The Yukawa couplings
  1  1     0.00000000E+00   # y_e(Q) DRbar
  2  2     0.00000000E+00   # y_mu(Q) DRbar
  3  3     1.79835760E-02   # y_tau(Q) DRbar
#
BLOCK MSOFT Q=  9.11876000E+01  # The soft SUSY breaking masses at the scale Q
         1     3.61000000E+02   # M_1                 
         2     2.50000000E+03   # M_2                 
         3     2.50000000E+03   # M_3                 
        14     0.00000000E+00   # A_u                 
        15     0.00000000E+00   # A_d                 
        16     0.00000000E+00   # A_e                 
        21     2.72557496E+06   # M^2_Hd              
        22     5.67264217E+05   # M^2_Hu              
        31     2.50000000E+03   # M_eL                
        32     2.50000000E+03   # M_muL               
        33     2.50000000E+03   # M_tauL              
        34     2.50000000E+03   # M_eR                
        35     2.50000000E+03   # M_muR               
        36     2.50000000E+03   # M_tauR              
        41     1.00000000E+03   # M_q1L               
        42     1.00000000E+03   # M_q2L               
        43     1.00000000E+03   # M_q3L               
        44     2.50000000E+03   # M_uR                
        45     2.50000000E+03   # M_cR                
        46     2.50000000E+03   # M_tR                
        47     1.00000000E+03   # M_dR                
        48     1.00000000E+03   # M_sR                
        49     1.02500000E+03   # M_bR                
#
#
#
#                             =================
#                             |The decay table|
#                             =================
#
# - The QCD corrections to the decays gluino -> squark  + quark
#                                     squark -> gaugino + quark_prime
#                                     squark -> squark_prime + Higgs
#                                     squark -> gluino  + quark
#   are included.
#
# - The multi-body decays for the inos, stops and sbottoms are included.
#
# - The loop induced decays for the gluino, neutralinos and stops
#   are included.
#
# - The SUSY decays of the top quark are included.
#
# - Possible decays of the NLSP in GMSB models are included.
#
#
#         PDG            Width
DECAY         6     1.45906737E+00   # top decays
#          BR         NDA      ID1       ID2
     1.00000000E+00    2           5        24   # BR(t ->  b    W+)
#
#         PDG            Width
DECAY   1000021     2.39260928E+02   # gluino decays
#          BR         NDA      ID1       ID2
     5.57153813E-02    2     1000001        -1   # BR(~g -> ~d_L  db)
     5.57153813E-02    2    -1000001         1   # BR(~g -> ~d_L* d )
     5.57386628E-02    2     2000001        -1   # BR(~g -> ~d_R  db)
     5.57386628E-02    2    -2000001         1   # BR(~g -> ~d_R* d )
     5.57673476E-02    2     1000002        -2   # BR(~g -> ~u_L  ub)
     5.57673476E-02    2    -1000002         2   # BR(~g -> ~u_L* u )
     5.22519554E-10    2     2000002        -2   # BR(~g -> ~u_R  ub)
     5.22519554E-10    2    -2000002         2   # BR(~g -> ~u_R* u )
     5.57153813E-02    2     1000003        -3   # BR(~g -> ~s_L  sb)
     5.57153813E-02    2    -1000003         3   # BR(~g -> ~s_L* s )
     5.57386628E-02    2     2000003        -3   # BR(~g -> ~s_R  sb)
     5.57386628E-02    2    -2000003         3   # BR(~g -> ~s_R* s )
     5.57673476E-02    2     1000004        -4   # BR(~g -> ~c_L  cb)
     5.57673476E-02    2    -1000004         4   # BR(~g -> ~c_L* c )
     5.22519554E-10    2     2000004        -4   # BR(~g -> ~c_R  cb)
     5.22519554E-10    2    -2000004         4   # BR(~g -> ~c_R* c )
     5.55573196E-02    2     1000005        -5   # BR(~g -> ~b_1  bb)
     5.55573196E-02    2    -1000005         5   # BR(~g -> ~b_1* b )
     5.44265835E-02    2     2000005        -5   # BR(~g -> ~b_2  bb)
     5.44265835E-02    2    -2000005         5   # BR(~g -> ~b_2* b )
     5.55733123E-02    2     1000006        -6   # BR(~g -> ~t_1  tb)
     5.55733123E-02    2    -1000006         6   # BR(~g -> ~t_1* t )
     5.13188386E-10    2     1000039        21   # BR(~g -> ~G g)
#
#         PDG            Width
DECAY   1000006     1.27267134E+01   # stop1 decays
#          BR         NDA      ID1       ID2
     3.88573529E-01    2     1000022         6   # BR(~t_1 -> ~chi_10 t )
     4.91048227E-01    2     1000023         6   # BR(~t_1 -> ~chi_20 t )
     1.19907620E-01    2     1000025         6   # BR(~t_1 -> ~chi_30 t )
     4.70623820E-04    2     1000024         5   # BR(~t_1 -> ~chi_1+ b )
#
#         PDG            Width
DECAY   2000006     8.56414223E+01   # stop2 decays
#          BR         NDA      ID1       ID2
     1.86233788E-01    2     1000022         6   # BR(~t_2 -> ~chi_10 t )
     2.30172816E-01    2     1000023         6   # BR(~t_2 -> ~chi_20 t )
     1.02094253E-01    2     1000025         6   # BR(~t_2 -> ~chi_30 t )
     4.61881463E-01    2     1000024         5   # BR(~t_2 -> ~chi_1+ b )
     8.89911589E-03    2     1000006        25   # BR(~t_2 -> ~t_1    h )
     2.26211902E-03    2     1000006        23   # BR(~t_2 -> ~t_1    Z )
     8.44905228E-03    2     1000005        24   # BR(~t_2 -> ~b_1    W+)
     7.39301081E-06    2     2000005        24   # BR(~t_2 -> ~b_2    W+)
#
#         PDG            Width
DECAY   1000005     1.25172396E+01   # sbottom1 decays
#          BR         NDA      ID1       ID2
     2.64376467E-03    2     1000022         5   # BR(~b_1 -> ~chi_10 b )
     6.35392073E-04    2     1000023         5   # BR(~b_1 -> ~chi_20 b )
     6.29408550E-03    2     1000025         5   # BR(~b_1 -> ~chi_30 b )
     9.90426758E-01    2    -1000024         6   # BR(~b_1 -> ~chi_1- t )
#
#         PDG            Width
DECAY   2000005     5.35483859E-01   # sbottom2 decays
#          BR         NDA      ID1       ID2
     1.59385211E-01    2     1000022         5   # BR(~b_2 -> ~chi_10 b )
     1.45231479E-02    2     1000023         5   # BR(~b_2 -> ~chi_20 b )
     6.75341047E-01    2     1000025         5   # BR(~b_2 -> ~chi_30 b )
     1.50750594E-01    2    -1000024         6   # BR(~b_2 -> ~chi_1- t )
#
#         PDG            Width
DECAY   1000002     1.21283332E-01   # sup_L decays
#          BR         NDA      ID1       ID2
     1.52863629E-01    2     1000022         2   # BR(~u_L -> ~chi_10 u)
     6.83424575E-03    2     1000023         2   # BR(~u_L -> ~chi_20 u)
     7.75950144E-01    2     1000025         2   # BR(~u_L -> ~chi_30 u)
     6.43519817E-02    2     1000024         1   # BR(~u_L -> ~chi_1+ d)
#
#         PDG            Width
DECAY   2000002     5.10142218E+00   # sup_R decays
#          BR         NDA      ID1       ID2
     1.89149848E-01    2     1000022         2   # BR(~u_R -> ~chi_10 u)
     3.71207252E-03    2     1000023         2   # BR(~u_R -> ~chi_20 u)
     8.07138079E-01    2     1000025         2   # BR(~u_R -> ~chi_30 u)
#
#         PDG            Width
DECAY   1000001     1.15206377E-01   # sdown_L decays
#          BR         NDA      ID1       ID2
     2.12045414E-01    2     1000022         1   # BR(~d_L -> ~chi_10 d)
     4.20062315E-02    2     1000023         1   # BR(~d_L -> ~chi_20 d)
     7.23066249E-01    2     1000025         1   # BR(~d_L -> ~chi_30 d)
     2.28821060E-02    2    -1000024         2   # BR(~d_L -> ~chi_1- u)
#
#         PDG            Width
DECAY   2000001     4.41732566E-01   # sdown_R decays
#          BR         NDA      ID1       ID2
     1.93634870E-01    2     1000022         1   # BR(~d_R -> ~chi_10 d)
     3.75605271E-03    2     1000023         1   # BR(~d_R -> ~chi_20 d)
     8.02609078E-01    2     1000025         1   # BR(~d_R -> ~chi_30 d)
#
#         PDG            Width
DECAY   1000004     1.21283332E-01   # scharm_L decays
#          BR         NDA      ID1       ID2
     1.52863629E-01    2     1000022         4   # BR(~c_L -> ~chi_10 c)
     6.83424575E-03    2     1000023         4   # BR(~c_L -> ~chi_20 c)
     7.75950144E-01    2     1000025         4   # BR(~c_L -> ~chi_30 c)
     6.43519817E-02    2     1000024         3   # BR(~c_L -> ~chi_1+ s)
#
#         PDG            Width
DECAY   2000004     5.10142218E+00   # scharm_R decays
#          BR         NDA      ID1       ID2
     1.89149848E-01    2     1000022         4   # BR(~c_R -> ~chi_10 c)
     3.71207252E-03    2     1000023         4   # BR(~c_R -> ~chi_20 c)
     8.07138079E-01    2     1000025         4   # BR(~c_R -> ~chi_30 c)
#
#         PDG            Width
DECAY   1000003     1.15206377E-01   # sstrange_L decays
#          BR         NDA      ID1       ID2
     2.12045414E-01    2     1000022         3   # BR(~s_L -> ~chi_10 s)
     4.20062315E-02    2     1000023         3   # BR(~s_L -> ~chi_20 s)
     7.23066249E-01    2     1000025         3   # BR(~s_L -> ~chi_30 s)
     2.28821060E-02    2    -1000024         4   # BR(~s_L -> ~chi_1- c)
#
#         PDG            Width
DECAY   2000003     4.41732566E-01   # sstrange_R decays
#          BR         NDA      ID1       ID2
     1.93634870E-01    2     1000022         3   # BR(~s_R -> ~chi_10 s)
     3.75605271E-03    2     1000023         3   # BR(~s_R -> ~chi_20 s)
     8.02609078E-01    2     1000025         3   # BR(~s_R -> ~chi_30 s)
#
#         PDG            Width
DECAY   1000011     3.00266744E+00   # selectron_L decays
#          BR         NDA      ID1       ID2
     1.79446883E-01    2     1000022        11   # BR(~e_L -> ~chi_10 e-)
     1.40511686E-04    2     1000023        11   # BR(~e_L -> ~chi_20 e-)
     8.17820416E-01    2     1000025        11   # BR(~e_L -> ~chi_30 e-)
     2.59218940E-03    2    -1000024        12   # BR(~e_L -> ~chi_1- nu_e)
#
#         PDG            Width
DECAY   2000011     1.19242074E+01   # selectron_R decays
#          BR         NDA      ID1       ID2
     1.89281277E-01    2     1000022        11   # BR(~e_R -> ~chi_10 e-)
     3.71334788E-03    2     1000023        11   # BR(~e_R -> ~chi_20 e-)
     8.07005375E-01    2     1000025        11   # BR(~e_R -> ~chi_30 e-)
#
#         PDG            Width
DECAY   1000013     3.00266744E+00   # smuon_L decays
#          BR         NDA      ID1       ID2
     1.79446883E-01    2     1000022        13   # BR(~mu_L -> ~chi_10 mu-)
     1.40511686E-04    2     1000023        13   # BR(~mu_L -> ~chi_20 mu-)
     8.17820416E-01    2     1000025        13   # BR(~mu_L -> ~chi_30 mu-)
     2.59218940E-03    2    -1000024        14   # BR(~mu_L -> ~chi_1- nu_mu)
#
#         PDG            Width
DECAY   2000013     1.19242074E+01   # smuon_R decays
#          BR         NDA      ID1       ID2
     1.89281277E-01    2     1000022        13   # BR(~mu_R -> ~chi_10 mu-)
     3.71334788E-03    2     1000023        13   # BR(~mu_R -> ~chi_20 mu-)
     8.07005375E-01    2     1000025        13   # BR(~mu_R -> ~chi_30 mu-)
#
#         PDG            Width
DECAY   1000015     7.65993839E+00   # stau_1 decays
#          BR         NDA      ID1       ID2
     1.96311391E-01    2     1000022        15   # BR(~tau_1 -> ~chi_10  tau-)
     1.87295602E-03    2     1000023        15   # BR(~tau_1 -> ~chi_20  tau-)
     8.01707997E-01    2     1000025        15   # BR(~tau_1 -> ~chi_30  tau-)
     1.07639623E-04    2    -1000024        16   # BR(~tau_1 -> ~chi_1-  nu_tau)
     1.60288055E-08    2     1000039        15   # BR(~tau_1 -> ~G       tau-)
#
#         PDG            Width
DECAY   2000015     7.31328960E+00   # stau_2 decays
#          BR         NDA      ID1       ID2
     1.78505717E-01    2     1000022        15   # BR(~tau_2 -> ~chi_10  tau-)
     6.24853355E-03    2     1000023        15   # BR(~tau_2 -> ~chi_20  tau-)
     8.12181603E-01    2     1000025        15   # BR(~tau_2 -> ~chi_30  tau-)
     3.06414622E-03    2    -1000024        16   # BR(~tau_2 -> ~chi_1-  nu_tau)
#
#         PDG            Width
DECAY   1000012     3.00514567E+00   # snu_eL decays
#          BR         NDA      ID1       ID2
     1.96384949E-01    2     1000022        12   # BR(~nu_eL -> ~chi_10 nu_e)
     1.19957002E-02    2     1000023        12   # BR(~nu_eL -> ~chi_20 nu_e)
     7.83938902E-01    2     1000025        12   # BR(~nu_eL -> ~chi_30 nu_e)
     7.68044891E-03    2     1000024        11   # BR(~nu_eL -> ~chi_1+ e-)
#
#         PDG            Width
DECAY   1000014     3.00514567E+00   # snu_muL decays
#          BR         NDA      ID1       ID2
     1.96384949E-01    2     1000022        14   # BR(~nu_muL -> ~chi_10 nu_mu)
     1.19957002E-02    2     1000023        14   # BR(~nu_muL -> ~chi_20 nu_mu)
     7.83938902E-01    2     1000025        14   # BR(~nu_muL -> ~chi_30 nu_mu)
     7.68044891E-03    2     1000024        13   # BR(~nu_muL -> ~chi_1+ mu-)
#
#         PDG            Width
DECAY   1000016     3.02059842E+00   # snu_tauL decays
#          BR         NDA      ID1       ID2
     1.95380284E-01    2     1000022        16   # BR(~nu_tauL -> ~chi_10 nu_tau)
     1.19343327E-02    2     1000023        16   # BR(~nu_tauL -> ~chi_20 nu_tau)
     7.79928433E-01    2     1000025        16   # BR(~nu_tauL -> ~chi_30 nu_tau)
     1.27569503E-02    2     1000024        15   # BR(~nu_tauL -> ~chi_1+ tau-)
#
#         PDG            Width
DECAY   1000024     9.07374984E-09   # chargino1+ decays
#          BR         NDA      ID1       ID2
     3.03569684E-04    2     1000039        24   # BR(~chi_1+ -> ~G       W+)
#           BR         NDA      ID1       ID2       ID3
     3.45249189E-01    3     1000022         2        -1   # BR(~chi_1+ -> ~chi_10 u    db)
     3.45249189E-01    3     1000022         4        -3   # BR(~chi_1+ -> ~chi_10 c    sb)
     1.15088829E-01    3     1000022       -11        12   # BR(~chi_1+ -> ~chi_10 e+   nu_e)
     1.15088829E-01    3     1000022       -13        14   # BR(~chi_1+ -> ~chi_10 mu+  nu_mu)
     7.90203949E-02    3     1000022       -15        16   # BR(~chi_1+ -> ~chi_10 tau+ nu_tau)
#
#         PDG            Width
DECAY   1000037     1.52413505E+02   # chargino2+ decays
#          BR         NDA      ID1       ID2
     1.37930799E-01    2     1000002        -1   # BR(~chi_2+ -> ~u_L     db)
     1.37923640E-01    2    -1000001         2   # BR(~chi_2+ -> ~d_L*    u )
     1.37930799E-01    2     1000004        -3   # BR(~chi_2+ -> ~c_L     sb)
     1.37923640E-01    2    -1000003         4   # BR(~chi_2+ -> ~s_L*    c )
     1.65610950E-01    2     1000006        -5   # BR(~chi_2+ -> ~t_1     bb)
     1.64050108E-01    2    -1000005         6   # BR(~chi_2+ -> ~b_1*    t )
     5.25349798E-04    2    -2000005         6   # BR(~chi_2+ -> ~b_2*    t )
     2.78195841E-07    2     1000012       -11   # BR(~chi_2+ -> ~nu_eL   e+  )
     2.78195841E-07    2     1000014       -13   # BR(~chi_2+ -> ~nu_muL  mu+ )
     2.01566848E-07    2     1000016       -15   # BR(~chi_2+ -> ~nu_tau1 tau+)
     1.82830966E-07    2    -1000011        12   # BR(~chi_2+ -> ~e_L+    nu_e)
     1.82830966E-07    2    -1000013        14   # BR(~chi_2+ -> ~mu_L+   nu_mu)
     1.04611964E-07    2    -1000015        16   # BR(~chi_2+ -> ~tau_1+  nu_tau)
     7.96000349E-08    2    -2000015        16   # BR(~chi_2+ -> ~tau_2+  nu_tau)
     2.45308200E-02    2     1000024        23   # BR(~chi_2+ -> ~chi_1+  Z )
     1.87436590E-02    2     1000022        24   # BR(~chi_2+ -> ~chi_10  W+)
     2.38069413E-02    2     1000023        24   # BR(~chi_2+ -> ~chi_20  W+)
     5.46568432E-03    2     1000025        24   # BR(~chi_2+ -> ~chi_30  W+)
     2.42243450E-02    2     1000024        25   # BR(~chi_2+ -> ~chi_1+  h )
     5.29765390E-03    2     1000024        35   # BR(~chi_2+ -> ~chi_1+  H )
     5.37857127E-03    2     1000024        36   # BR(~chi_2+ -> ~chi_1+  A )
     4.43000505E-03    2     1000022        37   # BR(~chi_2+ -> ~chi_10  H+)
     5.29041268E-03    2     1000023        37   # BR(~chi_2+ -> ~chi_20  H+)
     9.35314077E-04    2     1000025        37   # BR(~chi_2+ -> ~chi_30  H+)
     8.05709883E-10    2     1000039        24   # BR(~chi_2+ -> ~G       W+)
     4.41984916E-15    2     1000039        37   # BR(~chi_2+ -> ~G       H+)
#
#         PDG            Width
DECAY   1000022     2.64517580E-12   # neutralino1 decays
#          BR         NDA      ID1       ID2
     3.32476760E-01    2     1000039        22   # BR(~chi_10 -> ~G        gam)
     1.01964454E-01    2     1000039        23   # BR(~chi_10 -> ~G        Z)
     5.65558787E-01    2     1000039        25   # BR(~chi_10 -> ~G        h)
#
#         PDG            Width
DECAY   1000023     4.16706592E-08   # neutralino2 decays
#          BR         NDA      ID1       ID2
     2.32520227E-02    2     1000022        22   # BR(~chi_20 -> ~chi_10 gam)
#          BR         NDA      ID1       ID2
     2.69100989E-07    2     1000039        22   # BR(~chi_20 -> ~G        gam)
     6.21870026E-05    2     1000039        23   # BR(~chi_20 -> ~G        Z)
     2.07447755E-06    2     1000039        25   # BR(~chi_20 -> ~G        h)
#           BR         NDA      ID1       ID2       ID3
     1.35081609E-01    3     1000022        -2         2   # BR(~chi_20 -> ~chi_10 ub      u)
     1.74665508E-01    3     1000022        -1         1   # BR(~chi_20 -> ~chi_10 db      d)
     1.35081609E-01    3     1000022        -4         4   # BR(~chi_20 -> ~chi_10 cb      c)
     1.74665508E-01    3     1000022        -3         3   # BR(~chi_20 -> ~chi_10 sb      s)
     3.97900678E-02    3     1000022       -11        11   # BR(~chi_20 -> ~chi_10 e+      e-)
     3.97900678E-02    3     1000022       -13        13   # BR(~chi_20 -> ~chi_10 mu+     mu-)
     3.12782297E-02    3     1000022       -15        15   # BR(~chi_20 -> ~chi_10 tau+    tau-)
     7.93920584E-02    3     1000022       -12        12   # BR(~chi_20 -> ~chi_10 nu_eb   nu_e)
     7.93920584E-02    3     1000022       -14        14   # BR(~chi_20 -> ~chi_10 nu_mub  nu_mu)
     7.93920584E-02    3     1000022       -16        16   # BR(~chi_20 -> ~chi_10 nu_taub nu_tau)
     1.50730380E-03    3     1000024        -2         1   # BR(~chi_20 -> ~chi_1+ ub      d)
     1.50730380E-03    3    -1000024        -1         2   # BR(~chi_20 -> ~chi_1- db      u)
     1.50730380E-03    3     1000024        -4         3   # BR(~chi_20 -> ~chi_1+ cb      s)
     1.50730380E-03    3    -1000024        -3         4   # BR(~chi_20 -> ~chi_1- sb      c)
     5.02430698E-04    3     1000024       -12        11   # BR(~chi_20 -> ~chi_1+ nu_eb   e-)
     5.02430698E-04    3    -1000024        12       -11   # BR(~chi_20 -> ~chi_1- nu_e    e+)
     5.02430698E-04    3     1000024       -14        13   # BR(~chi_20 -> ~chi_1+ nu_mub  mu-)
     5.02430698E-04    3    -1000024        14       -13   # BR(~chi_20 -> ~chi_1- nu_mu   mu+)
     5.78675004E-05    3     1000024       -16        15   # BR(~chi_20 -> ~chi_1+ nu_taub tau-)
     5.78675004E-05    3    -1000024        16       -15   # BR(~chi_20 -> ~chi_1- nu_tau  tau+)
#
#         PDG            Width
DECAY   1000025     2.60726103E-06   # neutralino3 decays
#          BR         NDA      ID1       ID2
     7.79682244E-01    2     1000022        22   # BR(~chi_30 -> ~chi_10 gam)
     2.44574405E-02    2     1000023        22   # BR(~chi_30 -> ~chi_20 gam)
#          BR         NDA      ID1       ID2
     2.01347570E-06    2     1000039        22   # BR(~chi_30 -> ~G        gam)
     4.97852469E-07    2     1000039        23   # BR(~chi_30 -> ~G        Z)
     2.05776270E-07    2     1000039        25   # BR(~chi_30 -> ~G        h)
#           BR         NDA      ID1       ID2       ID3
     9.00249913E-04    3     1000022        -2         2   # BR(~chi_30 -> ~chi_10 ub      u)
     1.19177211E-03    3     1000022        -1         1   # BR(~chi_30 -> ~chi_10 db      d)
     9.00249913E-04    3     1000022        -4         4   # BR(~chi_30 -> ~chi_10 cb      c)
     1.19177211E-03    3     1000022        -3         3   # BR(~chi_30 -> ~chi_10 sb      s)
     6.63793107E-04    3     1000022        -5         5   # BR(~chi_30 -> ~chi_10 bb      b)
     2.77347204E-04    3     1000022       -11        11   # BR(~chi_30 -> ~chi_10 e+      e-)
     2.77347204E-04    3     1000022       -13        13   # BR(~chi_30 -> ~chi_10 mu+     mu-)
     2.52380511E-04    3     1000022       -15        15   # BR(~chi_30 -> ~chi_10 tau+    tau-)
     5.32217835E-04    3     1000022       -12        12   # BR(~chi_30 -> ~chi_10 nu_eb   nu_e)
     5.32217835E-04    3     1000022       -14        14   # BR(~chi_30 -> ~chi_10 nu_mub  nu_mu)
     5.32217835E-04    3     1000022       -16        16   # BR(~chi_30 -> ~chi_10 nu_taub nu_tau)
     3.00533380E-03    3     1000023        -2         2   # BR(~chi_30 -> ~chi_20 ub      u)
     3.88730153E-03    3     1000023        -1         1   # BR(~chi_30 -> ~chi_20 db      d)
     3.00533380E-03    3     1000023        -4         4   # BR(~chi_30 -> ~chi_20 cb      c)
     3.88730153E-03    3     1000023        -3         3   # BR(~chi_30 -> ~chi_20 sb      s)
     7.48376433E-04    3     1000023        -5         5   # BR(~chi_30 -> ~chi_20 bb      b)
     8.85582338E-04    3     1000023       -11        11   # BR(~chi_30 -> ~chi_20 e+      e-)
     8.85582338E-04    3     1000023       -13        13   # BR(~chi_30 -> ~chi_20 mu+     mu-)
     7.94656525E-04    3     1000023       -15        15   # BR(~chi_30 -> ~chi_20 tau+    tau-)
     1.76595735E-03    3     1000023       -12        12   # BR(~chi_30 -> ~chi_20 nu_eb   nu_e)
     1.76595735E-03    3     1000023       -14        14   # BR(~chi_30 -> ~chi_20 nu_mub  nu_mu)
     1.76595735E-03    3     1000023       -16        16   # BR(~chi_30 -> ~chi_20 nu_taub nu_tau)
     2.78893835E-02    3     1000024        -2         1   # BR(~chi_30 -> ~chi_1+ ub      d)
     2.78893835E-02    3    -1000024        -1         2   # BR(~chi_30 -> ~chi_1- db      u)
     2.78893835E-02    3     1000024        -4         3   # BR(~chi_30 -> ~chi_1+ cb      s)
     2.78893835E-02    3    -1000024        -3         4   # BR(~chi_30 -> ~chi_1- sb      c)
     9.29427252E-03    3     1000024       -12        11   # BR(~chi_30 -> ~chi_1+ nu_eb   e-)
     9.29427252E-03    3    -1000024        12       -11   # BR(~chi_30 -> ~chi_1- nu_e    e+)
     9.29427252E-03    3     1000024       -14        13   # BR(~chi_30 -> ~chi_1+ nu_mub  mu-)
     9.29427252E-03    3    -1000024        14       -13   # BR(~chi_30 -> ~chi_1- nu_mu   mu+)
     8.73703430E-03    3     1000024       -16        15   # BR(~chi_30 -> ~chi_1+ nu_taub tau-)
     8.73703430E-03    3    -1000024        16       -15   # BR(~chi_30 -> ~chi_1- nu_tau  tau+)
#
#         PDG            Width
DECAY   1000035     1.52413116E+02   # neutralino4 decays
#          BR         NDA      ID1       ID2
     1.83467891E-02    2     1000022        23   # BR(~chi_40 -> ~chi_10   Z )
     1.61681735E-03    2     1000023        23   # BR(~chi_40 -> ~chi_20   Z )
     4.61021426E-03    2     1000025        23   # BR(~chi_40 -> ~chi_30   Z )
     2.39652853E-02    2     1000024       -24   # BR(~chi_40 -> ~chi_1+   W-)
     2.39652853E-02    2    -1000024        24   # BR(~chi_40 -> ~chi_1-   W+)
     8.20688766E-04    2     1000022        25   # BR(~chi_40 -> ~chi_10   h )
     4.35681335E-03    2     1000022        35   # BR(~chi_40 -> ~chi_10   H )
     3.93350996E-05    2     1000022        36   # BR(~chi_40 -> ~chi_10   A )
     2.24814884E-02    2     1000023        25   # BR(~chi_40 -> ~chi_20   h )
     2.90835770E-05    2     1000023        35   # BR(~chi_40 -> ~chi_20   H )
     5.29695756E-03    2     1000023        36   # BR(~chi_40 -> ~chi_20   A )
     9.66975443E-04    2     1000025        25   # BR(~chi_40 -> ~chi_30   h )
     9.27437718E-04    2     1000025        35   # BR(~chi_40 -> ~chi_30   H )
     2.74581841E-07    2     1000025        36   # BR(~chi_40 -> ~chi_30   A )
     5.34137040E-03    2     1000024       -37   # BR(~chi_40 -> ~chi_1+   H-)
     5.34137040E-03    2    -1000024        37   # BR(~chi_40 -> ~chi_1-   H+)
     6.85442211E-02    2     1000002        -2   # BR(~chi_40 -> ~u_L      ub)
     6.85442211E-02    2    -1000002         2   # BR(~chi_40 -> ~u_L*     u )
     5.91296089E-12    2     2000002        -2   # BR(~chi_40 -> ~u_R      ub)
     5.91296089E-12    2    -2000002         2   # BR(~chi_40 -> ~u_R*     u )
     6.85215770E-02    2     1000001        -1   # BR(~chi_40 -> ~d_L      db)
     6.85215770E-02    2    -1000001         1   # BR(~chi_40 -> ~d_L*     d )
     3.29180118E-09    2     2000001        -1   # BR(~chi_40 -> ~d_R      db)
     3.29180118E-09    2    -2000001         1   # BR(~chi_40 -> ~d_R*     d )
     6.85442211E-02    2     1000004        -4   # BR(~chi_40 -> ~c_L      cb)
     6.85442211E-02    2    -1000004         4   # BR(~chi_40 -> ~c_L*     c )
     5.91296089E-12    2     2000004        -4   # BR(~chi_40 -> ~c_R      cb)
     5.91296089E-12    2    -2000004         4   # BR(~chi_40 -> ~c_R*     c )
     6.85215770E-02    2     1000003        -3   # BR(~chi_40 -> ~s_L      sb)
     6.85215770E-02    2    -1000003         3   # BR(~chi_40 -> ~s_L*     s )
     3.29180118E-09    2     2000003        -3   # BR(~chi_40 -> ~s_R      sb)
     3.29180118E-09    2    -2000003         3   # BR(~chi_40 -> ~s_R*     s )
     8.17976560E-02    2     1000006        -6   # BR(~chi_40 -> ~t_1      tb)
     8.17976560E-02    2    -1000006         6   # BR(~chi_40 -> ~t_1*     t )
     8.30263095E-02    2     1000005        -5   # BR(~chi_40 -> ~b_1      bb)
     8.30263095E-02    2    -1000005         5   # BR(~chi_40 -> ~b_1*     b )
     2.67240167E-04    2     2000005        -5   # BR(~chi_40 -> ~b_2      bb)
     2.67240167E-04    2    -2000005         5   # BR(~chi_40 -> ~b_2*     b )
     9.13671336E-08    2     1000011       -11   # BR(~chi_40 -> ~e_L-     e+)
     9.13671336E-08    2    -1000011        11   # BR(~chi_40 -> ~e_L+     e-)
     4.01313965E-14    2     2000011       -11   # BR(~chi_40 -> ~e_R-     e+)
     4.01313965E-14    2    -2000011        11   # BR(~chi_40 -> ~e_R+     e-)
     9.13671336E-08    2     1000013       -13   # BR(~chi_40 -> ~mu_L-    mu+)
     9.13671336E-08    2    -1000013        13   # BR(~chi_40 -> ~mu_L+    mu-)
     4.01313965E-14    2     2000013       -13   # BR(~chi_40 -> ~mu_R-    mu+)
     4.01313965E-14    2    -2000013        13   # BR(~chi_40 -> ~mu_R+    mu-)
     3.28066594E-08    2     1000015       -15   # BR(~chi_40 -> ~tau_1-   tau+)
     3.28066594E-08    2    -1000015        15   # BR(~chi_40 -> ~tau_1+   tau-)
     1.46730979E-08    2     2000015       -15   # BR(~chi_40 -> ~tau_2-   tau+)
     1.46730979E-08    2    -2000015        15   # BR(~chi_40 -> ~tau_2+   tau-)
     1.39304532E-07    2     1000012       -12   # BR(~chi_40 -> ~nu_eL    nu_eb)
     1.39304532E-07    2    -1000012        12   # BR(~chi_40 -> ~nu_eL*   nu_e )
     1.39304532E-07    2     1000014       -14   # BR(~chi_40 -> ~nu_muL   nu_mub)
     1.39304532E-07    2    -1000014        14   # BR(~chi_40 -> ~nu_muL*  nu_mu )
     1.39304532E-07    2     1000016       -16   # BR(~chi_40 -> ~nu_tau1  nu_taub)
     1.39304532E-07    2    -1000016        16   # BR(~chi_40 -> ~nu_tau1* nu_tau )
     1.91680521E-10    2     1000039        22   # BR(~chi_40 -> ~G        gam)
     6.13979871E-10    2     1000039        23   # BR(~chi_40 -> ~G        Z)
     6.22742073E-14    2     1000039        25   # BR(~chi_40 -> ~G        h)
     4.34853679E-15    2     1000039        35   # BR(~chi_40 -> ~G        H)
     2.10585630E-17    2     1000039        36   # BR(~chi_40 -> ~G        A)
#
#         PDG            Width
DECAY        25     3.16885083E-03   # h decays
#          BR         NDA      ID1       ID2
     7.39412758E-01    2           5        -5   # BR(h -> b       bb     )
     7.55117942E-02    2         -15        15   # BR(h -> tau+    tau-   )
     2.67342607E-04    2         -13        13   # BR(h -> mu+     mu-    )
     5.75894231E-04    2           3        -3   # BR(h -> s       sb     )
     2.48883664E-02    2           4        -4   # BR(h -> c       cb     )
     6.88357514E-02    2          21        21   # BR(h -> g       g      )
     2.10301872E-03    2          22        22   # BR(h -> gam     gam    )
     7.00807733E-04    2          22        23   # BR(h -> Z       gam    )
     7.94003678E-02    2          24       -24   # BR(h -> W+      W-     )
     8.30389934E-03    2          23        23   # BR(h -> Z       Z      )
#
#         PDG            Width
DECAY        35     4.07191648E+01   # H decays
#          BR         NDA      ID1       ID2
     1.39374951E-03    2           5        -5   # BR(H -> b       bb     )
     2.28932149E-04    2         -15        15   # BR(H -> tau+    tau-   )
     8.09360378E-07    2         -13        13   # BR(H -> mu+     mu-    )
     1.03648508E-06    2           3        -3   # BR(H -> s       sb     )
     9.33807464E-06    2           4        -4   # BR(H -> c       cb     )
     9.47809615E-01    2           6        -6   # BR(H -> t       tb     )
     7.32243262E-04    2          21        21   # BR(H -> g       g      )
     2.31898684E-06    2          22        22   # BR(H -> gam     gam    )
     1.11486712E-06    2          23        22   # BR(H -> Z       gam    )
     2.09310565E-04    2          24       -24   # BR(H -> W+      W-     )
     1.04369926E-04    2          23        23   # BR(H -> Z       Z      )
     7.28756467E-04    2          25        25   # BR(H -> h       h      )
     1.14072415E-23    2          36        36   # BR(H -> A       A      )
     2.43201698E-11    2          23        36   # BR(H -> Z       A      )
     1.88172268E-12    2          24       -37   # BR(H -> W+      H-     )
     1.88172268E-12    2         -24        37   # BR(H -> W-      H+     )
     1.06834135E-04    2     1000024  -1000024   # BR(H -> ~chi_1+ ~chi_1-)
     1.52346235E-02    2     1000022   1000022   # BR(H -> ~chi_10 ~chi_10)
     4.52372035E-05    2     1000023   1000023   # BR(H -> ~chi_20 ~chi_20)
     1.30080400E-02    2     1000025   1000025   # BR(H -> ~chi_30 ~chi_30)
     1.12538884E-05    2     1000022   1000023   # BR(H -> ~chi_10 ~chi_20)
     1.76269387E-02    2     1000022   1000025   # BR(H -> ~chi_10 ~chi_30)
     2.61587144E-03    2     1000023   1000025   # BR(H -> ~chi_20 ~chi_30)
     2.51430747E-05    2     1000002  -1000002   # BR(H -> ~u_L    ~u_L*  )
     2.51430747E-05    2     1000004  -1000004   # BR(H -> ~c_L    ~c_L*  )
     2.62178078E-05    2     1000001  -1000001   # BR(H -> ~d_L    ~d_L*  )
     9.23032738E-07    2     2000001  -2000001   # BR(H -> ~d_R    ~d_R*  )
     2.62178078E-05    2     1000003  -1000003   # BR(H -> ~s_L    ~s_L*  )
     9.23032738E-07    2     2000003  -2000003   # BR(H -> ~s_R    ~s_R*  )
     2.50381537E-05    2     1000005  -1000005   # BR(H -> ~b_1    ~b_1*  )
#
#         PDG            Width
DECAY        36     4.12502907E+01   # A decays
#          BR         NDA      ID1       ID2
     1.39334086E-03    2           5        -5   # BR(A -> b       bb     )
     2.26088501E-04    2         -15        15   # BR(A -> tau+    tau-   )
     7.99304525E-07    2         -13        13   # BR(A -> mu+     mu-    )
     1.05397166E-06    2           3        -3   # BR(A -> s       sb     )
     9.23621755E-06    2           4        -4   # BR(A -> c       cb     )
     9.48769690E-01    2           6        -6   # BR(A -> t       tb     )
     9.04839927E-04    2          21        21   # BR(A -> g       g      )
     3.19055225E-06    2          22        22   # BR(A -> gam     gam    )
     1.29840569E-06    2          23        22   # BR(A -> Z       gam    )
     2.04067079E-04    2          23        25   # BR(A -> Z       h      )
     6.18944232E-04    2     1000024  -1000024   # BR(A -> ~chi_1+ ~chi_1-)
     8.96803932E-04    2     1000022   1000022   # BR(A -> ~chi_10 ~chi_10)
     1.31421761E-03    2     1000023   1000023   # BR(A -> ~chi_20 ~chi_20)
     8.89931230E-05    2     1000025   1000025   # BR(A -> ~chi_30 ~chi_30)
     8.10842922E-03    2     1000022   1000023   # BR(A -> ~chi_10 ~chi_20)
     1.51357293E-03    2     1000022   1000025   # BR(A -> ~chi_10 ~chi_30)
     3.59454339E-02    2     1000023   1000025   # BR(A -> ~chi_20 ~chi_30)
#
#         PDG            Width
DECAY        37     4.04228580E+01   # H+ decays
#          BR         NDA      ID1       ID2
     2.23851703E-06    2           4        -5   # BR(H+ -> c       bb     )
     2.30941393E-04    2         -15        16   # BR(H+ -> tau+    nu_tau )
     8.16461247E-07    2         -13        14   # BR(H+ -> mu+     nu_mu  )
     1.42339399E-08    2           2        -5   # BR(H+ -> u       bb     )
     5.05715587E-08    2           2        -3   # BR(H+ -> u       sb     )
     1.00765743E-05    2           4        -3   # BR(H+ -> c       sb     )
     9.50566855E-01    2           6        -5   # BR(H+ -> t       bb     )
     2.09149964E-04    2          24        25   # BR(H+ -> W+      h      )
     9.17921766E-13    2          24        36   # BR(H+ -> W+      A      )
     8.59490388E-03    2     1000024   1000022   # BR(H+ -> ~chi_1+ ~chi_10)
     1.80826154E-04    2     1000024   1000023   # BR(H+ -> ~chi_1+ ~chi_20)
     4.01296543E-02    2     1000024   1000025   # BR(H+ -> ~chi_1+ ~chi_30)
     3.72366842E-05    2     1000002  -1000001   # BR(H+ -> ~u_L    ~d_L*  )
     3.72366842E-05    2     1000004  -1000003   # BR(H+ -> ~c_L    ~s_L*  )
