#  ISAJET SUSY parameters in SUSY Les Houches Accord 2 format
#  Created by ISALHA 2.0 Last revision: C. Balazs 21 Apr 2009
Block SPINFO   # Program information
     1   ISASUGRA from ISAJET          # Spectrum Calculator
     2   7.80   29-OCT-2009 12:50:36   # Version number
Block MODSEL   # Model selection
     1     1   # Minimal supergravity (mSUGRA) model               
Block SMINPUTS   # Standard Model inputs
     1     1.27845200E+02   # alpha_em^(-1)
     2     1.16570000E-05   # G_Fermi
     3     1.17200002E-01   # alpha_s(M_Z)
     4     9.11699982E+01   # m_{Z}(pole)
     5     4.19999981E+00   # m_{b}(m_{b})
     6     1.72500000E+02   # m_{top}(pole)
     7     1.77699995E+00   # m_{tau}(pole)
Block MINPAR   # SUSY breaking input parameters
     1     4.40000000E+02   # m_0
     2     1.00000000E+02   # m_{1/2}
     3     4.00000000E+01   # tan(beta)
     4     1.00000000E+00   # sign(mu)
     5    -5.00000000E+02   # A_0
Block EXTPAR   # Non-universal SUSY breaking parameters
     0     2.99543153E+16   # Input scale
Block MASS   # Scalar and gaugino mass spectrum
#  PDG code   mass                 particle
        24     8.04229965E+01   #  W^+
        25     1.07026649E+02   #  h^0            
        35     3.26559784E+02   #  H^0            
        36     3.24553406E+02   #  A^0            
        37     3.37546967E+02   #  H^+            
   1000001     4.97258606E+02   #  dnl            
   1000002     4.90664429E+02   #  upl            
   1000003     4.97258698E+02   #  stl            
   1000004     4.90666351E+02   #  chl            
   1000005     3.42508881E+02   #  b1             
   1000006     2.43814651E+02   #  t1             
   1000011     4.46148224E+02   #  el-            
   1000012     4.38784515E+02   #  nuel           
   1000013     4.46148254E+02   #  mul-           
   1000014     4.38784515E+02   #  numl           
   1000015     3.30953522E+02   #  tau1           
   1000016     3.90976379E+02   #  nutl           
   1000021     2.89945068E+02   #  glss           
   1000022     3.85669365E+01   #  z1ss           
   1000023     7.14920959E+01   #  z2ss           
   1000024     7.15806732E+01   #  w1ss           
   1000025    -2.56188538E+02   #  z3ss           
   1000035     2.69104065E+02   #  z4ss           
   1000037     2.70859802E+02   #  w2ss           
   2000001     4.92685364E+02   #  dnr            
   2000002     4.90798828E+02   #  upr            
   2000003     4.92685394E+02   #  str            
   2000004     4.90800720E+02   #  chr            
   2000005     4.24111877E+02   #  b2             
   2000006     4.20672577E+02   #  t2             
   2000011     4.43131989E+02   #  er-            
   2000013     4.43131989E+02   #  mur-           
   2000015     4.07670776E+02   #  tau2           
Block ALPHA   # Effective Higgs mixing parameter
         -2.53156424E-02   # alpha
Block STOPMIX   # stop mixing matrix
  1  1     5.28291166E-01   # O_{11}
  1  2     8.49063277E-01   # O_{12}
  2  1    -8.49063277E-01   # O_{21}
  2  2     5.28291166E-01   # O_{22}
Block SBOTMIX   # sbottom mixing matrix
  1  1     9.06219244E-01   # O_{11}
  1  2     4.22808051E-01   # O_{12}
  2  1    -4.22808051E-01   # O_{21}
  2  2     9.06219244E-01   # O_{22}
Block STAUMIX   # stau mixing matrix
  1  1     3.50663990E-01   # O_{11}
  1  2     9.36501324E-01   # O_{12}
  2  1    -9.36501324E-01   # O_{21}
  2  2     3.50663990E-01   # O_{22}
Block NMIX   # neutralino mixing matrix
  1  1    -9.74546552E-01   #
  1  2     8.05808306E-02   #
  1  3    -2.05916062E-01   #
  1  4     3.69377397E-02   #
  2  1    -1.45500198E-01   #
  2  2    -9.36186969E-01   #
  2  3     3.04780066E-01   #
  2  4    -9.74300951E-02   #
  3  1    -1.02685325E-01   #
  3  2     1.62415802E-01   #
  3  3     6.76985919E-01   #
  3  4     7.10469365E-01   #
  4  1     1.36178330E-01   #
  4  2    -3.01133931E-01   #
  4  3    -6.37493074E-01   #
  4  4     6.95971429E-01   #
Block UMIX   # chargino U mixing matrix
  1  1    -8.93918931E-01   # U_{11}
  1  2     4.48228717E-01   # U_{12}
  2  1    -4.48228717E-01   # U_{21}
  2  2    -8.93918931E-01   # U_{22}
Block VMIX   # chargino V mixing matrix
  1  1    -9.89435256E-01   # V_{11}
  1  2     1.44975245E-01   # V_{12}
  2  1    -1.44975245E-01   # V_{21}
  2  2    -9.89435256E-01   # V_{22}
Block GAUGE Q=  2.94595795E+02   #
     1     3.57497513E-01   # g`
     2     6.52446628E-01   # g_2
     3     1.22075188E+00   # g_3
Block YU Q=  2.94595795E+02   #
  3  3     8.94265592E-01   # y_t
Block YD Q=  2.94595795E+02   #
  3  3     5.24915695E-01   # y_b
Block YE Q=  2.94595795E+02   #
  3  3     4.11213577E-01   # y_tau
Block HMIX Q=  2.94595795E+02   # Higgs mixing parameters
     1     2.44686356E+02   # mu(Q)
     2     4.00000000E+01   # tan(beta)(M_GUT)
     3     2.50101166E+02   # Higgs vev at Q
     4     1.05334914E+05   # m_A^2(Q)
Block MSOFT Q=  2.94595795E+02   # DRbar SUSY breaking parameters
     1     4.04961662E+01   # M_1(Q)          
     2     7.76717987E+01   # M_2(Q)          
     3     2.53326157E+02   # M_3(Q)          
    31     4.42812073E+02   # MeL(Q)          
    32     4.42812073E+02   # MmuL(Q)         
    33     3.96063416E+02   # MtauL(Q)        
    34     4.40629822E+02   # MeR(Q)          
    35     4.40629822E+02   # MmuR(Q)         
    36     3.39124084E+02   # MtauR(Q)        
    41     4.81448547E+02   # MqL1(Q)         
    42     4.81448547E+02   # MqL2(Q)         
    43     3.41388916E+02   # MqL3(Q)         
    44     4.79936432E+02   # MuR(Q)          
    45     4.79936432E+02   # McR(Q)          
    46     2.54216461E+02   # MtR(Q)          
    47     4.79821747E+02   # MdR(Q)          
    48     4.79821747E+02   # MsR(Q)          
    49     4.03303375E+02   # MbR(Q)          
Block AU Q=  2.94595795E+02   #
  1  1    -3.39515167E+02   # A_u
  2  2    -3.39515167E+02   # A_c
  3  3    -3.39515167E+02   # A_t
Block AD Q=  2.94595795E+02   #
  1  1    -5.63387024E+02   # A_d
  2  2    -5.63387024E+02   # A_s
  3  3    -5.63387024E+02   # A_b
Block AE Q=  2.94595795E+02   #
  1  1    -3.75031921E+02   # A_e
  2  2    -3.75031921E+02   # A_mu
  3  3    -3.75031921E+02   # A_tau
#  ISAJET decay tables in SUSY Les Houches accord format
#  Created by ISALHD. Last revision: C. Balazs, 2005 May 25
Block DCINFO                           # Program information
     1   ISASUGRA from ISAJET          # Spectrum Calculator
     2   7.80   29-OCT-2009 12:50:36   # Version number
#         PDG         Width
DECAY         6  1.14680779E+00   # TP    decays
#          BR          NDA       ID1       ID2       ID3       ID4
      3.33333343E-01    3            2        -1         5             # TP     -->  UP     DB     BT          
      3.33333343E-01    3            4        -3         5             # TP     -->  CH     SB     BT          
      1.11111112E-01    3          -11        12         5             # TP     -->  E+     NUE    BT          
      1.11111112E-01    3          -13        14         5             # TP     -->  MU+    NUM    BT          
      1.11111112E-01    3          -15        16         5             # TP     -->  TAU+   NUT    BT          
#         PDG         Width
DECAY   1000021  2.73096072E-03   # GLSS  decays
#          BR          NDA       ID1       ID2       ID3       ID4
      7.92971179E-02    3      1000024         1        -2             # GLSS   -->  W1SS+  DN     UB          
      7.92971179E-02    3     -1000024         2        -1             # GLSS   -->  W1SS-  UP     DB          
      7.92962611E-02    3      1000024         3        -4             # GLSS   -->  W1SS+  ST     CB          
      7.92962611E-02    3     -1000024         4        -3             # GLSS   -->  W1SS-  CH     SB          
      7.94474036E-03    3      1000024         5        -6             # GLSS   -->  W1SS+  BT     TB          
      7.94474036E-03    3     -1000024         6        -5             # GLSS   -->  W1SS-  TP     BB          
      3.24395018E-07    3      1000037         1        -2             # GLSS   -->  W2SS+  DN     UB          
      3.24395018E-07    3     -1000037         2        -1             # GLSS   -->  W2SS-  UP     DB          
      3.24393227E-07    3      1000037         3        -4             # GLSS   -->  W2SS+  ST     CB          
      3.24393227E-07    3     -1000037         4        -3             # GLSS   -->  W2SS-  CH     SB          
      1.05456274E-03    2      1000022        21                       # GLSS   -->  Z1SS   GL                 
      2.90313251E-02    3      1000022         2        -2             # GLSS   -->  Z1SS   UP     UB          
      1.05219949E-02    3      1000022         1        -1             # GLSS   -->  Z1SS   DN     DB          
      1.05219902E-02    3      1000022         3        -3             # GLSS   -->  Z1SS   ST     SB          
      2.90307980E-02    3      1000022         4        -4             # GLSS   -->  Z1SS   CH     CB          
      9.89007801E-02    3      1000022         5        -5             # GLSS   -->  Z1SS   BT     BB          
      5.97067829E-03    2      1000023        21                       # GLSS   -->  Z2SS   GL                 
      4.31701094E-02    3      1000023         2        -2             # GLSS   -->  Z2SS   UP     UB          
      3.58299352E-02    3      1000023         1        -1             # GLSS   -->  Z2SS   DN     DB          
      3.58299017E-02    3      1000023         3        -3             # GLSS   -->  Z2SS   ST     SB          
      4.31693010E-02    3      1000023         4        -4             # GLSS   -->  Z2SS   CH     CB          
      3.22495162E-01    3      1000023         5        -5             # GLSS   -->  Z2SS   BT     BB          
      9.35406948E-04    2      1000025        21                       # GLSS   -->  Z3SS   GL                 
      2.42659269E-07    3      1000025         2        -2             # GLSS   -->  Z3SS   UP     UB          
      2.93550301E-07    3      1000025         1        -1             # GLSS   -->  Z3SS   DN     DB          
      2.93549959E-07    3      1000025         3        -3             # GLSS   -->  Z3SS   ST     SB          
      2.42653726E-07    3      1000025         4        -4             # GLSS   -->  Z3SS   CH     CB          
      1.67081482E-04    3      1000025         5        -5             # GLSS   -->  Z3SS   BT     BB          
      2.77246581E-04    2      1000035        21                       # GLSS   -->  Z4SS   GL                 
      2.38253264E-07    3      1000035         2        -2             # GLSS   -->  Z4SS   UP     UB          
      2.78323625E-07    3      1000035         1        -1             # GLSS   -->  Z4SS   DN     DB          
      2.78323341E-07    3      1000035         3        -3             # GLSS   -->  Z4SS   ST     SB          
      2.38247736E-07    3      1000035         4        -4             # GLSS   -->  Z4SS   CH     CB          
      1.40748753E-05    3      1000035         5        -5             # GLSS   -->  Z4SS   BT     BB          
#         PDG         Width
DECAY   1000002  1.96363544E+01   # UPL   decays
#          BR          NDA       ID1       ID2       ID3       ID4
      9.96956602E-04    2      1000022         2                       # UPL    -->  Z1SS   UP                 
      9.34133232E-02    2      1000023         2                       # UPL    -->  Z2SS   UP                 
      1.14760373E-03    2      1000025         2                       # UPL    -->  Z3SS   UP                 
      3.92233487E-03    2      1000035         2                       # UPL    -->  Z4SS   UP                 
      7.01115072E-01    2      1000021         2                       # UPL    -->  GLSS   UP                 
      1.97267383E-01    2      1000024         1                       # UPL    -->  W1SS+  DN                 
      2.13725516E-03    2      1000037         1                       # UPL    -->  W2SS+  DN                 
#         PDG         Width
DECAY   1000001  1.99003620E+01   # DNL   decays
#          BR          NDA       ID1       ID2       ID3       ID4
      6.97766244E-03    2      1000022         1                       # DNL    -->  Z1SS   DN                 
      8.34498256E-02    2      1000023         1                       # DNL    -->  Z2SS   DN                 
      1.86401408E-03    2      1000025         1                       # DNL    -->  Z3SS   DN                 
      5.59225166E-03    2      1000035         1                       # DNL    -->  Z4SS   DN                 
      7.20009267E-01    2      1000021         1                       # DNL    -->  GLSS   DN                 
      1.61202550E-01    2     -1000024         2                       # DNL    -->  W1SS-  UP                 
      2.09044218E-02    2     -1000037         2                       # DNL    -->  W2SS-  UP                 
#         PDG         Width
DECAY   1000003  1.99003067E+01   # STL   decays
#          BR          NDA       ID1       ID2       ID3       ID4
      6.97768247E-03    2      1000022         3                       # STL    -->  Z1SS   ST                 
      8.34500715E-02    2      1000023         3                       # STL    -->  Z2SS   ST                 
      1.86402001E-03    2      1000025         3                       # STL    -->  Z3SS   ST                 
      5.59227029E-03    2      1000035         3                       # STL    -->  Z4SS   ST                 
      7.20011652E-01    2      1000021         3                       # STL    -->  GLSS   ST                 
      1.61200538E-01    2     -1000024         4                       # STL    -->  W1SS-  CH                 
      2.09038649E-02    2     -1000037         4                       # STL    -->  W2SS-  CH                 
#         PDG         Width
DECAY   1000004  1.96360188E+01   # CHL   decays
#          BR          NDA       ID1       ID2       ID3       ID4
      9.96962423E-04    2      1000022         4                       # CHL    -->  Z1SS   CH                 
      9.34138447E-02    2      1000023         4                       # CHL    -->  Z2SS   CH                 
      1.14760175E-03    2      1000025         4                       # CHL    -->  Z3SS   CH                 
      3.92232276E-03    2      1000035         4                       # CHL    -->  Z4SS   CH                 
      7.01110303E-01    2      1000021         4                       # CHL    -->  GLSS   CH                 
      1.97271615E-01    2      1000024         3                       # CHL    -->  W1SS+  ST                 
      2.13731476E-03    2      1000037         3                       # CHL    -->  W2SS+  ST                 
#         PDG         Width
DECAY   1000005  5.24105930E+00   # BT1   decays
#          BR          NDA       ID1       ID2       ID3       ID4
      6.54812530E-02    2      1000022         5                       # BT1    -->  Z1SS   BT                 
      2.58439928E-01    2      1000023         5                       # BT1    -->  Z2SS   BT                 
      2.71916240E-02    2      1000025         5                       # BT1    -->  Z3SS   BT                 
      1.64779350E-02    2      1000035         5                       # BT1    -->  Z4SS   BT                 
      3.84263307E-01    2      1000021         5                       # BT1    -->  GLSS   BT                 
      2.22166702E-01    2     -1000024         6                       # BT1    -->  W1SS-  TP                 
      2.59792712E-02    2          -24   1000006                       # BT1    -->  W-     TP1                
#         PDG         Width
DECAY   1000006  9.58445966E-01   # TP1   decays
#          BR          NDA       ID1       ID2       ID3       ID4
      8.70305374E-02    2      1000022         6                       # TP1    -->  Z1SS   TP                 
      9.12969470E-01    2      1000024         5                       # TP1    -->  W1SS+  BT                 
#         PDG         Width
DECAY   2000002  1.48582954E+01   # UPR   decays
#          BR          NDA       ID1       ID2       ID3       ID4
      7.00448155E-02    2      1000022         2                       # UPR    -->  Z1SS   UP                 
      1.51443179E-03    2      1000023         2                       # UPR    -->  Z2SS   UP                 
      4.16748546E-04    2      1000025         2                       # UPR    -->  Z3SS   UP                 
      6.77297940E-04    2      1000035         2                       # UPR    -->  Z4SS   UP                 
      9.27346706E-01    2      1000021         2                       # UPR    -->  GLSS   UP                 
#         PDG         Width
DECAY   2000001  1.42103891E+01   # DNR   decays
#          BR          NDA       ID1       ID2       ID3       ID4
      1.83817297E-02    2      1000022         1                       # DNR    -->  Z1SS   DN                 
      3.97523487E-04    2      1000023         1                       # DNR    -->  Z2SS   DN                 
      1.09983135E-04    2      1000025         1                       # DNR    -->  Z3SS   DN                 
      1.78894974E-04    2      1000035         1                       # DNR    -->  Z4SS   DN                 
      9.80931878E-01    2      1000021         1                       # DNR    -->  GLSS   DN                 
#         PDG         Width
DECAY   2000003  1.42103901E+01   # STR   decays
#          BR          NDA       ID1       ID2       ID3       ID4
      1.83817316E-02    2      1000022         3                       # STR    -->  Z1SS   ST                 
      3.97523487E-04    2      1000023         3                       # STR    -->  Z2SS   ST                 
      1.09983157E-04    2      1000025         3                       # STR    -->  Z3SS   ST                 
      1.78894959E-04    2      1000035         3                       # STR    -->  Z4SS   ST                 
      9.80931878E-01    2      1000021         3                       # STR    -->  GLSS   ST                 
#         PDG         Width
DECAY   2000004  1.48579512E+01   # CHR   decays
#          BR          NDA       ID1       ID2       ID3       ID4
      7.00456351E-02    2      1000022         4                       # CHR    -->  Z1SS   CH                 
      1.51444937E-03    2      1000023         4                       # CHR    -->  Z2SS   CH                 
      4.16750321E-04    2      1000025         4                       # CHR    -->  Z3SS   CH                 
      6.77299686E-04    2      1000035         4                       # CHR    -->  Z4SS   CH                 
      9.27345872E-01    2      1000021         4                       # CHR    -->  GLSS   CH                 
#         PDG         Width
DECAY   2000005  9.64358807E+00   # BT2   decays
#          BR          NDA       ID1       ID2       ID3       ID4
      1.10801095E-02    2      1000022         5                       # BT2    -->  Z1SS   BT                 
      7.50083104E-03    2      1000023         5                       # BT2    -->  Z2SS   BT                 
      5.42288423E-02    2      1000025         5                       # BT2    -->  Z3SS   BT                 
      5.14781922E-02    2      1000035         5                       # BT2    -->  Z4SS   BT                 
      8.19746256E-01    2      1000021         5                       # BT2    -->  GLSS   BT                 
      1.90045475E-03    2     -1000024         6                       # BT2    -->  W1SS-  TP                 
      5.40654212E-02    2          -24   1000006                       # BT2    -->  W-     TP1                
#         PDG         Width
DECAY   2000006  5.35688829E+00   # TP2   decays
#          BR          NDA       ID1       ID2       ID3       ID4
      3.95052195E-01    2      1000024         5                       # TP2    -->  W1SS+  BT                 
      2.50919729E-01    2      1000037         5                       # TP2    -->  W2SS+  BT                 
      1.65092677E-01    2           23   1000006                       # TP2    -->  Z0     TP1                
      5.81717454E-02    2           25   1000006                       # TP2    -->  HL0    TP1                
      2.40765288E-02    2      1000022         6                       # TP2    -->  Z1SS   TP                 
      1.06686965E-01    2      1000023         6                       # TP2    -->  Z2SS   TP                 
#         PDG         Width
DECAY   1000011  5.42201233E+00   # EL-   decays
#          BR          NDA       ID1       ID2       ID3       ID4
      7.06536993E-02    2      1000022        11                       # EL-    -->  Z1SS   E-                 
      3.39513898E-01    2      1000023        11                       # EL-    -->  Z2SS   E-                 
      1.74766185E-03    2      1000025        11                       # EL-    -->  Z3SS   E-                 
      7.17821950E-03    2      1000035        11                       # EL-    -->  Z4SS   E-                 
      5.25418699E-01    2     -1000024        12                       # EL-    -->  W1SS-  NUE                
      5.54878525E-02    2     -1000037        12                       # EL-    -->  W2SS-  NUE                
#         PDG         Width
DECAY   1000013  5.42201281E+00   # MUL-  decays
#          BR          NDA       ID1       ID2       ID3       ID4
      7.06536844E-02    2      1000022        13                       # MUL-   -->  Z1SS   MU-                
      3.39513838E-01    2      1000023        13                       # MUL-   -->  Z2SS   MU-                
      1.74766139E-03    2      1000025        13                       # MUL-   -->  Z3SS   MU-                
      7.17821904E-03    2      1000035        13                       # MUL-   -->  Z4SS   MU-                
      5.25418639E-01    2     -1000024        14                       # MUL-   -->  W1SS-  NUM                
      5.54878637E-02    2     -1000037        14                       # MUL-   -->  W2SS-  NUM                
#         PDG         Width
DECAY   1000015  3.01993394E+00   # TAU1- decays
#          BR          NDA       ID1       ID2       ID3       ID4
      5.12087941E-01    2      1000022        15                       # TAU1-  -->  Z1SS   TAU-               
      1.58629075E-01    2      1000023        15                       # TAU1-  -->  Z2SS   TAU-               
      2.20079850E-02    2      1000025        15                       # TAU1-  -->  Z3SS   TAU-               
      1.11630531E-02    2      1000035        15                       # TAU1-  -->  Z4SS   TAU-               
      2.82012552E-01    2     -1000024        16                       # TAU1-  -->  W1SS-  NUT                
      1.40993847E-02    2     -1000037        16                       # TAU1-  -->  W2SS-  NUT                
#         PDG         Width
DECAY   1000012  5.56984615E+00   # NUEL  decays
#          BR          NDA       ID1       ID2       ID3       ID4
      1.23977907E-01    2      1000022        12                       # NUEL   -->  Z1SS   NUE                
      2.30365753E-01    2      1000023        12                       # NUEL   -->  Z2SS   NUE                
      6.89988164E-03    2      1000025        12                       # NUEL   -->  Z3SS   NUE                
      1.82447899E-02    2      1000035        12                       # NUEL   -->  Z4SS   NUE                
      6.15171611E-01    2      1000024        11                       # NUEL   -->  W1SS+  E-                 
      5.34002576E-03    2      1000037        11                       # NUEL   -->  W2SS+  E-                 
#         PDG         Width
DECAY   1000014  5.56984520E+00   # NUML  decays
#          BR          NDA       ID1       ID2       ID3       ID4
      1.23977929E-01    2      1000022        14                       # NUML   -->  Z1SS   NUM                
      2.30365798E-01    2      1000023        14                       # NUML   -->  Z2SS   NUM                
      6.89988304E-03    2      1000025        14                       # NUML   -->  Z3SS   NUM                
      1.82447936E-02    2      1000035        14                       # NUML   -->  Z4SS   NUM                
      6.15171552E-01    2      1000024        13                       # NUML   -->  W1SS+  MU-                
      5.34002529E-03    2      1000037        13                       # NUML   -->  W2SS+  MU-                
#         PDG         Width
DECAY   1000016  5.39349556E+00   # NUTL  decays
#          BR          NDA       ID1       ID2       ID3       ID4
      1.13621287E-01    2      1000022        16                       # NUTL   -->  Z1SS   NUT                
      2.08987907E-01    2      1000023        16                       # NUTL   -->  Z2SS   NUT                
      4.75915521E-03    2      1000025        16                       # NUTL   -->  Z3SS   NUT                
      1.19460542E-02    2      1000035        16                       # NUTL   -->  Z4SS   NUT                
      6.03661656E-01    2      1000024        15                       # NUTL   -->  W1SS+  TAU-               
      5.69690578E-02    2      1000037        15                       # NUTL   -->  W2SS+  TAU-               
      6.09615063E-06    3      1000015        16       -15             # NUTL   -->  TAU1-  NUT    TAU+        
      6.09615063E-06    3      1000015        12       -11             # NUTL   -->  TAU1-  NUE    E+          
      6.09615063E-06    3      1000015        14       -13             # NUTL   -->  TAU1-  NUM    MU+         
      1.82884523E-05    3      1000015         2        -1             # NUTL   -->  TAU1-  UP     DB          
      1.82884523E-05    3      1000015         4        -3             # NUTL   -->  TAU1-  CH     SB          
#         PDG         Width
DECAY   2000011  2.18075275E+00   # ER-   decays
#          BR          NDA       ID1       ID2       ID3       ID4
      9.66777146E-01    2      1000022        11                       # ER-    -->  Z1SS   E-                 
      2.07560677E-02    2      1000023        11                       # ER-    -->  Z2SS   E-                 
      4.83039767E-03    2      1000025        11                       # ER-    -->  Z3SS   E-                 
      7.63650844E-03    2      1000035        11                       # ER-    -->  Z4SS   E-                 
#         PDG         Width
DECAY   2000013  2.18075228E+00   # MUR-  decays
#          BR          NDA       ID1       ID2       ID3       ID4
      9.66777146E-01    2      1000022        13                       # MUR-   -->  Z1SS   MU-                
      2.07560696E-02    2      1000023        13                       # MUR-   -->  Z2SS   MU-                
      4.83039767E-03    2      1000025        13                       # MUR-   -->  Z3SS   MU-                
      7.63650751E-03    2      1000035        13                       # MUR-   -->  Z4SS   MU-                
#         PDG         Width
DECAY   2000015  4.55113411E+00   # TAU2- decays
#          BR          NDA       ID1       ID2       ID3       ID4
      1.04397587E-01    2      1000022        15                       # TAU2-  -->  Z1SS   TAU-               
      2.93599486E-01    2      1000023        15                       # TAU2-  -->  Z2SS   TAU-               
      6.41787797E-02    2      1000025        15                       # TAU2-  -->  Z3SS   TAU-               
      6.26245067E-02    2      1000035        15                       # TAU2-  -->  Z4SS   TAU-               
      3.85106623E-01    2     -1000024        16                       # TAU2-  -->  W1SS-  NUT                
      9.00930315E-02    2     -1000037        16                       # TAU2-  -->  W2SS-  NUT                
#         PDG         Width
DECAY   1000023  2.29052389E-07   # Z2SS  decays
#          BR          NDA       ID1       ID2       ID3       ID4
      3.03556747E-03    2      1000022        22                       # Z2SS   -->  Z1SS   GM                 
      1.24246038E-01    3      1000022         2        -2             # Z2SS   -->  Z1SS   UP     UB          
      1.73845917E-01    3      1000022         1        -1             # Z2SS   -->  Z1SS   DN     DB          
      1.73845902E-01    3      1000022         3        -3             # Z2SS   -->  Z1SS   ST     SB          
      1.24245919E-01    3      1000022         4        -4             # Z2SS   -->  Z1SS   CH     CB          
      2.42227614E-01    3      1000022         5        -5             # Z2SS   -->  Z1SS   BT     BB          
      1.45426439E-02    3      1000022        11       -11             # Z2SS   -->  Z1SS   E-     E+          
      1.45426458E-02    3      1000022        13       -13             # Z2SS   -->  Z1SS   MU-    MU+         
      3.74391563E-02    3      1000022        15       -15             # Z2SS   -->  Z1SS   TAU-   TAU+        
      3.28312069E-02    3      1000022        12       -12             # Z2SS   -->  Z1SS   NUE    ANUE        
      3.28312069E-02    3      1000022        14       -14             # Z2SS   -->  Z1SS   NUM    ANUM        
      2.63661295E-02    3      1000022        16       -16             # Z2SS   -->  Z1SS   NUT    ANUT        
#         PDG         Width
DECAY   1000025  1.34097052E+00   # Z3SS  decays
#          BR          NDA       ID1       ID2       ID3       ID4
      6.87900354E-07    2      1000022        22                       # Z3SS   -->  Z1SS   GM                 
      4.58907934E-09    2      1000023        22                       # Z3SS   -->  Z2SS   GM                 
      3.29853237E-01    2      1000024       -24                       # Z3SS   -->  W1SS+  W-                 
      3.29853237E-01    2     -1000024        24                       # Z3SS   -->  W1SS-  W+                 
      8.98147151E-02    2      1000022        23                       # Z3SS   -->  Z1SS   Z0                 
      1.79576769E-01    2      1000023        23                       # Z3SS   -->  Z2SS   Z0                 
      5.21430152E-08    3      1000022         2        -2             # Z3SS   -->  Z1SS   UP     UB          
      3.80728018E-08    3      1000022         1        -1             # Z3SS   -->  Z1SS   DN     DB          
      3.80727805E-08    3      1000022         3        -3             # Z3SS   -->  Z1SS   ST     SB          
      5.21420773E-08    3      1000022         4        -4             # Z3SS   -->  Z1SS   CH     CB          
      5.76103339E-05    3      1000022         5        -5             # Z3SS   -->  Z1SS   BT     BB          
      1.53787283E-07    3      1000022        11       -11             # Z3SS   -->  Z1SS   E-     E+          
      1.53787269E-07    3      1000022        13       -13             # Z3SS   -->  Z1SS   MU-    MU+         
      3.91239519E-05    3      1000022        15       -15             # Z3SS   -->  Z1SS   TAU-   TAU+        
      1.73842565E-07    3      1000022        12       -12             # Z3SS   -->  Z1SS   NUE    ANUE        
      1.73842565E-07    3      1000022        14       -14             # Z3SS   -->  Z1SS   NUM    ANUM        
      3.08909989E-07    3      1000022        16       -16             # Z3SS   -->  Z1SS   NUT    ANUT        
      1.91896660E-07    3      1000023         2        -2             # Z3SS   -->  Z2SS   UP     UB          
      2.55342371E-07    3      1000023         1        -1             # Z3SS   -->  Z2SS   DN     DB          
      2.55342172E-07    3      1000023         3        -3             # Z3SS   -->  Z2SS   ST     SB          
      1.91893122E-07    3      1000023         4        -4             # Z3SS   -->  Z2SS   CH     CB          
      1.11761961E-04    3      1000023         5        -5             # Z3SS   -->  Z2SS   BT     BB          
      6.28027408E-08    3      1000023        11       -11             # Z3SS   -->  Z2SS   E-     E+          
      6.28027266E-08    3      1000023        13       -13             # Z3SS   -->  Z2SS   MU-    MU+         
      1.75220612E-05    3      1000023        15       -15             # Z3SS   -->  Z2SS   TAU-   TAU+        
      2.00554823E-07    3      1000023        12       -12             # Z3SS   -->  Z2SS   NUE    ANUE        
      2.00554823E-07    3      1000023        14       -14             # Z3SS   -->  Z2SS   NUM    ANUM        
      3.61700813E-07    3      1000023        16       -16             # Z3SS   -->  Z2SS   NUT    ANUT        
      3.32033113E-02    2      1000022        25                       # Z3SS   -->  Z1SS   HL0                
      3.74690555E-02    2      1000023        25                       # Z3SS   -->  Z2SS   HL0                
#         PDG         Width
DECAY   1000035  1.46752882E+00   # Z4SS  decays
#          BR          NDA       ID1       ID2       ID3       ID4
      7.36498123E-07    2      1000022        22                       # Z4SS   -->  Z1SS   GM                 
      7.08656316E-08    2      1000023        22                       # Z4SS   -->  Z2SS   GM                 
      5.56179436E-10    2      1000025        22                       # Z4SS   -->  Z3SS   GM                 
      3.44599098E-01    2      1000024       -24                       # Z4SS   -->  W1SS+  W-                 
      3.44599098E-01    2     -1000024        24                       # Z4SS   -->  W1SS-  W+                 
      4.81576622E-02    2      1000022        23                       # Z4SS   -->  Z1SS   Z0                 
      6.36270791E-02    2      1000023        23                       # Z4SS   -->  Z2SS   Z0                 
      1.87414074E-07    3      1000022         2        -2             # Z4SS   -->  Z1SS   UP     UB          
      2.26825776E-07    3      1000022         1        -1             # Z4SS   -->  Z1SS   DN     DB          
      2.26825563E-07    3      1000022         3        -3             # Z4SS   -->  Z1SS   ST     SB          
      1.87410734E-07    3      1000022         4        -4             # Z4SS   -->  Z1SS   CH     CB          
      5.48909520E-05    3      1000022         5        -5             # Z4SS   -->  Z1SS   BT     BB          
      6.24861286E-07    3      1000022        11       -11             # Z4SS   -->  Z1SS   E-     E+          
      6.24861229E-07    3      1000022        13       -13             # Z4SS   -->  Z1SS   MU-    MU+         
      3.99567180E-05    3      1000022        15       -15             # Z4SS   -->  Z1SS   TAU-   TAU+        
      9.77463628E-07    3      1000022        12       -12             # Z4SS   -->  Z1SS   NUE    ANUE        
      9.77463628E-07    3      1000022        14       -14             # Z4SS   -->  Z1SS   NUM    ANUM        
      1.73429669E-06    3      1000022        16       -16             # Z4SS   -->  Z1SS   NUT    ANUT        
      1.79173151E-06    3      1000023         2        -2             # Z4SS   -->  Z2SS   UP     UB          
      2.09116979E-06    3      1000023         1        -1             # Z4SS   -->  Z2SS   DN     DB          
      2.09116774E-06    3      1000023         3        -3             # Z4SS   -->  Z2SS   ST     SB          
      1.79169876E-06    3      1000023         4        -4             # Z4SS   -->  Z2SS   CH     CB          
      1.22774887E-04    3      1000023         5        -5             # Z4SS   -->  Z2SS   BT     BB          
      7.08858124E-07    3      1000023        11       -11             # Z4SS   -->  Z2SS   E-     E+          
      7.08857897E-07    3      1000023        13       -13             # Z4SS   -->  Z2SS   MU-    MU+         
      1.72646160E-05    3      1000023        15       -15             # Z4SS   -->  Z2SS   TAU-   TAU+        
      1.49012681E-06    3      1000023        12       -12             # Z4SS   -->  Z2SS   NUE    ANUE        
      1.49012681E-06    3      1000023        14       -14             # Z4SS   -->  Z2SS   NUM    ANUM        
      2.67150699E-06    3      1000023        16       -16             # Z4SS   -->  Z2SS   NUT    ANUT        
      2.49336090E-08    3      1000025         2        -2             # Z4SS   -->  Z3SS   UP     UB          
      3.24550342E-08    3      1000025         1        -1             # Z4SS   -->  Z3SS   DN     DB          
      3.24550342E-08    3      1000025         3        -3             # Z4SS   -->  Z3SS   ST     SB          
      2.49336125E-08    3      1000025         4        -4             # Z4SS   -->  Z3SS   CH     CB          
      4.74238204E-09    3      1000025         5        -5             # Z4SS   -->  Z3SS   BT     BB          
      7.35610772E-09    3      1000025        11       -11             # Z4SS   -->  Z3SS   E-     E+          
      7.35610772E-09    3      1000025        13       -13             # Z4SS   -->  Z3SS   MU-    MU+         
      6.78820555E-09    3      1000025        15       -15             # Z4SS   -->  Z3SS   TAU-   TAU+        
      1.44395660E-08    3      1000025        12       -12             # Z4SS   -->  Z3SS   NUE    ANUE        
      1.44395660E-08    3      1000025        14       -14             # Z4SS   -->  Z3SS   NUM    ANUM        
      1.43768748E-08    3      1000025        16       -16             # Z4SS   -->  Z3SS   NUT    ANUT        
      6.44810572E-02    2      1000022        25                       # Z4SS   -->  Z1SS   HL0                
      1.34279564E-01    2      1000023        25                       # Z4SS   -->  Z2SS   HL0                
#         PDG         Width
DECAY   1000024  1.54122574E-06   # W1SS+ decays
#          BR          NDA       ID1       ID2       ID3       ID4
      3.40866417E-01    3      1000022         2        -1             # W1SS+  -->  Z1SS   UP     DB          
      3.40866417E-01    3      1000022         4        -3             # W1SS+  -->  Z1SS   CH     SB          
      1.04703180E-01    3      1000022       -11        12             # W1SS+  -->  Z1SS   E+     NUE         
      1.04703188E-01    3      1000022       -13        14             # W1SS+  -->  Z1SS   MU+    NUM         
      1.08860850E-01    3      1000022       -15        16             # W1SS+  -->  Z1SS   TAU+   NUT         
      2.39965990E-12    3      1000023       -11        12             # W1SS+  -->  Z2SS   E+     NUE         
#         PDG         Width
DECAY   1000037  1.48951161E+00   # W2SS+ decays
#          BR          NDA       ID1       ID2       ID3       ID4
      3.69446212E-07    3      1000022         2        -1             # W2SS+  -->  Z1SS   UP     DB          
      3.69445729E-07    3      1000022         4        -3             # W2SS+  -->  Z1SS   CH     SB          
      8.28530915E-07    3      1000022       -11        12             # W2SS+  -->  Z1SS   E+     NUE         
      8.28530688E-07    3      1000022       -13        14             # W2SS+  -->  Z1SS   MU+    NUM         
      3.30229414E-05    3      1000022       -15        16             # W2SS+  -->  Z1SS   TAU+   NUT         
      7.05365613E-02    2      1000022        24                       # W2SS+  -->  Z1SS   W+                 
      2.74889680E-06    3      1000023         2        -1             # W2SS+  -->  Z2SS   UP     DB          
      2.74889385E-06    3      1000023         4        -3             # W2SS+  -->  Z2SS   CH     SB          
      1.93574056E-06    3      1000023       -11        12             # W2SS+  -->  Z2SS   E+     NUE         
      1.93573987E-06    3      1000023       -13        14             # W2SS+  -->  Z2SS   MU+    NUM         
      3.16180558E-05    3      1000023       -15        16             # W2SS+  -->  Z2SS   TAU+   NUT         
      3.49699974E-01    2      1000023        24                       # W2SS+  -->  Z2SS   W+                 
      1.76358427E-07    3      1000025         2        -1             # W2SS+  -->  Z3SS   UP     DB          
      1.76358455E-07    3      1000025         4        -3             # W2SS+  -->  Z3SS   CH     SB          
      5.87005147E-08    3      1000025       -11        12             # W2SS+  -->  Z3SS   E+     NUE         
      5.87005147E-08    3      1000025       -13        14             # W2SS+  -->  Z3SS   MU+    NUM         
      6.15986053E-08    3      1000025       -15        16             # W2SS+  -->  Z3SS   TAU+   NUT         
      5.58072338E-12    3      1000035         2        -1             # W2SS+  -->  Z4SS   UP     DB          
      1.86219551E-12    3      1000035       -11        12             # W2SS+  -->  Z4SS   E+     NUE         
      1.86219551E-12    3      1000035       -13        14             # W2SS+  -->  Z4SS   MU+    NUM         
      1.18604153E-01    2      1000006        -5                       # W2SS+  -->  TP1    BB                 
      2.68894911E-01    2      1000024        23                       # W2SS+  -->  W1SS+  Z0                 
      8.07620779E-07    3      1000024         1        -1             # W2SS+  -->  W1SS+  DN     DB          
      8.07605829E-07    3      1000024         3        -3             # W2SS+  -->  W1SS+  ST     SB          
      5.91759363E-06    3      1000024         2        -2             # W2SS+  -->  W1SS+  UP     UB          
      5.91758908E-06    3      1000024         4        -4             # W2SS+  -->  W1SS+  CH     CB          
      3.32144691E-06    3      1000024        12       -12             # W2SS+  -->  W1SS+  NUE    ANUE        
      3.32144600E-06    3      1000024        14       -14             # W2SS+  -->  W1SS+  NUM    ANUM        
      1.73230019E-05    3      1000024        16       -16             # W2SS+  -->  W1SS+  NUT    ANUT        
      4.62233118E-07    3      1000024        11       -11             # W2SS+  -->  W1SS+  E-     E+          
      4.62233118E-07    3      1000024        13       -13             # W2SS+  -->  W1SS+  MU-    MU+         
      8.37533548E-07    3      1000024        15       -15             # W2SS+  -->  W1SS+  TAU-   TAU+        
      1.92148298E-01    2      1000024        25                       # W2SS+  -->  W1SS+  HL0                
#         PDG         Width
DECAY        25  3.91719164E-03   # HL0   decays
#          BR          NDA       ID1       ID2       ID3       ID4
      4.76306417E-09    2           11       -11                       # HL0    -->  E-     E+                 
      2.01104005E-04    2           13       -13                       # HL0    -->  MU-    MU+                
      5.75043596E-02    2           15       -15                       # HL0    -->  TAU-   TAU+               
      5.98468569E-06    2            1        -1                       # HL0    -->  DN     DB                 
      2.41811224E-03    2            3        -3                       # HL0    -->  ST     SB                 
      8.00801933E-01    2            5        -5                       # HL0    -->  BT     BB                 
      1.86665454E-06    2            2        -2                       # HL0    -->  UP     UB                 
      3.55316550E-02    2            4        -4                       # HL0    -->  CH     CB                 
      1.42724277E-03    2           22        22                       # HL0    -->  GM     GM                 
      3.37165967E-02    2           21        21                       # HL0    -->  GL     GL                 
      8.95364909E-04    3           24        11       -12             # HL0    -->  W+     E-     ANUE        
      8.95364909E-04    3           24        13       -14             # HL0    -->  W+     MU-    ANUM        
      8.95364909E-04    3           24        15       -16             # HL0    -->  W+     TAU-   ANUT        
      2.68609473E-03    3           24        -2         1             # HL0    -->  W+     UB     DN          
      2.68609473E-03    3           24        -4         3             # HL0    -->  W+     CB     ST          
      8.95364909E-04    3          -24       -11        12             # HL0    -->  W-     E+     NUE         
      8.95364909E-04    3          -24       -13        14             # HL0    -->  W-     MU+    NUM         
      8.95364909E-04    3          -24       -15        16             # HL0    -->  W-     TAU+   NUT         
      2.68609473E-03    3          -24         2        -1             # HL0    -->  W-     UP     DB          
      2.68609473E-03    3          -24         4        -3             # HL0    -->  W-     CH     SB          
      4.13366142E-05    3           23        12       -12             # HL0    -->  Z0     NUE    ANUE        
      4.13366142E-05    3           23        14       -14             # HL0    -->  Z0     NUM    ANUM        
      4.13366142E-05    3           23        16       -16             # HL0    -->  Z0     NUT    ANUT        
      2.08043020E-05    3           23        11       -11             # HL0    -->  Z0     E-     E+          
      2.08043020E-05    3           23        13       -13             # HL0    -->  Z0     MU-    MU+         
      2.08043020E-05    3           23        15       -15             # HL0    -->  Z0     TAU-   TAU+        
      7.12737747E-05    3           23         2        -2             # HL0    -->  Z0     UP     UB          
      7.12737747E-05    3           23         4        -4             # HL0    -->  Z0     CH     CB          
      9.18181831E-05    3           23         1        -1             # HL0    -->  Z0     DN     DB          
      9.18181831E-05    3           23         3        -3             # HL0    -->  Z0     ST     SB          
      9.18181831E-05    3           23         5        -5             # HL0    -->  Z0     BT     BB          
      5.16702980E-02    2      1000022   1000022                       # HL0    -->  Z1SS   Z1SS               
#         PDG         Width
DECAY        35  7.83104324E+00   # HH0   decays
#          BR          NDA       ID1       ID2       ID3       ID4
      1.13383258E-08    2           11       -11                       # HH0    -->  E-     E+                 
      4.78724280E-04    2           13       -13                       # HH0    -->  MU-    MU+                
      1.37089700E-01    2           15       -15                       # HH0    -->  TAU-   TAU+               
      1.40367329E-05    2            1        -1                       # HH0    -->  DN     DB                 
      5.67155005E-03    2            3        -3                       # HH0    -->  ST     SB                 
      7.60725975E-01    2            5        -5                       # HH0    -->  BT     BB                 
      1.79976433E-12    2            2        -2                       # HH0    -->  UP     UB                 
      2.91895166E-08    2            4        -4                       # HH0    -->  CH     CB                 
      3.94633162E-08    2           22        22                       # HH0    -->  GM     GM                 
      4.34109061E-05    2           21        21                       # HH0    -->  GL     GL                 
      1.03906537E-07    2           24       -24                       # HH0    -->  W+     W-                 
      4.82770552E-08    2           23        23                       # HH0    -->  Z0     Z0                 
      5.13565261E-03    2      1000022   1000022                       # HH0    -->  Z1SS   Z1SS               
      1.90652553E-02    2      1000022   1000023                       # HH0    -->  Z1SS   Z2SS               
      4.60040523E-03    2      1000022   1000025                       # HH0    -->  Z1SS   Z3SS               
      4.34888789E-04    2      1000022   1000035                       # HH0    -->  Z1SS   Z4SS               
      1.70819294E-02    2      1000023   1000023                       # HH0    -->  Z2SS   Z2SS               
      4.93623279E-02    2      1000024  -1000024                       # HH0    -->  W1SS+  W1SS-              
      2.95847858E-04    2           25        25                       # HH0    -->  HL0    HL0                
#         PDG         Width
DECAY        36  7.93698406E+00   # HA0   decays
#          BR          NDA       ID1       ID2       ID3       ID4
      1.11184324E-08    2           11       -11                       # HA0    -->  E-     E+                 
      4.69440187E-04    2           13       -13                       # HA0    -->  MU-    MU+                
      1.34446830E-01    2           15       -15                       # HA0    -->  TAU-   TAU+               
      1.37654824E-05    2            1        -1                       # HA0    -->  DN     DB                 
      5.56195201E-03    2            3        -3                       # HA0    -->  ST     SB                 
      7.46392667E-01    2            5        -5                       # HA0    -->  BT     BB                 
      1.72051316E-12    2            2        -2                       # HA0    -->  UP     UB                 
      2.79278609E-08    2            4        -4                       # HA0    -->  CH     CB                 
      9.20167409E-09    2           22        22                       # HA0    -->  GM     GM                 
      6.07851907E-05    2           21        21                       # HA0    -->  GL     GL                 
      5.42879850E-03    2      1000022   1000022                       # HA0    -->  Z1SS   Z1SS               
      2.13913824E-02    2      1000022   1000023                       # HA0    -->  Z1SS   Z2SS               
      1.21925503E-03    2      1000022   1000025                       # HA0    -->  Z1SS   Z3SS               
      2.02671206E-03    2      1000022   1000035                       # HA0    -->  Z1SS   Z4SS               
      2.13697497E-02    2      1000023   1000023                       # HA0    -->  Z2SS   Z2SS               
      6.16185367E-02    2      1000024  -1000024                       # HA0    -->  W1SS+  W1SS-              
      7.23284828E-08    2           25        23                       # HA0    -->  HL0    Z0                 
#         PDG         Width
DECAY        37  4.58614874E+00   # H+    decays
#          BR          NDA       ID1       ID2       ID3       ID4
      2.00123900E-08    2           12       -11                       # H+     -->  NUE    E+                 
      8.44959053E-04    2           14       -13                       # H+     -->  NUM    MU+                
      2.41995871E-01    2           16       -15                       # H+     -->  NUT    TAU+               
      2.25345484E-05    2            2        -1                       # H+     -->  UP     DB                 
      9.10484418E-03    2            4        -3                       # H+     -->  CH     SB                 
      6.65085495E-01    2            6        -5                       # H+     -->  TP     BB                 
      5.91832362E-02    2      1000024   1000022                       # H+     -->  W1SS+  Z1SS               
      1.25774962E-03    2      1000024   1000023                       # H+     -->  W1SS+  Z2SS               
      2.00506356E-02    2      1000024   1000025                       # H+     -->  W1SS+  Z3SS               
      2.45436328E-03    2      1000037   1000022                       # H+     -->  W2SS+  Z1SS               
      1.60056871E-07    2           25        24                       # H+     -->  HL0    W+                 
