  65
  401    857.0353    0.82506E-25
  402    853.3497    0.81029E-25
  403    857.0315    0.82507E-25
  404    853.3468    0.81030E-25
  405    782.8267    0.69135E-25
  406    648.8844    0.16289E-24
  407    857.0353    0.82506E-25
  408    853.3497    0.81029E-25
  409    857.0315    0.82507E-25
  410    853.3468    0.81030E-25
  411    782.8267    0.69135E-25
  412    648.8844    0.16289E-24
  413    821.3206    0.15449E-23
  414    823.4685    0.38504E-24
  415    821.3176    0.15449E-23
  416    823.4666    0.38504E-24
  417    818.2983    0.28921E-24
  418    837.3728    0.51979E-25
  419    821.3206    0.15449E-23
  420    823.4685    0.38504E-24
  421    821.3176    0.15449E-23
  422    823.4666    0.38504E-24
  423    818.2983    0.28921E-24
  424    837.3728    0.51979E-25
  425    273.1991    0.45562E-23
  426    261.4074    0.44336E-23
  427    273.2681    0.45528E-23
  428    261.4795    0.44296E-23
  429    143.1775    0.94975E-10
  430    260.0904    0.32486E-23
  431    273.1991    0.45562E-23
  432    261.4074    0.44336E-23
  433    273.2681    0.45528E-23
  434    261.4795    0.44296E-23
  435    143.1775    0.94975E-10
  436    260.0904    0.32486E-23
  437    156.2975    0.46608E-22
  438      0.0000    0.10000E+31
  439    156.8114    0.22037E-17
  440      0.0000    0.10000E+31
  441    276.8618    0.26268E-23
  442      0.0000    0.10000E+31
  443    156.2975    0.46608E-22
  444      0.0000    0.10000E+31
  445    156.8114    0.22037E-17
  446      0.0000    0.10000E+31
  447    276.8618    0.26268E-23
  448      0.0000    0.10000E+31
  449    934.0670    0.55480E-25
  450    161.6770    0.15586E-22
  451    302.0518    0.16408E-23
  452   -513.6500    0.22807E-24
  453    529.8572    0.18109E-24
  454    301.9935    0.16347E-23
  455    530.0138    0.18732E-24
  456    301.9935    0.16347E-23
  457    530.0138    0.18732E-24
  203    116.2284    0.12072E-21
  204    537.7476    0.24065E-24
  205    536.9350    0.23232E-24
  206    543.4946    0.29721E-24
  207    543.4946    0.29721E-24
  458      0.0000    0.10000E+31
    6    173.3000    0.56017E-24
   12    173.3000    0.56017E-24
   6
   401  0.17949637E-01     0   450     1     0     0     0
   401  0.31224239E+00     0   451     1     0     0     0
   401  0.92313613E-03     0   452     1     0     0     0
   401  0.14784912E-01     0   453     1     0     0     0
   401  0.61488956E+00     0   456     2     0     0     0
   401  0.39210301E-01     0   457     2     0     0     0
   6
   402  0.10198982E-01     0   450     2     0     0     0
   402  0.31736490E+00     0   451     2     0     0     0
   402  0.54444320E-03     0   452     2     0     0     0
   402  0.11303443E-01     0   453     2     0     0     0
   402  0.64487559E+00     0   454     1     0     0     0
   402  0.15712673E-01     0   455     1     0     0     0
   6
   403  0.17949760E-01     0   450     3     0     0     0
   403  0.31224397E+00     0   451     3     0     0     0
   403  0.92313375E-03     0   452     3     0     0     0
   403  0.14784861E-01     0   453     3     0     0     0
   403  0.61488861E+00     0   456     4     0     0     0
   403  0.39209649E-01     0   457     4     0     0     0
   6
   404  0.10198968E-01     0   450     4     0     0     0
   404  0.31736362E+00     0   451     4     0     0     0
   404  0.54443459E-03     0   452     4     0     0     0
   404  0.11303245E-01     0   453     4     0     0     0
   404  0.64487720E+00     0   454     3     0     0     0
   404  0.15712604E-01     0   455     3     0     0     0
   7
   405  0.22923240E-01     0   450     5     0     0     0
   405  0.22153617E+00     0   451     5     0     0     0
   405  0.11989068E-01     0   452     5     0     0     0
   405  0.12252462E-01     0   453     5     0     0     0
   405  0.36120689E+00     0   456     6     0     0     0
   405  0.26224738E+00     0   457     6     0     0     0
   405  0.10784482E+00     0   199   406     0     0     0
   4
   406  0.22961414E+00     0   450     6     0     0     0
   406  0.15390290E+00     0   451     6     0     0     0
   406  0.44414708E+00     0   454     5     0     0     0
   406  0.17233598E+00     0   455     5     0     0     0
   6
   407  0.17949637E-01     0   450     7     0     0     0
   407  0.31224239E+00     0   451     7     0     0     0
   407  0.92313613E-03     0   452     7     0     0     0
   407  0.14784912E-01     0   453     7     0     0     0
   407  0.61488956E+00     0   454     8     0     0     0
   407  0.39210301E-01     0   455     8     0     0     0
   6
   408  0.10198982E-01     0   450     8     0     0     0
   408  0.31736490E+00     0   451     8     0     0     0
   408  0.54444320E-03     0   452     8     0     0     0
   408  0.11303443E-01     0   453     8     0     0     0
   408  0.64487559E+00     0   456     7     0     0     0
   408  0.15712673E-01     0   457     7     0     0     0
   6
   409  0.17949760E-01     0   450     9     0     0     0
   409  0.31224397E+00     0   451     9     0     0     0
   409  0.92313375E-03     0   452     9     0     0     0
   409  0.14784861E-01     0   453     9     0     0     0
   409  0.61488861E+00     0   454    10     0     0     0
   409  0.39209649E-01     0   455    10     0     0     0
   6
   410  0.10198968E-01     0   450    10     0     0     0
   410  0.31736362E+00     0   451    10     0     0     0
   410  0.54443459E-03     0   452    10     0     0     0
   410  0.11303245E-01     0   453    10     0     0     0
   410  0.64487720E+00     0   456     9     0     0     0
   410  0.15712604E-01     0   457     9     0     0     0
   7
   411  0.22923240E-01     0   450    11     0     0     0
   411  0.22153617E+00     0   451    11     0     0     0
   411  0.11989068E-01     0   452    11     0     0     0
   411  0.12252462E-01     0   453    11     0     0     0
   411  0.36120689E+00     0   454    12     0     0     0
   411  0.26224738E+00     0   455    12     0     0     0
   411  0.10784482E+00     0   198   412     0     0     0
   4
   412  0.22961414E+00     0   450    12     0     0     0
   412  0.15390290E+00     0   451    12     0     0     0
   412  0.44414708E+00     0   456    11     0     0     0
   412  0.17233598E+00     0   457    11     0     0     0
   4
   413  0.99400264E+00     0   450     1     0     0     0
   413  0.23553229E-02     0   451     1     0     0     0
   413  0.72125602E-03     0   452     1     0     0     0
   413  0.29208187E-02     0   453     1     0     0     0
   4
   414  0.99397486E+00     0   450     2     0     0     0
   414  0.23581064E-02     0   451     2     0     0     0
   414  0.72576664E-03     0   452     2     0     0     0
   414  0.29412382E-02     0   453     2     0     0     0
   4
   415  0.99400264E+00     0   450     3     0     0     0
   415  0.23553192E-02     0   451     3     0     0     0
   415  0.72124990E-03     0   452     3     0     0     0
   415  0.29207908E-02     0   453     3     0     0     0
   4
   416  0.99397492E+00     0   450     4     0     0     0
   416  0.23581011E-02     0   451     4     0     0     0
   416  0.72575640E-03     0   452     4     0     0     0
   416  0.29411914E-02     0   453     4     0     0     0
   7
   417  0.15078415E+00     0   450     5     0     0     0
   417  0.48238959E-01     0   451     5     0     0     0
   417  0.76836638E-01     0   452     5     0     0     0
   417  0.94694123E-01     0   453     5     0     0     0
   417  0.80212168E-01     0   456     6     0     0     0
   417  0.41368857E+00     0   457     6     0     0     0
   417  0.13554542E+00     0   199   406     0     0     0
   8
   418  0.21829017E+00     0   454     5     0     0     0
   418  0.15669091E+00     0   455     5     0     0     0
   418  0.11557980E+00     0   200   406     0     0     0
   418  0.51464103E-01     0   203   406     0     0     0
   418  0.23986077E-01     0   450     6     0     0     0
   418  0.95002241E-01     0   451     6     0     0     0
   418  0.97241081E-01     0   452     6     0     0     0
   418  0.24174567E+00     0   453     6     0     0     0
   4
   419  0.99400264E+00     0   450     7     0     0     0
   419  0.23553229E-02     0   451     7     0     0     0
   419  0.72125602E-03     0   452     7     0     0     0
   419  0.29208187E-02     0   453     7     0     0     0
   4
   420  0.99397486E+00     0   450     8     0     0     0
   420  0.23581064E-02     0   451     8     0     0     0
   420  0.72576664E-03     0   452     8     0     0     0
   420  0.29412382E-02     0   453     8     0     0     0
   4
   421  0.99400264E+00     0   450     9     0     0     0
   421  0.23553192E-02     0   451     9     0     0     0
   421  0.72124990E-03     0   452     9     0     0     0
   421  0.29207908E-02     0   453     9     0     0     0
   4
   422  0.99397492E+00     0   450    10     0     0     0
   422  0.23581011E-02     0   451    10     0     0     0
   422  0.72575640E-03     0   452    10     0     0     0
   422  0.29411914E-02     0   453    10     0     0     0
   7
   423  0.15078415E+00     0   450    11     0     0     0
   423  0.48238959E-01     0   451    11     0     0     0
   423  0.76836638E-01     0   452    11     0     0     0
   423  0.94694123E-01     0   453    11     0     0     0
   423  0.80212168E-01     0   454    12     0     0     0
   423  0.41368857E+00     0   455    12     0     0     0
   423  0.13554542E+00     0   198   412     0     0     0
   8
   424  0.21829017E+00     0   456    11     0     0     0
   424  0.15669091E+00     0   457    11     0     0     0
   424  0.11557980E+00     0   200   412     0     0     0
   424  0.51464103E-01     0   203   412     0     0     0
   424  0.23986077E-01     0   450    12     0     0     0
   424  0.95002241E-01     0   451    12     0     0     0
   424  0.97241081E-01     0   452    12     0     0     0
   424  0.24174567E+00     0   453    12     0     0     0
   4
   425  0.91452497E+00     0   450   121     0     0     0
   425  0.13901425E-04     0   429   121   131     0     0
   425  0.25685684E-04     0   435   121   125     0     0
   425  0.85435323E-01     0   121   130     0     0     0
   4
   426  0.92038554E+00     0   450   122     0     0     0
   426  0.12881565E-04     0   435   122   125     0     0
   426  0.53092135E-04     0   435   121   126     0     0
   426  0.79548724E-01     0   129   121     0     0     0
   4
   427  0.91456741E+00     0   450   123     0     0     0
   427  0.13940698E-04     0   429   123   131     0     0
   427  0.25745197E-04     0   435   123   125     0     0
   427  0.85392870E-01     0   121   128     0     0     0
   4
   428  0.92043513E+00     0   450   124     0     0     0
   428  0.12911768E-04     0   435   124   125     0     0
   428  0.53215132E-04     0   435   123   126     0     0
   428  0.79498723E-01     0   127   121     0     0     0
   3
   429  0.24478728E-01     0   125   130     0     0     0
   429  0.48768577E+00     0   125   124     0     0     0
   429  0.48783553E+00     0   123   126     0     0     0
   2
   430  0.66257477E+00     0   450   126     0     0     0
   430  0.33742523E+00     0   198   429     0     0     0
   4
   431  0.91452497E+00     0   450   127     0     0     0
   431  0.13901425E-04     0   435   127   125     0     0
   431  0.25685684E-04     0   429   127   131     0     0
   431  0.85435323E-01     0   127   124     0     0     0
   4
   432  0.92038554E+00     0   450   128     0     0     0
   432  0.12881565E-04     0   429   128   131     0     0
   432  0.53092135E-04     0   429   127   132     0     0
   432  0.79548724E-01     0   123   127     0     0     0
   4
   433  0.91456741E+00     0   450   129     0     0     0
   433  0.13940698E-04     0   435   129   125     0     0
   433  0.25745197E-04     0   429   129   131     0     0
   433  0.85392870E-01     0   127   122     0     0     0
   4
   434  0.92043513E+00     0   450   130     0     0     0
   434  0.12911768E-04     0   429   130   131     0     0
   434  0.53215132E-04     0   429   129   132     0     0
   434  0.79498723E-01     0   121   127     0     0     0
   3
   435  0.24478728E-01     0   131   124     0     0     0
   435  0.48768577E+00     0   131   130     0     0     0
   435  0.48783553E+00     0   129   132     0     0     0
   2
   436  0.66257477E+00     0   450   132     0     0     0
   436  0.33742523E+00     0   199   435     0     0     0
   2
   437  0.49999982E+00     0   123   122     0     0     0
   437  0.50000030E+00     0   121   124     0     0     0
   0
   2
   439  0.46590102E+00     0   429   123   131     0     0
   439  0.53409898E+00     0   435   123   125     0     0
   0
   3
   441  0.62111807E+00     0   450   125     0     0     0
   441  0.18179823E+00     0   200   429     0     0     0
   441  0.19708362E+00     0   203   429     0     0     0
   0
   2
   443  0.49999982E+00     0   129   128     0     0     0
   443  0.50000030E+00     0   127   130     0     0     0
   0
   2
   445  0.46590102E+00     0   435   129   125     0     0
   445  0.53409898E+00     0   429   129   131     0     0
   0
   3
   447  0.62111807E+00     0   450   131     0     0     0
   447  0.18179823E+00     0   200   435     0     0     0
   447  0.19708362E+00     0   203   435     0     0     0
   0
  32
   449  0.50043990E-03     0   454     5    12     0     0
   449  0.50043990E-03     0   456     6    11     0     0
   449  0.15766249E-03     0   455     5    12     0     0
   449  0.15766249E-03     0   457     6    11     0     0
   449  0.92523929E-04     0   450     6    12     0     0
   449  0.32691951E-03     0   451     6    12     0     0
   449  0.35209814E-04     0   452    13     0     0     0
   449  0.48810569E-04     0   452     6    12     0     0
   449  0.25266363E-04     0   453    13     0     0     0
   449  0.28448223E-03     0   453     6    12     0     0
   449  0.24960831E-01     0   408     2     0     0     0
   449  0.24960831E-01     0   402     8     0     0     0
   449  0.22827260E-01     0   407     1     0     0     0
   449  0.22827260E-01     0   401     7     0     0     0
   449  0.45308635E-01     0   420     2     0     0     0
   449  0.45308635E-01     0   414     8     0     0     0
   449  0.46970606E-01     0   419     1     0     0     0
   449  0.46970606E-01     0   413     7     0     0     0
   449  0.22829350E-01     0   409     3     0     0     0
   449  0.22829350E-01     0   403     9     0     0     0
   449  0.46972852E-01     0   421     3     0     0     0
   449  0.46972852E-01     0   415     9     0     0     0
   449  0.24959382E-01     0   410     4     0     0     0
   449  0.24959382E-01     0   404    10     0     0     0
   449  0.45307137E-01     0   422     4     0     0     0
   449  0.45307137E-01     0   416    10     0     0     0
   449  0.79025939E-01     0   411     5     0     0     0
   449  0.79025939E-01     0   405    11     0     0     0
   449  0.50710168E-01     0   423     5     0     0     0
   449  0.50710168E-01     0   417    11     0     0     0
   449  0.89063115E-01     0   412     6     0     0     0
   449  0.89063115E-01     0   406    12     0     0     0
   6
   450  0.41169174E-01     0   437   127     0     0     0
   450  0.41169174E-01     0   443   121     0     0     0
   450  0.33781432E-01     0   439   129     0     0     0
   450  0.33781432E-01     0   445   123     0     0     0
   450  0.42504936E+00     0   429   131     0     0     0
   450  0.42504936E+00     0   435   125     0     0     0
  20
   451  0.35233835E-02     0   450   200     0     0     0
   451  0.27174104E-01     0   450   203     0     0     0
   451  0.51219027E-01     0   425   127     0     0     0
   451  0.51219027E-01     0   431   121     0     0     0
   451  0.50986379E-01     0   427   129     0     0     0
   451  0.50986379E-01     0   433   123     0     0     0
   451  0.29684845E-02     0   437   127     0     0     0
   451  0.29684845E-02     0   443   121     0     0     0
   451  0.29542041E-02     0   439   129     0     0     0
   451  0.29542041E-02     0   445   123     0     0     0
   451  0.75830869E-01     0   429   131     0     0     0
   451  0.75830869E-01     0   435   125     0     0     0
   451  0.37131842E-01     0   441   131     0     0     0
   451  0.37131842E-01     0   447   125     0     0     0
   451  0.86198717E-01     0   426   128     0     0     0
   451  0.86198717E-01     0   432   122     0     0     0
   451  0.85915245E-01     0   428   130     0     0     0
   451  0.85915245E-01     0   434   124     0     0     0
   451  0.91446489E-01     0   430   132     0     0     0
   451  0.91446489E-01     0   436   126     0     0     0
  24
   452  0.28885785E+00     0   454   199     0     0     0
   452  0.28885785E+00     0   456   198     0     0     0
   452  0.10358655E+00     0   450   200     0     0     0
   452  0.23990779E+00     0   451   200     0     0     0
   452  0.18321563E-01     0   450   203     0     0     0
   452  0.91183074E-02     0   451   203     0     0     0
   452  0.30116850E-03     0   425   127     0     0     0
   452  0.30116850E-03     0   431   121     0     0     0
   452  0.30104854E-03     0   427   129     0     0     0
   452  0.30104854E-03     0   433   123     0     0     0
   452  0.66554052E-03     0   437   127     0     0     0
   452  0.66554052E-03     0   443   121     0     0     0
   452  0.66464633E-03     0   439   129     0     0     0
   452  0.66464633E-03     0   445   123     0     0     0
   452  0.10385963E-01     0   429   131     0     0     0
   452  0.10385963E-01     0   435   125     0     0     0
   452  0.87837605E-02     0   441   131     0     0     0
   452  0.87837605E-02     0   447   125     0     0     0
   452  0.15209528E-02     0   426   128     0     0     0
   452  0.15209528E-02     0   432   122     0     0     0
   452  0.15203666E-02     0   428   130     0     0     0
   452  0.15203666E-02     0   434   124     0     0     0
   452  0.15316581E-02     0   430   132     0     0     0
   452  0.15316581E-02     0   436   126     0     0     0
  24
   453  0.26254183E+00     0   454   199     0     0     0
   453  0.26254183E+00     0   456   198     0     0     0
   453  0.17609093E-01     0   450   200     0     0     0
   453  0.13573542E-01     0   451   200     0     0     0
   453  0.71547918E-01     0   450   203     0     0     0
   453  0.17106497E+00     0   451   203     0     0     0
   453  0.85734678E-02     0   425   127     0     0     0
   453  0.85734678E-02     0   431   121     0     0     0
   453  0.85703330E-02     0   427   129     0     0     0
   453  0.85703330E-02     0   433   123     0     0     0
   453  0.24308243E-02     0   437   127     0     0     0
   453  0.24308243E-02     0   443   121     0     0     0
   453  0.24277740E-02     0   439   129     0     0     0
   453  0.24277740E-02     0   445   123     0     0     0
   453  0.51937164E-02     0   429   131     0     0     0
   453  0.51937164E-02     0   435   125     0     0     0
   453  0.17531229E-01     0   441   131     0     0     0
   453  0.17531229E-01     0   447   125     0     0     0
   453  0.18573120E-01     0   426   128     0     0     0
   453  0.18573120E-01     0   432   122     0     0     0
   453  0.18566528E-01     0   428   130     0     0     0
   453  0.18566528E-01     0   434   124     0     0     0
   453  0.18693419E-01     0   430   132     0     0     0
   453  0.18693419E-01     0   436   126     0     0     0
   8
   454  0.31504426E-01     0   450   198     0     0     0
   454  0.18911596E+00     0   426   127     0     0     0
   454  0.18849254E+00     0   428   129     0     0     0
   454  0.20263886E+00     0   430   131     0     0     0
   454  0.92282258E-01     0   431   122     0     0     0
   454  0.91862760E-01     0   433   124     0     0     0
   454  0.13841809E+00     0   435   126     0     0     0
   454  0.65685123E-01     0   447   126     0     0     0
  11
   455  0.80895126E-01     0   450   198     0     0     0
   455  0.28087640E+00     0   451   198     0     0     0
   455  0.17122220E-01     0   426   127     0     0     0
   455  0.17116148E-01     0   428   129     0     0     0
   455  0.29357614E-01     0   430   131     0     0     0
   455  0.38920365E-01     0   431   122     0     0     0
   455  0.38906146E-01     0   433   124     0     0     0
   455  0.61062598E-02     0   435   126     0     0     0
   455  0.45766223E-01     0   447   126     0     0     0
   455  0.25044274E+00     0   454   200     0     0     0
   455  0.19449086E+00     0   454   203     0     0     0
   8
   456  0.31504426E-01     0   450   199     0     0     0
   456  0.18911596E+00     0   432   121     0     0     0
   456  0.18849254E+00     0   434   123     0     0     0
   456  0.20263886E+00     0   436   125     0     0     0
   456  0.92282258E-01     0   425   128     0     0     0
   456  0.91862760E-01     0   427   130     0     0     0
   456  0.13841809E+00     0   429   132     0     0     0
   456  0.65685123E-01     0   441   132     0     0     0
  11
   457  0.80895126E-01     0   450   199     0     0     0
   457  0.28087640E+00     0   451   199     0     0     0
   457  0.17122220E-01     0   432   121     0     0     0
   457  0.17116148E-01     0   434   123     0     0     0
   457  0.29357614E-01     0   436   125     0     0     0
   457  0.38920365E-01     0   425   128     0     0     0
   457  0.38906146E-01     0   427   130     0     0     0
   457  0.61062598E-02     0   429   132     0     0     0
   457  0.45766223E-01     0   441   132     0     0     0
   457  0.25044274E+00     0   456   200     0     0     0
   457  0.19449086E+00     0   456   203     0     0     0
  28
   203  0.17397436E-03     0   123   129     0     0     0
   203  0.49759299E-01     0   125   131     0     0     0
   203  0.20892792E-02     0     3     9     0     0     0
   203  0.82489896E+00     0     5    11     0     0     0
   203  0.36830906E-01     0     4    10     0     0     0
   203  0.14235671E-02     0    59    59     0     0     0
   203  0.29736742E-01     0    13    13     0     0     0
   203  0.28509982E-02     0   198   121   128     0     0
   203  0.28509982E-02     0   198   123   130     0     0
   203  0.28509982E-02     0   198   125   132     0     0
   203  0.85529936E-02     0   198     8     1     0     0
   203  0.85529936E-02     0   198    10     3     0     0
   203  0.28509982E-02     0   199   127   122     0     0
   203  0.28509982E-02     0   199   129   124     0     0
   203  0.28509982E-02     0   199   131   126     0     0
   203  0.85529936E-02     0   199     2     7     0     0
   203  0.85529936E-02     0   199     4     9     0     0
   203  0.25780522E-03     0   200   122   128     0     0
   203  0.25780522E-03     0   200   124   130     0     0
   203  0.25780522E-03     0   200   126   132     0     0
   203  0.12975078E-03     0   200   121   127     0     0
   203  0.12975078E-03     0   200   123   129     0     0
   203  0.12975078E-03     0   200   125   131     0     0
   203  0.44451517E-03     0   200     2     8     0     0
   203  0.44451517E-03     0   200     4    10     0     0
   203  0.57264505E-03     0   200     1     7     0     0
   203  0.57264505E-03     0   200     3     9     0     0
   203  0.57264505E-03     0   200     5    11     0     0
  19
   204  0.22684138E-03     0   123   129     0     0     0
   204  0.64966604E-01     0   125   131     0     0     0
   204  0.26740022E-02     0     3     9     0     0     0
   204  0.85959285E+00     0     5    11     0     0     0
   204  0.43136891E-01     0     6    12     0     0     0
   204  0.86716427E-04     0    13    13     0     0     0
   204  0.38141804E-03     0   198   199     0     0     0
   204  0.18427457E-03     0   200   200     0     0     0
   204  0.26542326E-02     0   450   450     0     0     0
   204  0.49166158E-02     0   450   451     0     0     0
   204  0.30533219E-03     0   203   203     0     0     0
   204  0.71618160E-04     0   437   443     0     0     0
   204  0.71434311E-04     0   439   445     0     0     0
   204  0.34661461E-02     0   429   435     0     0     0
   204  0.84852399E-02     0   429   447     0     0     0
   204  0.84852399E-02     0   441   435     0     0     0
   204  0.95672905E-04     0   426   432     0     0     0
   204  0.95216456E-04     0   428   434     0     0     0
   204  0.10363945E-03     0   430   436     0     0     0
  12
   205  0.21883241E-03     0   123   129     0     0     0
   205  0.62675588E-01     0   125   131     0     0     0
   205  0.25796290E-02     0     3     9     0     0     0
   205  0.82955372E+00     0     5    11     0     0     0
   205  0.60480330E-01     0     6    12     0     0     0
   205  0.83432140E-04     0    13    13     0     0     0
   205  0.45480989E-02     0   450   450     0     0     0
   205  0.20455556E-01     0   450   451     0     0     0
   205  0.32821952E-03     0   203   200     0     0     0
   205  0.25747940E-02     0   429   435     0     0     0
   205  0.82510188E-02     0   429   447     0     0     0
   205  0.82510188E-02     0   441   435     0     0     0
  10
   206  0.28337957E-03     0   124   129     0     0     0
   206  0.81162535E-01     0   126   131     0     0     0
   206  0.30555322E-02     0     4     9     0     0     0
   206  0.85536122E+00     0     6    11     0     0     0
   206  0.31745110E-01     0   454   450     0     0     0
   206  0.44734540E-03     0   203   198     0     0     0
   206  0.99977682E-04     0   431   426     0     0     0
   206  0.99160337E-04     0   433   428     0     0     0
   206  0.27664946E-01     0   435   430     0     0     0
   206  0.80807244E-04     0   447   430     0     0     0
  10
   207  0.28337957E-03     0   130   123     0     0     0
   207  0.81162535E-01     0   132   125     0     0     0
   207  0.30555322E-02     0    10     3     0     0     0
   207  0.85536122E+00     0    12     5     0     0     0
   207  0.31745110E-01     0   456   450     0     0     0
   207  0.44734540E-03     0   203   199     0     0     0
   207  0.99977682E-04     0   425   432     0     0     0
   207  0.99160337E-04     0   427   434     0     0     0
   207  0.27664946E-01     0   429   436     0     0     0
   207  0.80807244E-04     0   441   436     0     0     0
   0
   5
     6  0.33333334E+00   100     2     7     5     0     0
     6  0.33333334E+00   100     4     9     5     0     0
     6  0.11111111E+00   100   122   127     5     0     0
     6  0.11111111E+00   100   124   129     5     0     0
     6  0.11111111E+00   100   126   131     5     0     0
   5
    12  0.33333334E+00   100     8     1    11     0     0
    12  0.33333334E+00   100    10     3    11     0     0
    12  0.11111111E+00   100   128   121    11     0     0
    12  0.11111111E+00   100   130   123    11     0     0
    12  0.11111111E+00   100   132   125    11     0     0
     12.61909962     -0.08390608
      0.99370873     -0.02453049      0.10191009     -0.03944286
     -0.05376955     -0.95866412      0.23509887     -0.15099789
      0.04225852     -0.06276691     -0.70145208     -0.70868856
     -0.08869169      0.27644464      0.66506219     -0.68804395
     -0.97617090      0.21700311     -0.21700311     -0.97617090
     -0.94144410      0.33716914     -0.33716914     -0.94144410
     -1.06901193     -0.33176601     -1.35039639
   -724.55999756    824.44299316   -432.54699707
    509.17199707
    F
  0.00000000E+00  0.00000000E+00  0.00000000E+00  0.47653500E-01  0.13383800E-23  0.00000000E+00  0.00000000E+00  0.00000000E+00  0.37933300E-23 -0.47653500E-01 -0.13383800E-23 -0.00000000E+00  0.00000000E+00  0.00000000E+00  0.00000000E+00  0.00000000E+00  0.00000000E+00  0.35305899E-07 -0.00000000E+00 -0.00000000E+00 -0.37933300E-23 -0.00000000E+00 -0.00000000E+00 -0.35305899E-07  0.00000000E+00  0.00000000E+00  0.00000000E+00
  0.57844501E-26  0.00000000E+00  0.00000000E+00  0.00000000E+00  0.12664901E-24  0.00000000E+00  0.00000000E+00  0.00000000E+00  0.53555199E-23  0.53838101E-10 -0.33262801E-36  0.00000000E+00  0.40310399E-37  0.11787700E-08  0.00000000E+00  0.00000000E+00  0.00000000E+00  0.49845902E-07  0.00000000E+00  0.00000000E+00  0.00000000E+00  0.00000000E+00  0.00000000E+00  0.00000000E+00  0.00000000E+00  0.00000000E+00  0.00000000E+00
  0.00000000E+00  0.00000000E+00  0.00000000E+00  0.00000000E+00  0.00000000E+00  0.00000000E+00  0.00000000E+00  0.00000000E+00  0.00000000E+00  0.00000000E+00  0.00000000E+00  0.00000000E+00  0.00000000E+00  0.00000000E+00  0.00000000E+00  0.00000000E+00  0.00000000E+00  0.00000000E+00  0.00000000E+00  0.00000000E+00  0.00000000E+00  0.00000000E+00  0.00000000E+00  0.00000000E+00  0.00000000E+00  0.00000000E+00  0.00000000E+00
