  65
  401    515.5393    0.13305E-24
  402    510.1422    0.12871E-24
  403    515.5394    0.13305E-24
  404    510.1442    0.12871E-24
  405    472.0556    0.16162E-24
  406    347.3227    0.33594E-24
  407    515.5393    0.13305E-24
  408    510.1422    0.12871E-24
  409    515.5394    0.13305E-24
  410    510.1442    0.12871E-24
  411    472.0556    0.16162E-24
  412    347.3227    0.33594E-24
  413    496.1499    0.25283E-23
  414    496.3248    0.63182E-24
  415    496.1499    0.25283E-23
  416    496.3268    0.63182E-24
  417    495.8139    0.15922E-23
  418    540.8985    0.11871E-24
  419    496.1499    0.25283E-23
  420    496.3248    0.63182E-24
  421    496.1499    0.25283E-23
  422    496.3268    0.63182E-24
  423    495.8139    0.15922E-23
  424    540.8985    0.11871E-24
  425    199.6092    0.12021E-23
  426    185.1897    0.14186E-23
  427    199.6092    0.12021E-23
  428    185.1897    0.14186E-23
  429    153.5527    0.17472E-23
  430    184.2813    0.14583E-23
  431    199.6092    0.12021E-23
  432    185.1897    0.14186E-23
  433    199.6092    0.12021E-23
  434    185.1897    0.14186E-23
  435    153.5527    0.17472E-23
  436    184.2813    0.14583E-23
  437    153.7223    0.17244E-23
  438      0.0000    0.10000E+31
  439    153.7223    0.17244E-23
  440      0.0000    0.10000E+31
  441    199.3556    0.12151E-23
  442      0.0000    0.10000E+31
  443    153.7223    0.17244E-23
  444      0.0000    0.10000E+31
  445    153.7223    0.17244E-23
  446      0.0000    0.10000E+31
  447    199.3556    0.12151E-23
  448      0.0000    0.10000E+31
  449    543.3849    0.18050E-24
  450     81.7833    0.10000E+31
  451    150.1404    0.26921E-19
  452   -338.1641    0.30763E-24
  453    368.1854    0.21792E-24
  454    148.4393    0.43628E-20
  455    363.4801    0.22129E-24
  456    148.4393    0.43628E-20
  457    363.4801    0.22129E-24
  203     95.9626    0.17443E-21
  204    413.9978    0.64298E-24
  205    407.4771    0.25375E-24
  206    417.6594    0.35139E-24
  207    417.6594    0.35139E-24
  458      0.0000    0.10000E+31
    6    172.5000    0.57395E-24
   12    172.5000    0.57395E-24
   6
   401  0.37108012E-01     0   450     1     0     0     0
   401  0.29665521E+00     0   451     1     0     0     0
   401  0.84809418E-03     0   452     1     0     0     0
   401  0.13809953E-01     0   453     1     0     0     0
   401  0.61447001E+00     0   456     2     0     0     0
   401  0.37108742E-01     0   457     2     0     0     0
   6
   402  0.13738574E-02     0   450     2     0     0     0
   402  0.32501885E+00     0   451     2     0     0     0
   402  0.48039487E-03     0   452     2     0     0     0
   402  0.95143067E-02     0   453     2     0     0     0
   402  0.64731699E+00     0   454     1     0     0     0
   402  0.16295565E-01     0   455     1     0     0     0
   6
   403  0.37108455E-01     0   450     3     0     0     0
   403  0.29665878E+00     0   451     3     0     0     0
   403  0.84810460E-03     0   452     3     0     0     0
   403  0.13810124E-01     0   453     3     0     0     0
   403  0.61446732E+00     0   456     4     0     0     0
   403  0.37107188E-01     0   457     4     0     0     0
   6
   404  0.13738434E-02     0   450     4     0     0     0
   404  0.32501528E+00     0   451     4     0     0     0
   404  0.48038128E-03     0   452     4     0     0     0
   404  0.95139248E-02     0   453     4     0     0     0
   404  0.64732069E+00     0   454     3     0     0     0
   404  0.16295891E-01     0   455     3     0     0     0
   6
   405  0.43291580E-01     0   450     5     0     0     0
   405  0.31071168E+00     0   451     5     0     0     0
   405  0.91124384E-03     0   452     5     0     0     0
   405  0.91851261E-02     0   453     5     0     0     0
   405  0.41461074E+00     0   456     6     0     0     0
   405  0.22128962E+00     0   199   406     0     0     0
   3
   406  0.14933500E+00     0   450     6     0     0     0
   406  0.92902929E-01     0   451     6     0     0     0
   406  0.75776207E+00     0   454     5     0     0     0
   6
   407  0.37108012E-01     0   450     7     0     0     0
   407  0.29665521E+00     0   451     7     0     0     0
   407  0.84809418E-03     0   452     7     0     0     0
   407  0.13809953E-01     0   453     7     0     0     0
   407  0.61447001E+00     0   454     8     0     0     0
   407  0.37108742E-01     0   455     8     0     0     0
   6
   408  0.13738574E-02     0   450     8     0     0     0
   408  0.32501885E+00     0   451     8     0     0     0
   408  0.48039487E-03     0   452     8     0     0     0
   408  0.95143067E-02     0   453     8     0     0     0
   408  0.64731699E+00     0   456     7     0     0     0
   408  0.16295565E-01     0   457     7     0     0     0
   6
   409  0.37108455E-01     0   450     9     0     0     0
   409  0.29665878E+00     0   451     9     0     0     0
   409  0.84810460E-03     0   452     9     0     0     0
   409  0.13810124E-01     0   453     9     0     0     0
   409  0.61446732E+00     0   454    10     0     0     0
   409  0.37107188E-01     0   455    10     0     0     0
   6
   410  0.13738434E-02     0   450    10     0     0     0
   410  0.32501528E+00     0   451    10     0     0     0
   410  0.48038128E-03     0   452    10     0     0     0
   410  0.95139248E-02     0   453    10     0     0     0
   410  0.64732069E+00     0   456     9     0     0     0
   410  0.16295891E-01     0   457     9     0     0     0
   6
   411  0.43291580E-01     0   450    11     0     0     0
   411  0.31071168E+00     0   451    11     0     0     0
   411  0.91124384E-03     0   452    11     0     0     0
   411  0.91851261E-02     0   453    11     0     0     0
   411  0.41461074E+00     0   454    12     0     0     0
   411  0.22128962E+00     0   198   412     0     0     0
   3
   412  0.14933500E+00     0   450    12     0     0     0
   412  0.92902929E-01     0   451    12     0     0     0
   412  0.75776207E+00     0   456    11     0     0     0
   4
   413  0.96796930E+00     0   450     1     0     0     0
   413  0.27652606E-01     0   451     1     0     0     0
   413  0.65230764E-03     0   452     1     0     0     0
   413  0.37257597E-02     0   453     1     0     0     0
   4
   414  0.96795976E+00     0   450     2     0     0     0
   414  0.27655175E-01     0   451     2     0     0     0
   414  0.65307331E-03     0   452     2     0     0     0
   414  0.37320144E-02     0   453     2     0     0     0
   4
   415  0.96796930E+00     0   450     3     0     0     0
   415  0.27652608E-01     0   451     3     0     0     0
   415  0.65230776E-03     0   452     3     0     0     0
   415  0.37257611E-02     0   453     3     0     0     0
   4
   416  0.96795994E+00     0   450     4     0     0     0
   416  0.27655145E-01     0   451     4     0     0     0
   416  0.65305864E-03     0   452     4     0     0     0
   416  0.37318713E-02     0   453     4     0     0     0
   6
   417  0.58580464E+00     0   450     5     0     0     0
   417  0.10084455E+00     0   451     5     0     0     0
   417  0.10705959E-01     0   452     5     0     0     0
   417  0.20933645E-01     0   453     5     0     0     0
   417  0.11943324E+00     0   456     6     0     0     0
   417  0.16227800E+00     0   199   406     0     0     0
   8
   418  0.22389315E+00     0   454     5     0     0     0
   418  0.24787718E+00     0   455     5     0     0     0
   418  0.28121471E+00     0   200   406     0     0     0
   418  0.59619747E-01     0   203   406     0     0     0
   418  0.25036609E-01     0   450     6     0     0     0
   418  0.10562280E+00     0   451     6     0     0     0
   418  0.34500748E-01     0   452     6     0     0     0
   418  0.22235045E-01     0   453     6     0     0     0
   4
   419  0.96796930E+00     0   450     7     0     0     0
   419  0.27652606E-01     0   451     7     0     0     0
   419  0.65230764E-03     0   452     7     0     0     0
   419  0.37257597E-02     0   453     7     0     0     0
   4
   420  0.96795976E+00     0   450     8     0     0     0
   420  0.27655175E-01     0   451     8     0     0     0
   420  0.65307331E-03     0   452     8     0     0     0
   420  0.37320144E-02     0   453     8     0     0     0
   4
   421  0.96796930E+00     0   450     9     0     0     0
   421  0.27652608E-01     0   451     9     0     0     0
   421  0.65230776E-03     0   452     9     0     0     0
   421  0.37257611E-02     0   453     9     0     0     0
   4
   422  0.96795994E+00     0   450    10     0     0     0
   422  0.27655145E-01     0   451    10     0     0     0
   422  0.65305864E-03     0   452    10     0     0     0
   422  0.37318713E-02     0   453    10     0     0     0
   6
   423  0.58580464E+00     0   450    11     0     0     0
   423  0.10084455E+00     0   451    11     0     0     0
   423  0.10705959E-01     0   452    11     0     0     0
   423  0.20933645E-01     0   453    11     0     0     0
   423  0.11943324E+00     0   454    12     0     0     0
   423  0.16227800E+00     0   198   412     0     0     0
   8
   424  0.22389315E+00     0   456    11     0     0     0
   424  0.24787718E+00     0   457    11     0     0     0
   424  0.28121471E+00     0   200   412     0     0     0
   424  0.59619747E-01     0   203   412     0     0     0
   424  0.25036609E-01     0   450    12     0     0     0
   424  0.10562280E+00     0   451    12     0     0     0
   424  0.34500748E-01     0   452    12     0     0     0
   424  0.22235045E-01     0   453    12     0     0     0
   3
   425  0.18368548E+00     0   450   121     0     0     0
   425  0.30568546E+00     0   451   121     0     0     0
   425  0.51062906E+00     0   456   122     0     0     0
   3
   426  0.46767256E+00     0   450   122     0     0     0
   426  0.13722748E+00     0   451   122     0     0     0
   426  0.39509997E+00     0   454   121     0     0     0
   3
   427  0.18368547E+00     0   450   123     0     0     0
   427  0.30568486E+00     0   451   123     0     0     0
   427  0.51062965E+00     0   456   124     0     0     0
   3
   428  0.46767348E+00     0   450   124     0     0     0
   428  0.13722774E+00     0   451   124     0     0     0
   428  0.39509878E+00     0   454   123     0     0     0
   3
   429  0.99949437E+00     0   450   125     0     0     0
   429  0.24308702E-03     0   451   125     0     0     0
   429  0.26256684E-03     0   456   126     0     0     0
   3
   430  0.47610846E+00     0   450   126     0     0     0
   430  0.13510296E+00     0   451   126     0     0     0
   430  0.38878861E+00     0   454   125     0     0     0
   3
   431  0.18368548E+00     0   450   127     0     0     0
   431  0.30568546E+00     0   451   127     0     0     0
   431  0.51062906E+00     0   454   128     0     0     0
   3
   432  0.46767256E+00     0   450   128     0     0     0
   432  0.13722748E+00     0   451   128     0     0     0
   432  0.39509997E+00     0   456   127     0     0     0
   3
   433  0.18368547E+00     0   450   129     0     0     0
   433  0.30568486E+00     0   451   129     0     0     0
   433  0.51062965E+00     0   454   130     0     0     0
   3
   434  0.46767348E+00     0   450   130     0     0     0
   434  0.13722774E+00     0   451   130     0     0     0
   434  0.39509878E+00     0   456   129     0     0     0
   3
   435  0.99949437E+00     0   450   131     0     0     0
   435  0.24308702E-03     0   451   131     0     0     0
   435  0.26256684E-03     0   454   132     0     0     0
   3
   436  0.47610846E+00     0   450   132     0     0     0
   436  0.13510296E+00     0   451   132     0     0     0
   436  0.38878861E+00     0   456   131     0     0     0
   2
   437  0.99986482E+00     0   450   121     0     0     0
   437  0.13519065E-03     0   451   121     0     0     0
   0
   2
   439  0.99986488E+00     0   450   123     0     0     0
   439  0.13513507E-03     0   451   123     0     0     0
   0
   3
   441  0.19851068E+00     0   450   125     0     0     0
   441  0.29995099E+00     0   451   125     0     0     0
   441  0.50153834E+00     0   456   126     0     0     0
   0
   2
   443  0.99986482E+00     0   450   127     0     0     0
   443  0.13519065E-03     0   451   127     0     0     0
   0
   2
   445  0.99986488E+00     0   450   129     0     0     0
   445  0.13513507E-03     0   451   129     0     0     0
   0
   3
   447  0.19851068E+00     0   450   131     0     0     0
   447  0.29995099E+00     0   451   131     0     0     0
   447  0.50153834E+00     0   454   132     0     0     0
   0
  26
   449  0.10501986E-03     0   454     5    12     0     0
   449  0.10501986E-03     0   456     6    11     0     0
   449  0.24974839E-04     0   452    13     0     0     0
   449  0.12682783E-04     0   453    13     0     0     0
   449  0.25748393E-01     0   408     2     0     0     0
   449  0.25748393E-01     0   402     8     0     0     0
   449  0.18251954E-01     0   407     1     0     0     0
   449  0.18251954E-01     0   401     7     0     0     0
   449  0.50256930E-01     0   420     2     0     0     0
   449  0.50256930E-01     0   414     8     0     0     0
   449  0.50614145E-01     0   419     1     0     0     0
   449  0.50614145E-01     0   413     7     0     0     0
   449  0.18251430E-01     0   409     3     0     0     0
   449  0.18251430E-01     0   403     9     0     0     0
   449  0.50613664E-01     0   421     3     0     0     0
   449  0.50613664E-01     0   415     9     0     0     0
   449  0.25725542E-01     0   410     4     0     0     0
   449  0.25725542E-01     0   404    10     0     0     0
   449  0.50234027E-01     0   422     4     0     0     0
   449  0.50234027E-01     0   416    10     0     0     0
   449  0.10690769E+00     0   411     5     0     0     0
   449  0.10690769E+00     0   405    11     0     0     0
   449  0.53078547E-01     0   423     5     0     0     0
   449  0.53078547E-01     0   417    11     0     0     0
   449  0.50193835E-01     0   412     6     0     0     0
   449  0.50193835E-01     0   406    12     0     0     0
   0
  12
   451  0.10741074E-02     0   450    59     0     0     0
   451  0.19050477E-01     0   450     2     8     0     0
   451  0.29801654E-01     0   450     1     7     0     0
   451  0.29801654E-01     0   450     3     9     0     0
   451  0.19050455E-01     0   450     4    10     0     0
   451  0.31821962E-01     0   450     5    11     0     0
   451  0.16630636E+00     0   450   121   127     0     0
   451  0.16630565E+00     0   450   123   129     0     0
   451  0.20577072E+00     0   450   125   131     0     0
   451  0.10866902E+00     0   450   122   128     0     0
   451  0.10866902E+00     0   450   124   130     0     0
   451  0.11367891E+00     0   450   126   132     0     0
  24
   452  0.30596873E+00     0   454   199     0     0     0
   452  0.30596873E+00     0   456   198     0     0     0
   452  0.14137478E+00     0   450   200     0     0     0
   452  0.21215746E+00     0   451   200     0     0     0
   452  0.12014442E-01     0   450   203     0     0     0
   452  0.74579157E-02     0   451   203     0     0     0
   452  0.26716630E-03     0   425   127     0     0     0
   452  0.26716630E-03     0   431   121     0     0     0
   452  0.26716621E-03     0   427   129     0     0     0
   452  0.26716621E-03     0   433   123     0     0     0
   452  0.53441490E-03     0   437   127     0     0     0
   452  0.53441490E-03     0   443   121     0     0     0
   452  0.53441466E-03     0   439   129     0     0     0
   452  0.53441466E-03     0   445   123     0     0     0
   452  0.80811145E-03     0   429   131     0     0     0
   452  0.80811145E-03     0   435   125     0     0     0
   452  0.78217656E-03     0   441   131     0     0     0
   452  0.78217656E-03     0   447   125     0     0     0
   452  0.14411404E-02     0   426   128     0     0     0
   452  0.14411405E-02     0   432   122     0     0     0
   452  0.14411404E-02     0   428   130     0     0     0
   452  0.14411405E-02     0   434   124     0     0     0
   452  0.14532489E-02     0   430   132     0     0     0
   452  0.14532489E-02     0   436   126     0     0     0
  24
   453  0.27275208E+00     0   454   199     0     0     0
   453  0.27275208E+00     0   456   198     0     0     0
   453  0.11171642E-01     0   450   200     0     0     0
   453  0.85679777E-02     0   451   200     0     0     0
   453  0.80581762E-01     0   450   203     0     0     0
   453  0.13246246E+00     0   451   203     0     0     0
   453  0.90650972E-02     0   425   127     0     0     0
   453  0.90650972E-02     0   431   121     0     0     0
   453  0.90650953E-02     0   427   129     0     0     0
   453  0.90650953E-02     0   433   123     0     0     0
   453  0.36216695E-02     0   437   127     0     0     0
   453  0.36216695E-02     0   443   121     0     0     0
   453  0.36216681E-02     0   439   129     0     0     0
   453  0.36216681E-02     0   445   123     0     0     0
   453  0.33113041E-02     0   429   131     0     0     0
   453  0.33113041E-02     0   435   125     0     0     0
   453  0.97721592E-02     0   441   131     0     0     0
   453  0.97721592E-02     0   447   125     0     0     0
   453  0.24079718E-01     0   426   128     0     0     0
   453  0.24079716E-01     0   432   122     0     0     0
   453  0.24079718E-01     0   428   130     0     0     0
   453  0.24079716E-01     0   434   124     0     0     0
   453  0.24239596E-01     0   430   132     0     0     0
   453  0.24239596E-01     0   436   126     0     0     0
   5
   454  0.28898957E+00     0   450     2     7     0     0
   454  0.28898957E+00     0   450     4     9     0     0
   454  0.13873394E+00     0   450   127   122     0     0
   454  0.13873394E+00     0   450   129   124     0     0
   454  0.14455299E+00     0   450   131   126     0     0
  12
   455  0.35403855E-01     0   450   198     0     0     0
   455  0.32096043E+00     0   451   198     0     0     0
   455  0.10380215E-01     0   406    11     0     0     0
   455  0.22574391E-01     0   426   127     0     0     0
   455  0.22574389E-01     0   428   129     0     0     0
   455  0.23214679E-01     0   430   131     0     0     0
   455  0.41965052E-01     0   431   122     0     0     0
   455  0.41965045E-01     0   433   124     0     0     0
   455  0.12269762E-04     0   435   126     0     0     0
   455  0.42563051E-01     0   447   126     0     0     0
   455  0.25799537E+00     0   454   200     0     0     0
   455  0.18039122E+00     0   454   203     0     0     0
   5
   456  0.28898957E+00     0   450     8     1     0     0
   456  0.28898957E+00     0   450    10     3     0     0
   456  0.13873394E+00     0   450   121   128     0     0
   456  0.13873394E+00     0   450   123   130     0     0
   456  0.14455299E+00     0   450   125   132     0     0
  12
   457  0.35403855E-01     0   450   199     0     0     0
   457  0.32096043E+00     0   451   199     0     0     0
   457  0.10380215E-01     0   412     5     0     0     0
   457  0.22574391E-01     0   432   121     0     0     0
   457  0.22574389E-01     0   434   123     0     0     0
   457  0.23214679E-01     0   436   125     0     0     0
   457  0.41965052E-01     0   425   128     0     0     0
   457  0.41965045E-01     0   427   130     0     0     0
   457  0.12269762E-04     0   429   132     0     0     0
   457  0.42563051E-01     0   441   132     0     0     0
   457  0.25799537E+00     0   456   200     0     0     0
   457  0.18039122E+00     0   456   203     0     0     0
  17
   203  0.21614200E-03     0   123   129     0     0     0
   203  0.61779503E-01     0   125   131     0     0     0
   203  0.26033644E-02     0     3     9     0     0     0
   203  0.87547445E+00     0     5    11     0     0     0
   203  0.33008557E-01     0     4    10     0     0     0
   203  0.10446083E-02     0    59    59     0     0     0
   203  0.24547888E-01     0    13    13     0     0     0
   203  0.73637937E-04     0   198   121   128     0     0
   203  0.73637937E-04     0   198   123   130     0     0
   203  0.73637937E-04     0   198   125   132     0     0
   203  0.22091380E-03     0   198     8     1     0     0
   203  0.22091380E-03     0   198    10     3     0     0
   203  0.73637937E-04     0   199   127   122     0     0
   203  0.73637937E-04     0   199   129   124     0     0
   203  0.73637937E-04     0   199   131   126     0     0
   203  0.22091380E-03     0   199     2     7     0     0
   203  0.22091380E-03     0   199     4     9     0     0
  24
   204  0.25580790E-04     0   123   129     0     0     0
   204  0.73259235E-02     0   125   131     0     0     0
   204  0.30231124E-03     0     3     9     0     0     0
   204  0.47464136E-01     0     5    11     0     0     0
   204  0.56185789E-04     0     4    10     0     0     0
   204  0.64532858E+00     0     6    12     0     0     0
   204  0.16926550E-04     0    59    59     0     0     0
   204  0.22114604E-02     0    13    13     0     0     0
   204  0.15770977E-01     0   198   199     0     0     0
   204  0.75966897E-02     0   200   200     0     0     0
   204  0.18035095E-01     0   450   450     0     0     0
   204  0.49105257E-01     0   450   451     0     0     0
   204  0.26617652E-01     0   451   451     0     0     0
   204  0.89998648E-01     0   454   456     0     0     0
   204  0.47607567E-01     0   203   203     0     0     0
   204  0.16102088E-02     0   425   431     0     0     0
   204  0.30516905E-02     0   437   443     0     0     0
   204  0.16101329E-02     0   427   433     0     0     0
   204  0.30515252E-02     0   439   445     0     0     0
   204  0.30768700E-02     0   429   435     0     0     0
   204  0.15841473E-02     0   441   447     0     0     0
   204  0.94562331E-02     0   426   432     0     0     0
   204  0.94562331E-02     0   428   434     0     0     0
   204  0.96399728E-02     0   430   436     0     0     0
  12
   205  0.10144357E-04     0   123   129     0     0     0
   205  0.29053895E-02     0   125   131     0     0     0
   205  0.11990398E-03     0     3     9     0     0     0
   205  0.18830981E-01     0     5    11     0     0     0
   205  0.18465815E-04     0     4    10     0     0     0
   205  0.64207304E+00     0     6    12     0     0     0
   205  0.66629512E-03     0    13    13     0     0     0
   205  0.18193079E-01     0   450   450     0     0     0
   205  0.66579126E-01     0   450   451     0     0     0
   205  0.58807008E-01     0   451   451     0     0     0
   205  0.18651672E+00     0   454   456     0     0     0
   205  0.52798716E-02     0   203   200     0     0     0
  11
   206  0.14398656E-04     0   124   129     0     0     0
   206  0.41238470E-02     0   126   131     0     0     0
   206  0.17897075E-03     0     4     9     0     0     0
   206  0.87327874E+00     0     6    11     0     0     0
   206  0.96170641E-01     0   454   450     0     0     0
   206  0.32615340E-02     0   454   451     0     0     0
   206  0.82411319E-02     0   203   198     0     0     0
   206  0.48679663E-02     0   431   426     0     0     0
   206  0.48678829E-02     0   433   428     0     0     0
   206  0.19165080E-03     0   435   430     0     0     0
   206  0.48032356E-02     0   447   430     0     0     0
  11
   207  0.14398656E-04     0   130   123     0     0     0
   207  0.41238470E-02     0   132   125     0     0     0
   207  0.17897075E-03     0    10     3     0     0     0
   207  0.87327874E+00     0    12     5     0     0     0
   207  0.96170641E-01     0   456   450     0     0     0
   207  0.32615340E-02     0   456   451     0     0     0
   207  0.82411319E-02     0   203   199     0     0     0
   207  0.48679663E-02     0   425   432     0     0     0
   207  0.48678829E-02     0   427   434     0     0     0
   207  0.19165080E-03     0   429   436     0     0     0
   207  0.48032356E-02     0   441   436     0     0     0
   0
   5
     6  0.33333334E+00   100     2     7     5     0     0
     6  0.33333334E+00   100     4     9     5     0     0
     6  0.11111111E+00   100   122   127     5     0     0
     6  0.11111111E+00   100   124   129     5     0     0
     6  0.11111111E+00   100   126   131     5     0     0
   5
    12  0.33333334E+00   100     8     1    11     0     0
    12  0.33333334E+00   100    10     3    11     0     0
    12  0.11111111E+00   100   128   121    11     0     0
    12  0.11111111E+00   100   130   123    11     0     0
    12  0.11111111E+00   100   132   125    11     0     0
      3.00000000     -0.35135362
      0.97449476     -0.11982642      0.16720161     -0.08969385
     -0.17638575     -0.93089288      0.26394603     -0.18071719
     -0.04596103      0.06875598      0.69847184      0.71084225
     -0.13090211      0.33816040      0.64382648     -0.67379469
     -0.95914066      0.28292963     -0.28292963     -0.95914066
     -0.91255510      0.40895373     -0.40895373     -0.91255510
     -0.96856809     -0.18558365     -1.44615531
   -395.81512451   -631.26916504   -139.49729919
    335.94903564
    T
