#  ISAJET SUSY parameters in SUSY Les Houches Accord 2 format
#  Created by ISALHA 2.0 Last revision: C. Balazs 21 Apr 2009
Block SPINFO   # Program information
     1   ISASUGRA from ISAJET          # Spectrum Calculator
     2   7.80   29-OCT-2009 12:50:36   # Version number
Block MODSEL   # Model selection
     1     1   # Minimal supergravity (mSUGRA) model               
Block SMINPUTS   # Standard Model inputs
     1     1.27842194E+02   # alpha_em^(-1)
     2     1.16570000E-05   # G_Fermi
     3     1.17200002E-01   # alpha_s(M_Z)
     4     9.11699982E+01   # m_{Z}(pole)
     5     4.19999981E+00   # m_{b}(m_{b})
     6     1.72500000E+02   # m_{top}(pole)
     7     1.77699995E+00   # m_{tau}(pole)
Block MINPAR   # SUSY breaking input parameters
     1     8.20000000E+02   # m_0
     2     2.10000000E+02   # m_{1/2}
     3     1.00000000E+01   # tan(beta)
     4     1.00000000E+00   # sign(mu)
     5     0.00000000E+00   # A_0
Block EXTPAR   # Non-universal SUSY breaking parameters
     0     2.52626862E+16   # Input scale
Block MASS   # Scalar and gaugino mass spectrum
#  PDG code   mass                 particle
        24     8.04229965E+01   #  W^+
        25     1.09569611E+02   #  h^0            
        35     8.74577454E+02   #  H^0            
        36     8.68669250E+02   #  A^0            
        37     8.78318298E+02   #  H^+            
   1000001     9.33675232E+02   #  dnl            
   1000002     9.30246033E+02   #  upl            
   1000003     9.33675232E+02   #  stl            
   1000004     9.30247009E+02   #  chl            
   1000005     7.84116394E+02   #  b1             
   1000006     5.97785400E+02   #  t1             
   1000011     8.30898376E+02   #  el-            
   1000012     8.27031616E+02   #  nuel           
   1000013     8.30898376E+02   #  mul-           
   1000014     8.27031616E+02   #  numl           
   1000015     8.14998596E+02   #  tau1           
   1000016     8.23322876E+02   #  nutl           
   1000021     5.64273499E+02   #  glss           
   1000022     8.25329971E+01   #  z1ss           
   1000023     1.51494034E+02   #  z2ss           
   1000024     1.51635406E+02   #  w1ss           
   1000025    -3.09006104E+02   #  z3ss           
   1000035     3.31651367E+02   #  z4ss           
   1000037     3.30992767E+02   #  w2ss           
   2000001     9.27609375E+02   #  dnr            
   2000002     9.26991028E+02   #  upr            
   2000003     9.27609436E+02   #  str            
   2000004     9.26992065E+02   #  chr            
   2000005     9.17786072E+02   #  b2             
   2000006     8.03279480E+02   #  t2             
   2000011     8.23735413E+02   #  er-            
   2000013     8.23735413E+02   #  mur-           
   2000015     8.28135681E+02   #  tau2           
Block ALPHA   # Effective Higgs mixing parameter
         -1.02141209E-01   # alpha
Block STOPMIX   # stop mixing matrix
  1  1     2.04257816E-01   # O_{11}
  1  2     9.78917122E-01   # O_{12}
  2  1    -9.78917122E-01   # O_{21}
  2  2     2.04257816E-01   # O_{22}
Block SBOTMIX   # sbottom mixing matrix
  1  1     9.99235392E-01   # O_{11}
  1  2     3.90984155E-02   # O_{12}
  2  1    -3.90984155E-02   # O_{21}
  2  2     9.99235392E-01   # O_{22}
Block STAUMIX   # stau mixing matrix
  1  1     2.87768841E-01   # O_{11}
  1  2     9.57699895E-01   # O_{12}
  2  1    -9.57699895E-01   # O_{21}
  2  2     2.87768841E-01   # O_{22}
Block NMIX   # neutralino mixing matrix
  1  1     9.79120314E-01   #
  1  2    -7.60967657E-02   #
  1  3     1.77122235E-01   #
  1  4    -6.45022914E-02   #
  2  1    -1.39486521E-01   #
  2  2    -9.23416793E-01   #
  2  3     3.08554024E-01   #
  2  4    -1.80664241E-01   #
  3  1    -7.02938288E-02   #
  3  2     1.02567516E-01   #
  3  3     6.91710532E-01   #
  3  4     7.11389422E-01   #
  4  1    -1.30099356E-01   #
  4  2     3.61926466E-01   #
  4  3     6.28456950E-01   #
  4  4    -6.76110268E-01   #
Block UMIX   # chargino U mixing matrix
  1  1    -8.92544270E-01   # U_{11}
  1  2     4.50959772E-01   # U_{12}
  2  1    -4.50959772E-01   # U_{21}
  2  2    -8.92544270E-01   # U_{22}
Block VMIX   # chargino V mixing matrix
  1  1    -9.64506865E-01   # V_{11}
  1  2     2.64057845E-01   # V_{12}
  2  1    -2.64057845E-01   # V_{21}
  2  2    -9.64506865E-01   # V_{22}
Block GAUGE Q=  6.60533752E+02   #
     1     3.57496023E-01   # g`
     2     6.52489066E-01   # g_2
     3     1.22085106E+00   # g_3
Block YU Q=  6.60533752E+02   #
  3  3     8.76905143E-01   # y_t
Block YD Q=  6.60533752E+02   #
  3  3     1.38038948E-01   # y_b
Block YE Q=  6.60533752E+02   #
  3  3     1.01611845E-01   # y_tau
Block HMIX Q=  6.60533752E+02   # Higgs mixing parameters
     1     2.99848572E+02   # mu(Q)
     2     1.00000000E+01   # tan(beta)(M_GUT)
     3     2.50681763E+02   # Higgs vev at Q
     4     7.54586250E+05   # m_A^2(Q)
Block MSOFT Q=  6.60533752E+02   # DRbar SUSY breaking parameters
     1     8.63743973E+01   # M_1(Q)          
     2     1.62293045E+02   # M_2(Q)          
     3     4.96497437E+02   # M_3(Q)          
    31     8.27344177E+02   # MeL(Q)          
    32     8.27344177E+02   # MmuL(Q)         
    33     8.23707825E+02   # MtauL(Q)        
    34     8.21848022E+02   # MeR(Q)          
    35     8.21848022E+02   # MmuR(Q)         
    36     8.14406494E+02   # MtauR(Q)        
    41     9.07945435E+02   # MqL1(Q)         
    42     9.07945435E+02   # MqL2(Q)         
    43     7.61425049E+02   # MqL3(Q)         
    44     9.03821472E+02   # MuR(Q)          
    45     9.03821472E+02   # McR(Q)          
    46     5.73010864E+02   # MtR(Q)          
    47     9.03396790E+02   # MdR(Q)          
    48     9.03396790E+02   # MsR(Q)          
    49     8.98905518E+02   # MbR(Q)          
Block AU Q=  6.60533752E+02   #
  1  1    -3.81250854E+02   # A_u
  2  2    -3.81250854E+02   # A_c
  3  3    -3.81250854E+02   # A_t
Block AD Q=  6.60533752E+02   #
  1  1    -5.72171265E+02   # A_d
  2  2    -5.72171265E+02   # A_s
  3  3    -5.72171265E+02   # A_b
Block AE Q=  6.60533752E+02   #
  1  1    -1.27435776E+02   # A_e
  2  2    -1.27435776E+02   # A_mu
  3  3    -1.27435776E+02   # A_tau
#  ISAJET decay tables in SUSY Les Houches accord format
#  Created by ISALHD. Last revision: C. Balazs, 2005 May 25
Block DCINFO                           # Program information
     1   ISASUGRA from ISAJET          # Spectrum Calculator
     2   7.80   29-OCT-2009 12:50:36   # Version number
#         PDG         Width
DECAY         6  1.14680779E+00   # TP    decays
#          BR          NDA       ID1       ID2       ID3       ID4
      3.33333343E-01    3            2        -1         5             # TP     -->  UP     DB     BT          
      3.33333343E-01    3            4        -3         5             # TP     -->  CH     SB     BT          
      1.11111112E-01    3          -11        12         5             # TP     -->  E+     NUE    BT          
      1.11111112E-01    3          -13        14         5             # TP     -->  MU+    NUM    BT          
      1.11111112E-01    3          -15        16         5             # TP     -->  TAU+   NUT    BT          
#         PDG         Width
DECAY   1000021  4.47984226E-03   # GLSS  decays
#          BR          NDA       ID1       ID2       ID3       ID4
      9.22683999E-02    3      1000024         1        -2             # GLSS   -->  W1SS+  DN     UB          
      9.22683999E-02    3     -1000024         2        -1             # GLSS   -->  W1SS-  UP     DB          
      9.22681391E-02    3      1000024         3        -4             # GLSS   -->  W1SS+  ST     CB          
      9.22681391E-02    3     -1000024         4        -3             # GLSS   -->  W1SS-  CH     SB          
      5.49130514E-02    3      1000024         5        -6             # GLSS   -->  W1SS+  BT     TB          
      5.49130514E-02    3     -1000024         6        -5             # GLSS   -->  W1SS-  TP     BB          
      2.29295879E-03    3      1000037         1        -2             # GLSS   -->  W2SS+  DN     UB          
      2.29295879E-03    3     -1000037         2        -1             # GLSS   -->  W2SS-  UP     DB          
      2.29295460E-03    3      1000037         3        -4             # GLSS   -->  W2SS+  ST     CB          
      2.29295460E-03    3     -1000037         4        -3             # GLSS   -->  W2SS-  CH     SB          
      8.64263345E-03    3      1000037         5        -6             # GLSS   -->  W2SS+  BT     TB          
      8.64263345E-03    3     -1000037         6        -5             # GLSS   -->  W2SS-  TP     BB          
      2.46954383E-04    2      1000022        21                       # GLSS   -->  Z1SS   GL                 
      3.67303826E-02    3      1000022         2        -2             # GLSS   -->  Z1SS   UP     UB          
      1.33794239E-02    3      1000022         1        -1             # GLSS   -->  Z1SS   DN     DB          
      1.33794211E-02    3      1000022         3        -3             # GLSS   -->  Z1SS   ST     SB          
      3.67301889E-02    3      1000022         4        -4             # GLSS   -->  Z1SS   CH     CB          
      2.06450280E-02    3      1000022         5        -5             # GLSS   -->  Z1SS   BT     BB          
      2.57859211E-02    3      1000022         6        -6             # GLSS   -->  Z1SS   TP     TB          
      4.85348050E-03    2      1000023        21                       # GLSS   -->  Z2SS   GL                 
      4.91660982E-02    3      1000023         2        -2             # GLSS   -->  Z2SS   UP     UB          
      4.28699628E-02    3      1000023         1        -1             # GLSS   -->  Z2SS   DN     DB          
      4.28699628E-02    3      1000023         3        -3             # GLSS   -->  Z2SS   ST     SB          
      4.91658449E-02    3      1000023         4        -4             # GLSS   -->  Z2SS   CH     CB          
      1.05429620E-01    3      1000023         5        -5             # GLSS   -->  Z2SS   BT     BB          
      2.18972773E-03    3      1000023         6        -6             # GLSS   -->  Z2SS   TP     TB          
      2.19881050E-02    2      1000025        21                       # GLSS   -->  Z3SS   GL                 
      5.10793434E-05    3      1000025         2        -2             # GLSS   -->  Z3SS   UP     UB          
      6.53087336E-05    3      1000025         1        -1             # GLSS   -->  Z3SS   DN     DB          
      6.53087336E-05    3      1000025         3        -3             # GLSS   -->  Z3SS   ST     SB          
      5.10790487E-05    3      1000025         4        -4             # GLSS   -->  Z3SS   CH     CB          
      2.19666795E-03    3      1000025         5        -5             # GLSS   -->  Z3SS   BT     BB          
      1.71778575E-02    2      1000035        21                       # GLSS   -->  Z4SS   GL                 
      1.08330650E-03    3      1000035         2        -2             # GLSS   -->  Z4SS   UP     UB          
      1.29978592E-03    3      1000035         1        -1             # GLSS   -->  Z4SS   DN     DB          
      1.29978592E-03    3      1000035         3        -3             # GLSS   -->  Z4SS   ST     SB          
      1.08330057E-03    3      1000035         4        -4             # GLSS   -->  Z4SS   CH     CB          
      4.84034186E-03    3      1000035         5        -5             # GLSS   -->  Z4SS   BT     BB          
#         PDG         Width
DECAY   1000002  3.40592270E+01   # UPL   decays
#          BR          NDA       ID1       ID2       ID3       ID4
      1.20721583E-03    2      1000022         2                       # UPL    -->  Z1SS   UP                 
      9.81148109E-02    2      1000023         2                       # UPL    -->  Z2SS   UP                 
      7.31984968E-04    2      1000025         2                       # UPL    -->  Z3SS   UP                 
      1.00130355E-02    2      1000035         2                       # UPL    -->  Z4SS   UP                 
      6.75016582E-01    2      1000021         2                       # UPL    -->  GLSS   UP                 
      2.02686340E-01    2      1000024         1                       # UPL    -->  W1SS+  DN                 
      1.22300284E-02    2      1000037         1                       # UPL    -->  W2SS+  DN                 
#         PDG         Width
DECAY   1000001  3.41659431E+01   # DNL   decays
#          BR          NDA       ID1       ID2       ID3       ID4
      7.39110587E-03    2      1000022         1                       # DNL    -->  Z1SS   DN                 
      8.79143849E-02    2      1000023         1                       # DNL    -->  Z2SS   DN                 
      1.21564651E-03    2      1000025         1                       # DNL    -->  Z3SS   DN                 
      1.30707901E-02    2      1000035         1                       # DNL    -->  Z4SS   DN                 
      6.80907607E-01    2      1000021         1                       # DNL    -->  GLSS   DN                 
      1.73734710E-01    2     -1000024         2                       # DNL    -->  W1SS-  UP                 
      3.57657187E-02    2     -1000037         2                       # DNL    -->  W2SS-  UP                 
#         PDG         Width
DECAY   1000003  3.41659088E+01   # STL   decays
#          BR          NDA       ID1       ID2       ID3       ID4
      7.39111332E-03    2      1000022         3                       # STL    -->  Z1SS   ST                 
      8.79144743E-02    2      1000023         3                       # STL    -->  Z2SS   ST                 
      1.21564767E-03    2      1000025         3                       # STL    -->  Z3SS   ST                 
      1.30708031E-02    2      1000035         3                       # STL    -->  Z4SS   ST                 
      6.80908322E-01    2      1000021         3                       # STL    -->  GLSS   ST                 
      1.73734114E-01    2     -1000024         4                       # STL    -->  W1SS-  CH                 
      3.57655585E-02    2     -1000037         4                       # STL    -->  W2SS-  CH                 
#         PDG         Width
DECAY   1000004  3.40590668E+01   # CHL   decays
#          BR          NDA       ID1       ID2       ID3       ID4
      1.20721746E-03    2      1000022         4                       # CHL    -->  Z1SS   CH                 
      9.81149599E-02    2      1000023         4                       # CHL    -->  Z2SS   CH                 
      7.31985609E-04    2      1000025         4                       # CHL    -->  Z3SS   CH                 
      1.00130448E-02    2      1000035         4                       # CHL    -->  Z4SS   CH                 
      6.75015092E-01    2      1000021         4                       # CHL    -->  GLSS   CH                 
      2.02687532E-01    2      1000024         3                       # CHL    -->  W1SS+  ST                 
      1.22301066E-02    2      1000037         3                       # CHL    -->  W2SS+  ST                 
#         PDG         Width
DECAY   1000005  2.83311920E+01   # BT1   decays
#          BR          NDA       ID1       ID2       ID3       ID4
      8.07008706E-03    2      1000022         5                       # BT1    -->  Z1SS   BT                 
      8.84815156E-02    2      1000023         5                       # BT1    -->  Z2SS   BT                 
      4.59631579E-03    2      1000025         5                       # BT1    -->  Z3SS   BT                 
      1.41240209E-02    2      1000035         5                       # BT1    -->  Z4SS   BT                 
      4.05627102E-01    2      1000021         5                       # BT1    -->  GLSS   BT                 
      1.68112829E-01    2     -1000024         6                       # BT1    -->  W1SS-  TP                 
      2.86241293E-01    2     -1000037         6                       # BT1    -->  W2SS-  TP                 
      2.47467905E-02    2          -24   1000006                       # BT1    -->  W-     TP1                
#         PDG         Width
DECAY   1000006  9.46330643E+00   # TP1   decays
#          BR          NDA       ID1       ID2       ID3       ID4
      1.12207055E-01    2      1000022         6                       # TP1    -->  Z1SS   TP                 
      5.40669933E-02    2      1000023         6                       # TP1    -->  Z2SS   TP                 
      2.26009011E-01    2      1000025         6                       # TP1    -->  Z3SS   TP                 
      1.01215154E-01    2      1000035         6                       # TP1    -->  Z4SS   TP                 
      1.36448488E-01    2      1000024         5                       # TP1    -->  W1SS+  BT                 
      3.70053321E-01    2      1000037         5                       # TP1    -->  W2SS+  BT                 
#         PDG         Width
DECAY   2000002  2.47820415E+01   # UPR   decays
#          BR          NDA       ID1       ID2       ID3       ID4
      7.97837004E-02    2      1000022         2                       # UPR    -->  Z1SS   UP                 
      1.55849580E-03    2      1000023         2                       # UPR    -->  Z2SS   UP                 
      3.30124429E-04    2      1000025         2                       # UPR    -->  Z3SS   UP                 
      1.08827162E-03    2      1000035         2                       # UPR    -->  Z4SS   UP                 
      9.17239428E-01    2      1000021         2                       # UPR    -->  GLSS   UP                 
#         PDG         Width
DECAY   2000001  2.32934647E+01   # DNR   decays
#          BR          NDA       ID1       ID2       ID3       ID4
      2.12351847E-02    2      1000022         1                       # DNR    -->  Z1SS   DN                 
      4.14829847E-04    2      1000023         1                       # DNR    -->  Z2SS   DN                 
      8.78931387E-05    2      1000025         1                       # DNR    -->  Z3SS   DN                 
      2.89760908E-04    2      1000035         1                       # DNR    -->  Z4SS   DN                 
      9.77972269E-01    2      1000021         1                       # DNR    -->  GLSS   DN                 
#         PDG         Width
DECAY   2000003  2.32934685E+01   # STR   decays
#          BR          NDA       ID1       ID2       ID3       ID4
      2.12351829E-02    2      1000022         3                       # STR    -->  Z1SS   ST                 
      4.14829788E-04    2      1000023         3                       # STR    -->  Z2SS   ST                 
      8.78931314E-05    2      1000025         3                       # STR    -->  Z3SS   ST                 
      2.89760879E-04    2      1000035         3                       # STR    -->  Z4SS   ST                 
      9.77972269E-01    2      1000021         3                       # STR    -->  GLSS   ST                 
#         PDG         Width
DECAY   2000004  2.47818756E+01   # CHR   decays
#          BR          NDA       ID1       ID2       ID3       ID4
      7.97839910E-02    2      1000022         4                       # CHR    -->  Z1SS   CH                 
      1.55850116E-03    2      1000023         4                       # CHR    -->  Z2SS   CH                 
      3.30125360E-04    2      1000025         4                       # CHR    -->  Z3SS   CH                 
      1.08827453E-03    2      1000035         4                       # CHR    -->  Z4SS   CH                 
      9.17239130E-01    2      1000021         4                       # CHR    -->  GLSS   CH                 
#         PDG         Width
DECAY   2000005  2.30916538E+01   # BT2   decays
#          BR          NDA       ID1       ID2       ID3       ID4
      2.12183762E-02    2      1000022         5                       # BT2    -->  Z1SS   BT                 
      1.02781400E-03    2      1000023         5                       # BT2    -->  Z2SS   BT                 
      6.25220127E-03    2      1000025         5                       # BT2    -->  Z3SS   BT                 
      5.80466213E-03    2      1000035         5                       # BT2    -->  Z4SS   BT                 
      9.51651037E-01    2      1000021         5                       # BT2    -->  GLSS   BT                 
      1.23005430E-03    2     -1000024         6                       # BT2    -->  W1SS-  TP                 
      1.15246195E-02    2     -1000037         6                       # BT2    -->  W2SS-  TP                 
      2.39491041E-04    2          -24   1000006                       # BT2    -->  W-     TP1                
      1.46955106E-04    2          -24   2000006                       # BT2    -->  W-     TP2                
      1.29244188E-04    2           23   1000005                       # BT2    -->  Z0     BT1                
      7.75508524E-04    2           25   1000005                       # BT2    -->  HL0    BT1                
#         PDG         Width
DECAY   2000006  2.38080139E+01   # TP2   decays
#          BR          NDA       ID1       ID2       ID3       ID4
      2.50478566E-01    2      1000021         6                       # TP2    -->  GLSS   TP                 
      2.03307733E-01    2      1000024         5                       # TP2    -->  W1SS+  BT                 
      6.02904968E-02    2      1000037         5                       # TP2    -->  W2SS+  BT                 
      1.82329826E-02    2           23   1000006                       # TP2    -->  Z0     TP1                
      2.76809931E-02    2           25   1000006                       # TP2    -->  HL0    TP1                
      2.05700961E-03    2      1000022         6                       # TP2    -->  Z1SS   TP                 
      9.66673195E-02    2      1000023         6                       # TP2    -->  Z2SS   TP                 
      1.46892995E-01    2      1000025         6                       # TP2    -->  Z3SS   TP                 
      1.94391876E-01    2      1000035         6                       # TP2    -->  Z4SS   TP                 
#         PDG         Width
DECAY   1000011  1.04348850E+01   # EL-   decays
#          BR          NDA       ID1       ID2       ID3       ID4
      7.01511502E-02    2      1000022        11                       # EL-    -->  Z1SS   E-                 
      3.13312829E-01    2      1000023        11                       # EL-    -->  Z2SS   E-                 
      1.01723999E-03    2      1000025        11                       # EL-    -->  Z3SS   E-                 
      1.99798010E-02    2      1000035        11                       # EL-    -->  Z4SS   E-                 
      4.99046594E-01    2     -1000024        12                       # EL-    -->  W1SS-  NUE                
      9.64924172E-02    2     -1000037        12                       # EL-    -->  W2SS-  NUE                
#         PDG         Width
DECAY   1000013  1.04348850E+01   # MUL-  decays
#          BR          NDA       ID1       ID2       ID3       ID4
      7.01511502E-02    2      1000022        13                       # MUL-   -->  Z1SS   MU-                
      3.13312829E-01    2      1000023        13                       # MUL-   -->  Z2SS   MU-                
      1.01723999E-03    2      1000025        13                       # MUL-   -->  Z3SS   MU-                
      1.99798010E-02    2      1000035        13                       # MUL-   -->  Z4SS   MU-                
      4.99046594E-01    2     -1000024        14                       # MUL-   -->  W1SS-  NUM                
      9.64924172E-02    2     -1000037        14                       # MUL-   -->  W2SS-  NUM                
#         PDG         Width
DECAY   1000015  4.88475800E+00   # TAU1- decays
#          BR          NDA       ID1       ID2       ID3       ID4
      7.53531039E-01    2      1000022        15                       # TAU1-  -->  Z1SS   TAU-               
      9.27127451E-02    2      1000023        15                       # TAU1-  -->  Z2SS   TAU-               
      9.19768121E-03    2      1000025        15                       # TAU1-  -->  Z3SS   TAU-               
      5.85255865E-03    2      1000035        15                       # TAU1-  -->  Z4SS   TAU-               
      1.38670012E-01    2     -1000024        16                       # TAU1-  -->  W1SS-  NUT                
      3.58776560E-05    2     -1000037        16                       # TAU1-  -->  W2SS-  NUT                
#         PDG         Width
DECAY   1000012  1.05219536E+01   # NUEL  decays
#          BR          NDA       ID1       ID2       ID3       ID4
      1.22355424E-01    2      1000022        12                       # NUEL   -->  Z1SS   NUE                
      2.21567154E-01    2      1000023        12                       # NUEL   -->  Z2SS   NUE                
      4.88339458E-03    2      1000025        12                       # NUEL   -->  Z3SS   NUE                
      4.37721238E-02    2      1000035        12                       # NUEL   -->  Z4SS   NUE                
      5.74879944E-01    2      1000024        11                       # NUEL   -->  W1SS+  E-                 
      3.25420052E-02    2      1000037        11                       # NUEL   -->  W2SS+  E-                 
#         PDG         Width
DECAY   1000014  1.05219536E+01   # NUML  decays
#          BR          NDA       ID1       ID2       ID3       ID4
      1.22355424E-01    2      1000022        14                       # NUML   -->  Z1SS   NUM                
      2.21567154E-01    2      1000023        14                       # NUML   -->  Z2SS   NUM                
      4.88339458E-03    2      1000025        14                       # NUML   -->  Z3SS   NUM                
      4.37721238E-02    2      1000035        14                       # NUML   -->  Z4SS   NUM                
      5.74879944E-01    2      1000024        13                       # NUML   -->  W1SS+  MU-                
      3.25420052E-02    2      1000037        13                       # NUML   -->  W2SS+  MU-                
#         PDG         Width
DECAY   1000016  1.05975513E+01   # NUTL  decays
#          BR          NDA       ID1       ID2       ID3       ID4
      1.20915845E-01    2      1000022        16                       # NUTL   -->  Z1SS   NUT                
      2.18862802E-01    2      1000023        16                       # NUTL   -->  Z2SS   NUT                
      4.81268391E-03    2      1000025        16                       # NUTL   -->  Z3SS   NUT                
      4.31153886E-02    2      1000035        16                       # NUTL   -->  Z4SS   NUT                
      5.70921600E-01    2      1000024        15                       # NUTL   -->  W1SS+  TAU-               
      4.13716659E-02    2      1000037        15                       # NUTL   -->  W2SS+  TAU-               
      8.88751225E-11    3      1000015        16       -15             # NUTL   -->  TAU1-  NUT    TAU+        
      8.88751225E-11    3      1000015        12       -11             # NUTL   -->  TAU1-  NUE    E+          
      8.88751225E-11    3      1000015        14       -13             # NUTL   -->  TAU1-  NUM    MU+         
      2.66625388E-10    3      1000015         2        -1             # NUTL   -->  TAU1-  UP     DB          
      2.66625388E-10    3      1000015         4        -3             # NUTL   -->  TAU1-  CH     SB          
#         PDG         Width
DECAY   2000011  4.07753181E+00   # ER-   decays
#          BR          NDA       ID1       ID2       ID3       ID4
      9.65378582E-01    2      1000022        11                       # ER-    -->  Z1SS   E-                 
      1.86623726E-02    2      1000023        11                       # ER-    -->  Z2SS   E-                 
      3.74879828E-03    2      1000025        11                       # ER-    -->  Z3SS   E-                 
      1.22101754E-02    2      1000035        11                       # ER-    -->  Z4SS   E-                 
#         PDG         Width
DECAY   2000013  4.07753181E+00   # MUR-  decays
#          BR          NDA       ID1       ID2       ID3       ID4
      9.65378582E-01    2      1000022        13                       # MUR-   -->  Z1SS   MU-                
      1.86623726E-02    2      1000023        13                       # MUR-   -->  Z2SS   MU-                
      3.74879828E-03    2      1000025        13                       # MUR-   -->  Z3SS   MU-                
      1.22101754E-02    2      1000035        13                       # MUR-   -->  Z4SS   MU-                
#         PDG         Width
DECAY   2000015  9.92159462E+00   # TAU2- decays
#          BR          NDA       ID1       ID2       ID3       ID4
      9.63411778E-02    2      1000022        15                       # TAU2-  -->  Z1SS   TAU-               
      2.92627692E-01    2      1000023        15                       # TAU2-  -->  Z2SS   TAU-               
      1.05258003E-02    2      1000025        15                       # TAU2-  -->  Z3SS   TAU-               
      3.29330526E-02    2      1000035        15                       # TAU2-  -->  Z4SS   TAU-               
      4.56719428E-01    2     -1000024        16                       # TAU2-  -->  W1SS-  NUT                
      1.10852778E-01    2     -1000037        16                       # TAU2-  -->  W2SS-  NUT                
#         PDG         Width
DECAY   1000023  8.50543984E-06   # Z2SS  decays
#          BR          NDA       ID1       ID2       ID3       ID4
      1.26076641E-03    2      1000022        22                       # Z2SS   -->  Z1SS   GM                 
      1.23693213E-01    3      1000022         2        -2             # Z2SS   -->  Z1SS   UP     UB          
      1.63135529E-01    3      1000022         1        -1             # Z2SS   -->  Z1SS   DN     DB          
      1.63135529E-01    3      1000022         3        -3             # Z2SS   -->  Z1SS   ST     SB          
      1.23693213E-01    3      1000022         4        -4             # Z2SS   -->  Z1SS   CH     CB          
      1.61772832E-01    3      1000022         5        -5             # Z2SS   -->  Z1SS   BT     BB          
      2.86336429E-02    3      1000022        11       -11             # Z2SS   -->  Z1SS   E-     E+          
      2.86336429E-02    3      1000022        13       -13             # Z2SS   -->  Z1SS   MU-    MU+         
      2.86801830E-02    3      1000022        15       -15             # Z2SS   -->  Z1SS   TAU-   TAU+        
      5.91506548E-02    3      1000022        12       -12             # Z2SS   -->  Z1SS   NUE    ANUE        
      5.91506548E-02    3      1000022        14       -14             # Z2SS   -->  Z1SS   NUM    ANUM        
      5.90600967E-02    3      1000022        16       -16             # Z2SS   -->  Z1SS   NUT    ANUT        
#         PDG         Width
DECAY   1000025  1.35376585E+00   # Z3SS  decays
#          BR          NDA       ID1       ID2       ID3       ID4
      1.28419941E-08    2      1000022        22                       # Z3SS   -->  Z1SS   GM                 
      6.04357638E-07    2      1000023        22                       # Z3SS   -->  Z2SS   GM                 
      3.08905661E-01    2      1000024       -24                       # Z3SS   -->  W1SS+  W-                 
      3.08905661E-01    2     -1000024        24                       # Z3SS   -->  W1SS-  W+                 
      1.34951562E-01    2      1000022        23                       # Z3SS   -->  Z1SS   Z0                 
      2.11124226E-01    2      1000023        23                       # Z3SS   -->  Z2SS   Z0                 
      2.51450638E-09    3      1000022         2        -2             # Z3SS   -->  Z1SS   UP     UB          
      1.61003644E-09    3      1000022         1        -1             # Z3SS   -->  Z1SS   DN     DB          
      1.61003622E-09    3      1000022         3        -3             # Z3SS   -->  Z1SS   ST     SB          
      2.51449417E-09    3      1000022         4        -4             # Z3SS   -->  Z1SS   CH     CB          
      1.02754690E-07    3      1000022         5        -5             # Z3SS   -->  Z1SS   BT     BB          
      7.43004591E-09    3      1000022        11       -11             # Z3SS   -->  Z1SS   E-     E+          
      7.43004591E-09    3      1000022        13       -13             # Z3SS   -->  Z1SS   MU-    MU+         
      9.03065214E-08    3      1000022        15       -15             # Z3SS   -->  Z1SS   TAU-   TAU+        
      7.08227521E-09    3      1000022        12       -12             # Z3SS   -->  Z1SS   NUE    ANUE        
      7.08227521E-09    3      1000022        14       -14             # Z3SS   -->  Z1SS   NUM    ANUM        
      7.22106419E-09    3      1000022        16       -16             # Z3SS   -->  Z1SS   NUT    ANUT        
      3.13606807E-09    3      1000023         2        -2             # Z3SS   -->  Z2SS   UP     UB          
      4.56139926E-09    3      1000023         1        -1             # Z3SS   -->  Z2SS   DN     DB          
      4.56139926E-09    3      1000023         3        -3             # Z3SS   -->  Z2SS   ST     SB          
      3.13605386E-09    3      1000023         4        -4             # Z3SS   -->  Z2SS   CH     CB          
      1.20150773E-07    3      1000023         5        -5             # Z3SS   -->  Z2SS   BT     BB          
      9.93204519E-10    3      1000023        11       -11             # Z3SS   -->  Z2SS   E-     E+          
      9.93204519E-10    3      1000023        13       -13             # Z3SS   -->  Z2SS   MU-    MU+         
      2.08657411E-08    3      1000023        15       -15             # Z3SS   -->  Z2SS   TAU-   TAU+        
      3.42278872E-09    3      1000023        12       -12             # Z3SS   -->  Z2SS   NUE    ANUE        
      3.42278872E-09    3      1000023        14       -14             # Z3SS   -->  Z2SS   NUM    ANUM        
      3.49094065E-09    3      1000023        16       -16             # Z3SS   -->  Z2SS   NUT    ANUT        
      2.50435695E-02    2      1000022        25                       # Z3SS   -->  Z1SS   HL0                
      1.10684400E-02    2      1000023        25                       # Z3SS   -->  Z2SS   HL0                
#         PDG         Width
DECAY   1000035  1.66067529E+00   # Z4SS  decays
#          BR          NDA       ID1       ID2       ID3       ID4
      2.45573180E-08    2      1000022        22                       # Z4SS   -->  Z1SS   GM                 
      1.10002475E-07    2      1000023        22                       # Z4SS   -->  Z2SS   GM                 
      1.09942091E-08    2      1000025        22                       # Z4SS   -->  Z3SS   GM                 
      3.57218325E-01    2      1000024       -24                       # Z4SS   -->  W1SS+  W-                 
      3.57218325E-01    2     -1000024        24                       # Z4SS   -->  W1SS-  W+                 
      3.00121475E-02    2      1000022        23                       # Z4SS   -->  Z1SS   Z0                 
      2.28315089E-02    2      1000023        23                       # Z4SS   -->  Z2SS   Z0                 
      2.57966768E-08    3      1000022         2        -2             # Z4SS   -->  Z1SS   UP     UB          
      4.26036664E-08    3      1000022         1        -1             # Z4SS   -->  Z1SS   DN     DB          
      4.26036664E-08    3      1000022         3        -3             # Z4SS   -->  Z1SS   ST     SB          
      2.57965524E-08    3      1000022         4        -4             # Z4SS   -->  Z1SS   CH     CB          
      1.47965196E-07    3      1000022         5        -5             # Z4SS   -->  Z1SS   BT     BB          
      9.94505953E-08    3      1000022        11       -11             # Z4SS   -->  Z1SS   E-     E+          
      9.94505953E-08    3      1000022        13       -13             # Z4SS   -->  Z1SS   MU-    MU+         
      1.76218279E-07    3      1000022        15       -15             # Z4SS   -->  Z1SS   TAU-   TAU+        
      1.68832344E-07    3      1000022        12       -12             # Z4SS   -->  Z1SS   NUE    ANUE        
      1.68832344E-07    3      1000022        14       -14             # Z4SS   -->  Z1SS   NUM    ANUM        
      1.72139082E-07    3      1000022        16       -16             # Z4SS   -->  Z1SS   NUT    ANUT        
      1.71899956E-07    3      1000023         2        -2             # Z4SS   -->  Z2SS   UP     UB          
      1.97013151E-07    3      1000023         1        -1             # Z4SS   -->  Z2SS   DN     DB          
      1.97013151E-07    3      1000023         3        -3             # Z4SS   -->  Z2SS   ST     SB          
      1.71899202E-07    3      1000023         4        -4             # Z4SS   -->  Z2SS   CH     CB          
      5.17254534E-07    3      1000023         5        -5             # Z4SS   -->  Z2SS   BT     BB          
      7.71048079E-08    3      1000023        11       -11             # Z4SS   -->  Z2SS   E-     E+          
      7.71048079E-08    3      1000023        13       -13             # Z4SS   -->  Z2SS   MU-    MU+         
      9.52227808E-08    3      1000023        15       -15             # Z4SS   -->  Z2SS   TAU-   TAU+        
      1.24924156E-07    3      1000023        12       -12             # Z4SS   -->  Z2SS   NUE    ANUE        
      1.24924156E-07    3      1000023        14       -14             # Z4SS   -->  Z2SS   NUM    ANUM        
      1.27418332E-07    3      1000023        16       -16             # Z4SS   -->  Z2SS   NUT    ANUT        
      3.55909322E-07    3      1000025         2        -2             # Z4SS   -->  Z3SS   UP     UB          
      4.59690568E-07    3      1000025         1        -1             # Z4SS   -->  Z3SS   DN     DB          
      4.59690568E-07    3      1000025         3        -3             # Z4SS   -->  Z3SS   ST     SB          
      3.55909322E-07    3      1000025         4        -4             # Z4SS   -->  Z3SS   CH     CB          
      2.66023704E-07    3      1000025         5        -5             # Z4SS   -->  Z3SS   BT     BB          
      1.04258852E-07    3      1000025        11       -11             # Z4SS   -->  Z3SS   E-     E+          
      1.04258852E-07    3      1000025        13       -13             # Z4SS   -->  Z3SS   MU-    MU+         
      9.57321902E-08    3      1000025        15       -15             # Z4SS   -->  Z3SS   TAU-   TAU+        
      2.06997271E-07    3      1000025        12       -12             # Z4SS   -->  Z3SS   NUE    ANUE        
      2.06997271E-07    3      1000025        14       -14             # Z4SS   -->  Z3SS   NUM    ANUM        
      2.06994088E-07    3      1000025        16       -16             # Z4SS   -->  Z3SS   NUT    ANUT        
      8.60704780E-02    2      1000022        25                       # Z4SS   -->  Z1SS   HL0                
      1.46643475E-01    2      1000023        25                       # Z4SS   -->  Z2SS   HL0                
#         PDG         Width
DECAY   1000024  9.57874799E-05   # W1SS+ decays
#          BR          NDA       ID1       ID2       ID3       ID4
      3.35461050E-01    3      1000022         2        -1             # W1SS+  -->  Z1SS   UP     DB          
      3.35461050E-01    3      1000022         4        -3             # W1SS+  -->  Z1SS   CH     SB          
      1.09690920E-01    3      1000022       -11        12             # W1SS+  -->  Z1SS   E+     NUE         
      1.09690920E-01    3      1000022       -13        14             # W1SS+  -->  Z1SS   MU+    NUM         
      1.09696135E-01    3      1000022       -15        16             # W1SS+  -->  Z1SS   TAU+   NUT         
      2.32323790E-13    3      1000023       -11        12             # W1SS+  -->  Z2SS   E+     NUE         
      2.32323790E-13    3      1000023       -13        14             # W1SS+  -->  Z2SS   MU+    NUM         
#         PDG         Width
DECAY   1000037  1.47985744E+00   # W2SS+ decays
#          BR          NDA       ID1       ID2       ID3       ID4
      5.72661527E-08    3      1000022         2        -1             # W2SS+  -->  Z1SS   UP     DB          
      5.72661278E-08    3      1000022         4        -3             # W2SS+  -->  Z1SS   CH     SB          
      1.80615032E-07    3      1000022       -11        12             # W2SS+  -->  Z1SS   E+     NUE         
      1.80615032E-07    3      1000022       -13        14             # W2SS+  -->  Z1SS   MU+    NUM         
      2.70724001E-07    3      1000022       -15        16             # W2SS+  -->  Z1SS   TAU+   NUT         
      8.07842314E-02    2      1000022        24                       # W2SS+  -->  Z1SS   W+                 
      1.75847177E-07    3      1000023         2        -1             # W2SS+  -->  Z2SS   UP     DB          
      1.75847077E-07    3      1000023         4        -3             # W2SS+  -->  Z2SS   CH     SB          
      1.16570476E-07    3      1000023       -11        12             # W2SS+  -->  Z2SS   E+     NUE         
      1.16570476E-07    3      1000023       -13        14             # W2SS+  -->  Z2SS   MU+    NUM         
      1.49534529E-07    3      1000023       -15        16             # W2SS+  -->  Z2SS   TAU+   NUT         
      3.91584188E-01    2      1000023        24                       # W2SS+  -->  Z2SS   W+                 
      1.25581801E-06    3      1000025         2        -1             # W2SS+  -->  Z3SS   UP     DB          
      1.25581801E-06    3      1000025         4        -3             # W2SS+  -->  Z3SS   CH     SB          
      4.18464055E-07    3      1000025       -11        12             # W2SS+  -->  Z3SS   E+     NUE         
      4.18464055E-07    3      1000025       -13        14             # W2SS+  -->  Z3SS   MU+    NUM         
      4.18579191E-07    3      1000025       -15        16             # W2SS+  -->  Z3SS   TAU+   NUT         
      3.16041410E-01    2      1000024        23                       # W2SS+  -->  W1SS+  Z0                 
      1.66195903E-07    3      1000024         1        -1             # W2SS+  -->  W1SS+  DN     DB          
      1.66195150E-07    3      1000024         3        -3             # W2SS+  -->  W1SS+  ST     SB          
      4.08559941E-07    3      1000024         2        -2             # W2SS+  -->  W1SS+  UP     UB          
      4.08559941E-07    3      1000024         4        -4             # W2SS+  -->  W1SS+  CH     CB          
      2.26301523E-07    3      1000024        12       -12             # W2SS+  -->  W1SS+  NUE    ANUE        
      2.26301523E-07    3      1000024        14       -14             # W2SS+  -->  W1SS+  NUM    ANUM        
      2.46437168E-07    3      1000024        16       -16             # W2SS+  -->  W1SS+  NUT    ANUT        
      9.24878378E-08    3      1000024        11       -11             # W2SS+  -->  W1SS+  E-     E+          
      9.24878378E-08    3      1000024        13       -13             # W2SS+  -->  W1SS+  MU-    MU+         
      9.43389082E-08    3      1000024        15       -15             # W2SS+  -->  W1SS+  TAU-   TAU+        
      2.11582899E-01    2      1000024        25                       # W2SS+  -->  W1SS+  HL0                
#         PDG         Width
DECAY        25  3.90852429E-03   # HL0   decays
#          BR          NDA       ID1       ID2       ID3       ID4
      5.00245090E-09    2           11       -11                       # HL0    -->  E-     E+                 
      2.11211314E-04    2           13       -13                       # HL0    -->  MU-    MU+                
      6.03990480E-02    2           15       -15                       # HL0    -->  TAU-   TAU+               
      6.28320868E-06    2            1        -1                       # HL0    -->  DN     DB                 
      2.53873062E-03    2            3        -3                       # HL0    -->  ST     SB                 
      8.37963104E-01    2            5        -5                       # HL0    -->  BT     BB                 
      1.91362801E-06    2            2        -2                       # HL0    -->  UP     UB                 
      3.62935290E-02    2            4        -4                       # HL0    -->  CH     CB                 
      1.61268236E-03    2           22        22                       # HL0    -->  GM     GM                 
      3.48893404E-02    2           21        21                       # HL0    -->  GL     GL                 
      1.38103450E-03    3           24        11       -12             # HL0    -->  W+     E-     ANUE        
      1.38103450E-03    3           24        13       -14             # HL0    -->  W+     MU-    ANUM        
      1.38103450E-03    3           24        15       -16             # HL0    -->  W+     TAU-   ANUT        
      4.14310349E-03    3           24        -2         1             # HL0    -->  W+     UB     DN          
      4.14310349E-03    3           24        -4         3             # HL0    -->  W+     CB     ST          
      1.38103450E-03    3          -24       -11        12             # HL0    -->  W-     E+     NUE         
      1.38103450E-03    3          -24       -13        14             # HL0    -->  W-     MU+    NUM         
      1.38103450E-03    3          -24       -15        16             # HL0    -->  W-     TAU+   NUT         
      4.14310349E-03    3          -24         2        -1             # HL0    -->  W-     UP     DB          
      4.14310349E-03    3          -24         4        -3             # HL0    -->  W-     CH     SB          
      8.38260312E-05    3           23        12       -12             # HL0    -->  Z0     NUE    ANUE        
      8.38260312E-05    3           23        14       -14             # HL0    -->  Z0     NUM    ANUM        
      8.38260312E-05    3           23        16       -16             # HL0    -->  Z0     NUT    ANUT        
      4.21887999E-05    3           23        11       -11             # HL0    -->  Z0     E-     E+          
      4.21887999E-05    3           23        13       -13             # HL0    -->  Z0     MU-    MU+         
      4.21887999E-05    3           23        15       -15             # HL0    -->  Z0     TAU-   TAU+        
      1.44535254E-04    3           23         2        -2             # HL0    -->  Z0     UP     UB          
      1.44535254E-04    3           23         4        -4             # HL0    -->  Z0     CH     CB          
      1.86197009E-04    3           23         1        -1             # HL0    -->  Z0     DN     DB          
      1.86197009E-04    3           23         3        -3             # HL0    -->  Z0     ST     SB          
      1.86197009E-04    3           23         5        -5             # HL0    -->  Z0     BT     BB          
#         PDG         Width
DECAY        35  1.04063063E+01   # HH0   decays
#          BR          NDA       ID1       ID2       ID3       ID4
      1.42750356E-09    2           11       -11                       # HH0    -->  E-     E+                 
      6.02717664E-05    2           13       -13                       # HH0    -->  MU-    MU+                
      1.72623321E-02    2           15       -15                       # HH0    -->  TAU-   TAU+               
      1.75076593E-06    2            1        -1                       # HH0    -->  DN     DB                 
      7.07398052E-04    2            3        -3                       # HH0    -->  ST     SB                 
      1.02913067E-01    2            5        -5                       # HH0    -->  BT     BB                 
      5.88523952E-11    2            2        -2                       # HH0    -->  UP     UB                 
      8.42790371E-07    2            4        -4                       # HH0    -->  CH     CB                 
      3.64221297E-02    2            6        -6                       # HH0    -->  TP     TB                 
      8.25698805E-07    2           22        22                       # HH0    -->  GM     GM                 
      2.77893541E-05    2           21        21                       # HH0    -->  GL     GL                 
      1.21552934E-04    2           24       -24                       # HH0    -->  W+     W-                 
      6.14962482E-05    2           23        23                       # HH0    -->  Z0     Z0                 
      7.27376016E-03    2      1000022   1000022                       # HH0    -->  Z1SS   Z1SS               
      3.24764661E-02    2      1000022   1000023                       # HH0    -->  Z1SS   Z2SS               
      5.60088679E-02    2      1000022   1000025                       # HH0    -->  Z1SS   Z3SS               
      1.66588780E-02    2      1000022   1000035                       # HH0    -->  Z1SS   Z4SS               
      3.48603092E-02    2      1000023   1000023                       # HH0    -->  Z2SS   Z2SS               
      1.04194477E-01    2      1000023   1000025                       # HH0    -->  Z2SS   Z3SS               
      2.39947494E-02    2      1000023   1000035                       # HH0    -->  Z2SS   Z4SS               
      2.89135100E-03    2      1000025   1000025                       # HH0    -->  Z3SS   Z3SS               
      4.00922075E-02    2      1000025   1000035                       # HH0    -->  Z3SS   Z4SS               
      1.13860834E-02    2      1000035   1000035                       # HH0    -->  Z4SS   Z4SS               
      9.74994004E-02    2      1000024  -1000024                       # HH0    -->  W1SS+  W1SS-              
      7.13647669E-03    2      1000037  -1000037                       # HH0    -->  W2SS+  W2SS-              
      2.03795567E-01    2      1000024  -1000037                       # HH0    -->  W1SS+  W2SS-              
      2.03795567E-01    2     -1000024   1000037                       # HH0    -->  W1SS-  W2SS+              
      3.56272329E-04    2           25        25                       # HH0    -->  HL0    HL0                
#         PDG         Width
DECAY        36  1.02985945E+01   # HA0   decays
#          BR          NDA       ID1       ID2       ID3       ID4
      1.43340673E-09    2           11       -11                       # HA0    -->  E-     E+                 
      6.05210153E-05    2           13       -13                       # HA0    -->  MU-    MU+                
      1.73340030E-02    2           15       -15                       # HA0    -->  TAU-   TAU+               
      1.75810771E-06    2            1        -1                       # HA0    -->  DN     DB                 
      7.10364489E-04    2            3        -3                       # HA0    -->  ST     SB                 
      1.03350863E-01    2            5        -5                       # HA0    -->  BT     BB                 
      5.62538072E-11    2            2        -2                       # HA0    -->  UP     UB                 
      8.06234311E-07    2            4        -4                       # HA0    -->  CH     CB                 
      4.02661487E-02    2            6        -6                       # HA0    -->  TP     TB                 
      7.89209764E-07    2           22        22                       # HA0    -->  GM     GM                 
      3.92274742E-05    2           21        21                       # HA0    -->  GL     GL                 
      8.77617579E-03    2      1000022   1000022                       # HA0    -->  Z1SS   Z1SS               
      4.25151363E-02    2      1000022   1000023                       # HA0    -->  Z1SS   Z2SS               
      3.04670502E-02    2      1000022   1000025                       # HA0    -->  Z1SS   Z3SS               
      3.28988433E-02    2      1000022   1000035                       # HA0    -->  Z1SS   Z4SS               
      5.03997281E-02    2      1000023   1000023                       # HA0    -->  Z2SS   Z2SS               
      4.84263301E-02    2      1000023   1000025                       # HA0    -->  Z2SS   Z3SS               
      5.48505969E-02    2      1000023   1000035                       # HA0    -->  Z2SS   Z4SS               
      3.79367452E-03    2      1000025   1000025                       # HA0    -->  Z3SS   Z3SS               
      1.45988613E-02    2      1000025   1000035                       # HA0    -->  Z3SS   Z4SS               
      4.13216725E-02    2      1000035   1000035                       # HA0    -->  Z4SS   Z4SS               
      1.38513863E-01    2      1000024  -1000024                       # HA0    -->  W1SS+  W1SS-              
      3.54812667E-02    2      1000037  -1000037                       # HA0    -->  W2SS+  W2SS-              
      1.68037117E-01    2      1000024  -1000037                       # HA0    -->  W1SS+  W2SS-              
      1.68037117E-01    2     -1000024   1000037                       # HA0    -->  W1SS-  W2SS+              
      1.18068529E-04    2           25        23                       # HA0    -->  HL0    Z0                 
#         PDG         Width
DECAY        37  1.01552973E+01   # H+    decays
#          BR          NDA       ID1       ID2       ID3       ID4
      1.46977974E-09    2           12       -11                       # H+     -->  NUE    E+                 
      6.20567516E-05    2           14       -13                       # H+     -->  NUM    MU+                
      1.77738592E-02    2           16       -15                       # H+     -->  NUT    TAU+               
      1.65506856E-06    2            2        -1                       # H+     -->  UP     DB                 
      6.69464702E-04    2            4        -3                       # H+     -->  CH     SB                 
      1.26197979E-01    2            6        -5                       # H+     -->  TP     BB                 
      6.24690913E-02    2      1000024   1000022                       # H+     -->  W1SS+  Z1SS               
      1.20969024E-03    2      1000024   1000023                       # H+     -->  W1SS+  Z2SS               
      2.16534108E-01    2      1000024   1000025                       # H+     -->  W1SS+  Z3SS               
      2.17789337E-01    2      1000024   1000035                       # H+     -->  W1SS+  Z4SS               
      2.42289379E-02    2      1000037   1000022                       # H+     -->  W2SS+  Z1SS               
      3.01030427E-01    2      1000037   1000023                       # H+     -->  W2SS+  Z2SS               
      2.85684913E-02    2      1000037   1000025                       # H+     -->  W2SS+  Z3SS               
      3.34166363E-03    2      1000037   1000035                       # H+     -->  W2SS+  Z4SS               
      1.23317397E-04    2           25        24                       # H+     -->  HL0    W+                 
