  65
  401    503.0903    0.93550E-25
  402    497.4608    0.99383E-25
  403    503.0904    0.93551E-25
  404    497.4627    0.99388E-25
  405   3000.0916    0.40673E-26
  406   3002.5991    0.28042E-26
  407    503.0903    0.93550E-25
  408    497.4608    0.99383E-25
  409    503.0904    0.93551E-25
  410    497.4627    0.99388E-25
  411   3000.0916    0.40673E-26
  412   3002.5991    0.28042E-26
  413    500.5669    0.14366E-24
  414    498.8644    0.12567E-24
  415    500.5669    0.14366E-24
  416    498.8662    0.12567E-24
  417   3000.5220    0.28388E-26
  418   3002.8484    0.28494E-26
  419    500.5669    0.14366E-24
  420    498.8644    0.12567E-24
  421    500.5669    0.14366E-24
  422    498.8662    0.12567E-24
  423   3000.5220    0.28388E-26
  424   3002.8484    0.28494E-26
  425    200.0027    0.49704E-23
  426    185.3874    0.52323E-23
  427    200.0027    0.49704E-23
  428    185.3874    0.52323E-23
  429   3000.2717    0.42728E-25
  430   2999.3887    0.16086E-25
  431    200.0027    0.49704E-23
  432    185.3874    0.52323E-23
  433    200.0027    0.49704E-23
  434    185.3874    0.52323E-23
  435   3000.2717    0.42728E-25
  436   2999.3887    0.16086E-25
  437    200.0010    0.11591E-23
  438      0.0000    0.10000E+31
  439    200.0010    0.11591E-23
  440      0.0000    0.10000E+31
  441   3000.3406    0.16097E-25
  442      0.0000    0.10000E+31
  443    200.0010    0.11591E-23
  444      0.0000    0.10000E+31
  445    200.0010    0.11591E-23
  446      0.0000    0.10000E+31
  447   3000.3406    0.16097E-25
  448      0.0000    0.10000E+31
  449    400.0000    0.44541E-21
  450     99.9996    0.10000E+31
  451    299.9675    0.39535E-24
  452   -602.6180    0.14007E-24
  453    618.4830    0.12252E-24
  454    299.7536    0.39428E-24
  455    617.6116    0.12244E-24
  456    299.7536    0.39428E-24
  457    617.6116    0.12244E-24
  203    106.8536    0.17587E-21
  204   1007.7263    0.86846E-25
  205   1000.0000    0.87498E-25
  206   1012.7043    0.89355E-25
  207   1012.7043    0.89355E-25
  458      0.0000    0.10000E+31
    6    172.5000    0.57395E-24
   12    172.5000    0.57395E-24
   4
   401  0.11244950E-01     0   450     1     0     0     0
   401  0.11695373E+00     0   451     1     0     0     0
   401  0.63913995E+00     0   449     1     0     0     0
   401  0.23266134E+00     0   456     2     0     0     0
   4
   402  0.78095342E-02     0   450     2     0     0     0
   402  0.12316858E+00     0   451     2     0     0     0
   402  0.62066478E+00     0   449     2     0     0     0
   402  0.24835706E+00     0   454     1     0     0     0
   4
   403  0.11245039E-01     0   450     3     0     0     0
   403  0.11695468E+00     0   451     3     0     0     0
   403  0.63914514E+00     0   449     3     0     0     0
   403  0.23265511E+00     0   456     4     0     0     0
   4
   404  0.78098704E-02     0   450     4     0     0     0
   404  0.12317232E+00     0   451     4     0     0     0
   404  0.62064421E+00     0   449     4     0     0     0
   404  0.24837366E+00     0   454     3     0     0     0
   7
   405  0.10382975E-01     0   450     5     0     0     0
   405  0.61686522E-04     0   451     5     0     0     0
   405  0.65016327E-03     0   452     5     0     0     0
   405  0.64776867E-03     0   453     5     0     0     0
   405  0.98697221E+00     0   449     5     0     0     0
   405  0.97007978E-04     0   456     6     0     0     0
   405  0.11882017E-02     0   457     6     0     0     0
   7
   406  0.67637295E+00     0   449     6     0     0     0
   406  0.28587487E-01     0   450     6     0     0     0
   406  0.24521535E-02     0   451     6     0     0     0
   406  0.73942862E-01     0   452     6     0     0     0
   406  0.70803188E-01     0   453     6     0     0     0
   406  0.50097043E-02     0   454     5     0     0     0
   406  0.14283173E+00     0   455     5     0     0     0
   4
   407  0.11244950E-01     0   450     7     0     0     0
   407  0.11695373E+00     0   451     7     0     0     0
   407  0.63913995E+00     0   449     7     0     0     0
   407  0.23266134E+00     0   454     8     0     0     0
   4
   408  0.78095342E-02     0   450     8     0     0     0
   408  0.12316858E+00     0   451     8     0     0     0
   408  0.62066478E+00     0   449     8     0     0     0
   408  0.24835706E+00     0   456     7     0     0     0
   4
   409  0.11245039E-01     0   450     9     0     0     0
   409  0.11695468E+00     0   451     9     0     0     0
   409  0.63914514E+00     0   449     9     0     0     0
   409  0.23265511E+00     0   454    10     0     0     0
   4
   410  0.78098704E-02     0   450    10     0     0     0
   410  0.12317232E+00     0   451    10     0     0     0
   410  0.62064421E+00     0   449    10     0     0     0
   410  0.24837366E+00     0   456     9     0     0     0
   7
   411  0.10382975E-01     0   450    11     0     0     0
   411  0.61686522E-04     0   451    11     0     0     0
   411  0.65016327E-03     0   452    11     0     0     0
   411  0.64776867E-03     0   453    11     0     0     0
   411  0.98697221E+00     0   449    11     0     0     0
   411  0.97007978E-04     0   454    12     0     0     0
   411  0.11882017E-02     0   455    12     0     0     0
   7
   412  0.67637295E+00     0   449    12     0     0     0
   412  0.28587487E-01     0   450    12     0     0     0
   412  0.24521535E-02     0   451    12     0     0     0
   412  0.73942862E-01     0   452    12     0     0     0
   412  0.70803188E-01     0   453    12     0     0     0
   412  0.50097043E-02     0   456    11     0     0     0
   412  0.14283173E+00     0   457    11     0     0     0
   3
   413  0.56483570E-01     0   450     1     0     0     0
   413  0.34663361E-04     0   451     1     0     0     0
   413  0.94348180E+00     0   449     1     0     0     0
   3
   414  0.19684632E+00     0   450     2     0     0     0
   414  0.11994684E-03     0   451     2     0     0     0
   414  0.80303377E+00     0   449     2     0     0     0
   3
   415  0.56483552E-01     0   450     3     0     0     0
   415  0.34663361E-04     0   451     3     0     0     0
   415  0.94348180E+00     0   449     3     0     0     0
   3
   416  0.19685796E+00     0   450     4     0     0     0
   416  0.11995247E-03     0   451     4     0     0     0
   416  0.80302209E+00     0   449     4     0     0     0
   7
   417  0.22071989E-02     0   450     5     0     0     0
   417  0.49978565E-01     0   451     5     0     0     0
   417  0.57855365E-03     0   452     5     0     0     0
   417  0.31618886E-02     0   453     5     0     0     0
   417  0.68896759E+00     0   449     5     0     0     0
   417  0.10305665E+00     0   456     6     0     0     0
   417  0.15204947E+00     0   457     6     0     0     0
   7
   418  0.68733227E+00     0   449     6     0     0     0
   418  0.10392321E+00     0   454     5     0     0     0
   418  0.40306109E-02     0   455     5     0     0     0
   418  0.16200705E-02     0   450     6     0     0     0
   418  0.53427860E-01     0   451     6     0     0     0
   418  0.75238712E-01     0   452     6     0     0     0
   418  0.74427314E-01     0   453     6     0     0     0
   3
   419  0.56483570E-01     0   450     7     0     0     0
   419  0.34663361E-04     0   451     7     0     0     0
   419  0.94348180E+00     0   449     7     0     0     0
   3
   420  0.19684632E+00     0   450     8     0     0     0
   420  0.11994684E-03     0   451     8     0     0     0
   420  0.80303377E+00     0   449     8     0     0     0
   3
   421  0.56483552E-01     0   450     9     0     0     0
   421  0.34663361E-04     0   451     9     0     0     0
   421  0.94348180E+00     0   449     9     0     0     0
   3
   422  0.19685796E+00     0   450    10     0     0     0
   422  0.11995247E-03     0   451    10     0     0     0
   422  0.80302209E+00     0   449    10     0     0     0
   7
   423  0.22071989E-02     0   450    11     0     0     0
   423  0.49978565E-01     0   451    11     0     0     0
   423  0.57855365E-03     0   452    11     0     0     0
   423  0.31618886E-02     0   453    11     0     0     0
   423  0.68896759E+00     0   449    11     0     0     0
   423  0.10305665E+00     0   454    12     0     0     0
   423  0.15204947E+00     0   455    12     0     0     0
   7
   424  0.68733227E+00     0   449    12     0     0     0
   424  0.10392321E+00     0   456    11     0     0     0
   424  0.40306109E-02     0   457    11     0     0     0
   424  0.16200705E-02     0   450    12     0     0     0
   424  0.53427860E-01     0   451    12     0     0     0
   424  0.75238712E-01     0   452    12     0     0     0
   424  0.74427314E-01     0   453    12     0     0     0
   1
   425  0.10000000E+01     0   450   121     0     0     0
   1
   426  0.10000000E+01     0   450   122     0     0     0
   1
   427  0.10000000E+01     0   450   123     0     0     0
   1
   428  0.10000000E+01     0   450   124     0     0     0
   6
   429  0.98096251E+00     0   450   125     0     0     0
   429  0.15500282E-02     0   451   125     0     0     0
   429  0.39519686E-02     0   452   125     0     0     0
   429  0.74800113E-02     0   453   125     0     0     0
   429  0.45697493E-03     0   456   126     0     0     0
   429  0.55984743E-02     0   457   126     0     0     0
   6
   430  0.98720245E-01     0   450   126     0     0     0
   430  0.27504233E+00     0   451   126     0     0     0
   430  0.11340657E-02     0   452   126     0     0     0
   430  0.19219156E-01     0   453   126     0     0     0
   430  0.58578515E+00     0   454   125     0     0     0
   430  0.20099077E-01     0   455   125     0     0     0
   1
   431  0.10000000E+01     0   450   127     0     0     0
   1
   432  0.10000000E+01     0   450   128     0     0     0
   1
   433  0.10000000E+01     0   450   129     0     0     0
   1
   434  0.10000000E+01     0   450   130     0     0     0
   6
   435  0.98096251E+00     0   450   131     0     0     0
   435  0.15500282E-02     0   451   131     0     0     0
   435  0.39519686E-02     0   452   131     0     0     0
   435  0.74800113E-02     0   453   131     0     0     0
   435  0.45697493E-03     0   454   132     0     0     0
   435  0.55984743E-02     0   455   132     0     0     0
   6
   436  0.98720245E-01     0   450   132     0     0     0
   436  0.27504233E+00     0   451   132     0     0     0
   436  0.11340657E-02     0   452   132     0     0     0
   436  0.19219156E-01     0   453   132     0     0     0
   436  0.58578515E+00     0   456   131     0     0     0
   436  0.20099077E-01     0   457   131     0     0     0
   1
   437  0.10000000E+01     0   450   121     0     0     0
   0
   1
   439  0.10000000E+01     0   450   123     0     0     0
   0
   6
   441  0.86192593E-01     0   450   125     0     0     0
   441  0.29936630E+00     0   451   125     0     0     0
   441  0.13438117E-02     0   452   125     0     0     0
   441  0.10408857E-01     0   453   125     0     0     0
   441  0.56250650E+00     0   456   126     0     0     0
   441  0.40181842E-01     0   457   126     0     0     0
   0
   1
   443  0.10000000E+01     0   450   127     0     0     0
   0
   1
   445  0.10000000E+01     0   450   129     0     0     0
   0
   6
   447  0.86192593E-01     0   450   131     0     0     0
   447  0.29936630E+00     0   451   131     0     0     0
   447  0.13438117E-02     0   452   131     0     0     0
   447  0.10408857E-01     0   453   131     0     0     0
   447  0.56250650E+00     0   454   132     0     0     0
   447  0.40181842E-01     0   455   132     0     0     0
   0
  13
   449  0.29678823E-01     0   454     1     8     0     0
   449  0.29678823E-01     0   456     2     7     0     0
   449  0.29678352E-01     0   454     3    10     0     0
   449  0.29678352E-01     0   456     4     9     0     0
   449  0.31589669E+00     0   450     2     8     0     0
   449  0.95280759E-01     0   450     1     7     0     0
   449  0.95280729E-01     0   450     3     9     0     0
   449  0.31588960E+00     0   450     4    10     0     0
   449  0.35876605E-04     0   450     5    11     0     0
   449  0.15603820E-01     0   451     2     8     0     0
   449  0.13847432E-01     0   451     1     7     0     0
   449  0.13847425E-01     0   451     3     9     0     0
   449  0.15603350E-01     0   451     4    10     0     0
   0
  14
   451  0.50563697E-03     0   450   200     0     0     0
   451  0.91155339E-02     0   450   203     0     0     0
   451  0.11566447E+00     0   425   127     0     0     0
   451  0.11566447E+00     0   431   121     0     0     0
   451  0.11566436E+00     0   427   129     0     0     0
   451  0.11566436E+00     0   433   123     0     0     0
   451  0.19322101E-03     0   437   127     0     0     0
   451  0.19322101E-03     0   443   121     0     0     0
   451  0.19322084E-03     0   439   129     0     0     0
   451  0.19322084E-03     0   445   123     0     0     0
   451  0.13173708E+00     0   426   128     0     0     0
   451  0.13173708E+00     0   432   122     0     0     0
   451  0.13173708E+00     0   428   130     0     0     0
   451  0.13173708E+00     0   434   124     0     0     0
  34
   452  0.30487248E+00     0   454   199     0     0     0
   452  0.30487248E+00     0   456   198     0     0     0
   452  0.83438776E-01     0   450   200     0     0     0
   452  0.27513203E+00     0   451   200     0     0     0
   452  0.14508417E-01     0   450   203     0     0     0
   452  0.10392118E-01     0   451   203     0     0     0
   452  0.12770783E-03     0   402     8     0     0     0
   452  0.12770783E-03     0   408     2     0     0     0
   452  0.19568938E-03     0   401     7     0     0     0
   452  0.19568938E-03     0   407     1     0     0     0
   452  0.19568895E-03     0   403     9     0     0     0
   452  0.19568895E-03     0   409     3     0     0     0
   452  0.12769521E-03     0   404    10     0     0     0
   452  0.12769521E-03     0   410     4     0     0     0
   452  0.45237819E-04     0   414     8     0     0     0
   452  0.45237819E-04     0   420     2     0     0     0
   452  0.10975197E-04     0   413     7     0     0     0
   452  0.10975197E-04     0   419     1     0     0     0
   452  0.10975174E-04     0   415     9     0     0     0
   452  0.10975174E-04     0   421     3     0     0     0
   452  0.45233232E-04     0   416    10     0     0     0
   452  0.45233232E-04     0   422     4     0     0     0
   452  0.16219754E-03     0   425   127     0     0     0
   452  0.16219754E-03     0   431   121     0     0     0
   452  0.16219754E-03     0   427   129     0     0     0
   452  0.16219754E-03     0   433   123     0     0     0
   452  0.27127156E-03     0   437   127     0     0     0
   452  0.27127156E-03     0   443   121     0     0     0
   452  0.27127151E-03     0   439   129     0     0     0
   452  0.27127151E-03     0   445   123     0     0     0
   452  0.88298356E-03     0   426   128     0     0     0
   452  0.88298356E-03     0   432   122     0     0     0
   452  0.88298356E-03     0   428   130     0     0     0
   452  0.88298356E-03     0   434   124     0     0     0
  34
   453  0.28620249E+00     0   454   199     0     0     0
   453  0.28620249E+00     0   456   198     0     0     0
   453  0.13888233E-01     0   450   200     0     0     0
   453  0.11821434E-01     0   451   200     0     0     0
   453  0.64612694E-01     0   450   203     0     0     0
   453  0.21702509E+00     0   451   203     0     0     0
   453  0.39220653E-02     0   402     8     0     0     0
   453  0.39220653E-02     0   408     2     0     0     0
   453  0.45701023E-02     0   401     7     0     0     0
   453  0.45701023E-02     0   407     1     0     0     0
   453  0.45700944E-02     0   403     9     0     0     0
   453  0.45700944E-02     0   409     3     0     0     0
   453  0.39217658E-02     0   404    10     0     0     0
   453  0.39217658E-02     0   410     4     0     0     0
   453  0.24562984E-03     0   414     8     0     0     0
   453  0.24562984E-03     0   420     2     0     0     0
   453  0.59853912E-04     0   413     7     0     0     0
   453  0.59853912E-04     0   419     1     0     0     0
   453  0.59853821E-04     0   415     9     0     0     0
   453  0.59853821E-04     0   421     3     0     0     0
   453  0.24561066E-03     0   416    10     0     0     0
   453  0.24561066E-03     0   422     4     0     0     0
   453  0.64171213E-02     0   425   127     0     0     0
   453  0.64171213E-02     0   431   121     0     0     0
   453  0.64171213E-02     0   427   129     0     0     0
   453  0.64171213E-02     0   433   123     0     0     0
   453  0.12098810E-02     0   437   127     0     0     0
   453  0.12098810E-02     0   443   121     0     0     0
   453  0.12098808E-02     0   439   129     0     0     0
   453  0.12098808E-02     0   445   123     0     0     0
   453  0.13637458E-01     0   426   128     0     0     0
   453  0.13637458E-01     0   432   122     0     0     0
   453  0.13637458E-01     0   428   130     0     0     0
   453  0.13637458E-01     0   434   124     0     0     0
   5
   454  0.96210949E-02     0   450   198     0     0     0
   454  0.27903759E+00     0   426   127     0     0     0
   454  0.27903754E+00     0   428   129     0     0     0
   454  0.21615192E+00     0   431   122     0     0     0
   454  0.21615183E+00     0   433   124     0     0     0
  12
   455  0.70918113E-01     0   450   198     0     0     0
   455  0.29606649E+00     0   451   198     0     0     0
   455  0.56894082E-02     0   402     7     0     0     0
   455  0.11650084E-01     0   407     2     0     0     0
   455  0.56892484E-02     0   404     9     0     0     0
   455  0.12694103E-01     0   409     4     0     0     0
   455  0.12727255E-01     0   426   127     0     0     0
   455  0.12727255E-01     0   428   129     0     0     0
   455  0.27484732E-01     0   431   122     0     0     0
   455  0.27484732E-01     0   433   124     0     0     0
   455  0.28053546E+00     0   454   200     0     0     0
   455  0.23633316E+00     0   454   203     0     0     0
   5
   456  0.96210949E-02     0   450   199     0     0     0
   456  0.27903759E+00     0   432   121     0     0     0
   456  0.27903754E+00     0   434   123     0     0     0
   456  0.21615192E+00     0   425   128     0     0     0
   456  0.21615183E+00     0   427   130     0     0     0
  12
   457  0.70918113E-01     0   450   199     0     0     0
   457  0.29606649E+00     0   451   199     0     0     0
   457  0.56894082E-02     0   408     1     0     0     0
   457  0.11650084E-01     0   401     8     0     0     0
   457  0.56892484E-02     0   410     3     0     0     0
   457  0.12694103E-01     0   403    10     0     0     0
   457  0.12727255E-01     0   432   121     0     0     0
   457  0.12727255E-01     0   434   123     0     0     0
   457  0.27484732E-01     0   425   128     0     0     0
   457  0.27484732E-01     0   427   130     0     0     0
   457  0.28053546E+00     0   456   200     0     0     0
   457  0.23633316E+00     0   456   203     0     0     0
  28
   203  0.21258231E-03     0   123   129     0     0     0
   203  0.60786176E-01     0   125   131     0     0     0
   203  0.25561932E-02     0     3     9     0     0     0
   203  0.84672326E+00     0     5    11     0     0     0
   203  0.37053157E-01     0     4    10     0     0     0
   203  0.15071688E-02     0    59    59     0     0     0
   203  0.34203950E-01     0    13    13     0     0     0
   203  0.90873206E-03     0   198   121   128     0     0
   203  0.90873206E-03     0   198   123   130     0     0
   203  0.90873206E-03     0   198   125   132     0     0
   203  0.27261965E-02     0   198     8     1     0     0
   203  0.27261965E-02     0   198    10     3     0     0
   203  0.90873206E-03     0   199   127   122     0     0
   203  0.90873206E-03     0   199   129   124     0     0
   203  0.90873206E-03     0   199   131   126     0     0
   203  0.27261965E-02     0   199     2     7     0     0
   203  0.27261965E-02     0   199     4     9     0     0
   203  0.41067804E-04     0   200   122   128     0     0
   203  0.41067804E-04     0   200   124   130     0     0
   203  0.41067804E-04     0   200   126   132     0     0
   203  0.20669015E-04     0   200   121   127     0     0
   203  0.20669015E-04     0   200   123   129     0     0
   203  0.20669015E-04     0   200   125   131     0     0
   203  0.70810289E-04     0   200     2     8     0     0
   203  0.70810289E-04     0   200     4    10     0     0
   203  0.91221104E-04     0   200     1     7     0     0
   203  0.91221104E-04     0   200     3     9     0     0
   203  0.91221104E-04     0   200     5    11     0     0
  31
   204  0.15228744E-04     0   123   129     0     0     0
   204  0.43616644E-02     0   125   131     0     0     0
   204  0.17852416E-03     0     3     9     0     0     0
   204  0.44018626E-01     0     5    11     0     0     0
   204  0.36910248E+00     0     6    12     0     0     0
   204  0.19593531E-03     0    13    13     0     0     0
   204  0.92331186E-03     0   198   199     0     0     0
   204  0.46879106E-03     0   200   200     0     0     0
   204  0.15927610E-02     0   450   450     0     0     0
   204  0.95679043E-02     0   450   451     0     0     0
   204  0.60385432E-01     0   450   452     0     0     0
   204  0.11092806E-01     0   450   453     0     0     0
   204  0.11818764E-01     0   451   451     0     0     0
   204  0.14086759E+00     0   451   452     0     0     0
   204  0.67530950E-02     0   451   453     0     0     0
   204  0.25998559E-01     0   454   456     0     0     0
   204  0.15313989E+00     0   454   457     0     0     0
   204  0.15313989E+00     0   456   455     0     0     0
   204  0.39578355E-02     0   203   203     0     0     0
   204  0.17956490E-03     0   425   431     0     0     0
   204  0.13456390E-03     0   437   443     0     0     0
   204  0.17955014E-03     0   427   433     0     0     0
   204  0.13455111E-03     0   439   445     0     0     0
   204  0.15485432E-03     0   402   408     0     0     0
   204  0.27466755E-04     0   414   420     0     0     0
   204  0.15472836E-03     0   404   410     0     0     0
   204  0.27420547E-04     0   416   422     0     0     0
   204  0.80822741E-04     0   401   407     0     0     0
   204  0.80835751E-04     0   403   409     0     0     0
   204  0.63319359E-03     0   426   432     0     0     0
   204  0.63319359E-03     0   428   434     0     0     0
  17
   205  0.15261288E-04     0   123   129     0     0     0
   205  0.43710396E-02     0   125   131     0     0     0
   205  0.17891709E-03     0     3     9     0     0     0
   205  0.44157576E-01     0     5    11     0     0     0
   205  0.39524153E+00     0     6    12     0     0     0
   205  0.21850261E-03     0    13    13     0     0     0
   205  0.24923699E-02     0   450   450     0     0     0
   205  0.19200766E-01     0   450   451     0     0     0
   205  0.14038502E-01     0   450   452     0     0     0
   205  0.48776105E-01     0   450   453     0     0     0
   205  0.36090527E-01     0   451   451     0     0     0
   205  0.95461011E-02     0   451   452     0     0     0
   205  0.10214574E+00     0   451   453     0     0     0
   205  0.78437135E-01     0   454   456     0     0     0
   205  0.12209456E+00     0   454   457     0     0     0
   205  0.12209456E+00     0   456   455     0     0     0
   205  0.90081512E-03     0   203   200     0     0     0
  15
   206  0.15782907E-04     0   124   129     0     0     0
   206  0.45204386E-02     0   126   131     0     0     0
   206  0.17747628E-03     0     4     9     0     0     0
   206  0.40640223E+00     0     6    11     0     0     0
   206  0.28340353E-01     0   454   450     0     0     0
   206  0.48526959E-04     0   454   451     0     0     0
   206  0.17026797E+00     0   454   452     0     0     0
   206  0.15808925E+00     0   454   453     0     0     0
   206  0.55298626E-01     0   455   450     0     0     0
   206  0.17364615E+00     0   455   451     0     0     0
   206  0.94975031E-03     0   203   198     0     0     0
   206  0.37449904E-03     0   402   407     0     0     0
   206  0.37431947E-03     0   404   409     0     0     0
   206  0.74732408E-03     0   431   426     0     0     0
   206  0.74730226E-03     0   433   428     0     0     0
  15
   207  0.15782907E-04     0   130   123     0     0     0
   207  0.45204386E-02     0   132   125     0     0     0
   207  0.17747628E-03     0    10     3     0     0     0
   207  0.40640223E+00     0    12     5     0     0     0
   207  0.28340353E-01     0   456   450     0     0     0
   207  0.48526959E-04     0   456   451     0     0     0
   207  0.17026797E+00     0   456   452     0     0     0
   207  0.15808925E+00     0   456   453     0     0     0
   207  0.55298626E-01     0   457   450     0     0     0
   207  0.17364615E+00     0   457   451     0     0     0
   207  0.94975031E-03     0   203   199     0     0     0
   207  0.37449904E-03     0   408   401     0     0     0
   207  0.37431947E-03     0   410   403     0     0     0
   207  0.74732408E-03     0   425   432     0     0     0
   207  0.74730226E-03     0   427   434     0     0     0
   0
   5
     6  0.33333334E+00   100     2     7     5     0     0
     6  0.33333334E+00   100     4     9     5     0     0
     6  0.11111111E+00   100   122   127     5     0     0
     6  0.11111111E+00   100   124   129     5     0     0
     6  0.11111111E+00   100   126   131     5     0     0
   5
    12  0.33333334E+00   100     8     1    11     0     0
    12  0.33333334E+00   100    10     3    11     0     0
    12  0.11111111E+00   100   128   121    11     0     0
    12  0.11111111E+00   100   130   123    11     0     0
    12  0.11111111E+00   100   132   125    11     0     0
      4.00000000     -0.24965113
     -0.99620706      0.01872936     -0.07889482      0.03155782
     -0.03697012     -0.97399265      0.18600248     -0.12399424
      0.03241037     -0.04536194     -0.70344061     -0.70856375
      0.07179026     -0.22120078     -0.68143213      0.69394988
     -0.98397720      0.17829427     -0.17829427     -0.98397720
     -0.96388167      0.26633093     -0.26633093     -0.96388167
      1.57075512     -1.57079577     -1.57079387
    150.00000000   2400.00000000   2400.00000000
    600.00000000
    T
