#  ISAJET SUSY parameters in SUSY Les Houches Accord 2 format
#  Created by ISALHA 2.0 Last revision: C. Balazs 21 Apr 2009
Block SPINFO   # Program information
     1   ISASUGRA from ISAJET          # Spectrum Calculator
     2   7.80   29-OCT-2009 12:50:36   # Version number
Block MODSEL   # Model selection
     1     1   # Minimal supergravity (mSUGRA) model               
Block SMINPUTS   # Standard Model inputs
     1     1.27844704E+02   # alpha_em^(-1)
     2     1.16570000E-05   # G_Fermi
     3     1.17200002E-01   # alpha_s(M_Z)
     4     9.11699982E+01   # m_{Z}(pole)
     5     4.19999981E+00   # m_{b}(m_{b})
     6     1.72500000E+02   # m_{top}(pole)
     7     1.77699995E+00   # m_{tau}(pole)
Block MINPAR   # SUSY breaking input parameters
     1     3.40000000E+02   # m_0
     2     2.10000000E+02   # m_{1/2}
     3     1.00000000E+01   # tan(beta)
     4     1.00000000E+00   # sign(mu)
     5     0.00000000E+00   # A_0
Block EXTPAR   # Non-universal SUSY breaking parameters
     0     2.49262250E+16   # Input scale
Block MASS   # Scalar and gaugino mass spectrum
#  PDG code   mass                 particle
        24     8.04229965E+01   #  W^+
        25     1.07979958E+02   #  h^0            
        35     4.59295227E+02   #  H^0            
        36     4.55979431E+02   #  A^0            
        37     4.66383881E+02   #  H^+            
   1000001     5.85147034E+02   #  dnl            
   1000002     5.79573853E+02   #  upl            
   1000003     5.85147095E+02   #  stl            
   1000004     5.79575500E+02   #  chl            
   1000005     5.18584229E+02   #  b1             
   1000006     4.04573273E+02   #  t1             
   1000011     3.70390137E+02   #  el-            
   1000012     3.61375641E+02   #  nuel           
   1000013     3.70390137E+02   #  mul-           
   1000014     3.61375641E+02   #  numl           
   1000015     3.45252899E+02   #  tau1           
   1000016     3.59690063E+02   #  nutl           
   1000021     5.35526672E+02   #  glss           
   1000022     8.05839462E+01   #  z1ss           
   1000023     1.46437576E+02   #  z2ss           
   1000024     1.45981400E+02   #  w1ss           
   1000025    -2.92595428E+02   #  z3ss           
   1000035     3.17118713E+02   #  z4ss           
   1000037     3.16357544E+02   #  w2ss           
   2000001     5.70293579E+02   #  dnr            
   2000002     5.69872009E+02   #  upr            
   2000003     5.70293579E+02   #  str            
   2000004     5.69873596E+02   #  chr            
   2000005     5.66335815E+02   #  b2             
   2000006     5.67849060E+02   #  t2             
   2000011     3.50944733E+02   #  er-            
   2000013     3.50944733E+02   #  mur-           
   2000015     3.71038483E+02   #  tau2           
Block ALPHA   # Effective Higgs mixing parameter
         -1.08085006E-01   # alpha
Block STOPMIX   # stop mixing matrix
  1  1     4.76730525E-01   # O_{11}
  1  2     8.79049480E-01   # O_{12}
  2  1    -8.79049480E-01   # O_{21}
  2  2     4.76730525E-01   # O_{22}
Block SBOTMIX   # sbottom mixing matrix
  1  1     9.85872865E-01   # O_{11}
  1  2     1.67495430E-01   # O_{12}
  2  1    -1.67495430E-01   # O_{21}
  2  2     9.85872865E-01   # O_{22}
Block STAUMIX   # stau mixing matrix
  1  1     3.02919477E-01   # O_{11}
  1  2     9.53016162E-01   # O_{12}
  2  1    -9.53016162E-01   # O_{21}
  2  2     3.02919477E-01   # O_{22}
Block NMIX   # neutralino mixing matrix
  1  1     9.75537717E-01   #
  1  2    -8.39214027E-02   #
  1  3     1.90465957E-01   #
  1  4    -7.07544982E-02   #
  2  1    -1.55414298E-01   #
  2  2    -9.14110422E-01   #
  2  3     3.22555870E-01   #
  2  4    -1.90279365E-01   #
  3  1    -7.38903880E-02   #
  3  2     1.08067602E-01   #
  3  3     6.90380692E-01   #
  3  4     7.11502552E-01   #
  4  1    -1.36795074E-01   #
  4  2     3.81681472E-01   #
  4  3     6.18914068E-01   #
  4  4    -6.72719538E-01   #
Block UMIX   # chargino U mixing matrix
  1  1    -8.77201319E-01   # U_{11}
  1  2     4.80122685E-01   # U_{12}
  2  1    -4.80122685E-01   # U_{21}
  2  2    -8.77201319E-01   # U_{22}
Block VMIX   # chargino V mixing matrix
  1  1    -9.58660483E-01   # V_{11}
  1  2     2.84552485E-01   # V_{12}
  2  1    -2.84552485E-01   # V_{21}
  2  2    -9.58660483E-01   # V_{22}
Block GAUGE Q=  4.48064148E+02   #
     1     3.57490599E-01   # g`
     2     6.52494371E-01   # g_2
     3     1.22093105E+00   # g_3
Block YU Q=  4.48064148E+02   #
  3  3     8.85041595E-01   # y_t
Block YD Q=  4.48064148E+02   #
  3  3     1.39233664E-01   # y_b
Block YE Q=  4.48064148E+02   #
  3  3     1.01730950E-01   # y_tau
Block HMIX Q=  4.48064148E+02   # Higgs mixing parameters
     1     2.84682434E+02   # mu(Q)
     2     1.00000000E+01   # tan(beta)(M_GUT)
     3     2.50201584E+02   # Higgs vev at Q
     4     2.07917234E+05   # m_A^2(Q)
Block MSOFT Q=  4.48064148E+02   # DRbar SUSY breaking parameters
     1     8.51198196E+01   # M_1(Q)          
     2     1.60958786E+02   # M_2(Q)          
     3     4.93842529E+02   # M_3(Q)          
    31     3.66482727E+02   # MeL(Q)          
    32     3.66482727E+02   # MmuL(Q)         
    33     3.64841003E+02   # MtauL(Q)        
    34     3.47997192E+02   # MeR(Q)          
    35     3.47997192E+02   # MmuR(Q)         
    36     3.44689270E+02   # MtauR(Q)        
    41     5.56010376E+02   # MqL1(Q)         
    42     5.56010376E+02   # MqL2(Q)         
    43     4.94585938E+02   # MqL3(Q)         
    44     5.44866760E+02   # MuR(Q)          
    45     5.44866760E+02   # McR(Q)          
    46     4.05918304E+02   # MtR(Q)          
    47     5.43553406E+02   # MdR(Q)          
    48     5.43553406E+02   # MsR(Q)          
    49     5.43412598E+02   # MbR(Q)          
Block AU Q=  4.48064148E+02   #
  1  1    -3.96801941E+02   # A_u
  2  2    -3.96801941E+02   # A_c
  3  3    -3.96801941E+02   # A_t
Block AD Q=  4.48064148E+02   #
  1  1    -5.96088440E+02   # A_d
  2  2    -5.96088440E+02   # A_s
  3  3    -5.96088440E+02   # A_b
Block AE Q=  4.48064148E+02   #
  1  1    -1.29137238E+02   # A_e
  2  2    -1.29137238E+02   # A_mu
  3  3    -1.29137238E+02   # A_tau
#  ISAJET decay tables in SUSY Les Houches accord format
#  Created by ISALHD. Last revision: C. Balazs, 2005 May 25
Block DCINFO                           # Program information
     1   ISASUGRA from ISAJET          # Spectrum Calculator
     2   7.80   29-OCT-2009 12:50:36   # Version number
#         PDG         Width
DECAY         6  1.14680779E+00   # TP    decays
#          BR          NDA       ID1       ID2       ID3       ID4
      3.33333343E-01    3            2        -1         5             # TP     -->  UP     DB     BT          
      3.33333343E-01    3            4        -3         5             # TP     -->  CH     SB     BT          
      1.11111112E-01    3          -11        12         5             # TP     -->  E+     NUE    BT          
      1.11111112E-01    3          -13        14         5             # TP     -->  MU+    NUM    BT          
      1.11111112E-01    3          -15        16         5             # TP     -->  TAU+   NUT    BT          
#         PDG         Width
DECAY   1000021  8.08735043E-02   # GLSS  decays
#          BR          NDA       ID1       ID2       ID3       ID4
      5.61189093E-02    3      1000024         1        -2             # GLSS   -->  W1SS+  DN     UB          
      5.61189093E-02    3     -1000024         2        -1             # GLSS   -->  W1SS-  UP     DB          
      5.61181270E-02    3      1000024         3        -4             # GLSS   -->  W1SS+  ST     CB          
      5.61181270E-02    3     -1000024         4        -3             # GLSS   -->  W1SS-  CH     SB          
      6.95987931E-03    3      1000024         5        -6             # GLSS   -->  W1SS+  BT     TB          
      6.95987931E-03    3     -1000024         6        -5             # GLSS   -->  W1SS-  TP     BB          
      2.29783636E-03    3      1000037         1        -2             # GLSS   -->  W2SS+  DN     UB          
      2.29783636E-03    3     -1000037         2        -1             # GLSS   -->  W2SS-  UP     DB          
      2.29781144E-03    3      1000037         3        -4             # GLSS   -->  W2SS+  ST     CB          
      2.29781144E-03    3     -1000037         4        -3             # GLSS   -->  W2SS-  CH     SB          
      7.66051468E-04    3      1000037         5        -6             # GLSS   -->  W2SS+  BT     TB          
      7.66051468E-04    3     -1000037         6        -5             # GLSS   -->  W2SS-  TP     BB          
      5.01968316E-05    2      1000022        21                       # GLSS   -->  Z1SS   GL                 
      2.50189546E-02    3      1000022         2        -2             # GLSS   -->  Z1SS   UP     UB          
      8.77679978E-03    3      1000022         1        -1             # GLSS   -->  Z1SS   DN     DB          
      8.77679791E-03    3      1000022         3        -3             # GLSS   -->  Z1SS   ST     SB          
      2.50183214E-02    3      1000022         4        -4             # GLSS   -->  Z1SS   CH     CB          
      6.03512675E-03    3      1000022         5        -5             # GLSS   -->  Z1SS   BT     BB          
      6.50478294E-03    3      1000022         6        -6             # GLSS   -->  Z1SS   TP     TB          
      4.83868993E-04    2      1000023        21                       # GLSS   -->  Z2SS   GL                 
      3.11151277E-02    3      1000023         2        -2             # GLSS   -->  Z2SS   UP     UB          
      2.50401516E-02    3      1000023         1        -1             # GLSS   -->  Z2SS   DN     DB          
      2.50401292E-02    3      1000023         3        -3             # GLSS   -->  Z2SS   ST     SB          
      3.11143640E-02    3      1000023         4        -4             # GLSS   -->  Z2SS   CH     CB          
      2.94399448E-04    3      1000023         5        -5             # GLSS   -->  Z2SS   BT     BB          
      9.56891337E-04    3      1000023         6        -6             # GLSS   -->  Z2SS   TP     TB          
      2.88104685E-03    2      1000025        21                       # GLSS   -->  Z3SS   GL                 
      6.62734892E-05    3      1000025         2        -2             # GLSS   -->  Z3SS   UP     UB          
      7.44023564E-05    3      1000025         1        -1             # GLSS   -->  Z3SS   DN     DB          
      7.44022691E-05    3      1000025         3        -3             # GLSS   -->  Z3SS   ST     SB          
      6.62711391E-05    3      1000025         4        -4             # GLSS   -->  Z3SS   CH     CB          
      6.14736695E-04    3      1000025         5        -5             # GLSS   -->  Z3SS   BT     BB          
      2.79977894E-03    2      1000035        21                       # GLSS   -->  Z4SS   GL                 
      1.12709042E-03    3      1000035         2        -2             # GLSS   -->  Z4SS   UP     UB          
      1.23398146E-03    3      1000035         1        -1             # GLSS   -->  Z4SS   DN     DB          
      1.23398029E-03    3      1000035         3        -3             # GLSS   -->  Z4SS   ST     SB          
      1.12705573E-03    3      1000035         4        -4             # GLSS   -->  Z4SS   CH     CB          
      6.41815132E-04    3      1000035         5        -5             # GLSS   -->  Z4SS   BT     BB          
      2.72357970E-01    2     -1000005         5                       # GLSS   -->  BB1    BT                 
      2.72357970E-01    2      1000005        -5                       # GLSS   -->  BT1    BB                 
#         PDG         Width
DECAY   1000002  7.01909161E+00   # UPL   decays
#          BR          NDA       ID1       ID2       ID3       ID4
      3.00425384E-03    2      1000022         2                       # UPL    -->  Z1SS   UP                 
      2.70632833E-01    2      1000023         2                       # UPL    -->  Z2SS   UP                 
      1.72443793E-03    2      1000025         2                       # UPL    -->  Z3SS   UP                 
      2.16976553E-02    2      1000035         2                       # UPL    -->  Z4SS   UP                 
      1.14836730E-01    2      1000021         2                       # UPL    -->  GLSS   UP                 
      5.60362279E-01    2      1000024         1                       # UPL    -->  W1SS+  DN                 
      2.77418029E-02    2      1000037         1                       # UPL    -->  W2SS+  DN                 
#         PDG         Width
DECAY   1000001  6.98984909E+00   # DNL   decays
#          BR          NDA       ID1       ID2       ID3       ID4
      2.33949367E-02    2      1000022         1                       # DNL    -->  Z1SS   DN                 
      2.42853463E-01    2      1000023         1                       # DNL    -->  Z2SS   DN                 
      2.93082674E-03    2      1000025         1                       # DNL    -->  Z3SS   DN                 
      2.90817358E-02    2      1000035         1                       # DNL    -->  Z4SS   DN                 
      1.43478885E-01    2      1000021         1                       # DNL    -->  GLSS   DN                 
      4.76893991E-01    2     -1000024         2                       # DNL    -->  W1SS-  UP                 
      8.13662335E-02    2     -1000037         2                       # DNL    -->  W2SS-  UP                 
#         PDG         Width
DECAY   1000003  6.98980045E+00   # STL   decays
#          BR          NDA       ID1       ID2       ID3       ID4
      2.33951025E-02    2      1000022         3                       # STL    -->  Z1SS   ST                 
      2.42855176E-01    2      1000023         3                       # STL    -->  Z2SS   ST                 
      2.93084770E-03    2      1000025         3                       # STL    -->  Z3SS   ST                 
      2.90819537E-02    2      1000035         3                       # STL    -->  Z4SS   ST                 
      1.43480197E-01    2      1000021         3                       # STL    -->  GLSS   ST                 
      4.76891667E-01    2     -1000024         4                       # STL    -->  W1SS-  CH                 
      8.13650936E-02    2     -1000037         4                       # STL    -->  W2SS-  CH                 
#         PDG         Width
DECAY   1000004  7.01873446E+00   # CHL   decays
#          BR          NDA       ID1       ID2       ID3       ID4
      3.00438190E-03    2      1000022         4                       # CHL    -->  Z1SS   CH                 
      2.70644218E-01    2      1000023         4                       # CHL    -->  Z2SS   CH                 
      1.72450359E-03    2      1000025         4                       # CHL    -->  Z3SS   CH                 
      2.16984414E-02    2      1000035         4                       # CHL    -->  Z4SS   CH                 
      1.14792250E-01    2      1000021         4                       # CHL    -->  GLSS   CH                 
      5.60392797E-01    2      1000024         3                       # CHL    -->  W1SS+  ST                 
      2.77434308E-02    2      1000037         3                       # CHL    -->  W2SS+  ST                 
#         PDG         Width
DECAY   1000005  6.36446381E+00   # BT1   decays
#          BR          NDA       ID1       ID2       ID3       ID4
      2.80311834E-02    2      1000022         5                       # BT1    -->  Z1SS   BT                 
      2.31866181E-01    2      1000023         5                       # BT1    -->  Z2SS   BT                 
      7.70819606E-03    2      1000025         5                       # BT1    -->  Z3SS   BT                 
      2.29509901E-02    2      1000035         5                       # BT1    -->  Z4SS   BT                 
      3.35979551E-01    2     -1000024         6                       # BT1    -->  W1SS-  TP                 
      3.06979775E-01    2     -1000037         6                       # BT1    -->  W2SS-  TP                 
      6.64841086E-02    2          -24   1000006                       # BT1    -->  W-     TP1                
#         PDG         Width
DECAY   1000006  2.99904442E+00   # TP1   decays
#          BR          NDA       ID1       ID2       ID3       ID4
      1.55533776E-01    2      1000022         6                       # TP1    -->  Z1SS   TP                 
      1.30587086E-01    2      1000023         6                       # TP1    -->  Z2SS   TP                 
      5.42966008E-01    2      1000024         5                       # TP1    -->  W1SS+  BT                 
      1.70913145E-01    2      1000037         5                       # TP1    -->  W2SS+  BT                 
#         PDG         Width
DECAY   2000002  1.72741151E+00   # UPR   decays
#          BR          NDA       ID1       ID2       ID3       ID4
      6.81618750E-01    2      1000022         2                       # UPR    -->  Z1SS   UP                 
      1.57124624E-02    2      1000023         2                       # UPR    -->  Z2SS   UP                 
      2.20788317E-03    2      1000025         2                       # UPR    -->  Z3SS   UP                 
      6.65060710E-03    2      1000035         2                       # UPR    -->  Z4SS   UP                 
      2.93810248E-01    2      1000021         2                       # UPR    -->  GLSS   UP                 
#         PDG         Width
DECAY   2000001  8.24489236E-01   # DNR   decays
#          BR          NDA       ID1       ID2       ID3       ID4
      3.57305527E-01    2      1000022         1                       # DNR    -->  Z1SS   DN                 
      8.23772047E-03    2      1000023         1                       # DNR    -->  Z2SS   DN                 
      1.15853082E-03    2      1000025         1                       # DNR    -->  Z3SS   DN                 
      3.49067082E-03    2      1000035         1                       # DNR    -->  Z4SS   DN                 
      6.29807532E-01    2      1000021         1                       # DNR    -->  GLSS   DN                 
#         PDG         Width
DECAY   2000003  8.24489236E-01   # STR   decays
#          BR          NDA       ID1       ID2       ID3       ID4
      3.57305527E-01    2      1000022         3                       # STR    -->  Z1SS   ST                 
      8.23772047E-03    2      1000023         3                       # STR    -->  Z2SS   ST                 
      1.15853082E-03    2      1000025         3                       # STR    -->  Z3SS   ST                 
      3.49067082E-03    2      1000035         3                       # STR    -->  Z4SS   ST                 
      6.29807532E-01    2      1000021         3                       # STR    -->  GLSS   ST                 
#         PDG         Width
DECAY   2000004  1.72702813E+00   # CHR   decays
#          BR          NDA       ID1       ID2       ID3       ID4
      6.81764245E-01    2      1000022         4                       # CHR    -->  Z1SS   CH                 
      1.57158077E-02    2      1000023         4                       # CHR    -->  Z2SS   CH                 
      2.20834301E-03    2      1000025         4                       # CHR    -->  Z3SS   CH                 
      6.65197754E-03    2      1000035         4                       # CHR    -->  Z4SS   CH                 
      2.93659627E-01    2      1000021         4                       # CHR    -->  GLSS   CH                 
#         PDG         Width
DECAY   2000005  1.15545261E+00   # BT2   decays
#          BR          NDA       ID1       ID2       ID3       ID4
      2.32746363E-01    2      1000022         5                       # BT2    -->  Z1SS   BT                 
      1.40504660E-02    2      1000023         5                       # BT2    -->  Z2SS   BT                 
      6.22251965E-02    2      1000025         5                       # BT2    -->  Z3SS   BT                 
      7.04532489E-02    2      1000035         5                       # BT2    -->  Z4SS   BT                 
      3.34642559E-01    2      1000021         5                       # BT2    -->  GLSS   BT                 
      1.43665997E-02    2     -1000024         6                       # BT2    -->  W1SS-  TP                 
      2.21998408E-01    2     -1000037         6                       # BT2    -->  W2SS-  TP                 
      4.95170541E-02    2          -24   1000006                       # BT2    -->  W-     TP1                
#         PDG         Width
DECAY   2000006  8.93105507E+00   # TP2   decays
#          BR          NDA       ID1       ID2       ID3       ID4
      2.06928194E-01    2      1000024         5                       # TP2    -->  W1SS+  BT                 
      1.99006900E-01    2      1000037         5                       # TP2    -->  W2SS+  BT                 
      7.98453167E-02    2           23   1000006                       # TP2    -->  Z0     TP1                
      4.06076424E-02    2           25   1000006                       # TP2    -->  HL0    TP1                
      1.36043597E-02    2      1000022         6                       # TP2    -->  Z1SS   TP                 
      8.89455229E-02    2      1000023         6                       # TP2    -->  Z2SS   TP                 
      9.99009982E-02    2      1000025         6                       # TP2    -->  Z3SS   TP                 
      2.71161020E-01    2      1000035         6                       # TP2    -->  Z4SS   TP                 
#         PDG         Width
DECAY   1000011  3.17403126E+00   # EL-   decays
#          BR          NDA       ID1       ID2       ID3       ID4
      9.11815986E-02    2      1000022        11                       # EL-    -->  Z1SS   E-                 
      3.49315196E-01    2      1000023        11                       # EL-    -->  Z2SS   E-                 
      3.15915269E-04    2      1000025        11                       # EL-    -->  Z3SS   E-                 
      3.28864949E-03    2      1000035        11                       # EL-    -->  Z4SS   E-                 
      5.39330959E-01    2     -1000024        12                       # EL-    -->  W1SS-  NUE                
      1.65677406E-02    2     -1000037        12                       # EL-    -->  W2SS-  NUE                
#         PDG         Width
DECAY   1000013  3.17403126E+00   # MUL-  decays
#          BR          NDA       ID1       ID2       ID3       ID4
      9.11815912E-02    2      1000022        13                       # MUL-   -->  Z1SS   MU-                
      3.49315166E-01    2      1000023        13                       # MUL-   -->  Z2SS   MU-                
      3.15914920E-04    2      1000025        13                       # MUL-   -->  Z3SS   MU-                
      3.28864180E-03    2      1000035        13                       # MUL-   -->  Z4SS   MU-                
      5.39330959E-01    2     -1000024        14                       # MUL-   -->  W1SS-  NUM                
      1.65677406E-02    2     -1000037        14                       # MUL-   -->  W2SS-  NUM                
#         PDG         Width
DECAY   1000015  1.78595364E+00   # TAU1- decays
#          BR          NDA       ID1       ID2       ID3       ID4
      7.86233187E-01    2      1000022        15                       # TAU1-  -->  Z1SS   TAU-               
      8.67973641E-02    2      1000023        15                       # TAU1-  -->  Z2SS   TAU-               
      1.08920154E-03    2      1000025        15                       # TAU1-  -->  Z3SS   TAU-               
      2.43976319E-04    2      1000035        15                       # TAU1-  -->  Z4SS   TAU-               
      1.25629395E-01    2     -1000024        16                       # TAU1-  -->  W1SS-  NUT                
      6.85047416E-06    2     -1000037        16                       # TAU1-  -->  W2SS-  NUT                
#         PDG         Width
DECAY   1000012  3.25003028E+00   # NUEL  decays
#          BR          NDA       ID1       ID2       ID3       ID4
      1.62518054E-01    2      1000022        12                       # NUEL   -->  Z1SS   NUE                
      2.24526942E-01    2      1000023        12                       # NUEL   -->  Z2SS   NUE                
      1.22741994E-03    2      1000025        12                       # NUEL   -->  Z3SS   NUE                
      5.16514387E-03    2      1000035        12                       # NUEL   -->  Z4SS   NUE                
      6.02425337E-01    2      1000024        11                       # NUEL   -->  W1SS+  E-                 
      4.13708622E-03    2      1000037        11                       # NUEL   -->  W2SS+  E-                 
#         PDG         Width
DECAY   1000014  3.25002980E+00   # NUML  decays
#          BR          NDA       ID1       ID2       ID3       ID4
      1.62518069E-01    2      1000022        14                       # NUML   -->  Z1SS   NUM                
      2.24526972E-01    2      1000023        14                       # NUML   -->  Z2SS   NUM                
      1.22742017E-03    2      1000025        14                       # NUML   -->  Z3SS   NUM                
      5.16514434E-03    2      1000035        14                       # NUML   -->  Z4SS   NUM                
      6.02425396E-01    2      1000024        13                       # NUML   -->  W1SS+  MU-                
      4.13707411E-03    2      1000037        13                       # NUML   -->  W2SS+  MU-                
#         PDG         Width
DECAY   1000016  3.23666263E+00   # NUTL  decays
#          BR          NDA       ID1       ID2       ID3       ID4
      1.62268430E-01    2      1000022        16                       # NUTL   -->  Z1SS   NUT                
      2.23575085E-01    2      1000023        16                       # NUTL   -->  Z2SS   NUT                
      1.18326338E-03    2      1000025        16                       # NUTL   -->  Z3SS   NUT                
      4.84256679E-03    2      1000035        16                       # NUTL   -->  Z4SS   NUT                
      6.03176296E-01    2      1000024        15                       # NUTL   -->  W1SS+  TAU-               
      4.95425239E-03    2      1000037        15                       # NUTL   -->  W2SS+  TAU-               
      4.90194685E-09    3      1000015        16       -15             # NUTL   -->  TAU1-  NUT    TAU+        
      4.90194685E-09    3      1000015        12       -11             # NUTL   -->  TAU1-  NUE    E+          
      4.90194685E-09    3      1000015        14       -13             # NUTL   -->  TAU1-  NUM    MU+         
      1.47058401E-08    3      1000015         2        -1             # NUTL   -->  TAU1-  UP     DB          
      1.47058401E-08    3      1000015         4        -3             # NUTL   -->  TAU1-  CH     SB          
#         PDG         Width
DECAY   2000011  1.55576253E+00   # ER-   decays
#          BR          NDA       ID1       ID2       ID3       ID4
      9.79792476E-01    2      1000022        11                       # ER-    -->  Z1SS   E-                 
      1.89024881E-02    2      1000023        11                       # ER-    -->  Z2SS   E-                 
      5.82288019E-04    2      1000025        11                       # ER-    -->  Z3SS   E-                 
      7.22798519E-04    2      1000035        11                       # ER-    -->  Z4SS   E-                 
#         PDG         Width
DECAY   2000013  1.55576229E+00   # MUR-  decays
#          BR          NDA       ID1       ID2       ID3       ID4
      9.79792476E-01    2      1000022        13                       # MUR-   -->  Z1SS   MU-                
      1.89024881E-02    2      1000023        13                       # MUR-   -->  Z2SS   MU-                
      5.82286913E-04    2      1000025        13                       # MUR-   -->  Z3SS   MU-                
      7.22794735E-04    2      1000035        13                       # MUR-   -->  Z4SS   MU-                
#         PDG         Width
DECAY   2000015  2.93087602E+00   # TAU2- decays
#          BR          NDA       ID1       ID2       ID3       ID4
      1.34130821E-01    2      1000022        15                       # TAU2-  -->  Z1SS   TAU-               
      3.34080070E-01    2      1000023        15                       # TAU2-  -->  Z2SS   TAU-               
      3.14359041E-03    2      1000025        15                       # TAU2-  -->  Z3SS   TAU-               
      5.68409031E-03    2      1000035        15                       # TAU2-  -->  Z4SS   TAU-               
      5.03121555E-01    2     -1000024        16                       # TAU2-  -->  W1SS-  NUT                
      1.98398791E-02    2     -1000037        16                       # TAU2-  -->  W2SS-  NUT                
#         PDG         Width
DECAY   1000023  6.96944790E-06   # Z2SS  decays
#          BR          NDA       ID1       ID2       ID3       ID4
      9.75038914E-04    2      1000022        22                       # Z2SS   -->  Z1SS   GM                 
      1.44528568E-01    3      1000022         2        -2             # Z2SS   -->  Z1SS   UP     UB          
      1.97288185E-01    3      1000022         1        -1             # Z2SS   -->  Z1SS   DN     DB          
      1.97288170E-01    3      1000022         3        -3             # Z2SS   -->  Z1SS   ST     SB          
      1.44528508E-01    3      1000022         4        -4             # Z2SS   -->  Z1SS   CH     CB          
      1.99814439E-01    3      1000022         5        -5             # Z2SS   -->  Z1SS   BT     BB          
      1.06232613E-02    3      1000022        11       -11             # Z2SS   -->  Z1SS   E-     E+          
      1.06232613E-02    3      1000022        13       -13             # Z2SS   -->  Z1SS   MU-    MU+         
      1.28376242E-02    3      1000022        15       -15             # Z2SS   -->  Z1SS   TAU-   TAU+        
      2.72902604E-02    3      1000022        12       -12             # Z2SS   -->  Z1SS   NUE    ANUE        
      2.72902604E-02    3      1000022        14       -14             # Z2SS   -->  Z1SS   NUM    ANUM        
      2.69123241E-02    3      1000022        16       -16             # Z2SS   -->  Z1SS   NUT    ANUT        
#         PDG         Width
DECAY   1000025  1.17230093E+00   # Z3SS  decays
#          BR          NDA       ID1       ID2       ID3       ID4
      2.60183015E-07    2      1000022        22                       # Z3SS   -->  Z1SS   GM                 
      2.50791544E-07    2      1000023        22                       # Z3SS   -->  Z2SS   GM                 
      3.12738657E-01    2      1000024       -24                       # Z3SS   -->  W1SS+  W-                 
      3.12738657E-01    2     -1000024        24                       # Z3SS   -->  W1SS-  W+                 
      1.46850944E-01    2      1000022        23                       # Z3SS   -->  Z1SS   Z0                 
      1.92967370E-01    2      1000023        23                       # Z3SS   -->  Z2SS   Z0                 
      1.93304057E-08    3      1000022         2        -2             # Z3SS   -->  Z1SS   UP     UB          
      1.22335742E-08    3      1000022         1        -1             # Z3SS   -->  Z1SS   DN     DB          
      1.22335679E-08    3      1000022         3        -3             # Z3SS   -->  Z1SS   ST     SB          
      1.93301517E-08    3      1000022         4        -4             # Z3SS   -->  Z1SS   CH     CB          
      1.06669540E-06    3      1000022         5        -5             # Z3SS   -->  Z1SS   BT     BB          
      4.80663459E-07    3      1000022        11       -11             # Z3SS   -->  Z1SS   E-     E+          
      4.80663459E-07    3      1000022        13       -13             # Z3SS   -->  Z1SS   MU-    MU+         
      4.02866362E-06    3      1000022        15       -15             # Z3SS   -->  Z1SS   TAU-   TAU+        
      4.04983297E-07    3      1000022        12       -12             # Z3SS   -->  Z1SS   NUE    ANUE        
      4.04983297E-07    3      1000022        14       -14             # Z3SS   -->  Z1SS   NUM    ANUM        
      4.18035086E-07    3      1000022        16       -16             # Z3SS   -->  Z1SS   NUT    ANUT        
      2.28045778E-08    3      1000023         2        -2             # Z3SS   -->  Z2SS   UP     UB          
      3.16693409E-08    3      1000023         1        -1             # Z3SS   -->  Z2SS   DN     DB          
      3.16693267E-08    3      1000023         3        -3             # Z3SS   -->  Z2SS   ST     SB          
      2.28042722E-08    3      1000023         4        -4             # Z3SS   -->  Z2SS   CH     CB          
      8.07262211E-07    3      1000023         5        -5             # Z3SS   -->  Z2SS   BT     BB          
      5.65648222E-08    3      1000023        11       -11             # Z3SS   -->  Z2SS   E-     E+          
      5.65648222E-08    3      1000023        13       -13             # Z3SS   -->  Z2SS   MU-    MU+         
      6.94515109E-07    3      1000023        15       -15             # Z3SS   -->  Z2SS   TAU-   TAU+        
      2.12589242E-07    3      1000023        12       -12             # Z3SS   -->  Z2SS   NUE    ANUE        
      2.12589242E-07    3      1000023        14       -14             # Z3SS   -->  Z2SS   NUM    ANUM        
      2.20194920E-07    3      1000023        16       -16             # Z3SS   -->  Z2SS   NUT    ANUT        
      2.56264415E-02    2      1000022        25                       # Z3SS   -->  Z1SS   HL0                
      9.06778779E-03    2      1000023        25                       # Z3SS   -->  Z2SS   HL0                
#         PDG         Width
DECAY   1000035  1.47850955E+00   # Z4SS  decays
#          BR          NDA       ID1       ID2       ID3       ID4
      4.25625274E-07    2      1000022        22                       # Z4SS   -->  Z1SS   GM                 
      3.23464810E-08    2      1000023        22                       # Z4SS   -->  Z2SS   GM                 
      1.17072751E-08    2      1000025        22                       # Z4SS   -->  Z3SS   GM                 
      3.58143866E-01    2      1000024       -24                       # Z4SS   -->  W1SS+  W-                 
      3.58143866E-01    2     -1000024        24                       # Z4SS   -->  W1SS-  W+                 
      3.17390859E-02    2      1000022        23                       # Z4SS   -->  Z1SS   Z0                 
      2.22388115E-02    2      1000023        23                       # Z4SS   -->  Z2SS   Z0                 
      2.02696057E-07    3      1000022         2        -2             # Z4SS   -->  Z1SS   UP     UB          
      3.40679350E-07    3      1000022         1        -1             # Z4SS   -->  Z1SS   DN     DB          
      3.40679179E-07    3      1000022         3        -3             # Z4SS   -->  Z1SS   ST     SB          
      2.02693400E-07    3      1000022         4        -4             # Z4SS   -->  Z1SS   CH     CB          
      1.22029269E-06    3      1000022         5        -5             # Z4SS   -->  Z1SS   BT     BB          
      6.45734190E-06    3      1000022        11       -11             # Z4SS   -->  Z1SS   E-     E+          
      6.45734190E-06    3      1000022        13       -13             # Z4SS   -->  Z1SS   MU-    MU+         
      9.53193285E-06    3      1000022        15       -15             # Z4SS   -->  Z1SS   TAU-   TAU+        
      1.06682501E-05    3      1000022        12       -12             # Z4SS   -->  Z1SS   NUE    ANUE        
      1.06682501E-05    3      1000022        14       -14             # Z4SS   -->  Z1SS   NUM    ANUM        
      1.10373476E-05    3      1000022        16       -16             # Z4SS   -->  Z1SS   NUT    ANUT        
      1.36064716E-06    3      1000023         2        -2             # Z4SS   -->  Z2SS   UP     UB          
      1.49038215E-06    3      1000023         1        -1             # Z4SS   -->  Z2SS   DN     DB          
      1.49038158E-06    3      1000023         3        -3             # Z4SS   -->  Z2SS   ST     SB          
      1.36062840E-06    3      1000023         4        -4             # Z4SS   -->  Z2SS   CH     CB          
      3.25216729E-06    3      1000023         5        -5             # Z4SS   -->  Z2SS   BT     BB          
      4.94332289E-06    3      1000023        11       -11             # Z4SS   -->  Z2SS   E-     E+          
      4.94332289E-06    3      1000023        13       -13             # Z4SS   -->  Z2SS   MU-    MU+         
      5.30848138E-06    3      1000023        15       -15             # Z4SS   -->  Z2SS   TAU-   TAU+        
      9.04375429E-06    3      1000023        12       -12             # Z4SS   -->  Z2SS   NUE    ANUE        
      9.04375429E-06    3      1000023        14       -14             # Z4SS   -->  Z2SS   NUM    ANUM        
      9.39151596E-06    3      1000023        16       -16             # Z4SS   -->  Z2SS   NUT    ANUT        
      5.77397088E-07    3      1000025         2        -2             # Z4SS   -->  Z3SS   UP     UB          
      7.48766581E-07    3      1000025         1        -1             # Z4SS   -->  Z3SS   DN     DB          
      7.48766581E-07    3      1000025         3        -3             # Z4SS   -->  Z3SS   ST     SB          
      5.77397088E-07    3      1000025         4        -4             # Z4SS   -->  Z3SS   CH     CB          
      4.71631154E-07    3      1000025         5        -5             # Z4SS   -->  Z3SS   BT     BB          
      1.71387171E-07    3      1000025        11       -11             # Z4SS   -->  Z3SS   E-     E+          
      1.71387171E-07    3      1000025        13       -13             # Z4SS   -->  Z3SS   MU-    MU+         
      1.61332224E-07    3      1000025        15       -15             # Z4SS   -->  Z3SS   TAU-   TAU+        
      3.28482798E-07    3      1000025        12       -12             # Z4SS   -->  Z3SS   NUE    ANUE        
      3.28482798E-07    3      1000025        14       -14             # Z4SS   -->  Z3SS   NUM    ANUM        
      3.28199434E-07    3      1000025        16       -16             # Z4SS   -->  Z3SS   NUT    ANUT        
      9.05478895E-02    2      1000022        25                       # Z4SS   -->  Z1SS   HL0                
      1.39072910E-01    2      1000023        25                       # Z4SS   -->  Z2SS   HL0                
#         PDG         Width
DECAY   1000024  8.05158415E-05   # W1SS+ decays
#          BR          NDA       ID1       ID2       ID3       ID4
      3.39739352E-01    3      1000022         2        -1             # W1SS+  -->  Z1SS   UP     DB          
      3.39739352E-01    3      1000022         4        -3             # W1SS+  -->  Z1SS   CH     SB          
      1.06779560E-01    3      1000022       -11        12             # W1SS+  -->  Z1SS   E+     NUE         
      1.06779560E-01    3      1000022       -13        14             # W1SS+  -->  Z1SS   MU+    NUM         
      1.06962167E-01    3      1000022       -15        16             # W1SS+  -->  Z1SS   TAU+   NUT         
#         PDG         Width
DECAY   1000037  1.35344088E+00   # W2SS+ decays
#          BR          NDA       ID1       ID2       ID3       ID4
      4.45899786E-07    3      1000022         2        -1             # W2SS+  -->  Z1SS   UP     DB          
      4.45899076E-07    3      1000022         4        -3             # W2SS+  -->  Z1SS   CH     SB          
      1.00517555E-05    3      1000022       -11        12             # W2SS+  -->  Z1SS   E+     NUE         
      1.00517555E-05    3      1000022       -13        14             # W2SS+  -->  Z1SS   MU+    NUM         
      1.39004396E-05    3      1000022       -15        16             # W2SS+  -->  Z1SS   TAU+   NUT         
      7.65067041E-02    2      1000022        24                       # W2SS+  -->  Z1SS   W+                 
      1.35181756E-06    3      1000023         2        -1             # W2SS+  -->  Z2SS   UP     DB          
      1.35181381E-06    3      1000023         4        -3             # W2SS+  -->  Z2SS   CH     SB          
      8.42362624E-06    3      1000023       -11        12             # W2SS+  -->  Z2SS   E+     NUE         
      8.42362624E-06    3      1000023       -13        14             # W2SS+  -->  Z2SS   MU+    NUM         
      9.23986863E-06    3      1000023       -15        16             # W2SS+  -->  Z2SS   TAU+   NUT         
      4.12909478E-01    2      1000023        24                       # W2SS+  -->  Z2SS   W+                 
      1.97688200E-06    3      1000025         2        -1             # W2SS+  -->  Z3SS   UP     DB          
      1.97688200E-06    3      1000025         4        -3             # W2SS+  -->  Z3SS   CH     SB          
      6.57367991E-07    3      1000025       -11        12             # W2SS+  -->  Z3SS   E+     NUE         
      6.57367991E-07    3      1000025       -13        14             # W2SS+  -->  Z3SS   MU+    NUM         
      6.59603757E-07    3      1000025       -15        16             # W2SS+  -->  Z3SS   TAU+   NUT         
      3.14312667E-01    2      1000024        23                       # W2SS+  -->  W1SS+  Z0                 
      1.35620508E-06    3      1000024         1        -1             # W2SS+  -->  W1SS+  DN     DB          
      1.35618632E-06    3      1000024         3        -3             # W2SS+  -->  W1SS+  ST     SB          
      3.08628546E-06    3      1000024         2        -2             # W2SS+  -->  W1SS+  UP     UB          
      3.08628319E-06    3      1000024         4        -4             # W2SS+  -->  W1SS+  CH     CB          
      1.45068061E-05    3      1000024        12       -12             # W2SS+  -->  W1SS+  NUE    ANUE        
      1.45068061E-05    3      1000024        14       -14             # W2SS+  -->  W1SS+  NUM    ANUM        
      2.66008647E-05    3      1000024        16       -16             # W2SS+  -->  W1SS+  NUT    ANUT        
      7.41417261E-06    3      1000024        11       -11             # W2SS+  -->  W1SS+  E-     E+          
      7.41417261E-06    3      1000024        13       -13             # W2SS+  -->  W1SS+  MU-    MU+         
      7.70923361E-06    3      1000024        15       -15             # W2SS+  -->  W1SS+  TAU-   TAU+        
      1.96114495E-01    2      1000024        25                       # W2SS+  -->  W1SS+  HL0                
#         PDG         Width
DECAY        25  4.24971944E-03   # HL0   decays
#          BR          NDA       ID1       ID2       ID3       ID4
      5.07500264E-09    2           11       -11                       # HL0    -->  E-     E+                 
      2.14274565E-04    2           13       -13                       # HL0    -->  MU-    MU+                
      6.12721704E-02    2           15       -15                       # HL0    -->  TAU-   TAU+               
      6.37576159E-06    2            1        -1                       # HL0    -->  DN     DB                 
      2.57612648E-03    2            3        -3                       # HL0    -->  ST     SB                 
      8.52063835E-01    2            5        -5                       # HL0    -->  BT     BB                 
      1.73266881E-06    2            2        -2                       # HL0    -->  UP     UB                 
      3.29359211E-02    2            4        -4                       # HL0    -->  CH     CB                 
      1.38445909E-03    2           22        22                       # HL0    -->  GM     GM                 
      3.12713571E-02    2           21        21                       # HL0    -->  GL     GL                 
      9.74364928E-04    3           24        11       -12             # HL0    -->  W+     E-     ANUE        
      9.74364928E-04    3           24        13       -14             # HL0    -->  W+     MU-    ANUM        
      9.74364928E-04    3           24        15       -16             # HL0    -->  W+     TAU-   ANUT        
      2.92309490E-03    3           24        -2         1             # HL0    -->  W+     UB     DN          
      2.92309490E-03    3           24        -4         3             # HL0    -->  W+     CB     ST          
      9.74364928E-04    3          -24       -11        12             # HL0    -->  W-     E+     NUE         
      9.74364928E-04    3          -24       -13        14             # HL0    -->  W-     MU+    NUM         
      9.74364928E-04    3          -24       -15        16             # HL0    -->  W-     TAU+   NUT         
      2.92309490E-03    3          -24         2        -1             # HL0    -->  W-     UP     DB          
      2.92309490E-03    3          -24         4        -3             # HL0    -->  W-     CH     SB          
      5.02583243E-05    3           23        12       -12             # HL0    -->  Z0     NUE    ANUE        
      5.02583243E-05    3           23        14       -14             # HL0    -->  Z0     NUM    ANUM        
      5.02583243E-05    3           23        16       -16             # HL0    -->  Z0     NUT    ANUT        
      2.52945101E-05    3           23        11       -11             # HL0    -->  Z0     E-     E+          
      2.52945101E-05    3           23        13       -13             # HL0    -->  Z0     MU-    MU+         
      2.52945101E-05    3           23        15       -15             # HL0    -->  Z0     TAU-   TAU+        
      8.66568444E-05    3           23         2        -2             # HL0    -->  Z0     UP     UB          
      8.66568444E-05    3           23         4        -4             # HL0    -->  Z0     CH     CB          
      1.11635367E-04    3           23         1        -1             # HL0    -->  Z0     DN     DB          
      1.11635367E-04    3           23         3        -3             # HL0    -->  Z0     ST     SB          
      1.11635367E-04    3           23         5        -5             # HL0    -->  Z0     BT     BB          
#         PDG         Width
DECAY        35  1.75425744E+00   # HH0   decays
#          BR          NDA       ID1       ID2       ID3       ID4
      4.44149784E-09    2           11       -11                       # HH0    -->  E-     E+                 
      1.87528000E-04    2           13       -13                       # HH0    -->  MU-    MU+                
      5.37060834E-02    2           15       -15                       # HH0    -->  TAU-   TAU+               
      5.47932450E-06    2            1        -1                       # HH0    -->  DN     DB                 
      2.21392442E-03    2            3        -3                       # HH0    -->  ST     SB                 
      3.34380955E-01    2            5        -5                       # HH0    -->  BT     BB                 
      2.06421824E-10    2            2        -2                       # HH0    -->  UP     UB                 
      3.20169647E-06    2            4        -4                       # HH0    -->  CH     CB                 
      5.88532761E-02    2            6        -6                       # HH0    -->  TP     TB                 
      2.68989720E-06    2           22        22                       # HH0    -->  GM     GM                 
      1.60639072E-04    2           21        21                       # HH0    -->  GL     GL                 
      1.05962285E-03    2           24       -24                       # HH0    -->  W+     W-                 
      5.16379485E-04    2           23        23                       # HH0    -->  Z0     Z0                 
      2.29813680E-02    2      1000022   1000022                       # HH0    -->  Z1SS   Z1SS               
      8.12322050E-02    2      1000022   1000023                       # HH0    -->  Z1SS   Z2SS               
      8.92827362E-02    2      1000022   1000025                       # HH0    -->  Z1SS   Z3SS               
      7.60004297E-03    2      1000022   1000035                       # HH0    -->  Z1SS   Z4SS               
      6.23307414E-02    2      1000023   1000023                       # HH0    -->  Z2SS   Z2SS               
      9.52832997E-02    2      1000023   1000025                       # HH0    -->  Z2SS   Z3SS               
      1.88058138E-01    2      1000024  -1000024                       # HH0    -->  W1SS+  W1SS-              
      2.14163656E-03    2           25        25                       # HH0    -->  HL0    HL0                
#         PDG         Width
DECAY        36  2.18496418E+00   # HA0   decays
#          BR          NDA       ID1       ID2       ID3       ID4
      3.54645047E-09    2           11       -11                       # HA0    -->  E-     E+                 
      1.49737520E-04    2           13       -13                       # HA0    -->  MU-    MU+                
      4.28858213E-02    2           15       -15                       # HA0    -->  TAU-   TAU+               
      4.37544350E-06    2            1        -1                       # HA0    -->  DN     DB                 
      1.76790077E-03    2            3        -3                       # HA0    -->  ST     SB                 
      2.67079085E-01    2            5        -5                       # HA0    -->  BT     BB                 
      1.40000164E-10    2            2        -2                       # HA0    -->  UP     UB                 
      2.17351430E-06    2            4        -4                       # HA0    -->  CH     CB                 
      8.66671503E-02    2            6        -6                       # HA0    -->  TP     TB                 
      1.26579380E-07    2           22        22                       # HA0    -->  GM     GM                 
      8.59683278E-05    2           21        21                       # HA0    -->  GL     GL                 
      2.44162679E-02    2      1000022   1000022                       # HA0    -->  Z1SS   Z1SS               
      1.03053018E-01    2      1000022   1000023                       # HA0    -->  Z1SS   Z2SS               
      1.83727369E-02    2      1000022   1000025                       # HA0    -->  Z1SS   Z3SS               
      2.98799612E-02    2      1000022   1000035                       # HA0    -->  Z1SS   Z4SS               
      1.06828734E-01    2      1000023   1000023                       # HA0    -->  Z2SS   Z2SS               
      3.47011583E-03    2      1000023   1000025                       # HA0    -->  Z2SS   Z3SS               
      3.14600736E-01    2      1000024  -1000024                       # HA0    -->  W1SS+  W1SS-              
      7.36169284E-04    2           25        23                       # HA0    -->  HL0    Z0                 
#         PDG         Width
DECAY        37  1.55562449E+00   # H+    decays
#          BR          NDA       ID1       ID2       ID3       ID4
      5.09485343E-09    2           12       -11                       # H+     -->  NUE    E+                 
      2.15113905E-04    2           14       -13                       # H+     -->  NUM    MU+                
      6.16101362E-02    2           16       -15                       # H+     -->  NUT    TAU+               
      5.73714033E-06    2            2        -1                       # H+     -->  UP     DB                 
      2.32082210E-03    2            4        -3                       # H+     -->  CH     SB                 
      3.65440011E-01    2            6        -5                       # H+     -->  TP     BB                 
      1.96754783E-01    2      1000024   1000022                       # H+     -->  W1SS+  Z1SS               
      5.06007206E-03    2      1000024   1000023                       # H+     -->  W1SS+  Z2SS               
      1.90518633E-01    2      1000024   1000025                       # H+     -->  W1SS+  Z3SS               
      6.20004945E-02    2      1000024   1000035                       # H+     -->  W1SS+  Z4SS               
      2.39868686E-02    2      1000037   1000022                       # H+     -->  W2SS+  Z1SS               
      9.09427553E-02    2      1000037   1000023                       # H+     -->  W2SS+  Z2SS               
      1.14457437E-03    2           25        24                       # H+     -->  HL0    W+                 
