#  ISAJET SUSY parameters in SUSY Les Houches Accord 2 format
#  Created by ISALHA 2.0 Last revision: C. Balazs 21 Apr 2009
Block SPINFO   # Program information
     1   ISASUGRA from ISAJET          # Spectrum Calculator
     2   7.80   29-OCT-2009 12:50:36   # Version number
Block MODSEL   # Model selection
     1     2   # Minimal gauge mediated (GMSB) model               
Block SMINPUTS   # Standard Model inputs
     1     1.27836258E+02   # alpha_em^(-1)
     2     1.16570000E-05   # G_Fermi
     3     1.17200002E-01   # alpha_s(M_Z)
     4     9.11699982E+01   # m_{Z}(pole)
     5     4.19999981E+00   # m_{b}(m_{b})
     6     1.72500000E+02   # m_{top}(pole)
     7     1.77699995E+00   # m_{tau}(pole)
Block MINPAR   # SUSY breaking input parameters
     1     2.50000000E+04   # Lambda scale of soft SSB
     2     2.50000000E+05   # M_mess overall messenger scale
     3     5.00000000E+00   # tan(beta)
     4     1.00000000E+00   # sign(mu)
     5     3.00000000E+00   # N_5 messenger index
     6     1.00000000E+00   # c_grav gravitino mass factor
    51     3.00000000E+00   # N5_1  U(1)_Y messenger index
    52     3.00000000E+00   # N5_2 SU(2)_L messenger index
    53     3.00000000E+00   # N5_3 SU(3)_C messenger index
   101     1.00000000E+00   # Rsl
   102     0.00000000E+00   # dmH_d^2
   103     0.00000000E+00   # dmH_u^2
   104     0.00000000E+00   # d_Y
Block MASS   # Scalar and gaugino mass spectrum
#  PDG code   mass                 particle
        24     8.04229965E+01   #  W^+
        25     1.01453499E+02   #  h^0            
        35     2.94136230E+02   #  H^0            
        36     2.89714142E+02   #  A^0            
        37     3.02288910E+02   #  H^+            
   1000001     5.86265747E+02   #  dnl            
   1000002     5.80834290E+02   #  upl            
   1000003     5.86265869E+02   #  stl            
   1000004     5.80835999E+02   #  chl            
   1000005     5.58641907E+02   #  b1             
   1000006     5.10015961E+02   #  t1             
   1000011     1.72268707E+02   #  el-            
   1000012     1.52368317E+02   #  nuel           
   1000013     1.72268738E+02   #  mul-           
   1000014     1.52368317E+02   #  numl           
   1000015     8.81372375E+01   #  tau1           
   1000016     1.50201416E+02   #  nutl           
   1000021     5.99444336E+02   #  glss           
   1000022     9.17102814E+01   #  z1ss           
   1000023     1.59714340E+02   #  z2ss           
   1000024     1.55911057E+02   #  w1ss           
   1000025    -2.44240875E+02   #  z3ss           
   1000035     2.93323029E+02   #  z4ss           
   1000037     2.90523041E+02   #  w2ss           
   1000039     1.50351642E-09   #  gvss
   2000001     5.62830017E+02   #  dnr            
   2000002     5.62854614E+02   #  upr            
   2000003     5.62830017E+02   #  str            
   2000004     5.62856384E+02   #  chr            
   2000005     5.65113770E+02   #  b2             
   2000006     5.97851440E+02   #  t2             
   2000011     8.69765167E+01   #  er-            
   2000013     8.69765854E+01   #  mur-           
   2000015     1.71314606E+02   #  tau2           
Block ALPHA   # Effective Higgs mixing parameter
         -2.43142739E-01   # alpha
Block STOPMIX   # stop mixing matrix
  1  1     4.66856152E-01   # O_{11}
  1  2     8.84333313E-01   # O_{12}
  2  1    -8.84333313E-01   # O_{21}
  2  2     4.66856152E-01   # O_{22}
Block SBOTMIX   # sbottom mixing matrix
  1  1     7.60983646E-01   # O_{11}
  1  2     6.48771048E-01   # O_{12}
  2  1    -6.48771048E-01   # O_{21}
  2  2     7.60983646E-01   # O_{22}
Block STAUMIX   # stau mixing matrix
  1  1     9.54402909E-02   # O_{11}
  1  2     9.95435178E-01   # O_{12}
  2  1    -9.95435178E-01   # O_{21}
  2  2     9.54402909E-02   # O_{22}
Block NMIX   # neutralino mixing matrix
  1  1    -9.40670907E-01   #
  1  2     1.45542175E-01   #
  1  3    -2.68970460E-01   #
  1  4     1.47005707E-01   #
  2  1     2.93253750E-01   #
  2  2     7.96786666E-01   #
  2  3    -4.17475134E-01   #
  2  4     3.23801756E-01   #
  3  1    -7.04572126E-02   #
  3  2     9.66885015E-02   #
  3  3     6.89271033E-01   #
  3  4     7.14557886E-01   #
  4  1    -1.55487150E-01   #
  4  2     5.78445971E-01   #
  4  3     5.27518213E-01   #
  4  4    -6.02452397E-01   #
Block UMIX   # chargino U mixing matrix
  1  1    -7.48850226E-01   # U_{11}
  1  2     6.62739217E-01   # U_{12}
  2  1    -6.62739217E-01   # U_{21}
  2  2    -7.48850226E-01   # U_{22}
Block VMIX   # chargino V mixing matrix
  1  1    -8.60148132E-01   # V_{11}
  1  2     5.10044277E-01   # V_{12}
  2  1    -5.10044277E-01   # V_{21}
  2  2    -8.60148132E-01   # V_{22}
Block GAUGE Q=  5.11097137E+02   #
     1     3.57524991E-01   # g`
     2     6.52378619E-01   # g_2
     3     1.21928000E+00   # g_3
Block YU Q=  5.11097137E+02   #
  3  3     9.01413202E-01   # y_t
Block YD Q=  5.11097137E+02   #
  3  3     7.16280341E-02   # y_b
Block YE Q=  5.11097137E+02   #
  3  3     5.10010719E-02   # y_tau
Block HMIX Q=  5.11097137E+02   # Higgs mixing parameters
     1     2.37370331E+02   # mu(Q)
     2     5.00000000E+00   # tan(beta)(M_GUT)
     3     2.49507874E+02   # Higgs vev at Q
     4     8.39342813E+04   # m_A^2(Q)
Block MSOFT Q=  5.11097137E+02   # DRbar SUSY breaking parameters
     1     1.02717331E+02   # M_1(Q)          
     2     1.96108017E+02   # M_2(Q)          
     3     5.60145447E+02   # M_3(Q)          
    31     1.65121658E+02   # MeL(Q)          
    32     1.65121658E+02   # MmuL(Q)         
    33     1.63155792E+02   # MtauL(Q)        
    34     7.69838181E+01   # MeR(Q)          
    35     7.69838181E+01   # MmuR(Q)         
    36     7.63667603E+01   # MtauR(Q)        
    41     5.54572693E+02   # MqL1(Q)         
    42     5.54572693E+02   # MqL2(Q)         
    43     5.34177002E+02   # MqL3(Q)         
    44     5.35787537E+02   # MuR(Q)          
    45     5.35787537E+02   # McR(Q)          
    46     4.89014465E+02   # MtR(Q)          
    47     5.34099915E+02   # MdR(Q)          
    48     5.34099915E+02   # MsR(Q)          
    49     5.34794128E+02   # MbR(Q)          
Block AU Q=  5.11097137E+02   #
  1  1    -2.03765945E+02   # A_u
  2  2    -2.03765945E+02   # A_c
  3  3    -2.03765945E+02   # A_t
Block AD Q=  5.11097137E+02   #
  1  1    -2.35456299E+02   # A_d
  2  2    -2.35456299E+02   # A_s
  3  3    -2.35456299E+02   # A_b
Block AE Q=  5.11097137E+02   #
  1  1    -2.33234921E+01   # A_e
  2  2    -2.33234921E+01   # A_mu
  3  3    -2.33234921E+01   # A_tau
#  ISAJET decay tables in SUSY Les Houches accord format
#  Created by ISALHD. Last revision: C. Balazs, 2005 May 25
Block DCINFO                           # Program information
     1   ISASUGRA from ISAJET          # Spectrum Calculator
     2   7.80   29-OCT-2009 12:50:36   # Version number
#         PDG         Width
DECAY         6  1.14680779E+00   # TP    decays
#          BR          NDA       ID1       ID2       ID3       ID4
      3.33333343E-01    3            2        -1         5             # TP     -->  UP     DB     BT          
      3.33333343E-01    3            4        -3         5             # TP     -->  CH     SB     BT          
      1.11111112E-01    3          -11        12         5             # TP     -->  E+     NUE    BT          
      1.11111112E-01    3          -13        14         5             # TP     -->  MU+    NUM    BT          
      1.11111112E-01    3          -15        16         5             # TP     -->  TAU+   NUT    BT          
#         PDG         Width
DECAY   1000021  1.40860569E+00   # GLSS  decays
#          BR          NDA       ID1       ID2       ID3       ID4
      4.86189499E-04    3      1000024         5        -6             # GLSS   -->  W1SS+  BT     TB          
      4.86189499E-04    3     -1000024         6        -5             # GLSS   -->  W1SS-  TP     BB          
      4.64630313E-04    3      1000037         5        -6             # GLSS   -->  W2SS+  BT     TB          
      4.64630313E-04    3     -1000037         6        -5             # GLSS   -->  W2SS-  TP     BB          
      7.76753768E-06    2      1000022        21                       # GLSS   -->  Z1SS   GL                 
      2.89393967E-04    3      1000022         6        -6             # GLSS   -->  Z1SS   TP     TB          
      7.75039298E-05    2      1000023        21                       # GLSS   -->  Z2SS   GL                 
      3.01222492E-04    3      1000023         6        -6             # GLSS   -->  Z2SS   TP     TB          
      3.00644955E-04    2      1000025        21                       # GLSS   -->  Z3SS   GL                 
      3.26358099E-06    3      1000025         6        -6             # GLSS   -->  Z3SS   TP     TB          
      2.08113983E-04    2      1000035        21                       # GLSS   -->  Z4SS   GL                 
      1.93225350E-02    2     -1000002         2                       # GLSS   -->  UBL    UP                 
      1.93225350E-02    2      1000002        -2                       # GLSS   -->  UPL    UB                 
      9.77901183E-03    2     -1000001         1                       # GLSS   -->  DBL    DN                 
      9.77901183E-03    2      1000001        -1                       # GLSS   -->  DNL    DB                 
      7.24359825E-02    2     -2000002         2                       # GLSS   -->  UBR    UP                 
      7.24359825E-02    2      2000002        -2                       # GLSS   -->  UPR    UB                 
      7.25303516E-02    2     -2000001         1                       # GLSS   -->  DBR    DN                 
      7.25303516E-02    2      2000001        -1                       # GLSS   -->  DNR    DB                 
      9.77776293E-03    2     -1000003         3                       # GLSS   -->  SBL    ST                 
      9.77776293E-03    2      1000003        -3                       # GLSS   -->  STL    SB                 
      7.25293458E-02    2     -2000003         3                       # GLSS   -->  SBR    ST                 
      7.25293458E-02    2      2000003        -3                       # GLSS   -->  STR    SB                 
      1.92697290E-02    2     -1000004         4                       # GLSS   -->  CBL    CH                 
      1.92697290E-02    2      1000004        -4                       # GLSS   -->  CHL    CB                 
      7.23829642E-02    2     -2000004         4                       # GLSS   -->  CBR    CH                 
      7.23829642E-02    2      2000004        -4                       # GLSS   -->  CHR    CB                 
      7.76793808E-02    2     -1000005         5                       # GLSS   -->  BB1    BT                 
      7.76793808E-02    2      1000005        -5                       # GLSS   -->  BT1    BB                 
      7.27481917E-02    2     -2000005         5                       # GLSS   -->  BB2    BT                 
      7.27481917E-02    2      2000005        -5                       # GLSS   -->  BT2    BB                 
      2.79849726E-08    2      1000039        21                       # GLSS   -->  GVSS   GL                 
#         PDG         Width
DECAY   1000002  5.76534700E+00   # UPL   decays
#          BR          NDA       ID1       ID2       ID3       ID4
      2.89486226E-04    2      1000022         2                       # UPL    -->  Z1SS   UP                 
      2.62126207E-01    2      1000023         2                       # UPL    -->  Z2SS   UP                 
      2.01702560E-03    2      1000025         2                       # UPL    -->  Z3SS   UP                 
      7.11836740E-02    2      1000035         2                       # UPL    -->  Z4SS   UP                 
      5.40333867E-01    2      1000024         1                       # UPL    -->  W1SS+  DN                 
      1.24049760E-01    2      1000037         1                       # UPL    -->  W2SS+  DN                 
#         PDG         Width
DECAY   1000001  5.56021643E+00   # DNL   decays
#          BR          NDA       ID1       ID2       ID3       ID4
      4.26796712E-02    2      1000022         1                       # DNL    -->  Z1SS   DN                 
      2.10030526E-01    2      1000023         1                       # DNL    -->  Z2SS   DN                 
      3.64111015E-03    2      1000025         1                       # DNL    -->  Z3SS   DN                 
      9.18844789E-02    2      1000035         1                       # DNL    -->  Z4SS   DN                 
      4.29857612E-01    2     -1000024         2                       # DNL    -->  W1SS-  UP                 
      2.21906587E-01    2     -1000037         2                       # DNL    -->  W2SS-  UP                 
#         PDG         Width
DECAY   1000003  5.56016636E+00   # STL   decays
#          BR          NDA       ID1       ID2       ID3       ID4
      4.26800698E-02    2      1000022         3                       # STL    -->  Z1SS   ST                 
      2.10032493E-01    2      1000023         3                       # STL    -->  Z2SS   ST                 
      3.64114414E-03    2      1000025         3                       # STL    -->  Z3SS   ST                 
      9.18853581E-02    2      1000035         3                       # STL    -->  Z4SS   ST                 
      4.29856300E-01    2     -1000024         4                       # STL    -->  W1SS-  CH                 
      2.21904591E-01    2     -1000037         4                       # STL    -->  W2SS-  CH                 
#         PDG         Width
DECAY   1000004  5.76534605E+00   # CHL   decays
#          BR          NDA       ID1       ID2       ID3       ID4
      2.89483898E-04    2      1000022         4                       # CHL    -->  Z1SS   CH                 
      2.62123913E-01    2      1000023         4                       # CHL    -->  Z2SS   CH                 
      2.01700511E-03    2      1000025         4                       # CHL    -->  Z3SS   CH                 
      7.11828023E-02    2      1000035         4                       # CHL    -->  Z4SS   CH                 
      5.40336072E-01    2      1000024         3                       # CHL    -->  W1SS+  ST                 
      1.24050662E-01    2      1000037         3                       # CHL    -->  W2SS+  ST                 
#         PDG         Width
DECAY   1000005  5.20378113E+00   # BT1   decays
#          BR          NDA       ID1       ID2       ID3       ID4
      5.88848740E-02    2      1000022         5                       # BT1    -->  Z1SS   BT                 
      1.41101897E-01    2      1000023         5                       # BT1    -->  Z2SS   BT                 
      1.33038801E-03    2      1000025         5                       # BT1    -->  Z3SS   BT                 
      3.96615714E-02    2      1000035         5                       # BT1    -->  Z4SS   BT                 
      3.17701072E-01    2     -1000024         6                       # BT1    -->  W1SS-  TP                 
      4.41320121E-01    2     -1000037         6                       # BT1    -->  W2SS-  TP                 
#         PDG         Width
DECAY   1000006  9.36463165E+00   # TP1   decays
#          BR          NDA       ID1       ID2       ID3       ID4
      9.20309797E-02    2      1000022         6                       # TP1    -->  Z1SS   TP                 
      1.17824234E-01    2      1000023         6                       # TP1    -->  Z2SS   TP                 
      2.50455230E-01    2      1000025         6                       # TP1    -->  Z3SS   TP                 
      1.57177895E-02    2      1000035         6                       # TP1    -->  Z4SS   TP                 
      3.90020758E-01    2      1000024         5                       # TP1    -->  W1SS+  BT                 
      1.33950964E-01    2      1000037         5                       # TP1    -->  W2SS+  BT                 
#         PDG         Width
DECAY   2000002  1.17987466E+00   # UPR   decays
#          BR          NDA       ID1       ID2       ID3       ID4
      9.04233336E-01    2      1000022         2                       # UPR    -->  Z1SS   UP                 
      7.84060806E-02    2      1000023         2                       # UPR    -->  Z2SS   UP                 
      3.52712953E-03    2      1000025         2                       # UPR    -->  Z3SS   UP                 
      1.38333654E-02    2      1000035         2                       # UPR    -->  Z4SS   UP                 
#         PDG         Width
DECAY   2000001  2.94953793E-01   # DNR   decays
#          BR          NDA       ID1       ID2       ID3       ID4
      9.04235005E-01    2      1000022         1                       # DNR    -->  Z1SS   DN                 
      7.84054175E-02    2      1000023         1                       # DNR    -->  Z2SS   DN                 
      3.52701009E-03    2      1000025         1                       # DNR    -->  Z3SS   DN                 
      1.38325561E-02    2      1000035         1                       # DNR    -->  Z4SS   DN                 
#         PDG         Width
DECAY   2000003  2.94953793E-01   # STR   decays
#          BR          NDA       ID1       ID2       ID3       ID4
      9.04235005E-01    2      1000022         3                       # STR    -->  Z1SS   ST                 
      7.84054175E-02    2      1000023         3                       # STR    -->  Z2SS   ST                 
      3.52701009E-03    2      1000025         3                       # STR    -->  Z3SS   ST                 
      1.38325561E-02    2      1000035         3                       # STR    -->  Z4SS   ST                 
#         PDG         Width
DECAY   2000004  1.17986405E+00   # CHR   decays
#          BR          NDA       ID1       ID2       ID3       ID4
      9.04233575E-01    2      1000022         4                       # CHR    -->  Z1SS   CH                 
      7.84060508E-02    2      1000023         4                       # CHR    -->  Z2SS   CH                 
      3.52712092E-03    2      1000025         4                       # CHR    -->  Z3SS   CH                 
      1.38332956E-02    2      1000035         4                       # CHR    -->  Z4SS   CH                 
#         PDG         Width
DECAY   2000005  3.96383238E+00   # BT2   decays
#          BR          NDA       ID1       ID2       ID3       ID4
      4.87025082E-02    2      1000022         5                       # BT2    -->  Z1SS   BT                 
      1.02365352E-01    2      1000023         5                       # BT2    -->  Z2SS   BT                 
      1.25095043E-02    2      1000025         5                       # BT2    -->  Z3SS   BT                 
      7.02878311E-02    2      1000035         5                       # BT2    -->  Z4SS   BT                 
      2.51282632E-01    2     -1000024         6                       # BT2    -->  W1SS-  TP                 
      5.14852166E-01    2     -1000037         6                       # BT2    -->  W2SS-  TP                 
#         PDG         Width
DECAY   2000006  9.86998558E+00   # TP2   decays
#          BR          NDA       ID1       ID2       ID3       ID4
      8.58372152E-02    2      1000024         5                       # TP2    -->  W1SS+  BT                 
      2.99019039E-01    2      1000037         5                       # TP2    -->  W2SS+  BT                 
      5.50979469E-03    2      1000022         6                       # TP2    -->  Z1SS   TP                 
      9.47264880E-02    2      1000023         6                       # TP2    -->  Z2SS   TP                 
      1.80408239E-01    2      1000025         6                       # TP2    -->  Z3SS   TP                 
      3.34499151E-01    2      1000035         6                       # TP2    -->  Z4SS   TP                 
#         PDG         Width
DECAY   1000011  9.11184475E-02   # EL-   decays
#          BR          NDA       ID1       ID2       ID3       ID4
      5.63891590E-01    2      1000022        11                       # EL-    -->  Z1SS   E-                 
      1.44048125E-01    2      1000023        11                       # EL-    -->  Z2SS   E-                 
      2.92059928E-01    2     -1000024        12                       # EL-    -->  W1SS-  NUE                
      3.53884161E-07    3      1000015        11       -15             # EL-    -->  TAU1-  E-     TAU+        
      9.56325579E-08    3     -1000015        11        15             # EL-    -->  TAU1+  E-     TAU-        
      8.47999726E-10    2           11   1000039                       # EL-    -->  E-     GVSS               
#         PDG         Width
DECAY   1000013  9.11180526E-02   # MUL-  decays
#          BR          NDA       ID1       ID2       ID3       ID4
      5.63893437E-01    2      1000022        13                       # MUL-   -->  Z1SS   MU-                
      1.44043922E-01    2      1000023        13                       # MUL-   -->  Z2SS   MU-                
      2.92062223E-01    2     -1000024        14                       # MUL-   -->  W1SS-  NUM                
      3.53886236E-07    3      1000015        13       -15             # MUL-   -->  TAU1-  MU-    TAU+        
      9.56331334E-08    3     -1000015        13        15             # MUL-   -->  TAU1+  MU-    TAU-        
      8.48002835E-10    2           13   1000039                       # MUL-   -->  MU-    GVSS               
#         PDG         Width
DECAY   1000015  2.70433784E-12   # TAU1- decays
#          BR          NDA       ID1       ID2       ID3       ID4
      1.00000000E+00    2           15   1000039                       # TAU1-  -->  TAU-   GVSS               
#         PDG         Width
DECAY   1000012  1.14503868E-01   # NUEL  decays
#          BR          NDA       ID1       ID2       ID3       ID4
      9.99971390E-01    2      1000022        12                       # NUEL   -->  Z1SS   NUE                
      9.09674964E-06    3      1000015        12       -15             # NUEL   -->  TAU1-  NUE    TAU+        
      7.42711791E-06    3     -1000015        12        15             # NUEL   -->  TAU1+  NUE    TAU-        
      1.21132343E-05    3     -1000015        11        16             # NUEL   -->  TAU1+  E-     NUT         
      3.65277780E-10    2           12   1000039                       # NUEL   -->  NUE    GVSS               
#         PDG         Width
DECAY   1000014  1.14503868E-01   # NUML  decays
#          BR          NDA       ID1       ID2       ID3       ID4
      9.99971390E-01    2      1000022        14                       # NUML   -->  Z1SS   NUM                
      9.09674964E-06    3      1000015        14       -15             # NUML   -->  TAU1-  NUM    TAU+        
      7.42711791E-06    3     -1000015        14        15             # NUML   -->  TAU1+  NUM    TAU-        
      1.21133735E-05    3     -1000015        13        16             # NUML   -->  TAU1+  MU-    NUT         
      3.65277780E-10    2           14   1000039                       # NUML   -->  NUM    GVSS               
#         PDG         Width
DECAY   1000016  1.09194085E-01   # NUTL  decays
#          BR          NDA       ID1       ID2       ID3       ID4
      9.99834895E-01    2      1000022        16                       # NUTL   -->  Z1SS   NUT                
      7.46870955E-06    3     -1000015        16        15             # NUTL   -->  TAU1+  NUT    TAU-        
      2.28287372E-05    3      1000015        16       -15             # NUTL   -->  TAU1-  NUT    TAU+        
      1.68554579E-05    3      1000015        12       -11             # NUTL   -->  TAU1-  NUE    E+          
      1.68554579E-05    3      1000015        14       -13             # NUTL   -->  TAU1-  NUM    MU+         
      5.05663702E-05    3      1000015         2        -1             # NUTL   -->  TAU1-  UP     DB          
      5.05663702E-05    3      1000015         4        -3             # NUTL   -->  TAU1-  CH     SB          
      3.56566943E-10    2           16   1000039                       # NUTL   -->  NUT    GVSS               
#         PDG         Width
DECAY   2000011  2.53501256E-12   # ER-   decays
#          BR          NDA       ID1       ID2       ID3       ID4
      1.00000000E+00    2           11   1000039                       # ER-    -->  E-     GVSS               
#         PDG         Width
DECAY   2000013  2.53500736E-12   # MUR-  decays
#          BR          NDA       ID1       ID2       ID3       ID4
      1.00000000E+00    2           13   1000039                       # MUR-   -->  MU-    GVSS               
#         PDG         Width
DECAY   2000015  8.64930078E-02   # TAU2- decays
#          BR          NDA       ID1       ID2       ID3       ID4
      6.05644405E-01    2      1000022        15                       # TAU2-  -->  Z1SS   TAU-               
      1.24731705E-01    2      1000023        15                       # TAU2-  -->  Z2SS   TAU-               
      2.69623935E-01    2     -1000024        16                       # TAU2-  -->  W1SS-  NUT                
#         PDG         Width
DECAY   1000022  1.04301833E-02   # Z1SS  decays
#          BR          NDA       ID1       ID2       ID3       ID4
      2.00122565E-01    2      2000011       -11                       # Z1SS   -->  ER-    E+                 
      2.00122565E-01    2     -2000011        11                       # Z1SS   -->  ER+    E-                 
      2.00070381E-01    2      2000013       -13                       # Z1SS   -->  MUR-   MU+                
      2.00070381E-01    2     -2000013        13                       # Z1SS   -->  MUR+   MU-                
      9.98070538E-02    2      1000015       -15                       # Z1SS   -->  TAU1-  TAU+               
      9.98070538E-02    2     -1000015        15                       # Z1SS   -->  TAU1+  TAU-               
      1.80223225E-10    2      1000039        22                       # Z1SS   -->  GVSS   GM                 
      3.61464114E-12    3      1000039        11       -11             # Z1SS   -->  GVSS   E-     E+          
      2.15106333E-18    2      1000039        23                       # Z1SS   -->  GVSS   Z0                 
#         PDG         Width
DECAY   1000023  1.15020916E-01   # Z2SS  decays
#          BR          NDA       ID1       ID2       ID3       ID4
      1.85656546E-07    2      1000022        22                       # Z2SS   -->  Z1SS   GM                 
      7.32442329E-09    3     -1000024         2        -1             # Z2SS   -->  W1SS-  UP     DB          
      2.44147436E-09    3     -1000024        12       -11             # Z2SS   -->  W1SS-  NUE    E+          
      2.44147436E-09    3     -1000024        14       -13             # Z2SS   -->  W1SS-  NUM    MU+         
      7.32442329E-09    3      1000024         1        -2             # Z2SS   -->  W1SS+  DN     UB          
      2.44147436E-09    3      1000024        11       -12             # Z2SS   -->  W1SS+  E-     ANUE        
      2.44147436E-09    3      1000024        13       -14             # Z2SS   -->  W1SS+  MU-    ANUM        
      7.32442329E-09    3     -1000024         4        -3             # Z2SS   -->  W1SS-  CH     SB          
      2.44147436E-09    3     -1000024        16       -15             # Z2SS   -->  W1SS-  NUT    TAU+        
      7.32442329E-09    3      1000024         3        -4             # Z2SS   -->  W1SS+  ST     CB          
      2.44147436E-09    3      1000024        15       -16             # Z2SS   -->  W1SS+  TAU-   ANUT        
      2.02850370E-05    3      1000022         2        -2             # Z2SS   -->  Z1SS   UP     UB          
      2.76882747E-05    3      1000022         1        -1             # Z2SS   -->  Z1SS   DN     DB          
      2.76882729E-05    3      1000022         3        -3             # Z2SS   -->  Z1SS   ST     SB          
      2.02850297E-05    3      1000022         4        -4             # Z2SS   -->  Z1SS   CH     CB          
      2.76328610E-05    3      1000022         5        -5             # Z2SS   -->  Z1SS   BT     BB          
      2.67640826E-05    3      1000022        11       -11             # Z2SS   -->  Z1SS   E-     E+          
      2.67640207E-05    3      1000022        13       -13             # Z2SS   -->  Z1SS   MU-    MU+         
      2.82920464E-05    3      1000022        15       -15             # Z2SS   -->  Z1SS   TAU-   TAU+        
      1.12533489E-05    3      1000022        12       -12             # Z2SS   -->  Z1SS   NUE    ANUE        
      1.12533489E-05    3      1000022        14       -14             # Z2SS   -->  Z1SS   NUM    ANUM        
      1.12533489E-05    3      1000022        16       -16             # Z2SS   -->  Z1SS   NUT    ANUT        
      1.50270626E-01    2      2000011       -11                       # Z2SS   -->  ER-    E+                 
      1.50270626E-01    2     -2000011        11                       # Z2SS   -->  ER+    E-                 
      1.50270343E-01    2      2000013       -13                       # Z2SS   -->  MUR-   MU+                
      1.50270343E-01    2     -2000013        13                       # Z2SS   -->  MUR+   MU-                
      1.64494649E-01    2      1000015       -15                       # Z2SS   -->  TAU1-  TAU+               
      1.64494649E-01    2     -1000015        15                       # Z2SS   -->  TAU1+  TAU-               
      9.53666214E-03    2      1000012       -12                       # Z2SS   -->  NUEL   ANUE               
      9.53666214E-03    2     -1000012        12                       # Z2SS   -->  ANUEL  NUE                
      9.53666214E-03    2      1000014       -14                       # Z2SS   -->  NUML   ANUM               
      9.53666214E-03    2     -1000014        14                       # Z2SS   -->  ANUML  NUM                
      1.57713164E-02    2      1000016       -16                       # Z2SS   -->  NUTL   ANUT               
      1.57713164E-02    2     -1000016        16                       # Z2SS   -->  ANUTL  NUT                
      1.88941723E-10    2      1000039        22                       # Z2SS   -->  GVSS   GM                 
      3.96327372E-12    3      1000039        11       -11             # Z2SS   -->  GVSS   E-     E+          
      3.70710650E-11    2      1000039        23                       # Z2SS   -->  GVSS   Z0                 
      1.33108325E-12    2      1000039        25                       # Z2SS   -->  GVSS   HL0                
#         PDG         Width
DECAY   1000025  2.69376904E-01   # Z3SS  decays
#          BR          NDA       ID1       ID2       ID3       ID4
      3.23533243E-07    2      1000022        22                       # Z3SS   -->  Z1SS   GM                 
      1.12112957E-06    2      1000023        22                       # Z3SS   -->  Z2SS   GM                 
      1.26726925E-01    2      1000024       -24                       # Z3SS   -->  W1SS+  W-                 
      1.26726925E-01    2     -1000024        24                       # Z3SS   -->  W1SS-  W+                 
      5.42522371E-01    2      1000022        23                       # Z3SS   -->  Z1SS   Z0                 
      1.54629074E-08    3      1000022         2        -2             # Z3SS   -->  Z1SS   UP     UB          
      1.32694025E-08    3      1000022         1        -1             # Z3SS   -->  Z1SS   DN     DB          
      1.32693900E-08    3      1000022         3        -3             # Z3SS   -->  Z1SS   ST     SB          
      1.54626889E-08    3      1000022         4        -4             # Z3SS   -->  Z1SS   CH     CB          
      1.18213813E-06    3      1000022         5        -5             # Z3SS   -->  Z1SS   BT     BB          
      1.49558076E-07    3      1000022        15       -15             # Z3SS   -->  Z1SS   TAU-   TAU+        
      7.56695459E-04    3      1000023         2        -2             # Z3SS   -->  Z2SS   UP     UB          
      9.67388740E-04    3      1000023         1        -1             # Z3SS   -->  Z2SS   DN     DB          
      9.67388740E-04    3      1000023         3        -3             # Z3SS   -->  Z2SS   ST     SB          
      7.56695401E-04    3      1000023         4        -4             # Z3SS   -->  Z2SS   CH     CB          
      9.60839796E-04    3      1000023         5        -5             # Z3SS   -->  Z2SS   BT     BB          
      2.20462302E-04    3      1000023        11       -11             # Z3SS   -->  Z2SS   E-     E+          
      2.20462302E-04    3      1000023        13       -13             # Z3SS   -->  Z2SS   MU-    MU+         
      2.20086367E-04    3      1000023        15       -15             # Z3SS   -->  Z2SS   TAU-   TAU+        
      4.38650692E-04    3      1000023        12       -12             # Z3SS   -->  Z2SS   NUE    ANUE        
      4.38650692E-04    3      1000023        14       -14             # Z3SS   -->  Z2SS   NUM    ANUM        
      4.38650692E-04    3      1000023        16       -16             # Z3SS   -->  Z2SS   NUT    ANUT        
      3.61915268E-02    2      1000022        25                       # Z3SS   -->  Z1SS   HL0                
      1.61904376E-03    2      1000011       -11                       # Z3SS   -->  EL-    E+                 
      1.61904376E-03    2     -1000011        11                       # Z3SS   -->  EL+    E-                 
      1.61904178E-03    2      1000013       -13                       # Z3SS   -->  MUL-   MU+                
      1.61904178E-03    2     -1000013        13                       # Z3SS   -->  MUL+   MU-                
      8.72752629E-03    2      2000011       -11                       # Z3SS   -->  ER-    E+                 
      8.72752629E-03    2     -2000011        11                       # Z3SS   -->  ER+    E-                 
      8.72752164E-03    2      2000013       -13                       # Z3SS   -->  MUR-   MU+                
      8.72752164E-03    2     -2000013        13                       # Z3SS   -->  MUR+   MU-                
      1.46377720E-02    2      1000015       -15                       # Z3SS   -->  TAU1-  TAU+               
      1.46377720E-02    2     -1000015        15                       # Z3SS   -->  TAU1+  TAU-               
      5.75096579E-03    2      2000015       -15                       # Z3SS   -->  TAU2-  TAU+               
      5.75096579E-03    2     -2000015        15                       # Z3SS   -->  TAU2+  TAU-               
      1.30552826E-02    2      1000012       -12                       # Z3SS   -->  NUEL   ANUE               
      1.30552826E-02    2     -1000012        12                       # Z3SS   -->  ANUEL  NUE                
      1.30552826E-02    2      1000014       -14                       # Z3SS   -->  NUML   ANUM               
      1.30552826E-02    2     -1000014        14                       # Z3SS   -->  ANUML  NUM                
      1.35293324E-02    2      1000016       -16                       # Z3SS   -->  NUTL   ANUT               
      1.35293324E-02    2     -1000016        16                       # Z3SS   -->  ANUTL  NUT                
      3.78369889E-13    2      1000039        22                       # Z3SS   -->  GVSS   GM                 
      8.20320239E-15    3      1000039        11       -11             # Z3SS   -->  GVSS   E-     E+          
      1.56867727E-10    2      1000039        23                       # Z3SS   -->  GVSS   Z0                 
      2.84530982E-10    2      1000039        25                       # Z3SS   -->  GVSS   HL0                
#         PDG         Width
DECAY   1000035  2.28745914E+00   # Z4SS  decays
#          BR          NDA       ID1       ID2       ID3       ID4
      1.02036619E-08    2      1000022        22                       # Z4SS   -->  Z1SS   GM                 
      3.74076023E-08    2      1000023        22                       # Z4SS   -->  Z2SS   GM                 
      1.01937943E-07    2      1000025        22                       # Z4SS   -->  Z3SS   GM                 
      1.76201329E-01    2      1000024       -24                       # Z4SS   -->  W1SS+  W-                 
      1.76201329E-01    2     -1000024        24                       # Z4SS   -->  W1SS-  W+                 
      5.65242055E-11    3     -1000037         2        -1             # Z4SS   -->  W2SS-  UP     DB          
      1.88414024E-11    3     -1000037        12       -11             # Z4SS   -->  W2SS-  NUE    E+          
      1.88414024E-11    3     -1000037        14       -13             # Z4SS   -->  W2SS-  NUM    MU+         
      5.65242055E-11    3      1000037         1        -2             # Z4SS   -->  W2SS+  DN     UB          
      1.88414024E-11    3      1000037        11       -12             # Z4SS   -->  W2SS+  E-     ANUE        
      1.88414024E-11    3      1000037        13       -14             # Z4SS   -->  W2SS+  MU-    ANUM        
      5.65242055E-11    3     -1000037         4        -3             # Z4SS   -->  W2SS-  CH     SB          
      1.88414024E-11    3     -1000037        16       -15             # Z4SS   -->  W2SS-  NUT    TAU+        
      5.65242055E-11    3      1000037         3        -4             # Z4SS   -->  W2SS+  ST     CB          
      1.88414024E-11    3      1000037        15       -16             # Z4SS   -->  W2SS+  TAU-   ANUT        
      8.75467062E-03    2      1000022        23                       # Z4SS   -->  Z1SS   Z0                 
      1.06306060E-03    2      1000023        23                       # Z4SS   -->  Z2SS   Z0                 
      7.58677601E-08    3      1000022         2        -2             # Z4SS   -->  Z1SS   UP     UB          
      3.73030190E-07    3      1000022         1        -1             # Z4SS   -->  Z1SS   DN     DB          
      3.73029849E-07    3      1000022         3        -3             # Z4SS   -->  Z1SS   ST     SB          
      7.58666729E-08    3      1000022         4        -4             # Z4SS   -->  Z1SS   CH     CB          
      5.08047151E-07    3      1000022         5        -5             # Z4SS   -->  Z1SS   BT     BB          
      9.22442478E-09    3      1000022        15       -15             # Z4SS   -->  Z1SS   TAU-   TAU+        
      5.91421497E-07    3      1000023         2        -2             # Z4SS   -->  Z2SS   UP     UB          
      5.24479276E-07    3      1000023         1        -1             # Z4SS   -->  Z2SS   DN     DB          
      5.24478708E-07    3      1000023         3        -3             # Z4SS   -->  Z2SS   ST     SB          
      5.91413254E-07    3      1000023         4        -4             # Z4SS   -->  Z2SS   CH     CB          
      6.38857671E-07    3      1000023         5        -5             # Z4SS   -->  Z2SS   BT     BB          
      5.71302346E-11    3      1000023        15       -15             # Z4SS   -->  Z2SS   TAU-   TAU+        
      9.24114374E-06    3      1000025         2        -2             # Z4SS   -->  Z3SS   UP     UB          
      1.20048599E-05    3      1000025         1        -1             # Z4SS   -->  Z3SS   DN     DB          
      1.20048599E-05    3      1000025         3        -3             # Z4SS   -->  Z3SS   ST     SB          
      9.24114374E-06    3      1000025         4        -4             # Z4SS   -->  Z3SS   CH     CB          
      1.07610158E-05    3      1000025         5        -5             # Z4SS   -->  Z3SS   BT     BB          
      2.71209137E-06    3      1000025        11       -11             # Z4SS   -->  Z3SS   E-     E+          
      2.71209137E-06    3      1000025        13       -13             # Z4SS   -->  Z3SS   MU-    MU+         
      2.66203051E-06    3      1000025        15       -15             # Z4SS   -->  Z3SS   TAU-   TAU+        
      5.39620896E-06    3      1000025        12       -12             # Z4SS   -->  Z3SS   NUE    ANUE        
      5.39620896E-06    3      1000025        14       -14             # Z4SS   -->  Z3SS   NUM    ANUM        
      5.39620896E-06    3      1000025        16       -16             # Z4SS   -->  Z3SS   NUT    ANUT        
      3.62753421E-02    2      1000022        25                       # Z4SS   -->  Z1SS   HL0                
      8.54800921E-03    2      1000023        25                       # Z4SS   -->  Z2SS   HL0                
      2.81470120E-02    2      1000011       -11                       # Z4SS   -->  EL-    E+                 
      2.81470120E-02    2     -1000011        11                       # Z4SS   -->  EL+    E-                 
      2.81469952E-02    2      1000013       -13                       # Z4SS   -->  MUL-   MU+                
      2.81469952E-02    2     -1000013        13                       # Z4SS   -->  MUL+   MU-                
      6.55861152E-03    2      2000011       -11                       # Z4SS   -->  ER-    E+                 
      6.55861152E-03    2     -2000011        11                       # Z4SS   -->  ER+    E-                 
      6.55860780E-03    2      2000013       -13                       # Z4SS   -->  MUR-   MU+                
      6.55860780E-03    2     -2000013        13                       # Z4SS   -->  MUR+   MU-                
      6.06273068E-03    2      1000015       -15                       # Z4SS   -->  TAU1-  TAU+               
      6.06273068E-03    2     -1000015        15                       # Z4SS   -->  TAU1+  TAU-               
      2.93710064E-02    2      2000015       -15                       # Z4SS   -->  TAU2-  TAU+               
      2.93710064E-02    2     -2000015        15                       # Z4SS   -->  TAU2+  TAU-               
      6.34205118E-02    2      1000012       -12                       # Z4SS   -->  NUEL   ANUE               
      6.34205118E-02    2     -1000012        12                       # Z4SS   -->  ANUEL  NUE                
      6.34205118E-02    2      1000014       -14                       # Z4SS   -->  NUML   ANUM               
      6.34205118E-02    2     -1000014        14                       # Z4SS   -->  ANUML  NUM                
      6.47511855E-02    2      1000016       -16                       # Z4SS   -->  NUTL   ANUT               
      6.47511855E-02    2     -1000016        16                       # Z4SS   -->  ANUTL  NUT                
      9.79690547E-12    2      1000039        22                       # Z4SS   -->  GVSS   GM                 
      2.15374837E-13    3      1000039        11       -11             # Z4SS   -->  GVSS   E-     E+          
      1.86589313E-10    2      1000039        23                       # Z4SS   -->  GVSS   Z0                 
      3.04225672E-11    2      1000039        25                       # Z4SS   -->  GVSS   HL0                
      1.37734506E-17    2      1000039        36                       # Z4SS   -->  GVSS   HA0                
#         PDG         Width
DECAY   1000024  9.31684207E-03   # W1SS+ decays
#          BR          NDA       ID1       ID2       ID3       ID4
      8.12281296E-03    3      1000022         2        -1             # W1SS+  -->  Z1SS   UP     DB          
      8.12281296E-03    3      1000022         4        -3             # W1SS+  -->  Z1SS   CH     SB          
      1.92175724E-03    3      1000022       -11        12             # W1SS+  -->  Z1SS   E+     NUE         
      1.92175771E-03    3      1000022       -13        14             # W1SS+  -->  Z1SS   MU+    NUM         
      1.91629317E-03    3      1000022       -15        16             # W1SS+  -->  Z1SS   TAU+   NUT         
      1.05202734E-01    2      1000012       -11                       # W1SS+  -->  NUEL   E+                 
      1.05157591E-01    2      1000014       -13                       # W1SS+  -->  NUML   MU+                
      2.67394513E-01    2      1000016       -15                       # W1SS+  -->  NUTL   TAU+               
      5.00239730E-01    2     -1000015        16                       # W1SS+  -->  TAU1+  NUT                
#         PDG         Width
DECAY   1000037  1.94042861E+00   # W2SS+ decays
#          BR          NDA       ID1       ID2       ID3       ID4
      3.75157043E-07    3      1000022         2        -1             # W2SS+  -->  Z1SS   UP     DB          
      3.75156645E-07    3      1000022         4        -3             # W2SS+  -->  Z1SS   CH     SB          
      2.30207090E-10    3      1000022       -15        16             # W2SS+  -->  Z1SS   TAU+   NUT         
      1.23604927E-02    2      1000022        24                       # W2SS+  -->  Z1SS   W+                 
      4.56186967E-07    3      1000023         2        -1             # W2SS+  -->  Z2SS   UP     DB          
      4.56184097E-07    3      1000023         4        -3             # W2SS+  -->  Z2SS   CH     SB          
      3.91429573E-08    3      1000023       -15        16             # W2SS+  -->  Z2SS   TAU+   NUT         
      2.08872691E-01    2      1000023        24                       # W2SS+  -->  Z2SS   W+                 
      3.08348281E-05    3      1000025         2        -1             # W2SS+  -->  Z3SS   UP     DB          
      3.08348281E-05    3      1000025         4        -3             # W2SS+  -->  Z3SS   CH     SB          
      1.02652193E-05    3      1000025       -11        12             # W2SS+  -->  Z3SS   E+     NUE         
      1.02652193E-05    3      1000025       -13        14             # W2SS+  -->  Z3SS   MU+    NUM         
      1.02653094E-05    3      1000025       -15        16             # W2SS+  -->  Z3SS   TAU+   NUT         
      8.61617252E-02    2      1000012       -11                       # W2SS+  -->  NUEL   E+                 
      8.61617178E-02    2      1000014       -13                       # W2SS+  -->  NUML   MU+                
      8.88682455E-02    2      1000016       -15                       # W2SS+  -->  NUTL   TAU+               
      1.16375983E-01    2     -1000011        12                       # W2SS+  -->  EL+    NUE                
      1.16375960E-01    2     -1000013        14                       # W2SS+  -->  MUL+   NUM                
      8.59388820E-06    2     -1000015        16                       # W2SS+  -->  TAU1+  NUT                
      1.18717805E-01    2     -2000015        16                       # W2SS+  -->  TAU2+  NUT                
      1.40471891E-01    2      1000024        23                       # W2SS+  -->  W1SS+  Z0                 
      8.50494246E-07    3      1000024         1        -1             # W2SS+  -->  W1SS+  DN     DB          
      8.50482593E-07    3      1000024         3        -3             # W2SS+  -->  W1SS+  ST     SB          
      1.04140838E-06    3      1000024         2        -2             # W2SS+  -->  W1SS+  UP     UB          
      1.04140736E-06    3      1000024         4        -4             # W2SS+  -->  W1SS+  CH     CB          
      2.55269483E-02    2      1000024        25                       # W2SS+  -->  W1SS+  HL0                
#         PDG         Width
DECAY        25  4.99699265E-03   # HL0   decays
#          BR          NDA       ID1       ID2       ID3       ID4
      5.19963228E-09    2           11       -11                       # HL0    -->  E-     E+                 
      2.19536436E-04    2           13       -13                       # HL0    -->  MU-    MU+                
      6.27632961E-02    2           15       -15                       # HL0    -->  TAU-   TAU+               
      6.53863526E-06    2            1        -1                       # HL0    -->  DN     DB                 
      2.64193537E-03    2            3        -3                       # HL0    -->  ST     SB                 
      8.81541431E-01    2            5        -5                       # HL0    -->  BT     BB                 
      1.36010772E-06    2            2        -2                       # HL0    -->  UP     UB                 
      2.61060949E-02    2            4        -4                       # HL0    -->  CH     CB                 
      9.30992421E-04    2           22        22                       # HL0    -->  GM     GM                 
      2.15607993E-02    2           21        21                       # HL0    -->  GL     GL                 
      2.31570826E-04    3           24        11       -12             # HL0    -->  W+     E-     ANUE        
      2.31570826E-04    3           24        13       -14             # HL0    -->  W+     MU-    ANUM        
      2.31570826E-04    3           24        15       -16             # HL0    -->  W+     TAU-   ANUT        
      6.94712508E-04    3           24        -2         1             # HL0    -->  W+     UB     DN          
      6.94712508E-04    3           24        -4         3             # HL0    -->  W+     CB     ST          
      2.31570826E-04    3          -24       -11        12             # HL0    -->  W-     E+     NUE         
      2.31570826E-04    3          -24       -13        14             # HL0    -->  W-     MU+    NUM         
      2.31570826E-04    3          -24       -15        16             # HL0    -->  W-     TAU+   NUT         
      6.94712508E-04    3          -24         2        -1             # HL0    -->  W-     UP     DB          
      6.94712508E-04    3          -24         4        -3             # HL0    -->  W-     CH     SB          
      4.08264941E-06    3           23        12       -12             # HL0    -->  Z0     NUE    ANUE        
      4.08264941E-06    3           23        14       -14             # HL0    -->  Z0     NUM    ANUM        
      4.08264941E-06    3           23        16       -16             # HL0    -->  Z0     NUT    ANUT        
      2.05475635E-06    3           23        11       -11             # HL0    -->  Z0     E-     E+          
      2.05475635E-06    3           23        13       -13             # HL0    -->  Z0     MU-    MU+         
      2.05475635E-06    3           23        15       -15             # HL0    -->  Z0     TAU-   TAU+        
      7.03942123E-06    3           23         2        -2             # HL0    -->  Z0     UP     UB          
      7.03942123E-06    3           23         4        -4             # HL0    -->  Z0     CH     CB          
      9.06850892E-06    3           23         1        -1             # HL0    -->  Z0     DN     DB          
      9.06850892E-06    3           23         3        -3             # HL0    -->  Z0     ST     SB          
      9.06850892E-06    3           23         5        -5             # HL0    -->  Z0     BT     BB          
#         PDG         Width
DECAY        35  2.38975123E-01   # HH0   decays
#          BR          NDA       ID1       ID2       ID3       ID4
      5.12307663E-09    2           11       -11                       # HH0    -->  E-     E+                 
      2.16305372E-04    2           13       -13                       # HH0    -->  MU-    MU+                
      6.19396567E-02    2           15       -15                       # HH0    -->  TAU-   TAU+               
      6.35004062E-06    2            1        -1                       # HH0    -->  DN     DB                 
      2.56573735E-03    2            3        -3                       # HH0    -->  ST     SB                 
      4.43871528E-01    2            5        -5                       # HH0    -->  BT     BB                 
      5.00058928E-09    2            2        -2                       # HH0    -->  UP     UB                 
      8.22488873E-05    2            4        -4                       # HH0    -->  CH     CB                 
      9.33757565E-06    2           22        22                       # HH0    -->  GM     GM                 
      1.33663358E-03    2           21        21                       # HH0    -->  GL     GL                 
      4.65980135E-02    2           24       -24                       # HH0    -->  W+     W-                 
      2.12032646E-02    2           23        23                       # HH0    -->  Z0     Z0                 
      1.10668048E-01    2      1000022   1000022                       # HH0    -->  Z1SS   Z1SS               
      9.14373472E-02    2      1000022   1000023                       # HH0    -->  Z1SS   Z2SS               
      1.89774349E-01    2           25        25                       # HH0    -->  HL0    HL0                
      1.03652729E-02    2      2000011  -2000011                       # HH0    -->  ER-    ER+                
      1.03639076E-02    2      2000013  -2000013                       # HH0    -->  MUR-   MUR+               
      9.22825653E-03    2      1000015  -1000015                       # HH0    -->  TAU1-  TAU1+              
      1.66868078E-04    2      1000015  -2000015                       # HH0    -->  TAU1-  TAU2+              
      1.66868078E-04    2      2000015  -1000015                       # HH0    -->  TAU2-  TAU1+              
#         PDG         Width
DECAY        36  3.39078188E-01   # HA0   decays
#          BR          NDA       ID1       ID2       ID3       ID4
      3.62997299E-09    2           11       -11                       # HA0    -->  E-     E+                 
      1.53263973E-04    2           13       -13                       # HA0    -->  MU-    MU+                
      4.38938551E-02    2           15       -15                       # HA0    -->  TAU-   TAU+               
      4.50014704E-06    2            1        -1                       # HA0    -->  DN     DB                 
      1.81828719E-03    2            3        -3                       # HA0    -->  ST     SB                 
      3.14755321E-01    2            5        -5                       # HA0    -->  BT     BB                 
      2.30383801E-09    2            2        -2                       # HA0    -->  UP     UB                 
      3.79720805E-05    2            4        -4                       # HA0    -->  CH     CB                 
      1.68283918E-07    2           22        22                       # HA0    -->  GM     GM                 
      2.88174371E-04    2           21        21                       # HA0    -->  GL     GL                 
      2.09224835E-01    2      1000022   1000022                       # HA0    -->  Z1SS   Z1SS               
      4.09122676E-01    2      1000022   1000023                       # HA0    -->  Z1SS   Z2SS               
      2.05690898E-02    2           25        23                       # HA0    -->  HL0    Z0                 
      2.07916497E-11    2      1000011  -2000011                       # HA0    -->  EL-    ER+                
      2.07916497E-11    2      2000011  -1000011                       # HA0    -->  ER-    EL+                
      8.77859691E-07    2      1000013  -2000013                       # HA0    -->  MUL-   MUR+               
      8.77859691E-07    2      2000013  -1000013                       # HA0    -->  MUR-   MUL+               
      6.50092334E-05    2      1000015  -2000015                       # HA0    -->  TAU1-  TAU2+              
      6.50092334E-05    2      2000015  -1000015                       # HA0    -->  TAU2-  TAU1+              
#         PDG         Width
DECAY        37  4.92270052E-01   # H+    decays
#          BR          NDA       ID1       ID2       ID3       ID4
      2.60886934E-09    2           12       -11                       # H+     -->  NUE    E+                 
      1.10151144E-04    2           14       -13                       # H+     -->  NUM    MU+                
      3.15468051E-02    2           16       -15                       # H+     -->  NUT    TAU+               
      2.93916855E-06    2            2        -1                       # H+     -->  UP     DB                 
      1.21155812E-03    2            4        -3                       # H+     -->  CH     SB                 
      6.56673610E-01    2            6        -5                       # H+     -->  TP     BB                 
      2.91134804E-01    2      1000024   1000022                       # H+     -->  W1SS+  Z1SS               
      1.93188563E-02    2           25        24                       # H+     -->  HL0    W+                 
      1.31111267E-06    2     -1000015   1000016                       # H+     -->  TAU1+  NUTL               
