  65
  401   2000.8307    0.26091E-25
  402   1999.3210    0.25995E-25
  403   2000.8307    0.26091E-25
  404   1999.3215    0.25995E-25
  405   1999.9003    0.48092E-25
  406   1828.8071    0.13878E-25
  407   2000.8307    0.26091E-25
  408   1999.3210    0.25995E-25
  409   2000.8307    0.26091E-25
  410   1999.3215    0.25995E-25
  411   1999.9003    0.48092E-25
  412   1828.8071    0.13878E-25
  413   2000.1520    0.58862E-24
  414   1999.6959    0.14719E-24
  415   2000.1520    0.58862E-24
  416   1999.6964    0.14719E-24
  417   2001.0859    0.14137E-25
  418   2165.5322    0.80650E-26
  419   2000.1520    0.58862E-24
  420   1999.6959    0.14719E-24
  421   2000.1520    0.58862E-24
  422   1999.6964    0.14719E-24
  423   2001.0859    0.14137E-25
  424   2165.5322    0.80650E-26
  425   2000.5267    0.23951E-25
  426   1999.0170    0.23908E-25
  427   2000.5267    0.23951E-25
  428   1999.0170    0.23908E-25
  429   2000.1730    0.36618E-25
  430   1999.0170    0.23783E-25
  431   2000.5267    0.23951E-25
  432   1999.0170    0.23908E-25
  433   2000.5267    0.23951E-25
  434   1999.0170    0.23908E-25
  435   2000.1730    0.36618E-25
  436   1999.0170    0.23783E-25
  437   1999.9562    0.65409E-25
  438      0.0000    0.10000E+31
  439   1999.9562    0.65409E-25
  440      0.0000    0.10000E+31
  441   2000.8112    0.32895E-25
  442      0.0000    0.10000E+31
  443   1999.9562    0.65409E-25
  444      0.0000    0.10000E+31
  445   1999.9562    0.65409E-25
  446      0.0000    0.10000E+31
  447   2000.8112    0.32895E-25
  448      0.0000    0.10000E+31
  449   2000.0000    0.19879E-24
  450     54.6767    0.10000E+31
  451   -132.1384    0.20186E-21
  452    135.1665    0.31389E-21
  453    202.2951    0.13746E-23
  454     63.3402    0.67657E-17
  455    194.2260    0.19850E-23
  456     63.3402    0.67657E-17
  457    194.2260    0.19850E-23
  203    119.0164    0.50129E-22
  204    504.3795    0.10291E-24
  205    500.0000    0.10221E-24
  206    509.4134    0.10622E-24
  207    509.4134    0.10622E-24
  458      0.0000    0.10000E+31
    6    172.5000    0.57395E-24
   12    172.5000    0.57395E-24
   6
   401  0.13776311E+00     0   450     1     0     0     0
   401  0.15414220E-01     0   451     1     0     0     0
   401  0.38458493E-01     0   452     1     0     0     0
   401  0.14962097E+00     0   453     1     0     0     0
   401  0.21224640E+00     0   456     2     0     0     0
   401  0.44649687E+00     0   457     2     0     0     0
   6
   402  0.10069402E+00     0   450     2     0     0     0
   402  0.10554411E-01     0   451     2     0     0     0
   402  0.14169775E+00     0   452     2     0     0     0
   402  0.87212160E-01     0   453     2     0     0     0
   402  0.45209438E+00     0   454     1     0     0     0
   402  0.20774727E+00     0   455     1     0     0     0
   6
   403  0.13776320E+00     0   450     3     0     0     0
   403  0.15414230E-01     0   451     3     0     0     0
   403  0.38458515E-01     0   452     3     0     0     0
   403  0.14962105E+00     0   453     3     0     0     0
   403  0.21224634E+00     0   456     4     0     0     0
   403  0.44649673E+00     0   457     4     0     0     0
   6
   404  0.10069396E+00     0   450     4     0     0     0
   404  0.10554405E-01     0   451     4     0     0     0
   404  0.14169769E+00     0   452     4     0     0     0
   404  0.87212116E-01     0   453     4     0     0     0
   404  0.45209455E+00     0   454     3     0     0     0
   404  0.20774734E+00     0   455     3     0     0     0
   7
   405  0.11758829E+00     0   450     5     0     0     0
   405  0.60164032E-03     0   451     5     0     0     0
   405  0.62614903E-01     0   452     5     0     0     0
   405  0.41777290E-01     0   453     5     0     0     0
   405  0.28104469E+00     0   456     6     0     0     0
   405  0.37535551E+00     0   457     6     0     0     0
   405  0.12101763E+00     0   199   406     0     0     0
   6
   406  0.19318920E-01     0   450     6     0     0     0
   406  0.20603959E+00     0   451     6     0     0     0
   406  0.68177916E-01     0   452     6     0     0     0
   406  0.30500910E+00     0   453     6     0     0     0
   406  0.51232637E-02     0   454     5     0     0     0
   406  0.39633116E+00     0   455     5     0     0     0
   6
   407  0.13776311E+00     0   450     7     0     0     0
   407  0.15414220E-01     0   451     7     0     0     0
   407  0.38458493E-01     0   452     7     0     0     0
   407  0.14962097E+00     0   453     7     0     0     0
   407  0.21224640E+00     0   454     8     0     0     0
   407  0.44649687E+00     0   455     8     0     0     0
   6
   408  0.10069402E+00     0   450     8     0     0     0
   408  0.10554411E-01     0   451     8     0     0     0
   408  0.14169775E+00     0   452     8     0     0     0
   408  0.87212160E-01     0   453     8     0     0     0
   408  0.45209438E+00     0   456     7     0     0     0
   408  0.20774727E+00     0   457     7     0     0     0
   6
   409  0.13776320E+00     0   450     9     0     0     0
   409  0.15414230E-01     0   451     9     0     0     0
   409  0.38458515E-01     0   452     9     0     0     0
   409  0.14962105E+00     0   453     9     0     0     0
   409  0.21224634E+00     0   454    10     0     0     0
   409  0.44649673E+00     0   455    10     0     0     0
   6
   410  0.10069396E+00     0   450    10     0     0     0
   410  0.10554405E-01     0   451    10     0     0     0
   410  0.14169769E+00     0   452    10     0     0     0
   410  0.87212116E-01     0   453    10     0     0     0
   410  0.45209455E+00     0   456     9     0     0     0
   410  0.20774734E+00     0   457     9     0     0     0
   7
   411  0.11758829E+00     0   450    11     0     0     0
   411  0.60164032E-03     0   451    11     0     0     0
   411  0.62614903E-01     0   452    11     0     0     0
   411  0.41777290E-01     0   453    11     0     0     0
   411  0.28104469E+00     0   454    12     0     0     0
   411  0.37535551E+00     0   455    12     0     0     0
   411  0.12101763E+00     0   198   412     0     0     0
   6
   412  0.19318920E-01     0   450    12     0     0     0
   412  0.20603959E+00     0   451    12     0     0     0
   412  0.68177916E-01     0   452    12     0     0     0
   412  0.30500910E+00     0   453    12     0     0     0
   412  0.51232637E-02     0   456    11     0     0     0
   412  0.39633116E+00     0   457    11     0     0     0
   4
   413  0.63663512E-01     0   450     1     0     0     0
   413  0.10125224E-01     0   451     1     0     0     0
   413  0.74016970E+00     0   452     1     0     0     0
   413  0.18604167E+00     0   453     1     0     0     0
   4
   414  0.63663796E-01     0   450     2     0     0     0
   414  0.10125236E-01     0   451     2     0     0     0
   414  0.74017018E+00     0   452     2     0     0     0
   414  0.18604083E+00     0   453     2     0     0     0
   4
   415  0.63663512E-01     0   450     3     0     0     0
   415  0.10125224E-01     0   451     3     0     0     0
   415  0.74016970E+00     0   452     3     0     0     0
   415  0.18604167E+00     0   453     3     0     0     0
   4
   416  0.63663796E-01     0   450     4     0     0     0
   416  0.10125235E-01     0   451     4     0     0     0
   416  0.74017018E+00     0   452     4     0     0     0
   416  0.18604083E+00     0   453     4     0     0     0
   7
   417  0.48025049E-01     0   450     5     0     0     0
   417  0.14459153E-01     0   451     5     0     0     0
   417  0.20292291E-01     0   452     5     0     0     0
   417  0.75409904E-01     0   453     5     0     0     0
   417  0.20510638E+00     0   456     6     0     0     0
   417  0.49985108E+00     0   457     6     0     0     0
   417  0.13685614E+00     0   199   406     0     0     0
   9
   418  0.25876096E+00     0   454     5     0     0     0
   418  0.23041658E-01     0   455     5     0     0     0
   418  0.21568927E+00     0   200   406     0     0     0
   418  0.18106937E-01     0   198   405     0     0     0
   418  0.66057362E-01     0   198   417     0     0     0
   418  0.12015244E+00     0   450     6     0     0     0
   418  0.21762398E+00     0   451     6     0     0     0
   418  0.47527585E-01     0   452     6     0     0     0
   418  0.33039846E-01     0   453     6     0     0     0
   4
   419  0.63663512E-01     0   450     7     0     0     0
   419  0.10125224E-01     0   451     7     0     0     0
   419  0.74016970E+00     0   452     7     0     0     0
   419  0.18604167E+00     0   453     7     0     0     0
   4
   420  0.63663796E-01     0   450     8     0     0     0
   420  0.10125236E-01     0   451     8     0     0     0
   420  0.74017018E+00     0   452     8     0     0     0
   420  0.18604083E+00     0   453     8     0     0     0
   4
   421  0.63663512E-01     0   450     9     0     0     0
   421  0.10125224E-01     0   451     9     0     0     0
   421  0.74016970E+00     0   452     9     0     0     0
   421  0.18604167E+00     0   453     9     0     0     0
   4
   422  0.63663796E-01     0   450    10     0     0     0
   422  0.10125235E-01     0   451    10     0     0     0
   422  0.74017018E+00     0   452    10     0     0     0
   422  0.18604083E+00     0   453    10     0     0     0
   7
   423  0.48025049E-01     0   450    11     0     0     0
   423  0.14459153E-01     0   451    11     0     0     0
   423  0.20292291E-01     0   452    11     0     0     0
   423  0.75409904E-01     0   453    11     0     0     0
   423  0.20510638E+00     0   454    12     0     0     0
   423  0.49985108E+00     0   455    12     0     0     0
   423  0.13685614E+00     0   198   412     0     0     0
   9
   424  0.25876096E+00     0   456    11     0     0     0
   424  0.23041658E-01     0   457    11     0     0     0
   424  0.21568927E+00     0   200   412     0     0     0
   424  0.18106937E-01     0   199   411     0     0     0
   424  0.66057362E-01     0   199   423     0     0     0
   424  0.12015244E+00     0   450    12     0     0     0
   424  0.21762398E+00     0   451    12     0     0     0
   424  0.47527585E-01     0   452    12     0     0     0
   424  0.33039846E-01     0   453    12     0     0     0
   6
   425  0.64406164E-01     0   450   121     0     0     0
   425  0.61377636E-02     0   451   121     0     0     0
   425  0.28622177E+00     0   452   121     0     0     0
   425  0.38629699E-01     0   453   121     0     0     0
   425  0.19480367E+00     0   456   122     0     0     0
   425  0.40980095E+00     0   457   122     0     0     0
   6
   426  0.16481476E+00     0   450   122     0     0     0
   426  0.19339288E-01     0   451   122     0     0     0
   426  0.20446387E-03     0   452   122     0     0     0
   426  0.20885076E+00     0   453   122     0     0     0
   426  0.41574693E+00     0   454   121     0     0     0
   426  0.19104385E+00     0   455   121     0     0     0
   6
   427  0.64406164E-01     0   450   123     0     0     0
   427  0.61377636E-02     0   451   123     0     0     0
   427  0.28622177E+00     0   452   123     0     0     0
   427  0.38629699E-01     0   453   123     0     0     0
   427  0.19480367E+00     0   456   124     0     0     0
   427  0.40980095E+00     0   457   124     0     0     0
   6
   428  0.16481476E+00     0   450   124     0     0     0
   428  0.19339288E-01     0   451   124     0     0     0
   428  0.20446387E-03     0   452   124     0     0     0
   428  0.20885076E+00     0   453   124     0     0     0
   428  0.41574693E+00     0   454   123     0     0     0
   428  0.19104385E+00     0   455   123     0     0     0
   6
   429  0.96558772E-01     0   450   125     0     0     0
   429  0.76825102E-03     0   451   125     0     0     0
   429  0.42455631E+00     0   452   125     0     0     0
   429  0.66182956E-01     0   453   125     0     0     0
   429  0.17454204E+00     0   456   126     0     0     0
   429  0.23739170E+00     0   457   126     0     0     0
   6
   430  0.16394688E+00     0   450   126     0     0     0
   430  0.19237451E-01     0   451   126     0     0     0
   430  0.20338722E-03     0   452   126     0     0     0
   430  0.20775099E+00     0   453   126     0     0     0
   430  0.41715994E+00     0   454   125     0     0     0
   430  0.19170132E+00     0   455   125     0     0     0
   6
   431  0.64406164E-01     0   450   127     0     0     0
   431  0.61377636E-02     0   451   127     0     0     0
   431  0.28622177E+00     0   452   127     0     0     0
   431  0.38629699E-01     0   453   127     0     0     0
   431  0.19480367E+00     0   454   128     0     0     0
   431  0.40980095E+00     0   455   128     0     0     0
   6
   432  0.16481476E+00     0   450   128     0     0     0
   432  0.19339288E-01     0   451   128     0     0     0
   432  0.20446387E-03     0   452   128     0     0     0
   432  0.20885076E+00     0   453   128     0     0     0
   432  0.41574693E+00     0   456   127     0     0     0
   432  0.19104385E+00     0   457   127     0     0     0
   6
   433  0.64406164E-01     0   450   129     0     0     0
   433  0.61377636E-02     0   451   129     0     0     0
   433  0.28622177E+00     0   452   129     0     0     0
   433  0.38629699E-01     0   453   129     0     0     0
   433  0.19480367E+00     0   454   130     0     0     0
   433  0.40980095E+00     0   455   130     0     0     0
   6
   434  0.16481476E+00     0   450   130     0     0     0
   434  0.19339288E-01     0   451   130     0     0     0
   434  0.20446387E-03     0   452   130     0     0     0
   434  0.20885076E+00     0   453   130     0     0     0
   434  0.41574693E+00     0   456   129     0     0     0
   434  0.19104385E+00     0   457   129     0     0     0
   6
   435  0.96558772E-01     0   450   131     0     0     0
   435  0.76825102E-03     0   451   131     0     0     0
   435  0.42455631E+00     0   452   131     0     0     0
   435  0.66182956E-01     0   453   131     0     0     0
   435  0.17454204E+00     0   454   132     0     0     0
   435  0.23739170E+00     0   455   132     0     0     0
   6
   436  0.16394688E+00     0   450   132     0     0     0
   436  0.19237451E-01     0   451   132     0     0     0
   436  0.20338722E-03     0   452   132     0     0     0
   436  0.20775099E+00     0   453   132     0     0     0
   436  0.41715994E+00     0   456   131     0     0     0
   436  0.19170132E+00     0   457   131     0     0     0
   4
   437  0.63663654E-01     0   450   121     0     0     0
   437  0.10125232E-01     0   451   121     0     0     0
   437  0.74016982E+00     0   452   121     0     0     0
   437  0.18604133E+00     0   453   121     0     0     0
   0
   4
   439  0.63663654E-01     0   450   123     0     0     0
   439  0.10125232E-01     0   451   123     0     0     0
   439  0.74016982E+00     0   452   123     0     0     0
   439  0.18604133E+00     0   453   123     0     0     0
   0
   6
   441  0.40108930E-01     0   450   125     0     0     0
   441  0.18825626E-01     0   451   125     0     0     0
   441  0.38412863E+00     0   452   125     0     0     0
   441  0.89319758E-01     0   453   125     0     0     0
   441  0.11573412E+00     0   456   126     0     0     0
   441  0.35188290E+00     0   457   126     0     0     0
   0
   4
   443  0.63663654E-01     0   450   127     0     0     0
   443  0.10125232E-01     0   451   127     0     0     0
   443  0.74016982E+00     0   452   127     0     0     0
   443  0.18604133E+00     0   453   127     0     0     0
   0
   4
   445  0.63663654E-01     0   450   129     0     0     0
   445  0.10125232E-01     0   451   129     0     0     0
   445  0.74016982E+00     0   452   129     0     0     0
   445  0.18604133E+00     0   453   129     0     0     0
   0
   6
   447  0.40108930E-01     0   450   131     0     0     0
   447  0.18825626E-01     0   451   131     0     0     0
   447  0.38412863E+00     0   452   131     0     0     0
   447  0.89319758E-01     0   453   131     0     0     0
   447  0.11573412E+00     0   454   132     0     0     0
   447  0.35188290E+00     0   455   132     0     0     0
   0
  32
   449  0.27083806E-02     0   454     1     8     0     0
   449  0.27083806E-02     0   456     2     7     0     0
   449  0.27083806E-02     0   454     3    10     0     0
   449  0.27083806E-02     0   456     4     9     0     0
   449  0.11750810E-01     0   454     5    12     0     0
   449  0.11750810E-01     0   456     6    11     0     0
   449  0.56035314E-02     0   455     1     8     0     0
   449  0.56035314E-02     0   457     2     7     0     0
   449  0.56035314E-02     0   455     3    10     0     0
   449  0.56035314E-02     0   457     4     9     0     0
   449  0.19003174E+00     0   455     5    12     0     0
   449  0.19003174E+00     0   457     6    11     0     0
   449  0.32218063E-03     0   450    13     0     0     0
   449  0.36608379E-02     0   450     1     7     0     0
   449  0.36608379E-02     0   450     3     9     0     0
   449  0.39532627E-02     0   450     5    11     0     0
   449  0.19264936E-01     0   450     6    12     0     0
   449  0.95517753E-03     0   451    13     0     0     0
   449  0.38395083E-03     0   451     1     7     0     0
   449  0.38395083E-03     0   451     3     9     0     0
   449  0.76252257E-03     0   451     5    11     0     0
   449  0.18563659E+00     0   451     6    12     0     0
   449  0.10815553E-04     0   452    13     0     0     0
   449  0.19026272E-02     0   452     1     7     0     0
   449  0.19026272E-02     0   452     3     9     0     0
   449  0.18847570E-02     0   452     5    11     0     0
   449  0.57492971E-01     0   452     6    12     0     0
   449  0.39068094E-03     0   453    13     0     0     0
   449  0.42257621E-02     0   453     1     7     0     0
   449  0.42257621E-02     0   453     3     9     0     0
   449  0.43473840E-02     0   453     5    11     0     0
   449  0.26781958E+00     0   453     6    12     0     0
   0
  22
   451  0.33483357E-03     0   450    59     0     0     0
   451  0.11230264E+00     0   456     2     7     0     0
   451  0.37434213E-01     0   456   122   127     0     0
   451  0.37434213E-01     0   456   124   129     0     0
   451  0.11230264E+00     0   454     1     8     0     0
   451  0.37434213E-01     0   454   121   128     0     0
   451  0.37434213E-01     0   454   123   130     0     0
   451  0.11230264E+00     0   456     4     9     0     0
   451  0.37434213E-01     0   456   126   131     0     0
   451  0.11230264E+00     0   454     3    10     0     0
   451  0.37434213E-01     0   454   125   132     0     0
   451  0.38556930E-01     0   450     2     8     0     0
   451  0.49674012E-01     0   450     1     7     0     0
   451  0.49674012E-01     0   450     3     9     0     0
   451  0.38556930E-01     0   450     4    10     0     0
   451  0.48291754E-01     0   450     5    11     0     0
   451  0.11270748E-01     0   450   121   127     0     0
   451  0.11270748E-01     0   450   123   129     0     0
   451  0.11217471E-01     0   450   125   131     0     0
   451  0.22445591E-01     0   450   122   128     0     0
   451  0.22445591E-01     0   450   124   130     0     0
   451  0.22445591E-01     0   450   126   132     0     0
  22
   452  0.73780317E-03     0   450    59     0     0     0
   452  0.16622299E+00     0   456     2     7     0     0
   452  0.55407658E-01     0   456   122   127     0     0
   452  0.55407658E-01     0   456   124   129     0     0
   452  0.16622299E+00     0   454     1     8     0     0
   452  0.55407658E-01     0   454   121   128     0     0
   452  0.55407658E-01     0   454   123   130     0     0
   452  0.16622299E+00     0   456     4     9     0     0
   452  0.55407658E-01     0   456   126   131     0     0
   452  0.16622299E+00     0   454     3    10     0     0
   452  0.55407658E-01     0   454   125   132     0     0
   452  0.23554444E-03     0   450     2     8     0     0
   452  0.28817143E-03     0   450     1     7     0     0
   452  0.28817143E-03     0   450     3     9     0     0
   452  0.23554444E-03     0   450     4    10     0     0
   452  0.28157278E-03     0   450     5    11     0     0
   452  0.65496359E-04     0   450   121   127     0     0
   452  0.65496359E-04     0   450   123   129     0     0
   452  0.65349370E-04     0   450   125   131     0     0
   452  0.13302667E-03     0   450   122   128     0     0
   452  0.13302667E-03     0   450   124   130     0     0
   452  0.13302667E-03     0   450   126   132     0     0
  15
   453  0.49440944E+00     0   454   199     0     0     0
   453  0.49440944E+00     0   456   198     0     0     0
   453  0.88303499E-02     0   450   200     0     0     0
   453  0.17568248E-03     0   451     2     8     0     0
   453  0.22679855E-03     0   451     1     7     0     0
   453  0.22679855E-03     0   451     3     9     0     0
   453  0.17568248E-03     0   451     4    10     0     0
   453  0.21799620E-03     0   451     5    11     0     0
   453  0.51436251E-04     0   451   121   127     0     0
   453  0.51436251E-04     0   451   123   129     0     0
   453  0.51087442E-04     0   451   125   131     0     0
   453  0.10221849E-03     0   451   122   128     0     0
   453  0.10221849E-03     0   451   124   130     0     0
   453  0.10221849E-03     0   451   126   132     0     0
   453  0.86732337E-03     0   450   203     0     0     0
   5
   454  0.33333230E+00     0   450     2     7     0     0
   454  0.33333230E+00     0   450     4     9     0     0
   454  0.11111149E+00     0   450   127   122     0     0
   454  0.11111149E+00     0   450   129   124     0     0
   454  0.11111251E+00     0   450   131   126     0     0
  13
   455  0.49977222E+00     0   450   198     0     0     0
   455  0.67367859E-03     0   451     2     7     0     0
   455  0.67367859E-03     0   451     4     9     0     0
   455  0.22451958E-03     0   451   127   122     0     0
   455  0.22451958E-03     0   451   129   124     0     0
   455  0.22452236E-03     0   451   131   126     0     0
   455  0.55864314E-03     0   452     2     7     0     0
   455  0.55864314E-03     0   452     4     9     0     0
   455  0.18638695E-03     0   452   127   122     0     0
   455  0.18638695E-03     0   452   129   124     0     0
   455  0.18638725E-03     0   452   131   126     0     0
   455  0.48754811E+00     0   454   200     0     0     0
   455  0.89824190E-02     0   454   203     0     0     0
   5
   456  0.33333230E+00     0   450     8     1     0     0
   456  0.33333230E+00     0   450    10     3     0     0
   456  0.11111149E+00     0   450   121   128     0     0
   456  0.11111149E+00     0   450   123   130     0     0
   456  0.11111251E+00     0   450   125   132     0     0
  13
   457  0.49977222E+00     0   450   199     0     0     0
   457  0.67367859E-03     0   451     8     1     0     0
   457  0.67367859E-03     0   451    10     3     0     0
   457  0.22451958E-03     0   451   121   128     0     0
   457  0.22451958E-03     0   451   123   130     0     0
   457  0.22452236E-03     0   451   125   132     0     0
   457  0.55864314E-03     0   452     8     1     0     0
   457  0.55864314E-03     0   452    10     3     0     0
   457  0.18638695E-03     0   452   121   128     0     0
   457  0.18638695E-03     0   452   123   130     0     0
   457  0.18638725E-03     0   452   125   132     0     0
   457  0.48754811E+00     0   456   200     0     0     0
   457  0.89824190E-02     0   456   203     0     0     0
  29
   203  0.77324818E-04     0   123   129     0     0     0
   203  0.22117499E-01     0   125   131     0     0     0
   203  0.92827360E-03     0     3     9     0     0     0
   203  0.30283055E+00     0     5    11     0     0     0
   203  0.11517267E-01     0     4    10     0     0     0
   203  0.83329802E-03     0    59    59     0     0     0
   203  0.13373882E-01     0    13    13     0     0     0
   203  0.15761509E-02     0   198   121   128     0     0
   203  0.15761509E-02     0   198   123   130     0     0
   203  0.15761509E-02     0   198   125   132     0     0
   203  0.47284523E-02     0   198     8     1     0     0
   203  0.47284523E-02     0   198    10     3     0     0
   203  0.15761509E-02     0   199   127   122     0     0
   203  0.15761509E-02     0   199   129   124     0     0
   203  0.15761509E-02     0   199   131   126     0     0
   203  0.47284523E-02     0   199     2     7     0     0
   203  0.47284523E-02     0   199     4     9     0     0
   203  0.17585009E-03     0   200   122   128     0     0
   203  0.17585009E-03     0   200   124   130     0     0
   203  0.17585009E-03     0   200   126   132     0     0
   203  0.88503584E-04     0   200   121   127     0     0
   203  0.88503584E-04     0   200   123   129     0     0
   203  0.88503584E-04     0   200   125   131     0     0
   203  0.30320580E-03     0   200     2     8     0     0
   203  0.30320580E-03     0   200     4    10     0     0
   203  0.39060376E-03     0   200     1     7     0     0
   203  0.39060376E-03     0   200     3     9     0     0
   203  0.39060376E-03     0   200     5    11     0     0
   203  0.61738002E+00     0   450   450     0     0     0
  22
   204  0.20262591E-04     0   123   129     0     0     0
   204  0.58030863E-02     0   125   131     0     0     0
   204  0.23900108E-03     0     3     9     0     0     0
   204  0.64128444E-01     0     5    11     0     0     0
   204  0.63959457E-01     0     6    12     0     0     0
   204  0.96591873E-04     0    13    13     0     0     0
   204  0.12754065E-02     0   198   199     0     0     0
   204  0.62698097E-03     0   200   200     0     0     0
   204  0.11242662E+00     0   450   450     0     0     0
   204  0.50970137E-01     0   450   451     0     0     0
   204  0.21780301E-03     0   450   452     0     0     0
   204  0.15903130E-01     0   450   453     0     0     0
   204  0.15237923E-01     0   451   451     0     0     0
   204  0.34376260E-03     0   451   452     0     0     0
   204  0.12075656E+00     0   451   453     0     0     0
   204  0.44233527E-03     0   452   453     0     0     0
   204  0.76312418E-02     0   453   453     0     0     0
   204  0.22649686E+00     0   454   456     0     0     0
   204  0.62977984E-02     0   455   457     0     0     0
   204  0.15095709E+00     0   454   457     0     0     0
   204  0.15095709E+00     0   456   455     0     0     0
   204  0.52125510E-02     0   203   203     0     0     0
  20
   205  0.20055573E-04     0   123   129     0     0     0
   205  0.57440791E-02     0   125   131     0     0     0
   205  0.23657896E-03     0     3     9     0     0     0
   205  0.63561313E-01     0     5    11     0     0     0
   205  0.94669953E-01     0     6    12     0     0     0
   205  0.81849023E-04     0    13    13     0     0     0
   205  0.17530571E+00     0   450   450     0     0     0
   205  0.99127525E-02     0   450   451     0     0     0
   205  0.62785629E-03     0   450   452     0     0     0
   205  0.15330430E-01     0   450   453     0     0     0
   205  0.92903674E-02     0   451   451     0     0     0
   205  0.25081128E-03     0   451   452     0     0     0
   205  0.39701588E-01     0   451   453     0     0     0
   205  0.17395940E-02     0   452   453     0     0     0
   205  0.59187062E-01     0   453   453     0     0     0
   205  0.33197713E+00     0   454   456     0     0     0
   205  0.74761882E-01     0   455   457     0     0     0
   205  0.58259141E-01     0   454   457     0     0     0
   205  0.58259141E-01     0   456   455     0     0     0
   205  0.10825755E-02     0   203   200     0     0     0
  13
   206  0.21233815E-04     0   124   129     0     0     0
   206  0.60815425E-02     0   126   131     0     0     0
   206  0.23094760E-03     0     4     9     0     0     0
   206  0.13476187E+00     0     6    11     0     0     0
   206  0.73422999E-02     0   454   450     0     0     0
   206  0.11992960E+00     0   454   451     0     0     0
   206  0.21554008E+00     0   454   452     0     0     0
   206  0.92243023E-01     0   454   453     0     0     0
   206  0.26073918E+00     0   455   450     0     0     0
   206  0.10110463E+00     0   455   451     0     0     0
   206  0.51026233E-01     0   455   452     0     0     0
   206  0.97595910E-02     0   455   453     0     0     0
   206  0.12198729E-02     0   203   198     0     0     0
  13
   207  0.21233815E-04     0   130   123     0     0     0
   207  0.60815425E-02     0   132   125     0     0     0
   207  0.23094760E-03     0    10     3     0     0     0
   207  0.13476187E+00     0    12     5     0     0     0
   207  0.73422999E-02     0   456   450     0     0     0
   207  0.11992960E+00     0   456   451     0     0     0
   207  0.21554008E+00     0   456   452     0     0     0
   207  0.92243023E-01     0   456   453     0     0     0
   207  0.26073918E+00     0   457   450     0     0     0
   207  0.10110463E+00     0   457   451     0     0     0
   207  0.51026233E-01     0   457   452     0     0     0
   207  0.97595910E-02     0   457   453     0     0     0
   207  0.12198729E-02     0   203   199     0     0     0
   0
   5
     6  0.33333334E+00   100     2     7     5     0     0
     6  0.33333334E+00   100     4     9     5     0     0
     6  0.11111111E+00   100   122   127     5     0     0
     6  0.11111111E+00   100   124   129     5     0     0
     6  0.11111111E+00   100   126   131     5     0     0
   5
    12  0.33333334E+00   100     8     1    11     0     0
    12  0.33333334E+00   100    10     3    11     0     0
    12  0.11111111E+00   100   128   121    11     0     0
    12  0.11111111E+00   100   130   123    11     0     0
    12  0.11111111E+00   100   132   125    11     0     0
      6.00000000     -0.18023261
     -0.25114539      0.59684443     -0.65964925      0.38153028
     -0.10052110      0.19739896      0.64161009      0.73434711
     -0.85962439     -0.49845076     -0.07591258      0.08264425
      0.43343675     -0.59695673     -0.38397497      0.55528271
     -0.82552212      0.56436980     -0.56436980     -0.82552212
     -0.56436938      0.82552236     -0.82552236     -0.56436938
      0.78484106     -1.09409297     -0.84546745
   4899.00000000      0.00000000      0.00000000
    120.00000000
    T
