#  ISAJET SUSY parameters in SUSY Les Houches Accord 2 format
#  Created by ISALHA 2.0 Last revision: C. Balazs 21 Apr 2009
Block SPINFO   # Program information
     1   ISASUGRA from ISAJET          # Spectrum Calculator
     2   7.80   29-OCT-2009 12:50:36   # Version number
Block MODSEL   # Model selection
     1     0   #   MsR(Q)          MbR(Q)                          
Block SMINPUTS   # Standard Model inputs
     1     1.27837601E+02   # alpha_em^(-1)
     2     1.16570000E-05   # G_Fermi
     3     1.17200002E-01   # alpha_s(M_Z)
     4     9.11699982E+01   # m_{Z}(pole)
     5     4.19999981E+00   # m_{b}(m_{b})
     6     1.72500000E+02   # m_{top}(pole)
     7     1.77699995E+00   # m_{tau}(pole)
Block MINPAR   # SUSY breaking input parameters
Block MASS   # Scalar and gaugino mass spectrum
#  PDG code   mass                 particle
        24     8.04229965E+01   #  W^+
        25     1.20300003E+02   #  h^0            
        35     2.51769946E+03   #  H^0            
        36     2.50000000E+03   #  A^0            
        37     2.51645581E+03   #  H^+            
   1000001     1.00140430E+03   #  dnl            
   1000002     9.98851196E+02   #  upl            
   1000003     1.00140430E+03   #  stl            
   1000004     9.98852112E+02   #  chl            
   1000005     1.00024969E+03   #  b1             
   1000006     1.00906799E+03   #  t1             
   1000011     2.50035645E+03   #  el-            
   1000012     2.49933496E+03   #  nuel           
   1000013     2.50035645E+03   #  mul-           
   1000014     2.49933496E+03   #  numl           
   1000015     2.50029565E+03   #  tau1           
   1000016     2.49933496E+03   #  nutl           
   1000021     4.00000000E+02   #  glss           
   1000022     4.95151367E+01   #  z1ss           
   1000023     2.42852466E+03   #  z2ss           
   1000024     2.42832593E+03   #  w1ss           
   1000025    -2.50041187E+03   #  z3ss           
   1000035     2.57237256E+03   #  z4ss           
   1000037     2.57219092E+03   #  w2ss           
   2000001     1.00025708E+03   #  dnr            
   2000002     9.99485657E+02   #  upr            
   2000003     1.00025714E+03   #  str            
   2000004     9.99486572E+02   #  chr            
   2000005     1.00141937E+03   #  b2             
   2000006     1.00974225E+03   #  t2             
   2000011     2.50030859E+03   #  er-            
   2000013     2.50030859E+03   #  mur-           
   2000015     2.50037036E+03   #  tau2           
Block ALPHA   # Effective Higgs mixing parameter
         -3.22586089E-01   # alpha
Block STOPMIX   # stop mixing matrix
  1  1     7.15469003E-01   # O_{11}
  1  2     6.98644459E-01   # O_{12}
  2  1    -6.98644459E-01   # O_{21}
  2  2     7.15469003E-01   # O_{22}
Block SBOTMIX   # sbottom mixing matrix
  1  1     5.52335052E-07   # O_{11}
  1  2    -1.00000000E+00   # O_{12}
  2  1     1.00000000E+00   # O_{21}
  2  2     5.52335052E-07   # O_{22}
Block STAUMIX   # stau mixing matrix
  1  1     2.81731172E-06   # O_{11}
  1  2    -1.00000000E+00   # O_{12}
  2  1     1.00000000E+00   # O_{21}
  2  2     2.81731172E-06   # O_{22}
Block NMIX   # neutralino mixing matrix
  1  1     9.99839604E-01   #
  1  2    -3.59976722E-04   #
  1  3     1.68992430E-02   #
  1  4    -5.92865795E-03   #
  2  1     1.16938101E-02   #
  2  2     7.08019316E-01   #
  2  3    -5.02892852E-01   #
  2  4     4.95652080E-01   #
  3  1    -7.75294006E-03   #
  3  2     7.19459541E-03   #
  3  3     7.06950903E-01   #
  3  4     7.07183957E-01   #
  4  1     1.11359842E-02   #
  4  2    -7.06156433E-01   #
  4  3    -4.97025281E-01   #
  4  4     5.04167676E-01   #
Block UMIX   # chargino U mixing matrix
  1  1    -7.02002406E-01   # U_{11}
  1  2     7.12174535E-01   # U_{12}
  2  1    -7.12174535E-01   # U_{21}
  2  2    -7.02002406E-01   # U_{22}
Block VMIX   # chargino V mixing matrix
  1  1    -7.12174356E-01   # V_{11}
  1  2     7.02002585E-01   # V_{12}
  2  1    -7.02002585E-01   # V_{21}
  2  2    -7.12174356E-01   # V_{22}
Block GAUGE Q=  0.00000000E+00   #
     1     0.00000000E+00   # g`
     2     0.00000000E+00   # g_2
     3     0.00000000E+00   # g_3
Block YU Q=  0.00000000E+00   #
  3  3     0.00000000E+00   # y_t
Block YD Q=  0.00000000E+00   #
  3  3     0.00000000E+00   # y_b
Block YE Q=  0.00000000E+00   #
  3  3     0.00000000E+00   # y_tau
Block HMIX Q=  0.00000000E+00   # Higgs mixing parameters
     1     0.00000000E+00   # mu(Q)
     2     0.00000000E+00   # tan(beta)(M_GUT)
     3     0.00000000E+00   # Higgs vev at Q
     4     6.25000000E+06   # m_A^2(Q)
Block MSOFT Q=  0.00000000E+00   # DRbar SUSY breaking parameters
     1     0.00000000E+00   # M_1(Q)          
     2     0.00000000E+00   # M_2(Q)          
     3     0.00000000E+00   # M_3(Q)          
    31     0.00000000E+00   # MeL(Q)          
    32     0.00000000E+00   # MmuL(Q)         
    33     0.00000000E+00   # MtauL(Q)        
    34     0.00000000E+00   # MeR(Q)          
    35     0.00000000E+00   # MmuR(Q)         
    36     0.00000000E+00   # MtauR(Q)        
    41     0.00000000E+00   # MqL1(Q)         
    42     0.00000000E+00   # MqL2(Q)         
    43     0.00000000E+00   # MqL3(Q)         
    44     0.00000000E+00   # MuR(Q)          
    45     0.00000000E+00   # McR(Q)          
    46     0.00000000E+00   # MtR(Q)          
    47     0.00000000E+00   # MdR(Q)          
    48     0.00000000E+00   # MsR(Q)          
    49     0.00000000E+00   # MbR(Q)          
Block AU Q=  0.00000000E+00   #
  1  1     0.00000000E+00   # A_u
  2  2     0.00000000E+00   # A_c
  3  3     0.00000000E+00   # A_t
Block AD Q=  0.00000000E+00   #
  1  1     0.00000000E+00   # A_d
  2  2     0.00000000E+00   # A_s
  3  3     0.00000000E+00   # A_b
Block AE Q=  0.00000000E+00   #
  1  1     0.00000000E+00   # A_e
  2  2     0.00000000E+00   # A_mu
  3  3     0.00000000E+00   # A_tau
#         PDG         Width
DECAY   1000021  5.87354079E-05   # GLSS  decays
#          BR          NDA       ID1       ID2       ID3       ID4
      1.03782928E-04    2      1000022        21                       # GLSS   -->  Z1SS   GL                 
      3.47331345E-01    3      1000022         2        -2             # GLSS   -->  Z1SS   UP     UB          
      1.01806343E-01    3      1000022         1        -1             # GLSS   -->  Z1SS   DN     DB          
      1.01806305E-01    3      1000022         3        -3             # GLSS   -->  Z1SS   ST     SB          
      3.47329944E-01    3      1000022         4        -4             # GLSS   -->  Z1SS   CH     CB          
      1.01517834E-01    3      1000022         5        -5             # GLSS   -->  Z1SS   BT     BB          
      4.95170461E-05    3      1000022         6        -6             # GLSS   -->  Z1SS   TP     TB          
      5.49786018E-05    2      1000039        21                       # GLSS   -->  GVSS   GL                 
#         PDG         Width
DECAY   1000002  4.33850327E+01   # UPL   decays
#          BR          NDA       ID1       ID2       ID3       ID4
      3.22308764E-03    2      1000022         2                       # UPL    -->  Z1SS   UP                 
      9.96776879E-01    2      1000021         2                       # UPL    -->  GLSS   UP                 
#         PDG         Width
DECAY   1000001  4.35700417E+01   # DNL   decays
#          BR          NDA       ID1       ID2       ID3       ID4
      3.24307848E-03    2      1000022         1                       # DNL    -->  Z1SS   DN                 
      9.96756971E-01    2      1000021         1                       # DNL    -->  GLSS   DN                 
#         PDG         Width
DECAY   1000003  4.35700417E+01   # STL   decays
#          BR          NDA       ID1       ID2       ID3       ID4
      3.24307848E-03    2      1000022         3                       # STL    -->  Z1SS   ST                 
      9.96756971E-01    2      1000021         3                       # STL    -->  GLSS   ST                 
#         PDG         Width
DECAY   1000004  4.33848686E+01   # CHL   decays
#          BR          NDA       ID1       ID2       ID3       ID4
      3.22309090E-03    2      1000022         4                       # CHL    -->  Z1SS   CH                 
      9.96776938E-01    2      1000021         4                       # CHL    -->  GLSS   CH                 
#         PDG         Width
DECAY   1000005  4.39050140E+01   # BT1   decays
#          BR          NDA       ID1       ID2       ID3       ID4
      1.28075862E-02    2      1000022         5                       # BT1    -->  Z1SS   BT                 
      9.87192392E-01    2      1000021         5                       # BT1    -->  GLSS   BT                 
#         PDG         Width
DECAY   1000006  4.82837601E+01   # TP1   decays
#          BR          NDA       ID1       ID2       ID3       ID4
      6.23945340E-09    2      1000022         4                       # TP1    -->  Z1SS   CH                 
      9.76277173E-01    2      1000021         6                       # TP1    -->  GLSS   TP                 
      2.37228405E-02    2      1000022         6                       # TP1    -->  Z1SS   TP                 
#         PDG         Width
DECAY   2000002  4.55384293E+01   # UPR   decays
#          BR          NDA       ID1       ID2       ID3       ID4
      4.93561327E-02    2      1000022         2                       # UPR    -->  Z1SS   UP                 
      9.50643897E-01    2      1000021         2                       # UPR    -->  GLSS   UP                 
#         PDG         Width
DECAY   2000001  4.39086304E+01   # DNR   decays
#          BR          NDA       ID1       ID2       ID3       ID4
      1.28070079E-02    2      1000022         1                       # DNR    -->  Z1SS   DN                 
      9.87192929E-01    2      1000021         1                       # DNR    -->  GLSS   DN                 
#         PDG         Width
DECAY   2000003  4.39086418E+01   # STR   decays
#          BR          NDA       ID1       ID2       ID3       ID4
      1.28070060E-02    2      1000022         3                       # STR    -->  Z1SS   ST                 
      9.87192988E-01    2      1000021         3                       # STR    -->  GLSS   ST                 
#         PDG         Width
DECAY   2000004  4.55382614E+01   # CHR   decays
#          BR          NDA       ID1       ID2       ID3       ID4
      4.93561774E-02    2      1000022         4                       # CHR    -->  Z1SS   CH                 
      9.50643837E-01    2      1000021         4                       # CHR    -->  GLSS   CH                 
#         PDG         Width
DECAY   2000005  4.35680695E+01   # BT2   decays
#          BR          NDA       ID1       ID2       ID3       ID4
      3.24340886E-03    2      1000022         5                       # BT2    -->  Z1SS   BT                 
      9.96756613E-01    2      1000021         5                       # BT2    -->  GLSS   BT                 
#         PDG         Width
DECAY   2000006  3.48600922E+01   # TP2   decays
#          BR          NDA       ID1       ID2       ID3       ID4
      8.64209682E-09    2      1000022         4                       # TP2    -->  Z1SS   CH                 
      9.67679143E-01    2      1000021         6                       # TP2    -->  GLSS   TP                 
      3.23209055E-02    2      1000022         6                       # TP2    -->  Z1SS   TP                 
#         PDG         Width
DECAY   1000011  3.22240710E+00   # EL-   decays
#          BR          NDA       ID1       ID2       ID3       ID4
      9.84262943E-01    2      1000022        11                       # EL-    -->  Z1SS   E-                 
      5.34682302E-03    2      1000023        11                       # EL-    -->  Z2SS   E-                 
      1.03807310E-02    2     -1000024        12                       # EL-    -->  W1SS-  NUE                
      9.56363601E-06    2           11   1000039                       # EL-    -->  E-     GVSS               
#         PDG         Width
DECAY   1000013  3.22240710E+00   # MUL-  decays
#          BR          NDA       ID1       ID2       ID3       ID4
      9.84262943E-01    2      1000022        13                       # MUL-   -->  Z1SS   MU-                
      5.34681790E-03    2      1000023        13                       # MUL-   -->  Z2SS   MU-                
      1.03807310E-02    2     -1000024        14                       # MUL-   -->  W1SS-  NUM                
      9.56363601E-06    2           13   1000039                       # MUL-   -->  MU-    GVSS               
#         PDG         Width
DECAY   1000015  1.27032700E+01   # TAU1- decays
#          BR          NDA       ID1       ID2       ID3       ID4
      9.99987543E-01    2      1000022        15                       # TAU1-  -->  Z1SS   TAU-               
      3.65754045E-06    2      1000023        15                       # TAU1-  -->  Z2SS   TAU-               
      6.37783251E-06    2     -1000024        16                       # TAU1-  -->  W1SS-  NUT                
      2.42568422E-06    2           15   1000039                       # TAU1-  -->  TAU-   GVSS               
#         PDG         Width
DECAY   1000012  3.22839093E+00   # NUEL  decays
#          BR          NDA       ID1       ID2       ID3       ID4
      9.84613180E-01    2      1000022        12                       # NUEL   -->  Z1SS   NUE                
      5.00530750E-03    2      1000023        12                       # NUEL   -->  Z2SS   NUE                
      1.03720119E-02    2      1000024        11                       # NUEL   -->  W1SS+  E-                 
      9.52642404E-06    2           12   1000039                       # NUEL   -->  NUE    GVSS               
#         PDG         Width
DECAY   1000014  3.22839093E+00   # NUML  decays
#          BR          NDA       ID1       ID2       ID3       ID4
      9.84613180E-01    2      1000022        14                       # NUML   -->  Z1SS   NUM                
      5.00530750E-03    2      1000023        14                       # NUML   -->  Z2SS   NUM                
      1.03720017E-02    2      1000024        13                       # NUML   -->  W1SS+  MU-                
      9.52642404E-06    2           14   1000039                       # NUML   -->  NUM    GVSS               
#         PDG         Width
DECAY   1000016  3.22837877E+00   # NUTL  decays
#          BR          NDA       ID1       ID2       ID3       ID4
      9.84616876E-01    2      1000022        16                       # NUTL   -->  Z1SS   NUT                
      5.00532612E-03    2      1000023        16                       # NUTL   -->  Z2SS   NUT                
      1.03683183E-02    2      1000024        15                       # NUTL   -->  W1SS+  TAU-               
      9.52646042E-06    2           16   1000039                       # NUTL   -->  NUT    GVSS               
#         PDG         Width
DECAY   2000011  1.27032137E+01   # ER-   decays
#          BR          NDA       ID1       ID2       ID3       ID4
      9.99997139E-01    2      1000022        11                       # ER-    -->  Z1SS   E-                 
      4.38489423E-07    2      1000023        11                       # ER-    -->  Z2SS   E-                 
      2.82060361E-40    3      1000015        12       -16             # ER-    -->  TAU1-  NUE    ANUT        
      2.42576220E-06    2           11   1000039                       # ER-    -->  E-     GVSS               
#         PDG         Width
DECAY   2000013  1.27032137E+01   # MUR-  decays
#          BR          NDA       ID1       ID2       ID3       ID4
      9.99997139E-01    2      1000022        13                       # MUR-   -->  Z1SS   MU-                
      4.38488968E-07    2      1000023        13                       # MUR-   -->  Z2SS   MU-                
      1.20845268E-35    3      1000015        14       -16             # MUR-   -->  TAU1-  NUM    ANUT        
      2.42576220E-06    2           13   1000039                       # MUR-   -->  MU-    GVSS               
#         PDG         Width
DECAY   2000015  3.22241831E+00   # TAU2- decays
#          BR          NDA       ID1       ID2       ID3       ID4
      9.84268427E-01    2      1000022        15                       # TAU2-  -->  Z1SS   TAU-               
      5.34702651E-03    2      1000023        15                       # TAU2-  -->  Z2SS   TAU-               
      1.03845913E-02    2     -1000024        16                       # TAU2-  -->  W1SS-  NUT                
#         PDG         Width
DECAY   1000022  7.34044918E-14   # Z1SS  decays
#          BR          NDA       ID1       ID2       ID3       ID4
      9.81320918E-01    2      1000039        22                       # Z1SS   -->  GVSS   GM                 
      1.86790824E-02    3      1000039        11       -11             # Z1SS   -->  GVSS   E-     E+          
#         PDG         Width
DECAY   1000023  1.05446106E+02   # Z2SS  decays
#          BR          NDA       ID1       ID2       ID3       ID4
      1.10984310E-07    2      1000022        22                       # Z2SS   -->  Z1SS   GM                 
      1.38288888E-03    2      1000022        23                       # Z2SS   -->  Z1SS   Z0                 
      9.21917902E-08    3      1000022         5        -5             # Z2SS   -->  Z1SS   BT     BB          
      6.19979255E-06    3      1000022        11       -11             # Z2SS   -->  Z1SS   E-     E+          
      6.19979255E-06    3      1000022        13       -13             # Z2SS   -->  Z1SS   MU-    MU+         
      6.31477678E-06    3      1000022        15       -15             # Z2SS   -->  Z1SS   TAU-   TAU+        
      6.01582951E-06    3      1000022        12       -12             # Z2SS   -->  Z1SS   NUE    ANUE        
      6.01582951E-06    3      1000022        14       -14             # Z2SS   -->  Z1SS   NUM    ANUM        
      6.01582951E-06    3      1000022        16       -16             # Z2SS   -->  Z1SS   NUT    ANUT        
      6.28688233E-03    2      1000022        25                       # Z2SS   -->  Z1SS   HL0                
      5.06240688E-02    2      1000002        -2                       # Z2SS   -->  UPL    UB                 
      5.06240688E-02    2     -1000002         2                       # Z2SS   -->  UBL    UP                 
      4.99108173E-02    2      1000001        -1                       # Z2SS   -->  DNL    DB                 
      4.99108173E-02    2     -1000001         1                       # Z2SS   -->  DBL    DN                 
      4.99108173E-02    2      1000003        -3                       # Z2SS   -->  STL    SB                 
      4.99108173E-02    2     -1000003         3                       # Z2SS   -->  SBL    ST                 
      5.06240204E-02    2      1000004        -4                       # Z2SS   -->  CHL    CB                 
      5.06240204E-02    2     -1000004         4                       # Z2SS   -->  CBL    CH                 
      7.36773427E-06    2      2000002        -2                       # Z2SS   -->  UPR    UB                 
      7.36773427E-06    2     -2000002         2                       # Z2SS   -->  UBR    UP                 
      1.84077362E-06    2      2000001        -1                       # Z2SS   -->  DNR    DB                 
      1.84077362E-06    2     -2000001         1                       # Z2SS   -->  DBR    DN                 
      1.84077305E-06    2      2000003        -3                       # Z2SS   -->  STR    SB                 
      1.84077305E-06    2     -2000003         3                       # Z2SS   -->  SBR    ST                 
      7.36772699E-06    2      2000004        -4                       # Z2SS   -->  CHR    CB                 
      7.36772699E-06    2     -2000004         4                       # Z2SS   -->  CBR    CH                 
      3.05215653E-04    2      1000005        -5                       # Z2SS   -->  BT1    BB                 
      3.05215653E-04    2     -1000005         5                       # Z2SS   -->  BB1    BT                 
      5.02520353E-02    2      2000005        -5                       # Z2SS   -->  BT2    BB                 
      5.02520353E-02    2     -2000005         5                       # Z2SS   -->  BB2    BT                 
      2.02590704E-01    2      1000006        -6                       # Z2SS   -->  TP1    TB                 
      2.02590704E-01    2     -1000006         6                       # Z2SS   -->  TB1    TP                 
      4.19104360E-02    2      2000006        -6                       # Z2SS   -->  TP2    TB                 
      4.19104360E-02    2     -2000006         6                       # Z2SS   -->  TB2    TP                 
      3.11724406E-08    2      1000039        22                       # Z2SS   -->  GVSS   GM                 
      7.94532495E-10    3      1000039        11       -11             # Z2SS   -->  GVSS   E-     E+          
      1.44695477E-07    2      1000039        23                       # Z2SS   -->  GVSS   Z0                 
      1.20710260E-08    2      1000039        25                       # Z2SS   -->  GVSS   HL0                
#         PDG         Width
DECAY   1000025  7.97950897E+01   # Z3SS  decays
#          BR          NDA       ID1       ID2       ID3       ID4
      1.84633819E-08    2      1000022        22                       # Z3SS   -->  Z1SS   GM                 
      6.61829688E-11    2      1000023        22                       # Z3SS   -->  Z2SS   GM                 
      1.06534435E-05    3     -1000024         2        -1             # Z3SS   -->  W1SS-  UP     DB          
      3.55114798E-06    3     -1000024        12       -11             # Z3SS   -->  W1SS-  NUE    E+          
      3.55114798E-06    3     -1000024        14       -13             # Z3SS   -->  W1SS-  NUM    MU+         
      1.06534435E-05    3      1000024         1        -2             # Z3SS   -->  W1SS+  DN     UB          
      3.55114798E-06    3      1000024        11       -12             # Z3SS   -->  W1SS+  E-     ANUE        
      3.55114798E-06    3      1000024        13       -14             # Z3SS   -->  W1SS+  MU-    ANUM        
      1.06534435E-05    3     -1000024         4        -3             # Z3SS   -->  W1SS-  CH     SB          
      3.55114798E-06    3     -1000024        16       -15             # Z3SS   -->  W1SS-  NUT    TAU+        
      1.06534435E-05    3      1000024         3        -4             # Z3SS   -->  W1SS+  ST     CB          
      3.55114798E-06    3      1000024        15       -16             # Z3SS   -->  W1SS+  TAU-   ANUT        
      1.68026760E-02    2      1000022        23                       # Z3SS   -->  Z1SS   Z0                 
      3.19132482E-07    3      1000022         5        -5             # Z3SS   -->  Z1SS   BT     BB          
      4.18905337E-08    3      1000022        15       -15             # Z3SS   -->  Z1SS   TAU-   TAU+        
      2.37743234E-06    3      1000023         2        -2             # Z3SS   -->  Z2SS   UP     UB          
      3.06571474E-06    3      1000023         1        -1             # Z3SS   -->  Z2SS   DN     DB          
      3.06571474E-06    3      1000023         3        -3             # Z3SS   -->  Z2SS   ST     SB          
      2.37743234E-06    3      1000023         4        -4             # Z3SS   -->  Z2SS   CH     CB          
      2.96281769E-06    3      1000023         5        -5             # Z3SS   -->  Z2SS   BT     BB          
      6.95455867E-07    3      1000023        11       -11             # Z3SS   -->  Z2SS   E-     E+          
      6.95455867E-07    3      1000023        13       -13             # Z3SS   -->  Z2SS   MU-    MU+         
      6.90903960E-07    3      1000023        15       -15             # Z3SS   -->  Z2SS   TAU-   TAU+        
      1.38373844E-06    3      1000023        12       -12             # Z3SS   -->  Z2SS   NUE    ANUE        
      1.38373844E-06    3      1000023        14       -14             # Z3SS   -->  Z2SS   NUM    ANUM        
      1.38373844E-06    3      1000023        16       -16             # Z3SS   -->  Z2SS   NUT    ANUT        
      3.80570581E-03    2      1000022        25                       # Z3SS   -->  Z1SS   HL0                
      4.65924586E-06    2      1000002        -2                       # Z3SS   -->  UPL    UB                 
      4.65924586E-06    2     -1000002         2                       # Z3SS   -->  UBL    UP                 
      1.03513339E-05    2      1000001        -1                       # Z3SS   -->  DNL    DB                 
      1.03513339E-05    2     -1000001         1                       # Z3SS   -->  DBL    DN                 
      1.03513339E-05    2      1000003        -3                       # Z3SS   -->  STL    SB                 
      1.03513339E-05    2     -1000003         3                       # Z3SS   -->  SBL    ST                 
      4.65924177E-06    2      1000004        -4                       # Z3SS   -->  CHL    CB                 
      4.65924177E-06    2     -1000004         4                       # Z3SS   -->  CBL    CH                 
      4.50877815E-06    2      2000002        -2                       # Z3SS   -->  UPR    UB                 
      4.50877815E-06    2     -2000002         2                       # Z3SS   -->  UBR    UP                 
      1.12653231E-06    2      2000001        -1                       # Z3SS   -->  DNR    DB                 
      1.12653231E-06    2     -2000001         1                       # Z3SS   -->  DBR    DN                 
      1.12653231E-06    2      2000003        -3                       # Z3SS   -->  STR    SB                 
      1.12653231E-06    2     -2000003         3                       # Z3SS   -->  SBR    ST                 
      4.50877405E-06    2      2000004        -4                       # Z3SS   -->  CHR    CB                 
      4.50877405E-06    2     -2000004         4                       # Z3SS   -->  CBR    CH                 
      8.36774474E-04    2      1000005        -5                       # Z3SS   -->  BT1    BB                 
      8.36774474E-04    2     -1000005         5                       # Z3SS   -->  BB1    BT                 
      8.45847535E-04    2      2000005        -5                       # Z3SS   -->  BT2    BB                 
      8.45847535E-04    2     -2000005         5                       # Z3SS   -->  BB2    BT                 
      2.06099749E-01    2      1000006        -6                       # Z3SS   -->  TP1    TB                 
      2.06099749E-01    2     -1000006         6                       # Z3SS   -->  TB1    TP                 
      2.81829834E-01    2      2000006        -6                       # Z3SS   -->  TP2    TB                 
      2.81829834E-01    2     -2000006         6                       # Z3SS   -->  TB2    TP                 
      1.11393493E-15    2      1000011       -11                       # Z3SS   -->  EL-    E+                 
      1.11393493E-15    2     -1000011        11                       # Z3SS   -->  EL+    E-                 
      3.26908470E-14    2      2000011       -11                       # Z3SS   -->  ER-    E+                 
      3.26908470E-14    2     -2000011        11                       # Z3SS   -->  ER+    E-                 
      6.41964390E-12    2      1000012       -12                       # Z3SS   -->  NUEL   ANUE               
      6.41964390E-12    2     -1000012        12                       # Z3SS   -->  ANUEL  NUE                
      6.41964390E-12    2      1000014       -14                       # Z3SS   -->  NUML   ANUM               
      6.41964390E-12    2     -1000014        14                       # Z3SS   -->  ANUML  NUM                
      6.41964390E-12    2      1000016       -16                       # Z3SS   -->  NUTL   ANUT               
      6.41964390E-12    2     -1000016        16                       # Z3SS   -->  ANUTL  NUT                
      4.28048222E-12    2      1000039        22                       # Z3SS   -->  GVSS   GM                 
      1.09309236E-13    3      1000039        11       -11             # Z3SS   -->  GVSS   E-     E+          
      3.84803833E-08    2      1000039        23                       # Z3SS   -->  GVSS   Z0                 
      1.53212810E-07    2      1000039        25                       # Z3SS   -->  GVSS   HL0                
      1.81873752E-21    2      1000039        36                       # Z3SS   -->  GVSS   HA0                
#         PDG         Width
DECAY   1000035  1.09720901E+02   # Z4SS  decays
#          BR          NDA       ID1       ID2       ID3       ID4
      5.94667249E-09    2      1000022        22                       # Z4SS   -->  Z1SS   GM                 
      3.76138842E-10    2      1000023        22                       # Z4SS   -->  Z2SS   GM                 
      1.26568001E-09    2      1000025        22                       # Z4SS   -->  Z3SS   GM                 
      9.23322234E-03    2      1000024       -24                       # Z4SS   -->  W1SS+  W-                 
      9.23322234E-03    2     -1000024        24                       # Z4SS   -->  W1SS-  W+                 
      1.49572582E-03    2      1000022        23                       # Z4SS   -->  Z1SS   Z0                 
      3.15665438E-10    2      1000023        23                       # Z4SS   -->  Z2SS   Z0                 
      2.09980076E-16    3      1000023         5        -5             # Z4SS   -->  Z2SS   BT     BB          
      2.78539572E-17    3      1000023        15       -15             # Z4SS   -->  Z2SS   TAU-   TAU+        
      1.75109506E-06    3      1000025         2        -2             # Z4SS   -->  Z3SS   UP     UB          
      2.25804865E-06    3      1000025         1        -1             # Z4SS   -->  Z3SS   DN     DB          
      2.25804865E-06    3      1000025         3        -3             # Z4SS   -->  Z3SS   ST     SB          
      1.75109506E-06    3      1000025         4        -4             # Z4SS   -->  Z3SS   CH     CB          
      2.18346804E-06    3      1000025         5        -5             # Z4SS   -->  Z3SS   BT     BB          
      5.12237193E-07    3      1000025        11       -11             # Z4SS   -->  Z3SS   E-     E+          
      5.12237193E-07    3      1000025        13       -13             # Z4SS   -->  Z3SS   MU-    MU+         
      5.09171741E-07    3      1000025        15       -15             # Z4SS   -->  Z3SS   TAU-   TAU+        
      1.01919079E-06    3      1000025        12       -12             # Z4SS   -->  Z3SS   NUE    ANUE        
      1.01919079E-06    3      1000025        14       -14             # Z4SS   -->  Z3SS   NUM    ANUM        
      1.01919079E-06    3      1000025        16       -16             # Z4SS   -->  Z3SS   NUT    ANUT        
      5.95945213E-03    2      1000022        25                       # Z4SS   -->  Z1SS   HL0                
      1.85127976E-06    2      1000022        35                       # Z4SS   -->  Z1SS   HH0                
      3.86855845E-06    2      1000022        36                       # Z4SS   -->  Z1SS   HA0                
      6.21205913E-08    2      1000023        25                       # Z4SS   -->  Z2SS   HL0                
      5.29274046E-02    2      1000002        -2                       # Z4SS   -->  UPL    UB                 
      5.29274046E-02    2     -1000002         2                       # Z4SS   -->  UBL    UP                 
      5.34453280E-02    2      1000001        -1                       # Z4SS   -->  DNL    DB                 
      5.34453280E-02    2     -1000001         1                       # Z4SS   -->  DBL    DN                 
      5.34453280E-02    2      1000003        -3                       # Z4SS   -->  STL    SB                 
      5.34453280E-02    2     -1000003         3                       # Z4SS   -->  SBL    ST                 
      5.29273599E-02    2      1000004        -4                       # Z4SS   -->  CHL    CB                 
      5.29273599E-02    2     -1000004         4                       # Z4SS   -->  CBL    CH                 
      7.10652284E-06    2      2000002        -2                       # Z4SS   -->  UPR    UB                 
      7.10652284E-06    2     -2000002         2                       # Z4SS   -->  UBR    UP                 
      1.77565494E-06    2      2000001        -1                       # Z4SS   -->  DNR    DB                 
      1.77565494E-06    2     -2000001         1                       # Z4SS   -->  DBR    DN                 
      1.77565494E-06    2      2000003        -3                       # Z4SS   -->  STR    SB                 
      1.77565494E-06    2     -2000003         3                       # Z4SS   -->  SBR    ST                 
      7.10651739E-06    2      2000004        -4                       # Z4SS   -->  CHR    CB                 
      7.10651739E-06    2     -2000004         4                       # Z4SS   -->  CBR    CH                 
      3.17020516E-04    2      1000005        -5                       # Z4SS   -->  BT1    BB                 
      3.17020516E-04    2     -1000005         5                       # Z4SS   -->  BB1    BT                 
      5.37222587E-02    2      2000005        -5                       # Z4SS   -->  BT2    BB                 
      5.37222587E-02    2     -2000005         5                       # Z4SS   -->  BB2    BT                 
      5.39913923E-02    2      1000006        -6                       # Z4SS   -->  TP1    TB                 
      5.39913923E-02    2     -1000006         6                       # Z4SS   -->  TB1    TP                 
      1.65778413E-01    2      2000006        -6                       # Z4SS   -->  TP2    TB                 
      1.65778413E-01    2     -2000006         6                       # Z4SS   -->  TB2    TP                 
      7.37010851E-05    2      1000011       -11                       # Z4SS   -->  EL-    E+                 
      7.37010851E-05    2     -1000011        11                       # Z4SS   -->  EL+    E-                 
      7.37010050E-05    2      1000013       -13                       # Z4SS   -->  MUL-   MU+                
      7.37010050E-05    2     -1000013        13                       # Z4SS   -->  MUL+   MU-                
      2.25655761E-08    2      2000011       -11                       # Z4SS   -->  ER-    E+                 
      2.25655761E-08    2     -2000011        11                       # Z4SS   -->  ER+    E-                 
      2.25655512E-08    2      2000013       -13                       # Z4SS   -->  MUR-   MU+                
      2.25655512E-08    2     -2000013        13                       # Z4SS   -->  MUR+   MU-                
      1.94853726E-07    2      1000015       -15                       # Z4SS   -->  TAU1-  TAU+               
      1.94853726E-07    2     -1000015        15                       # Z4SS   -->  TAU1+  TAU-               
      7.36465299E-05    2      2000015       -15                       # Z4SS   -->  TAU2-  TAU+               
      7.36465299E-05    2     -2000015        15                       # Z4SS   -->  TAU2+  TAU-               
      7.84496078E-05    2      1000012       -12                       # Z4SS   -->  NUEL   ANUE               
      7.84496078E-05    2     -1000012        12                       # Z4SS   -->  ANUEL  NUE                
      7.84496078E-05    2      1000014       -14                       # Z4SS   -->  NUML   ANUM               
      7.84496078E-05    2     -1000014        14                       # Z4SS   -->  ANUML  NUM                
      7.84496078E-05    2      1000016       -16                       # Z4SS   -->  NUTL   ANUT               
      7.84496078E-05    2     -1000016        16                       # Z4SS   -->  ANUTL  NUT                
      3.53327252E-08    2      1000039        22                       # Z4SS   -->  GVSS   GM                 
      9.03941866E-10    3      1000039        11       -11             # Z4SS   -->  GVSS   E-     E+          
      1.90536809E-07    2      1000039        23                       # Z4SS   -->  GVSS   Z0                 
      1.64912528E-08    2      1000039        25                       # Z4SS   -->  GVSS   HL0                
      2.01754873E-13    2      1000039        35                       # Z4SS   -->  GVSS   HH0                
      1.49336516E-13    2      1000039        36                       # Z4SS   -->  GVSS   HA0                
#         PDG         Width
DECAY   1000024  1.05586365E+02   # W1SS+ decays
#          BR          NDA       ID1       ID2       ID3       ID4
      1.21474095E-05    3      1000022       -11        12             # W1SS+  -->  Z1SS   E+     NUE         
      1.21474095E-05    3      1000022       -13        14             # W1SS+  -->  Z1SS   MU+    NUM         
      1.22622168E-05    3      1000022       -15        16             # W1SS+  -->  Z1SS   TAU+   NUT         
      7.67045282E-03    2      1000022        24                       # W1SS+  -->  Z1SS   W+                 
      1.01672456E-01    2      1000002        -1                       # W1SS+  -->  UPL    DB                 
      9.85829905E-02    2     -1000001         2                       # W1SS+  -->  DBL    UP                 
      1.01672381E-01    2      1000004        -3                       # W1SS+  -->  CHL    SB                 
      9.87887606E-02    2     -1000003         4                       # W1SS+  -->  SBL    CH                 
      2.68495023E-01    2      1000006        -5                       # W1SS+  -->  TP1    BB                 
      6.01791125E-03    2      2000006        -5                       # W1SS+  -->  TP2    BB                 
      6.06434769E-04    2     -1000005         6                       # W1SS+  -->  BB1    TP                 
      3.16457063E-01    2     -2000005         6                       # W1SS+  -->  BB2    TP                 
#         PDG         Width
DECAY   1000037  1.09789574E+02   # W2SS+ decays
#          BR          NDA       ID1       ID2       ID3       ID4
      7.41612911E-03    2      1000022        24                       # W2SS+  -->  Z1SS   W+                 
      2.56789076E-06    2      1000022        37                       # W2SS+  -->  Z1SS   H+                 
      6.70121985E-14    3      1000023       -15        16             # W2SS+  -->  Z2SS   TAU+   NUT         
      9.26914625E-03    2      1000023        24                       # W2SS+  -->  Z2SS   W+                 
      7.51912512E-06    3      1000025         2        -1             # W2SS+  -->  Z3SS   UP     DB          
      7.51912512E-06    3      1000025         4        -3             # W2SS+  -->  Z3SS   CH     SB          
      2.50637504E-06    3      1000025       -11        12             # W2SS+  -->  Z3SS   E+     NUE         
      2.50637504E-06    3      1000025       -13        14             # W2SS+  -->  Z3SS   MU+    NUM         
      2.50637504E-06    3      1000025       -15        16             # W2SS+  -->  Z3SS   TAU+   NUT         
      1.05141714E-01    2      1000002        -1                       # W2SS+  -->  UPL    DB                 
      1.08014144E-01    2     -1000001         2                       # W2SS+  -->  DBL    UP                 
      1.05141640E-01    2      1000004        -3                       # W2SS+  -->  CHL    SB                 
      1.08210690E-01    2     -1000003         4                       # W2SS+  -->  SBL    CH                 
      5.68397949E-03    2      1000006        -5                       # W2SS+  -->  TP1    BB                 
      2.88818717E-01    2      2000006        -5                       # W2SS+  -->  TP2    BB                 
      6.27623755E-04    2     -1000005         6                       # W2SS+  -->  BB1    TP                 
      2.53135324E-01    2     -2000005         6                       # W2SS+  -->  BB2    TP                 
      1.51574641E-04    2      1000012       -11                       # W2SS+  -->  NUEL   E+                 
      1.51574466E-04    2      1000014       -13                       # W2SS+  -->  NUML   MU+                
      1.51524000E-04    2      1000016       -15                       # W2SS+  -->  NUTL   TAU+               
      1.51716114E-04    2     -1000011        12                       # W2SS+  -->  EL+    NUE                
      1.51716114E-04    2     -1000013        14                       # W2SS+  -->  MUL+   NUM                
      3.48143828E-07    2     -1000015        16                       # W2SS+  -->  TAU1+  NUT                
      1.51658198E-04    2     -2000015        16                       # W2SS+  -->  TAU2+  NUT                
      7.60517782E-03    2      1000024        23                       # W2SS+  -->  W1SS+  Z0                 
      5.51258836E-07    2      1000024        25                       # W2SS+  -->  W1SS+  HL0                
#         PDG         Width
DECAY        25  4.48178081E-03   # HL0   decays
#          BR          NDA       ID1       ID2       ID3       ID4
      4.58439953E-09    2           11       -11                       # HL0    -->  E-     E+                 
      1.93560743E-04    2           13       -13                       # HL0    -->  MU-    MU+                
      5.53664528E-02    2           15       -15                       # HL0    -->  TAU-   TAU+               
      5.75002377E-06    2            1        -1                       # HL0    -->  DN     DB                 
      2.32329802E-03    2            3        -3                       # HL0    -->  ST     SB                 
      7.56777525E-01    2            5        -5                       # HL0    -->  BT     BB                 
      1.82961173E-06    2            2        -2                       # HL0    -->  UP     UB                 
      3.42055410E-02    2            4        -4                       # HL0    -->  CH     CB                 
      1.99273438E-03    2           22        22                       # HL0    -->  GM     GM                 
      4.07512859E-02    2           21        21                       # HL0    -->  GL     GL                 
      5.41989924E-03    3           24        11       -12             # HL0    -->  W+     E-     ANUE        
      5.41989924E-03    3           24        13       -14             # HL0    -->  W+     MU-    ANUM        
      5.41989924E-03    3           24        15       -16             # HL0    -->  W+     TAU-   ANUT        
      1.62596982E-02    3           24        -2         1             # HL0    -->  W+     UB     DN          
      1.62596982E-02    3           24        -4         3             # HL0    -->  W+     CB     ST          
      5.41989924E-03    3          -24       -11        12             # HL0    -->  W-     E+     NUE         
      5.41989924E-03    3          -24       -13        14             # HL0    -->  W-     MU+    NUM         
      5.41989924E-03    3          -24       -15        16             # HL0    -->  W-     TAU+   NUT         
      1.62596982E-02    3          -24         2        -1             # HL0    -->  W-     UP     DB          
      1.62596982E-02    3          -24         4        -3             # HL0    -->  W-     CH     SB          
      6.37157180E-04    3           23        12       -12             # HL0    -->  Z0     NUE    ANUE        
      6.37157180E-04    3           23        14       -14             # HL0    -->  Z0     NUM    ANUM        
      6.37157180E-04    3           23        16       -16             # HL0    -->  Z0     NUT    ANUT        
      3.20674793E-04    3           23        11       -11             # HL0    -->  Z0     E-     E+          
      3.20674793E-04    3           23        13       -13             # HL0    -->  Z0     MU-    MU+         
      3.20674793E-04    3           23        15       -15             # HL0    -->  Z0     TAU-   TAU+        
      1.09860464E-03    3           23         2        -2             # HL0    -->  Z0     UP     UB          
      1.09860464E-03    3           23         4        -4             # HL0    -->  Z0     CH     CB          
      1.41527341E-03    3           23         1        -1             # HL0    -->  Z0     DN     DB          
      1.41527341E-03    3           23         3        -3             # HL0    -->  Z0     ST     SB          
      1.41527341E-03    3           23         5        -5             # HL0    -->  Z0     BT     BB          
      1.50775921E-03    2      1000022   1000022                       # HL0    -->  Z1SS   Z1SS               
#         PDG         Width
DECAY        35  9.08439789E+01   # HH0   decays
#          BR          NDA       ID1       ID2       ID3       ID4
      4.23644175E-11    2           11       -11                       # HH0    -->  E-     E+                 
      1.78870209E-06    2           13       -13                       # HH0    -->  MU-    MU+                
      5.12310187E-04    2           15       -15                       # HH0    -->  TAU-   TAU+               
      5.15363112E-08    2            1        -1                       # HH0    -->  DN     DB                 
      2.08232777E-05    2            3        -3                       # HH0    -->  ST     SB                 
      4.63105179E-03    2            5        -5                       # HH0    -->  BT     BB                 
      2.04715453E-10    2            2        -2                       # HH0    -->  UP     UB                 
      2.59993544E-06    2            4        -4                       # HH0    -->  CH     CB                 
      1.34267300E-01    2            6        -6                       # HH0    -->  TP     TB                 
      3.06848392E-07    2           22        22                       # HH0    -->  GM     GM                 
      4.12620357E-05    2           21        21                       # HH0    -->  GL     GL                 
      3.96609394E-05    2           24       -24                       # HH0    -->  W+     W-                 
      2.03219643E-05    2           23        23                       # HH0    -->  Z0     Z0                 
      1.40893444E-05    2      1000022   1000022                       # HH0    -->  Z1SS   Z1SS               
      7.28389296E-06    2      1000022   1000023                       # HH0    -->  Z1SS   Z2SS               
      2.53124982E-02    2           25        25                       # HH0    -->  HL0    HL0                
      3.17097256E-05    2      1000002  -1000002                       # HH0    -->  UPL    UBL                
      6.35388369E-06    2      2000002  -2000002                       # HH0    -->  UPR    UBR                
      3.16875667E-05    2      1000004  -1000004                       # HH0    -->  CHL    CBL                
      6.34398566E-06    2      2000004  -2000004                       # HH0    -->  CHR    CBR                
      4.72948741E-05    2      1000001  -1000001                       # HH0    -->  DNL    DBL                
      1.58637533E-06    2      2000001  -2000001                       # HH0    -->  DNR    DBR                
      4.73001237E-05    2      1000003  -1000003                       # HH0    -->  STL    SBL                
      1.58541445E-06    2      2000003  -2000003                       # HH0    -->  STR    SBR                
      1.40390682E-06    2      1000005  -1000005                       # HH0    -->  BT1    BB1                
      4.83284493E-05    2      2000005  -2000005                       # HH0    -->  BT2    BB2                
      1.25308409E-02    2      1000005  -2000005                       # HH0    -->  BT1    BB2                
      1.25308409E-02    2      2000005  -1000005                       # HH0    -->  BT2    BB1                
      4.27658558E-01    2      1000006  -1000006                       # HH0    -->  TP1    TB1                
      3.81628931E-01    2      2000006  -2000006                       # HH0    -->  TP2    TB2                
      2.77993735E-04    2      1000006  -2000006                       # HH0    -->  TP1    TB2                
      2.77993735E-04    2      2000006  -1000006                       # HH0    -->  TP2    TB1                
#         PDG         Width
DECAY        36  8.80620575E+01   # HA0   decays
#          BR          NDA       ID1       ID2       ID3       ID4
      4.34197088E-11    2           11       -11                       # HA0    -->  E-     E+                 
      1.83325858E-06    2           13       -13                       # HA0    -->  MU-    MU+                
      5.25072799E-04    2           15       -15                       # HA0    -->  TAU-   TAU+               
      5.28226742E-08    2            1        -1                       # HA0    -->  DN     DB                 
      2.13430321E-05    2            3        -3                       # HA0    -->  ST     SB                 
      4.75028716E-03    2            5        -5                       # HA0    -->  BT     BB                 
      2.08660977E-10    2            2        -2                       # HA0    -->  UP     UB                 
      2.65206268E-06    2            4        -4                       # HA0    -->  CH     CB                 
      1.38938084E-01    2            6        -6                       # HA0    -->  TP     TB                 
      3.14362495E-07    2           22        22                       # HA0    -->  GM     GM                 
      4.10934808E-05    2           21        21                       # HA0    -->  GL     GL                 
      2.31550748E-05    2      1000022   1000022                       # HA0    -->  Z1SS   Z1SS               
      5.98174447E-05    2      1000022   1000023                       # HA0    -->  Z1SS   Z2SS               
      4.03893173E-05    2           25        23                       # HA0    -->  HL0    Z0                 
      5.22230315E-10    2      1000002  -2000002                       # HA0    -->  UPL    UBR                
      5.22230315E-10    2      2000002  -1000002                       # HA0    -->  UPR    UBL                
      3.03495908E-05    2      1000004  -2000004                       # HA0    -->  CHL    CBR                
      3.03495908E-05    2      2000004  -1000004                       # HA0    -->  CHR    CBL                
      1.62732028E-09    2      1000001  -2000001                       # HA0    -->  DNL    DBR                
      1.62732028E-09    2      2000001  -1000001                       # HA0    -->  DNR    DBL                
      6.57519706E-07    2      1000003  -2000003                       # HA0    -->  STL    SBR                
      6.57519706E-07    2      2000003  -1000003                       # HA0    -->  STR    SBL                
      1.28583340E-02    2      1000005  -2000005                       # HA0    -->  BT1    BB2                
      1.28583340E-02    2      2000005  -1000005                       # HA0    -->  BT2    BB1                
      4.14908588E-01    2      1000006  -2000006                       # HA0    -->  TP1    TB2                
      4.14908588E-01    2      2000006  -1000006                       # HA0    -->  TP2    TB1                
#         PDG         Width
DECAY        37  8.80698471E+01   # H+    decays
#          BR          NDA       ID1       ID2       ID3       ID4
      4.37016465E-11    2           12       -11                       # H+     -->  NUE    E+                 
      1.84516239E-06    2           14       -13                       # H+     -->  NUM    MU+                
      5.28482255E-04    2           16       -15                       # H+     -->  NUT    TAU+               
      4.94037415E-08    2            2        -1                       # H+     -->  UP     DB                 
      2.23519546E-05    2            4        -3                       # H+     -->  CH     SB                 
      1.33173347E-01    2            6        -5                       # H+     -->  TP     BB                 
      1.02242593E-04    2      1000024   1000022                       # H+     -->  W1SS+  Z1SS               
      4.06935360E-05    2           25        24                       # H+     -->  HL0    W+                 
      8.05027303E-05    2      1000002  -1000001                       # H+     -->  UPL    DBL                
      3.27766481E-09    2      2000002  -2000001                       # H+     -->  UPR    DBR                
      8.04725496E-05    2      1000004  -1000003                       # H+     -->  CHL    SBL                
      1.32434127E-06    2      2000004  -2000003                       # H+     -->  CHR    SBR                
      1.36359204E-02    2      1000006  -1000005                       # H+     -->  TP1    BB1                
      4.16596711E-01    2      1000006  -2000005                       # H+     -->  TP1    BB2                
      1.20371105E-02    2      2000006  -1000005                       # H+     -->  TP2    BB1                
      4.23698962E-01    2      2000006  -2000005                       # H+     -->  TP2    BB2                
