#  ISAJET SUSY parameters in SUSY Les Houches Accord 2 format
#  Created by ISALHA 2.0 Last revision: C. Balazs 21 Apr 2009
Block SPINFO   # Program information
     1   ISASUGRA from ISAJET          # Spectrum Calculator
     2   7.80   29-OCT-2009 12:50:36   # Version number
Block MODSEL   # Model selection
     1     1   # Minimal supergravity (mSUGRA) model               
Block SMINPUTS   # Standard Model inputs
     1     1.27841125E+02   # alpha_em^(-1)
     2     1.16570000E-05   # G_Fermi
     3     1.17200002E-01   # alpha_s(M_Z)
     4     9.11699982E+01   # m_{Z}(pole)
     5     4.19999981E+00   # m_{b}(m_{b})
     6     1.72500000E+02   # m_{top}(pole)
     7     1.77699995E+00   # m_{tau}(pole)
Block MINPAR   # SUSY breaking input parameters
     1     1.86000000E+03   # m_0
     2     2.40000000E+02   # m_{1/2}
     3     1.00000000E+01   # tan(beta)
     4     1.00000000E+00   # sign(mu)
     5     0.00000000E+00   # A_0
Block EXTPAR   # Non-universal SUSY breaking parameters
     0     2.36145419E+16   # Input scale
Block MASS   # Scalar and gaugino mass spectrum
#  PDG code   mass                 particle
        24     8.04229965E+01   #  W^+
        25     1.13998352E+02   #  h^0            
        35     1.87842786E+03   #  H^0            
        36     1.86605334E+03   #  A^0            
        37     1.88019543E+03   #  H^+            
   1000001     1.90728357E+03   #  dnl            
   1000002     1.90560083E+03   #  upl            
   1000003     1.90728357E+03   #  stl            
   1000004     1.90560132E+03   #  chl            
   1000005     1.56338354E+03   #  b1             
   1000006     1.12483057E+03   #  t1             
   1000011     1.86300256E+03   #  el-            
   1000012     1.86183044E+03   #  nuel           
   1000013     1.86300256E+03   #  mul-           
   1000014     1.86183044E+03   #  numl           
   1000015     1.84298425E+03   #  tau1           
   1000016     1.85339795E+03   #  nutl           
   1000021     6.73047424E+02   #  glss           
   1000022     9.79194107E+01   #  z1ss           
   1000023     1.82236923E+02   #  z2ss           
   1000024     1.83124496E+02   #  w1ss           
   1000025    -3.51610779E+02   #  z3ss           
   1000035     3.72789581E+02   #  z4ss           
   1000037     3.71734314E+02   #  w2ss           
   2000001     1.91005212E+03   #  dnr            
   2000002     1.90902942E+03   #  upr            
   2000003     1.91005212E+03   #  str            
   2000004     1.90902979E+03   #  chr            
   2000005     1.89083118E+03   #  b2             
   2000006     1.57345679E+03   #  t2             
   2000011     1.86043372E+03   #  er-            
   2000013     1.86043372E+03   #  mur-           
   2000015     1.85457092E+03   #  tau2           
Block ALPHA   # Effective Higgs mixing parameter
         -1.00256160E-01   # alpha
Block STOPMIX   # stop mixing matrix
  1  1     4.49730568E-02   # O_{11}
  1  2     9.98988211E-01   # O_{12}
  2  1    -9.98988211E-01   # O_{21}
  2  2     4.49730568E-02   # O_{22}
Block SBOTMIX   # sbottom mixing matrix
  1  1     9.99945343E-01   # O_{11}
  1  2     1.04529215E-02   # O_{12}
  2  1    -1.04529215E-02   # O_{21}
  2  2     9.99945343E-01   # O_{22}
Block STAUMIX   # stau mixing matrix
  1  1     1.93686083E-01   # O_{11}
  1  2     9.81063545E-01   # O_{12}
  2  1    -9.81063545E-01   # O_{21}
  2  2     1.93686083E-01   # O_{22}
Block NMIX   # neutralino mixing matrix
  1  1     9.85286057E-01   #
  1  2    -5.70462942E-02   #
  1  3     1.50935188E-01   #
  1  4    -5.63507974E-02   #
  2  1    -1.08589329E-01   #
  2  2    -9.34248924E-01   #
  2  3     2.89279163E-01   #
  2  4    -1.78057685E-01   #
  3  1    -6.08692430E-02   #
  3  2     8.70038942E-02   #
  3  3     6.95530951E-01   #
  3  4     7.10606754E-01   #
  4  1    -1.17108747E-01   #
  4  2     3.41108024E-01   #
  4  3     6.40134871E-01   #
  4  4    -6.78349435E-01   #
Block UMIX   # chargino U mixing matrix
  1  1    -9.11464036E-01   # U_{11}
  1  2     4.11379725E-01   # U_{12}
  2  1    -4.11379725E-01   # U_{21}
  2  2    -9.11464036E-01   # U_{22}
Block VMIX   # chargino V mixing matrix
  1  1    -9.67939556E-01   # V_{11}
  1  2     2.51183212E-01   # V_{12}
  2  1    -2.51183212E-01   # V_{21}
  2  2    -9.67939556E-01   # V_{22}
Block GAUGE Q=  1.31384070E+03   #
     1     3.57504725E-01   # g`
     2     6.52447939E-01   # g_2
     3     1.22029459E+00   # g_3
Block YU Q=  1.31384070E+03   #
  3  3     8.60005558E-01   # y_t
Block YD Q=  1.31384070E+03   #
  3  3     1.33476019E-01   # y_b
Block YE Q=  1.31384070E+03   #
  3  3     1.01723731E-01   # y_tau
Block HMIX Q=  1.31384070E+03   # Higgs mixing parameters
     1     3.40832794E+02   # mu(Q)
     2     1.00000000E+01   # tan(beta)(M_GUT)
     3     2.51343079E+02   # Higgs vev at Q
     4     3.48215500E+06   # m_A^2(Q)
Block MSOFT Q=  1.31384070E+03   # DRbar SUSY breaking parameters
     1     1.01217453E+02   # M_1(Q)          
     2     1.87736755E+02   # M_2(Q)          
     3     5.65275269E+02   # M_3(Q)          
    31     1.85671460E+03   # MeL(Q)          
    32     1.85671460E+03   # MmuL(Q)         
    33     1.84847546E+03   # MtauL(Q)        
    34     1.85814978E+03   # MeR(Q)          
    35     1.85814978E+03   # MmuR(Q)         
    36     1.84160254E+03   # MtauR(Q)        
    41     1.87492285E+03   # MqL1(Q)         
    42     1.87492285E+03   # MqL2(Q)         
    43     1.53917834E+03   # MqL3(Q)         
    44     1.87790759E+03   # MuR(Q)          
    45     1.87790759E+03   # McR(Q)          
    46     1.12149268E+03   # MtR(Q)          
    47     1.87841858E+03   # MdR(Q)          
    48     1.87841858E+03   # MsR(Q)          
    49     1.86435254E+03   # MbR(Q)          
Block AU Q=  1.31384070E+03   #
  1  1    -4.11095001E+02   # A_u
  2  2    -4.11095001E+02   # A_c
  3  3    -4.11095001E+02   # A_t
Block AD Q=  1.31384070E+03   #
  1  1    -6.09959961E+02   # A_d
  2  2    -6.09959961E+02   # A_s
  3  3    -6.09959961E+02   # A_b
Block AE Q=  1.31384070E+03   #
  1  1    -1.42219650E+02   # A_e
  2  2    -1.42219650E+02   # A_mu
  3  3    -1.42219650E+02   # A_tau
#  ISAJET decay tables in SUSY Les Houches accord format
#  Created by ISALHD. Last revision: C. Balazs, 2005 May 25
Block DCINFO                           # Program information
     1   ISASUGRA from ISAJET          # Spectrum Calculator
     2   7.80   29-OCT-2009 12:50:36   # Version number
#         PDG         Width
DECAY         6  1.14680779E+00   # TP    decays
#          BR          NDA       ID1       ID2       ID3       ID4
      3.33333343E-01    3            2        -1         5             # TP     -->  UP     DB     BT          
      3.33333343E-01    3            4        -3         5             # TP     -->  CH     SB     BT          
      1.11111112E-01    3          -11        12         5             # TP     -->  E+     NUE    BT          
      1.11111112E-01    3          -13        14         5             # TP     -->  MU+    NUM    BT          
      1.11111112E-01    3          -15        16         5             # TP     -->  TAU+   NUT    BT          
#         PDG         Width
DECAY   1000021  5.79130370E-04   # GLSS  decays
#          BR          NDA       ID1       ID2       ID3       ID4
      7.54821002E-02    3      1000024         1        -2             # GLSS   -->  W1SS+  DN     UB          
      7.54821002E-02    3     -1000024         2        -1             # GLSS   -->  W1SS-  UP     DB          
      7.54820630E-02    3      1000024         3        -4             # GLSS   -->  W1SS+  ST     CB          
      7.54820630E-02    3     -1000024         4        -3             # GLSS   -->  W1SS-  CH     SB          
      6.03550747E-02    3      1000024         5        -6             # GLSS   -->  W1SS+  BT     TB          
      6.03550747E-02    3     -1000024         6        -5             # GLSS   -->  W1SS-  TP     BB          
      1.93442649E-03    3      1000037         1        -2             # GLSS   -->  W2SS+  DN     UB          
      1.93442649E-03    3     -1000037         2        -1             # GLSS   -->  W2SS-  UP     DB          
      1.93442567E-03    3      1000037         3        -4             # GLSS   -->  W2SS+  ST     CB          
      1.93442567E-03    3     -1000037         4        -3             # GLSS   -->  W2SS-  CH     SB          
      3.74685377E-02    3      1000037         5        -6             # GLSS   -->  W2SS+  BT     TB          
      3.74685377E-02    3     -1000037         6        -5             # GLSS   -->  W2SS-  TP     BB          
      1.09878754E-04    2      1000022        21                       # GLSS   -->  Z1SS   GL                 
      3.01270913E-02    3      1000022         2        -2             # GLSS   -->  Z1SS   UP     UB          
      1.04797557E-02    3      1000022         1        -1             # GLSS   -->  Z1SS   DN     DB          
      1.04797557E-02    3      1000022         3        -3             # GLSS   -->  Z1SS   ST     SB          
      3.01270653E-02    3      1000022         4        -4             # GLSS   -->  Z1SS   CH     CB          
      1.53155383E-02    3      1000022         5        -5             # GLSS   -->  Z1SS   BT     BB          
      6.19295202E-02    3      1000022         6        -6             # GLSS   -->  Z1SS   TP     TB          
      6.26936555E-03    2      1000023        21                       # GLSS   -->  Z2SS   GL                 
      3.93984430E-02    3      1000023         2        -2             # GLSS   -->  Z2SS   UP     UB          
      3.58660817E-02    3      1000023         1        -1             # GLSS   -->  Z2SS   DN     DB          
      3.58660817E-02    3      1000023         3        -3             # GLSS   -->  Z2SS   ST     SB          
      3.93984020E-02    3      1000023         4        -4             # GLSS   -->  Z2SS   CH     CB          
      8.47827494E-02    3      1000023         5        -5             # GLSS   -->  Z2SS   BT     BB          
      7.37815863E-03    3      1000023         6        -6             # GLSS   -->  Z2SS   TP     TB          
      4.26163450E-02    2      1000025        21                       # GLSS   -->  Z3SS   GL                 
      3.22743872E-05    3      1000025         2        -2             # GLSS   -->  Z3SS   UP     UB          
      4.21398508E-05    3      1000025         1        -1             # GLSS   -->  Z3SS   DN     DB          
      4.21398508E-05    3      1000025         3        -3             # GLSS   -->  Z3SS   ST     SB          
      3.22743545E-05    3      1000025         4        -4             # GLSS   -->  Z3SS   CH     CB          
      1.72170124E-03    3      1000025         5        -5             # GLSS   -->  Z3SS   BT     BB          
      3.46001051E-02    2      1000035        21                       # GLSS   -->  Z4SS   GL                 
      9.34026786E-04    3      1000035         2        -2             # GLSS   -->  Z4SS   UP     UB          
      1.13268592E-03    3      1000035         1        -1             # GLSS   -->  Z4SS   DN     DB          
      1.13268592E-03    3      1000035         3        -3             # GLSS   -->  Z4SS   ST     SB          
      9.34025797E-04    3      1000035         4        -4             # GLSS   -->  Z4SS   CH     CB          
      3.93839227E-03    3      1000035         5        -5             # GLSS   -->  Z4SS   BT     BB          
#         PDG         Width
DECAY   1000002  1.07861069E+02   # UPL   decays
#          BR          NDA       ID1       ID2       ID3       ID4
      1.12764060E-03    2      1000022         2                       # UPL    -->  Z1SS   UP                 
      6.64700866E-02    2      1000023         2                       # UPL    -->  Z2SS   UP                 
      3.99235549E-04    2      1000025         2                       # UPL    -->  Z3SS   UP                 
      7.02817412E-03    2      1000035         2                       # UPL    -->  Z4SS   UP                 
      7.79503644E-01    2      1000021         2                       # UPL    -->  GLSS   UP                 
      1.36787772E-01    2      1000024         1                       # UPL    -->  W1SS+  DN                 
      8.68344028E-03    2      1000037         1                       # UPL    -->  W2SS+  DN                 
#         PDG         Width
DECAY   1000001  1.07886116E+02   # DNL   decays
#          BR          NDA       ID1       ID2       ID3       ID4
      4.17741155E-03    2      1000022         1                       # DNL    -->  Z1SS   DN                 
      6.10836521E-02    2      1000023         1                       # DNL    -->  Z2SS   DN                 
      6.69050671E-04    2      1000025         1                       # DNL    -->  Z3SS   DN                 
      9.04890615E-03    2      1000035         1                       # DNL    -->  Z4SS   DN                 
      7.80336857E-01    2      1000021         1                       # DNL    -->  GLSS   DN                 
      1.21374257E-01    2     -1000024         2                       # DNL    -->  W1SS-  UP                 
      2.33098511E-02    2     -1000037         2                       # DNL    -->  W2SS-  UP                 
#         PDG         Width
DECAY   1000003  1.07886101E+02   # STL   decays
#          BR          NDA       ID1       ID2       ID3       ID4
      4.17741202E-03    2      1000022         3                       # STL    -->  Z1SS   ST                 
      6.10836595E-02    2      1000023         3                       # STL    -->  Z2SS   ST                 
      6.69050729E-04    2      1000025         3                       # STL    -->  Z3SS   ST                 
      9.04890709E-03    2      1000035         3                       # STL    -->  Z4SS   ST                 
      7.80336976E-01    2      1000021         3                       # STL    -->  GLSS   ST                 
      1.21374160E-01    2     -1000024         4                       # STL    -->  W1SS-  CH                 
      2.33098287E-02    2     -1000037         4                       # STL    -->  W2SS-  CH                 
#         PDG         Width
DECAY   1000004  1.07861000E+02   # CHL   decays
#          BR          NDA       ID1       ID2       ID3       ID4
      1.12764037E-03    2      1000022         4                       # CHL    -->  Z1SS   CH                 
      6.64700866E-02    2      1000023         4                       # CHL    -->  Z2SS   CH                 
      3.99235490E-04    2      1000025         4                       # CHL    -->  Z3SS   CH                 
      7.02817366E-03    2      1000035         4                       # CHL    -->  Z4SS   CH                 
      7.79503465E-01    2      1000021         4                       # CHL    -->  GLSS   CH                 
      1.36787891E-01    2      1000024         3                       # CHL    -->  W1SS+  ST                 
      8.68344773E-03    2      1000037         3                       # CHL    -->  W2SS+  ST                 
#         PDG         Width
DECAY   1000005  1.00642029E+02   # BT1   decays
#          BR          NDA       ID1       ID2       ID3       ID4
      3.82710993E-03    2      1000022         5                       # BT1    -->  Z1SS   BT                 
      5.37445322E-02    2      1000023         5                       # BT1    -->  Z2SS   BT                 
      3.03720706E-03    2      1000025         5                       # BT1    -->  Z3SS   BT                 
      9.65672638E-03    2      1000035         5                       # BT1    -->  Z4SS   BT                 
      6.05336905E-01    2      1000021         5                       # BT1    -->  GLSS   BT                 
      1.14494331E-01    2     -1000024         6                       # BT1    -->  W1SS-  TP                 
      2.04583049E-01    2     -1000037         6                       # BT1    -->  W2SS-  TP                 
      5.32014249E-03    2          -24   1000006                       # BT1    -->  W-     TP1                
#         PDG         Width
DECAY   1000006  5.31835403E+01   # TP1   decays
#          BR          NDA       ID1       ID2       ID3       ID4
      4.81208652E-01    2      1000021         6                       # TP1    -->  GLSS   TP                 
      4.45038788E-02    2      1000022         6                       # TP1    -->  Z1SS   TP                 
      1.15106516E-02    2      1000023         6                       # TP1    -->  Z2SS   TP                 
      1.19595744E-01    2      1000025         6                       # TP1    -->  Z3SS   TP                 
      1.01194523E-01    2      1000035         6                       # TP1    -->  Z4SS   TP                 
      2.30409484E-02    2      1000024         5                       # TP1    -->  W1SS+  BT                 
      2.18945563E-01    2      1000037         5                       # TP1    -->  W2SS+  BT                 
#         PDG         Width
DECAY   2000002  8.85880127E+01   # UPR   decays
#          BR          NDA       ID1       ID2       ID3       ID4
      4.70424965E-02    2      1000022         2                       # UPR    -->  Z1SS   UP                 
      5.63996902E-04    2      1000023         2                       # UPR    -->  Z2SS   UP                 
      1.68450701E-04    2      1000025         2                       # UPR    -->  Z3SS   UP                 
      6.18105347E-04    2      1000035         2                       # UPR    -->  Z4SS   UP                 
      9.51606989E-01    2      1000021         2                       # UPR    -->  GLSS   UP                 
#         PDG         Width
DECAY   2000001  8.54397659E+01   # DNR   decays
#          BR          NDA       ID1       ID2       ID3       ID4
      1.22005753E-02    2      1000022         1                       # DNR    -->  Z1SS   DN                 
      1.46275910E-04    2      1000023         1                       # DNR    -->  Z2SS   DN                 
      4.36911032E-05    2      1000025         1                       # DNR    -->  Z3SS   DN                 
      1.60319702E-04    2      1000035         1                       # DNR    -->  Z4SS   DN                 
      9.87449169E-01    2      1000021         1                       # DNR    -->  GLSS   DN                 
#         PDG         Width
DECAY   2000003  8.54397659E+01   # STR   decays
#          BR          NDA       ID1       ID2       ID3       ID4
      1.22005753E-02    2      1000022         3                       # STR    -->  Z1SS   ST                 
      1.46275910E-04    2      1000023         3                       # STR    -->  Z2SS   ST                 
      4.36911032E-05    2      1000025         3                       # STR    -->  Z3SS   ST                 
      1.60319702E-04    2      1000035         3                       # STR    -->  Z4SS   ST                 
      9.87449169E-01    2      1000021         3                       # STR    -->  GLSS   ST                 
#         PDG         Width
DECAY   2000004  8.85879364E+01   # CHR   decays
#          BR          NDA       ID1       ID2       ID3       ID4
      4.70425002E-02    2      1000022         4                       # CHR    -->  Z1SS   CH                 
      5.63996902E-04    2      1000023         4                       # CHR    -->  Z2SS   CH                 
      1.68450730E-04    2      1000025         4                       # CHR    -->  Z3SS   CH                 
      6.18105463E-04    2      1000035         4                       # CHR    -->  Z4SS   CH                 
      9.51606929E-01    2      1000021         4                       # CHR    -->  GLSS   CH                 
#         PDG         Width
DECAY   2000005  8.55121002E+01   # BT2   decays
#          BR          NDA       ID1       ID2       ID3       ID4
      1.21979611E-02    2      1000022         5                       # BT2    -->  Z1SS   BT                 
      6.81318226E-04    2      1000023         5                       # BT2    -->  Z2SS   BT                 
      3.77216330E-03    2      1000025         5                       # BT2    -->  Z3SS   BT                 
      3.39292036E-03    2      1000035         5                       # BT2    -->  Z4SS   BT                 
      9.71919477E-01    2      1000021         5                       # BT2    -->  GLSS   BT                 
      1.05928932E-03    2     -1000024         6                       # BT2    -->  W1SS-  TP                 
      6.50396105E-03    2     -1000037         6                       # BT2    -->  W2SS-  TP                 
      3.01298451E-06    2          -24   1000006                       # BT2    -->  W-     TP1                
      1.47582366E-04    2          -24   2000006                       # BT2    -->  W-     TP2                
      7.98018955E-05    2           23   1000005                       # BT2    -->  Z0     BT1                
      2.42531372E-04    2           25   1000005                       # BT2    -->  HL0    BT1                
#         PDG         Width
DECAY   2000006  9.92021484E+01   # TP2   decays
#          BR          NDA       ID1       ID2       ID3       ID4
      5.92736483E-01    2      1000021         6                       # TP2    -->  GLSS   TP                 
      1.18777215E-01    2      1000024         5                       # TP2    -->  W1SS+  BT                 
      1.56092113E-02    2      1000037         5                       # TP2    -->  W2SS+  BT                 
      2.86257244E-03    2           23   1000006                       # TP2    -->  Z0     TP1                
      5.78761194E-03    2           25   1000006                       # TP2    -->  HL0    TP1                
      1.40096410E-03    2      1000022         6                       # TP2    -->  Z1SS   TP                 
      6.17235862E-02    2      1000023         6                       # TP2    -->  Z2SS   TP                 
      9.96393561E-02    2      1000025         6                       # TP2    -->  Z3SS   TP                 
      1.01463012E-01    2      1000035         6                       # TP2    -->  Z4SS   TP                 
#         PDG         Width
DECAY   1000011  2.52307320E+01   # EL-   decays
#          BR          NDA       ID1       ID2       ID3       ID4
      7.25535005E-02    2      1000022        11                       # EL-    -->  Z1SS   E-                 
      3.01201999E-01    2      1000023        11                       # EL-    -->  Z2SS   E-                 
      8.28881690E-04    2      1000025        11                       # EL-    -->  Z3SS   E-                 
      2.19357982E-02    2      1000035        11                       # EL-    -->  Z4SS   E-                 
      5.06490886E-01    2     -1000024        12                       # EL-    -->  W1SS-  NUE                
      9.69888940E-02    2     -1000037        12                       # EL-    -->  W2SS-  NUE                
#         PDG         Width
DECAY   1000013  2.52307320E+01   # MUL-  decays
#          BR          NDA       ID1       ID2       ID3       ID4
      7.25535005E-02    2      1000022        13                       # MUL-   -->  Z1SS   MU-                
      3.01201999E-01    2      1000023        13                       # MUL-   -->  Z2SS   MU-                
      8.28881690E-04    2      1000025        13                       # MUL-   -->  Z3SS   MU-                
      2.19357982E-02    2      1000035        13                       # MUL-   -->  Z4SS   MU-                
      5.06490886E-01    2     -1000024        14                       # MUL-   -->  W1SS-  NUM                
      9.69888940E-02    2     -1000037        14                       # MUL-   -->  W2SS-  NUM                
#         PDG         Width
DECAY   1000015  1.06524754E+01   # TAU1- decays
#          BR          NDA       ID1       ID2       ID3       ID4
      8.30426931E-01    2      1000022        15                       # TAU1-  -->  Z1SS   TAU-               
      5.48162945E-02    2      1000023        15                       # TAU1-  -->  Z2SS   TAU-               
      1.48043185E-02    2      1000025        15                       # TAU1-  -->  Z3SS   TAU-               
      1.16905887E-02    2      1000035        15                       # TAU1-  -->  Z4SS   TAU-               
      8.29229057E-02    2     -1000024        16                       # TAU1-  -->  W1SS-  NUT                
      5.33899618E-03    2     -1000037        16                       # TAU1-  -->  W2SS-  NUT                
#         PDG         Width
DECAY   1000012  2.52795067E+01   # NUEL  decays
#          BR          NDA       ID1       ID2       ID3       ID4
      1.10464454E-01    2      1000022        12                       # NUEL   -->  Z1SS   NUE                
      2.32598573E-01    2      1000023        12                       # NUEL   -->  Z2SS   NUE                
      4.18328214E-03    2      1000025        12                       # NUEL   -->  Z3SS   NUE                
      4.69643883E-02    2      1000035        12                       # NUEL   -->  Z4SS   NUE                
      5.69726467E-01    2      1000024        11                       # NUEL   -->  W1SS+  E-                 
      3.60628404E-02    2      1000037        11                       # NUEL   -->  W2SS+  E-                 
#         PDG         Width
DECAY   1000014  2.52795067E+01   # NUML  decays
#          BR          NDA       ID1       ID2       ID3       ID4
      1.10464454E-01    2      1000022        14                       # NUML   -->  Z1SS   NUM                
      2.32598573E-01    2      1000023        14                       # NUML   -->  Z2SS   NUM                
      4.18328214E-03    2      1000025        14                       # NUML   -->  Z3SS   NUM                
      4.69643883E-02    2      1000035        14                       # NUML   -->  Z4SS   NUM                
      5.69726467E-01    2      1000024        13                       # NUML   -->  W1SS+  MU-                
      3.60628404E-02    2      1000037        13                       # NUML   -->  W2SS+  MU-                
#         PDG         Width
DECAY   1000016  2.55301418E+01   # NUTL  decays
#          BR          NDA       ID1       ID2       ID3       ID4
      1.08879082E-01    2      1000022        16                       # NUTL   -->  Z1SS   NUT                
      2.29231507E-01    2      1000023        16                       # NUTL   -->  Z2SS   NUT                
      4.12067212E-03    2      1000025        16                       # NUTL   -->  Z3SS   NUT                
      4.62574475E-02    2      1000035        16                       # NUTL   -->  Z4SS   NUT                
      5.64048648E-01    2      1000024        15                       # NUTL   -->  W1SS+  TAU-               
      4.74626422E-02    2      1000037        15                       # NUTL   -->  W2SS+  TAU-               
      5.20235348E-11    3      1000015        16       -15             # NUTL   -->  TAU1-  NUT    TAU+        
      5.20235348E-11    3      1000015        12       -11             # NUTL   -->  TAU1-  NUE    E+          
      5.20235348E-11    3      1000015        14       -13             # NUTL   -->  TAU1-  NUM    MU+         
      1.56070601E-10    3      1000015         2        -1             # NUTL   -->  TAU1-  UP     DB          
      1.56070601E-10    3      1000015         4        -3             # NUTL   -->  TAU1-  CH     SB          
#         PDG         Width
DECAY   2000011  9.39702415E+00   # ER-   decays
#          BR          NDA       ID1       ID2       ID3       ID4
      9.72160101E-01    2      1000022        11                       # ER-    -->  Z1SS   E-                 
      1.16472291E-02    2      1000023        11                       # ER-    -->  Z2SS   E-                 
      3.46917240E-03    2      1000025        11                       # ER-    -->  Z3SS   E-                 
      1.27235092E-02    2      1000035        11                       # ER-    -->  Z4SS   E-                 
#         PDG         Width
DECAY   2000013  9.39702415E+00   # MUR-  decays
#          BR          NDA       ID1       ID2       ID3       ID4
      9.72160101E-01    2      1000022        13                       # MUR-   -->  Z1SS   MU-                
      1.16472291E-02    2      1000023        13                       # MUR-   -->  Z2SS   MU-                
      3.46917240E-03    2      1000025        13                       # MUR-   -->  Z3SS   MU-                
      1.27235092E-02    2      1000035        13                       # MUR-   -->  Z4SS   MU-                
#         PDG         Width
DECAY   2000015  2.48693905E+01   # TAU2- decays
#          BR          NDA       ID1       ID2       ID3       ID4
      8.21953267E-02    2      1000022        15                       # TAU2-  -->  Z1SS   TAU-               
      2.87515491E-01    2      1000023        15                       # TAU2-  -->  Z2SS   TAU-               
      1.01463506E-02    2      1000025        15                       # TAU2-  -->  Z3SS   TAU-               
      3.39768641E-02    2      1000035        15                       # TAU2-  -->  Z4SS   TAU-               
      4.78338867E-01    2     -1000024        16                       # TAU2-  -->  W1SS-  NUT                
      1.07827015E-01    2     -1000037        16                       # TAU2-  -->  W2SS-  NUT                
#         PDG         Width
DECAY   1000023  3.36184457E-05   # Z2SS  decays
#          BR          NDA       ID1       ID2       ID3       ID4
      6.62982347E-04    2      1000022        22                       # Z2SS   -->  Z1SS   GM                 
      1.18867137E-01    3      1000022         2        -2             # Z2SS   -->  Z1SS   UP     UB          
      1.53739467E-01    3      1000022         1        -1             # Z2SS   -->  Z1SS   DN     DB          
      1.53739467E-01    3      1000022         3        -3             # Z2SS   -->  Z1SS   ST     SB          
      1.18867137E-01    3      1000022         4        -4             # Z2SS   -->  Z1SS   CH     CB          
      1.51992440E-01    3      1000022         5        -5             # Z2SS   -->  Z1SS   BT     BB          
      3.35819796E-02    3      1000022        11       -11             # Z2SS   -->  Z1SS   E-     E+          
      3.35819796E-02    3      1000022        13       -13             # Z2SS   -->  Z1SS   MU-    MU+         
      3.35780159E-02    3      1000022        15       -15             # Z2SS   -->  Z1SS   TAU-   TAU+        
      6.71344921E-02    3      1000022        12       -12             # Z2SS   -->  Z1SS   NUE    ANUE        
      6.71344921E-02    3      1000022        14       -14             # Z2SS   -->  Z1SS   NUM    ANUM        
      6.71203360E-02    3      1000022        16       -16             # Z2SS   -->  Z1SS   NUT    ANUT        
#         PDG         Width
DECAY   1000025  1.59076631E+00   # Z3SS  decays
#          BR          NDA       ID1       ID2       ID3       ID4
      8.58052331E-08    2      1000022        22                       # Z3SS   -->  Z1SS   GM                 
      9.44504620E-07    2      1000023        22                       # Z3SS   -->  Z2SS   GM                 
      3.00787926E-01    2      1000024       -24                       # Z3SS   -->  W1SS+  W-                 
      3.00787926E-01    2     -1000024        24                       # Z3SS   -->  W1SS-  W+                 
      1.28092006E-01    2      1000022        23                       # Z3SS   -->  Z1SS   Z0                 
      2.36303702E-01    2      1000023        23                       # Z3SS   -->  Z2SS   Z0                 
      1.53283705E-10    3      1000022         2        -2             # Z3SS   -->  Z1SS   UP     UB          
      8.31205937E-11    3      1000022         1        -1             # Z3SS   -->  Z1SS   DN     DB          
      8.31205937E-11    3      1000022         3        -3             # Z3SS   -->  Z1SS   ST     SB          
      1.53283566E-10    3      1000022         4        -4             # Z3SS   -->  Z1SS   CH     CB          
      7.10276593E-09    3      1000022         5        -5             # Z3SS   -->  Z1SS   BT     BB          
      2.98506747E-10    3      1000022        11       -11             # Z3SS   -->  Z1SS   E-     E+          
      2.98506747E-10    3      1000022        13       -13             # Z3SS   -->  Z1SS   MU-    MU+         
      5.19799004E-09    3      1000022        15       -15             # Z3SS   -->  Z1SS   TAU-   TAU+        
      2.61311472E-10    3      1000022        12       -12             # Z3SS   -->  Z1SS   NUE    ANUE        
      2.61311472E-10    3      1000022        14       -14             # Z3SS   -->  Z1SS   NUM    ANUM        
      2.66190875E-10    3      1000022        16       -16             # Z3SS   -->  Z1SS   NUT    ANUT        
      1.49857821E-10    3      1000023         2        -2             # Z3SS   -->  Z2SS   UP     UB          
      2.29094257E-10    3      1000023         1        -1             # Z3SS   -->  Z2SS   DN     DB          
      2.29094257E-10    3      1000023         3        -3             # Z3SS   -->  Z2SS   ST     SB          
      1.49857682E-10    3      1000023         4        -4             # Z3SS   -->  Z2SS   CH     CB          
      8.15861334E-09    3      1000023         5        -5             # Z3SS   -->  Z2SS   BT     BB          
      3.02313279E-11    3      1000023        11       -11             # Z3SS   -->  Z2SS   E-     E+          
      3.02313279E-11    3      1000023        13       -13             # Z3SS   -->  Z2SS   MU-    MU+         
      1.07106701E-09    3      1000023        15       -15             # Z3SS   -->  Z2SS   TAU-   TAU+        
      1.16118053E-10    3      1000023        12       -12             # Z3SS   -->  Z2SS   NUE    ANUE        
      1.16118053E-10    3      1000023        14       -14             # Z3SS   -->  Z2SS   NUM    ANUM        
      1.18295596E-10    3      1000023        16       -16             # Z3SS   -->  Z2SS   NUT    ANUT        
      2.34477557E-02    2      1000022        25                       # Z3SS   -->  Z1SS   HL0                
      1.05797350E-02    2      1000023        25                       # Z3SS   -->  Z2SS   HL0                
#         PDG         Width
DECAY   1000035  1.95741868E+00   # Z4SS  decays
#          BR          NDA       ID1       ID2       ID3       ID4
      4.05480236E-08    2      1000022        22                       # Z4SS   -->  Z1SS   GM                 
      3.30961711E-07    2      1000023        22                       # Z4SS   -->  Z2SS   GM                 
      8.45997050E-09    2      1000025        22                       # Z4SS   -->  Z3SS   GM                 
      3.54460865E-01    2      1000024       -24                       # Z4SS   -->  W1SS+  W-                 
      3.54460865E-01    2     -1000024        24                       # Z4SS   -->  W1SS-  W+                 
      3.56006457E-13    3     -1000037         2        -1             # Z4SS   -->  W2SS-  UP     DB          
      1.18668828E-13    3     -1000037        12       -11             # Z4SS   -->  W2SS-  NUE    E+          
      1.18668828E-13    3     -1000037        14       -13             # Z4SS   -->  W2SS-  NUM    MU+         
      3.56006457E-13    3      1000037         1        -2             # Z4SS   -->  W2SS+  DN     UB          
      1.18668828E-13    3      1000037        11       -12             # Z4SS   -->  W2SS+  E-     ANUE        
      1.18668828E-13    3      1000037        13       -14             # Z4SS   -->  W2SS+  MU-    ANUM        
      2.60952674E-02    2      1000022        23                       # Z4SS   -->  Z1SS   Z0                 
      1.95945818E-02    2      1000023        23                       # Z4SS   -->  Z2SS   Z0                 
      1.77172887E-09    3      1000022         2        -2             # Z4SS   -->  Z1SS   UP     UB          
      2.51746735E-09    3      1000022         1        -1             # Z4SS   -->  Z1SS   DN     DB          
      2.51746735E-09    3      1000022         3        -3             # Z4SS   -->  Z1SS   ST     SB          
      1.77172754E-09    3      1000022         4        -4             # Z4SS   -->  Z1SS   CH     CB          
      9.93594806E-09    3      1000022         5        -5             # Z4SS   -->  Z1SS   BT     BB          
      4.52534055E-09    3      1000022        11       -11             # Z4SS   -->  Z1SS   E-     E+          
      4.52534055E-09    3      1000022        13       -13             # Z4SS   -->  Z1SS   MU-    MU+         
      8.97963215E-09    3      1000022        15       -15             # Z4SS   -->  Z1SS   TAU-   TAU+        
      7.12205761E-09    3      1000022        12       -12             # Z4SS   -->  Z1SS   NUE    ANUE        
      7.12205761E-09    3      1000022        14       -14             # Z4SS   -->  Z1SS   NUM    ANUM        
      7.25497085E-09    3      1000022        16       -16             # Z4SS   -->  Z1SS   NUT    ANUT        
      9.70125758E-09    3      1000023         2        -2             # Z4SS   -->  Z2SS   UP     UB          
      1.14147847E-08    3      1000023         1        -1             # Z4SS   -->  Z2SS   DN     DB          
      1.14147847E-08    3      1000023         3        -3             # Z4SS   -->  Z2SS   ST     SB          
      9.70124781E-09    3      1000023         4        -4             # Z4SS   -->  Z2SS   CH     CB          
      3.25981766E-08    3      1000023         5        -5             # Z4SS   -->  Z2SS   BT     BB          
      2.89273272E-09    3      1000023        11       -11             # Z4SS   -->  Z2SS   E-     E+          
      2.89273272E-09    3      1000023        13       -13             # Z4SS   -->  Z2SS   MU-    MU+         
      3.82457888E-09    3      1000023        15       -15             # Z4SS   -->  Z2SS   TAU-   TAU+        
      4.80519802E-09    3      1000023        12       -12             # Z4SS   -->  Z2SS   NUE    ANUE        
      4.80519802E-09    3      1000023        14       -14             # Z4SS   -->  Z2SS   NUM    ANUM        
      4.89534768E-09    3      1000023        16       -16             # Z4SS   -->  Z2SS   NUT    ANUT        
      2.24583189E-07    3      1000025         2        -2             # Z4SS   -->  Z3SS   UP     UB          
      2.89682504E-07    3      1000025         1        -1             # Z4SS   -->  Z3SS   DN     DB          
      2.89682504E-07    3      1000025         3        -3             # Z4SS   -->  Z3SS   ST     SB          
      2.24583189E-07    3      1000025         4        -4             # Z4SS   -->  Z3SS   CH     CB          
      1.54451470E-07    3      1000025         5        -5             # Z4SS   -->  Z3SS   BT     BB          
      6.57102746E-08    3      1000025        11       -11             # Z4SS   -->  Z3SS   E-     E+          
      6.57102746E-08    3      1000025        13       -13             # Z4SS   -->  Z3SS   MU-    MU+         
      5.96124394E-08    3      1000025        15       -15             # Z4SS   -->  Z3SS   TAU-   TAU+        
      1.30704194E-07    3      1000025        12       -12             # Z4SS   -->  Z3SS   NUE    ANUE        
      1.30704194E-07    3      1000025        14       -14             # Z4SS   -->  Z3SS   NUM    ANUM        
      1.30703938E-07    3      1000025        16       -16             # Z4SS   -->  Z3SS   NUT    ANUT        
      8.45434070E-02    2      1000022        25                       # Z4SS   -->  Z1SS   HL0                
      1.60842746E-01    2      1000023        25                       # Z4SS   -->  Z2SS   HL0                
#         PDG         Width
DECAY   1000024  1.31249882E-03   # W1SS+ decays
#          BR          NDA       ID1       ID2       ID3       ID4
      1.74291060E-07    3      1000022         2        -1             # W1SS+  -->  Z1SS   UP     DB          
      1.74291031E-07    3      1000022         4        -3             # W1SS+  -->  Z1SS   CH     SB          
      5.75923025E-07    3      1000022       -11        12             # W1SS+  -->  Z1SS   E+     NUE         
      5.75923025E-07    3      1000022       -13        14             # W1SS+  -->  Z1SS   MU+    NUM         
      6.02618968E-07    3      1000022       -15        16             # W1SS+  -->  Z1SS   TAU+   NUT         
      9.99997854E-01    2      1000022        24                       # W1SS+  -->  Z1SS   W+                 
      2.12252535E-10    3      1000023       -11        12             # W1SS+  -->  Z2SS   E+     NUE         
      2.12252535E-10    3      1000023       -13        14             # W1SS+  -->  Z2SS   MU+    NUM         
#         PDG         Width
DECAY   1000037  1.67564440E+00   # W2SS+ decays
#          BR          NDA       ID1       ID2       ID3       ID4
      3.54416496E-09    3      1000022         2        -1             # W2SS+  -->  Z1SS   UP     DB          
      3.54416407E-09    3      1000022         4        -3             # W2SS+  -->  Z1SS   CH     SB          
      8.55887894E-09    3      1000022       -11        12             # W2SS+  -->  Z1SS   E+     NUE         
      8.55887894E-09    3      1000022       -13        14             # W2SS+  -->  Z1SS   MU+    NUM         
      1.38561544E-08    3      1000022       -15        16             # W2SS+  -->  Z1SS   TAU+   NUT         
      9.15898979E-02    2      1000022        24                       # W2SS+  -->  Z1SS   W+                 
      9.68046621E-09    3      1000023         2        -1             # W2SS+  -->  Z2SS   UP     DB          
      9.68046532E-09    3      1000023         4        -3             # W2SS+  -->  Z2SS   CH     SB          
      4.05626599E-09    3      1000023       -11        12             # W2SS+  -->  Z2SS   E+     NUE         
      4.05626599E-09    3      1000023       -13        14             # W2SS+  -->  Z2SS   MU+    NUM         
      5.78910742E-09    3      1000023       -15        16             # W2SS+  -->  Z2SS   TAU+   NUT         
      3.60918969E-01    2      1000023        24                       # W2SS+  -->  Z2SS   W+                 
      7.31657053E-07    3      1000025         2        -1             # W2SS+  -->  Z3SS   UP     DB          
      7.31657053E-07    3      1000025         4        -3             # W2SS+  -->  Z3SS   CH     SB          
      2.43871625E-07    3      1000025       -11        12             # W2SS+  -->  Z3SS   E+     NUE         
      2.43871625E-07    3      1000025       -13        14             # W2SS+  -->  Z3SS   MU+    NUM         
      2.43883647E-07    3      1000025       -15        16             # W2SS+  -->  Z3SS   TAU+   NUT         
      3.15963954E-01    2      1000024        23                       # W2SS+  -->  W1SS+  Z0                 
      9.53357926E-09    3      1000024         1        -1             # W2SS+  -->  W1SS+  DN     DB          
      9.53356949E-09    3      1000024         3        -3             # W2SS+  -->  W1SS+  ST     SB          
      2.25930421E-08    3      1000024         2        -2             # W2SS+  -->  W1SS+  UP     UB          
      2.25930421E-08    3      1000024         4        -4             # W2SS+  -->  W1SS+  CH     CB          
      8.29117219E-09    3      1000024        12       -12             # W2SS+  -->  W1SS+  NUE    ANUE        
      8.29117219E-09    3      1000024        14       -14             # W2SS+  -->  W1SS+  NUM    ANUM        
      8.66639116E-09    3      1000024        16       -16             # W2SS+  -->  W1SS+  NUT    ANUT        
      3.49500917E-09    3      1000024        11       -11             # W2SS+  -->  W1SS+  E-     E+          
      3.49500917E-09    3      1000024        13       -13             # W2SS+  -->  W1SS+  MU-    MU+         
      3.56060981E-09    3      1000024        15       -15             # W2SS+  -->  W1SS+  TAU-   TAU+        
      2.31524900E-01    2      1000024        25                       # W2SS+  -->  W1SS+  HL0                
#         PDG         Width
DECAY        25  4.02259082E-03   # HL0   decays
#          BR          NDA       ID1       ID2       ID3       ID4
      4.87274399E-09    2           11       -11                       # HL0    -->  E-     E+                 
      2.05734992E-04    2           13       -13                       # HL0    -->  MU-    MU+                
      5.88400699E-02    2           15       -15                       # HL0    -->  TAU-   TAU+               
      6.11661244E-06    2            1        -1                       # HL0    -->  DN     DB                 
      2.47141789E-03    2            3        -3                       # HL0    -->  ST     SB                 
      8.11185479E-01    2            5        -5                       # HL0    -->  BT     BB                 
      1.93409528E-06    2            2        -2                       # HL0    -->  UP     UB                 
      3.64582352E-02    2            4        -4                       # HL0    -->  CH     CB                 
      1.82217394E-03    2           22        22                       # HL0    -->  GM     GM                 
      3.83982360E-02    2           21        21                       # HL0    -->  GL     GL                 
      2.62865215E-03    3           24        11       -12             # HL0    -->  W+     E-     ANUE        
      2.62865215E-03    3           24        13       -14             # HL0    -->  W+     MU-    ANUM        
      2.62865215E-03    3           24        15       -16             # HL0    -->  W+     TAU-   ANUT        
      7.88595621E-03    3           24        -2         1             # HL0    -->  W+     UB     DN          
      7.88595621E-03    3           24        -4         3             # HL0    -->  W+     CB     ST          
      2.62865215E-03    3          -24       -11        12             # HL0    -->  W-     E+     NUE         
      2.62865215E-03    3          -24       -13        14             # HL0    -->  W-     MU+    NUM         
      2.62865215E-03    3          -24       -15        16             # HL0    -->  W-     TAU+   NUT         
      7.88595621E-03    3          -24         2        -1             # HL0    -->  W-     UP     DB          
      7.88595621E-03    3          -24         4        -3             # HL0    -->  W-     CH     SB          
      2.25333031E-04    3           23        12       -12             # HL0    -->  Z0     NUE    ANUE        
      2.25333031E-04    3           23        14       -14             # HL0    -->  Z0     NUM    ANUM        
      2.25333031E-04    3           23        16       -16             # HL0    -->  Z0     NUT    ANUT        
      1.13407856E-04    3           23        11       -11             # HL0    -->  Z0     E-     E+          
      1.13407856E-04    3           23        13       -13             # HL0    -->  Z0     MU-    MU+         
      1.13407856E-04    3           23        15       -15             # HL0    -->  Z0     TAU-   TAU+        
      3.88525688E-04    3           23         2        -2             # HL0    -->  Z0     UP     UB          
      3.88525688E-04    3           23         4        -4             # HL0    -->  Z0     CH     CB          
      5.00516791E-04    3           23         1        -1             # HL0    -->  Z0     DN     DB          
      5.00516791E-04    3           23         3        -3             # HL0    -->  Z0     ST     SB          
      5.00516791E-04    3           23         5        -5             # HL0    -->  Z0     BT     BB          
#         PDG         Width
DECAY        35  2.73355827E+01   # HH0   decays
#          BR          NDA       ID1       ID2       ID3       ID4
      1.16763732E-09    2           11       -11                       # HH0    -->  E-     E+                 
      4.92997497E-05    2           13       -13                       # HH0    -->  MU-    MU+                
      1.41201289E-02    2           15       -15                       # HH0    -->  TAU-   TAU+               
      1.42341298E-06    2            1        -1                       # HH0    -->  DN     DB                 
      5.75130864E-04    2            3        -3                       # HH0    -->  ST     SB                 
      7.82176033E-02    2            5        -5                       # HH0    -->  BT     BB                 
      4.60867490E-11    2            2        -2                       # HH0    -->  UP     UB                 
      6.04356501E-07    2            4        -4                       # HH0    -->  CH     CB                 
      3.06810383E-02    2            6        -6                       # HH0    -->  TP     TB                 
      2.01183440E-07    2           22        22                       # HH0    -->  GM     GM                 
      1.01959822E-05    2           21        21                       # HH0    -->  GL     GL                 
      2.69314933E-05    2           24       -24                       # HH0    -->  W+     W-                 
      1.37803236E-05    2           23        23                       # HH0    -->  Z0     Z0                 
      4.25983593E-03    2      1000022   1000022                       # HH0    -->  Z1SS   Z1SS               
      2.31767520E-02    2      1000022   1000023                       # HH0    -->  Z1SS   Z2SS               
      5.27479500E-02    2      1000022   1000025                       # HH0    -->  Z1SS   Z3SS               
      2.06458978E-02    2      1000022   1000035                       # HH0    -->  Z1SS   Z4SS               
      3.04535590E-02    2      1000023   1000023                       # HH0    -->  Z2SS   Z2SS               
      1.10432766E-01    2      1000023   1000025                       # HH0    -->  Z2SS   Z3SS               
      3.78064439E-02    2      1000023   1000035                       # HH0    -->  Z2SS   Z4SS               
      3.89809906E-03    2      1000025   1000025                       # HH0    -->  Z3SS   Z3SS               
      3.81226726E-02    2      1000025   1000035                       # HH0    -->  Z3SS   Z4SS               
      2.38132440E-02    2      1000035   1000035                       # HH0    -->  Z4SS   Z4SS               
      7.60539174E-02    2      1000024  -1000024                       # HH0    -->  W1SS+  W1SS-              
      1.58255827E-02    2      1000037  -1000037                       # HH0    -->  W2SS+  W2SS-              
      2.19485462E-01    2      1000024  -1000037                       # HH0    -->  W1SS+  W2SS-              
      2.19485462E-01    2     -1000024   1000037                       # HH0    -->  W1SS-  W2SS+              
      9.59701574E-05    2           25        25                       # HH0    -->  HL0    HL0                
#         PDG         Width
DECAY        36  2.71395683E+01   # HA0   decays
#          BR          NDA       ID1       ID2       ID3       ID4
      1.16846055E-09    2           11       -11                       # HA0    -->  E-     E+                 
      4.93345142E-05    2           13       -13                       # HA0    -->  MU-    MU+                
      1.41301360E-02    2           15       -15                       # HA0    -->  TAU-   TAU+               
      1.42448584E-06    2            1        -1                       # HA0    -->  DN     DB                 
      5.75564394E-04    2            3        -3                       # HA0    -->  ST     SB                 
      7.82774985E-02    2            5        -5                       # HA0    -->  BT     BB                 
      4.55789746E-11    2            2        -2                       # HA0    -->  UP     UB                 
      5.98136467E-07    2            4        -4                       # HA0    -->  CH     CB                 
      3.11906729E-02    2            6        -6                       # HA0    -->  TP     TB                 
      5.83452618E-07    2           22        22                       # HA0    -->  GM     GM                 
      1.66510545E-05    2           21        21                       # HA0    -->  GL     GL                 
      5.00610843E-03    2      1000022   1000022                       # HA0    -->  Z1SS   Z1SS               
      2.90571135E-02    2      1000022   1000023                       # HA0    -->  Z1SS   Z2SS               
      3.26973982E-02    2      1000022   1000025                       # HA0    -->  Z1SS   Z3SS               
      3.48300487E-02    2      1000022   1000035                       # HA0    -->  Z1SS   Z4SS               
      4.05413173E-02    2      1000023   1000023                       # HA0    -->  Z2SS   Z2SS               
      6.50849342E-02    2      1000023   1000025                       # HA0    -->  Z2SS   Z3SS               
      6.58973902E-02    2      1000023   1000035                       # HA0    -->  Z2SS   Z4SS               
      3.00388201E-03    2      1000025   1000025                       # HA0    -->  Z3SS   Z3SS               
      2.56957673E-02    2      1000025   1000035                       # HA0    -->  Z3SS   Z4SS               
      4.32941392E-02    2      1000035   1000035                       # HA0    -->  Z4SS   Z4SS               
      9.96440649E-02    2      1000024  -1000024                       # HA0    -->  W1SS+  W1SS-              
      3.79706994E-02    2      1000037  -1000037                       # HA0    -->  W2SS+  W2SS-              
      1.96503952E-01    2      1000024  -1000037                       # HA0    -->  W1SS+  W2SS-              
      1.96503952E-01    2     -1000024   1000037                       # HA0    -->  W1SS-  W2SS+              
      2.67439646E-05    2           25        23                       # HA0    -->  HL0    Z0                 
#         PDG         Width
DECAY        37  2.70411034E+01   # H+    decays
#          BR          NDA       ID1       ID2       ID3       ID4
      1.18160293E-09    2           12       -11                       # H+     -->  NUE    E+                 
      4.98894042E-05    2           14       -13                       # H+     -->  NUM    MU+                
      1.42890653E-02    2           16       -15                       # H+     -->  NUT    TAU+               
      1.33056255E-06    2            2        -1                       # H+     -->  UP     DB                 
      5.38155029E-04    2            4        -3                       # H+     -->  CH     SB                 
      1.00682378E-01    2            6        -5                       # H+     -->  TP     BB                 
      4.40183803E-02    2      1000024   1000022                       # H+     -->  W1SS+  Z1SS               
      3.61791666E-04    2      1000024   1000023                       # H+     -->  W1SS+  Z2SS               
      2.27298871E-01    2      1000024   1000025                       # H+     -->  W1SS+  Z3SS               
      2.35582441E-01    2      1000024   1000035                       # H+     -->  W1SS+  Z4SS               
      3.40106115E-02    2      1000037   1000022                       # H+     -->  W2SS+  Z1SS               
      3.07594478E-01    2      1000037   1000023                       # H+     -->  W2SS+  Z2SS               
      3.20154428E-02    2      1000037   1000025                       # H+     -->  W2SS+  Z3SS               
      3.52998055E-03    2      1000037   1000035                       # H+     -->  W2SS+  Z4SS               
      2.71490971E-05    2           25        24                       # H+     -->  HL0    W+                 
