#  ISAJET SUSY parameters in SUSY Les Houches Accord 2 format
#  Created by ISALHA 2.0 Last revision: C. Balazs 21 Apr 2009
Block SPINFO   # Program information
     1   ISASUGRA from ISAJET          # Spectrum Calculator
     2   7.80   29-OCT-2009 12:50:36   # Version number
Block MODSEL   # Model selection
     1     0   #   MsR(Q)          MbR(Q)                          
Block SMINPUTS   # Standard Model inputs
     1     1.27837601E+02   # alpha_em^(-1)
     2     1.16570000E-05   # G_Fermi
     3     1.17200002E-01   # alpha_s(M_Z)
     4     9.11699982E+01   # m_{Z}(pole)
     5     4.19999981E+00   # m_{b}(m_{b})
     6     1.72500000E+02   # m_{top}(pole)
     7     1.77699995E+00   # m_{tau}(pole)
Block MINPAR   # SUSY breaking input parameters
Block MASS   # Scalar and gaugino mass spectrum
#  PDG code   mass                 particle
        24     8.04229965E+01   #  W^+
        25     1.20300003E+02   #  h^0            
        35     2.51776025E+03   #  H^0            
        36     2.50000000E+03   #  A^0            
        37     2.51607861E+03   #  H^+            
   1000001     6.02337585E+02   #  dnl            
   1000002     5.98083374E+02   #  upl            
   1000003     6.02337585E+02   #  stl            
   1000004     5.98084839E+02   #  chl            
   1000005     6.00416565E+02   #  b1             
   1000006     6.16062134E+02   #  t1             
   1000011     2.50035645E+03   #  el-            
   1000012     2.49933496E+03   #  nuel           
   1000013     2.50035645E+03   #  mul-           
   1000014     2.49933496E+03   #  numl           
   1000015     2.50029565E+03   #  tau1           
   1000016     2.49933496E+03   #  nutl           
   1000021     6.00000000E+02   #  glss           
   1000022     4.99348389E+02   #  z1ss           
   1000023     2.42860034E+03   #  z2ss           
   1000024     2.42832593E+03   #  w1ss           
   1000025    -2.50038916E+03   #  z3ss           
   1000035     2.57244043E+03   #  z4ss           
   1000037     2.57219092E+03   #  w2ss           
   2000001     6.00428345E+02   #  dnr            
   2000002     5.99142334E+02   #  upr            
   2000003     6.00428406E+02   #  str            
   2000004     5.99143860E+02   #  chr            
   2000005     6.02363098E+02   #  b2             
   2000006     6.17165955E+02   #  t2             
   2000011     2.50030859E+03   #  er-            
   2000013     2.50030859E+03   #  mur-           
   2000015     2.50037036E+03   #  tau2           
Block ALPHA   # Effective Higgs mixing parameter
         -3.22547197E-01   # alpha
Block STOPMIX   # stop mixing matrix
  1  1     7.26197243E-01   # O_{11}
  1  2     6.87486470E-01   # O_{12}
  2  1    -6.87486470E-01   # O_{21}
  2  2     7.26197243E-01   # O_{22}
Block SBOTMIX   # sbottom mixing matrix
  1  1     5.52335052E-07   # O_{11}
  1  2    -1.00000000E+00   # O_{12}
  2  1     1.00000000E+00   # O_{21}
  2  2     5.52335052E-07   # O_{22}
Block STAUMIX   # stau mixing matrix
  1  1     2.81731172E-06   # O_{11}
  1  2    -1.00000000E+00   # O_{12}
  2  1     1.00000000E+00   # O_{21}
  2  2     2.81731172E-06   # O_{22}
Block NMIX   # neutralino mixing matrix
  1  1     9.99782503E-01   #
  1  2    -5.92538971E-04   #
  1  3     1.86497718E-02   #
  1  4    -9.32106376E-03   #
  2  1     1.44137088E-02   #
  2  2     7.08370090E-01   #
  2  3    -5.02602518E-01   #
  2  4     4.95373696E-01   #
  3  1    -6.59014285E-03   #
  3  2     7.19456375E-03   #
  3  3     7.06963241E-01   #
  3  4     7.07183182E-01   #
  4  1     1.35595864E-02   #
  4  2    -7.05804527E-01   #
  4  3    -4.97238696E-01   #
  4  4     5.04390895E-01   #
Block UMIX   # chargino U mixing matrix
  1  1    -7.02002406E-01   # U_{11}
  1  2     7.12174535E-01   # U_{12}
  2  1    -7.12174535E-01   # U_{21}
  2  2    -7.02002406E-01   # U_{22}
Block VMIX   # chargino V mixing matrix
  1  1    -7.12174356E-01   # V_{11}
  1  2     7.02002585E-01   # V_{12}
  2  1    -7.02002585E-01   # V_{21}
  2  2    -7.12174356E-01   # V_{22}
Block GAUGE Q=  0.00000000E+00   #
     1     0.00000000E+00   # g`
     2     0.00000000E+00   # g_2
     3     0.00000000E+00   # g_3
Block YU Q=  0.00000000E+00   #
  3  3     0.00000000E+00   # y_t
Block YD Q=  0.00000000E+00   #
  3  3     0.00000000E+00   # y_b
Block YE Q=  0.00000000E+00   #
  3  3     0.00000000E+00   # y_tau
Block HMIX Q=  0.00000000E+00   # Higgs mixing parameters
     1     0.00000000E+00   # mu(Q)
     2     0.00000000E+00   # tan(beta)(M_GUT)
     3     0.00000000E+00   # Higgs vev at Q
     4     6.25000000E+06   # m_A^2(Q)
Block MSOFT Q=  0.00000000E+00   # DRbar SUSY breaking parameters
     1     0.00000000E+00   # M_1(Q)          
     2     0.00000000E+00   # M_2(Q)          
     3     0.00000000E+00   # M_3(Q)          
    31     0.00000000E+00   # MeL(Q)          
    32     0.00000000E+00   # MmuL(Q)         
    33     0.00000000E+00   # MtauL(Q)        
    34     0.00000000E+00   # MeR(Q)          
    35     0.00000000E+00   # MmuR(Q)         
    36     0.00000000E+00   # MtauR(Q)        
    41     0.00000000E+00   # MqL1(Q)         
    42     0.00000000E+00   # MqL2(Q)         
    43     0.00000000E+00   # MqL3(Q)         
    44     0.00000000E+00   # MuR(Q)          
    45     0.00000000E+00   # McR(Q)          
    46     0.00000000E+00   # MtR(Q)          
    47     0.00000000E+00   # MdR(Q)          
    48     0.00000000E+00   # MsR(Q)          
    49     0.00000000E+00   # MbR(Q)          
Block AU Q=  0.00000000E+00   #
  1  1     0.00000000E+00   # A_u
  2  2     0.00000000E+00   # A_c
  3  3     0.00000000E+00   # A_t
Block AD Q=  0.00000000E+00   #
  1  1     0.00000000E+00   # A_d
  2  2     0.00000000E+00   # A_s
  3  3     0.00000000E+00   # A_b
Block AE Q=  0.00000000E+00   #
  1  1     0.00000000E+00   # A_e
  2  2     0.00000000E+00   # A_mu
  3  3     0.00000000E+00   # A_tau
#         PDG         Width
DECAY   1000021  1.24261365E-03   # GLSS  decays
#          BR          NDA       ID1       ID2       ID3       ID4
      3.96938325E-04    2      1000022        21                       # GLSS   -->  Z1SS   GL                 
      3.06147952E-02    3      1000022         1        -1             # GLSS   -->  Z1SS   DN     DB          
      3.06145605E-02    3      1000022         3        -3             # GLSS   -->  Z1SS   ST     SB          
      2.68207174E-02    3      1000022         5        -5             # GLSS   -->  Z1SS   BT     BB          
      2.38697499E-01    2     -1000002         2                       # GLSS   -->  UBL    UP                 
      2.38697499E-01    2      1000002        -2                       # GLSS   -->  UPL    UB                 
      4.78822030E-02    2     -2000002         2                       # GLSS   -->  UBR    UP                 
      4.78822030E-02    2      2000002        -2                       # GLSS   -->  UPR    UB                 
      1.69186935E-01    2     -1000004         4                       # GLSS   -->  CBL    CH                 
      1.69186935E-01    2      1000004        -4                       # GLSS   -->  CHL    CB                 
      1.97339432E-05    2      1000039        21                       # GLSS   -->  GVSS   GL                 
#         PDG         Width
DECAY   1000002  7.70025002E-03   # UPL   decays
#          BR          NDA       ID1       ID2       ID3       ID4
      1.00000000E+00    2      1000022         2                       # UPL    -->  Z1SS   UP                 
#         PDG         Width
DECAY   1000001  1.07146036E-02   # DNL   decays
#          BR          NDA       ID1       ID2       ID3       ID4
      7.81475902E-01    2      1000022         1                       # DNL    -->  Z1SS   DN                 
      2.18524083E-01    2      1000021         1                       # DNL    -->  GLSS   DN                 
#         PDG         Width
DECAY   1000003  1.07146036E-02   # STL   decays
#          BR          NDA       ID1       ID2       ID3       ID4
      7.81475902E-01    2      1000022         3                       # STL    -->  Z1SS   ST                 
      2.18524083E-01    2      1000021         3                       # STL    -->  GLSS   ST                 
#         PDG         Width
DECAY   1000004  7.69958645E-03   # CHL   decays
#          BR          NDA       ID1       ID2       ID3       ID4
      1.00000000E+00    2      1000022         4                       # CHL    -->  Z1SS   CH                 
#         PDG         Width
DECAY   1000005  3.21805738E-02   # BT1   decays
#          BR          NDA       ID1       ID2       ID3       ID4
      1.00000000E+00    2      1000022         5                       # BT1    -->  Z1SS   BT                 
#         PDG         Width
DECAY   1000006  6.90205752E-06   # TP1   decays
#          BR          NDA       ID1       ID2       ID3       ID4
      3.15052248E-03    2      1000022         4                       # TP1    -->  Z1SS   CH                 
      9.96849477E-01    3      1000022        24         5             # TP1    -->  Z1SS   W+     BT          
#         PDG         Width
DECAY   2000002  1.26252070E-01   # UPR   decays
#          BR          NDA       ID1       ID2       ID3       ID4
      1.00000000E+00    2      1000022         2                       # UPR    -->  Z1SS   UP                 
#         PDG         Width
DECAY   2000001  3.23286429E-02   # DNR   decays
#          BR          NDA       ID1       ID2       ID3       ID4
      9.97551799E-01    2      1000022         1                       # DNR    -->  Z1SS   DN                 
      2.44816905E-03    2      1000021         1                       # DNR    -->  GLSS   DN                 
#         PDG         Width
DECAY   2000003  3.23287100E-02   # STR   decays
#          BR          NDA       ID1       ID2       ID3       ID4
      9.97550964E-01    2      1000022         3                       # STR    -->  Z1SS   ST                 
      2.44898256E-03    2      1000021         3                       # STR    -->  GLSS   ST                 
#         PDG         Width
DECAY   2000004  1.26241609E-01   # CHR   decays
#          BR          NDA       ID1       ID2       ID3       ID4
      1.00000000E+00    2      1000022         4                       # CHR    -->  Z1SS   CH                 
#         PDG         Width
DECAY   2000005  8.35754070E-03   # BT2   decays
#          BR          NDA       ID1       ID2       ID3       ID4
      1.00000000E+00    2      1000022         5                       # BT2    -->  Z1SS   BT                 
#         PDG         Width
DECAY   2000006  2.17450875E-08   # TP2   decays
#          BR          NDA       ID1       ID2       ID3       ID4
      1.00000000E+00    2      1000022         4                       # TP2    -->  Z1SS   CH                 
#         PDG         Width
DECAY   1000011  2.97398496E+00   # EL-   decays
#          BR          NDA       ID1       ID2       ID3       ID4
      9.82930541E-01    2      1000022        11                       # EL-    -->  Z1SS   E-                 
      5.81134157E-03    2      1000023        11                       # EL-    -->  Z2SS   E-                 
      1.12478519E-02    2     -1000024        12                       # EL-    -->  W1SS-  NUE                
      1.03625034E-05    2           11   1000039                       # EL-    -->  E-     GVSS               
#         PDG         Width
DECAY   1000013  2.97398496E+00   # MUL-  decays
#          BR          NDA       ID1       ID2       ID3       ID4
      9.82930541E-01    2      1000022        13                       # MUL-   -->  Z1SS   MU-                
      5.81133505E-03    2      1000023        13                       # MUL-   -->  Z2SS   MU-                
      1.12478519E-02    2     -1000024        14                       # MUL-   -->  W1SS-  NUM                
      1.03625034E-05    2           13   1000039                       # MUL-   -->  MU-    GVSS               
#         PDG         Width
DECAY   1000015  1.17179670E+01   # TAU1- decays
#          BR          NDA       ID1       ID2       ID3       ID4
      9.99986231E-01    2      1000022        15                       # TAU1-  -->  Z1SS   TAU-               
      4.21355844E-06    2      1000023        15                       # TAU1-  -->  Z2SS   TAU-               
      6.91411151E-06    2     -1000024        16                       # TAU1-  -->  W1SS-  NUT                
      2.62964727E-06    2           15   1000039                       # TAU1-  -->  TAU-   GVSS               
#         PDG         Width
DECAY   1000012  2.98404694E+00   # NUEL  decays
#          BR          NDA       ID1       ID2       ID3       ID4
      9.83382225E-01    2      1000022        12                       # NUEL   -->  Z1SS   NUE                
      5.38614905E-03    2      1000023        12                       # NUEL   -->  Z2SS   NUE                
      1.12213083E-02    2      1000024        11                       # NUEL   -->  W1SS+  E-                 
      1.03064804E-05    2           12   1000039                       # NUEL   -->  NUE    GVSS               
#         PDG         Width
DECAY   1000014  2.98404694E+00   # NUML  decays
#          BR          NDA       ID1       ID2       ID3       ID4
      9.83382225E-01    2      1000022        14                       # NUML   -->  Z1SS   NUM                
      5.38614905E-03    2      1000023        14                       # NUML   -->  Z2SS   NUM                
      1.12212971E-02    2      1000024        13                       # NUML   -->  W1SS+  MU-                
      1.03064804E-05    2           14   1000039                       # NUML   -->  NUM    GVSS               
#         PDG         Width
DECAY   1000016  2.98403478E+00   # NUTL  decays
#          BR          NDA       ID1       ID2       ID3       ID4
      9.83386219E-01    2      1000022        16                       # NUTL   -->  Z1SS   NUT                
      5.38617093E-03    2      1000023        16                       # NUTL   -->  Z2SS   NUT                
      1.12173147E-02    2      1000024        15                       # NUTL   -->  W1SS+  TAU-               
      1.03065222E-05    2           16   1000039                       # NUTL   -->  NUT    GVSS               
#         PDG         Width
DECAY   2000011  1.17179203E+01   # ER-   decays
#          BR          NDA       ID1       ID2       ID3       ID4
      9.99996662E-01    2      1000022        11                       # ER-    -->  Z1SS   E-                 
      7.20707249E-07    2      1000023        11                       # ER-    -->  Z2SS   E-                 
      3.05777338E-40    3      1000015        12       -16             # ER-    -->  TAU1-  NUE    ANUT        
      2.62973072E-06    2           11   1000039                       # ER-    -->  E-     GVSS               
#         PDG         Width
DECAY   2000013  1.17179203E+01   # MUR-  decays
#          BR          NDA       ID1       ID2       ID3       ID4
      9.99996662E-01    2      1000022        13                       # MUR-   -->  Z1SS   MU-                
      7.20706510E-07    2      1000023        13                       # MUR-   -->  Z2SS   MU-                
      1.31006449E-35    3      1000015        14       -16             # MUR-   -->  TAU1-  NUM    ANUT        
      2.62973072E-06    2           13   1000039                       # MUR-   -->  MU-    GVSS               
#         PDG         Width
DECAY   2000015  2.97400331E+00   # TAU2- decays
#          BR          NDA       ID1       ID2       ID3       ID4
      9.82936502E-01    2      1000022        15                       # TAU2-  -->  Z1SS   TAU-               
      5.81148313E-03    2      1000023        15                       # TAU2-  -->  Z2SS   TAU-               
      1.12520037E-02    2     -1000024        16                       # TAU2-  -->  W1SS-  NUT                
#         PDG         Width
DECAY   1000022  9.67055946E-09   # Z1SS  decays
#          BR          NDA       ID1       ID2       ID3       ID4
      7.76693523E-01    2      1000039        22                       # Z1SS   -->  GVSS   GM                 
      1.77598726E-02    3      1000039        11       -11             # Z1SS   -->  GVSS   E-     E+          
      2.05543175E-01    2      1000039        23                       # Z1SS   -->  GVSS   Z0                 
      3.41834721E-06    2      1000039        25                       # Z1SS   -->  GVSS   HL0                
#         PDG         Width
DECAY   1000023  1.37398590E+02   # Z2SS  decays
#          BR          NDA       ID1       ID2       ID3       ID4
      6.35801030E-08    2      1000022        22                       # Z2SS   -->  Z1SS   GM                 
      6.84270519E-04    2      1000022        23                       # Z2SS   -->  Z1SS   Z0                 
      2.17375540E-08    3      1000022         5        -5             # Z2SS   -->  Z1SS   BT     BB          
      4.50159450E-06    3      1000022        11       -11             # Z2SS   -->  Z1SS   E-     E+          
      4.50159450E-06    3      1000022        13       -13             # Z2SS   -->  Z1SS   MU-    MU+         
      4.56749922E-06    3      1000022        15       -15             # Z2SS   -->  Z1SS   TAU-   TAU+        
      4.33570131E-06    3      1000022        12       -12             # Z2SS   -->  Z1SS   NUE    ANUE        
      4.33570131E-06    3      1000022        14       -14             # Z2SS   -->  Z1SS   NUM    ANUM        
      4.33570131E-06    3      1000022        16       -16             # Z2SS   -->  Z1SS   NUT    ANUT        
      6.54926663E-03    2      1000022        25                       # Z2SS   -->  Z1SS   HL0                
      4.97836694E-02    2      1000002        -2                       # Z2SS   -->  UPL    UB                 
      4.97836694E-02    2     -1000002         2                       # Z2SS   -->  UBL    UP                 
      4.89564501E-02    2      1000001        -1                       # Z2SS   -->  DNL    DB                 
      4.89564501E-02    2     -1000001         1                       # Z2SS   -->  DBL    DN                 
      4.89564501E-02    2      1000003        -3                       # Z2SS   -->  STL    SB                 
      4.89564501E-02    2     -1000003         3                       # Z2SS   -->  SBL    ST                 
      4.97836284E-02    2      1000004        -4                       # Z2SS   -->  CHL    CB                 
      4.97836284E-02    2     -1000004         4                       # Z2SS   -->  CBL    CH                 
      1.09822504E-05    2      2000002        -2                       # Z2SS   -->  UPR    UB                 
      1.09822504E-05    2     -2000002         2                       # Z2SS   -->  UBR    UP                 
      2.74403374E-06    2      2000001        -1                       # Z2SS   -->  DNR    DB                 
      2.74403374E-06    2     -2000001         1                       # Z2SS   -->  DBR    DN                 
      2.74403328E-06    2      2000003        -3                       # Z2SS   -->  STR    SB                 
      2.74403328E-06    2     -2000003         3                       # Z2SS   -->  SBR    ST                 
      1.09822422E-05    2      2000004        -4                       # Z2SS   -->  CHR    CB                 
      1.09822422E-05    2     -2000004         4                       # Z2SS   -->  CBR    CH                 
      3.19059618E-04    2      1000005        -5                       # Z2SS   -->  BT1    BB                 
      3.19059618E-04    2     -1000005         5                       # Z2SS   -->  BB1    BT                 
      4.93067130E-02    2      2000005        -5                       # Z2SS   -->  BT2    BB                 
      4.93067130E-02    2     -2000005         5                       # Z2SS   -->  BB2    BT                 
      2.05573201E-01    2      1000006        -6                       # Z2SS   -->  TP1    TB                 
      2.05573201E-01    2     -1000006         6                       # Z2SS   -->  TB1    TP                 
      4.36631292E-02    2      2000006        -6                       # Z2SS   -->  TP2    TB                 
      4.36631292E-02    2     -2000006         6                       # Z2SS   -->  TB2    TP                 
      2.42759075E-08    2      1000039        22                       # Z2SS   -->  GVSS   GM                 
      6.18752882E-10    3      1000039        11       -11             # Z2SS   -->  GVSS   E-     E+          
      1.10782693E-07    2      1000039        23                       # Z2SS   -->  GVSS   Z0                 
      9.25653243E-09    2      1000039        25                       # Z2SS   -->  GVSS   HL0                
#         PDG         Width
DECAY   1000025  1.06843338E+02   # Z3SS  decays
#          BR          NDA       ID1       ID2       ID3       ID4
      1.24007995E-08    2      1000022        22                       # Z3SS   -->  Z1SS   GM                 
      4.91361084E-11    2      1000023        22                       # Z3SS   -->  Z2SS   GM                 
      7.94565858E-06    3     -1000024         2        -1             # Z3SS   -->  W1SS-  UP     DB          
      2.64855294E-06    3     -1000024        12       -11             # Z3SS   -->  W1SS-  NUE    E+          
      2.64855294E-06    3     -1000024        14       -13             # Z3SS   -->  W1SS-  NUM    MU+         
      7.94565858E-06    3      1000024         1        -2             # Z3SS   -->  W1SS+  DN     UB          
      2.64855294E-06    3      1000024        11       -12             # Z3SS   -->  W1SS+  E-     ANUE        
      2.64855294E-06    3      1000024        13       -14             # Z3SS   -->  W1SS+  MU-    ANUM        
      7.94565858E-06    3     -1000024         4        -3             # Z3SS   -->  W1SS-  CH     SB          
      2.64855294E-06    3     -1000024        16       -15             # Z3SS   -->  W1SS-  NUT    TAU+        
      7.94565858E-06    3      1000024         3        -4             # Z3SS   -->  W1SS+  ST     CB          
      2.64855294E-06    3      1000024        15       -16             # Z3SS   -->  W1SS+  TAU-   ANUT        
      1.66688673E-02    2      1000022        23                       # Z3SS   -->  Z1SS   Z0                 
      6.51997851E-08    3      1000022         5        -5             # Z3SS   -->  Z1SS   BT     BB          
      8.04430655E-09    3      1000022        15       -15             # Z3SS   -->  Z1SS   TAU-   TAU+        
      1.75805462E-06    3      1000023         2        -2             # Z3SS   -->  Z2SS   UP     UB          
      2.26702309E-06    3      1000023         1        -1             # Z3SS   -->  Z2SS   DN     DB          
      2.26702309E-06    3      1000023         3        -3             # Z3SS   -->  Z2SS   ST     SB          
      1.75805462E-06    3      1000023         4        -4             # Z3SS   -->  Z2SS   CH     CB          
      2.19007984E-06    3      1000023         5        -5             # Z3SS   -->  Z2SS   BT     BB          
      5.14273040E-07    3      1000023        11       -11             # Z3SS   -->  Z2SS   E-     E+          
      5.14273040E-07    3      1000023        13       -13             # Z3SS   -->  Z2SS   MU-    MU+         
      5.11053599E-07    3      1000023        15       -15             # Z3SS   -->  Z2SS   TAU-   TAU+        
      1.02324157E-06    3      1000023        12       -12             # Z3SS   -->  Z2SS   NUE    ANUE        
      1.02324157E-06    3      1000023        14       -14             # Z3SS   -->  Z2SS   NUM    ANUM        
      1.02324157E-06    3      1000023        16       -16             # Z3SS   -->  Z2SS   NUT    ANUT        
      1.81914226E-03    2      1000022        25                       # Z3SS   -->  Z1SS   HL0                
      4.70800751E-06    2      1000002        -2                       # Z3SS   -->  UPL    UB                 
      4.70800751E-06    2     -1000002         2                       # Z3SS   -->  UBL    UP                 
      9.25536733E-06    2      1000001        -1                       # Z3SS   -->  DNL    DB                 
      9.25536733E-06    2     -1000001         1                       # Z3SS   -->  DBL    DN                 
      9.25536733E-06    2      1000003        -3                       # Z3SS   -->  STL    SB                 
      9.25536733E-06    2     -1000003         3                       # Z3SS   -->  SBL    ST                 
      4.70800433E-06    2      1000004        -4                       # Z3SS   -->  CHL    CB                 
      4.70800433E-06    2     -1000004         4                       # Z3SS   -->  CBL    CH                 
      3.06193488E-06    2      2000002        -2                       # Z3SS   -->  UPR    UB                 
      3.06193488E-06    2     -2000002         2                       # Z3SS   -->  UBR    UP                 
      7.65083030E-07    2      2000001        -1                       # Z3SS   -->  DNR    DB                 
      7.65083030E-07    2     -2000001         1                       # Z3SS   -->  DBR    DN                 
      7.65082859E-07    2      2000003        -3                       # Z3SS   -->  STR    SB                 
      7.65082859E-07    2     -2000003         3                       # Z3SS   -->  SBR    ST                 
      3.06193283E-06    2      2000004        -4                       # Z3SS   -->  CHR    CB                 
      3.06193283E-06    2     -2000004         4                       # Z3SS   -->  CBR    CH                 
      8.36403167E-04    2      1000005        -5                       # Z3SS   -->  BT1    BB                 
      8.36403167E-04    2     -1000005         5                       # Z3SS   -->  BB1    BT                 
      8.44760856E-04    2      2000005        -5                       # Z3SS   -->  BT2    BB                 
      8.44760856E-04    2     -2000005         5                       # Z3SS   -->  BB2    BT                 
      2.10760042E-01    2      1000006        -6                       # Z3SS   -->  TP1    TB                 
      2.10760042E-01    2     -1000006         6                       # Z3SS   -->  TB1    TP                 
      2.78247863E-01    2      2000006        -6                       # Z3SS   -->  TP2    TB                 
      2.78247863E-01    2     -2000006         6                       # Z3SS   -->  TB2    TP                 
      4.29867421E-16    2      1000011       -11                       # Z3SS   -->  EL-    E+                 
      4.29867421E-16    2     -1000011        11                       # Z3SS   -->  EL+    E-                 
      1.07396349E-14    2      2000011       -11                       # Z3SS   -->  ER-    E+                 
      1.07396349E-14    2     -2000011        11                       # Z3SS   -->  ER+    E-                 
      4.09621772E-12    2      1000012       -12                       # Z3SS   -->  NUEL   ANUE               
      4.09621772E-12    2     -1000012        12                       # Z3SS   -->  ANUEL  NUE                
      4.09621772E-12    2      1000014       -14                       # Z3SS   -->  NUML   ANUM               
      4.09621772E-12    2     -1000014        14                       # Z3SS   -->  ANUML  NUM                
      4.09621772E-12    2      1000016       -16                       # Z3SS   -->  NUTL   ANUT               
      4.09621772E-12    2     -1000016        16                       # Z3SS   -->  ANUTL  NUT                
      1.53918198E-12    2      1000039        22                       # Z3SS   -->  GVSS   GM                 
      3.93055441E-14    3      1000039        11       -11             # Z3SS   -->  GVSS   E-     E+          
      2.87337212E-08    2      1000039        23                       # Z3SS   -->  GVSS   Z0                 
      1.14416927E-07    2      1000039        25                       # Z3SS   -->  GVSS   HL0                
      1.08279447E-21    2      1000039        36                       # Z3SS   -->  GVSS   HA0                
#         PDG         Width
DECAY   1000035  1.39411316E+02   # Z4SS  decays
#          BR          NDA       ID1       ID2       ID3       ID4
      4.38632908E-09    2      1000022        22                       # Z4SS   -->  Z1SS   GM                 
      2.96908470E-10    2      1000023        22                       # Z4SS   -->  Z2SS   GM                 
      9.98228500E-10    2      1000025        22                       # Z4SS   -->  Z3SS   GM                 
      7.26057263E-03    2      1000024       -24                       # Z4SS   -->  W1SS+  W-                 
      7.26057263E-03    2     -1000024        24                       # Z4SS   -->  W1SS-  W+                 
      7.51093263E-04    2      1000022        23                       # Z4SS   -->  Z1SS   Z0                 
      1.90777311E-10    2      1000023        23                       # Z4SS   -->  Z2SS   Z0                 
      2.86779063E-08    3      1000022         5        -5             # Z4SS   -->  Z1SS   BT     BB          
      3.53824614E-09    3      1000022        15       -15             # Z4SS   -->  Z1SS   TAU-   TAU+        
      1.93140241E-16    3      1000023         5        -5             # Z4SS   -->  Z2SS   BT     BB          
      2.40800846E-17    3      1000023        15       -15             # Z4SS   -->  Z2SS   TAU-   TAU+        
      1.39039230E-06    3      1000025         2        -2             # Z4SS   -->  Z3SS   UP     UB          
      1.79292010E-06    3      1000025         1        -1             # Z4SS   -->  Z3SS   DN     DB          
      1.79292010E-06    3      1000025         3        -3             # Z4SS   -->  Z3SS   ST     SB          
      1.39039230E-06    3      1000025         4        -4             # Z4SS   -->  Z3SS   CH     CB          
      1.73415572E-06    3      1000025         5        -5             # Z4SS   -->  Z3SS   BT     BB          
      4.06722961E-07    3      1000025        11       -11             # Z4SS   -->  Z3SS   E-     E+          
      4.06722961E-07    3      1000025        13       -13             # Z4SS   -->  Z3SS   MU-    MU+         
      4.04378113E-07    3      1000025        15       -15             # Z4SS   -->  Z3SS   TAU-   TAU+        
      8.09250821E-07    3      1000025        12       -12             # Z4SS   -->  Z3SS   NUE    ANUE        
      8.09250821E-07    3      1000025        14       -14             # Z4SS   -->  Z3SS   NUM    ANUM        
      8.09250821E-07    3      1000025        16       -16             # Z4SS   -->  Z3SS   NUT    ANUT        
      6.11178298E-03    2      1000022        25                       # Z4SS   -->  Z1SS   HL0                
      9.28443669E-08    2      1000023        25                       # Z4SS   -->  Z2SS   HL0                
      5.15690632E-02    2      1000002        -2                       # Z4SS   -->  UPL    UB                 
      5.15690632E-02    2     -1000002         2                       # Z4SS   -->  UBL    UP                 
      5.22149131E-02    2      1000001        -1                       # Z4SS   -->  DNL    DB                 
      5.22149131E-02    2     -1000001         1                       # Z4SS   -->  DBL    DN                 
      5.22149131E-02    2      1000003        -3                       # Z4SS   -->  STL    SB                 
      5.22149131E-02    2     -1000003         3                       # Z4SS   -->  SBL    ST                 
      5.15690260E-02    2      1000004        -4                       # Z4SS   -->  CHL    CB                 
      5.15690260E-02    2     -1000004         4                       # Z4SS   -->  CBL    CH                 
      1.02897284E-05    2      2000002        -2                       # Z4SS   -->  UPR    UB                 
      1.02897284E-05    2     -2000002         2                       # Z4SS   -->  UBR    UP                 
      2.57116426E-06    2      2000001        -1                       # Z4SS   -->  DNR    DB                 
      2.57116426E-06    2     -2000001         1                       # Z4SS   -->  DBR    DN                 
      2.57116380E-06    2      2000003        -3                       # Z4SS   -->  STR    SB                 
      2.57116380E-06    2     -2000003         3                       # Z4SS   -->  SBR    ST                 
      1.02897202E-05    2      2000004        -4                       # Z4SS   -->  CHR    CB                 
      1.02897202E-05    2     -2000004         4                       # Z4SS   -->  CBR    CH                 
      3.30402487E-04    2      1000005        -5                       # Z4SS   -->  BT1    BB                 
      3.30402487E-04    2     -1000005         5                       # Z4SS   -->  BB1    BT                 
      5.25081530E-02    2      2000005        -5                       # Z4SS   -->  BT2    BB                 
      5.25081530E-02    2     -2000005         5                       # Z4SS   -->  BB2    BT                 
      5.71912192E-02    2      1000006        -6                       # Z4SS   -->  TP1    TB                 
      5.71912192E-02    2     -1000006         6                       # Z4SS   -->  TB1    TP                 
      1.71318904E-01    2      2000006        -6                       # Z4SS   -->  TP2    TB                 
      1.71318904E-01    2     -2000006         6                       # Z4SS   -->  TB2    TP                 
      5.78321742E-05    2      1000011       -11                       # Z4SS   -->  EL-    E+                 
      5.78321742E-05    2     -1000011        11                       # Z4SS   -->  EL+    E-                 
      5.78321160E-05    2      1000013       -13                       # Z4SS   -->  MUL-   MU+                
      5.78321160E-05    2     -1000013        13                       # Z4SS   -->  MUL+   MU-                
      2.63796540E-08    2      2000011       -11                       # Z4SS   -->  ER-    E+                 
      2.63796540E-08    2     -2000011        11                       # Z4SS   -->  ER+    E-                 
      2.63796274E-08    2      2000013       -13                       # Z4SS   -->  MUR-   MU+                
      2.63796274E-08    2     -2000013        13                       # Z4SS   -->  MUR+   MU-                
      1.61805019E-07    2      1000015       -15                       # Z4SS   -->  TAU1-  TAU+               
      1.61805019E-07    2     -1000015        15                       # Z4SS   -->  TAU1+  TAU-               
      5.77898936E-05    2      2000015       -15                       # Z4SS   -->  TAU2-  TAU+               
      5.77898936E-05    2     -2000015        15                       # Z4SS   -->  TAU2+  TAU-               
      6.20242063E-05    2      1000012       -12                       # Z4SS   -->  NUEL   ANUE               
      6.20242063E-05    2     -1000012        12                       # Z4SS   -->  ANUEL  NUE                
      6.20242063E-05    2      1000014       -14                       # Z4SS   -->  NUML   ANUM               
      6.20242063E-05    2     -1000014        14                       # Z4SS   -->  ANUML  NUM                
      6.20242063E-05    2      1000016       -16                       # Z4SS   -->  NUTL   ANUT               
      6.20242063E-05    2     -1000016        16                       # Z4SS   -->  ANUTL  NUT                
      2.74268004E-08    2      1000039        22                       # Z4SS   -->  GVSS   GM                 
      7.01680269E-10    3      1000039        11       -11             # Z4SS   -->  GVSS   E-     E+          
      1.50295136E-07    2      1000039        23                       # Z4SS   -->  GVSS   Z0                 
      1.29944926E-08    2      1000039        25                       # Z4SS   -->  GVSS   HL0                
      1.59005147E-13    2      1000039        35                       # Z4SS   -->  GVSS   HH0                
      1.18070972E-13    2      1000039        36                       # Z4SS   -->  GVSS   HA0                
#         PDG         Width
DECAY   1000024  1.37523834E+02   # W1SS+ decays
#          BR          NDA       ID1       ID2       ID3       ID4
      8.77618368E-06    3      1000022       -11        12             # W1SS+  -->  Z1SS   E+     NUE         
      8.77618368E-06    3      1000022       -13        14             # W1SS+  -->  Z1SS   MU+    NUM         
      8.84244764E-06    3      1000022       -15        16             # W1SS+  -->  Z1SS   TAU+   NUT         
      7.23444112E-03    2      1000022        24                       # W1SS+  -->  Z1SS   W+                 
      9.97883305E-02    2      1000002        -1                       # W1SS+  -->  UPL    DB                 
      9.67794433E-02    2     -1000001         2                       # W1SS+  -->  DBL    UP                 
      9.97882560E-02    2      1000004        -3                       # W1SS+  -->  CHL    SB                 
      9.69580859E-02    2     -1000003         4                       # W1SS+  -->  SBL    CH                 
      2.71628201E-01    2      1000006        -5                       # W1SS+  -->  TP1    BB                 
      8.82210210E-03    2      2000006        -5                       # W1SS+  -->  TP2    BB                 
      6.34483586E-04    2     -1000005         6                       # W1SS+  -->  BB1    TP                 
      3.18340302E-01    2     -2000005         6                       # W1SS+  -->  BB2    TP                 
#         PDG         Width
DECAY   1000037  1.39544495E+02   # W2SS+ decays
#          BR          NDA       ID1       ID2       ID3       ID4
      3.44781825E-09    3      1000022       -15        16             # W2SS+  -->  Z1SS   TAU+   NUT         
      6.80943998E-03    2      1000022        24                       # W2SS+  -->  Z1SS   W+                 
      5.27220479E-14    3      1000023       -15        16             # W2SS+  -->  Z2SS   TAU+   NUT         
      7.29889655E-03    2      1000023        24                       # W2SS+  -->  Z2SS   W+                 
      5.92957531E-06    3      1000025         2        -1             # W2SS+  -->  Z3SS   UP     DB          
      5.92957531E-06    3      1000025         4        -3             # W2SS+  -->  Z3SS   CH     SB          
      1.97652503E-06    3      1000025       -11        12             # W2SS+  -->  Z3SS   E+     NUE         
      1.97652503E-06    3      1000025       -13        14             # W2SS+  -->  Z3SS   MU+    NUM         
      1.97652503E-06    3      1000025       -15        16             # W2SS+  -->  Z3SS   TAU+   NUT         
      1.02641679E-01    2      1000002        -1                       # W2SS+  -->  UPL    DB                 
      1.05465442E-01    2     -1000001         2                       # W2SS+  -->  DBL    UP                 
      1.02641627E-01    2      1000004        -3                       # W2SS+  -->  CHL    SB                 
      1.05637699E-01    2     -1000003         4                       # W2SS+  -->  SBL    CH                 
      5.73804090E-03    2      1000006        -5                       # W2SS+  -->  TP1    BB                 
      2.93753564E-01    2      2000006        -5                       # W2SS+  -->  TP2    BB                 
      6.52824179E-04    2     -1000005         6                       # W2SS+  -->  BB1    TP                 
      2.62642771E-01    2     -2000005         6                       # W2SS+  -->  BB2    TP                 
      1.19254546E-04    2      1000012       -11                       # W2SS+  -->  NUEL   E+                 
      1.19254408E-04    2      1000014       -13                       # W2SS+  -->  NUML   MU+                
      1.19214703E-04    2      1000016       -15                       # W2SS+  -->  NUTL   TAU+               
      1.19365854E-04    2     -1000011        12                       # W2SS+  -->  EL+    NUE                
      1.19365854E-04    2     -1000013        14                       # W2SS+  -->  MUL+   NUM                
      2.73909507E-07    2     -1000015        16                       # W2SS+  -->  TAU1+  NUT                
      1.19320284E-04    2     -2000015        16                       # W2SS+  -->  TAU2+  NUT                
      5.98353380E-03    2      1000024        23                       # W2SS+  -->  W1SS+  Z0                 
      4.33801887E-07    2      1000024        25                       # W2SS+  -->  W1SS+  HL0                
#         PDG         Width
DECAY        25  4.47680429E-03   # HL0   decays
#          BR          NDA       ID1       ID2       ID3       ID4
      4.58842742E-09    2           11       -11                       # HL0    -->  E-     E+                 
      1.93730812E-04    2           13       -13                       # HL0    -->  MU-    MU+                
      5.54151013E-02    2           15       -15                       # HL0    -->  TAU-   TAU+               
      5.75507602E-06    2            1        -1                       # HL0    -->  DN     DB                 
      2.32533924E-03    2            3        -3                       # HL0    -->  ST     SB                 
      7.57442474E-01    2            5        -5                       # HL0    -->  BT     BB                 
      1.83169323E-06    2            2        -2                       # HL0    -->  UP     UB                 
      3.42444554E-02    2            4        -4                       # HL0    -->  CH     CB                 
      2.00066855E-03    2           22        22                       # HL0    -->  GM     GM                 
      4.13775891E-02    2           21        21                       # HL0    -->  GL     GL                 
      5.42592444E-03    3           24        11       -12             # HL0    -->  W+     E-     ANUE        
      5.42592444E-03    3           24        13       -14             # HL0    -->  W+     MU-    ANUM        
      5.42592444E-03    3           24        15       -16             # HL0    -->  W+     TAU-   ANUT        
      1.62777733E-02    3           24        -2         1             # HL0    -->  W+     UB     DN          
      1.62777733E-02    3           24        -4         3             # HL0    -->  W+     CB     ST          
      5.42592444E-03    3          -24       -11        12             # HL0    -->  W-     E+     NUE         
      5.42592444E-03    3          -24       -13        14             # HL0    -->  W-     MU+    NUM         
      5.42592444E-03    3          -24       -15        16             # HL0    -->  W-     TAU+   NUT         
      1.62777733E-02    3          -24         2        -1             # HL0    -->  W-     UP     DB          
      1.62777733E-02    3          -24         4        -3             # HL0    -->  W-     CH     SB          
      6.37865509E-04    3           23        12       -12             # HL0    -->  Z0     NUE    ANUE        
      6.37865509E-04    3           23        14       -14             # HL0    -->  Z0     NUM    ANUM        
      6.37865509E-04    3           23        16       -16             # HL0    -->  Z0     NUT    ANUT        
      3.21031286E-04    3           23        11       -11             # HL0    -->  Z0     E-     E+          
      3.21031286E-04    3           23        13       -13             # HL0    -->  Z0     MU-    MU+         
      3.21031286E-04    3           23        15       -15             # HL0    -->  Z0     TAU-   TAU+        
      1.09982595E-03    3           23         2        -2             # HL0    -->  Z0     UP     UB          
      1.09982595E-03    3           23         4        -4             # HL0    -->  Z0     CH     CB          
      1.41684688E-03    3           23         1        -1             # HL0    -->  Z0     DN     DB          
      1.41684688E-03    3           23         3        -3             # HL0    -->  Z0     ST     SB          
      1.41684688E-03    3           23         5        -5             # HL0    -->  Z0     BT     BB          
#         PDG         Width
DECAY        35  1.33632202E+02   # HH0   decays
#          BR          NDA       ID1       ID2       ID3       ID4
      2.88010327E-11    2           11       -11                       # HH0    -->  E-     E+                 
      1.21603148E-06    2           13       -13                       # HH0    -->  MU-    MU+                
      3.48289032E-04    2           15       -15                       # HH0    -->  TAU-   TAU+               
      3.50364466E-08    2            1        -1                       # HH0    -->  DN     DB                 
      1.41564979E-05    2            3        -3                       # HH0    -->  ST     SB                 
      3.14836623E-03    2            5        -5                       # HH0    -->  BT     BB                 
      1.39137771E-10    2            2        -2                       # HH0    -->  UP     UB                 
      1.76707829E-06    2            4        -4                       # HH0    -->  CH     CB                 
      9.12565142E-02    2            6        -6                       # HH0    -->  TP     TB                 
      2.28458418E-07    2           22        22                       # HH0    -->  GM     GM                 
      3.13323180E-05    2           21        21                       # HH0    -->  GL     GL                 
      2.45118226E-05    2           24       -24                       # HH0    -->  W+     W-                 
      1.25596735E-05    2           23        23                       # HH0    -->  Z0     Z0                 
      8.05942273E-06    2      1000022   1000022                       # HH0    -->  Z1SS   Z1SS               
      2.40401365E-02    2           25        25                       # HH0    -->  HL0    HL0                
      3.11622389E-05    2      1000002  -1000002                       # HH0    -->  UPL    UBL                
      6.24770610E-06    2      2000002  -2000002                       # HH0    -->  UPR    UBR                
      3.11404910E-05    2      1000004  -1000004                       # HH0    -->  CHL    CBL                
      6.23797723E-06    2      2000004  -2000004                       # HH0    -->  CHR    CBR                
      4.65845624E-05    2      1000001  -1000001                       # HH0    -->  DNL    DBL                
      1.56094097E-06    2      2000001  -2000001                       # HH0    -->  DNR    DBR                
      4.65897319E-05    2      1000003  -1000003                       # HH0    -->  STL    SBL                
      1.55999544E-06    2      2000003  -2000003                       # HH0    -->  STR    SBR                
      1.37026097E-06    2      1000005  -1000005                       # HH0    -->  BT1    BB1                
      4.76687892E-05    2      2000005  -2000005                       # HH0    -->  BT2    BB2                
      1.31262895E-02    2      1000005  -2000005                       # HH0    -->  BT1    BB2                
      1.31262895E-02    2      2000005  -1000005                       # HH0    -->  BT2    BB1                
      4.51136202E-01    2      1000006  -1000006                       # HH0    -->  TP1    TB1                
      4.00723070E-01    2      2000006  -2000006                       # HH0    -->  TP2    TB2                
      1.39048381E-03    2      1000006  -2000006                       # HH0    -->  TP1    TB2                
      1.39048381E-03    2      2000006  -1000006                       # HH0    -->  TP2    TB1                
#         PDG         Width
DECAY        36  1.30903259E+02   # HA0   decays
#          BR          NDA       ID1       ID2       ID3       ID4
      2.92095792E-11    2           11       -11                       # HA0    -->  E-     E+                 
      1.23328118E-06    2           13       -13                       # HA0    -->  MU-    MU+                
      3.53230251E-04    2           15       -15                       # HA0    -->  TAU-   TAU+               
      3.55351979E-08    2            1        -1                       # HA0    -->  DN     DB                 
      1.43580182E-05    2            3        -3                       # HA0    -->  ST     SB                 
      3.19564273E-03    2            5        -5                       # HA0    -->  BT     BB                 
      1.40371714E-10    2            2        -2                       # HA0    -->  UP     UB                 
      1.78411210E-06    2            4        -4                       # HA0    -->  CH     CB                 
      9.34672952E-02    2            6        -6                       # HA0    -->  TP     TB                 
      2.30716410E-07    2           22        22                       # HA0    -->  GM     GM                 
      3.01964938E-05    2           21        21                       # HA0    -->  GL     GL                 
      1.90013816E-05    2      1000022   1000022                       # HA0    -->  Z1SS   Z1SS               
      2.47002226E-05    2           25        23                       # HA0    -->  HL0    Z0                 
      5.13264098E-10    2      1000002  -2000002                       # HA0    -->  UPL    UBR                
      5.13264098E-10    2      2000002  -1000002                       # HA0    -->  UPR    UBL                
      2.98285431E-05    2      1000004  -2000004                       # HA0    -->  CHL    CBR                
      2.98285431E-05    2      2000004  -1000004                       # HA0    -->  CHR    CBL                
      1.60189839E-09    2      1000001  -2000001                       # HA0    -->  DNL    DBR                
      1.60189839E-09    2      2000001  -1000001                       # HA0    -->  DNR    DBL                
      6.47247987E-07    2      1000003  -2000003                       # HA0    -->  STL    SBR                
      6.47247987E-07    2      2000003  -1000003                       # HA0    -->  STR    SBL                
      1.34666571E-02    2      1000005  -2000005                       # HA0    -->  BT1    BB2                
      1.34666571E-02    2      2000005  -1000005                       # HA0    -->  BT2    BB1                
      4.37949032E-01    2      1000006  -2000006                       # HA0    -->  TP1    TB2                
      4.37949032E-01    2      2000006  -1000006                       # HA0    -->  TP2    TB1                
#         PDG         Width
DECAY        37  1.29876251E+02   # H+    decays
#          BR          NDA       ID1       ID2       ID3       ID4
      2.96298992E-11    2           12       -11                       # H+     -->  NUE    E+                 
      1.25102792E-06    2           14       -13                       # H+     -->  NUM    MU+                
      3.58313206E-04    2           16       -15                       # H+     -->  NUT    TAU+               
      3.34959438E-08    2            2        -1                       # H+     -->  UP     DB                 
      1.51547474E-05    2            4        -3                       # H+     -->  CH     SB                 
      9.02932882E-02    2            6        -5                       # H+     -->  TP     BB                 
      2.50739249E-05    2           25        24                       # H+     -->  HL0    W+                 
      7.90780759E-05    2      1000002  -1000001                       # H+     -->  UPL    DBL                
      3.21800542E-09    2      2000002  -2000001                       # H+     -->  UPR    DBR                
      7.90484773E-05    2      1000004  -1000003                       # H+     -->  CHL    SBL                
      1.30023636E-06    2      2000004  -2000003                       # H+     -->  CHR    SBR                
      1.47381900E-02    2      1000006  -1000005                       # H+     -->  TP1    BB1                
      4.24396455E-01    2      1000006  -2000005                       # H+     -->  TP1    BB2                
      1.22010224E-02    2      2000006  -1000005                       # H+     -->  TP2    BB1                
      4.57811713E-01    2      2000006  -2000005                       # H+     -->  TP2    BB2                
