  65
  401   2000.8307    0.26157E-25
  402   1999.3210    0.26060E-25
  403   2000.8307    0.26158E-25
  404   1999.3215    0.26061E-25
  405   1999.9003    0.48123E-25
  406   1828.8071    0.13892E-25
  407   2000.8307    0.26157E-25
  408   1999.3210    0.26060E-25
  409   2000.8307    0.26158E-25
  410   1999.3215    0.26061E-25
  411   1999.9003    0.48123E-25
  412   1828.8071    0.13892E-25
  413   2000.1520    0.58579E-24
  414   1999.6959    0.14648E-24
  415   2000.1520    0.58579E-24
  416   1999.6964    0.14648E-24
  417   2001.0859    0.14152E-25
  418   2165.5322    0.80648E-26
  419   2000.1520    0.58579E-24
  420   1999.6959    0.14648E-24
  421   2000.1520    0.58579E-24
  422   1999.6964    0.14648E-24
  423   2001.0859    0.14152E-25
  424   2165.5322    0.80648E-26
  425   2000.5267    0.23997E-25
  426   1999.0170    0.23955E-25
  427   2000.5267    0.23997E-25
  428   1999.0170    0.23955E-25
  429     82.5621    0.22516E-22
  430   1999.0170    0.23828E-25
  431   2000.5267    0.23997E-25
  432   1999.0170    0.23955E-25
  433   2000.5267    0.23997E-25
  434   1999.0170    0.23955E-25
  435     82.5621    0.22516E-22
  436   1999.0170    0.23828E-25
  437     82.5992    0.22827E-22
  438      0.0000    0.10000E+31
  439     82.5993    0.22827E-22
  440      0.0000    0.10000E+31
  441   2000.5475    0.23869E-25
  442      0.0000    0.10000E+31
  443     82.5992    0.22827E-22
  444      0.0000    0.10000E+31
  445     82.5993    0.22827E-22
  446      0.0000    0.10000E+31
  447   2000.5475    0.23869E-25
  448      0.0000    0.10000E+31
  449   2000.0000    0.19899E-24
  450     55.3707    0.10000E+31
  451    109.8333    0.29769E-23
  452   -131.8900    0.47000E-22
  453    206.6861    0.89870E-24
  454     71.9463    0.41710E-18
  455    204.3513    0.17874E-23
  456     71.9463    0.41710E-18
  457    204.3513    0.17874E-23
  203    119.0164    0.59309E-22
  204    504.3795    0.10559E-24
  205    500.0000    0.10524E-24
  206    509.4134    0.10905E-24
  207    509.4134    0.10905E-24
  458      0.0000    0.10000E+31
    6    172.5000    0.57395E-24
   12    172.5000    0.57395E-24
   6
   401  0.98779619E-01     0   450     1     0     0     0
   401  0.39081085E-01     0   451     1     0     0     0
   401  0.13879717E-01     0   452     1     0     0     0
   401  0.18957166E+00     0   453     1     0     0     0
   401  0.17471993E+00     0   456     2     0     0     0
   401  0.48396808E+00     0   457     2     0     0     0
   6
   402  0.45383498E-01     0   450     2     0     0     0
   402  0.13956398E+00     0   451     2     0     0     0
   402  0.85975230E-02     0   452     2     0     0     0
   402  0.14666694E+00     0   453     2     0     0     0
   402  0.39626589E+00     0   454     1     0     0     0
   402  0.26352215E+00     0   455     1     0     0     0
   6
   403  0.98779678E-01     0   450     3     0     0     0
   403  0.39081112E-01     0   451     3     0     0     0
   403  0.13879726E-01     0   452     3     0     0     0
   403  0.18957178E+00     0   453     3     0     0     0
   403  0.17471987E+00     0   456     4     0     0     0
   403  0.48396793E+00     0   457     4     0     0     0
   6
   404  0.45383468E-01     0   450     4     0     0     0
   404  0.13956389E+00     0   451     4     0     0     0
   404  0.85975183E-02     0   452     4     0     0     0
   404  0.14666685E+00     0   453     4     0     0     0
   404  0.39626604E+00     0   454     3     0     0     0
   404  0.26352221E+00     0   455     3     0     0     0
   7
   405  0.11085761E+00     0   450     5     0     0     0
   405  0.61843462E-01     0   451     5     0     0     0
   405  0.56685723E-03     0   452     5     0     0     0
   405  0.49463686E-01     0   453     5     0     0     0
   405  0.29645368E+00     0   456     6     0     0     0
   405  0.35971928E+00     0   457     6     0     0     0
   405  0.12109546E+00     0   199   406     0     0     0
   6
   406  0.14353207E-01     0   450     6     0     0     0
   406  0.73197640E-01     0   451     6     0     0     0
   406  0.20681636E+00     0   452     6     0     0     0
   406  0.30479291E+00     0   453     6     0     0     0
   406  0.24601894E-02     0   454     5     0     0     0
   406  0.39837971E+00     0   455     5     0     0     0
   6
   407  0.98779619E-01     0   450     7     0     0     0
   407  0.39081085E-01     0   451     7     0     0     0
   407  0.13879717E-01     0   452     7     0     0     0
   407  0.18957166E+00     0   453     7     0     0     0
   407  0.17471993E+00     0   454     8     0     0     0
   407  0.48396808E+00     0   455     8     0     0     0
   6
   408  0.45383498E-01     0   450     8     0     0     0
   408  0.13956398E+00     0   451     8     0     0     0
   408  0.85975230E-02     0   452     8     0     0     0
   408  0.14666694E+00     0   453     8     0     0     0
   408  0.39626589E+00     0   456     7     0     0     0
   408  0.26352215E+00     0   457     7     0     0     0
   6
   409  0.98779678E-01     0   450     9     0     0     0
   409  0.39081112E-01     0   451     9     0     0     0
   409  0.13879726E-01     0   452     9     0     0     0
   409  0.18957178E+00     0   453     9     0     0     0
   409  0.17471987E+00     0   454    10     0     0     0
   409  0.48396793E+00     0   455    10     0     0     0
   6
   410  0.45383468E-01     0   450    10     0     0     0
   410  0.13956389E+00     0   451    10     0     0     0
   410  0.85975183E-02     0   452    10     0     0     0
   410  0.14666685E+00     0   453    10     0     0     0
   410  0.39626604E+00     0   456     9     0     0     0
   410  0.26352221E+00     0   457     9     0     0     0
   7
   411  0.11085761E+00     0   450    11     0     0     0
   411  0.61843462E-01     0   451    11     0     0     0
   411  0.56685723E-03     0   452    11     0     0     0
   411  0.49463686E-01     0   453    11     0     0     0
   411  0.29645368E+00     0   454    12     0     0     0
   411  0.35971928E+00     0   455    12     0     0     0
   411  0.12109546E+00     0   198   412     0     0     0
   6
   412  0.14353207E-01     0   450    12     0     0     0
   412  0.73197640E-01     0   451    12     0     0     0
   412  0.20681636E+00     0   452    12     0     0     0
   412  0.30479291E+00     0   453    12     0     0     0
   412  0.24601894E-02     0   456    11     0     0     0
   412  0.39837971E+00     0   457    11     0     0     0
   4
   413  0.22738163E+00     0   450     1     0     0     0
   413  0.69923782E+00     0   451     1     0     0     0
   413  0.13859149E-01     0   452     1     0     0     0
   413  0.59521366E-01     0   453     1     0     0     0
   4
   414  0.22738211E+00     0   450     2     0     0     0
   414  0.69923788E+00     0   451     2     0     0     0
   414  0.13859134E-01     0   452     2     0     0     0
   414  0.59520941E-01     0   453     2     0     0     0
   4
   415  0.22738163E+00     0   450     3     0     0     0
   415  0.69923782E+00     0   451     3     0     0     0
   415  0.13859149E-01     0   452     3     0     0     0
   415  0.59521366E-01     0   453     3     0     0     0
   4
   416  0.22738209E+00     0   450     4     0     0     0
   416  0.69923782E+00     0   451     4     0     0     0
   416  0.13859131E-01     0   452     4     0     0     0
   416  0.59520941E-01     0   453     4     0     0     0
   7
   417  0.32563198E-01     0   450     5     0     0     0
   417  0.20277917E-01     0   451     5     0     0     0
   417  0.13754333E-01     0   452     5     0     0     0
   417  0.91437213E-01     0   453     5     0     0     0
   417  0.22645496E+00     0   456     6     0     0     0
   417  0.47850895E+00     0   457     6     0     0     0
   417  0.13700342E+00     0   199   406     0     0     0
   9
   418  0.27040479E+00     0   454     5     0     0     0
   418  0.11404200E-01     0   455     5     0     0     0
   418  0.21568285E+00     0   200   406     0     0     0
   418  0.18106399E-01     0   198   405     0     0     0
   418  0.66055402E-01     0   198   417     0     0     0
   418  0.11347674E+00     0   450     6     0     0     0
   418  0.53591561E-01     0   451     6     0     0     0
   418  0.21661244E+00     0   452     6     0     0     0
   418  0.34665696E-01     0   453     6     0     0     0
   4
   419  0.22738163E+00     0   450     7     0     0     0
   419  0.69923782E+00     0   451     7     0     0     0
   419  0.13859149E-01     0   452     7     0     0     0
   419  0.59521366E-01     0   453     7     0     0     0
   4
   420  0.22738211E+00     0   450     8     0     0     0
   420  0.69923788E+00     0   451     8     0     0     0
   420  0.13859134E-01     0   452     8     0     0     0
   420  0.59520941E-01     0   453     8     0     0     0
   4
   421  0.22738163E+00     0   450     9     0     0     0
   421  0.69923782E+00     0   451     9     0     0     0
   421  0.13859149E-01     0   452     9     0     0     0
   421  0.59521366E-01     0   453     9     0     0     0
   4
   422  0.22738209E+00     0   450    10     0     0     0
   422  0.69923782E+00     0   451    10     0     0     0
   422  0.13859131E-01     0   452    10     0     0     0
   422  0.59520941E-01     0   453    10     0     0     0
   7
   423  0.32563198E-01     0   450    11     0     0     0
   423  0.20277917E-01     0   451    11     0     0     0
   423  0.13754333E-01     0   452    11     0     0     0
   423  0.91437213E-01     0   453    11     0     0     0
   423  0.22645496E+00     0   454    12     0     0     0
   423  0.47850895E+00     0   455    12     0     0     0
   423  0.13700342E+00     0   198   412     0     0     0
   9
   424  0.27040479E+00     0   456    11     0     0     0
   424  0.11404200E-01     0   457    11     0     0     0
   424  0.21568285E+00     0   200   412     0     0     0
   424  0.18106399E-01     0   199   411     0     0     0
   424  0.66055402E-01     0   199   423     0     0     0
   424  0.11347674E+00     0   450    12     0     0     0
   424  0.53591561E-01     0   451    12     0     0     0
   424  0.21661244E+00     0   452    12     0     0     0
   424  0.34665696E-01     0   453    12     0     0     0
   6
   425  0.11656729E-01     0   450   121     0     0     0
   425  0.27863654E+00     0   451   121     0     0     0
   425  0.42476598E-02     0   452   121     0     0     0
   425  0.10126969E+00     0   453   121     0     0     0
   425  0.16026458E+00     0   456   122     0     0     0
   425  0.44392478E+00     0   457   122     0     0     0
   6
   426  0.15763302E+00     0   450   122     0     0     0
   426  0.40187192E-03     0   451   122     0     0     0
   426  0.18629422E-01     0   452   122     0     0     0
   426  0.21695577E+00     0   453   122     0     0     0
   426  0.36419010E+00     0   454   121     0     0     0
   426  0.24218982E+00     0   455   121     0     0     0
   6
   427  0.11656729E-01     0   450   123     0     0     0
   427  0.27863654E+00     0   451   123     0     0     0
   427  0.42476598E-02     0   452   123     0     0     0
   427  0.10126969E+00     0   453   123     0     0     0
   427  0.16026458E+00     0   456   124     0     0     0
   427  0.44392478E+00     0   457   124     0     0     0
   6
   428  0.15763302E+00     0   450   124     0     0     0
   428  0.40187192E-03     0   451   124     0     0     0
   428  0.18629422E-01     0   452   124     0     0     0
   428  0.21695577E+00     0   453   124     0     0     0
   428  0.36419010E+00     0   454   123     0     0     0
   428  0.24218982E+00     0   455   123     0     0     0
   2
   429  0.99109828E+00     0   450   125     0     0     0
   429  0.89017022E-02     0   456   126     0     0     0
   7
   430  0.15679847E+00     0   450   126     0     0     0
   430  0.39974431E-03     0   451   126     0     0     0
   430  0.18530793E-01     0   452   126     0     0     0
   430  0.21580712E+00     0   453   126     0     0     0
   430  0.36616978E+00     0   454   125     0     0     0
   430  0.24227560E+00     0   455   125     0     0     0
   430  0.18449386E-04     0   198   429     0     0     0
   6
   431  0.11656729E-01     0   450   127     0     0     0
   431  0.27863654E+00     0   451   127     0     0     0
   431  0.42476598E-02     0   452   127     0     0     0
   431  0.10126969E+00     0   453   127     0     0     0
   431  0.16026458E+00     0   454   128     0     0     0
   431  0.44392478E+00     0   455   128     0     0     0
   6
   432  0.15763302E+00     0   450   128     0     0     0
   432  0.40187192E-03     0   451   128     0     0     0
   432  0.18629422E-01     0   452   128     0     0     0
   432  0.21695577E+00     0   453   128     0     0     0
   432  0.36419010E+00     0   456   127     0     0     0
   432  0.24218982E+00     0   457   127     0     0     0
   6
   433  0.11656729E-01     0   450   129     0     0     0
   433  0.27863654E+00     0   451   129     0     0     0
   433  0.42476598E-02     0   452   129     0     0     0
   433  0.10126969E+00     0   453   129     0     0     0
   433  0.16026458E+00     0   454   130     0     0     0
   433  0.44392478E+00     0   455   130     0     0     0
   6
   434  0.15763302E+00     0   450   130     0     0     0
   434  0.40187192E-03     0   451   130     0     0     0
   434  0.18629422E-01     0   452   130     0     0     0
   434  0.21695577E+00     0   453   130     0     0     0
   434  0.36419010E+00     0   456   129     0     0     0
   434  0.24218982E+00     0   457   129     0     0     0
   2
   435  0.99109828E+00     0   450   131     0     0     0
   435  0.89017022E-02     0   454   132     0     0     0
   7
   436  0.15679847E+00     0   450   132     0     0     0
   436  0.39974431E-03     0   451   132     0     0     0
   436  0.18530793E-01     0   452   132     0     0     0
   436  0.21580712E+00     0   453   132     0     0     0
   436  0.36616978E+00     0   456   131     0     0     0
   436  0.24227560E+00     0   457   131     0     0     0
   436  0.18449386E-04     0   199   435     0     0     0
   1
   437  0.10000000E+01     0   450   121     0     0     0
   0
   1
   439  0.10000000E+01     0   450   123     0     0     0
   0
   6
   441  0.13826250E-01     0   450   125     0     0     0
   441  0.27731532E+00     0   451   125     0     0     0
   441  0.64130384E-02     0   452   125     0     0     0
   441  0.10145145E+00     0   453   125     0     0     0
   441  0.15940131E+00     0   456   126     0     0     0
   441  0.44159278E+00     0   457   126     0     0     0
   0
   1
   443  0.10000000E+01     0   450   127     0     0     0
   0
   1
   445  0.10000000E+01     0   450   129     0     0     0
   0
   6
   447  0.13826250E-01     0   450   131     0     0     0
   447  0.27731532E+00     0   451   131     0     0     0
   447  0.64130384E-02     0   452   131     0     0     0
   447  0.10145145E+00     0   453   131     0     0     0
   447  0.15940131E+00     0   454   132     0     0     0
   447  0.44159278E+00     0   455   132     0     0     0
   0
  32
   449  0.22248372E-02     0   454     1     8     0     0
   449  0.22248372E-02     0   456     2     7     0     0
   449  0.22248372E-02     0   454     3    10     0     0
   449  0.22248372E-02     0   456     4     9     0     0
   449  0.11972687E-01     0   454     5    12     0     0
   449  0.11972687E-01     0   456     6    11     0     0
   449  0.60527236E-02     0   455     1     8     0     0
   449  0.60527236E-02     0   457     2     7     0     0
   449  0.60527236E-02     0   455     3    10     0     0
   449  0.60527236E-02     0   457     4     9     0     0
   449  0.18959868E+00     0   455     5    12     0     0
   449  0.18959868E+00     0   457     6    11     0     0
   449  0.31673859E-03     0   450    13     0     0     0
   449  0.28359010E-02     0   450     1     7     0     0
   449  0.28359010E-02     0   450     3     9     0     0
   449  0.31270052E-02     0   450     5    11     0     0
   449  0.15067822E-01     0   450     6    12     0     0
   449  0.43200867E-04     0   451    13     0     0     0
   449  0.18645945E-02     0   451     1     7     0     0
   449  0.18645945E-02     0   451     3     9     0     0
   449  0.18670349E-02     0   451     5    11     0     0
   449  0.62137213E-01     0   451     6    12     0     0
   449  0.95462200E-03     0   452    13     0     0     0
   449  0.35051175E-03     0   452     1     7     0     0
   449  0.35051175E-03     0   452     3     9     0     0
   449  0.73129585E-03     0   452     5    11     0     0
   449  0.18630654E+00     0   452     6    12     0     0
   449  0.36597427E-03     0   453    13     0     0     0
   449  0.51366747E-02     0   453     1     7     0     0
   449  0.51366747E-02     0   453     3     9     0     0
   449  0.52380054E-02     0   453     5    11     0     0
   449  0.26721621E+00     0   453     6    12     0     0
   0
  16
   451  0.69706017E-04     0   456     2     7     0     0
   451  0.23235340E-04     0   456   122   127     0     0
   451  0.23235340E-04     0   456   124   129     0     0
   451  0.69706017E-04     0   454     1     8     0     0
   451  0.23235340E-04     0   454   121   128     0     0
   451  0.23235340E-04     0   454   123   130     0     0
   451  0.69706017E-04     0   456     4     9     0     0
   451  0.23235340E-04     0   456   126   131     0     0
   451  0.69706017E-04     0   454     3    10     0     0
   451  0.23235340E-04     0   454   125   132     0     0
   451  0.16672669E+00     0   437   127     0     0     0
   451  0.16672669E+00     0   443   121     0     0     0
   451  0.16672508E+00     0   439   129     0     0     0
   451  0.16672508E+00     0   445   123     0     0     0
   451  0.16633910E+00     0   429   131     0     0     0
   451  0.16633910E+00     0   435   125     0     0     0
  28
   452  0.16470362E-04     0   450    59     0     0     0
   452  0.12243198E-01     0   456     2     7     0     0
   452  0.40810662E-02     0   456   122   127     0     0
   452  0.40810662E-02     0   456   124   129     0     0
   452  0.12243198E-01     0   454     1     8     0     0
   452  0.40810662E-02     0   454   121   128     0     0
   452  0.40810662E-02     0   454   123   130     0     0
   452  0.12243198E-01     0   456     4     9     0     0
   452  0.40810662E-02     0   456   126   131     0     0
   452  0.12243198E-01     0   454     3    10     0     0
   452  0.40810662E-02     0   454   125   132     0     0
   452  0.81378911E-02     0   450     2     8     0     0
   452  0.10486391E-01     0   450     1     7     0     0
   452  0.10486391E-01     0   450     3     9     0     0
   452  0.81378911E-02     0   450     4    10     0     0
   452  0.10176073E-01     0   450     5    11     0     0
   452  0.23796468E-02     0   450   121   127     0     0
   452  0.23796468E-02     0   450   123   129     0     0
   452  0.23676446E-02     0   450   125   131     0     0
   452  0.47379001E-02     0   450   122   128     0     0
   452  0.47379001E-02     0   450   124   130     0     0
   452  0.47379001E-02     0   450   126   132     0     0
   452  0.12295433E+00     0   437   127     0     0     0
   452  0.12295433E+00     0   443   121     0     0     0
   452  0.12295391E+00     0   439   129     0     0     0
   452  0.12295391E+00     0   445   123     0     0     0
   452  0.18297136E+00     0   429   131     0     0     0
   452  0.18297136E+00     0   435   125     0     0     0
  22
   453  0.40415138E+00     0   454   199     0     0     0
   453  0.40415138E+00     0   456   198     0     0     0
   453  0.42744442E-02     0   450   200     0     0     0
   453  0.67941495E-03     0   451   200     0     0     0
   453  0.15943182E-03     0   452     2     8     0     0
   453  0.20583342E-03     0   452     1     7     0     0
   453  0.20583342E-03     0   452     3     9     0     0
   453  0.15943182E-03     0   452     4    10     0     0
   453  0.19988115E-03     0   452     5    11     0     0
   453  0.46674722E-04     0   452   121   127     0     0
   453  0.46674722E-04     0   452   123   129     0     0
   453  0.46434187E-04     0   452   125   131     0     0
   453  0.92769151E-04     0   452   122   128     0     0
   453  0.92769151E-04     0   452   124   130     0     0
   453  0.92769151E-04     0   452   126   132     0     0
   453  0.64609892E-04     0   450   203     0     0     0
   453  0.30633209E-01     0   437   127     0     0     0
   453  0.30633209E-01     0   443   121     0     0     0
   453  0.30633187E-01     0   439   129     0     0     0
   453  0.30633187E-01     0   445   123     0     0     0
   453  0.31398654E-01     0   429   131     0     0     0
   453  0.31398654E-01     0   435   125     0     0     0
   5
   454  0.33238876E+00     0   450     2     7     0     0
   454  0.33238876E+00     0   450     4     9     0     0
   454  0.11079176E+00     0   450   127   122     0     0
   454  0.11079176E+00     0   450   129   124     0     0
   454  0.11363897E+00     0   450   131   126     0     0
  10
   455  0.27246055E+00     0   450   198     0     0     0
   455  0.20962378E+00     0   451   198     0     0     0
   455  0.14923918E-02     0   452     2     7     0     0
   455  0.14923918E-02     0   452     4     9     0     0
   455  0.49736793E-03     0   452   127   122     0     0
   455  0.49736793E-03     0   452   129   124     0     0
   455  0.49736886E-03     0   452   131   126     0     0
   455  0.36910125E-02     0   435   126     0     0     0
   455  0.49110430E+00     0   454   200     0     0     0
   455  0.18643524E-01     0   454   203     0     0     0
   5
   456  0.33238876E+00     0   450     8     1     0     0
   456  0.33238876E+00     0   450    10     3     0     0
   456  0.11079176E+00     0   450   121   128     0     0
   456  0.11079176E+00     0   450   123   130     0     0
   456  0.11363897E+00     0   450   125   132     0     0
  10
   457  0.27246055E+00     0   450   199     0     0     0
   457  0.20962378E+00     0   451   199     0     0     0
   457  0.14923918E-02     0   452     8     1     0     0
   457  0.14923918E-02     0   452    10     3     0     0
   457  0.49736793E-03     0   452   121   128     0     0
   457  0.49736793E-03     0   452   123   130     0     0
   457  0.49736886E-03     0   452   125   132     0     0
   457  0.36910125E-02     0   429   132     0     0     0
   457  0.49110430E+00     0   456   200     0     0     0
   457  0.18643524E-01     0   456   203     0     0     0
  29
   203  0.91485577E-04     0   123   129     0     0     0
   203  0.26167955E-01     0   125   131     0     0     0
   203  0.10982716E-02     0     3     9     0     0     0
   203  0.35828900E+00     0     5    11     0     0     0
   203  0.13626465E-01     0     4    10     0     0     0
   203  0.88844920E-03     0    59    59     0     0     0
   203  0.15823087E-01     0    13    13     0     0     0
   203  0.18647970E-02     0   198   121   128     0     0
   203  0.18647970E-02     0   198   123   130     0     0
   203  0.18647970E-02     0   198   125   132     0     0
   203  0.55943909E-02     0   198     8     1     0     0
   203  0.55943909E-02     0   198    10     3     0     0
   203  0.18647970E-02     0   199   127   122     0     0
   203  0.18647970E-02     0   199   129   124     0     0
   203  0.18647970E-02     0   199   131   126     0     0
   203  0.55943909E-02     0   199     2     7     0     0
   203  0.55943909E-02     0   199     4     9     0     0
   203  0.20805413E-03     0   200   122   128     0     0
   203  0.20805413E-03     0   200   124   130     0     0
   203  0.20805413E-03     0   200   126   132     0     0
   203  0.10471157E-03     0   200   121   127     0     0
   203  0.10471157E-03     0   200   123   129     0     0
   203  0.10471157E-03     0   200   125   131     0     0
   203  0.35873294E-03     0   200     2     8     0     0
   203  0.35873294E-03     0   200     4    10     0     0
   203  0.46213641E-03     0   200     1     7     0     0
   203  0.46213641E-03     0   200     3     9     0     0
   203  0.46213641E-03     0   200     5    11     0     0
   203  0.54740685E+00     0   450   450     0     0     0
  26
   204  0.20789872E-04     0   123   129     0     0     0
   204  0.59540961E-02     0   125   131     0     0     0
   204  0.24522044E-03     0     3     9     0     0     0
   204  0.65797217E-01     0     5    11     0     0     0
   204  0.65623835E-01     0     6    12     0     0     0
   204  0.99105411E-04     0    13    13     0     0     0
   204  0.13085955E-02     0   198   199     0     0     0
   204  0.64329652E-03     0   200   200     0     0     0
   204  0.10631980E+00     0   450   450     0     0     0
   204  0.41571674E-02     0   450   451     0     0     0
   204  0.50672192E-01     0   450   452     0     0     0
   204  0.17677205E-01     0   450   453     0     0     0
   204  0.12699405E-04     0   451   451     0     0     0
   204  0.13361192E-04     0   451   452     0     0     0
   204  0.18652715E-02     0   451   453     0     0     0
   204  0.15121567E-01     0   452   452     0     0     0
   204  0.12517406E+00     0   452   453     0     0     0
   204  0.65276544E-02     0   453   453     0     0     0
   204  0.21190490E+00     0   454   456     0     0     0
   204  0.55315644E-02     0   455   457     0     0     0
   204  0.15473926E+00     0   454   457     0     0     0
   204  0.15473926E+00     0   456   455     0     0     0
   204  0.53481939E-02     0   203   203     0     0     0
   204  0.17114518E-03     0   437   443     0     0     0
   204  0.17111102E-03     0   439   445     0     0     0
   204  0.16147851E-03     0   429   435     0     0     0
  21
   205  0.20649246E-04     0   123   129     0     0     0
   205  0.59141121E-02     0   125   131     0     0     0
   205  0.24358202E-03     0     3     9     0     0     0
   205  0.65442815E-01     0     5    11     0     0     0
   205  0.97472310E-01     0     6    12     0     0     0
   205  0.84271865E-04     0    13    13     0     0     0
   205  0.16714571E+00     0   450   450     0     0     0
   205  0.85218856E-02     0   450   451     0     0     0
   205  0.10051468E-01     0   450   452     0     0     0
   205  0.18563628E-01     0   450   453     0     0     0
   205  0.30233017E-04     0   451   451     0     0     0
   205  0.19685851E-03     0   451   452     0     0     0
   205  0.54726396E-02     0   451   453     0     0     0
   205  0.92585161E-02     0   452   452     0     0     0
   205  0.39955243E-01     0   452   453     0     0     0
   205  0.55968270E-01     0   453   453     0     0     0
   205  0.32295221E+00     0   454   456     0     0     0
   205  0.71592599E-01     0   455   457     0     0     0
   205  0.59999298E-01     0   454   457     0     0     0
   205  0.59999298E-01     0   456   455     0     0     0
   205  0.11146212E-02     0   203   200     0     0     0
  13
   206  0.21799378E-04     0   124   129     0     0     0
   206  0.62435251E-02     0   126   131     0     0     0
   206  0.23709892E-03     0     4     9     0     0     0
   206  0.13835128E+00     0     6    11     0     0     0
   206  0.30645628E-01     0   454   450     0     0     0
   206  0.14983198E+00     0   454   451     0     0     0
   206  0.99634871E-01     0   454   452     0     0     0
   206  0.14683868E+00     0   454   453     0     0     0
   206  0.19105381E+00     0   455   450     0     0     0
   206  0.11672562E+00     0   455   451     0     0     0
   206  0.11592226E+00     0   455   452     0     0     0
   206  0.32411930E-02     0   455   453     0     0     0
   206  0.12523644E-02     0   203   198     0     0     0
  13
   207  0.21799378E-04     0   130   123     0     0     0
   207  0.62435251E-02     0   132   125     0     0     0
   207  0.23709892E-03     0    10     3     0     0     0
   207  0.13835128E+00     0    12     5     0     0     0
   207  0.30645628E-01     0   456   450     0     0     0
   207  0.14983198E+00     0   456   451     0     0     0
   207  0.99634871E-01     0   456   452     0     0     0
   207  0.14683868E+00     0   456   453     0     0     0
   207  0.19105381E+00     0   457   450     0     0     0
   207  0.11672562E+00     0   457   451     0     0     0
   207  0.11592226E+00     0   457   452     0     0     0
   207  0.32411930E-02     0   457   453     0     0     0
   207  0.12523644E-02     0   203   199     0     0     0
   0
   5
     6  0.33333334E+00   100     2     7     5     0     0
     6  0.33333334E+00   100     4     9     5     0     0
     6  0.11111111E+00   100   122   127     5     0     0
     6  0.11111111E+00   100   124   129     5     0     0
     6  0.11111111E+00   100   126   131     5     0     0
   5
    12  0.33333334E+00   100     8     1    11     0     0
    12  0.33333334E+00   100    10     3    11     0     0
    12  0.11111111E+00   100   128   121    11     0     0
    12  0.11111111E+00   100   130   123    11     0     0
    12  0.11111111E+00   100   132   125    11     0     0
      6.00000000     -0.18023261
     -0.47578645      0.45650753     -0.64943081      0.37877163
      0.83622944      0.49594471     -0.17061123      0.16016003
     -0.11788599      0.18293121      0.64314729      0.73416668
      0.24586704     -0.71566492     -0.36809406      0.54025954
     -0.77212107      0.63547540     -0.63547540     -0.77212107
     -0.51155347      0.85925144     -0.85925144     -0.51155347
      0.78484106     -1.09409297     -1.57048166
   4899.00000000      0.00000000      0.00000000
    120.00000000
    T
