##******************************************************************
##                      MadGraph/MadEvent                          *
##******************************************************************
## Les Houches friendly file for the (MS)SM parameters of MadGraph *
##      SM parameter set and decay widths produced by MSSMCalc     *
##******************************************************************
##*Please note the following IMPORTANT issues:                     *
##                                                                 *
##0. REFRAIN from editing this file by hand! Some of the parame-   *
##   ters are not independent. Always use a calculator.            *
##                                                                 *
##1. alpha_S(MZ) has been used in the calculation of the parameters*
##   This value is KEPT by madgraph when no pdf are used lpp(i)=0, *
##   but, for consistency, it will be reset by madgraph to the     *
##   value expected IF the pdfs for collisions with hadrons are    *
##   used.                                                         *
##                                                                 *
##2. Values of the charm and bottom kinematic (pole) masses are    *
##   those used in the matrix elements and phase space UNLESS they *
##   are set to ZERO from the start in the model (particles.dat)   *
##   This happens, for example,  when using 5-flavor QCD where     *
##   charm and bottom are treated as partons in the initial state  *
##   and a zero mass might be hardwired in the model definition.   *
##                                                                 *
##       The SUSY decays have calculated using SDECAY 1.1a         *
##                                                                 *
##******************************************************************
#
BLOCK DCINFO  # Decay Program information
     1   SDECAY      # decay calculator
     2   1.1a        # version number
#
BLOCK SPINFO  # Spectrum calculator information
     1   SuSpect                                           
     2   2.41                                              
#
BLOCK MODSEL  # Model selection
     1     1   #SUGRA                                            
#
BLOCK SMINPUTS  # Standard Model inputs
     1     1.27934000E+02   # alpha_em^-1(M_Z)^MSbar
     2     1.16639000E-05   # G_F [GeV^-2]
     3     1.17200000E-01   # alpha_S(M_Z)^MSbar
     4     9.11870000E+01   # M_Z pole mass
     6     1.72500000E+02   # mt pole mass
     7     1.77710000E+00   # mtau pole mass
#
BLOCK MINPAR  # Input parameters - minimal models
     1     3.00000000E+02   #   m0                
     2     2.50000000E+02   #   m_1/2             
     3     5.00000000E+00   #   tanbeta(mZ)       
     4     1.00000000E+00   #   sign(mu)          
     5    -1.00000000E+02   #   A0                
#
BLOCK EXTPAR  # Input parameters - non-minimal models
     0     4.65777483E+02   #  EWSB scale         
#
BLOCK MASS  # Mass Spectrum
# PDG code           mass       particle
         5     4.87877839E+00   # b-quark pole mass
         6     1.72500000E+02   # t-quark pole mass (not read by ME)
        24     7.98285576E+01   # W+
        25     3.09932416E+02   # h
        35     3.94935594E+02   # H
        36     3.94525487E+02   # A
        37     4.02953218E+02   # H+
   1000001     3.00000000E+04   # ~d_L
   2000001     3.00000000E+04   # ~d_R
   1000002     3.00000000E+04   # ~u_L
   2000002     3.00000000E+04   # ~u_R
   1000003     3.00000000E+04   # ~s_L
   2000003     3.00000000E+04   # ~s_R
   1000004     3.00000000E+04   # ~c_L
   2000004     3.00000000E+04   # ~c_R
   1000005     3.00000000E+04   # ~b_1
   2000005     3.00000000E+04   # ~b_2
   1000006     1.20000000E+03   # ~t_1
   2000006     1.20000000E+03   # ~t_2
   1000011     2.00774228E+04   # ~e_L
   2000011     1.42820157E+04   # ~e_R
   1000012     1.84853985E+04   # ~nu_eL
   1000013     2.00774228E+04   # ~mu_L
   2000013     1.42820157E+04   # ~mu_R
   1000014     1.84853985E+04   # ~nu_muL
   1000015     1.33342244E+04   # ~tau_1
   2000015     2.04795115E+04   # ~tau_2
   1000016     1.83966053E+04   # ~nu_tauL
   1000021     8.00000000E+04   # ~g
   1000022     7.50000000E+02   # ~chi_10
   1000023     8.50000000E+02   # ~chi_20
   1000025     1.00000000E+03   # ~chi_30
   1000035     8.77781490E+02   # ~chi_40
   1000024     9.50000000E+02   # ~chi_1+
   1000037     1.00000000E+03   # ~chi_2+
#
BLOCK NMIX  # Neutralino Mixing Matrix
  1  1     1.00000000E+00   # N_11
  1  2     0.00000000E+00   # N_12
  1  3     0.00000000E+00   # N_13
  1  4     0.00000000E+00   # N_14
  2  1     0.00000000E+00   # N_21
  2  2     1.00000000E+00   # N_22
  2  3     0.00000000E+00   # N_23
  2  4     0.00000000E+00   # N_24
  3  1     0.00000000E+00   # N_31
  3  2     0.00000000E+00   # N_32
  3  3     1.00000000E+00   # N_33
  3  4     0.00000000E+00   # N_34
  4  1     0.00000000E+00   # N_41
  4  2     0.00000000E+00   # N_42
  4  3     0.00000000E+00   # N_43
  4  4     1.00000000E+00   # N_44
#
BLOCK UMIX  # Chargino Mixing Matrix U
  1  1    -9.11420712E-01   # U_11
  1  2     4.11475741E-01   # U_12
  2  1     4.11475741E-01   # U_21
  2  2     9.11420712E-01   # U_22
#
BLOCK VMIX  # Chargino Mixing Matrix V
  1  1    -9.70421546E-01   # V_11
  1  2     2.41416701E-01   # V_12
  2  1     2.41416701E-01   # V_21
  2  2     9.70421546E-01   # V_22
#
BLOCK STOPMIX  # Stop Mixing Matrix
  1  1     5.52988023E-01   # O_{11}
  1  2     8.33189202E-01   # O_{12}
  2  1    -8.33189202E-01   # O_{21}
  2  2     5.52988023E-01   # O_{22}
#
BLOCK SBOTMIX  # Sbottom Mixing Matrix
  1  1     9.30091013E-01   # O_{11}
  1  2     3.67329153E-01   # O_{12}
  2  1    -3.67329153E-01   # O_{21}
  2  2     9.30091013E-01   # O_{22}
#
BLOCK STAUMIX  # Stau Mixing Matrix
  1  1     2.84460080E-01   # O_{11}
  1  2     9.58687886E-01   # O_{12}
  2  1    -9.58687886E-01   # O_{21}
  2  2     2.84460080E-01   # O_{22}
#
BLOCK ALPHA  # Higgs mixing
          -1.14188003E-01   # Mixing angle in the neutral Higgs boson sector
#
BLOCK HMIX Q=  4.65777483E+02  # DRbar Higgs Parameters
     1     3.52164860E+02   #  mu(Q)              
     2     9.75041102E+00   #  tanbeta(Q)         
     3     2.45014641E+02   #  vev(Q)             
     4     1.62371513E+05   #  MA^2(Q)            
#
BLOCK GAUGE Q=  4.65777483E+02  # The gauge couplings
     3     1.09890437E+00   # g3(Q) MSbar
#
BLOCK AU Q=  4.65777483E+02  # The trilinear couplings
  3  3    -5.06144039E+02   # A_t(Q) DRbar
#
BLOCK AD Q=  4.65777483E+02  # The trilinear couplings
  3  3    -7.96595982E+02   # A_b(Q) DRbar
#
BLOCK AE Q=  4.65777483E+02  # The trilinear couplings
  3  3    -2.51542764E+02   # A_tau(Q) DRbar
#
BLOCK YU Q=  4.65777483E+02  # The Yukawa couplings
  3  3     8.78978125E-01   # y_t(Q) DRbar
#
BLOCK YD Q=  4.65777483E+02  # The Yukawa couplings
  3  3     1.39517330E-01   # y_b(Q) DRbar
#
BLOCK YE Q=  4.65777483E+02  # The Yukawa couplings
  3  3     1.01147257E-01   # y_tau(Q) DRbar
#
BLOCK MSOFT Q=  4.65777483E+02  # The soft SUSY breaking masses at the scale Q
     1     1.01486794E+02   #  M_1                
     2     1.91565439E+02   #  M_2                
     3     5.86284400E+02   #  M_3                
    21     3.23226904E+04   #  M^2_Hd             
    22    -1.24993993E+05   #  M^2_Hu             
    31     1.95443359E+02   #  M_eL               
    32     1.95443359E+02   #  M_muL              
    33     1.94603750E+02   #  M_tauL             
    34     1.35950985E+02   #  M_eR               
    35     1.35950985E+02   #  M_muR              
    36     1.33480599E+02   #  M_tauR             
    41     5.45553618E+02   #  M_q1L              
    42     5.45553618E+02   #  M_q2L              
    43     4.97578078E+02   #  M_q3L              
    44     5.27538927E+02   #  M_uR               
    45     5.27538927E+02   #  M_cR               
    46     4.23429537E+02   #  M_tR               
    47     5.25444117E+02   #  M_dR               
    48     5.25444117E+02   #  M_sR               
    49     5.22139557E+02   #  M_bR               
#
#
#
#                             =================
#                             |The decay table|
#                             =================
#
# - The multi-body decays for the inos, stops and sbottoms are included.
#
# - The SUSY decays of the top quark are included.
#
#
#         PDG            Width
DECAY        23     2.41180149E+00   # Z width (SM calculation)
DECAY        24     2.00313007E+00   # W width (SM calculation)
#
#         PDG            Width
DECAY         6     1.48576460E+00   # top decays
#          BR         NDA      ID1       ID2
     1.00000000E+00    2           5        24   # BR(t ->  b    W+)
     0.00000000E+00    2           5        37   # BR(t ->  b    H+)
     0.00000000E+00    2     1000006   1000022   # BR(t -> ~t_1 ~chi_10)
     0.00000000E+00    2     1000006   1000023   # BR(t -> ~t_1 ~chi_20)
     0.00000000E+00    2     1000006   1000025   # BR(t -> ~t_1 ~chi_30)
     0.00000000E+00    2     1000006   1000035   # BR(t -> ~t_1 ~chi_40)
     0.00000000E+00    2     2000006   1000022   # BR(t -> ~t_2 ~chi_10)
     0.00000000E+00    2     2000006   1000023   # BR(t -> ~t_2 ~chi_20)
     0.00000000E+00    2     2000006   1000025   # BR(t -> ~t_2 ~chi_30)
     0.00000000E+00    2     2000006   1000035   # BR(t -> ~t_2 ~chi_40)
#
#         PDG            Width
DECAY        25     9.53537663E+00   # h decays
#          BR         NDA      ID1       ID2
     8.58686034E-05    2          15       -15   # BR(H1 -> tau- tau+)
     4.89489537E-04    2           5        -5   # BR(H1 -> b bb)
     6.91430162E-01    2          24       -24   # BR(H1 -> W+ W-)
     3.07994480E-01    2          23        23   # BR(H1 -> Z Z)
#
#         PDG            Width
DECAY        35     5.62361474E-01   # H decays
#          BR         NDA      ID1       ID2
     1.41065641E-01    2          15       -15   # BR(H -> tau- tau+)
     4.84728091E-02    2           6        -6   # BR(H -> t tb)
     8.04536185E-01    2           5        -5   # BR(H -> b bb)
     4.04557660E-03    2          24       -24   # BR(H -> W+ W-)
     1.87978828E-03    2          23        23   # BR(H -> Z Z)
     0.00000000E+00    2          24       -37   # BR(H -> W+ H-)
     0.00000000E+00    2         -24        37   # BR(H -> W- H+)
     0.00000000E+00    2          37       -37   # BR(H -> H+ H-)
     0.00000000E+00    2          25        25   # BR(H -> h h)
     0.00000000E+00    2          36        36   # BR(H -> A A)
#
#         PDG            Width
DECAY        36     6.24741903E-01   # A decays
#          BR         NDA      ID1       ID2
     1.27189393E-01    2          15       -15   # BR(A -> tau- tau+)
     1.47030600E-01    2           6        -6   # BR(A -> t tb)
     7.25780007E-01    2           5        -5   # BR(A -> b bb)
     0.00000000E+00    2          23        25   # BR(A -> Z h)
     0.00000000E+00    2          23        35   # BR(A -> Z H)
     0.00000000E+00    2          24       -37   # BR(A -> W+ H-)
     0.00000000E+00    2         -24        37   # BR(A -> W- H+)
#
#         PDG            Width
DECAY        37     5.38547436E-01   # H+ decays
#          BR         NDA      ID1       ID2
     1.50701051E-01    2         -15        16   # BR(H+ -> tau+ nu_tau)
     8.49247162E-01    2           6        -5   # BR(H+ -> t bb)
     5.17864495E-05    2          24        25   # BR(H+ -> W+ h)
     0.00000000E+00    2          24        35   # BR(H+ -> W+ H)
     0.00000000E+00    2          24        36   # BR(H+ -> W+ A)
#
#         PDG            Width
DECAY   1000021     1.80375989E+04   # gluino decays
#          BR         NDA      ID1       ID2
     3.93456423E-02    2     1000001        -1   # BR(~g -> ~d_L  db)
     3.93456423E-02    2    -1000001         1   # BR(~g -> ~d_L* d )
     3.93456423E-02    2     2000001        -1   # BR(~g -> ~d_R  db)
     3.93456423E-02    2    -2000001         1   # BR(~g -> ~d_R* d )
     3.93456423E-02    2     1000002        -2   # BR(~g -> ~u_L  ub)
     3.93456423E-02    2    -1000002         2   # BR(~g -> ~u_L* u )
     3.93456423E-02    2     2000002        -2   # BR(~g -> ~u_R  ub)
     3.93456423E-02    2    -2000002         2   # BR(~g -> ~u_R* u )
     3.93456423E-02    2     1000003        -3   # BR(~g -> ~s_L  sb)
     3.93456423E-02    2    -1000003         3   # BR(~g -> ~s_L* s )
     3.93456423E-02    2     2000003        -3   # BR(~g -> ~s_R  sb)
     3.93456423E-02    2    -2000003         3   # BR(~g -> ~s_R* s )
     3.93456423E-02    2     1000004        -4   # BR(~g -> ~c_L  cb)
     3.93456423E-02    2    -1000004         4   # BR(~g -> ~c_L* c )
     3.93456423E-02    2     2000004        -4   # BR(~g -> ~c_R  cb)
     3.93456423E-02    2    -2000004         4   # BR(~g -> ~c_R* c )
     3.93418265E-02    2     1000005        -5   # BR(~g -> ~b_1  bb)
     3.93418265E-02    2    -1000005         5   # BR(~g -> ~b_1* b )
     3.93494580E-02    2     2000005        -5   # BR(~g -> ~b_2  bb)
     3.93494580E-02    2    -2000005         5   # BR(~g -> ~b_2* b )
     5.30600838E-02    2     1000006        -6   # BR(~g -> ~t_1  tb)
     5.30600838E-02    2    -1000006         6   # BR(~g -> ~t_1* t )
     5.34834934E-02    2     2000006        -6   # BR(~g -> ~t_2  tb)
     5.34834934E-02    2    -2000006         6   # BR(~g -> ~t_2* t )
#
#         PDG            Width
DECAY   1000006     4.36172083E-01   # stop1 decays
#          BR         NDA      ID1       ID2
     1.00000000E+00    2     1000022         6   # BR(~t_1 -> ~chi_10 t )
     0.00000000E+00    2     1000023         6   # BR(~t_1 -> ~chi_20 t )
     0.00000000E+00    2     1000025         6   # BR(~t_1 -> ~chi_30 t )
     0.00000000E+00    2     1000035         6   # BR(~t_1 -> ~chi_40 t )
     0.00000000E+00    2     1000024         5   # BR(~t_1 -> ~chi_1+ b )
     0.00000000E+00    2     1000037         5   # BR(~t_1 -> ~chi_2+ b )
     0.00000000E+00    2     1000021         6   # BR(~t_1 -> ~g      t )
     0.00000000E+00    2     1000005        37   # BR(~t_1 -> ~b_1    H+)
     0.00000000E+00    2     2000005        37   # BR(~t_1 -> ~b_2    H+)
     0.00000000E+00    2     1000005        24   # BR(~t_1 -> ~b_1    W+)
     0.00000000E+00    2     2000005        24   # BR(~t_1 -> ~b_2    W+)
#
#         PDG            Width
DECAY   2000006     1.42030313E-01   # stop2 decays
#          BR         NDA      ID1       ID2
     1.00000000E+00    2     1000022         6   # BR(~t_2 -> ~chi_10 t )
     0.00000000E+00    2     1000023         6   # BR(~t_2 -> ~chi_20 t )
     0.00000000E+00    2     1000025         6   # BR(~t_2 -> ~chi_30 t )
     0.00000000E+00    2     1000035         6   # BR(~t_2 -> ~chi_40 t )
     0.00000000E+00    2     1000024         5   # BR(~t_2 -> ~chi_1+ b )
     0.00000000E+00    2     1000037         5   # BR(~t_2 -> ~chi_2+ b )
     0.00000000E+00    2     1000021         6   # BR(~t_2 -> ~g      t )
     0.00000000E+00    2     1000006        25   # BR(~t_2 -> ~t_1    h )
     0.00000000E+00    2     1000006        35   # BR(~t_2 -> ~t_1    H )
     0.00000000E+00    2     1000006        36   # BR(~t_2 -> ~t_1    A )
     0.00000000E+00    2     1000005        37   # BR(~t_2 -> ~b_1    H+)
     0.00000000E+00    2     2000005        37   # BR(~t_2 -> ~b_2    H+)
     0.00000000E+00    2     1000006        23   # BR(~t_2 -> ~t_1    Z )
     0.00000000E+00    2     1000005        24   # BR(~t_2 -> ~b_1    W+)
     0.00000000E+00    2     2000005        24   # BR(~t_2 -> ~b_2    W+)
#
#         PDG            Width
DECAY   1000005     1.53173429E+07   # sbottom1 decays
#          BR         NDA      ID1       ID2
     3.89709646E-07    2     1000022         5   # BR(~b_1 -> ~chi_10 b )
     7.07500286E-06    2     1000023         5   # BR(~b_1 -> ~chi_20 b )
     7.56755173E-07    2     1000025         5   # BR(~b_1 -> ~chi_30 b )
     0.00000000E+00    2     1000035         5   # BR(~b_1 -> ~chi_40 b )
     1.41789320E-05    2    -1000024         6   # BR(~b_1 -> ~chi_1- t )
     2.60506391E-05    2    -1000037         6   # BR(~b_1 -> ~chi_2- t )
     0.00000000E+00    2     1000021         5   # BR(~b_1 -> ~g      b )
     1.59401452E-09    2     1000006       -37   # BR(~b_1 -> ~t_1    H-)
     1.20085574E-09    2     2000006       -37   # BR(~b_1 -> ~t_2    H-)
     3.05780937E-01    2     1000006       -24   # BR(~b_1 -> ~t_1    W-)
     6.94170610E-01    2     2000006       -24   # BR(~b_1 -> ~t_2    W-)
#
#         PDG            Width
DECAY   2000005     2.38918349E+06   # sbottom2 decays
#          BR         NDA      ID1       ID2
     6.39423072E-06    2     1000022         5   # BR(~b_2 -> ~chi_10 b )
     7.07490237E-06    2     1000023         5   # BR(~b_2 -> ~chi_20 b )
     4.85172046E-06    2     1000025         5   # BR(~b_2 -> ~chi_30 b )
     0.00000000E+00    2     1000035         5   # BR(~b_2 -> ~chi_40 b )
     8.19235358E-06    2    -1000024         6   # BR(~b_2 -> ~chi_1- t )
     3.61390799E-05    2    -1000037         6   # BR(~b_2 -> ~chi_2- t )
     0.00000000E+00    2     1000021         5   # BR(~b_2 -> ~g      b )
     0.00000000E+00    2     1000005        25   # BR(~b_2 -> ~b_1    h )
     0.00000000E+00    2     1000005        35   # BR(~b_2 -> ~b_1    H )
     0.00000000E+00    2     1000005        36   # BR(~b_2 -> ~b_1    A )
     3.95688900E-09    2     1000006       -37   # BR(~b_2 -> ~t_1    H-)
     4.76743885E-10    2     2000006       -37   # BR(~b_2 -> ~t_2    H-)
     0.00000000E+00    2     1000005        23   # BR(~b_2 -> ~b_1    Z )
     3.05776593E-01    2     1000006       -24   # BR(~b_2 -> ~t_1    W-)
     6.94160750E-01    2     2000006       -24   # BR(~b_2 -> ~t_2    W-)
#
#         PDG            Width
DECAY   1000002     3.79966281E+02   # sup_L decays
#          BR         NDA      ID1       ID2
     1.11832596E-02    2     1000022         2   # BR(~u_L -> ~chi_10 u)
     3.29696338E-01    2     1000023         2   # BR(~u_L -> ~chi_20 u)
     0.00000000E+00    2     1000025         2   # BR(~u_L -> ~chi_30 u)
     0.00000000E+00    2     1000035         2   # BR(~u_L -> ~chi_40 u)
     6.20713377E-01    2     1000024         1   # BR(~u_L -> ~chi_1+ d)
     3.84070251E-02    2     1000037         1   # BR(~u_L -> ~chi_2+ d)
     0.00000000E+00    2     1000021         2   # BR(~u_L -> ~g      u)
#
#         PDG            Width
DECAY   2000002     6.79881851E+01   # sup_R decays
#          BR         NDA      ID1       ID2
     1.00000000E+00    2     1000022         2   # BR(~u_R -> ~chi_10 u)
     2.52372436E-34    2     1000023         2   # BR(~u_R -> ~chi_20 u)
     0.00000000E+00    2     1000025         2   # BR(~u_R -> ~chi_30 u)
     0.00000000E+00    2     1000035         2   # BR(~u_R -> ~chi_40 u)
     0.00000000E+00    2     1000024         1   # BR(~u_R -> ~chi_1+ d)
     0.00000000E+00    2     1000037         1   # BR(~u_R -> ~chi_2+ d)
     0.00000000E+00    2     1000021         2   # BR(~u_R -> ~g      u)
#
#         PDG            Width
DECAY   1000001     3.79960250E+02   # sdown_L decays
#          BR         NDA      ID1       ID2
     1.11834371E-02    2     1000022         1   # BR(~d_L -> ~chi_10 d)
     3.29701571E-01    2     1000023         1   # BR(~d_L -> ~chi_20 d)
     0.00000000E+00    2     1000025         1   # BR(~d_L -> ~chi_30 d)
     0.00000000E+00    2     1000035         1   # BR(~d_L -> ~chi_40 d)
     5.47538831E-01    2    -1000024         2   # BR(~d_L -> ~chi_1- u)
     1.11576161E-01    2    -1000037         2   # BR(~d_L -> ~chi_2- u)
     0.00000000E+00    2     1000021         1   # BR(~d_L -> ~g      d)
#
#         PDG            Width
DECAY   2000001     1.69970463E+01   # sdown_R decays
#          BR         NDA      ID1       ID2
     1.00000000E+00    2     1000022         1   # BR(~d_R -> ~chi_10 d)
     2.52372436E-34    2     1000023         1   # BR(~d_R -> ~chi_20 d)
     0.00000000E+00    2     1000025         1   # BR(~d_R -> ~chi_30 d)
     0.00000000E+00    2     1000035         1   # BR(~d_R -> ~chi_40 d)
     0.00000000E+00    2    -1000024         2   # BR(~d_R -> ~chi_1- u)
     0.00000000E+00    2    -1000037         2   # BR(~d_R -> ~chi_2- u)
     0.00000000E+00    2     1000021         1   # BR(~d_R -> ~g      d)
#
#         PDG            Width
DECAY   1000004     3.79966281E+02   # scharm_L decays
#          BR         NDA      ID1       ID2
     1.11832596E-02    2     1000022         4   # BR(~c_L -> ~chi_10 c)
     3.29696338E-01    2     1000023         4   # BR(~c_L -> ~chi_20 c)
     0.00000000E+00    2     1000025         4   # BR(~c_L -> ~chi_30 c)
     0.00000000E+00    2     1000035         4   # BR(~c_L -> ~chi_40 c)
     6.20713377E-01    2     1000024         3   # BR(~c_L -> ~chi_1+ s)
     3.84070251E-02    2     1000037         3   # BR(~c_L -> ~chi_2+ s)
     0.00000000E+00    2     1000021         4   # BR(~c_L -> ~g      c)
#
#         PDG            Width
DECAY   2000004     6.79881851E+01   # scharm_R decays
#          BR         NDA      ID1       ID2
     1.00000000E+00    2     1000022         4   # BR(~c_R -> ~chi_10 c)
     2.52372436E-34    2     1000023         4   # BR(~c_R -> ~chi_20 c)
     0.00000000E+00    2     1000025         4   # BR(~c_R -> ~chi_30 c)
     0.00000000E+00    2     1000035         4   # BR(~c_R -> ~chi_40 c)
     0.00000000E+00    2     1000024         3   # BR(~c_R -> ~chi_1+ s)
     0.00000000E+00    2     1000037         3   # BR(~c_R -> ~chi_2+ s)
     0.00000000E+00    2     1000021         4   # BR(~c_R -> ~g      c)
#
#         PDG            Width
DECAY   1000003     3.79960250E+02   # sstrange_L decays
#          BR         NDA      ID1       ID2
     1.11834371E-02    2     1000022         3   # BR(~s_L -> ~chi_10 s)
     3.29701571E-01    2     1000023         3   # BR(~s_L -> ~chi_20 s)
     0.00000000E+00    2     1000025         3   # BR(~s_L -> ~chi_30 s)
     0.00000000E+00    2     1000035         3   # BR(~s_L -> ~chi_40 s)
     5.47538831E-01    2    -1000024         4   # BR(~s_L -> ~chi_1- c)
     1.11576161E-01    2    -1000037         4   # BR(~s_L -> ~chi_2- c)
     0.00000000E+00    2     1000021         3   # BR(~s_L -> ~g      s)
#
#         PDG            Width
DECAY   2000003     1.69970463E+01   # sstrange_R decays
#          BR         NDA      ID1       ID2
     1.00000000E+00    2     1000022         3   # BR(~s_R -> ~chi_10 s)
     2.52372436E-34    2     1000023         3   # BR(~s_R -> ~chi_20 s)
     0.00000000E+00    2     1000025         3   # BR(~s_R -> ~chi_30 s)
     0.00000000E+00    2     1000035         3   # BR(~s_R -> ~chi_40 s)
     0.00000000E+00    2    -1000024         4   # BR(~s_R -> ~chi_1- c)
     0.00000000E+00    2    -1000037         4   # BR(~s_R -> ~chi_2- c)
     0.00000000E+00    2     1000021         3   # BR(~s_R -> ~g      s)
#
#         PDG            Width
DECAY   1000011     2.76446997E+02   # selectron_L decays
#          BR         NDA      ID1       ID2
     9.25727613E-02    2     1000022        11   # BR(~e_L -> ~chi_10 e-)
     3.02672782E-01    2     1000023        11   # BR(~e_L -> ~chi_20 e-)
     0.00000000E+00    2     1000025        11   # BR(~e_L -> ~chi_30 e-)
     0.00000000E+00    2     1000035        11   # BR(~e_L -> ~chi_40 e-)
     5.02403334E-01    2    -1000024        12   # BR(~e_L -> ~chi_1- nu_e)
     1.02351123E-01    2    -1000037        12   # BR(~e_L -> ~chi_2- nu_e)
#
#         PDG            Width
DECAY   2000011     7.28035362E+01   # selectron_R decays
#          BR         NDA      ID1       ID2
     1.00000000E+00    2     1000022        11   # BR(~e_R -> ~chi_10 e-)
     2.51066720E-34    2     1000023        11   # BR(~e_R -> ~chi_20 e-)
     0.00000000E+00    2     1000025        11   # BR(~e_R -> ~chi_30 e-)
     0.00000000E+00    2     1000035        11   # BR(~e_R -> ~chi_40 e-)
     0.00000000E+00    2    -1000024        12   # BR(~e_R -> ~chi_1- nu_e)
     0.00000000E+00    2    -1000037        12   # BR(~e_R -> ~chi_2- nu_e)
#
#         PDG            Width
DECAY   1000013     2.76446997E+02   # smuon_L decays
#          BR         NDA      ID1       ID2
     9.25727613E-02    2     1000022        13   # BR(~mu_L -> ~chi_10 mu-)
     3.02672782E-01    2     1000023        13   # BR(~mu_L -> ~chi_20 mu-)
     0.00000000E+00    2     1000025        13   # BR(~mu_L -> ~chi_30 mu-)
     0.00000000E+00    2     1000035        13   # BR(~mu_L -> ~chi_40 mu-)
     5.02403334E-01    2    -1000024        14   # BR(~mu_L -> ~chi_1- nu_mu)
     1.02351123E-01    2    -1000037        14   # BR(~mu_L -> ~chi_2- nu_mu)
#
#         PDG            Width
DECAY   2000013     7.28035362E+01   # smuon_R decays
#          BR         NDA      ID1       ID2
     1.00000000E+00    2     1000022        13   # BR(~mu_R -> ~chi_10 mu-)
     2.51066720E-34    2     1000023        13   # BR(~mu_R -> ~chi_20 mu-)
     0.00000000E+00    2     1000025        13   # BR(~mu_R -> ~chi_30 mu-)
     0.00000000E+00    2     1000035        13   # BR(~mu_R -> ~chi_40 mu-)
     0.00000000E+00    2    -1000024        14   # BR(~mu_R -> ~chi_1- nu_mu)
     0.00000000E+00    2    -1000037        14   # BR(~mu_R -> ~chi_2- nu_mu)
#
#         PDG            Width
DECAY   1000015     8.24063597E+01   # stau_1 decays
#          BR         NDA      ID1       ID2
     7.74738622E-01    2     1000022        15   # BR(~tau_1 -> ~chi_10  tau-)
     5.43185842E-02    2     1000023        15   # BR(~tau_1 -> ~chi_20  tau-)
     3.25642940E-02    2     1000025        15   # BR(~tau_1 -> ~chi_30  tau-)
     0.00000000E+00    2     1000035        15   # BR(~tau_1 -> ~chi_40  tau-)
     1.37882686E-01    2    -1000024        16   # BR(~tau_1 -> ~chi_1-  nu_tau)
     4.95813234E-04    2    -1000037        16   # BR(~tau_1 -> ~chi_2-  nu_tau)
     0.00000000E+00    2     1000016       -37   # BR(~tau_1 -> ~nu_tauL H-)
     0.00000000E+00    2     1000016       -24   # BR(~tau_1 -> ~nu_tauL W-)
#
#         PDG            Width
DECAY   2000015     7.75421192E+04   # stau_2 decays
#          BR         NDA      ID1       ID2
     4.18366056E-04    2     1000022        15   # BR(~tau_2 -> ~chi_10  tau-)
     1.01175258E-03    2     1000023        15   # BR(~tau_2 -> ~chi_20  tau-)
     5.34993921E-05    2     1000025        15   # BR(~tau_2 -> ~chi_30  tau-)
     0.00000000E+00    2     1000035        15   # BR(~tau_2 -> ~chi_40  tau-)
     1.61000257E-03    2    -1000024        16   # BR(~tau_2 -> ~chi_1-  nu_tau)
     4.15900300E-04    2    -1000037        16   # BR(~tau_2 -> ~chi_2-  nu_tau)
     1.45687423E-12    2     1000016       -37   # BR(~tau_2 -> ~nu_tauL H-)
     4.79815654E-01    2     1000016       -24   # BR(~tau_2 -> ~nu_tauL W-)
     3.52199870E-09    2     1000015        25   # BR(~tau_2 -> ~tau_1 h)
     1.16311429E-09    2     1000015        35   # BR(~tau_2 -> ~tau_1 H)
     1.69269752E-09    2     1000015        36   # BR(~tau_2 -> ~tau_1 A)
     5.16674819E-01    2     1000015        23   # BR(~tau_2 -> ~tau_1 Z)
#
#         PDG            Width
DECAY   1000012     2.54359213E+02   # snu_eL decays
#          BR         NDA      ID1       ID2
     9.26302827E-02    2     1000022        12   # BR(~nu_eL -> ~chi_10 nu_e)
     3.02676272E-01    2     1000023        12   # BR(~nu_eL -> ~chi_20 nu_e)
     0.00000000E+00    2     1000025        12   # BR(~nu_eL -> ~chi_30 nu_e)
     0.00000000E+00    2     1000035        12   # BR(~nu_eL -> ~chi_40 nu_e)
     5.69469675E-01    2     1000024        11   # BR(~nu_eL -> ~chi_1+ e-)
     3.52237700E-02    2     1000037        11   # BR(~nu_eL -> ~chi_2+ e-)
#
#         PDG            Width
DECAY   1000014     2.54359213E+02   # snu_muL decays
#          BR         NDA      ID1       ID2
     9.26302827E-02    2     1000022        14   # BR(~nu_muL -> ~chi_10 nu_mu)
     3.02676272E-01    2     1000023        14   # BR(~nu_muL -> ~chi_20 nu_mu)
     0.00000000E+00    2     1000025        14   # BR(~nu_muL -> ~chi_30 nu_mu)
     0.00000000E+00    2     1000035        14   # BR(~nu_muL -> ~chi_40 nu_mu)
     5.69469675E-01    2     1000024        13   # BR(~nu_muL -> ~chi_1+ mu-)
     3.52237700E-02    2     1000037        13   # BR(~nu_muL -> ~chi_2+ mu-)
#
#         PDG            Width
DECAY   1000016     3.55988489E+04   # snu_tauL decays
#          BR         NDA      ID1       ID2
     6.58676843E-04    2     1000022        16   # BR(~nu_tauL -> ~chi_10 nu_tau)
     2.15219173E-03    2     1000023        16   # BR(~nu_tauL -> ~chi_20 nu_tau)
     0.00000000E+00    2     1000025        16   # BR(~nu_tauL -> ~chi_30 nu_tau)
     0.00000000E+00    2     1000035        16   # BR(~nu_tauL -> ~chi_40 nu_tau)
     4.06690366E-03    2     1000024        15   # BR(~nu_tauL -> ~chi_1+ tau-)
     3.37316724E-04    2     1000037        15   # BR(~nu_tauL -> ~chi_2+ tau-)
     7.49875345E-09    2    -1000015       -37   # BR(~nu_tauL -> ~tau_1+ H-)
     0.00000000E+00    2    -2000015       -37   # BR(~nu_tauL -> ~tau_2+ H-)
     9.92784904E-01    2    -1000015       -24   # BR(~nu_tauL -> ~tau_1+ W-)
     0.00000000E+00    2    -2000015       -24   # BR(~nu_tauL -> ~tau_2+ W-)
#
#         PDG            Width
DECAY   1000024     8.40411669E+00   # chargino1+ decays
#          BR         NDA      ID1       ID2
     0.00000000E+00    2     1000002        -1   # BR(~chi_1+ -> ~u_L   db)
     0.00000000E+00    2     2000002        -1   # BR(~chi_1+ -> ~u_R   db)
     0.00000000E+00    2    -1000001         2   # BR(~chi_1+ -> ~d_L*  u )
     0.00000000E+00    2    -2000001         2   # BR(~chi_1+ -> ~d_R*  u )
     0.00000000E+00    2     1000004        -3   # BR(~chi_1+ -> ~c_L   sb)
     0.00000000E+00    2     2000004        -3   # BR(~chi_1+ -> ~c_R   sb)
     0.00000000E+00    2    -1000003         4   # BR(~chi_1+ -> ~s_L*  c )
     0.00000000E+00    2    -2000003         4   # BR(~chi_1+ -> ~s_R*  c )
     4.88182442E-01    2     1000006        -5   # BR(~chi_1+ -> ~t_1   bb)
     2.97008085E-01    2     2000006        -5   # BR(~chi_1+ -> ~t_2   bb)
     0.00000000E+00    2    -1000005         6   # BR(~chi_1+ -> ~b_1*  t )
     0.00000000E+00    2    -2000005         6   # BR(~chi_1+ -> ~b_2*  t )
     0.00000000E+00    2     1000012       -11   # BR(~chi_1+ -> ~nu_eL  e+  )
     0.00000000E+00    2     1000014       -13   # BR(~chi_1+ -> ~nu_muL  mu+ )
     0.00000000E+00    2     1000016       -15   # BR(~chi_1+ -> ~nu_tau1 tau+)
     0.00000000E+00    2    -1000011        12   # BR(~chi_1+ -> ~e_L+    nu_e)
     0.00000000E+00    2    -2000011        12   # BR(~chi_1+ -> ~e_R+    nu_e)
     0.00000000E+00    2    -1000013        14   # BR(~chi_1+ -> ~mu_L+   nu_mu)
     0.00000000E+00    2    -2000013        14   # BR(~chi_1+ -> ~mu_R+   nu_mu)
     0.00000000E+00    2    -1000015        16   # BR(~chi_1+ -> ~tau_1+  nu_tau)
     0.00000000E+00    2    -2000015        16   # BR(~chi_1+ -> ~tau_2+  nu_tau)
     0.00000000E+00    2     1000022        24   # BR(~chi_1+ -> ~chi_10  W+)
     2.07364281E-01    2     1000023        24   # BR(~chi_1+ -> ~chi_20  W+)
     0.00000000E+00    2     1000025        24   # BR(~chi_1+ -> ~chi_30  W+)
     0.00000000E+00    2     1000035        24   # BR(~chi_1+ -> ~chi_40  W+)
     7.44519185E-03    2     1000022        37   # BR(~chi_1+ -> ~chi_10  H+)
     0.00000000E+00    2     1000023        37   # BR(~chi_1+ -> ~chi_20  H+)
     0.00000000E+00    2     1000025        37   # BR(~chi_1+ -> ~chi_30  H+)
     0.00000000E+00    2     1000035        37   # BR(~chi_1+ -> ~chi_40  H+)
#
#         PDG            Width
DECAY   1000037     1.87288934E+01   # chargino2+ decays
#          BR         NDA      ID1       ID2
     0.00000000E+00    2     1000002        -1   # BR(~chi_2+ -> ~u_L   db)
     0.00000000E+00    2     2000002        -1   # BR(~chi_2+ -> ~u_R   db)
     0.00000000E+00    2    -1000001         2   # BR(~chi_2+ -> ~d_L*  u )
     0.00000000E+00    2    -2000001         2   # BR(~chi_2+ -> ~d_R*  u )
     0.00000000E+00    2     1000004        -3   # BR(~chi_2+ -> ~c_L   sb)
     0.00000000E+00    2     2000004        -3   # BR(~chi_2+ -> ~c_R   sb)
     0.00000000E+00    2    -1000003         4   # BR(~chi_2+ -> ~s_L*  c )
     0.00000000E+00    2    -2000003         4   # BR(~chi_2+ -> ~s_R*  c )
     3.54569359E-01    2     1000006        -5   # BR(~chi_2+ -> ~t_1   bb)
     3.33499209E-01    2     2000006        -5   # BR(~chi_2+ -> ~t_2   bb)
     0.00000000E+00    2    -1000005         6   # BR(~chi_2+ -> ~b_1*  t )
     0.00000000E+00    2    -2000005         6   # BR(~chi_2+ -> ~b_2*  t )
     0.00000000E+00    2     1000012       -11   # BR(~chi_2+ -> ~nu_eL  e+  )
     0.00000000E+00    2     1000014       -13   # BR(~chi_2+ -> ~nu_muL  mu+ )
     0.00000000E+00    2     1000016       -15   # BR(~chi_2+ -> ~nu_tau1 tau+)
     0.00000000E+00    2    -1000011        12   # BR(~chi_2+ -> ~e_L+    nu_e)
     0.00000000E+00    2    -2000011        12   # BR(~chi_2+ -> ~e_R+    nu_e)
     0.00000000E+00    2    -1000013        14   # BR(~chi_2+ -> ~mu_L+   nu_mu)
     0.00000000E+00    2    -2000013        14   # BR(~chi_2+ -> ~mu_R+   nu_mu)
     0.00000000E+00    2    -1000015        16   # BR(~chi_2+ -> ~tau_1+  nu_tau)
     0.00000000E+00    2    -2000015        16   # BR(~chi_2+ -> ~tau_2+  nu_tau)
     0.00000000E+00    2     1000024        23   # BR(~chi_2+ -> ~chi_1+  Z )
     0.00000000E+00    2     1000022        24   # BR(~chi_2+ -> ~chi_10  W+)
     1.11445638E-01    2     1000023        24   # BR(~chi_2+ -> ~chi_20  W+)
     0.00000000E+00    2     1000025        24   # BR(~chi_2+ -> ~chi_30  W+)
     1.82984873E-01    2     1000035        24   # BR(~chi_2+ -> ~chi_40  W+)
     0.00000000E+00    2     1000024        25   # BR(~chi_2+ -> ~chi_1+  h )
     0.00000000E+00    2     1000024        35   # BR(~chi_2+ -> ~chi_1+  H )
     0.00000000E+00    2     1000024        36   # BR(~chi_2+ -> ~chi_1+  A )
     1.75009220E-02    2     1000022        37   # BR(~chi_2+ -> ~chi_10  H+)
     0.00000000E+00    2     1000023        37   # BR(~chi_2+ -> ~chi_20  H+)
     0.00000000E+00    2     1000025        37   # BR(~chi_2+ -> ~chi_30  H+)
     0.00000000E+00    2     1000035        37   # BR(~chi_2+ -> ~chi_40  H+)
#
#         PDG            Width
DECAY   1000022     0.00000000E+00   # neutralino1 decays
#
#         PDG            Width
DECAY   1000023     4.18433794E+00   # neutralino2 decays
#          BR         NDA      ID1       ID2
     0.00000000E+00    2     1000022        23   # BR(~chi_20 -> ~chi_10   Z )
     0.00000000E+00    2     1000024       -24   # BR(~chi_20 -> ~chi_1+   W-)
     0.00000000E+00    2    -1000024        24   # BR(~chi_20 -> ~chi_1-   W+)
     0.00000000E+00    2     1000037       -24   # BR(~chi_20 -> ~chi_2+   W-)
     0.00000000E+00    2    -1000037        24   # BR(~chi_20 -> ~chi_2-   W+)
     0.00000000E+00    2     1000022        25   # BR(~chi_20 -> ~chi_10   h )
     0.00000000E+00    2     1000022        35   # BR(~chi_20 -> ~chi_10   H )
     0.00000000E+00    2     1000022        36   # BR(~chi_20 -> ~chi_10   A )
     0.00000000E+00    2     1000024       -37   # BR(~chi_20 -> ~chi_1+   H-)
     0.00000000E+00    2    -1000024        37   # BR(~chi_20 -> ~chi_1-   H+)
     0.00000000E+00    2     1000037       -37   # BR(~chi_20 -> ~chi_2+   H-)
     0.00000000E+00    2    -1000037        37   # BR(~chi_20 -> ~chi_2-   H+)
     0.00000000E+00    2     1000002        -2   # BR(~chi_20 -> ~u_L      ub)
     0.00000000E+00    2    -1000002         2   # BR(~chi_20 -> ~u_L*     u )
     0.00000000E+00    2     2000002        -2   # BR(~chi_20 -> ~u_R      ub)
     0.00000000E+00    2    -2000002         2   # BR(~chi_20 -> ~u_R*     u )
     0.00000000E+00    2     1000001        -1   # BR(~chi_20 -> ~d_L      db)
     0.00000000E+00    2    -1000001         1   # BR(~chi_20 -> ~d_L*     d )
     0.00000000E+00    2     2000001        -1   # BR(~chi_20 -> ~d_R      db)
     0.00000000E+00    2    -2000001         1   # BR(~chi_20 -> ~d_R*     d )
     0.00000000E+00    2     1000004        -4   # BR(~chi_20 -> ~c_L      cb)
     0.00000000E+00    2    -1000004         4   # BR(~chi_20 -> ~c_L*     c )
     0.00000000E+00    2     2000004        -4   # BR(~chi_20 -> ~c_R      cb)
     0.00000000E+00    2    -2000004         4   # BR(~chi_20 -> ~c_R*     c )
     0.00000000E+00    2     1000003        -3   # BR(~chi_20 -> ~s_L      sb)
     0.00000000E+00    2    -1000003         3   # BR(~chi_20 -> ~s_L*     s )
     0.00000000E+00    2     2000003        -3   # BR(~chi_20 -> ~s_R      sb)
     0.00000000E+00    2    -2000003         3   # BR(~chi_20 -> ~s_R*     s )
     1.52897877E-01    2     1000006        -6   # BR(~chi_20 -> ~t_1      tb)
     1.52897877E-01    2    -1000006         6   # BR(~chi_20 -> ~t_1*     t )
     3.47102123E-01    2     2000006        -6   # BR(~chi_20 -> ~t_2      tb)
     3.47102123E-01    2    -2000006         6   # BR(~chi_20 -> ~t_2*     t )
     0.00000000E+00    2     1000005        -5   # BR(~chi_20 -> ~b_1      bb)
     0.00000000E+00    2    -1000005         5   # BR(~chi_20 -> ~b_1*     b )
     0.00000000E+00    2     2000005        -5   # BR(~chi_20 -> ~b_2      bb)
     0.00000000E+00    2    -2000005         5   # BR(~chi_20 -> ~b_2*     b )
     0.00000000E+00    2     1000011       -11   # BR(~chi_20 -> ~e_L-     e+)
     0.00000000E+00    2    -1000011        11   # BR(~chi_20 -> ~e_L+     e-)
     0.00000000E+00    2     2000011       -11   # BR(~chi_20 -> ~e_R-     e+)
     0.00000000E+00    2    -2000011        11   # BR(~chi_20 -> ~e_R+     e-)
     0.00000000E+00    2     1000013       -13   # BR(~chi_20 -> ~mu_L-    mu+)
     0.00000000E+00    2    -1000013        13   # BR(~chi_20 -> ~mu_L+    mu-)
     0.00000000E+00    2     2000013       -13   # BR(~chi_20 -> ~mu_R-    mu+)
     0.00000000E+00    2    -2000013        13   # BR(~chi_20 -> ~mu_R+    mu-)
     0.00000000E+00    2     1000015       -15   # BR(~chi_20 -> ~tau_1-   tau+)
     0.00000000E+00    2    -1000015        15   # BR(~chi_20 -> ~tau_1+   tau-)
     0.00000000E+00    2     2000015       -15   # BR(~chi_20 -> ~tau_2-   tau+)
     0.00000000E+00    2    -2000015        15   # BR(~chi_20 -> ~tau_2+   tau-)
     0.00000000E+00    2     1000012       -12   # BR(~chi_20 -> ~nu_eL    nu_eb)
     0.00000000E+00    2    -1000012        12   # BR(~chi_20 -> ~nu_eL*   nu_e )
     0.00000000E+00    2     1000014       -14   # BR(~chi_20 -> ~nu_muL   nu_mub)
     0.00000000E+00    2    -1000014        14   # BR(~chi_20 -> ~nu_muL*  nu_mu )
     0.00000000E+00    2     1000016       -16   # BR(~chi_20 -> ~nu_tau1  nu_taub)
     0.00000000E+00    2    -1000016        16   # BR(~chi_20 -> ~nu_tau1* nu_tau )
#
#         PDG            Width
DECAY   1000025     8.87376372E-01   # neutralino3 decays
#          BR         NDA      ID1       ID2
     0.00000000E+00    2     1000022        23   # BR(~chi_30 -> ~chi_10   Z )
     0.00000000E+00    2     1000023        23   # BR(~chi_30 -> ~chi_20   Z )
     0.00000000E+00    2     1000024       -24   # BR(~chi_30 -> ~chi_1+   W-)
     0.00000000E+00    2    -1000024        24   # BR(~chi_30 -> ~chi_1-   W+)
     0.00000000E+00    2     1000037       -24   # BR(~chi_30 -> ~chi_2+   W-)
     0.00000000E+00    2    -1000037        24   # BR(~chi_30 -> ~chi_2-   W+)
     1.07160573E-02    2     1000022        25   # BR(~chi_30 -> ~chi_10   h )
     7.17720502E-01    2     1000022        35   # BR(~chi_30 -> ~chi_10   H )
     2.71563441E-01    2     1000022        36   # BR(~chi_30 -> ~chi_10   A )
     0.00000000E+00    2     1000023        25   # BR(~chi_30 -> ~chi_20   h )
     0.00000000E+00    2     1000023        35   # BR(~chi_30 -> ~chi_20   H )
     0.00000000E+00    2     1000023        36   # BR(~chi_30 -> ~chi_20   A )
     0.00000000E+00    2     1000024       -37   # BR(~chi_30 -> ~chi_1+   H-)
     0.00000000E+00    2    -1000024        37   # BR(~chi_30 -> ~chi_1-   H+)
     0.00000000E+00    2     1000037       -37   # BR(~chi_30 -> ~chi_2+   H-)
     0.00000000E+00    2    -1000037        37   # BR(~chi_30 -> ~chi_2-   H+)
     0.00000000E+00    2     1000002        -2   # BR(~chi_30 -> ~u_L      ub)
     0.00000000E+00    2    -1000002         2   # BR(~chi_30 -> ~u_L*     u )
     0.00000000E+00    2     2000002        -2   # BR(~chi_30 -> ~u_R      ub)
     0.00000000E+00    2    -2000002         2   # BR(~chi_30 -> ~u_R*     u )
     0.00000000E+00    2     1000001        -1   # BR(~chi_30 -> ~d_L      db)
     0.00000000E+00    2    -1000001         1   # BR(~chi_30 -> ~d_L*     d )
     0.00000000E+00    2     2000001        -1   # BR(~chi_30 -> ~d_R      db)
     0.00000000E+00    2    -2000001         1   # BR(~chi_30 -> ~d_R*     d )
     0.00000000E+00    2     1000004        -4   # BR(~chi_30 -> ~c_L      cb)
     0.00000000E+00    2    -1000004         4   # BR(~chi_30 -> ~c_L*     c )
     0.00000000E+00    2     2000004        -4   # BR(~chi_30 -> ~c_R      cb)
     0.00000000E+00    2    -2000004         4   # BR(~chi_30 -> ~c_R*     c )
     0.00000000E+00    2     1000003        -3   # BR(~chi_30 -> ~s_L      sb)
     0.00000000E+00    2    -1000003         3   # BR(~chi_30 -> ~s_L*     s )
     0.00000000E+00    2     2000003        -3   # BR(~chi_30 -> ~s_R      sb)
     0.00000000E+00    2    -2000003         3   # BR(~chi_30 -> ~s_R*     s )
     0.00000000E+00    2     1000006        -6   # BR(~chi_30 -> ~t_1      tb)
     0.00000000E+00    2    -1000006         6   # BR(~chi_30 -> ~t_1*     t )
     0.00000000E+00    2     2000006        -6   # BR(~chi_30 -> ~t_2      tb)
     0.00000000E+00    2    -2000006         6   # BR(~chi_30 -> ~t_2*     t )
     0.00000000E+00    2     1000005        -5   # BR(~chi_30 -> ~b_1      bb)
     0.00000000E+00    2    -1000005         5   # BR(~chi_30 -> ~b_1*     b )
     0.00000000E+00    2     2000005        -5   # BR(~chi_30 -> ~b_2      bb)
     0.00000000E+00    2    -2000005         5   # BR(~chi_30 -> ~b_2*     b )
     0.00000000E+00    2     1000011       -11   # BR(~chi_30 -> ~e_L-     e+)
     0.00000000E+00    2    -1000011        11   # BR(~chi_30 -> ~e_L+     e-)
     0.00000000E+00    2     2000011       -11   # BR(~chi_30 -> ~e_R-     e+)
     0.00000000E+00    2    -2000011        11   # BR(~chi_30 -> ~e_R+     e-)
     0.00000000E+00    2     1000013       -13   # BR(~chi_30 -> ~mu_L-    mu+)
     0.00000000E+00    2    -1000013        13   # BR(~chi_30 -> ~mu_L+    mu-)
     0.00000000E+00    2     2000013       -13   # BR(~chi_30 -> ~mu_R-    mu+)
     0.00000000E+00    2    -2000013        13   # BR(~chi_30 -> ~mu_R+    mu-)
     0.00000000E+00    2     1000015       -15   # BR(~chi_30 -> ~tau_1-   tau+)
     0.00000000E+00    2    -1000015        15   # BR(~chi_30 -> ~tau_1+   tau-)
     0.00000000E+00    2     2000015       -15   # BR(~chi_30 -> ~tau_2-   tau+)
     0.00000000E+00    2    -2000015        15   # BR(~chi_30 -> ~tau_2+   tau-)
     0.00000000E+00    2     1000012       -12   # BR(~chi_30 -> ~nu_eL    nu_eb)
     0.00000000E+00    2    -1000012        12   # BR(~chi_30 -> ~nu_eL*   nu_e )
     0.00000000E+00    2     1000014       -14   # BR(~chi_30 -> ~nu_muL   nu_mub)
     0.00000000E+00    2    -1000014        14   # BR(~chi_30 -> ~nu_muL*  nu_mu )
     0.00000000E+00    2     1000016       -16   # BR(~chi_30 -> ~nu_tau1  nu_taub)
     0.00000000E+00    2    -1000016        16   # BR(~chi_30 -> ~nu_tau1* nu_tau )
#
#         PDG            Width
DECAY   1000035     3.50967314E+01   # neutralino4 decays
#          BR         NDA      ID1       ID2
     0.00000000E+00    2     1000022        23   # BR(~chi_40 -> ~chi_10   Z )
     0.00000000E+00    2     1000023        23   # BR(~chi_40 -> ~chi_20   Z )
     0.00000000E+00    2     1000025        23   # BR(~chi_40 -> ~chi_30   Z )
     0.00000000E+00    2     1000024       -24   # BR(~chi_40 -> ~chi_1+   W-)
     0.00000000E+00    2    -1000024        24   # BR(~chi_40 -> ~chi_1-   W+)
     0.00000000E+00    2     1000037       -24   # BR(~chi_40 -> ~chi_2+   W-)
     0.00000000E+00    2    -1000037        24   # BR(~chi_40 -> ~chi_2-   W+)
     1.75734268E-02    2     1000022        25   # BR(~chi_40 -> ~chi_10   h )
     1.93664734E-04    2     1000022        35   # BR(~chi_40 -> ~chi_10   H )
     4.69316234E-05    2     1000022        36   # BR(~chi_40 -> ~chi_10   A )
     0.00000000E+00    2     1000023        25   # BR(~chi_40 -> ~chi_20   h )
     0.00000000E+00    2     1000023        35   # BR(~chi_40 -> ~chi_20   H )
     0.00000000E+00    2     1000023        36   # BR(~chi_40 -> ~chi_20   A )
     0.00000000E+00    2     1000025        25   # BR(~chi_40 -> ~chi_30   h )
     0.00000000E+00    2     1000025        35   # BR(~chi_40 -> ~chi_30   H )
     0.00000000E+00    2     1000025        36   # BR(~chi_40 -> ~chi_30   A )
     0.00000000E+00    2     1000024       -37   # BR(~chi_40 -> ~chi_1+   H-)
     0.00000000E+00    2    -1000024        37   # BR(~chi_40 -> ~chi_1-   H+)
     0.00000000E+00    2     1000037       -37   # BR(~chi_40 -> ~chi_2+   H-)
     0.00000000E+00    2    -1000037        37   # BR(~chi_40 -> ~chi_2-   H+)
     0.00000000E+00    2     1000002        -2   # BR(~chi_40 -> ~u_L      ub)
     0.00000000E+00    2    -1000002         2   # BR(~chi_40 -> ~u_L*     u )
     0.00000000E+00    2     2000002        -2   # BR(~chi_40 -> ~u_R      ub)
     0.00000000E+00    2    -2000002         2   # BR(~chi_40 -> ~u_R*     u )
     0.00000000E+00    2     1000001        -1   # BR(~chi_40 -> ~d_L      db)
     0.00000000E+00    2    -1000001         1   # BR(~chi_40 -> ~d_L*     d )
     0.00000000E+00    2     2000001        -1   # BR(~chi_40 -> ~d_R      db)
     0.00000000E+00    2    -2000001         1   # BR(~chi_40 -> ~d_R*     d )
     0.00000000E+00    2     1000004        -4   # BR(~chi_40 -> ~c_L      cb)
     0.00000000E+00    2    -1000004         4   # BR(~chi_40 -> ~c_L*     c )
     0.00000000E+00    2     2000004        -4   # BR(~chi_40 -> ~c_R      cb)
     0.00000000E+00    2    -2000004         4   # BR(~chi_40 -> ~c_R*     c )
     0.00000000E+00    2     1000003        -3   # BR(~chi_40 -> ~s_L      sb)
     0.00000000E+00    2    -1000003         3   # BR(~chi_40 -> ~s_L*     s )
     0.00000000E+00    2     2000003        -3   # BR(~chi_40 -> ~s_R      sb)
     0.00000000E+00    2    -2000003         3   # BR(~chi_40 -> ~s_R*     s )
     3.70073444E-01    2     1000006        -6   # BR(~chi_40 -> ~t_1      tb)
     3.70073444E-01    2    -1000006         6   # BR(~chi_40 -> ~t_1*     t )
     1.21019545E-01    2     2000006        -6   # BR(~chi_40 -> ~t_2      tb)
     1.21019545E-01    2    -2000006         6   # BR(~chi_40 -> ~t_2*     t )
     0.00000000E+00    2     1000005        -5   # BR(~chi_40 -> ~b_1      bb)
     0.00000000E+00    2    -1000005         5   # BR(~chi_40 -> ~b_1*     b )
     0.00000000E+00    2     2000005        -5   # BR(~chi_40 -> ~b_2      bb)
     0.00000000E+00    2    -2000005         5   # BR(~chi_40 -> ~b_2*     b )
     0.00000000E+00    2     1000011       -11   # BR(~chi_40 -> ~e_L-     e+)
     0.00000000E+00    2    -1000011        11   # BR(~chi_40 -> ~e_L+     e-)
     0.00000000E+00    2     2000011       -11   # BR(~chi_40 -> ~e_R-     e+)
     0.00000000E+00    2    -2000011        11   # BR(~chi_40 -> ~e_R+     e-)
     0.00000000E+00    2     1000013       -13   # BR(~chi_40 -> ~mu_L-    mu+)
     0.00000000E+00    2    -1000013        13   # BR(~chi_40 -> ~mu_L+    mu-)
     0.00000000E+00    2     2000013       -13   # BR(~chi_40 -> ~mu_R-    mu+)
     0.00000000E+00    2    -2000013        13   # BR(~chi_40 -> ~mu_R+    mu-)
     0.00000000E+00    2     1000015       -15   # BR(~chi_40 -> ~tau_1-   tau+)
     0.00000000E+00    2    -1000015        15   # BR(~chi_40 -> ~tau_1+   tau-)
     0.00000000E+00    2     2000015       -15   # BR(~chi_40 -> ~tau_2-   tau+)
     0.00000000E+00    2    -2000015        15   # BR(~chi_40 -> ~tau_2+   tau-)
     0.00000000E+00    2     1000012       -12   # BR(~chi_40 -> ~nu_eL    nu_eb)
     0.00000000E+00    2    -1000012        12   # BR(~chi_40 -> ~nu_eL*   nu_e )
     0.00000000E+00    2     1000014       -14   # BR(~chi_40 -> ~nu_muL   nu_mub)
     0.00000000E+00    2    -1000014        14   # BR(~chi_40 -> ~nu_muL*  nu_mu )
     0.00000000E+00    2     1000016       -16   # BR(~chi_40 -> ~nu_tau1  nu_taub)
     0.00000000E+00    2    -1000016        16   # BR(~chi_40 -> ~nu_tau1* nu_tau )
