#  ISAJET SUSY parameters in SUSY Les Houches Accord 2 format
#  Created by ISALHA 2.0 Last revision: C. Balazs 21 Apr 2009
Block SPINFO   # Program information
     1   ISASUGRA from ISAJET          # Spectrum Calculator
     2   7.80   29-OCT-2009 12:50:36   # Version number
Block MODSEL   # Model selection
     1     0   #   MsR(Q)          MbR(Q)                          
Block SMINPUTS   # Standard Model inputs
     1     1.27837601E+02   # alpha_em^(-1)
     2     1.16570000E-05   # G_Fermi
     3     1.17200002E-01   # alpha_s(M_Z)
     4     9.11699982E+01   # m_{Z}(pole)
     5     4.19999981E+00   # m_{b}(m_{b})
     6     1.72500000E+02   # m_{top}(pole)
     7     1.77699995E+00   # m_{tau}(pole)
Block MINPAR   # SUSY breaking input parameters
Block MASS   # Scalar and gaugino mass spectrum
#  PDG code   mass                 particle
        24     8.04229965E+01   #  W^+
        25     1.20300003E+02   #  h^0            
        35     2.51776025E+03   #  H^0            
        36     2.50000000E+03   #  A^0            
        37     2.51607861E+03   #  H^+            
   1000001     6.02337585E+02   #  dnl            
   1000002     5.98083374E+02   #  upl            
   1000003     6.02337585E+02   #  stl            
   1000004     5.98084839E+02   #  chl            
   1000005     6.00416565E+02   #  b1             
   1000006     6.16062134E+02   #  t1             
   1000011     2.50035645E+03   #  el-            
   1000012     2.49933496E+03   #  nuel           
   1000013     2.50035645E+03   #  mul-           
   1000014     2.49933496E+03   #  numl           
   1000015     2.50029565E+03   #  tau1           
   1000016     2.49933496E+03   #  nutl           
   1000021     7.00000000E+02   #  glss           
   1000022     1.49481934E+02   #  z1ss           
   1000023     2.42853882E+03   #  z2ss           
   1000024     2.42832593E+03   #  w1ss           
   1000025    -2.50040601E+03   #  z3ss           
   1000035     2.57238525E+03   #  z4ss           
   1000037     2.57219092E+03   #  w2ss           
   2000001     6.00428345E+02   #  dnr            
   2000002     5.99142334E+02   #  upr            
   2000003     6.00428406E+02   #  str            
   2000004     5.99143860E+02   #  chr            
   2000005     6.02363098E+02   #  b2             
   2000006     6.17165955E+02   #  t2             
   2000011     2.50030859E+03   #  er-            
   2000013     2.50030859E+03   #  mur-           
   2000015     2.50037036E+03   #  tau2           
Block ALPHA   # Effective Higgs mixing parameter
         -3.22547197E-01   # alpha
Block STOPMIX   # stop mixing matrix
  1  1     7.26197243E-01   # O_{11}
  1  2     6.87486470E-01   # O_{12}
  2  1    -6.87486470E-01   # O_{21}
  2  2     7.26197243E-01   # O_{22}
Block SBOTMIX   # sbottom mixing matrix
  1  1     5.52335052E-07   # O_{11}
  1  2    -1.00000000E+00   # O_{12}
  2  1     1.00000000E+00   # O_{21}
  2  2     5.52335052E-07   # O_{22}
Block STAUMIX   # stau mixing matrix
  1  1     2.81731172E-06   # O_{11}
  1  2    -1.00000000E+00   # O_{12}
  2  1     1.00000000E+00   # O_{21}
  2  2     2.81731172E-06   # O_{22}
Block NMIX   # neutralino mixing matrix
  1  1     9.99830484E-01   #
  1  2    -4.00799792E-04   #
  1  3     1.71788409E-02   #
  1  4    -6.62148744E-03   #
  2  1     1.22056603E-02   #
  2  2     7.08085597E-01   #
  2  3    -5.02838492E-01   #
  2  4     4.95600075E-01   #
  3  1    -7.46043026E-03   #
  3  2     7.19459588E-03   #
  3  3     7.06954181E-01   #
  3  4     7.07183778E-01   #
  4  1     1.15966070E-02   #
  4  2    -7.06089973E-01   #
  4  3    -4.97065961E-01   #
  4  4     5.04210234E-01   #
Block UMIX   # chargino U mixing matrix
  1  1    -7.02002406E-01   # U_{11}
  1  2     7.12174535E-01   # U_{12}
  2  1    -7.12174535E-01   # U_{21}
  2  2    -7.02002406E-01   # U_{22}
Block VMIX   # chargino V mixing matrix
  1  1    -7.12174356E-01   # V_{11}
  1  2     7.02002585E-01   # V_{12}
  2  1    -7.02002585E-01   # V_{21}
  2  2    -7.12174356E-01   # V_{22}
Block GAUGE Q=  0.00000000E+00   #
     1     0.00000000E+00   # g`
     2     0.00000000E+00   # g_2
     3     0.00000000E+00   # g_3
Block YU Q=  0.00000000E+00   #
  3  3     0.00000000E+00   # y_t
Block YD Q=  0.00000000E+00   #
  3  3     0.00000000E+00   # y_b
Block YE Q=  0.00000000E+00   #
  3  3     0.00000000E+00   # y_tau
Block HMIX Q=  0.00000000E+00   # Higgs mixing parameters
     1     0.00000000E+00   # mu(Q)
     2     0.00000000E+00   # tan(beta)(M_GUT)
     3     0.00000000E+00   # Higgs vev at Q
     4     6.25000000E+06   # m_A^2(Q)
Block MSOFT Q=  0.00000000E+00   # DRbar SUSY breaking parameters
     1     0.00000000E+00   # M_1(Q)          
     2     0.00000000E+00   # M_2(Q)          
     3     0.00000000E+00   # M_3(Q)          
    31     0.00000000E+00   # MeL(Q)          
    32     0.00000000E+00   # MmuL(Q)         
    33     0.00000000E+00   # MtauL(Q)        
    34     0.00000000E+00   # MeR(Q)          
    35     0.00000000E+00   # MmuR(Q)         
    36     0.00000000E+00   # MtauR(Q)        
    41     0.00000000E+00   # MqL1(Q)         
    42     0.00000000E+00   # MqL2(Q)         
    43     0.00000000E+00   # MqL3(Q)         
    44     0.00000000E+00   # MuR(Q)          
    45     0.00000000E+00   # McR(Q)          
    46     0.00000000E+00   # MtR(Q)          
    47     0.00000000E+00   # MdR(Q)          
    48     0.00000000E+00   # MsR(Q)          
    49     0.00000000E+00   # MbR(Q)          
Block AU Q=  0.00000000E+00   #
  1  1     0.00000000E+00   # A_u
  2  2     0.00000000E+00   # A_c
  3  3     0.00000000E+00   # A_t
Block AD Q=  0.00000000E+00   #
  1  1     0.00000000E+00   # A_d
  2  2     0.00000000E+00   # A_s
  3  3     0.00000000E+00   # A_b
Block AE Q=  0.00000000E+00   #
  1  1     0.00000000E+00   # A_e
  2  2     0.00000000E+00   # A_mu
  3  3     0.00000000E+00   # A_tau
#         PDG         Width
DECAY   1000021  1.17176876E+01   # GLSS  decays
#          BR          NDA       ID1       ID2       ID3       ID4
      4.82742735E-07    2      1000022        21                       # GLSS   -->  Z1SS   GL                 
      1.39842974E-04    3      1000022         6        -6             # GLSS   -->  Z1SS   TP     TB          
      5.20430058E-02    2     -1000002         2                       # GLSS   -->  UBL    UP                 
      5.20430058E-02    2      1000002        -2                       # GLSS   -->  UPL    UB                 
      4.81026843E-02    2     -1000001         1                       # GLSS   -->  DBL    DN                 
      4.81026843E-02    2      1000001        -1                       # GLSS   -->  DNL    DB                 
      5.10503128E-02    2     -2000002         2                       # GLSS   -->  UBR    UP                 
      5.10503128E-02    2      2000002        -2                       # GLSS   -->  UPR    UB                 
      4.98553254E-02    2     -2000001         1                       # GLSS   -->  DBR    DN                 
      4.98553254E-02    2      2000001        -1                       # GLSS   -->  DNR    DB                 
      4.81026061E-02    2     -1000003         3                       # GLSS   -->  SBL    ST                 
      4.81026061E-02    2      1000003        -3                       # GLSS   -->  STL    SB                 
      4.98551838E-02    2     -2000003         3                       # GLSS   -->  SBR    ST                 
      4.98551838E-02    2      2000003        -3                       # GLSS   -->  STR    SB                 
      5.20377532E-02    2     -1000004         4                       # GLSS   -->  CBL    CH                 
      5.20377532E-02    2      1000004        -4                       # GLSS   -->  CHL    CB                 
      5.10449857E-02    2     -2000004         4                       # GLSS   -->  CBR    CH                 
      5.10449857E-02    2      2000004        -4                       # GLSS   -->  CHR    CB                 
      4.98125404E-02    2     -1000005         5                       # GLSS   -->  BB1    BT                 
      4.98125404E-02    2      1000005        -5                       # GLSS   -->  BT1    BB                 
      4.80254218E-02    2     -2000005         5                       # GLSS   -->  BB2    BT                 
      4.80254218E-02    2      2000005        -5                       # GLSS   -->  BT2    BB                 
      4.52316140E-09    2      1000039        21                       # GLSS   -->  GVSS   GL                 
#         PDG         Width
DECAY   1000002  7.39232227E-02   # UPL   decays
#          BR          NDA       ID1       ID2       ID3       ID4
      1.00000000E+00    2      1000022         2                       # UPL    -->  Z1SS   UP                 
#         PDG         Width
DECAY   1000001  7.52444267E-02   # DNL   decays
#          BR          NDA       ID1       ID2       ID3       ID4
      1.00000000E+00    2      1000022         1                       # DNL    -->  Z1SS   DN                 
#         PDG         Width
DECAY   1000003  7.52444267E-02   # STL   decays
#          BR          NDA       ID1       ID2       ID3       ID4
      1.00000000E+00    2      1000022         3                       # STL    -->  Z1SS   ST                 
#         PDG         Width
DECAY   1000004  7.39225969E-02   # CHL   decays
#          BR          NDA       ID1       ID2       ID3       ID4
      1.00000000E+00    2      1000022         4                       # CHL    -->  Z1SS   CH                 
#         PDG         Width
DECAY   1000005  2.98405349E-01   # BT1   decays
#          BR          NDA       ID1       ID2       ID3       ID4
      1.00000000E+00    2      1000022         5                       # BT1    -->  Z1SS   BT                 
#         PDG         Width
DECAY   1000006  5.69121003E-01   # TP1   decays
#          BR          NDA       ID1       ID2       ID3       ID4
      2.87631252E-07    2      1000022         4                       # TP1    -->  Z1SS   CH                 
      9.99999702E-01    2      1000022         6                       # TP1    -->  Z1SS   TP                 
#         PDG         Width
DECAY   2000002  1.19062805E+00   # UPR   decays
#          BR          NDA       ID1       ID2       ID3       ID4
      1.00000000E+00    2      1000022         2                       # UPR    -->  Z1SS   UP                 
#         PDG         Width
DECAY   2000001  2.98465341E-01   # DNR   decays
#          BR          NDA       ID1       ID2       ID3       ID4
      1.00000000E+00    2      1000022         1                       # DNR    -->  Z1SS   DN                 
#         PDG         Width
DECAY   2000003  2.98465401E-01   # STR   decays
#          BR          NDA       ID1       ID2       ID3       ID4
      1.00000000E+00    2      1000022         3                       # STR    -->  Z1SS   ST                 
#         PDG         Width
DECAY   2000004  1.19061792E+00   # CHR   decays
#          BR          NDA       ID1       ID2       ID3       ID4
      1.00000000E+00    2      1000022         4                       # CHR    -->  Z1SS   CH                 
#         PDG         Width
DECAY   2000005  7.52380937E-02   # BT2   decays
#          BR          NDA       ID1       ID2       ID3       ID4
      1.00000000E+00    2      1000022         5                       # BT2    -->  Z1SS   BT                 
#         PDG         Width
DECAY   2000006  5.15929997E-01   # TP2   decays
#          BR          NDA       ID1       ID2       ID3       ID4
      3.17285270E-07    2      1000022         4                       # TP2    -->  Z1SS   CH                 
      9.99999642E-01    2      1000022         6                       # TP2    -->  Z1SS   TP                 
#         PDG         Width
DECAY   1000011  3.20173049E+00   # EL-   decays
#          BR          NDA       ID1       ID2       ID3       ID4
      9.84158218E-01    2      1000022        11                       # EL-    -->  Z1SS   E-                 
      5.38449083E-03    2      1000023        11                       # EL-    -->  Z2SS   E-                 
      1.04477694E-02    2     -1000024        12                       # EL-    -->  W1SS-  NUE                
      9.62539798E-06    2           11   1000039                       # EL-    -->  E-     GVSS               
#         PDG         Width
DECAY   1000013  3.20173049E+00   # MUL-  decays
#          BR          NDA       ID1       ID2       ID3       ID4
      9.84158218E-01    2      1000022        13                       # MUL-   -->  Z1SS   MU-                
      5.38448477E-03    2      1000023        13                       # MUL-   -->  Z2SS   MU-                
      1.04477694E-02    2     -1000024        14                       # MUL-   -->  W1SS-  NUM                
      9.62539798E-06    2           13   1000039                       # MUL-   -->  MU-    GVSS               
#         PDG         Width
DECAY   1000015  1.26222897E+01   # TAU1- decays
#          BR          NDA       ID1       ID2       ID3       ID4
      9.99987483E-01    2      1000022        15                       # TAU1-  -->  Z1SS   TAU-               
      3.72085310E-06    2      1000023        15                       # TAU1-  -->  Z2SS   TAU-               
      6.41875067E-06    2     -1000024        16                       # TAU1-  -->  W1SS-  NUT                
      2.44124658E-06    2           15   1000039                       # TAU1-  -->  TAU-   GVSS               
#         PDG         Width
DECAY   1000012  3.20856476E+00   # NUEL  decays
#          BR          NDA       ID1       ID2       ID3       ID4
      9.84523118E-01    2      1000022        12                       # NUEL   -->  Z1SS   NUE                
      5.03116241E-03    2      1000023        12                       # NUEL   -->  Z2SS   NUE                
      1.04361018E-02    2      1000024        11                       # NUEL   -->  W1SS+  E-                 
      9.58528926E-06    2           12   1000039                       # NUEL   -->  NUE    GVSS               
#         PDG         Width
DECAY   1000014  3.20856476E+00   # NUML  decays
#          BR          NDA       ID1       ID2       ID3       ID4
      9.84523118E-01    2      1000022        14                       # NUML   -->  Z1SS   NUM                
      5.03116241E-03    2      1000023        14                       # NUML   -->  Z2SS   NUM                
      1.04360916E-02    2      1000024        13                       # NUML   -->  W1SS+  MU-                
      9.58528926E-06    2           14   1000039                       # NUML   -->  NUM    GVSS               
#         PDG         Width
DECAY   1000016  3.20855260E+00   # NUTL  decays
#          BR          NDA       ID1       ID2       ID3       ID4
      9.84526873E-01    2      1000022        16                       # NUTL   -->  Z1SS   NUT                
      5.03118150E-03    2      1000023        16                       # NUTL   -->  Z2SS   NUT                
      1.04323858E-02    2      1000024        15                       # NUTL   -->  W1SS+  TAU-               
      9.58532564E-06    2           16   1000039                       # NUTL   -->  NUT    GVSS               
#         PDG         Width
DECAY   2000011  1.26222334E+01   # ER-   decays
#          BR          NDA       ID1       ID2       ID3       ID4
      9.99997139E-01    2      1000022        11                       # ER-    -->  Z1SS   E-                 
      4.80593144E-07    2      1000023        11                       # ER-    -->  Z2SS   E-                 
      2.83869438E-40    3      1000015        12       -16             # ER-    -->  TAU1-  NUE    ANUT        
      2.44132502E-06    2           11   1000039                       # ER-    -->  E-     GVSS               
#         PDG         Width
DECAY   2000013  1.26222334E+01   # MUR-  decays
#          BR          NDA       ID1       ID2       ID3       ID4
      9.99997139E-01    2      1000022        13                       # MUR-   -->  Z1SS   MU-                
      4.80592632E-07    2      1000023        13                       # MUR-   -->  Z2SS   MU-                
      1.21620574E-35    3      1000015        14       -16             # MUR-   -->  TAU1-  NUM    ANUT        
      2.44132502E-06    2           13   1000039                       # MUR-   -->  MU-    GVSS               
#         PDG         Width
DECAY   2000015  3.20174360E+00   # TAU2- decays
#          BR          NDA       ID1       ID2       ID3       ID4
      9.84163702E-01    2      1000022        15                       # TAU2-  -->  Z1SS   TAU-               
      5.38468268E-03    2      1000023        15                       # TAU2-  -->  Z2SS   TAU-               
      1.04516475E-02    2     -1000024        16                       # TAU2-  -->  W1SS-  NUT                
#         PDG         Width
DECAY   1000022  1.92892213E-11   # Z1SS  decays
#          BR          NDA       ID1       ID2       ID3       ID4
      9.36365068E-01    2      1000039        22                       # Z1SS   -->  GVSS   GM                 
      1.95385683E-02    3      1000039        11       -11             # Z1SS   -->  GVSS   E-     E+          
      4.40963209E-02    2      1000039        23                       # Z1SS   -->  GVSS   Z0                 
      6.54883570E-09    2      1000039        25                       # Z1SS   -->  GVSS   HL0                
#         PDG         Width
DECAY   1000023  1.37238434E+02   # Z2SS  decays
#          BR          NDA       ID1       ID2       ID3       ID4
      8.11439591E-08    2      1000022        22                       # Z2SS   -->  Z1SS   GM                 
      9.76629090E-04    2      1000022        23                       # Z2SS   -->  Z1SS   Z0                 
      5.76282275E-08    3      1000022         5        -5             # Z2SS   -->  Z1SS   BT     BB          
      4.86608269E-06    3      1000022        11       -11             # Z2SS   -->  Z1SS   E-     E+          
      4.86608269E-06    3      1000022        13       -13             # Z2SS   -->  Z1SS   MU-    MU+         
      4.95049107E-06    3      1000022        15       -15             # Z2SS   -->  Z1SS   TAU-   TAU+        
      4.71479461E-06    3      1000022        12       -12             # Z2SS   -->  Z1SS   NUE    ANUE        
      4.71479461E-06    3      1000022        14       -14             # Z2SS   -->  Z1SS   NUM    ANUM        
      4.71479461E-06    3      1000022        16       -16             # Z2SS   -->  Z1SS   NUT    ANUT        
      5.22598391E-03    2      1000022        25                       # Z2SS   -->  Z1SS   HL0                
      4.97436374E-02    2      1000002        -2                       # Z2SS   -->  UPL    UB                 
      4.97436374E-02    2     -1000002         2                       # Z2SS   -->  UBL    UP                 
      4.90287021E-02    2      1000001        -1                       # Z2SS   -->  DNL    DB                 
      4.90287021E-02    2     -1000001         1                       # Z2SS   -->  DBL    DN                 
      4.90287021E-02    2      1000003        -3                       # Z2SS   -->  STL    SB                 
      4.90287021E-02    2     -1000003         3                       # Z2SS   -->  SBL    ST                 
      4.97435965E-02    2      1000004        -4                       # Z2SS   -->  CHL    CB                 
      4.97435965E-02    2     -1000004         4                       # Z2SS   -->  CBL    CH                 
      7.88415400E-06    2      2000002        -2                       # Z2SS   -->  UPR    UB                 
      7.88415400E-06    2     -2000002         2                       # Z2SS   -->  UBR    UP                 
      1.96994074E-06    2      2000001        -1                       # Z2SS   -->  DNR    DB                 
      1.96994074E-06    2     -2000001         1                       # Z2SS   -->  DBR    DN                 
      1.96994051E-06    2      2000003        -3                       # Z2SS   -->  STR    SB                 
      1.96994051E-06    2     -2000003         3                       # Z2SS   -->  SBR    ST                 
      7.88414764E-06    2      2000004        -4                       # Z2SS   -->  CHR    CB                 
      7.88414764E-06    2     -2000004         4                       # Z2SS   -->  CBR    CH                 
      3.18981794E-04    2      1000005        -5                       # Z2SS   -->  BT1    BB                 
      3.18981794E-04    2     -1000005         5                       # Z2SS   -->  BB1    BT                 
      4.93796840E-02    2      2000005        -5                       # Z2SS   -->  BT2    BB                 
      4.93796840E-02    2     -2000005         5                       # Z2SS   -->  BB2    BT                 
      2.06000328E-01    2      1000006        -6                       # Z2SS   -->  TP1    TB                 
      2.06000328E-01    2     -1000006         6                       # Z2SS   -->  TB1    TP                 
      4.36207838E-02    2      2000006        -6                       # Z2SS   -->  TP2    TB                 
      4.36207838E-02    2     -2000006         6                       # Z2SS   -->  TB2    TP                 
      2.40173730E-08    2      1000039        22                       # Z2SS   -->  GVSS   GM                 
      6.12162154E-10    3      1000039        11       -11             # Z2SS   -->  GVSS   E-     E+          
      1.11126106E-07    2      1000039        23                       # Z2SS   -->  GVSS   Z0                 
      9.27450916E-09    2      1000039        25                       # Z2SS   -->  GVSS   HL0                
#         PDG         Width
DECAY   1000025  1.06586220E+02   # Z3SS  decays
#          BR          NDA       ID1       ID2       ID3       ID4
      1.36623779E-08    2      1000022        22                       # Z3SS   -->  Z1SS   GM                 
      4.94492641E-11    2      1000023        22                       # Z3SS   -->  Z2SS   GM                 
      7.96936729E-06    3     -1000024         2        -1             # Z3SS   -->  W1SS-  UP     DB          
      2.65645554E-06    3     -1000024        12       -11             # Z3SS   -->  W1SS-  NUE    E+          
      2.65645554E-06    3     -1000024        14       -13             # Z3SS   -->  W1SS-  NUM    MU+         
      7.96936729E-06    3      1000024         1        -2             # Z3SS   -->  W1SS+  DN     UB          
      2.65645554E-06    3      1000024        11       -12             # Z3SS   -->  W1SS+  E-     ANUE        
      2.65645554E-06    3      1000024        13       -14             # Z3SS   -->  W1SS+  MU-    ANUM        
      7.96936729E-06    3     -1000024         4        -3             # Z3SS   -->  W1SS-  CH     SB          
      2.65645554E-06    3     -1000024        16       -15             # Z3SS   -->  W1SS-  NUT    TAU+        
      7.96936729E-06    3      1000024         3        -4             # Z3SS   -->  W1SS+  ST     CB          
      2.65645554E-06    3      1000024        15       -16             # Z3SS   -->  W1SS+  TAU-   ANUT        
      1.35393795E-02    2      1000022        23                       # Z3SS   -->  Z1SS   Z0                 
      1.83616450E-07    3      1000022         5        -5             # Z3SS   -->  Z1SS   BT     BB          
      2.26540973E-08    3      1000022        15       -15             # Z3SS   -->  Z1SS   TAU-   TAU+        
      1.77558820E-06    3      1000023         2        -2             # Z3SS   -->  Z2SS   UP     UB          
      2.28963268E-06    3      1000023         1        -1             # Z3SS   -->  Z2SS   DN     DB          
      2.28963268E-06    3      1000023         3        -3             # Z3SS   -->  Z2SS   ST     SB          
      1.77558820E-06    3      1000023         4        -4             # Z3SS   -->  Z2SS   CH     CB          
      2.21351070E-06    3      1000023         5        -5             # Z3SS   -->  Z2SS   BT     BB          
      5.19402079E-07    3      1000023        11       -11             # Z3SS   -->  Z2SS   E-     E+          
      5.19402079E-07    3      1000023        13       -13             # Z3SS   -->  Z2SS   MU-    MU+         
      5.16313889E-07    3      1000023        15       -15             # Z3SS   -->  Z2SS   TAU-   TAU+        
      1.03344678E-06    3      1000023        12       -12             # Z3SS   -->  Z2SS   NUE    ANUE        
      1.03344678E-06    3      1000023        14       -14             # Z3SS   -->  Z2SS   NUM    ANUM        
      1.03344678E-06    3      1000023        16       -16             # Z3SS   -->  Z2SS   NUT    ANUT        
      2.61335564E-03    2      1000022        25                       # Z3SS   -->  Z1SS   HL0                
      4.47143884E-06    2      1000002        -2                       # Z3SS   -->  UPL    UB                 
      4.47143884E-06    2     -1000002         2                       # Z3SS   -->  UBL    UP                 
      9.63331149E-06    2      1000001        -1                       # Z3SS   -->  DNL    DB                 
      9.63331149E-06    2     -1000001         1                       # Z3SS   -->  DBL    DN                 
      9.63331149E-06    2      1000003        -3                       # Z3SS   -->  STL    SB                 
      9.63331149E-06    2     -1000003         3                       # Z3SS   -->  SBL    ST                 
      4.47143566E-06    2      1000004        -4                       # Z3SS   -->  CHL    CB                 
      4.47143566E-06    2     -1000004         4                       # Z3SS   -->  CBL    CH                 
      3.93354458E-06    2      2000002        -2                       # Z3SS   -->  UPR    UB                 
      3.93354458E-06    2     -2000002         2                       # Z3SS   -->  UBR    UP                 
      9.82871484E-07    2      2000001        -1                       # Z3SS   -->  DNR    DB                 
      9.82871484E-07    2     -2000001         1                       # Z3SS   -->  DBR    DN                 
      9.82871143E-07    2      2000003        -3                       # Z3SS   -->  STR    SB                 
      9.82871143E-07    2     -2000003         3                       # Z3SS   -->  SBR    ST                 
      3.93354185E-06    2      2000004        -4                       # Z3SS   -->  CHR    CB                 
      3.93354185E-06    2     -2000004         4                       # Z3SS   -->  CBR    CH                 
      8.38650623E-04    2      1000005        -5                       # Z3SS   -->  BT1    BB                 
      8.38650623E-04    2     -1000005         5                       # Z3SS   -->  BB1    BT                 
      8.47153948E-04    2      2000005        -5                       # Z3SS   -->  BT2    BB                 
      8.47153948E-04    2     -2000005         5                       # Z3SS   -->  BB2    BT                 
      2.11345196E-01    2      1000006        -6                       # Z3SS   -->  TP1    TB                 
      2.11345196E-01    2     -1000006         6                       # Z3SS   -->  TB1    TP                 
      2.78822988E-01    2      2000006        -6                       # Z3SS   -->  TP2    TB                 
      2.78822988E-01    2     -2000006         6                       # Z3SS   -->  TB2    TP                 
      7.40746406E-16    2      1000011       -11                       # Z3SS   -->  EL-    E+                 
      7.40746406E-16    2     -1000011        11                       # Z3SS   -->  EL+    E-                 
      2.01472529E-14    2      2000011       -11                       # Z3SS   -->  ER-    E+                 
      2.01472529E-14    2     -2000011        11                       # Z3SS   -->  ER+    E-                 
      4.62105658E-12    2      1000012       -12                       # Z3SS   -->  NUEL   ANUE               
      4.62105658E-12    2     -1000012        12                       # Z3SS   -->  ANUEL  NUE                
      4.62105658E-12    2      1000014       -14                       # Z3SS   -->  NUML   ANUM               
      4.62105658E-12    2     -1000014        14                       # Z3SS   -->  ANUML  NUM                
      4.62105658E-12    2      1000016       -16                       # Z3SS   -->  NUTL   ANUT               
      4.62105658E-12    2     -1000016        16                       # Z3SS   -->  ANUTL  NUT                
      2.72999874E-12    2      1000039        22                       # Z3SS   -->  GVSS   GM                 
      6.97150399E-14    3      1000039        11       -11             # Z3SS   -->  GVSS   E-     E+          
      2.88067863E-08    2      1000039        23                       # Z3SS   -->  GVSS   Z0                 
      1.14696242E-07    2      1000039        25                       # Z3SS   -->  GVSS   HL0                
      1.28525207E-21    2      1000039        36                       # Z3SS   -->  GVSS   HA0                
#         PDG         Width
DECAY   1000035  1.39338837E+02   # Z4SS  decays
#          BR          NDA       ID1       ID2       ID3       ID4
      4.65946792E-09    2      1000022        22                       # Z4SS   -->  Z1SS   GM                 
      2.96359548E-10    2      1000023        22                       # Z4SS   -->  Z2SS   GM                 
      9.97107619E-10    2      1000025        22                       # Z4SS   -->  Z3SS   GM                 
      7.26939691E-03    2      1000024       -24                       # Z4SS   -->  W1SS+  W-                 
      7.26939691E-03    2     -1000024        24                       # Z4SS   -->  W1SS-  W+                 
      1.07871741E-03    2      1000022        23                       # Z4SS   -->  Z1SS   Z0                 
      2.36591385E-10    2      1000023        23                       # Z4SS   -->  Z2SS   Z0                 
      9.53927213E-08    3      1000022         5        -5             # Z4SS   -->  Z1SS   BT     BB          
      1.17692345E-08    3      1000022        15       -15             # Z4SS   -->  Z1SS   TAU-   TAU+        
      1.79126570E-16    3      1000023         5        -5             # Z4SS   -->  Z2SS   BT     BB          
      2.23335490E-17    3      1000023        15       -15             # Z4SS   -->  Z2SS   TAU-   TAU+        
      1.38181997E-06    3      1000025         2        -2             # Z4SS   -->  Z3SS   UP     UB          
      1.78186610E-06    3      1000025         1        -1             # Z4SS   -->  Z3SS   DN     DB          
      1.78186610E-06    3      1000025         3        -3             # Z4SS   -->  Z3SS   ST     SB          
      1.38181997E-06    3      1000025         4        -4             # Z4SS   -->  Z3SS   CH     CB          
      1.72267846E-06    3      1000025         5        -5             # Z4SS   -->  Z3SS   BT     BB          
      4.04215427E-07    3      1000025        11       -11             # Z4SS   -->  Z3SS   E-     E+          
      4.04215427E-07    3      1000025        13       -13             # Z4SS   -->  Z3SS   MU-    MU+         
      4.01754562E-07    3      1000025        15       -15             # Z4SS   -->  Z3SS   TAU-   TAU+        
      8.04261617E-07    3      1000025        12       -12             # Z4SS   -->  Z3SS   NUE    ANUE        
      8.04261617E-07    3      1000025        14       -14             # Z4SS   -->  Z3SS   NUM    ANUM        
      8.04261617E-07    3      1000025        16       -16             # Z4SS   -->  Z3SS   NUT    ANUT        
      5.02847508E-03    2      1000022        25                       # Z4SS   -->  Z1SS   HL0                
      5.61587505E-08    2      1000023        25                       # Z4SS   -->  Z2SS   HL0                
      5.16892001E-02    2      1000002        -2                       # Z4SS   -->  UPL    UB                 
      5.16892001E-02    2     -1000002         2                       # Z4SS   -->  UBL    UP                 
      5.22297509E-02    2      1000001        -1                       # Z4SS   -->  DNL    DB                 
      5.22297509E-02    2     -1000001         1                       # Z4SS   -->  DBL    DN                 
      5.22297509E-02    2      1000003        -3                       # Z4SS   -->  STL    SB                 
      5.22297509E-02    2     -1000003         3                       # Z4SS   -->  SBL    ST                 
      5.16891666E-02    2      1000004        -4                       # Z4SS   -->  CHL    CB                 
      5.16891666E-02    2     -1000004         4                       # Z4SS   -->  CBL    CH                 
      7.52986580E-06    2      2000002        -2                       # Z4SS   -->  UPR    UB                 
      7.52986580E-06    2     -2000002         2                       # Z4SS   -->  UBR    UP                 
      1.88153842E-06    2      2000001        -1                       # Z4SS   -->  DNR    DB                 
      1.88153842E-06    2     -2000001         1                       # Z4SS   -->  DBR    DN                 
      1.88153820E-06    2      2000003        -3                       # Z4SS   -->  STR    SB                 
      1.88153820E-06    2     -2000003         3                       # Z4SS   -->  SBR    ST                 
      7.52986080E-06    2      2000004        -4                       # Z4SS   -->  CHR    CB                 
      7.52986080E-06    2     -2000004         4                       # Z4SS   -->  CBR    CH                 
      3.29681352E-04    2      1000005        -5                       # Z4SS   -->  BT1    BB                 
      3.29681352E-04    2     -1000005         5                       # Z4SS   -->  BB1    BT                 
      5.25229238E-02    2      2000005        -5                       # Z4SS   -->  BT2    BB                 
      5.25229238E-02    2     -2000005         5                       # Z4SS   -->  BB2    BT                 
      5.72917126E-02    2      1000006        -6                       # Z4SS   -->  TP1    TB                 
      5.72917126E-02    2     -1000006         6                       # Z4SS   -->  TB1    TP                 
      1.71310231E-01    2      2000006        -6                       # Z4SS   -->  TP2    TB                 
      1.71310231E-01    2     -2000006         6                       # Z4SS   -->  TB2    TP                 
      5.80020896E-05    2      1000011       -11                       # Z4SS   -->  EL-    E+                 
      5.80020896E-05    2     -1000011        11                       # Z4SS   -->  EL+    E-                 
      5.80020314E-05    2      1000013       -13                       # Z4SS   -->  MUL-   MU+                
      5.80020314E-05    2     -1000013        13                       # Z4SS   -->  MUL+   MU-                
      1.92760243E-08    2      2000011       -11                       # Z4SS   -->  ER-    E+                 
      1.92760243E-08    2     -2000011        11                       # Z4SS   -->  ER+    E-                 
      1.92760048E-08    2      2000013       -13                       # Z4SS   -->  MUR-   MU+                
      1.92760048E-08    2     -2000013        13                       # Z4SS   -->  MUR+   MU-                
      1.54909529E-07    2      1000015       -15                       # Z4SS   -->  TAU1-  TAU+               
      1.54909529E-07    2     -1000015        15                       # Z4SS   -->  TAU1+  TAU-               
      5.79592597E-05    2      2000015       -15                       # Z4SS   -->  TAU2-  TAU+               
      5.79592597E-05    2     -2000015        15                       # Z4SS   -->  TAU2+  TAU-               
      6.18276390E-05    2      1000012       -12                       # Z4SS   -->  NUEL   ANUE               
      6.18276390E-05    2     -1000012        12                       # Z4SS   -->  ANUEL  NUE                
      6.18276390E-05    2      1000014       -14                       # Z4SS   -->  NUML   ANUM               
      6.18276390E-05    2     -1000014        14                       # Z4SS   -->  ANUML  NUM                
      6.18276390E-05    2      1000016       -16                       # Z4SS   -->  NUTL   ANUT               
      6.18276390E-05    2     -1000016        16                       # Z4SS   -->  ANUTL  NUT                
      2.77497421E-08    2      1000039        22                       # Z4SS   -->  GVSS   GM                 
      7.09941328E-10    3      1000039        11       -11             # Z4SS   -->  GVSS   E-     E+          
      1.50100362E-07    2      1000039        23                       # Z4SS   -->  GVSS   Z0                 
      1.29904008E-08    2      1000039        25                       # Z4SS   -->  GVSS   HL0                
      1.58338796E-13    2      1000039        35                       # Z4SS   -->  GVSS   HH0                
      1.17694645E-13    2      1000039        36                       # Z4SS   -->  GVSS   HA0                
#         PDG         Width
DECAY   1000024  1.37381683E+02   # W1SS+ decays
#          BR          NDA       ID1       ID2       ID3       ID4
      9.52725622E-06    3      1000022       -11        12             # W1SS+  -->  Z1SS   E+     NUE         
      9.52725622E-06    3      1000022       -13        14             # W1SS+  -->  Z1SS   MU+    NUM         
      9.61174192E-06    3      1000022       -15        16             # W1SS+  -->  Z1SS   TAU+   NUT         
      6.20497903E-03    2      1000022        24                       # W1SS+  -->  Z1SS   W+                 
      9.98915881E-02    2      1000002        -1                       # W1SS+  -->  UPL    DB                 
      9.68795791E-02    2     -1000001         2                       # W1SS+  -->  DBL    UP                 
      9.98915061E-02    2      1000004        -3                       # W1SS+  -->  CHL    SB                 
      9.70584080E-02    2     -1000003         4                       # W1SS+  -->  SBL    CH                 
      2.71909237E-01    2      1000006        -5                       # W1SS+  -->  TP1    BB                 
      8.83123092E-03    2      2000006        -5                       # W1SS+  -->  TP2    BB                 
      6.35140110E-04    2     -1000005         6                       # W1SS+  -->  BB1    TP                 
      3.18669707E-01    2     -2000005         6                       # W1SS+  -->  BB2    TP                 
#         PDG         Width
DECAY   1000037  1.39440338E+02   # W2SS+ decays
#          BR          NDA       ID1       ID2       ID3       ID4
      1.11133724E-08    3      1000022       -15        16             # W2SS+  -->  Z1SS   TAU+   NUT         
      6.07259898E-03    2      1000022        24                       # W2SS+  -->  Z1SS   W+                 
      5.27899800E-14    3      1000023       -15        16             # W2SS+  -->  Z2SS   TAU+   NUT         
      7.29932263E-03    2      1000023        24                       # W2SS+  -->  Z2SS   W+                 
      5.92288416E-06    3      1000025         2        -1             # W2SS+  -->  Z3SS   UP     DB          
      5.92288416E-06    3      1000025         4        -3             # W2SS+  -->  Z3SS   CH     SB          
      1.97429449E-06    3      1000025       -11        12             # W2SS+  -->  Z3SS   E+     NUE         
      1.97429449E-06    3      1000025       -13        14             # W2SS+  -->  Z3SS   MU+    NUM         
      1.97429449E-06    3      1000025       -15        16             # W2SS+  -->  Z3SS   TAU+   NUT         
      1.02718346E-01    2      1000002        -1                       # W2SS+  -->  UPL    DB                 
      1.05544224E-01    2     -1000001         2                       # W2SS+  -->  DBL    UP                 
      1.02718301E-01    2      1000004        -3                       # W2SS+  -->  CHL    SB                 
      1.05716608E-01    2     -1000003         4                       # W2SS+  -->  SBL    CH                 
      5.74232684E-03    2      1000006        -5                       # W2SS+  -->  TP1    BB                 
      2.93972969E-01    2      2000006        -5                       # W2SS+  -->  TP2    BB                 
      6.53311785E-04    2     -1000005         6                       # W2SS+  -->  BB1    TP                 
      2.62838960E-01    2     -2000005         6                       # W2SS+  -->  BB2    TP                 
      1.19343626E-04    2      1000012       -11                       # W2SS+  -->  NUEL   E+                 
      1.19343487E-04    2      1000014       -13                       # W2SS+  -->  NUML   MU+                
      1.19303746E-04    2      1000016       -15                       # W2SS+  -->  NUTL   TAU+               
      1.19455013E-04    2     -1000011        12                       # W2SS+  -->  EL+    NUE                
      1.19455013E-04    2     -1000013        14                       # W2SS+  -->  MUL+   NUM                
      2.74114086E-07    2     -1000015        16                       # W2SS+  -->  TAU1+  NUT                
      1.19409407E-04    2     -2000015        16                       # W2SS+  -->  TAU2+  NUT                
      5.98800322E-03    2      1000024        23                       # W2SS+  -->  W1SS+  Z0                 
      4.34125923E-07    2      1000024        25                       # W2SS+  -->  W1SS+  HL0                
#         PDG         Width
DECAY        25  4.47680429E-03   # HL0   decays
#          BR          NDA       ID1       ID2       ID3       ID4
      4.58842742E-09    2           11       -11                       # HL0    -->  E-     E+                 
      1.93730812E-04    2           13       -13                       # HL0    -->  MU-    MU+                
      5.54151013E-02    2           15       -15                       # HL0    -->  TAU-   TAU+               
      5.75507602E-06    2            1        -1                       # HL0    -->  DN     DB                 
      2.32533924E-03    2            3        -3                       # HL0    -->  ST     SB                 
      7.57442474E-01    2            5        -5                       # HL0    -->  BT     BB                 
      1.83169323E-06    2            2        -2                       # HL0    -->  UP     UB                 
      3.42444554E-02    2            4        -4                       # HL0    -->  CH     CB                 
      2.00066855E-03    2           22        22                       # HL0    -->  GM     GM                 
      4.13775891E-02    2           21        21                       # HL0    -->  GL     GL                 
      5.42592444E-03    3           24        11       -12             # HL0    -->  W+     E-     ANUE        
      5.42592444E-03    3           24        13       -14             # HL0    -->  W+     MU-    ANUM        
      5.42592444E-03    3           24        15       -16             # HL0    -->  W+     TAU-   ANUT        
      1.62777733E-02    3           24        -2         1             # HL0    -->  W+     UB     DN          
      1.62777733E-02    3           24        -4         3             # HL0    -->  W+     CB     ST          
      5.42592444E-03    3          -24       -11        12             # HL0    -->  W-     E+     NUE         
      5.42592444E-03    3          -24       -13        14             # HL0    -->  W-     MU+    NUM         
      5.42592444E-03    3          -24       -15        16             # HL0    -->  W-     TAU+   NUT         
      1.62777733E-02    3          -24         2        -1             # HL0    -->  W-     UP     DB          
      1.62777733E-02    3          -24         4        -3             # HL0    -->  W-     CH     SB          
      6.37865509E-04    3           23        12       -12             # HL0    -->  Z0     NUE    ANUE        
      6.37865509E-04    3           23        14       -14             # HL0    -->  Z0     NUM    ANUM        
      6.37865509E-04    3           23        16       -16             # HL0    -->  Z0     NUT    ANUT        
      3.21031286E-04    3           23        11       -11             # HL0    -->  Z0     E-     E+          
      3.21031286E-04    3           23        13       -13             # HL0    -->  Z0     MU-    MU+         
      3.21031286E-04    3           23        15       -15             # HL0    -->  Z0     TAU-   TAU+        
      1.09982595E-03    3           23         2        -2             # HL0    -->  Z0     UP     UB          
      1.09982595E-03    3           23         4        -4             # HL0    -->  Z0     CH     CB          
      1.41684688E-03    3           23         1        -1             # HL0    -->  Z0     DN     DB          
      1.41684688E-03    3           23         3        -3             # HL0    -->  Z0     ST     SB          
      1.41684688E-03    3           23         5        -5             # HL0    -->  Z0     BT     BB          
#         PDG         Width
DECAY        35  1.33632385E+02   # HH0   decays
#          BR          NDA       ID1       ID2       ID3       ID4
      2.88009928E-11    2           11       -11                       # HH0    -->  E-     E+                 
      1.21602977E-06    2           13       -13                       # HH0    -->  MU-    MU+                
      3.48288537E-04    2           15       -15                       # HH0    -->  TAU-   TAU+               
      3.50363969E-08    2            1        -1                       # HH0    -->  DN     DB                 
      1.41564788E-05    2            3        -3                       # HH0    -->  ST     SB                 
      3.14836181E-03    2            5        -5                       # HH0    -->  BT     BB                 
      1.39137576E-10    2            2        -2                       # HH0    -->  UP     UB                 
      1.76707579E-06    2            4        -4                       # HH0    -->  CH     CB                 
      9.12563875E-02    2            6        -6                       # HH0    -->  TP     TB                 
      2.28458106E-07    2           22        22                       # HH0    -->  GM     GM                 
      3.13322744E-05    2           21        21                       # HH0    -->  GL     GL                 
      2.45117899E-05    2           24       -24                       # HH0    -->  W+     W-                 
      1.25596562E-05    2           23        23                       # HH0    -->  Z0     Z0                 
      9.46061482E-06    2      1000022   1000022                       # HH0    -->  Z1SS   Z1SS               
      2.40401030E-02    2           25        25                       # HH0    -->  HL0    HL0                
      3.11621952E-05    2      1000002  -1000002                       # HH0    -->  UPL    UBL                
      6.24769746E-06    2      2000002  -2000002                       # HH0    -->  UPR    UBR                
      3.11404474E-05    2      1000004  -1000004                       # HH0    -->  CHL    CBL                
      6.23796859E-06    2      2000004  -2000004                       # HH0    -->  CHR    CBR                
      4.65844969E-05    2      1000001  -1000001                       # HH0    -->  DNL    DBL                
      1.56093881E-06    2      2000001  -2000001                       # HH0    -->  DNR    DBR                
      4.65896701E-05    2      1000003  -1000003                       # HH0    -->  STL    SBL                
      1.55999328E-06    2      2000003  -2000003                       # HH0    -->  STR    SBR                
      1.37025916E-06    2      1000005  -1000005                       # HH0    -->  BT1    BB1                
      4.76687237E-05    2      2000005  -2000005                       # HH0    -->  BT2    BB2                
      1.31262718E-02    2      1000005  -2000005                       # HH0    -->  BT1    BB2                
      1.31262718E-02    2      2000005  -1000005                       # HH0    -->  BT2    BB1                
      4.51135576E-01    2      1000006  -1000006                       # HH0    -->  TP1    TB1                
      4.00722533E-01    2      2000006  -2000006                       # HH0    -->  TP2    TB2                
      1.39048195E-03    2      1000006  -2000006                       # HH0    -->  TP1    TB2                
      1.39048195E-03    2      2000006  -1000006                       # HH0    -->  TP2    TB1                
#         PDG         Width
DECAY        36  1.30902924E+02   # HA0   decays
#          BR          NDA       ID1       ID2       ID3       ID4
      2.92096521E-11    2           11       -11                       # HA0    -->  E-     E+                 
      1.23328425E-06    2           13       -13                       # HA0    -->  MU-    MU+                
      3.53231153E-04    2           15       -15                       # HA0    -->  TAU-   TAU+               
      3.55352903E-08    2            1        -1                       # HA0    -->  DN     DB                 
      1.43580555E-05    2            3        -3                       # HA0    -->  ST     SB                 
      3.19565111E-03    2            5        -5                       # HA0    -->  BT     BB                 
      1.40372075E-10    2            2        -2                       # HA0    -->  UP     UB                 
      1.78411665E-06    2            4        -4                       # HA0    -->  CH     CB                 
      9.34675336E-02    2            6        -6                       # HA0    -->  TP     TB                 
      2.30717006E-07    2           22        22                       # HA0    -->  GM     GM                 
      3.01965702E-05    2           21        21                       # HA0    -->  GL     GL                 
      1.63281420E-05    2      1000022   1000022                       # HA0    -->  Z1SS   Z1SS               
      2.47002863E-05    2           25        23                       # HA0    -->  HL0    Z0                 
      5.13265375E-10    2      1000002  -2000002                       # HA0    -->  UPL    UBR                
      5.13265375E-10    2      2000002  -1000002                       # HA0    -->  UPR    UBL                
      2.98286195E-05    2      1000004  -2000004                       # HA0    -->  CHL    CBR                
      2.98286195E-05    2      2000004  -1000004                       # HA0    -->  CHR    CBL                
      1.60190250E-09    2      1000001  -2000001                       # HA0    -->  DNL    DBR                
      1.60190250E-09    2      2000001  -1000001                       # HA0    -->  DNR    DBL                
      6.47249635E-07    2      1000003  -2000003                       # HA0    -->  STL    SBR                
      6.47249635E-07    2      2000003  -1000003                       # HA0    -->  STR    SBL                
      1.34666916E-02    2      1000005  -2000005                       # HA0    -->  BT1    BB2                
      1.34666916E-02    2      2000005  -1000005                       # HA0    -->  BT2    BB1                
      4.37950164E-01    2      1000006  -2000006                       # HA0    -->  TP1    TB2                
      4.37950164E-01    2      2000006  -1000006                       # HA0    -->  TP2    TB1                
#         PDG         Width
DECAY        37  1.29876251E+02   # H+    decays
#          BR          NDA       ID1       ID2       ID3       ID4
      2.96298992E-11    2           12       -11                       # H+     -->  NUE    E+                 
      1.25102792E-06    2           14       -13                       # H+     -->  NUM    MU+                
      3.58313206E-04    2           16       -15                       # H+     -->  NUT    TAU+               
      3.34959438E-08    2            2        -1                       # H+     -->  UP     DB                 
      1.51547474E-05    2            4        -3                       # H+     -->  CH     SB                 
      9.02932882E-02    2            6        -5                       # H+     -->  TP     BB                 
      2.50739249E-05    2           25        24                       # H+     -->  HL0    W+                 
      7.90780759E-05    2      1000002  -1000001                       # H+     -->  UPL    DBL                
      3.21800542E-09    2      2000002  -2000001                       # H+     -->  UPR    DBR                
      7.90484773E-05    2      1000004  -1000003                       # H+     -->  CHL    SBL                
      1.30023636E-06    2      2000004  -2000003                       # H+     -->  CHR    SBR                
      1.47381900E-02    2      1000006  -1000005                       # H+     -->  TP1    BB1                
      4.24396455E-01    2      1000006  -2000005                       # H+     -->  TP1    BB2                
      1.22010224E-02    2      2000006  -1000005                       # H+     -->  TP2    BB1                
      4.57811713E-01    2      2000006  -2000005                       # H+     -->  TP2    BB2                
