  65
  401    602.5777    0.40323E-25
  402    597.8857    0.41187E-25
  403    602.5777    0.40324E-25
  404    597.8872    0.41187E-25
  405   2000.1373    0.61483E-26
  406   2004.0999    0.43381E-26
  407    602.5777    0.40323E-25
  408    597.8857    0.41187E-25
  409    602.5777    0.40324E-25
  410    597.8872    0.41187E-25
  411   2000.1373    0.61483E-26
  412   2004.0999    0.43381E-26
  413   2000.1418    0.61631E-26
  414   1999.7164    0.59759E-26
  415   2000.1418    0.61631E-26
  416   1999.7168    0.59759E-26
  417   2000.7828    0.43483E-26
  418   2004.4734    0.43859E-26
  419   2000.1418    0.61631E-26
  420   1999.7164    0.59759E-26
  421   2000.1418    0.61631E-26
  422   1999.7168    0.59759E-26
  423   2000.7828    0.43483E-26
  424   2004.4734    0.43859E-26
  425    204.8549    0.47029E-23
  426    190.6121    0.48677E-23
  427    204.8549    0.47029E-23
  428    190.6121    0.48677E-23
  429   2000.4075    0.64379E-25
  430   1999.0830    0.24784E-25
  431    204.8549    0.47029E-23
  432    190.6121    0.48677E-23
  433    204.8549    0.47029E-23
  434    190.6121    0.48677E-23
  435   2000.4075    0.64379E-25
  436   1999.0830    0.24784E-25
  437   2000.4253    0.65090E-25
  438      0.0000    0.10000E+31
  439   2000.4253    0.65090E-25
  440      0.0000    0.10000E+31
  441   2000.5106    0.24821E-25
  442      0.0000    0.10000E+31
  443   2000.4253    0.65090E-25
  444      0.0000    0.10000E+31
  445   2000.4253    0.65090E-25
  446      0.0000    0.10000E+31
  447   2000.5106    0.24821E-25
  448      0.0000    0.10000E+31
  449    400.0000    0.55945E-20
  450     99.9659    0.10000E+31
  451    299.8095    0.42734E-24
  452   -602.6187    0.14040E-24
  453    618.4748    0.12754E-24
  454    299.5957    0.42586E-24
  455    617.6038    0.12688E-24
  456    299.5957    0.42586E-24
  457    617.6038    0.12688E-24
  203    105.4009    0.17894E-21
  204   1007.7203    0.86926E-25
  205   1000.0000    0.87469E-25
  206   1006.3821    0.95404E-25
  207   1006.3821    0.95404E-25
  458      0.0000    0.10000E+31
    6    172.5000    0.57395E-24
   12    172.5000    0.57395E-24
   4
   401  0.59518870E-02     0   450     1     0     0     0
   401  0.82308017E-01     0   451     1     0     0     0
   401  0.74810350E+00     0   449     1     0     0     0
   401  0.16363662E+00     0   456     2     0     0     0
   4
   402  0.39909482E-02     0   450     2     0     0     0
   402  0.84881343E-01     0   451     2     0     0     0
   402  0.74008876E+00     0   449     2     0     0     0
   402  0.17103897E+00     0   454     1     0     0     0
   4
   403  0.59519038E-02     0   450     3     0     0     0
   403  0.82308248E-01     0   451     3     0     0     0
   403  0.74810565E+00     0   449     3     0     0     0
   403  0.16363418E+00     0   456     4     0     0     0
   4
   404  0.39909850E-02     0   450     4     0     0     0
   404  0.84881753E-01     0   451     4     0     0     0
   404  0.74008441E+00     0   449     4     0     0     0
   404  0.17104289E+00     0   454     3     0     0     0
   7
   405  0.10435166E-01     0   450     5     0     0     0
   405  0.62692627E-04     0   451     5     0     0     0
   405  0.61397505E-03     0   452     5     0     0     0
   405  0.60683506E-03     0   453     5     0     0     0
   405  0.98707837E+00     0   449     5     0     0     0
   405  0.98633987E-04     0   456     6     0     0     0
   405  0.11043386E-02     0   457     6     0     0     0
   7
   406  0.68677270E+00     0   449     6     0     0     0
   406  0.29178558E-01     0   450     6     0     0     0
   406  0.25607138E-02     0   451     6     0     0     0
   406  0.70969641E-01     0   452     6     0     0     0
   406  0.67639709E-01     0   453     6     0     0     0
   406  0.52627139E-02     0   454     5     0     0     0
   406  0.13761593E+00     0   455     5     0     0     0
   4
   407  0.59518870E-02     0   450     7     0     0     0
   407  0.82308017E-01     0   451     7     0     0     0
   407  0.74810350E+00     0   449     7     0     0     0
   407  0.16363662E+00     0   454     8     0     0     0
   4
   408  0.39909482E-02     0   450     8     0     0     0
   408  0.84881343E-01     0   451     8     0     0     0
   408  0.74008876E+00     0   449     8     0     0     0
   408  0.17103897E+00     0   456     7     0     0     0
   4
   409  0.59519038E-02     0   450     9     0     0     0
   409  0.82308248E-01     0   451     9     0     0     0
   409  0.74810565E+00     0   449     9     0     0     0
   409  0.16363418E+00     0   454    10     0     0     0
   4
   410  0.39909850E-02     0   450    10     0     0     0
   410  0.84881753E-01     0   451    10     0     0     0
   410  0.74008441E+00     0   449    10     0     0     0
   410  0.17104289E+00     0   456     9     0     0     0
   7
   411  0.10435166E-01     0   450    11     0     0     0
   411  0.62692627E-04     0   451    11     0     0     0
   411  0.61397505E-03     0   452    11     0     0     0
   411  0.60683506E-03     0   453    11     0     0     0
   411  0.98707837E+00     0   449    11     0     0     0
   411  0.98633987E-04     0   454    12     0     0     0
   411  0.11043386E-02     0   455    12     0     0     0
   7
   412  0.68677270E+00     0   449    12     0     0     0
   412  0.29178558E-01     0   450    12     0     0     0
   412  0.25607138E-02     0   451    12     0     0     0
   412  0.70969641E-01     0   452    12     0     0     0
   412  0.67639709E-01     0   453    12     0     0     0
   412  0.52627139E-02     0   456    11     0     0     0
   412  0.13761593E+00     0   457    11     0     0     0
   4
   413  0.10451620E-01     0   450     1     0     0     0
   413  0.13824414E-04     0   451     1     0     0     0
   413  0.44614117E-04     0   453     1     0     0     0
   413  0.98948997E+00     0   449     1     0     0     0
   5
   414  0.40527672E-01     0   450     2     0     0     0
   414  0.53605225E-04     0   451     2     0     0     0
   414  0.35640158E-04     0   452     2     0     0     0
   414  0.17298250E-03     0   453     2     0     0     0
   414  0.95921016E+00     0   449     2     0     0     0
   4
   415  0.10451620E-01     0   450     3     0     0     0
   415  0.13824414E-04     0   451     3     0     0     0
   415  0.44614117E-04     0   453     3     0     0     0
   415  0.98948997E+00     0   449     3     0     0     0
   5
   416  0.40527672E-01     0   450     4     0     0     0
   416  0.53605225E-04     0   451     4     0     0     0
   416  0.35640154E-04     0   452     4     0     0     0
   416  0.17298249E-03     0   453     4     0     0     0
   416  0.95921010E+00     0   449     4     0     0     0
   7
   417  0.22485657E-02     0   450     5     0     0     0
   417  0.49772147E-01     0   451     5     0     0     0
   417  0.54844865E-03     0   452     5     0     0     0
   417  0.28981175E-02     0   453     5     0     0     0
   417  0.69833660E+00     0   449     5     0     0     0
   417  0.10126182E+00     0   456     6     0     0     0
   417  0.14493431E+00     0   457     6     0     0     0
   7
   418  0.69448495E+00     0   449     6     0     0     0
   418  0.10413220E+00     0   454     5     0     0     0
   418  0.37319262E-02     0   455     5     0     0     0
   418  0.16583678E-02     0   450     6     0     0     0
   418  0.52825071E-01     0   451     6     0     0     0
   418  0.71920209E-01     0   452     6     0     0     0
   418  0.71247242E-01     0   453     6     0     0     0
   4
   419  0.10451620E-01     0   450     7     0     0     0
   419  0.13824414E-04     0   451     7     0     0     0
   419  0.44614117E-04     0   453     7     0     0     0
   419  0.98948997E+00     0   449     7     0     0     0
   5
   420  0.40527672E-01     0   450     8     0     0     0
   420  0.53605225E-04     0   451     8     0     0     0
   420  0.35640158E-04     0   452     8     0     0     0
   420  0.17298250E-03     0   453     8     0     0     0
   420  0.95921016E+00     0   449     8     0     0     0
   4
   421  0.10451620E-01     0   450     9     0     0     0
   421  0.13824414E-04     0   451     9     0     0     0
   421  0.44614117E-04     0   453     9     0     0     0
   421  0.98948997E+00     0   449     9     0     0     0
   5
   422  0.40527672E-01     0   450    10     0     0     0
   422  0.53605225E-04     0   451    10     0     0     0
   422  0.35640154E-04     0   452    10     0     0     0
   422  0.17298249E-03     0   453    10     0     0     0
   422  0.95921010E+00     0   449    10     0     0     0
   7
   423  0.22485657E-02     0   450    11     0     0     0
   423  0.49772147E-01     0   451    11     0     0     0
   423  0.54844865E-03     0   452    11     0     0     0
   423  0.28981175E-02     0   453    11     0     0     0
   423  0.69833660E+00     0   449    11     0     0     0
   423  0.10126182E+00     0   454    12     0     0     0
   423  0.14493431E+00     0   455    12     0     0     0
   7
   424  0.69448495E+00     0   449    12     0     0     0
   424  0.10413220E+00     0   456    11     0     0     0
   424  0.37319262E-02     0   457    11     0     0     0
   424  0.16583678E-02     0   450    12     0     0     0
   424  0.52825071E-01     0   451    12     0     0     0
   424  0.71920209E-01     0   452    12     0     0     0
   424  0.71247242E-01     0   453    12     0     0     0
   1
   425  0.10000000E+01     0   450   121     0     0     0
   1
   426  0.10000000E+01     0   450   122     0     0     0
   1
   427  0.10000000E+01     0   450   123     0     0     0
   1
   428  0.10000000E+01     0   450   124     0     0     0
   6
   429  0.98274517E+00     0   450   125     0     0     0
   429  0.15182459E-02     0   451   125     0     0     0
   429  0.35630732E-02     0   452   125     0     0     0
   429  0.67064255E-02     0   453   125     0     0     0
   429  0.44721665E-03     0   456   126     0     0     0
   429  0.50198748E-02     0   457   126     0     0     0
   6
   430  0.10109702E+00     0   450   126     0     0     0
   430  0.27537084E+00     0   451   126     0     0     0
   430  0.10455083E-02     0   452   126     0     0     0
   430  0.17588994E-01     0   453   126     0     0     0
   430  0.58649945E+00     0   454   125     0     0     0
   430  0.18398192E-01     0   455   125     0     0     0
   1
   431  0.10000000E+01     0   450   127     0     0     0
   1
   432  0.10000000E+01     0   450   128     0     0     0
   1
   433  0.10000000E+01     0   450   129     0     0     0
   1
   434  0.10000000E+01     0   450   130     0     0     0
   6
   435  0.98274517E+00     0   450   131     0     0     0
   435  0.15182459E-02     0   451   131     0     0     0
   435  0.35630732E-02     0   452   131     0     0     0
   435  0.67064255E-02     0   453   131     0     0     0
   435  0.44721665E-03     0   454   132     0     0     0
   435  0.50198748E-02     0   455   132     0     0     0
   6
   436  0.10109702E+00     0   450   132     0     0     0
   436  0.27537084E+00     0   451   132     0     0     0
   436  0.10455083E-02     0   452   132     0     0     0
   436  0.17588994E-01     0   453   132     0     0     0
   436  0.58649945E+00     0   456   131     0     0     0
   436  0.18398192E-01     0   457   131     0     0     0
   4
   437  0.99357045E+00     0   450   121     0     0     0
   437  0.13142161E-02     0   451   121     0     0     0
   437  0.87386952E-03     0   452   121     0     0     0
   437  0.42414349E-02     0   453   121     0     0     0
   0
   4
   439  0.99357045E+00     0   450   123     0     0     0
   439  0.13142161E-02     0   451   123     0     0     0
   439  0.87386952E-03     0   452   123     0     0     0
   439  0.42414349E-02     0   453   123     0     0     0
   0
   6
   441  0.88367984E-01     0   450   125     0     0     0
   441  0.30009845E+00     0   451   125     0     0     0
   441  0.12400900E-02     0   452   125     0     0     0
   441  0.95397001E-02     0   453   125     0     0     0
   441  0.56391102E+00     0   456   126     0     0     0
   441  0.36842760E-01     0   457   126     0     0     0
   0
   4
   443  0.99357045E+00     0   450   127     0     0     0
   443  0.13142161E-02     0   451   127     0     0     0
   443  0.87386952E-03     0   452   127     0     0     0
   443  0.42414349E-02     0   453   127     0     0     0
   0
   4
   445  0.99357045E+00     0   450   129     0     0     0
   445  0.13142161E-02     0   451   129     0     0     0
   445  0.87386952E-03     0   452   129     0     0     0
   445  0.42414349E-02     0   453   129     0     0     0
   0
   6
   447  0.88367984E-01     0   450   131     0     0     0
   447  0.30009845E+00     0   451   131     0     0     0
   447  0.12400900E-02     0   452   131     0     0     0
   447  0.95397001E-02     0   453   131     0     0     0
   447  0.56391102E+00     0   454   132     0     0     0
   447  0.36842760E-01     0   455   132     0     0     0
   0
  16
   449  0.10576969E+00     0   454     1     8     0     0
   449  0.10576969E+00     0   456     2     7     0     0
   449  0.10576884E+00     0   454     3    10     0     0
   449  0.10576884E+00     0   456     4     9     0     0
   449  0.52858568E-02     0   450    13     0     0     0
   449  0.76845869E-01     0   450     2     8     0     0
   449  0.10285126E+00     0   450     1     7     0     0
   449  0.10285126E+00     0   450     3     9     0     0
   449  0.76844938E-01     0   450     4    10     0     0
   449  0.23265609E-02     0   450     5    11     0     0
   449  0.58852474E-04     0   451    13     0     0     0
   449  0.54400824E-01     0   451     2     8     0     0
   449  0.50436385E-01     0   451     1     7     0     0
   449  0.50436385E-01     0   451     3     9     0     0
   449  0.54399967E-01     0   451     4    10     0     0
   449  0.18478533E-03     0   451     5    11     0     0
   0
  10
   451  0.54540508E-03     0   450   200     0     0     0
   451  0.99191219E-02     0   450   203     0     0     0
   451  0.11512148E+00     0   425   127     0     0     0
   451  0.11512148E+00     0   431   121     0     0     0
   451  0.11512141E+00     0   427   129     0     0     0
   451  0.11512141E+00     0   433   123     0     0     0
   451  0.13226242E+00     0   426   128     0     0     0
   451  0.13226242E+00     0   432   122     0     0     0
   451  0.13226242E+00     0   428   130     0     0     0
   451  0.13226242E+00     0   434   124     0     0     0
  14
   452  0.30565673E+00     0   454   199     0     0     0
   452  0.30565673E+00     0   456   198     0     0     0
   452  0.83631881E-01     0   450   200     0     0     0
   452  0.27583259E+00     0   451   200     0     0     0
   452  0.14581753E-01     0   450   203     0     0     0
   452  0.10498553E-01     0   451   203     0     0     0
   452  0.16069319E-03     0   425   127     0     0     0
   452  0.16069319E-03     0   431   121     0     0     0
   452  0.16069316E-03     0   427   129     0     0     0
   452  0.16069316E-03     0   433   123     0     0     0
   452  0.87475887E-03     0   426   128     0     0     0
   452  0.87475887E-03     0   432   122     0     0     0
   452  0.87475887E-03     0   428   130     0     0     0
   452  0.87475887E-03     0   434   124     0     0     0
  22
   453  0.29796526E+00     0   454   199     0     0     0
   453  0.29796526E+00     0   456   198     0     0     0
   453  0.14460161E-01     0   450   200     0     0     0
   453  0.12322650E-01     0   451   200     0     0     0
   453  0.67357540E-01     0   450   203     0     0     0
   453  0.22646178E+00     0   451   203     0     0     0
   453  0.14024875E-03     0   402     8     0     0     0
   453  0.14024875E-03     0   408     2     0     0     0
   453  0.10692166E-03     0   401     7     0     0     0
   453  0.10692166E-03     0   407     1     0     0     0
   453  0.10691351E-03     0   403     9     0     0     0
   453  0.10691351E-03     0   409     3     0     0     0
   453  0.13993651E-03     0   404    10     0     0     0
   453  0.13993651E-03     0   410     4     0     0     0
   453  0.65955985E-02     0   425   127     0     0     0
   453  0.65955985E-02     0   431   121     0     0     0
   453  0.65955976E-02     0   427   129     0     0     0
   453  0.65955976E-02     0   433   123     0     0     0
   453  0.14024237E-01     0   426   128     0     0     0
   453  0.14024237E-01     0   432   122     0     0     0
   453  0.14024237E-01     0   428   130     0     0     0
   453  0.14024237E-01     0   434   124     0     0     0
   5
   454  0.10374553E-01     0   450   198     0     0     0
   454  0.27988532E+00     0   426   127     0     0     0
   454  0.27988526E+00     0   428   129     0     0     0
   454  0.21492745E+00     0   431   122     0     0     0
   454  0.21492739E+00     0   433   124     0     0     0
  12
   455  0.73490322E-01     0   450   198     0     0     0
   455  0.30684793E+00     0   451   198     0     0     0
   455  0.18842974E-03     0   402     7     0     0     0
   455  0.24619434E-03     0   407     2     0     0     0
   455  0.18839166E-03     0   404     9     0     0     0
   455  0.41967805E-03     0   409     4     0     0     0
   455  0.13022372E-01     0   426   127     0     0     0
   455  0.13022374E-01     0   428   129     0     0     0
   455  0.28133083E-01     0   431   122     0     0     0
   455  0.28133083E-01     0   433   124     0     0     0
   455  0.29075748E+00     0   454   200     0     0     0
   455  0.24555066E+00     0   454   203     0     0     0
   5
   456  0.10374553E-01     0   450   199     0     0     0
   456  0.27988532E+00     0   432   121     0     0     0
   456  0.27988526E+00     0   434   123     0     0     0
   456  0.21492745E+00     0   425   128     0     0     0
   456  0.21492739E+00     0   427   130     0     0     0
  12
   457  0.73490322E-01     0   450   199     0     0     0
   457  0.30684793E+00     0   451   199     0     0     0
   457  0.18842974E-03     0   408     1     0     0     0
   457  0.24619434E-03     0   401     8     0     0     0
   457  0.18839166E-03     0   410     3     0     0     0
   457  0.41967805E-03     0   403    10     0     0     0
   457  0.13022372E-01     0   432   121     0     0     0
   457  0.13022374E-01     0   434   123     0     0     0
   457  0.28133083E-01     0   425   128     0     0     0
   457  0.28133083E-01     0   427   130     0     0     0
   457  0.29075748E+00     0   456   200     0     0     0
   457  0.24555066E+00     0   456   203     0     0     0
  28
   203  0.21322111E-03     0   123   129     0     0     0
   203  0.60966037E-01     0   125   131     0     0     0
   203  0.25644151E-02     0     3     9     0     0     0
   203  0.85108870E+00     0     5    11     0     0     0
   203  0.37276458E-01     0     4    10     0     0     0
   203  0.14730083E-02     0    59    59     0     0     0
   203  0.33282124E-01     0    13    13     0     0     0
   203  0.70840097E-03     0   198   121   128     0     0
   203  0.70840097E-03     0   198   123   130     0     0
   203  0.70840097E-03     0   198   125   132     0     0
   203  0.21252029E-02     0   198     8     1     0     0
   203  0.21252029E-02     0   198    10     3     0     0
   203  0.70840097E-03     0   199   127   122     0     0
   203  0.70840097E-03     0   199   129   124     0     0
   203  0.70840097E-03     0   199   131   126     0     0
   203  0.21252029E-02     0   199     2     7     0     0
   203  0.21252029E-02     0   199     4     9     0     0
   203  0.26317393E-04     0   200   122   128     0     0
   203  0.26317393E-04     0   200   124   130     0     0
   203  0.26317393E-04     0   200   126   132     0     0
   203  0.13245279E-04     0   200   121   127     0     0
   203  0.13245279E-04     0   200   123   129     0     0
   203  0.13245279E-04     0   200   125   131     0     0
   203  0.45377205E-04     0   200     2     8     0     0
   203  0.45377205E-04     0   200     4    10     0     0
   203  0.58457019E-04     0   200     1     7     0     0
   203  0.58457019E-04     0   200     3     9     0     0
   203  0.58457019E-04     0   200     5    11     0     0
  23
   204  0.15242995E-04     0   123   129     0     0     0
   204  0.43657464E-02     0   125   131     0     0     0
   204  0.17869123E-03     0     3     9     0     0     0
   204  0.44059854E-01     0     5    11     0     0     0
   204  0.36919990E+00     0     6    12     0     0     0
   204  0.21619805E-03     0    13    13     0     0     0
   204  0.89266454E-03     0   198   199     0     0     0
   204  0.45323052E-03     0   200   200     0     0     0
   204  0.15944871E-02     0   450   450     0     0     0
   204  0.95775723E-02     0   450   451     0     0     0
   204  0.60433440E-01     0   450   452     0     0     0
   204  0.11109360E-01     0   450   453     0     0     0
   204  0.11834489E-01     0   451   451     0     0     0
   204  0.14106117E+00     0   451   452     0     0     0
   204  0.67798914E-02     0   451   453     0     0     0
   204  0.26032900E-01     0   454   456     0     0     0
   204  0.15338610E+00     0   454   457     0     0     0
   204  0.15338610E+00     0   456   455     0     0     0
   204  0.38037840E-02     0   203   203     0     0     0
   204  0.17884705E-03     0   425   431     0     0     0
   204  0.17883233E-03     0   427   433     0     0     0
   204  0.63073740E-03     0   426   432     0     0     0
   204  0.63073740E-03     0   428   434     0     0     0
  17
   205  0.15256127E-04     0   123   129     0     0     0
   205  0.43695611E-02     0   125   131     0     0     0
   205  0.17885657E-03     0     3     9     0     0     0
   205  0.44142641E-01     0     5    11     0     0     0
   205  0.39510787E+00     0     6    12     0     0     0
   205  0.23074889E-03     0    13    13     0     0     0
   205  0.24915207E-02     0   450   450     0     0     0
   205  0.19188119E-01     0   450   451     0     0     0
   205  0.14035781E-01     0   450   452     0     0     0
   205  0.48766896E-01     0   450   453     0     0     0
   205  0.36060005E-01     0   451   451     0     0     0
   205  0.95649138E-02     0   451   452     0     0     0
   205  0.10221905E+00     0   451   453     0     0     0
   205  0.78371145E-01     0   454   456     0     0     0
   205  0.12219347E+00     0   454   457     0     0     0
   205  0.12219347E+00     0   456   455     0     0     0
   205  0.87068771E-03     0   203   200     0     0     0
  13
   206  0.16746051E-04     0   124   129     0     0     0
   206  0.47962959E-02     0   126   131     0     0     0
   206  0.18831248E-03     0     4     9     0     0     0
   206  0.38926166E+00     0     6    11     0     0     0
   206  0.29986158E-01     0   454   450     0     0     0
   206  0.51193991E-04     0   454   451     0     0     0
   206  0.17539731E+00     0   454   452     0     0     0
   206  0.16197915E+00     0   454   453     0     0     0
   206  0.57827286E-01     0   455   450     0     0     0
   206  0.17793755E+00     0   455   451     0     0     0
   206  0.96153445E-03     0   203   198     0     0     0
   206  0.79840928E-03     0   431   426     0     0     0
   206  0.79838600E-03     0   433   428     0     0     0
  13
   207  0.16746051E-04     0   130   123     0     0     0
   207  0.47962959E-02     0   132   125     0     0     0
   207  0.18831248E-03     0    10     3     0     0     0
   207  0.38926166E+00     0    12     5     0     0     0
   207  0.29986158E-01     0   456   450     0     0     0
   207  0.51193991E-04     0   456   451     0     0     0
   207  0.17539731E+00     0   456   452     0     0     0
   207  0.16197915E+00     0   456   453     0     0     0
   207  0.57827286E-01     0   457   450     0     0     0
   207  0.17793755E+00     0   457   451     0     0     0
   207  0.96153445E-03     0   203   199     0     0     0
   207  0.79840928E-03     0   425   432     0     0     0
   207  0.79838600E-03     0   427   434     0     0     0
   0
   5
     6  0.33333334E+00   100     2     7     5     0     0
     6  0.33333334E+00   100     4     9     5     0     0
     6  0.11111111E+00   100   122   127     5     0     0
     6  0.11111111E+00   100   124   129     5     0     0
     6  0.11111111E+00   100   126   131     5     0     0
   5
    12  0.33333334E+00   100     8     1    11     0     0
    12  0.33333334E+00   100    10     3    11     0     0
    12  0.11111111E+00   100   128   121    11     0     0
    12  0.11111111E+00   100   130   123    11     0     0
    12  0.11111111E+00   100   132   125    11     0     0
      4.00000000     -0.24957091
     -0.99620754      0.01873938     -0.07889357      0.03155365
     -0.03697126     -0.97401696      0.18593092     -0.12391019
      0.03241186     -0.04537013     -0.70344007     -0.70856428
      0.07178839     -0.22109117     -0.68145245      0.69396526
     -0.98399889      0.17817450     -0.17817450     -0.98399889
     -0.96390969      0.26622936     -0.26622936     -0.96390969
      1.57074499     -1.57079601     -1.57079482
    150.00000000   2400.00000000   2400.00000000
    600.00000000
    T
