  65
    6    171.4000    4.70073e-25
   12    171.4000    4.70073e-25
  203    114.3149    4.03802e-22
  204    646.8941    3.51486e-25
  205    647.0548    3.47334e-25
  206    652.2145    3.77392e-25
  207    652.2145    3.77392e-25
  401   1492.4094    4.84757e-26
  402   1483.6543    4.84856e-26
  403   1492.4076    4.84757e-26
  404   1483.6516    4.84856e-26
  405   1415.8663    8.45785e-26
  406   1326.1198    2.30002e-26
  407   1492.4094    4.84757e-26
  408   1483.6543    4.84856e-26
  409   1492.4076    4.84757e-26
  410   1483.6516    4.84856e-26
  411   1415.8663    8.45785e-26
  412   1326.1198    2.30002e-26
  413   1429.0520    8.71773e-25
  414   1433.2424    2.17284e-25
  415   1429.0464    8.71773e-25
  416   1433.2407    2.17284e-25
  417   1435.2183    2.76620e-26
  418   1439.8122    2.34225e-26
  419   1429.0520    8.71773e-25
  420   1433.2424    2.17284e-25
  421   1429.0464    8.71773e-25
  422   1433.2407    2.17284e-25
  423   1435.2183    2.76620e-26
  424   1439.8122    2.34225e-26
  429    205.9680    1.00000e+30
  430    445.4506    1.28464e-24
  427    224.3035    3.67561e-17
  428    446.6188    2.99117e-24
  425    224.3333    3.64434e-17
  426    446.6225    3.00204e-24
  435    205.9680    1.00000e+30
  436    445.4506    1.28464e-24
  433    224.3035    3.67561e-17
  434    446.6188    2.99117e-24
  431    224.3333    3.64434e-17
  432    446.6225    3.00204e-24
  437    450.1451    1.35217e-24
  438      0.0000    1.00000e+30
  439    453.8932    3.34032e-24
  440      0.0000    1.00000e+30
  441    453.9073    3.35588e-24
  442      0.0000    1.00000e+30
  443    450.1451    1.35217e-24
  444      0.0000    1.00000e+30
  445    453.8932    3.34032e-24
  446      0.0000    1.00000e+30
  447    453.9073    3.35588e-24
  448      0.0000    1.00000e+30
  449   1532.3630    1.60086e-25
  450    284.9536    8.69685e-25
  451    479.0605    1.36242e-24
  452   -516.7343    1.48413e-24
  453    602.5678    2.31253e-25
  454    481.1689    1.68134e-24
  455    603.1646    2.44087e-25
  456    481.1689    1.68134e-24
  457    603.1646    2.44087e-25
  458      0.0000    1.00000e+30
   0
   0
   8
   203  6.50390775e-01     0     5    11     0     0     0
   203  1.56078835e-01     0   131   125     0     0     0
   203  5.68690166e-04     0   129   123     0     0     0
   203  1.24823884e-03     0     3     9     0     0     0
   203  4.91606329e-02     0     4    10     0     0     0
   203  1.37342171e-01     0    13    13     0     0     0
   203  3.97086575e-03     0    59    59     0     0     0
   203  1.23979064e-03     0    59   200     0     0     0
  16
   204  4.11930621e-05     0   429   435     0     0     0
   204  2.91138450e-05     0   427   433     0     0     0
   204  2.90819816e-05     0   425   431     0     0     0
   204  6.98041495e-01     0     5    11     0     0     0
   204  2.59780276e-01     0   131   125     0     0     0
   204  9.45250775e-04     0   129   123     0     0     0
   204  1.47542232e-03     0     3     9     0     0     0
   204  5.23271857e-07     0     4    10     0     0     0
   204  3.62267826e-02     0     6    12     0     0     0
   204  1.71605547e-04     0    13    13     0     0     0
   204  5.62857617e-07     0    59    59     0     0     0
   204  9.59271183e-08     0   200    59     0     0     0
   204  3.13349739e-04     0   198   199     0     0     0
   204  1.52576003e-04     0   200   200     0     0     0
   204  1.25161472e-03     0   203   203     0     0     0
   204  1.54105589e-03     0   450   450     0     0     0
  11
   205  6.90224003e-01     0     5    11     0     0     0
   205  2.56856196e-01     0   131   125     0     0     0
   205  9.34583740e-04     0   129   123     0     0     0
   205  1.45897671e-03     0     3     9     0     0     0
   205  4.71533084e-07     0     4    10     0     0     0
   205  4.22221859e-02     0     6    12     0     0     0
   205  2.88623765e-04     0    13    13     0     0     0
   205  8.79589767e-07     0    59    59     0     0     0
   205  1.48791535e-07     0   200    59     0     0     0
   205  2.89269811e-04     0   200   203     0     0     0
   205  7.72466054e-03     0   450   450     0     0     0
   9
   206  2.06697860e-05     0   435   430     0     0     0
   206  1.12096916e-03     0     4    11     0     0     0
   206  2.81310429e-01     0   131   126     0     0     0
   206  1.02356142e-03     0   129   124     0     0     0
   206  7.17405527e-06     0     2    11     0     0     0
   206  7.59242746e-05     0     2     9     0     0     0
   206  1.56206712e-03     0     4     9     0     0     0
   206  7.14551694e-01     0     6    11     0     0     0
   206  3.27511065e-04     0   198   203     0     0     0
   9
   207  2.06697860e-05     0   429   436     0     0     0
   207  1.12096916e-03     0    10     5     0     0     0
   207  2.81310429e-01     0   125   132     0     0     0
   207  1.02356142e-03     0   123   130     0     0     0
   207  7.17405527e-06     0     8     5     0     0     0
   207  7.59242746e-05     0     8     3     0     0     0
   207  1.56206712e-03     0    10     3     0     0     0
   207  7.14551694e-01     0    12     5     0     0     0
   207  3.27511065e-04     0   199   203     0     0     0
   6
   401  1.80961594e-02     0   450     1     0     0     0
   401  1.03180826e-01     0   451     1     0     0     0
   401  1.09980116e-03     0   452     1     0     0     0
   401  2.21677207e-01     0   453     1     0     0     0
   401  2.01533963e-01     0   456     2     0     0     0
   401  4.54412044e-01     0   457     2     0     0     0
   6
   402  1.07525049e-02     0   450     2     0     0     0
   402  1.23176128e-01     0   451     2     0     0     0
   402  6.20069544e-04     0   452     2     0     0     0
   402  2.07477119e-01     0   453     2     0     0     0
   402  2.63070390e-01     0   454     1     0     0     0
   402  3.94903788e-01     0   455     1     0     0     0
   6
   403  1.80961594e-02     0   450     3     0     0     0
   403  1.03180826e-01     0   451     3     0     0     0
   403  1.09980116e-03     0   452     3     0     0     0
   403  2.21677207e-01     0   453     3     0     0     0
   403  2.01533963e-01     0   456     4     0     0     0
   403  4.54412044e-01     0   457     4     0     0     0
   6
   404  1.07525049e-02     0   450     4     0     0     0
   404  1.23176128e-01     0   451     4     0     0     0
   404  6.20069544e-04     0   452     4     0     0     0
   404  2.07477119e-01     0   453     4     0     0     0
   404  2.63070390e-01     0   454     3     0     0     0
   404  3.94903788e-01     0   455     3     0     0     0
   7
   405  1.08274704e-01     0   450     5     0     0     0
   405  1.69714627e-01     0   451     5     0     0     0
   405  7.78929553e-02     0   452     5     0     0     0
   405  1.53365898e-02     0   453     5     0     0     0
   405  4.84680079e-01     0   456     6     0     0     0
   405  1.43834530e-01     0   457     6     0     0     0
   405  2.66515119e-04     0   406   199     0     0     0
   6
   406  9.46937366e-02     0   450     6     0     0     0
   406  1.78150568e-01     0   451     6     0     0     0
   406  2.41167434e-01     0   452     6     0     0     0
   406  3.23319750e-02     0   453     6     0     0     0
   406  3.81919719e-01     0   454     5     0     0     0
   406  7.17365670e-02     0   455     5     0     0     0
   6
   407  1.80961594e-02     0   450     7     0     0     0
   407  1.03180826e-01     0   451     7     0     0     0
   407  1.09980116e-03     0   452     7     0     0     0
   407  2.21677207e-01     0   453     7     0     0     0
   407  2.01533963e-01     0   454     8     0     0     0
   407  4.54412044e-01     0   455     8     0     0     0
   6
   408  1.07525049e-02     0   450     8     0     0     0
   408  1.23176128e-01     0   451     8     0     0     0
   408  6.20069544e-04     0   452     8     0     0     0
   408  2.07477119e-01     0   453     8     0     0     0
   408  2.63070390e-01     0   456     7     0     0     0
   408  3.94903788e-01     0   457     7     0     0     0
   6
   409  1.80961594e-02     0   450     9     0     0     0
   409  1.03180826e-01     0   451     9     0     0     0
   409  1.09980116e-03     0   452     9     0     0     0
   409  2.21677207e-01     0   453     9     0     0     0
   409  2.01533963e-01     0   454    10     0     0     0
   409  4.54412044e-01     0   455    10     0     0     0
   6
   410  1.07525049e-02     0   450    10     0     0     0
   410  1.23176128e-01     0   451    10     0     0     0
   410  6.20069544e-04     0   452    10     0     0     0
   410  2.07477119e-01     0   453    10     0     0     0
   410  2.63070390e-01     0   456     9     0     0     0
   410  3.94903788e-01     0   457     9     0     0     0
   7
   411  1.08274704e-01     0   450    11     0     0     0
   411  1.69714627e-01     0   451    11     0     0     0
   411  7.78929553e-02     0   452    11     0     0     0
   411  1.53365898e-02     0   453    11     0     0     0
   411  4.84680079e-01     0   454    12     0     0     0
   411  1.43834530e-01     0   455    12     0     0     0
   411  2.66515119e-04     0   412   198     0     0     0
   6
   412  9.46937366e-02     0   450    12     0     0     0
   412  1.78150568e-01     0   451    12     0     0     0
   412  2.41167434e-01     0   452    12     0     0     0
   412  3.23319750e-02     0   453    12     0     0     0
   412  3.81919719e-01     0   456    11     0     0     0
   412  7.17365670e-02     0   457    11     0     0     0
   4
   413  9.79571564e-01     0   450     1     0     0     0
   413  1.63475245e-02     0   451     1     0     0     0
   413  1.12898199e-03     0   452     1     0     0     0
   413  2.95192948e-03     0   453     1     0     0     0
   4
   414  9.79549575e-01     0   450     2     0     0     0
   414  1.63625440e-02     0   451     2     0     0     0
   414  1.13031665e-03     0   452     2     0     0     0
   414  2.95756474e-03     0   453     2     0     0     0
   4
   415  9.79571564e-01     0   450     3     0     0     0
   415  1.63475245e-02     0   451     3     0     0     0
   415  1.12898199e-03     0   452     3     0     0     0
   415  2.95192948e-03     0   453     3     0     0     0
   4
   416  9.79549575e-01     0   450     4     0     0     0
   416  1.63625440e-02     0   451     4     0     0     0
   416  1.13031665e-03     0   452     4     0     0     0
   416  2.95756474e-03     0   453     4     0     0     0
   7
   417  7.34870273e-03     0   450     5     0     0     0
   417  4.30203708e-02     0   451     5     0     0     0
   417  3.41533148e-02     0   452     5     0     0     0
   417  1.24413211e-01     0   453     5     0     0     0
   417  3.46990717e-01     0   456     6     0     0     0
   417  4.41661624e-01     0   457     6     0     0     0
   417  2.41206023e-03     0   406   199     0     0     0
   7
   418  7.45110581e-03     0   450     6     0     0     0
   418  1.69352653e-01     0   451     6     0     0     0
   418  2.40176244e-01     0   452     6     0     0     0
   418  2.36596513e-01     0   453     6     0     0     0
   418  6.55977817e-02     0   454     5     0     0     0
   418  2.79680374e-01     0   455     5     0     0     0
   418  1.14532849e-03     0   406   200     0     0     0
   4
   419  9.79571564e-01     0   450     7     0     0     0
   419  1.63475245e-02     0   451     7     0     0     0
   419  1.12898199e-03     0   452     7     0     0     0
   419  2.95192948e-03     0   453     7     0     0     0
   4
   420  9.79549575e-01     0   450     8     0     0     0
   420  1.63625440e-02     0   451     8     0     0     0
   420  1.13031665e-03     0   452     8     0     0     0
   420  2.95756474e-03     0   453     8     0     0     0
   4
   421  9.79571564e-01     0   450     9     0     0     0
   421  1.63475245e-02     0   451     9     0     0     0
   421  1.12898199e-03     0   452     9     0     0     0
   421  2.95192948e-03     0   453     9     0     0     0
   4
   422  9.79549575e-01     0   450    10     0     0     0
   422  1.63625440e-02     0   451    10     0     0     0
   422  1.13031665e-03     0   452    10     0     0     0
   422  2.95756474e-03     0   453    10     0     0     0
   7
   423  7.34870273e-03     0   450    11     0     0     0
   423  4.30203708e-02     0   451    11     0     0     0
   423  3.41533148e-02     0   452    11     0     0     0
   423  1.24413211e-01     0   453    11     0     0     0
   423  3.46990717e-01     0   454    12     0     0     0
   423  4.41661624e-01     0   455    12     0     0     0
   423  2.41206023e-03     0   412   198     0     0     0
   7
   424  7.45110581e-03     0   450    12     0     0     0
   424  1.69352653e-01     0   451    12     0     0     0
   424  2.40176244e-01     0   452    12     0     0     0
   424  2.36596513e-01     0   453    12     0     0     0
   424  6.55977817e-02     0   456    11     0     0     0
   424  2.79680374e-01     0   457    11     0     0     0
   424  1.14532849e-03     0   412   200     0     0     0
   0
   2
   430  4.23716672e-01     0   450   126     0     0     0
   430  5.76283328e-01     0   429   198     0     0     0
   3
   427  3.62120663e-01     0   429   123   131     0     0
   427  1.34902924e-06     0   429   124   132     0     0
   427  6.37877988e-01     0   435   123   125     0     0
   2
   428  9.96347316e-01     0   450   124     0     0     0
   428  3.65268387e-03     0   427   198     0     0     0
   3
   425  3.62154620e-01     0   429   121   131     0     0
   425  3.15366772e-11     0   429   122   132     0     0
   425  6.37845380e-01     0   435   121   125     0     0
   2
   426  9.99999914e-01     0   450   122     0     0     0
   426  8.57192311e-08     0   425   198     0     0     0
   0
   2
   436  4.23716672e-01     0   450   132     0     0     0
   436  5.76283328e-01     0   435   199     0     0     0
   3
   433  3.62120663e-01     0   435   129   125     0     0
   433  1.34902924e-06     0   435   130   126     0     0
   433  6.37877988e-01     0   429   129   131     0     0
   2
   434  9.96347316e-01     0   450   130     0     0     0
   434  3.65268387e-03     0   433   199     0     0     0
   3
   431  3.62154620e-01     0   435   127   125     0     0
   431  3.15366772e-11     0   435   128   126     0     0
   431  6.37845380e-01     0   429   127   131     0     0
   2
   432  9.99999914e-01     0   450   128     0     0     0
   432  8.57192311e-08     0   431   199     0     0     0
   3
   437  4.01461732e-01     0   450   125     0     0     0
   437  2.92571515e-01     0   429   203     0     0     0
   437  3.05966754e-01     0   429   200     0     0     0
   0
   3
   439  9.95335722e-01     0   450   123     0     0     0
   439  2.51277781e-03     0   427   203     0     0     0
   439  2.15149984e-03     0   427   200     0     0     0
   0
   3
   441  9.99999890e-01     0   450   121     0     0     0
   441  5.90513633e-08     0   425   203     0     0     0
   441  5.05510373e-08     0   425   200     0     0     0
   0
   3
   443  4.01461732e-01     0   450   131     0     0     0
   443  2.92571515e-01     0   435   203     0     0     0
   443  3.05966754e-01     0   435   200     0     0     0
   0
   3
   445  9.95335722e-01     0   450   129     0     0     0
   445  2.51277781e-03     0   433   203     0     0     0
   445  2.15149984e-03     0   433   200     0     0     0
   0
   3
   447  9.99999890e-01     0   450   127     0     0     0
   447  5.90513633e-08     0   431   203     0     0     0
   447  5.05510373e-08     0   431   200     0     0     0
   0
  22
   449  9.90264041e-03     0   401     7     0     0     0
   449  9.90264041e-03     0   407     1     0     0     0
   449  6.34676401e-02     0   413     7     0     0     0
   449  6.34676401e-02     0   419     1     0     0     0
   449  1.46317135e-02     0   402     8     0     0     0
   449  1.46317135e-02     0   408     2     0     0     0
   449  5.85827237e-02     0   414     8     0     0     0
   449  5.85827237e-02     0   420     2     0     0     0
   449  9.90264041e-03     0   403     9     0     0     0
   449  9.90264041e-03     0   409     3     0     0     0
   449  6.34676401e-02     0   415     9     0     0     0
   449  6.34676401e-02     0   421     3     0     0     0
   449  1.46317135e-02     0   404    10     0     0     0
   449  1.46317135e-02     0   410     4     0     0     0
   449  5.85827237e-02     0   416    10     0     0     0
   449  5.85827237e-02     0   422     4     0     0     0
   449  7.69569074e-02     0   405    11     0     0     0
   449  7.69569074e-02     0   411     5     0     0     0
   449  5.68372460e-02     0   417    11     0     0     0
   449  5.68372460e-02     0   423     5     0     0     0
   449  7.30364112e-02     0   406    12     0     0     0
   449  7.30364112e-02     0   412     6     0     0     0
   6
   450  2.20247750e-01     0   429   131     0     0     0
   450  2.20247750e-01     0   435   125     0     0     0
   450  1.39936169e-01     0   427   129     0     0     0
   450  1.39936169e-01     0   433   123     0     0     0
   450  1.39816081e-01     0   425   127     0     0     0
   450  1.39816081e-01     0   431   121     0     0     0
  20
   451  1.75400592e-01     0   429   131     0     0     0
   451  1.75400592e-01     0   435   125     0     0     0
   451  3.02968651e-02     0   427   129     0     0     0
   451  3.02968651e-02     0   433   123     0     0     0
   451  2.98762610e-02     0   425   127     0     0     0
   451  2.98762610e-02     0   431   121     0     0     0
   451  1.30099994e-02     0   437   131     0     0     0
   451  1.30099994e-02     0   443   125     0     0     0
   451  8.70825812e-03     0   439   129     0     0     0
   451  8.70825812e-03     0   445   123     0     0     0
   451  8.69453774e-03     0   441   127     0     0     0
   451  8.69453774e-03     0   447   121     0     0     0
   451  8.74018540e-03     0   430   132     0     0     0
   451  8.74018540e-03     0   436   126     0     0     0
   451  8.16375179e-03     0   428   130     0     0     0
   451  8.16375179e-03     0   434   124     0     0     0
   451  8.16194956e-03     0   426   128     0     0     0
   451  8.16194956e-03     0   432   122     0     0     0
   451  3.04057483e-02     0   450   200     0     0     0
   451  3.87489452e-01     0   450   203     0     0     0
  20
   452  1.63566507e-01     0   429   131     0     0     0
   452  1.63566507e-01     0   435   125     0     0     0
   452  3.19667046e-03     0   427   129     0     0     0
   452  3.19667046e-03     0   433   123     0     0     0
   452  2.72219139e-03     0   425   127     0     0     0
   452  2.72219139e-03     0   431   121     0     0     0
   452  1.48851869e-02     0   437   131     0     0     0
   452  1.48851869e-02     0   443   125     0     0     0
   452  1.43607206e-04     0   439   129     0     0     0
   452  1.43607206e-04     0   445   123     0     0     0
   452  1.01772210e-04     0   441   127     0     0     0
   452  1.01772210e-04     0   447   121     0     0     0
   452  7.76237924e-04     0   430   132     0     0     0
   452  7.76237924e-04     0   436   126     0     0     0
   452  7.52828691e-04     0   428   130     0     0     0
   452  7.52828691e-04     0   434   124     0     0     0
   452  7.52754799e-04     0   426   128     0     0     0
   452  7.52754799e-04     0   432   122     0     0     0
   452  5.91933962e-01     0   450   200     0     0     0
   452  3.42705244e-02     0   450   203     0     0     0
  24
   453  2.67961204e-03     0   429   131     0     0     0
   453  2.67961204e-03     0   435   125     0     0     0
   453  1.61747650e-03     0   427   129     0     0     0
   453  1.61747650e-03     0   433   123     0     0     0
   453  1.61480007e-03     0   425   127     0     0     0
   453  1.61480007e-03     0   431   121     0     0     0
   453  5.69744608e-02     0   437   131     0     0     0
   453  5.69744608e-02     0   443   125     0     0     0
   453  5.07211469e-02     0   439   129     0     0     0
   453  5.07211469e-02     0   445   123     0     0     0
   453  5.07005742e-02     0   441   127     0     0     0
   453  5.07005742e-02     0   447   121     0     0     0
   453  6.61662711e-02     0   430   132     0     0     0
   453  6.61662711e-02     0   436   126     0     0     0
   453  6.53313975e-02     0   428   130     0     0     0
   453  6.53313975e-02     0   434   124     0     0     0
   453  6.53287503e-02     0   426   128     0     0     0
   453  6.53287503e-02     0   432   122     0     0     0
   453  2.99639399e-03     0   450   200     0     0     0
   453  6.14088548e-04     0   451   200     0     0     0
   453  1.17367114e-01     0   454   199     0     0     0
   453  1.17367114e-01     0   456   198     0     0     0
   453  2.29725824e-02     0   450   203     0     0     0
   453  1.64137283e-02     0   451   203     0     0     0
  10
   454  4.72648898e-02     0   430   131     0     0     0
   454  3.57391369e-02     0   428   129     0     0     0
   454  3.57039661e-02     0   426   127     0     0     0
   454  3.64226614e-01     0   435   126     0     0     0
   454  1.07476908e-03     0   433   124     0     0     0
   454  2.51356269e-08     0   431   122     0     0     0
   454  1.92798953e-02     0   443   126     0     0     0
   454  1.71866174e-02     0   445   124     0     0     0
   454  1.71766026e-02     0   447   122     0     0     0
   454  4.62347484e-01     0   450   198     0     0     0
  14
   455  1.24254044e-01     0   430   131     0     0     0
   455  1.18034529e-01     0   428   129     0     0     0
   455  1.18015103e-01     0   426   127     0     0     0
   455  3.50499062e-03     0   435   126     0     0     0
   455  1.05886982e-05     0   433   124     0     0     0
   455  2.47684133e-10     0   431   122     0     0     0
   455  1.33698833e-01     0   443   126     0     0     0
   455  1.24081628e-01     0   445   124     0     0     0
   455  1.24048691e-01     0   447   122     0     0     0
   455  8.25039927e-02     0   454   200     0     0     0
   455  2.40099911e-02     0   450   198     0     0     0
   455  1.26373638e-01     0   451   198     0     0     0
   455  8.69756086e-03     0   452   198     0     0     0
   455  1.27664093e-02     0   454   203     0     0     0
  10
   456  4.72648898e-02     0   436   125     0     0     0
   456  3.57391369e-02     0   434   123     0     0     0
   456  3.57039661e-02     0   432   121     0     0     0
   456  3.64226614e-01     0   429   132     0     0     0
   456  1.07476908e-03     0   427   130     0     0     0
   456  2.51356269e-08     0   425   128     0     0     0
   456  1.92798953e-02     0   437   132     0     0     0
   456  1.71866174e-02     0   439   130     0     0     0
   456  1.71766026e-02     0   441   128     0     0     0
   456  4.62347484e-01     0   450   199     0     0     0
  14
   457  1.24254044e-01     0   436   125     0     0     0
   457  1.18034529e-01     0   434   123     0     0     0
   457  1.18015103e-01     0   432   121     0     0     0
   457  3.50499062e-03     0   429   132     0     0     0
   457  1.05886982e-05     0   427   130     0     0     0
   457  2.47684133e-10     0   425   128     0     0     0
   457  1.33698833e-01     0   437   132     0     0     0
   457  1.24081628e-01     0   439   130     0     0     0
   457  1.24048691e-01     0   441   128     0     0     0
   457  8.25039927e-02     0   456   200     0     0     0
   457  2.40099911e-02     0   450   199     0     0     0
   457  1.26373638e-01     0   451   199     0     0     0
   457  8.69756086e-03     0   452   199     0     0     0
   457  1.27664093e-02     0   456   203     0     0     0
   0
     19.32806289     -0.05438404
      0.98790963     -0.02388727      0.13185819     -0.07795754
     -0.13704373     -0.56183935      0.59496812     -0.55818321
     -0.03671351      0.04937175      0.70293991      0.70858312
     -0.06249558      0.82542618      0.36674492     -0.42457519
     -0.60790101      0.79401282     -0.79401282     -0.60790101
     -0.53014867      0.84790470     -0.84790470     -0.53014867
      1.33119750      1.13657052      1.45539891
   -449.79079048   -497.19924110    -50.80940150
    512.85735435
    T
