#
#                              ======================
#                              | THE SUSYHIT OUTPUT |
#                              ======================
#
#
#              ------------------------------------------------------
#              |     This is the output of the SUSY-HIT package     |
#              |  created by A.Djouadi, M.Muehlleitner and M.Spira. |
#              |  In case of problems with SUSY-HIT email to        |
#              |           margarete.muehlleitner@cern.ch           |
#              |           michael.spira@psi.ch                     |
#              |           abdelhak.djouadi@cern.ch                 |
#              ------------------------------------------------------
#
#              ------------------------------------------------------
#              |  SUSY Les Houches Accord - MSSM Spectrum + Decays  |
#              |              based on the decay programs           |
#              |                                                    |
#              |                     SDECAY 1.3b                    |
#              |                                                    |
#              |  Authors: M.Muhlleitner, A.Djouadi and Y.Mambrini  |
#              |  Ref.:    Comput.Phys.Commun.168(2005)46           |
#              |           [hep-ph/0311167]                         |
#              |                                                    |
#              |                     HDECAY 3.4                     |
#              |                                                    |
#              |  By: A.Djouadi,J.Kalinowski,M.Muhlleitner,M.Spira  |
#              |  Ref.:    Comput.Phys.Commun.108(1998)56           |
#              |           [hep-ph/9704448]                         |
#              |                                                    |
#              |                                                    |
#              |  If not stated otherwise all DRbar couplings and   |
#              |  soft SUSY breaking masses are given at the scale  |
#              |  Q=  0.91187600E+02
#              |                                                    |
#              ------------------------------------------------------
#
#
BLOCK DCINFO  # Decay Program information
     1   SDECAY/HDECAY # decay calculator
     2   1.3b  /3.4    # version number
#
BLOCK SPINFO  # Spectrum calculator information
     1   SuSpect     # RGE +Spectrum calculator            
     2   2.41         # version number                     
#
BLOCK MODSEL  # Model selection
     1     0   # #general MSSM low scale                           
#
BLOCK SMINPUTS  # Standard Model inputs
         1     1.27934000E+02   # alpha_em^-1(M_Z)^MSbar
         2     1.16639000E-05   # G_F [GeV^-2]
         3     1.17200000E-01   # alpha_S(M_Z)^MSbar
         4     9.11870000E+01   # M_Z pole mass
         5     4.25000000E+00   # mb(mb)^MSbar
         6     1.75000000E+02   # mt pole mass
         7     1.77700000E+00   # mtau pole mass
#
BLOCK MINPAR  # Input parameters - minimal models
#
BLOCK EXTPAR  # Input parameters - non-minimal models
         0     9.11876000E+01   # EWSB                
         1     2.25000000E+02   # M_1                 
         2     2.50000000E+03   # M_2                 
         3     2.50000000E+03   # M_3                 
        11     0.00000000E+00   # A_t                 
        12     0.00000000E+00   # A_b                 
        13     0.00000000E+00   # A_tau               
        14     0.00000000E+00   # A_u                 
        15     0.00000000E+00   # A_d                 
        16     0.00000000E+00   # A_e                 
        23    -2.00000000E+02   # mu(EWSB)            
        25     1.50000000E+00   # tanbeta(in)         
        26     2.00000000E+03   # MA_pole             
        31     2.50000000E+03   # M_eL                
        32     2.50000000E+03   # M_muL               
        33     2.50000000E+03   # M_tauL              
        34     2.50000000E+03   # M_eR                
        35     2.50000000E+03   # M_muR               
        36     2.50000000E+03   # M_tauR              
        41     9.00000000E+02   # M_q1L               
        42     9.00000000E+02   # M_q2L               
        43     9.00000000E+02   # M_q3L               
        44     2.50000000E+03   # M_uR                
        45     2.50000000E+03   # M_cR                
        46     2.50000000E+03   # M_tR                
        47     9.00000000E+02   # M_dR                
        48     9.00000000E+02   # M_sR                
        49     9.25000000E+02   # M_bR                
#
BLOCK MASS  # Mass Spectrum
# PDG code           mass       particle
        24     8.05450894E+01   # W+
        25     1.15000000E+02   # h
        35     2.00390962E+03   # H
        36     2.00000000E+03   # A
        37     2.00204746E+03   # H+
         5     4.87877839E+00   # b-quark pole mass calculated from mb(mb)_Msbar
   1000001     9.00751822E+02   # ~d_L
   2000001     9.00141232E+02   # ~d_R
   1000002     8.99388899E+02   # ~u_L
   2000002     2.49989830E+03   # ~u_R
   1000003     9.00751822E+02   # ~s_L
   2000003     9.00141232E+02   # ~s_R
   1000004     8.99388899E+02   # ~c_L
   2000004     2.49989830E+03   # ~c_R
   1000005     9.00747560E+02   # ~b_1
   2000005     9.25149697E+02   # ~b_2
   1000006     9.13110252E+02   # ~t_1
   2000006     2.50490010E+03   # ~t_2
   1000011     2.50016907E+03   # ~e_L
   2000011     2.50015254E+03   # ~e_R
   1000012     2.49967836E+03   # ~nu_eL
   1000013     2.50016907E+03   # ~mu_L
   2000013     2.50015254E+03   # ~mu_R
   1000014     2.49967836E+03   # ~nu_muL
   1000015     2.50005455E+03   # ~tau_1
   2000015     2.50026831E+03   # ~tau_2
   1000016     2.49967836E+03   # ~nu_tauL
   1000021     2.50000000E+03   # ~g
   1000022     1.97557409E+02   # ~chi_10
   1000023    -2.06687545E+02   # ~chi_20
   1000025     2.31753081E+02   # ~chi_30
   1000035     2.50237706E+03   # ~chi_40
   1000024     2.02163146E+02   # ~chi_1+
   1000037     2.50237648E+03   # ~chi_2+
   1000039     5.44000000E-09   # ~gravitino
#
BLOCK NMIX  # Neutralino Mixing Matrix
  1  1     2.59970201E-01   # N_11
  1  2    -5.55736339E-03   # N_12
  1  3    -7.03426009E-01   # N_13
  1  4    -6.61495623E-01   # N_14
  2  1     1.00663175E-01   # N_21
  2  2    -2.87945925E-02   # N_22
  2  3     7.00903844E-01   # N_23
  2  4    -7.05529303E-01   # N_24
  3  1     9.60355185E-01   # N_31
  3  2     5.12805209E-03   # N_32
  3  3     1.16960597E-01   # N_33
  3  4     2.53005613E-01   # N_34
  4  1     5.81705274E-04   # N_41
  4  2    -9.99556747E-01   # N_42
  4  3    -1.56802169E-02   # N_43
  4  4     2.53002407E-02   # N_44
#
BLOCK UMIX  # Chargino Mixing Matrix U
  1  1    -2.21624276E-02   # U_11
  1  2     9.99754383E-01   # U_12
  2  1     9.99754383E-01   # U_21
  2  2     2.21624276E-02   # U_22
#
BLOCK VMIX  # Chargino Mixing Matrix V
  1  1     3.57762122E-02   # V_11
  1  2    -9.99359826E-01   # V_12
  2  1     9.99359826E-01   # V_21
  2  2     3.57762122E-02   # V_22
#
BLOCK STOPMIX  # Stop Mixing Matrix
  1  1     9.99992507E-01   # cos(theta_t)
  1  2    -3.87116828E-03   # sin(theta_t)
  2  1     3.87116828E-03   # -sin(theta_t)
  2  2     9.99992507E-01   # cos(theta_t)
#
BLOCK SBOTMIX  # Sbottom Mixing Matrix
  1  1     9.99829395E-01   # cos(theta_b)
  1  2    -1.84710826E-02   # sin(theta_b)
  2  1     1.84710826E-02   # -sin(theta_b)
  2  2     9.99829395E-01   # cos(theta_b)
#
BLOCK STAUMIX  # Stau Mixing Matrix
  1  1    -6.79215519E-01   # cos(theta_tau)
  1  2     7.33938879E-01   # sin(theta_tau)
  2  1    -7.33938879E-01   # -sin(theta_tau)
  2  2    -6.79215519E-01   # cos(theta_tau)
#
BLOCK ALPHA  # Higgs mixing
          -5.89792604E-01   # Mixing angle in the neutral Higgs boson sector
#
BLOCK HMIX Q=  9.11876000E+01  # DRbar Higgs Parameters
         1    -2.00000000E+02   # mu(Q)               
         2     1.49999979E+00   # tanbeta(Q)          
         3     2.51721341E+02   # vev(Q)              
         4     3.98504545E+06   # MA^2(Q)             
#
BLOCK GAUGE Q=  9.11876000E+01  # The gauge couplings
     1     3.53815704E-01   # gprime(Q) DRbar
     2     6.34579475E-01   # g(Q) DRbar
     3     1.10047854E+00   # g3(Q) DRbar
#
BLOCK AU Q=  9.11876000E+01  # The trilinear couplings
  1  1     0.00000000E+00   # A_u(Q) DRbar
  2  2     0.00000000E+00   # A_c(Q) DRbar
  3  3     0.00000000E+00   # A_t(Q) DRbar
#
BLOCK AD Q=  9.11876000E+01  # The trilinear couplings
  1  1     0.00000000E+00   # A_d(Q) DRbar
  2  2     0.00000000E+00   # A_s(Q) DRbar
  3  3     0.00000000E+00   # A_b(Q) DRbar
#
BLOCK AE Q=  9.11876000E+01  # The trilinear couplings
  1  1     0.00000000E+00   # A_e(Q) DRbar
  2  2     0.00000000E+00   # A_mu(Q) DRbar
  3  3     0.00000000E+00   # A_tau(Q) DRbar
#
BLOCK Yu Q=  9.11876000E+01  # The Yukawa couplings
  1  1     0.00000000E+00   # y_u(Q) DRbar
  2  2     0.00000000E+00   # y_c(Q) DRbar
  3  3     1.06658115E+00   # y_t(Q) DRbar
#
BLOCK Yd Q=  9.11876000E+01  # The Yukawa couplings
  1  1     0.00000000E+00   # y_d(Q) DRbar
  2  2     0.00000000E+00   # y_s(Q) DRbar
  3  3     2.77804238E-02   # y_b(Q) DRbar
#
BLOCK Ye Q=  9.11876000E+01  # The Yukawa couplings
  1  1     0.00000000E+00   # y_e(Q) DRbar
  2  2     0.00000000E+00   # y_mu(Q) DRbar
  3  3     1.79894452E-02   # y_tau(Q) DRbar
#
BLOCK MSOFT Q=  9.11876000E+01  # The soft SUSY breaking masses at the scale Q
         1     2.25000000E+02   # M_1                 
         2     2.50000000E+03   # M_2                 
         3     2.50000000E+03   # M_3                 
        14     0.00000000E+00   # A_u                 
        15     0.00000000E+00   # A_d                 
        16     0.00000000E+00   # A_e                 
        21     2.81327471E+06   # M^2_Hd              
        22     6.66496864E+05   # M^2_Hu              
        31     2.50000000E+03   # M_eL                
        32     2.50000000E+03   # M_muL               
        33     2.50000000E+03   # M_tauL              
        34     2.50000000E+03   # M_eR                
        35     2.50000000E+03   # M_muR               
        36     2.50000000E+03   # M_tauR              
        41     9.00000000E+02   # M_q1L               
        42     9.00000000E+02   # M_q2L               
        43     9.00000000E+02   # M_q3L               
        44     2.50000000E+03   # M_uR                
        45     2.50000000E+03   # M_cR                
        46     2.50000000E+03   # M_tR                
        47     9.00000000E+02   # M_dR                
        48     9.00000000E+02   # M_sR                
        49     9.25000000E+02   # M_bR                
#
#
#
#                             =================
#                             |The decay table|
#                             =================
#
# - The QCD corrections to the decays gluino -> squark  + quark
#                                     squark -> gaugino + quark_prime
#                                     squark -> squark_prime + Higgs
#                                     squark -> gluino  + quark
#   are included.
#
# - The multi-body decays for the inos, stops and sbottoms are included.
#
# - The loop induced decays for the gluino, neutralinos and stops
#   are included.
#
# - The SUSY decays of the top quark are included.
#
# - Possible decays of the NLSP in GMSB models are included.
#
#
#         PDG            Width
DECAY         6     1.46325761E+00   # top decays
#          BR         NDA      ID1       ID2
     1.00000000E+00    2           5        24   # BR(t ->  b    W+)
#
#         PDG            Width
DECAY   1000021     2.60652693E+02   # gluino decays
#          BR         NDA      ID1       ID2
     5.57120103E-02    2     1000001        -1   # BR(~g -> ~d_L  db)
     5.57120103E-02    2    -1000001         1   # BR(~g -> ~d_L* d )
     5.57345408E-02    2     2000001        -1   # BR(~g -> ~d_R  db)
     5.57345408E-02    2    -2000001         1   # BR(~g -> ~d_R* d )
     5.57622867E-02    2     1000002        -2   # BR(~g -> ~u_L  ub)
     5.57622867E-02    2    -1000002         2   # BR(~g -> ~u_L* u )
     4.87002812E-10    2     2000002        -2   # BR(~g -> ~u_R  ub)
     4.87002812E-10    2    -2000002         2   # BR(~g -> ~u_R* u )
     5.57120103E-02    2     1000003        -3   # BR(~g -> ~s_L  sb)
     5.57120103E-02    2    -1000003         3   # BR(~g -> ~s_L* s )
     5.57345408E-02    2     2000003        -3   # BR(~g -> ~s_R  sb)
     5.57345408E-02    2    -2000003         3   # BR(~g -> ~s_R* s )
     5.57622867E-02    2     1000004        -4   # BR(~g -> ~c_L  cb)
     5.57622867E-02    2    -1000004         4   # BR(~g -> ~c_L* c )
     4.87002812E-10    2     2000004        -4   # BR(~g -> ~c_R  cb)
     4.87002812E-10    2    -2000004         4   # BR(~g -> ~c_R* c )
     5.55342597E-02    2     1000005        -5   # BR(~g -> ~b_1  bb)
     5.55342597E-02    2    -1000005         5   # BR(~g -> ~b_1* b )
     5.45416090E-02    2     2000005        -5   # BR(~g -> ~b_2  bb)
     5.45416090E-02    2    -2000005         5   # BR(~g -> ~b_2* b )
     5.55064475E-02    2     1000006        -6   # BR(~g -> ~t_1  tb)
     5.55064475E-02    2    -1000006         6   # BR(~g -> ~t_1* t )
     1.45755996E-08    2     1000039        21   # BR(~g -> ~G g)
#
#         PDG            Width
DECAY   1000006     1.35222190E+01   # stop1 decays
#          BR         NDA      ID1       ID2
     4.40567873E-01    2     1000022         6   # BR(~t_1 -> ~chi_10 t )
     4.90868241E-01    2     1000023         6   # BR(~t_1 -> ~chi_20 t )
     6.80688454E-02    2     1000025         6   # BR(~t_1 -> ~chi_30 t )
     4.95040233E-04    2     1000024         5   # BR(~t_1 -> ~chi_1+ b )
#
#         PDG            Width
DECAY   2000006     8.74215793E+01   # stop2 decays
#          BR         NDA      ID1       ID2
     2.07330562E-01    2     1000022         6   # BR(~t_2 -> ~chi_10 t )
     2.32165725E-01    2     1000023         6   # BR(~t_2 -> ~chi_20 t )
     8.37105929E-02    2     1000025         6   # BR(~t_2 -> ~chi_30 t )
     4.66338052E-01    2     1000024         5   # BR(~t_2 -> ~chi_1+ b )
     4.86377652E-03    2     1000006        25   # BR(~t_2 -> ~t_1    h )
     1.06963075E-03    2     1000006        23   # BR(~t_2 -> ~t_1    Z )
     4.51999910E-03    2     1000005        24   # BR(~t_2 -> ~b_1    W+)
     1.66253194E-06    2     2000005        24   # BR(~t_2 -> ~b_2    W+)
#
#         PDG            Width
DECAY   1000005     1.33405066E+01   # sbottom1 decays
#          BR         NDA      ID1       ID2
     1.35986011E-03    2     1000022         5   # BR(~b_1 -> ~chi_10 b )
     7.87957569E-04    2     1000023         5   # BR(~b_1 -> ~chi_20 b )
     7.28152515E-03    2     1000025         5   # BR(~b_1 -> ~chi_30 b )
     9.90570657E-01    2    -1000024         6   # BR(~b_1 -> ~chi_1- t )
#
#         PDG            Width
DECAY   2000005     5.36741873E-01   # sbottom2 decays
#          BR         NDA      ID1       ID2
     6.37888859E-02    2     1000022         5   # BR(~b_2 -> ~chi_10 b )
     2.18347050E-02    2     1000023         5   # BR(~b_2 -> ~chi_20 b )
     8.02006725E-01    2     1000025         5   # BR(~b_2 -> ~chi_30 b )
     1.12369684E-01    2    -1000024         6   # BR(~b_2 -> ~chi_1- t )
#
#         PDG            Width
DECAY   1000002     1.26878759E-01   # sup_L decays
#          BR         NDA      ID1       ID2
     4.93581577E-02    2     1000022         2   # BR(~u_L -> ~chi_10 u)
     2.72270872E-03    2     1000023         2   # BR(~u_L -> ~chi_20 u)
     8.79107747E-01    2     1000025         2   # BR(~u_L -> ~chi_30 u)
     6.88113864E-02    2     1000024         1   # BR(~u_L -> ~chi_1+ d)
#
#         PDG            Width
DECAY   2000002     5.21235979E+00   # sup_R decays
#          BR         NDA      ID1       ID2
     6.78107466E-02    2     1000022         2   # BR(~u_R -> ~chi_10 u)
     1.01578889E-02    2     1000023         2   # BR(~u_R -> ~chi_20 u)
     9.22031364E-01    2     1000025         2   # BR(~u_R -> ~chi_30 u)
#
#         PDG            Width
DECAY   1000001     1.20599527E-01   # sdown_L decays
#          BR         NDA      ID1       ID2
     8.25738440E-02    2     1000022         1   # BR(~d_L -> ~chi_10 d)
     6.36505822E-02    2     1000023         1   # BR(~d_L -> ~chi_20 d)
     8.25946635E-01    2     1000025         1   # BR(~d_L -> ~chi_30 d)
     2.78289389E-02    2    -1000024         2   # BR(~d_L -> ~chi_1- u)
#
#         PDG            Width
DECAY   2000001     4.58785209E-01   # sdown_R decays
#          BR         NDA      ID1       ID2
     6.97816483E-02    2     1000022         1   # BR(~d_R -> ~chi_10 d)
     1.03728296E-02    2     1000023         1   # BR(~d_R -> ~chi_20 d)
     9.19845522E-01    2     1000025         1   # BR(~d_R -> ~chi_30 d)
#
#         PDG            Width
DECAY   1000004     1.26878759E-01   # scharm_L decays
#          BR         NDA      ID1       ID2
     4.93581577E-02    2     1000022         4   # BR(~c_L -> ~chi_10 c)
     2.72270872E-03    2     1000023         4   # BR(~c_L -> ~chi_20 c)
     8.79107747E-01    2     1000025         4   # BR(~c_L -> ~chi_30 c)
     6.88113864E-02    2     1000024         3   # BR(~c_L -> ~chi_1+ s)
#
#         PDG            Width
DECAY   2000004     5.21235979E+00   # scharm_R decays
#          BR         NDA      ID1       ID2
     6.78107466E-02    2     1000022         4   # BR(~c_R -> ~chi_10 c)
     1.01578889E-02    2     1000023         4   # BR(~c_R -> ~chi_20 c)
     9.22031364E-01    2     1000025         4   # BR(~c_R -> ~chi_30 c)
#
#         PDG            Width
DECAY   1000003     1.20599527E-01   # sstrange_L decays
#          BR         NDA      ID1       ID2
     8.25738440E-02    2     1000022         3   # BR(~s_L -> ~chi_10 s)
     6.36505822E-02    2     1000023         3   # BR(~s_L -> ~chi_20 s)
     8.25946635E-01    2     1000025         3   # BR(~s_L -> ~chi_30 s)
     2.78289389E-02    2    -1000024         4   # BR(~s_L -> ~chi_1- c)
#
#         PDG            Width
DECAY   2000003     4.58785209E-01   # sstrange_R decays
#          BR         NDA      ID1       ID2
     6.97816483E-02    2     1000022         3   # BR(~s_R -> ~chi_10 s)
     1.03728296E-02    2     1000023         3   # BR(~s_R -> ~chi_20 s)
     9.19845522E-01    2     1000025         3   # BR(~s_R -> ~chi_30 s)
#
#         PDG            Width
DECAY   1000011     3.08579685E+00   # selectron_L decays
#          BR         NDA      ID1       ID2
     6.22739200E-02    2     1000022        11   # BR(~e_L -> ~chi_10 e-)
     2.39128822E-03    2     1000023        11   # BR(~e_L -> ~chi_20 e-)
     9.32188195E-01    2     1000025        11   # BR(~e_L -> ~chi_30 e-)
     3.14659716E-03    2    -1000024        12   # BR(~e_L -> ~chi_1- nu_e)
#
#         PDG            Width
DECAY   2000011     1.22444691E+01   # selectron_R decays
#          BR         NDA      ID1       ID2
     6.78809138E-02    2     1000022        11   # BR(~e_R -> ~chi_10 e-)
     1.01654252E-02    2     1000023        11   # BR(~e_R -> ~chi_20 e-)
     9.21953661E-01    2     1000025        11   # BR(~e_R -> ~chi_30 e-)
#
#         PDG            Width
DECAY   1000013     3.08579685E+00   # smuon_L decays
#          BR         NDA      ID1       ID2
     6.22739200E-02    2     1000022        13   # BR(~mu_L -> ~chi_10 mu-)
     2.39128822E-03    2     1000023        13   # BR(~mu_L -> ~chi_20 mu-)
     9.32188195E-01    2     1000025        13   # BR(~mu_L -> ~chi_30 mu-)
     3.14659716E-03    2    -1000024        14   # BR(~mu_L -> ~chi_1- nu_mu)
#
#         PDG            Width
DECAY   2000013     1.22444691E+01   # smuon_R decays
#          BR         NDA      ID1       ID2
     6.78809138E-02    2     1000022        13   # BR(~mu_R -> ~chi_10 mu-)
     1.01654252E-02    2     1000023        13   # BR(~mu_R -> ~chi_20 mu-)
     9.21953661E-01    2     1000025        13   # BR(~mu_R -> ~chi_30 mu-)
#
#         PDG            Width
DECAY   1000015     8.02413518E+00   # stau_1 decays
#          BR         NDA      ID1       ID2
     7.30330854E-02    2     1000022        15   # BR(~tau_1 -> ~chi_10  tau-)
     6.82367063E-03    2     1000023        15   # BR(~tau_1 -> ~chi_20  tau-)
     9.20061378E-01    2     1000025        15   # BR(~tau_1 -> ~chi_30  tau-)
     8.13924826E-05    2    -1000024        16   # BR(~tau_1 -> ~chi_1-  nu_tau)
     4.73519420E-07    2     1000039        15   # BR(~tau_1 -> ~G       tau-)
#
#         PDG            Width
DECAY   2000015     7.35377584E+00   # stau_2 decays
#          BR         NDA      ID1       ID2
     6.16063420E-02    2     1000022        15   # BR(~tau_2 -> ~chi_10  tau-)
     1.26061383E-02    2     1000023        15   # BR(~tau_2 -> ~chi_20  tau-)
     9.22396518E-01    2     1000025        15   # BR(~tau_2 -> ~chi_30  tau-)
     3.39100215E-03    2    -1000024        16   # BR(~tau_2 -> ~chi_1-  nu_tau)
#
#         PDG            Width
DECAY   1000012     3.08837452E+00   # snu_eL decays
#          BR         NDA      ID1       ID2
     7.25258057E-02    2     1000022        12   # BR(~nu_eL -> ~chi_10 nu_e)
     2.30616500E-02    2     1000023        12   # BR(~nu_eL -> ~chi_20 nu_e)
     8.96221390E-01    2     1000025        12   # BR(~nu_eL -> ~chi_30 nu_e)
     8.19115380E-03    2     1000024        11   # BR(~nu_eL -> ~chi_1+ e-)
#
#         PDG            Width
DECAY   1000014     3.08837452E+00   # snu_muL decays
#          BR         NDA      ID1       ID2
     7.25258057E-02    2     1000022        14   # BR(~nu_muL -> ~chi_10 nu_mu)
     2.30616500E-02    2     1000023        14   # BR(~nu_muL -> ~chi_20 nu_mu)
     8.96221390E-01    2     1000025        14   # BR(~nu_muL -> ~chi_30 nu_mu)
     8.19115380E-03    2     1000024        13   # BR(~nu_muL -> ~chi_1+ mu-)
#
#         PDG            Width
DECAY   1000016     3.10425494E+00   # snu_tauL decays
#          BR         NDA      ID1       ID2
     7.21547856E-02    2     1000022        16   # BR(~nu_tauL -> ~chi_10 nu_tau)
     2.29436736E-02    2     1000023        16   # BR(~nu_tauL -> ~chi_20 nu_tau)
     8.91636593E-01    2     1000025        16   # BR(~nu_tauL -> ~chi_30 nu_tau)
     1.32649473E-02    2     1000024        15   # BR(~nu_tauL -> ~chi_1+ tau-)
#
#         PDG            Width
DECAY   1000024     2.06134199E-09   # chargino1+ decays
#          BR         NDA      ID1       ID2
     1.61748981E-03    2     1000039        24   # BR(~chi_1+ -> ~G       W+)
#           BR         NDA      ID1       ID2       ID3
     3.52798306E-01    3     1000022         2        -1   # BR(~chi_1+ -> ~chi_10 u    db)
     3.52798306E-01    3     1000022         4        -3   # BR(~chi_1+ -> ~chi_10 c    sb)
     1.17603239E-01    3     1000022       -11        12   # BR(~chi_1+ -> ~chi_10 e+   nu_e)
     1.17603239E-01    3     1000022       -13        14   # BR(~chi_1+ -> ~chi_10 mu+  nu_mu)
     5.75794200E-02    3     1000022       -15        16   # BR(~chi_1+ -> ~chi_10 tau+ nu_tau)
#
#         PDG            Width
DECAY   1000037     1.64098214E+02   # chargino2+ decays
#          BR         NDA      ID1       ID2
     1.37051144E-01    2     1000002        -1   # BR(~chi_2+ -> ~u_L     db)
     1.37047163E-01    2    -1000001         2   # BR(~chi_2+ -> ~d_L*    u )
     1.37051144E-01    2     1000004        -3   # BR(~chi_2+ -> ~c_L     sb)
     1.37047163E-01    2    -1000003         4   # BR(~chi_2+ -> ~s_L*    c )
     1.64433893E-01    2     1000006        -5   # BR(~chi_2+ -> ~t_1     bb)
     1.63155571E-01    2    -1000005         6   # BR(~chi_2+ -> ~b_1*    t )
     3.33162622E-04    2    -2000005         6   # BR(~chi_2+ -> ~b_2*    t )
     2.83382856E-07    2     1000012       -11   # BR(~chi_2+ -> ~nu_eL   e+  )
     2.83382856E-07    2     1000014       -13   # BR(~chi_2+ -> ~nu_muL  mu+ )
     2.13115289E-07    2     1000016       -15   # BR(~chi_2+ -> ~nu_tau1 tau+)
     1.89865093E-07    2    -1000011        12   # BR(~chi_2+ -> ~e_L+    nu_e)
     1.89865093E-07    2    -1000013        14   # BR(~chi_2+ -> ~mu_L+   nu_mu)
     9.70425726E-08    2    -1000015        16   # BR(~chi_2+ -> ~tau_1+  nu_tau)
     9.31798697E-08    2    -2000015        16   # BR(~chi_2+ -> ~tau_2+  nu_tau)
     2.61676526E-02    2     1000024        23   # BR(~chi_2+ -> ~chi_1+  Z )
     2.31490794E-02    2     1000022        24   # BR(~chi_2+ -> ~chi_10  W+)
     2.52173387E-02    2     1000023        24   # BR(~chi_2+ -> ~chi_20  W+)
     2.87704226E-03    2     1000025        24   # BR(~chi_2+ -> ~chi_30  W+)
     2.58054735E-02    2     1000024        25   # BR(~chi_2+ -> ~chi_1+  h )
     5.14704711E-03    2     1000024        35   # BR(~chi_2+ -> ~chi_1+  H )
     5.19776775E-03    2     1000024        36   # BR(~chi_2+ -> ~chi_1+  A )
     4.89245112E-03    2     1000022        37   # BR(~chi_2+ -> ~chi_10  H+)
     5.11426765E-03    2     1000023        37   # BR(~chi_2+ -> ~chi_20  H+)
     3.11265807E-04    2     1000025        37   # BR(~chi_2+ -> ~chi_30  H+)
     2.31589057E-08    2     1000039        24   # BR(~chi_2+ -> ~G       W+)
     1.43217367E-13    2     1000039        37   # BR(~chi_2+ -> ~G       H+)
#
#         PDG            Width
DECAY   1000022     1.71482756E-12   # neutralino1 decays
#          BR         NDA      ID1       ID2
     3.43642335E-01    2     1000039        22   # BR(~chi_10 -> ~G        gam)
     7.88468805E-02    2     1000039        23   # BR(~chi_10 -> ~G        Z)
     5.77510784E-01    2     1000039        25   # BR(~chi_10 -> ~G        h)
#
#         PDG            Width
DECAY   1000023     5.06269183E-08   # neutralino2 decays
#          BR         NDA      ID1       ID2
     2.36943519E-02    2     1000022        22   # BR(~chi_20 -> ~chi_10 gam)
#          BR         NDA      ID1       ID2
     1.58287285E-06    2     1000039        22   # BR(~chi_20 -> ~G        gam)
     5.87271775E-05    2     1000039        23   # BR(~chi_20 -> ~G        Z)
     1.27155737E-06    2     1000039        25   # BR(~chi_20 -> ~G        h)
#           BR         NDA      ID1       ID2       ID3
     1.25177845E-01    3     1000022        -2         2   # BR(~chi_20 -> ~chi_10 ub      u)
     1.61827805E-01    3     1000022        -1         1   # BR(~chi_20 -> ~chi_10 db      d)
     1.25177845E-01    3     1000022        -4         4   # BR(~chi_20 -> ~chi_10 cb      c)
     1.61827805E-01    3     1000022        -3         3   # BR(~chi_20 -> ~chi_10 sb      s)
     3.68528036E-02    3     1000022       -11        11   # BR(~chi_20 -> ~chi_10 e+      e-)
     3.68528036E-02    3     1000022       -13        13   # BR(~chi_20 -> ~chi_10 mu+     mu-)
     2.89905096E-02    3     1000022       -15        15   # BR(~chi_20 -> ~chi_10 tau+    tau-)
     7.35187926E-02    3     1000022       -12        12   # BR(~chi_20 -> ~chi_10 nu_eb   nu_e)
     7.35187926E-02    3     1000022       -14        14   # BR(~chi_20 -> ~chi_10 nu_mub  nu_mu)
     7.35187926E-02    3     1000022       -16        16   # BR(~chi_20 -> ~chi_10 nu_taub nu_tau)
     1.39758960E-02    3     1000024        -2         1   # BR(~chi_20 -> ~chi_1+ ub      d)
     1.39758960E-02    3    -1000024        -1         2   # BR(~chi_20 -> ~chi_1- db      u)
     1.39758960E-02    3     1000024        -4         3   # BR(~chi_20 -> ~chi_1+ cb      s)
     1.39758960E-02    3    -1000024        -3         4   # BR(~chi_20 -> ~chi_1- sb      c)
     4.65858859E-03    3     1000024       -12        11   # BR(~chi_20 -> ~chi_1+ nu_eb   e-)
     4.65858859E-03    3    -1000024        12       -11   # BR(~chi_20 -> ~chi_1- nu_e    e+)
     4.65858859E-03    3     1000024       -14        13   # BR(~chi_20 -> ~chi_1+ nu_mub  mu-)
     4.65858859E-03    3    -1000024        14       -13   # BR(~chi_20 -> ~chi_1- nu_mu   mu+)
     2.22116687E-03    3     1000024       -16        15   # BR(~chi_20 -> ~chi_1+ nu_taub tau-)
     2.22116687E-03    3    -1000024        16       -15   # BR(~chi_20 -> ~chi_1- nu_tau  tau+)
#
#         PDG            Width
DECAY   1000025     8.80851557E-06   # neutralino3 decays
#          BR         NDA      ID1       ID2
     3.04531840E-01    2     1000022        22   # BR(~chi_30 -> ~chi_10 gam)
     9.91746100E-03    2     1000023        22   # BR(~chi_30 -> ~chi_20 gam)
#          BR         NDA      ID1       ID2
     2.08977225E-06    2     1000039        22   # BR(~chi_30 -> ~G        gam)
     3.39233739E-07    2     1000039        23   # BR(~chi_30 -> ~G        Z)
     3.61235694E-08    2     1000039        25   # BR(~chi_30 -> ~G        h)
#           BR         NDA      ID1       ID2       ID3
     1.20895253E-02    3     1000022        -2         2   # BR(~chi_30 -> ~chi_10 ub      u)
     1.57359441E-02    3     1000022        -1         1   # BR(~chi_30 -> ~chi_10 db      d)
     1.20895253E-02    3     1000022        -4         4   # BR(~chi_30 -> ~chi_10 cb      c)
     1.57359441E-02    3     1000022        -3         3   # BR(~chi_30 -> ~chi_10 sb      s)
     1.24794198E-02    3     1000022        -5         5   # BR(~chi_30 -> ~chi_10 bb      b)
     3.60160222E-03    3     1000022       -11        11   # BR(~chi_30 -> ~chi_10 e+      e-)
     3.60160222E-03    3     1000022       -13        13   # BR(~chi_30 -> ~chi_10 mu+     mu-)
     3.46334129E-03    3     1000022       -15        15   # BR(~chi_30 -> ~chi_10 tau+    tau-)
     7.11197275E-03    3     1000022       -12        12   # BR(~chi_30 -> ~chi_10 nu_eb   nu_e)
     7.11197275E-03    3     1000022       -14        14   # BR(~chi_30 -> ~chi_10 nu_mub  nu_mu)
     7.11197275E-03    3     1000022       -16        16   # BR(~chi_30 -> ~chi_10 nu_taub nu_tau)
     7.78428757E-03    3     1000023        -2         2   # BR(~chi_30 -> ~chi_20 ub      u)
     1.00727600E-02    3     1000023        -1         1   # BR(~chi_30 -> ~chi_20 db      d)
     7.78428757E-03    3     1000023        -4         4   # BR(~chi_30 -> ~chi_20 cb      c)
     1.00727600E-02    3     1000023        -3         3   # BR(~chi_30 -> ~chi_20 sb      s)
     7.16718732E-03    3     1000023        -5         5   # BR(~chi_30 -> ~chi_20 bb      b)
     2.29438881E-03    3     1000023       -11        11   # BR(~chi_30 -> ~chi_20 e+      e-)
     2.29438881E-03    3     1000023       -13        13   # BR(~chi_30 -> ~chi_20 mu+     mu-)
     2.22732331E-03    3     1000023       -15        15   # BR(~chi_30 -> ~chi_20 tau+    tau-)
     4.57056474E-03    3     1000023       -12        12   # BR(~chi_30 -> ~chi_20 nu_eb   nu_e)
     4.57056474E-03    3     1000023       -14        14   # BR(~chi_30 -> ~chi_20 nu_mub  nu_mu)
     4.57056474E-03    3     1000023       -16        16   # BR(~chi_30 -> ~chi_20 nu_taub nu_tau)
     8.71822742E-02    3     1000024        -2         1   # BR(~chi_30 -> ~chi_1+ ub      d)
     8.71822742E-02    3    -1000024        -1         2   # BR(~chi_30 -> ~chi_1- db      u)
     8.71822742E-02    3     1000024        -4         3   # BR(~chi_30 -> ~chi_1+ cb      s)
     8.71822742E-02    3    -1000024        -3         4   # BR(~chi_30 -> ~chi_1- sb      c)
     2.90491466E-02    3     1000024       -12        11   # BR(~chi_30 -> ~chi_1+ nu_eb   e-)
     2.90491466E-02    3    -1000024        12       -11   # BR(~chi_30 -> ~chi_1- nu_e    e+)
     2.90491466E-02    3     1000024       -14        13   # BR(~chi_30 -> ~chi_1+ nu_mub  mu-)
     2.90491466E-02    3    -1000024        14       -13   # BR(~chi_30 -> ~chi_1- nu_mu   mu+)
     2.85403254E-02    3     1000024       -16        15   # BR(~chi_30 -> ~chi_1+ nu_taub tau-)
     2.85403254E-02    3    -1000024        16       -15   # BR(~chi_30 -> ~chi_1- nu_tau  tau+)
#
#         PDG            Width
DECAY   1000035     1.64097710E+02   # neutralino4 decays
#          BR         NDA      ID1       ID2
     2.28266872E-02    2     1000022        23   # BR(~chi_40 -> ~chi_10   Z )
     1.38898204E-03    2     1000023        23   # BR(~chi_40 -> ~chi_20   Z )
     1.99400804E-03    2     1000025        23   # BR(~chi_40 -> ~chi_30   Z )
     2.55792031E-02    2     1000024       -24   # BR(~chi_40 -> ~chi_1+   W-)
     2.55792031E-02    2    -1000024        24   # BR(~chi_40 -> ~chi_1-   W+)
     8.34701716E-04    2     1000022        25   # BR(~chi_40 -> ~chi_10   h )
     4.76406019E-03    2     1000022        35   # BR(~chi_40 -> ~chi_10   H )
     1.05035847E-04    2     1000022        36   # BR(~chi_40 -> ~chi_10   A )
     2.40828434E-02    2     1000023        25   # BR(~chi_40 -> ~chi_20   h )
     7.21411549E-05    2     1000023        35   # BR(~chi_40 -> ~chi_20   H )
     5.06167453E-03    2     1000023        36   # BR(~chi_40 -> ~chi_20   A )
     9.32937524E-04    2     1000025        25   # BR(~chi_40 -> ~chi_30   h )
     3.04297250E-04    2     1000025        35   # BR(~chi_40 -> ~chi_30   H )
     5.94048291E-06    2     1000025        36   # BR(~chi_40 -> ~chi_30   A )
     5.17496416E-03    2     1000024       -37   # BR(~chi_40 -> ~chi_1+   H-)
     5.17496416E-03    2    -1000024        37   # BR(~chi_40 -> ~chi_1-   H+)
     6.76705822E-02    2     1000002        -2   # BR(~chi_40 -> ~u_L      ub)
     6.76705822E-02    2    -1000002         2   # BR(~chi_40 -> ~u_L*     u )
     5.64992167E-12    2     2000002        -2   # BR(~chi_40 -> ~u_R      ub)
     5.64992167E-12    2    -2000002         2   # BR(~chi_40 -> ~u_R*     u )
     6.76501328E-02    2     1000001        -1   # BR(~chi_40 -> ~d_L      db)
     6.76501328E-02    2    -1000001         1   # BR(~chi_40 -> ~d_L*     d )
     3.16598257E-09    2     2000001        -1   # BR(~chi_40 -> ~d_R      db)
     3.16598257E-09    2    -2000001         1   # BR(~chi_40 -> ~d_R*     d )
     6.76705822E-02    2     1000004        -4   # BR(~chi_40 -> ~c_L      cb)
     6.76705822E-02    2    -1000004         4   # BR(~chi_40 -> ~c_L*     c )
     5.64992167E-12    2     2000004        -4   # BR(~chi_40 -> ~c_R      cb)
     5.64992167E-12    2    -2000004         4   # BR(~chi_40 -> ~c_R*     c )
     6.76501328E-02    2     1000003        -3   # BR(~chi_40 -> ~s_L      sb)
     6.76501328E-02    2    -1000003         3   # BR(~chi_40 -> ~s_L*     s )
     3.16598257E-09    2     2000003        -3   # BR(~chi_40 -> ~s_R      sb)
     3.16598257E-09    2    -2000003         3   # BR(~chi_40 -> ~s_R*     s )
     8.12653848E-02    2     1000006        -6   # BR(~chi_40 -> ~t_1      tb)
     8.12653848E-02    2    -1000006         6   # BR(~chi_40 -> ~t_1*     t )
     8.25246172E-02    2     1000005        -5   # BR(~chi_40 -> ~b_1      bb)
     8.25246172E-02    2    -1000005         5   # BR(~chi_40 -> ~b_1*     b )
     1.69451097E-04    2     2000005        -5   # BR(~chi_40 -> ~b_2      bb)
     1.69451097E-04    2    -2000005         5   # BR(~chi_40 -> ~b_2*     b )
     9.48835330E-08    2     1000011       -11   # BR(~chi_40 -> ~e_L-     e+)
     9.48835330E-08    2    -1000011        11   # BR(~chi_40 -> ~e_L+     e-)
     4.05864942E-14    2     2000011       -11   # BR(~chi_40 -> ~e_R-     e+)
     4.05864942E-14    2    -2000011        11   # BR(~chi_40 -> ~e_R+     e-)
     9.48835330E-08    2     1000013       -13   # BR(~chi_40 -> ~mu_L-    mu+)
     9.48835330E-08    2    -1000013        13   # BR(~chi_40 -> ~mu_L+    mu-)
     4.05864942E-14    2     2000013       -13   # BR(~chi_40 -> ~mu_R-    mu+)
     4.05864942E-14    2    -2000013        13   # BR(~chi_40 -> ~mu_R+    mu-)
     3.11703137E-08    2     1000015       -15   # BR(~chi_40 -> ~tau_1-   tau+)
     3.11703137E-08    2    -1000015        15   # BR(~chi_40 -> ~tau_1+   tau-)
     2.50786980E-08    2     2000015       -15   # BR(~chi_40 -> ~tau_2-   tau+)
     2.50786980E-08    2    -2000015        15   # BR(~chi_40 -> ~tau_2+   tau-)
     1.41900633E-07    2     1000012       -12   # BR(~chi_40 -> ~nu_eL    nu_eb)
     1.41900633E-07    2    -1000012        12   # BR(~chi_40 -> ~nu_eL*   nu_e )
     1.41900633E-07    2     1000014       -14   # BR(~chi_40 -> ~nu_muL   nu_mub)
     1.41900633E-07    2    -1000014        14   # BR(~chi_40 -> ~nu_muL*  nu_mu )
     1.41900633E-07    2     1000016       -16   # BR(~chi_40 -> ~nu_tau1  nu_taub)
     1.41900633E-07    2    -1000016        16   # BR(~chi_40 -> ~nu_tau1* nu_tau )
     5.50021168E-09    2     1000039        22   # BR(~chi_40 -> ~G        gam)
     1.76575200E-08    2     1000039        23   # BR(~chi_40 -> ~G        Z)
     1.74619718E-12    2     1000039        25   # BR(~chi_40 -> ~G        h)
     1.41465354E-13    2     1000039        35   # BR(~chi_40 -> ~G        H)
     1.93019643E-16    2     1000039        36   # BR(~chi_40 -> ~G        A)
#
#         PDG            Width
DECAY        25     3.17333918E-03   # h decays
#          BR         NDA      ID1       ID2
     7.39514328E-01    2           5        -5   # BR(h -> b       bb     )
     7.54015399E-02    2         -15        15   # BR(h -> tau+    tau-   )
     2.66952262E-04    2         -13        13   # BR(h -> mu+     mu-    )
     5.75053868E-04    2           3        -3   # BR(h -> s       sb     )
     2.48536739E-02    2           4        -4   # BR(h -> c       cb     )
     6.90088064E-02    2          21        21   # BR(h -> g       g      )
     2.08871503E-03    2          22        22   # BR(h -> gam     gam    )
     6.99791229E-04    2          22        23   # BR(h -> Z       gam    )
     7.92989847E-02    2          24       -24   # BR(h -> W+      W-     )
     8.29215480E-03    2          23        23   # BR(h -> Z       Z      )
#
#         PDG            Width
DECAY        35     4.12897425E+01   # H decays
#          BR         NDA      ID1       ID2
     1.36618841E-03    2           5        -5   # BR(H -> b       bb     )
     2.25772787E-04    2         -15        15   # BR(H -> tau+    tau-   )
     7.98190857E-07    2         -13        13   # BR(H -> mu+     mu-    )
     1.02218179E-06    2           3        -3   # BR(H -> s       sb     )
     9.20859728E-06    2           4        -4   # BR(H -> c       cb     )
     9.34667637E-01    2           6        -6   # BR(H -> t       tb     )
     8.61971395E-04    2          21        21   # BR(H -> g       g      )
     2.78876351E-06    2          22        22   # BR(H -> gam     gam    )
     1.09923652E-06    2          23        22   # BR(H -> Z       gam    )
     2.02929823E-04    2          24       -24   # BR(H -> W+      W-     )
     1.01188232E-04    2          23        23   # BR(H -> Z       Z      )
     7.07454623E-04    2          25        25   # BR(H -> h       h      )
     1.20428485E-23    2          36        36   # BR(H -> A       A      )
     2.38735494E-11    2          23        36   # BR(H -> Z       A      )
     1.42612530E-12    2          24       -37   # BR(H -> W+      H-     )
     1.42612530E-12    2         -24        37   # BR(H -> W-      H+     )
     1.17650058E-04    2     1000024  -1000024   # BR(H -> ~chi_1+ ~chi_1-)
     7.27950012E-03    2     1000022   1000022   # BR(H -> ~chi_10 ~chi_10)
     9.45804442E-05    2     1000023   1000023   # BR(H -> ~chi_20 ~chi_20)
     5.48502309E-03    2     1000025   1000025   # BR(H -> ~chi_30 ~chi_30)
     5.27104466E-04    2     1000022   1000023   # BR(H -> ~chi_10 ~chi_20)
     3.83838699E-02    2     1000022   1000025   # BR(H -> ~chi_10 ~chi_30)
     2.68820239E-03    2     1000023   1000025   # BR(H -> ~chi_20 ~chi_30)
     1.54633240E-04    2     1000002  -1000002   # BR(H -> ~u_L    ~u_L*  )
     1.54633240E-04    2     1000004  -1000004   # BR(H -> ~c_L    ~c_L*  )
     6.27232072E-03    2     1000006  -1000006   # BR(H -> ~t_1    ~t_1*  )
     2.23954034E-04    2     1000001  -1000001   # BR(H -> ~d_L    ~d_L*  )
     6.61976267E-06    2     2000001  -2000001   # BR(H -> ~d_R    ~d_R*  )
     2.23954034E-04    2     1000003  -1000003   # BR(H -> ~s_L    ~s_L*  )
     6.61976267E-06    2     2000003  -2000003   # BR(H -> ~s_R    ~s_R*  )
     2.16803698E-04    2     1000005  -1000005   # BR(H -> ~b_1    ~b_1*  )
     5.47301993E-06    2     2000005  -2000005   # BR(H -> ~b_2    ~b_2*  )
     5.49929810E-06    2     1000005  -2000005   # BR(H -> ~b_1    ~b_2*  )
     5.49929810E-06    2     2000005  -1000005   # BR(H -> ~b_2    ~b_1*  )
#
#         PDG            Width
DECAY        36     4.15272778E+01   # A decays
#          BR         NDA      ID1       ID2
     1.37565901E-03    2           5        -5   # BR(A -> b       bb     )
     2.24580490E-04    2         -15        15   # BR(A -> tau+    tau-   )
     7.93973161E-07    2         -13        13   # BR(A -> mu+     mu-    )
     1.04694166E-06    2           3        -3   # BR(A -> s       sb     )
     9.17461194E-06    2           4        -4   # BR(A -> c       cb     )
     9.42441393E-01    2           6        -6   # BR(A -> t       tb     )
     8.98804641E-04    2          21        21   # BR(A -> g       g      )
     3.15439307E-06    2          22        22   # BR(A -> gam     gam    )
     1.28947027E-06    2          23        22   # BR(A -> Z       gam    )
     1.99281418E-04    2          23        25   # BR(A -> Z       h      )
     7.10084861E-04    2     1000024  -1000024   # BR(A -> ~chi_1+ ~chi_1-)
     3.94946694E-04    2     1000022   1000022   # BR(A -> ~chi_10 ~chi_10)
     2.57647806E-03    2     1000023   1000023   # BR(A -> ~chi_20 ~chi_20)
     1.88042134E-04    2     1000025   1000025   # BR(A -> ~chi_30 ~chi_30)
     2.86382171E-03    2     1000022   1000023   # BR(A -> ~chi_10 ~chi_20)
     2.71035944E-03    2     1000022   1000025   # BR(A -> ~chi_10 ~chi_30)
     4.53922308E-02    2     1000023   1000025   # BR(A -> ~chi_20 ~chi_30)
     4.42928701E-06    2     1000005  -2000005   # BR(A -> ~b_1    ~b_2*  )
     4.42928701E-06    2    -1000005   2000005   # BR(A -> ~b_1*   ~b_2   )
#
#         PDG            Width
DECAY        37     4.08154433E+01   # H+ decays
#          BR         NDA      ID1       ID2
     2.20327946E-06    2           4        -5   # BR(H+ -> c       bb     )
     2.28731166E-04    2         -15        16   # BR(H+ -> tau+    nu_tau )
     8.08647297E-07    2         -13        14   # BR(H+ -> mu+     nu_mu  )
     1.40093062E-08    2           2        -5   # BR(H+ -> u       bb     )
     5.00872343E-08    2           2        -3   # BR(H+ -> u       sb     )
     9.98007063E-06    2           4        -3   # BR(H+ -> c       sb     )
     9.41455495E-01    2           6        -5   # BR(H+ -> t       bb     )
     2.03668783E-04    2          24        25   # BR(H+ -> W+      h      )
     1.15905946E-12    2          24        36   # BR(H+ -> W+      A      )
     3.31847706E-03    2     1000024   1000022   # BR(H+ -> ~chi_1+ ~chi_10)
     5.36033771E-04    2     1000024   1000023   # BR(H+ -> ~chi_1+ ~chi_20)
     5.13055942E-02    2     1000024   1000025   # BR(H+ -> ~chi_1+ ~chi_30)
     3.78173542E-04    2     1000002  -1000001   # BR(H+ -> ~u_L    ~d_L*  )
     3.78173542E-04    2     1000004  -1000003   # BR(H+ -> ~c_L    ~s_L*  )
     2.17799738E-03    2     1000006  -1000005   # BR(H+ -> ~t_1    ~b_1*  )
     4.59918748E-06    2     1000006  -2000005   # BR(H+ -> ~t_1    ~b_2*  )
