  65
  401    702.2107    0.44385E-25
  402    698.1886    0.45314E-25
  403    702.2108    0.44385E-25
  404    698.1899    0.45314E-25
  405   2000.1373    0.64446E-26
  406   2004.0999    0.46302E-26
  407    702.2107    0.44385E-25
  408    698.1886    0.45314E-25
  409    702.2108    0.44385E-25
  410    698.1899    0.45314E-25
  411   2000.1373    0.64446E-26
  412   2004.0999    0.46302E-26
  413    700.4050    0.59228E-25
  414    699.1893    0.54168E-25
  415    700.4050    0.59228E-25
  416    699.1906    0.54169E-25
  417   2000.7828    0.45955E-26
  418   2004.4734    0.46368E-26
  419    700.4050    0.59228E-25
  420    699.1893    0.54168E-25
  421    700.4050    0.59228E-25
  422    699.1906    0.54169E-25
  423   2000.7828    0.45955E-26
  424   2004.4734    0.46368E-26
  425    253.9007    0.29699E-23
  426    242.5551    0.30056E-23
  427    253.9007    0.29699E-23
  428    242.5551    0.30056E-23
  429    253.2394    0.72039E-24
  430   1999.0830    0.25506E-25
  431    253.9007    0.29699E-23
  432    242.5551    0.30056E-23
  433    253.9007    0.29699E-23
  434    242.5551    0.30056E-23
  435    253.2394    0.72039E-24
  436   1999.0830    0.25506E-25
  437    253.3802    0.71956E-24
  438      0.0000    0.10000E+31
  439    253.3802    0.71956E-24
  440      0.0000    0.10000E+31
  441   2000.5107    0.25543E-25
  442      0.0000    0.10000E+31
  443    253.3802    0.71956E-24
  444      0.0000    0.10000E+31
  445    253.3802    0.71956E-24
  446      0.0000    0.10000E+31
  447   2000.5107    0.25543E-25
  448      0.0000    0.10000E+31
  449    500.0000    0.71707E-21
  450     99.9752    0.10000E+31
  451    399.8298    0.26755E-24
  452   -752.0848    0.10956E-24
  453    765.6602    0.10126E-24
  454    399.7271    0.26735E-24
  455    764.9924    0.10127E-24
  456    399.7271    0.26735E-24
  457    764.9924    0.10127E-24
  203    105.4010    0.17896E-21
  204   1007.7596    0.18209E-24
  205   1000.0000    0.15881E-24
  206   1004.4799    0.21549E-24
  207   1004.4799    0.21549E-24
  458      0.0000    0.10000E+31
    6    172.5000    0.57395E-24
   12    172.5000    0.57395E-24
   4
   401  0.70746811E-02     0   450     1     0     0     0
   401  0.86857200E-01     0   451     1     0     0     0
   401  0.73331803E+00     0   449     1     0     0     0
   401  0.17275010E+00     0   456     2     0     0     0
   4
   402  0.58312938E-02     0   450     2     0     0     0
   402  0.88610321E-01     0   451     2     0     0     0
   402  0.72723490E+00     0   449     2     0     0     0
   402  0.17832348E+00     0   454     1     0     0     0
   4
   403  0.70746988E-02     0   450     3     0     0     0
   403  0.86857423E-01     0   451     3     0     0     0
   403  0.73332012E+00     0   449     3     0     0     0
   403  0.17274778E+00     0   456     4     0     0     0
   4
   404  0.58313548E-02     0   450     4     0     0     0
   404  0.88610768E-01     0   451     4     0     0     0
   404  0.72723055E+00     0   449     4     0     0     0
   404  0.17832734E+00     0   454     3     0     0     0
   7
   405  0.10970008E-01     0   450     5     0     0     0
   405  0.41174470E-04     0   451     5     0     0     0
   405  0.57328097E-03     0   452     5     0     0     0
   405  0.56133140E-03     0   453     5     0     0     0
   405  0.98673177E+00     0   449     5     0     0     0
   405  0.72555857E-04     0   456     6     0     0     0
   405  0.10498827E-02     0   457     6     0     0     0
   7
   406  0.69864750E+00     0   449     6     0     0     0
   406  0.31168306E-01     0   450     6     0     0     0
   406  0.20672530E-02     0   451     6     0     0     0
   406  0.67340516E-01     0   452     6     0     0     0
   406  0.64731620E-01     0   453     6     0     0     0
   406  0.42272257E-02     0   454     5     0     0     0
   406  0.13181761E+00     0   455     5     0     0     0
   4
   407  0.70746811E-02     0   450     7     0     0     0
   407  0.86857200E-01     0   451     7     0     0     0
   407  0.73331803E+00     0   449     7     0     0     0
   407  0.17275010E+00     0   454     8     0     0     0
   4
   408  0.58312938E-02     0   450     8     0     0     0
   408  0.88610321E-01     0   451     8     0     0     0
   408  0.72723490E+00     0   449     8     0     0     0
   408  0.17832348E+00     0   456     7     0     0     0
   4
   409  0.70746988E-02     0   450     9     0     0     0
   409  0.86857423E-01     0   451     9     0     0     0
   409  0.73332012E+00     0   449     9     0     0     0
   409  0.17274778E+00     0   454    10     0     0     0
   4
   410  0.58313548E-02     0   450    10     0     0     0
   410  0.88610768E-01     0   451    10     0     0     0
   410  0.72723055E+00     0   449    10     0     0     0
   410  0.17832734E+00     0   456     9     0     0     0
   7
   411  0.10970008E-01     0   450    11     0     0     0
   411  0.41174470E-04     0   451    11     0     0     0
   411  0.57328097E-03     0   452    11     0     0     0
   411  0.56133140E-03     0   453    11     0     0     0
   411  0.98673177E+00     0   449    11     0     0     0
   411  0.72555857E-04     0   454    12     0     0     0
   411  0.10498827E-02     0   455    12     0     0     0
   7
   412  0.69864750E+00     0   449    12     0     0     0
   412  0.31168306E-01     0   450    12     0     0     0
   412  0.20672530E-02     0   451    12     0     0     0
   412  0.67340516E-01     0   452    12     0     0     0
   412  0.64731620E-01     0   453    12     0     0     0
   412  0.42272257E-02     0   456    11     0     0     0
   412  0.13181761E+00     0   457    11     0     0     0
   2
   413  0.34033205E-01     0   450     1     0     0     0
   413  0.96596676E+00     0   449     1     0     0     0
   3
   414  0.12426882E+00     0   450     2     0     0     0
   414  0.27467888E-04     0   451     2     0     0     0
   414  0.87570369E+00     0   449     2     0     0     0
   2
   415  0.34033205E-01     0   450     3     0     0     0
   415  0.96596676E+00     0   449     3     0     0     0
   3
   416  0.12427051E+00     0   450     4     0     0     0
   416  0.27468124E-04     0   451     4     0     0     0
   416  0.87570202E+00     0   449     4     0     0     0
   7
   417  0.21674903E-02     0   450     5     0     0     0
   417  0.51735908E-01     0   451     5     0     0     0
   417  0.47557394E-03     0   452     5     0     0     0
   417  0.21325422E-02     0   453     5     0     0     0
   417  0.70387512E+00     0   449     5     0     0     0
   417  0.10379965E+00     0   456     6     0     0     0
   417  0.13581370E+00     0   457     6     0     0     0
   7
   418  0.69980657E+00     0   449     6     0     0     0
   418  0.10694325E+00     0   454     5     0     0     0
   418  0.29267871E-02     0   455     5     0     0     0
   418  0.18507992E-02     0   450     6     0     0     0
   418  0.53592447E-01     0   451     6     0     0     0
   418  0.67575060E-01     0   452     6     0     0     0
   418  0.67305118E-01     0   453     6     0     0     0
   2
   419  0.34033205E-01     0   450     7     0     0     0
   419  0.96596676E+00     0   449     7     0     0     0
   3
   420  0.12426882E+00     0   450     8     0     0     0
   420  0.27467888E-04     0   451     8     0     0     0
   420  0.87570369E+00     0   449     8     0     0     0
   2
   421  0.34033205E-01     0   450     9     0     0     0
   421  0.96596676E+00     0   449     9     0     0     0
   3
   422  0.12427051E+00     0   450    10     0     0     0
   422  0.27468124E-04     0   451    10     0     0     0
   422  0.87570202E+00     0   449    10     0     0     0
   7
   423  0.21674903E-02     0   450    11     0     0     0
   423  0.51735908E-01     0   451    11     0     0     0
   423  0.47557394E-03     0   452    11     0     0     0
   423  0.21325422E-02     0   453    11     0     0     0
   423  0.70387512E+00     0   449    11     0     0     0
   423  0.10379965E+00     0   454    12     0     0     0
   423  0.13581370E+00     0   455    12     0     0     0
   7
   424  0.69980657E+00     0   449    12     0     0     0
   424  0.10694325E+00     0   456    11     0     0     0
   424  0.29267871E-02     0   457    11     0     0     0
   424  0.18507992E-02     0   450    12     0     0     0
   424  0.53592447E-01     0   451    12     0     0     0
   424  0.67575060E-01     0   452    12     0     0     0
   424  0.67305118E-01     0   453    12     0     0     0
   1
   425  0.10000000E+01     0   450   121     0     0     0
   1
   426  0.10000000E+01     0   450   122     0     0     0
   1
   427  0.10000000E+01     0   450   123     0     0     0
   1
   428  0.10000000E+01     0   450   124     0     0     0
   1
   429  0.10000000E+01     0   450   125     0     0     0
   7
   430  0.10099237E+00     0   450   126     0     0     0
   430  0.28211364E+00     0   451   126     0     0     0
   430  0.60888851E-03     0   452   126     0     0     0
   430  0.11754908E-01     0   453   126     0     0     0
   430  0.58628225E+00     0   454   125     0     0     0
   430  0.13583263E-01     0   455   125     0     0     0
   430  0.46646544E-02     0   206   429     0     0     0
   1
   431  0.10000000E+01     0   450   127     0     0     0
   1
   432  0.10000000E+01     0   450   128     0     0     0
   1
   433  0.10000000E+01     0   450   129     0     0     0
   1
   434  0.10000000E+01     0   450   130     0     0     0
   1
   435  0.10000000E+01     0   450   131     0     0     0
   7
   436  0.10099237E+00     0   450   132     0     0     0
   436  0.28211364E+00     0   451   132     0     0     0
   436  0.60888851E-03     0   452   132     0     0     0
   436  0.11754908E-01     0   453   132     0     0     0
   436  0.58628225E+00     0   456   131     0     0     0
   436  0.13583263E-01     0   457   131     0     0     0
   436  0.46646544E-02     0   207   435     0     0     0
   1
   437  0.10000000E+01     0   450   121     0     0     0
   0
   1
   439  0.10000000E+01     0   450   123     0     0     0
   0
   8
   441  0.94452493E-01     0   450   125     0     0     0
   441  0.29683360E+00     0   451   125     0     0     0
   441  0.10646789E-02     0   452   125     0     0     0
   441  0.70637157E-02     0   453   125     0     0     0
   441  0.57133061E+00     0   456   126     0     0     0
   441  0.24582203E-01     0   457   126     0     0     0
   441  0.23430658E-02     0   205   429     0     0     0
   441  0.23296485E-02     0   204   429     0     0     0
   0
   1
   443  0.10000000E+01     0   450   127     0     0     0
   0
   1
   445  0.10000000E+01     0   450   129     0     0     0
   0
   8
   447  0.94452493E-01     0   450   131     0     0     0
   447  0.29683360E+00     0   451   131     0     0     0
   447  0.10646789E-02     0   452   131     0     0     0
   447  0.70637157E-02     0   453   131     0     0     0
   447  0.57133061E+00     0   454   132     0     0     0
   447  0.24582203E-01     0   455   132     0     0     0
   447  0.23430658E-02     0   205   435     0     0     0
   447  0.23296485E-02     0   204   435     0     0     0
   0
  15
   449  0.99616200E-02     0   454     1     8     0     0
   449  0.99616200E-02     0   456     2     7     0     0
   449  0.99615520E-02     0   454     3    10     0     0
   449  0.99615520E-02     0   456     4     9     0     0
   449  0.36168393E+00     0   450     2     8     0     0
   449  0.10792133E+00     0   450     1     7     0     0
   449  0.10792132E+00     0   450     3     9     0     0
   449  0.36168021E+00     0   450     4    10     0     0
   449  0.10123421E-02     0   450     5    11     0     0
   449  0.66307446E-04     0   450     6    12     0     0
   449  0.50988849E-02     0   451     2     8     0     0
   449  0.48217988E-02     0   451     1     7     0     0
   449  0.48217955E-02     0   451     3     9     0     0
   449  0.50988207E-02     0   451     4    10     0     0
   449  0.26906197E-04     0   451     5    11     0     0
   0
  16
   451  0.39760946E-03     0   450   200     0     0     0
   451  0.60476176E-02     0   450   203     0     0     0
   451  0.12002137E+00     0   425   127     0     0     0
   451  0.12002137E+00     0   431   121     0     0     0
   451  0.12002134E+00     0   427   129     0     0     0
   451  0.12002134E+00     0   433   123     0     0     0
   451  0.69005400E-04     0   437   127     0     0     0
   451  0.69005400E-04     0   443   121     0     0     0
   451  0.69005371E-04     0   439   129     0     0     0
   451  0.69005371E-04     0   445   123     0     0     0
   451  0.92907845E-04     0   429   131     0     0     0
   451  0.92907845E-04     0   435   125     0     0     0
   451  0.12825188E+00     0   426   128     0     0     0
   451  0.12825188E+00     0   432   122     0     0     0
   451  0.12825188E+00     0   428   130     0     0     0
   451  0.12825188E+00     0   434   124     0     0     0
  28
   452  0.30464488E+00     0   454   199     0     0     0
   452  0.30464488E+00     0   456   198     0     0     0
   452  0.76239727E-01     0   450   200     0     0     0
   452  0.28465545E+00     0   451   200     0     0     0
   452  0.15342951E-01     0   450   203     0     0     0
   452  0.90928786E-02     0   451   203     0     0     0
   452  0.14281321E-04     0   402     8     0     0     0
   452  0.14281321E-04     0   408     2     0     0     0
   452  0.21369855E-04     0   401     7     0     0     0
   452  0.21369855E-04     0   407     1     0     0     0
   452  0.21369642E-04     0   403     9     0     0     0
   452  0.21369642E-04     0   409     3     0     0     0
   452  0.14276514E-04     0   404    10     0     0     0
   452  0.14276514E-04     0   410     4     0     0     0
   452  0.90959416E-04     0   425   127     0     0     0
   452  0.90959416E-04     0   431   121     0     0     0
   452  0.90959409E-04     0   427   129     0     0     0
   452  0.90959409E-04     0   433   123     0     0     0
   452  0.17857568E-03     0   437   127     0     0     0
   452  0.17857568E-03     0   443   121     0     0     0
   452  0.17857569E-03     0   439   129     0     0     0
   452  0.17857569E-03     0   445   123     0     0     0
   452  0.10073330E-02     0   429   131     0     0     0
   452  0.10073330E-02     0   435   125     0     0     0
   452  0.53595711E-03     0   426   128     0     0     0
   452  0.53595717E-03     0   432   122     0     0     0
   452  0.53595711E-03     0   428   130     0     0     0
   452  0.53595717E-03     0   434   124     0     0     0
  32
   453  0.29669836E+00     0   454   199     0     0     0
   453  0.29669836E+00     0   456   198     0     0     0
   453  0.15061813E-01     0   450   200     0     0     0
   453  0.10293074E-01     0   451   200     0     0     0
   453  0.64622030E-01     0   450   203     0     0     0
   453  0.24462691E+00     0   451   203     0     0     0
   453  0.69447036E-03     0   402     8     0     0     0
   453  0.69447036E-03     0   408     2     0     0     0
   453  0.76552719E-03     0   401     7     0     0     0
   453  0.76552719E-03     0   407     1     0     0     0
   453  0.76552224E-03     0   403     9     0     0     0
   453  0.76552224E-03     0   409     3     0     0     0
   453  0.69431879E-03     0   404    10     0     0     0
   453  0.69431879E-03     0   410     4     0     0     0
   453  0.34723245E-04     0   414     8     0     0     0
   453  0.34723245E-04     0   420     2     0     0     0
   453  0.34715376E-04     0   416    10     0     0     0
   453  0.34715376E-04     0   422     4     0     0     0
   453  0.50781225E-02     0   425   127     0     0     0
   453  0.50781225E-02     0   431   121     0     0     0
   453  0.50781225E-02     0   427   129     0     0     0
   453  0.50781225E-02     0   433   123     0     0     0
   453  0.74856495E-03     0   437   127     0     0     0
   453  0.74856495E-03     0   443   121     0     0     0
   453  0.74856490E-03     0   439   129     0     0     0
   453  0.74856490E-03     0   445   123     0     0     0
   453  0.14882656E-02     0   429   131     0     0     0
   453  0.14882656E-02     0   435   125     0     0     0
   453  0.99344077E-02     0   426   128     0     0     0
   453  0.99344077E-02     0   432   122     0     0     0
   453  0.99344077E-02     0   428   130     0     0     0
   453  0.99344077E-02     0   434   124     0     0     0
   6
   454  0.65543395E-02     0   450   198     0     0     0
   454  0.26604131E+00     0   426   127     0     0     0
   454  0.26604128E+00     0   428   129     0     0     0
   454  0.23065622E+00     0   431   122     0     0     0
   454  0.23065619E+00     0   433   124     0     0     0
   454  0.50648861E-04     0   435   126     0     0     0
  13
   455  0.76013550E-01     0   450   198     0     0     0
   455  0.30274886E+00     0   451   198     0     0     0
   455  0.10271523E-02     0   402     7     0     0     0
   455  0.19001390E-02     0   407     2     0     0     0
   455  0.10271107E-02     0   404     9     0     0     0
   455  0.21391462E-02     0   409     4     0     0     0
   455  0.99292165E-02     0   426   127     0     0     0
   455  0.99292165E-02     0   428   129     0     0     0
   455  0.20242902E-01     0   431   122     0     0     0
   455  0.20242900E-01     0   433   124     0     0     0
   455  0.14930276E-02     0   435   126     0     0     0
   455  0.29372990E+00     0   454   200     0     0     0
   455  0.25957683E+00     0   454   203     0     0     0
   6
   456  0.65543395E-02     0   450   199     0     0     0
   456  0.26604131E+00     0   432   121     0     0     0
   456  0.26604128E+00     0   434   123     0     0     0
   456  0.23065622E+00     0   425   128     0     0     0
   456  0.23065619E+00     0   427   130     0     0     0
   456  0.50648861E-04     0   429   132     0     0     0
  13
   457  0.76013550E-01     0   450   199     0     0     0
   457  0.30274886E+00     0   451   199     0     0     0
   457  0.10271523E-02     0   408     1     0     0     0
   457  0.19001390E-02     0   401     8     0     0     0
   457  0.10271107E-02     0   410     3     0     0     0
   457  0.21391462E-02     0   403    10     0     0     0
   457  0.99292165E-02     0   432   121     0     0     0
   457  0.99292165E-02     0   434   123     0     0     0
   457  0.20242902E-01     0   425   128     0     0     0
   457  0.20242900E-01     0   427   130     0     0     0
   457  0.14930276E-02     0   429   132     0     0     0
   457  0.29372990E+00     0   456   200     0     0     0
   457  0.25957683E+00     0   456   203     0     0     0
  28
   203  0.21323265E-03     0   123   129     0     0     0
   203  0.60969334E-01     0   125   131     0     0     0
   203  0.25645536E-02     0     3     9     0     0     0
   203  0.85113460E+00     0     5    11     0     0     0
   203  0.37278611E-01     0     4    10     0     0     0
   203  0.14658901E-02     0    59    59     0     0     0
   203  0.33236708E-01     0    13    13     0     0     0
   203  0.70845836E-03     0   198   121   128     0     0
   203  0.70845836E-03     0   198   123   130     0     0
   203  0.70845836E-03     0   198   125   132     0     0
   203  0.21253752E-02     0   198     8     1     0     0
   203  0.21253752E-02     0   198    10     3     0     0
   203  0.70845836E-03     0   199   127   122     0     0
   203  0.70845836E-03     0   199   129   124     0     0
   203  0.70845836E-03     0   199   131   126     0     0
   203  0.21253752E-02     0   199     2     7     0     0
   203  0.21253752E-02     0   199     4     9     0     0
   203  0.26320025E-04     0   200   122   128     0     0
   203  0.26320025E-04     0   200   124   130     0     0
   203  0.26320025E-04     0   200   126   132     0     0
   203  0.13246605E-04     0   200   121   127     0     0
   203  0.13246605E-04     0   200   123   129     0     0
   203  0.13246605E-04     0   200   125   131     0     0
   203  0.45381748E-04     0   200     2     8     0     0
   203  0.45381748E-04     0   200     4    10     0     0
   203  0.58462869E-04     0   200     1     7     0     0
   203  0.58462869E-04     0   200     3     9     0     0
   203  0.58462869E-04     0   200     5    11     0     0
  23
   204  0.31932046E-04     0   123   129     0     0     0
   204  0.91456575E-02     0   125   131     0     0     0
   204  0.37433422E-03     0     3     9     0     0     0
   204  0.92299066E-01     0     5    11     0     0     0
   204  0.16948659E-04     0     4    10     0     0     0
   204  0.77342790E+00     0     6    12     0     0     0
   204  0.45295994E-03     0    13    13     0     0     0
   204  0.18697677E-02     0   198   199     0     0     0
   204  0.94933360E-03     0   200   200     0     0     0
   204  0.19742001E-02     0   450   450     0     0     0
   204  0.11095739E-01     0   450   451     0     0     0
   204  0.62893383E-01     0   450   452     0     0     0
   204  0.82598124E-02     0   450   453     0     0     0
   204  0.80603370E-02     0   451   451     0     0     0
   204  0.17070260E-01     0   454   456     0     0     0
   204  0.80782799E-02     0   203   203     0     0     0
   204  0.35418911E-03     0   425   431     0     0     0
   204  0.26560968E-03     0   437   443     0     0     0
   204  0.35415994E-03     0   427   433     0     0     0
   204  0.26558444E-03     0   439   445     0     0     0
   204  0.25848098E-03     0   429   435     0     0     0
   204  0.12510315E-02     0   426   432     0     0     0
   204  0.12510315E-02     0   428   434     0     0     0
  14
   205  0.27698989E-04     0   123   129     0     0     0
   205  0.79333642E-02     0   125   131     0     0     0
   205  0.32473158E-03     0     3     9     0     0     0
   205  0.80145270E-01     0     5    11     0     0     0
   205  0.14157643E-04     0     4    10     0     0     0
   205  0.71735734E+00     0     6    12     0     0     0
   205  0.41894743E-03     0    13    13     0     0     0
   205  0.25955504E-02     0   450   450     0     0     0
   205  0.20544035E-01     0   450   451     0     0     0
   205  0.88063264E-02     0   450   452     0     0     0
   205  0.43287966E-01     0   450   453     0     0     0
   205  0.37743069E-01     0   451   451     0     0     0
   205  0.79221055E-01     0   454   456     0     0     0
   205  0.15804832E-02     0   203   200     0     0     0
  10
   206  0.37752903E-04     0   124   129     0     0     0
   206  0.10812943E-01     0   126   131     0     0     0
   206  0.42454244E-03     0     4     9     0     0     0
   206  0.87755376E+00     0     6    11     0     0     0
   206  0.40051550E-01     0   454   450     0     0     0
   206  0.19277802E-04     0   454   451     0     0     0
   206  0.65525293E-01     0   455   450     0     0     0
   206  0.21586320E-02     0   203   198     0     0     0
   206  0.17081524E-02     0   431   426     0     0     0
   206  0.17081030E-02     0   433   428     0     0     0
  10
   207  0.37752903E-04     0   130   123     0     0     0
   207  0.10812943E-01     0   132   125     0     0     0
   207  0.42454244E-03     0    10     3     0     0     0
   207  0.87755376E+00     0    12     5     0     0     0
   207  0.40051550E-01     0   456   450     0     0     0
   207  0.19277802E-04     0   456   451     0     0     0
   207  0.65525293E-01     0   457   450     0     0     0
   207  0.21586320E-02     0   203   199     0     0     0
   207  0.17081524E-02     0   425   432     0     0     0
   207  0.17081030E-02     0   427   434     0     0     0
   0
   5
     6  0.33333334E+00   100     2     7     5     0     0
     6  0.33333334E+00   100     4     9     5     0     0
     6  0.11111111E+00   100   122   127     5     0     0
     6  0.11111111E+00   100   124   129     5     0     0
     6  0.11111111E+00   100   126   131     5     0     0
   5
    12  0.33333334E+00   100     8     1    11     0     0
    12  0.33333334E+00   100    10     3    11     0     0
    12  0.11111111E+00   100   128   121    11     0     0
    12  0.11111111E+00   100   130   123    11     0     0
    12  0.11111111E+00   100   132   125    11     0     0
      4.00000000     -0.24957046
      0.99783224     -0.00948713      0.06105863     -0.02264904
     -0.02159280     -0.98076910      0.15958039     -0.11027168
      0.02671548     -0.03565336     -0.70476848     -0.70803690
     -0.05613527      0.19165301      0.68855423     -0.69714487
     -0.98753667      0.15738915     -0.15738915     -0.98753667
     -0.97385818      0.22715689     -0.22715689     -0.97385818
      1.57073224     -1.57079589     -1.57079637
    187.50000000   3000.00000000   3000.00000000
    750.00000000
    T
