#  ISAJET SUSY parameters in SUSY Les Houches Accord 2 format
#  Created by ISALHA 2.0 Last revision: C. Balazs 21 Apr 2009
Block SPINFO   # Program information
     1   ISASUGRA from ISAJET          # Spectrum Calculator
     2   7.80   29-OCT-2009 12:50:36   # Version number
Block MODSEL   # Model selection
     1     1   # Minimal supergravity (mSUGRA) model               
Block SMINPUTS   # Standard Model inputs
     1     1.27837868E+02   # alpha_em^(-1)
     2     1.16570000E-05   # G_Fermi
     3     1.17200002E-01   # alpha_s(M_Z)
     4     9.11699982E+01   # m_{Z}(pole)
     5     4.19999981E+00   # m_{b}(m_{b})
     6     1.72500000E+02   # m_{top}(pole)
     7     1.77699995E+00   # m_{tau}(pole)
Block MINPAR   # SUSY breaking input parameters
     1     3.60000000E+02   # m_0
     2     1.00000000E+02   # m_{1/2}
     3     4.00000000E+01   # tan(beta)
     4     1.00000000E+00   # sign(mu)
     5     0.00000000E+00   # A_0
Block EXTPAR   # Non-universal SUSY breaking parameters
     0     3.06780623E+16   # Input scale
Block MASS   # Scalar and gaugino mass spectrum
#  PDG code   mass                 particle
        24     8.04229965E+01   #  W^+
        25     1.03215645E+02   #  h^0            
        35     2.64397461E+02   #  H^0            
        36     2.62639862E+02   #  A^0            
        37     2.77391785E+02   #  H^+            
   1000001     4.30444275E+02   #  dnl            
   1000002     4.22817078E+02   #  upl            
   1000003     4.30444336E+02   #  stl            
   1000004     4.22819275E+02   #  chl            
   1000005     3.30308380E+02   #  b1             
   1000006     2.86674896E+02   #  t1             
   1000011     3.67943970E+02   #  el-            
   1000012     3.58896851E+02   #  nuel           
   1000013     3.67943970E+02   #  mul-           
   1000014     3.58896851E+02   #  numl           
   1000015     2.97314392E+02   #  tau1           
   1000016     3.30117188E+02   #  nutl           
   1000021     2.84918213E+02   #  glss           
   1000022     3.33714142E+01   #  z1ss           
   1000023     5.90140648E+01   #  z2ss           
   1000024     5.67176056E+01   #  w1ss           
   1000025    -1.56965973E+02   #  z3ss           
   1000035     1.83647552E+02   #  z4ss           
   1000037     1.85984665E+02   #  w2ss           
   2000001     4.24438019E+02   #  dnr            
   2000002     4.22343872E+02   #  upr            
   2000003     4.24438080E+02   #  str            
   2000004     4.22346069E+02   #  chr            
   2000005     3.82302490E+02   #  b2             
   2000006     3.89891388E+02   #  t2             
   2000011     3.64000885E+02   #  er-            
   2000013     3.64000885E+02   #  mur-           
   2000015     3.45313477E+02   #  tau2           
Block ALPHA   # Effective Higgs mixing parameter
         -3.00338175E-02   # alpha
Block STOPMIX   # stop mixing matrix
  1  1     4.98850286E-01   # O_{11}
  1  2     8.66688192E-01   # O_{12}
  2  1    -8.66688192E-01   # O_{21}
  2  2     4.98850286E-01   # O_{22}
Block SBOTMIX   # sbottom mixing matrix
  1  1     9.14339066E-01   # O_{11}
  1  2     4.04949516E-01   # O_{12}
  2  1    -4.04949516E-01   # O_{21}
  2  2     9.14339066E-01   # O_{22}
Block STAUMIX   # stau mixing matrix
  1  1     3.57509315E-01   # O_{11}
  1  2     9.33909595E-01   # O_{12}
  2  1    -9.33909595E-01   # O_{21}
  2  2     3.57509315E-01   # O_{22}
Block NMIX   # neutralino mixing matrix
  1  1    -8.67214620E-01   #
  1  2     2.28799254E-01   #
  1  3    -4.27401096E-01   #
  1  4     1.13657385E-01   #
  2  1    -4.26187366E-01   #
  2  2    -7.95763910E-01   #
  2  3     3.91018420E-01   #
  2  4    -1.79523617E-01   #
  3  1    -1.56707600E-01   #
  3  2     2.33115271E-01   #
  3  3     6.34295106E-01   #
  3  4     7.20256686E-01   #
  4  1     2.04317436E-01   #
  4  2    -5.09968519E-01   #
  4  3    -5.11959910E-01   #
  4  4     6.60365880E-01   #
Block UMIX   # chargino U mixing matrix
  1  1    -7.20203221E-01   # U_{11}
  1  2     6.93763196E-01   # U_{12}
  2  1    -6.93763196E-01   # U_{21}
  2  2    -7.20203221E-01   # U_{22}
Block VMIX   # chargino V mixing matrix
  1  1    -9.51937497E-01   # V_{11}
  1  2     3.06292415E-01   # V_{12}
  2  1    -3.06292415E-01   # V_{21}
  2  2    -9.51937497E-01   # V_{22}
Block GAUGE Q=  2.93046295E+02   #
     1     3.57522368E-01   # g`
     2     6.52376711E-01   # g_2
     3     1.21923625E+00   # g_3
Block YU Q=  2.93046295E+02   #
  3  3     9.01153922E-01   # y_t
Block YD Q=  2.93046295E+02   #
  3  3     5.44252932E-01   # y_b
Block YE Q=  2.93046295E+02   #
  3  3     4.10117775E-01   # y_tau
Block HMIX Q=  2.93046295E+02   # Higgs mixing parameters
     1     1.38899948E+02   # mu(Q)
     2     4.00000000E+01   # tan(beta)(M_GUT)
     3     2.49957092E+02   # Higgs vev at Q
     4     6.89796953E+04   # m_A^2(Q)
Block MSOFT Q=  2.93046295E+02   # DRbar SUSY breaking parameters
     1     3.97450867E+01   # M_1(Q)          
     2     7.61353455E+01   # M_2(Q)          
     3     2.50751007E+02   # M_3(Q)          
    31     3.64282013E+02   # MeL(Q)          
    32     3.64282013E+02   # MmuL(Q)         
    33     3.36268555E+02   # MtauL(Q)        
    34     3.61102325E+02   # MeR(Q)          
    35     3.61102325E+02   # MmuR(Q)         
    36     3.01369110E+02   # MtauR(Q)        
    41     4.13927765E+02   # MqL1(Q)         
    42     4.13927765E+02   # MqL2(Q)         
    43     3.23269989E+02   # MqL3(Q)         
    44     4.11535553E+02   # MuR(Q)          
    45     4.11535553E+02   # McR(Q)          
    46     2.65648315E+02   # MtR(Q)          
    47     4.11306274E+02   # MdR(Q)          
    48     4.11306274E+02   # MsR(Q)          
    49     3.64483826E+02   # MbR(Q)          
Block AU Q=  2.93046295E+02   #
  1  1    -1.91554825E+02   # A_u
  2  2    -1.91554825E+02   # A_c
  3  3    -1.91554825E+02   # A_t
Block AD Q=  2.93046295E+02   #
  1  1    -2.55580536E+02   # A_d
  2  2    -2.55580536E+02   # A_s
  3  3    -2.55580536E+02   # A_b
Block AE Q=  2.93046295E+02   #
  1  1    -3.32103996E+01   # A_e
  2  2    -3.32103996E+01   # A_mu
  3  3    -3.32103996E+01   # A_tau
#  ISAJET decay tables in SUSY Les Houches accord format
#  Created by ISALHD. Last revision: C. Balazs, 2005 May 25
Block DCINFO                           # Program information
     1   ISASUGRA from ISAJET          # Spectrum Calculator
     2   7.80   29-OCT-2009 12:50:36   # Version number
#         PDG         Width
DECAY         6  1.14680779E+00   # TP    decays
#          BR          NDA       ID1       ID2       ID3       ID4
      3.33333343E-01    3            2        -1         5             # TP     -->  UP     DB     BT          
      3.33333343E-01    3            4        -3         5             # TP     -->  CH     SB     BT          
      1.11111112E-01    3          -11        12         5             # TP     -->  E+     NUE    BT          
      1.11111112E-01    3          -13        14         5             # TP     -->  MU+    NUM    BT          
      1.11111112E-01    3          -15        16         5             # TP     -->  TAU+   NUT    BT          
#         PDG         Width
DECAY   1000021  4.85635735E-03   # GLSS  decays
#          BR          NDA       ID1       ID2       ID3       ID4
      7.39131346E-02    3      1000024         1        -2             # GLSS   -->  W1SS+  DN     UB          
      7.39131346E-02    3     -1000024         2        -1             # GLSS   -->  W1SS-  UP     DB          
      7.39118755E-02    3      1000024         3        -4             # GLSS   -->  W1SS+  ST     CB          
      7.39118755E-02    3     -1000024         4        -3             # GLSS   -->  W1SS-  CH     SB          
      6.93128165E-03    3      1000024         5        -6             # GLSS   -->  W1SS+  BT     TB          
      6.93128165E-03    3     -1000024         6        -5             # GLSS   -->  W1SS-  TP     BB          
      1.98749290E-03    3      1000037         1        -2             # GLSS   -->  W2SS+  DN     UB          
      1.98749290E-03    3     -1000037         2        -1             # GLSS   -->  W2SS-  UP     DB          
      1.98747567E-03    3      1000037         3        -4             # GLSS   -->  W2SS+  ST     CB          
      1.98747567E-03    3     -1000037         4        -3             # GLSS   -->  W2SS-  CH     SB          
      2.14863941E-03    2      1000022        21                       # GLSS   -->  Z1SS   GL                 
      2.44450886E-02    3      1000022         2        -2             # GLSS   -->  Z1SS   UP     UB          
      1.40572302E-02    3      1000022         1        -1             # GLSS   -->  Z1SS   DN     DB          
      1.40572200E-02    3      1000022         3        -3             # GLSS   -->  Z1SS   ST     SB          
      2.44444478E-02    3      1000022         4        -4             # GLSS   -->  Z1SS   CH     CB          
      1.78607494E-01    3      1000022         5        -5             # GLSS   -->  Z1SS   BT     BB          
      4.26788768E-03    2      1000023        21                       # GLSS   -->  Z2SS   GL                 
      4.59408201E-02    3      1000023         2        -2             # GLSS   -->  Z2SS   UP     UB          
      2.63478421E-02    3      1000023         1        -1             # GLSS   -->  Z2SS   DN     DB          
      2.63478253E-02    3      1000023         3        -3             # GLSS   -->  Z2SS   ST     SB          
      4.59395945E-02    3      1000023         4        -4             # GLSS   -->  Z2SS   CH     CB          
      1.94651008E-01    3      1000023         5        -5             # GLSS   -->  Z2SS   BT     BB          
      1.50367664E-02    2      1000025        21                       # GLSS   -->  Z3SS   GL                 
      2.30546546E-04    3      1000025         2        -2             # GLSS   -->  Z3SS   UP     UB          
      2.72291305E-04    3      1000025         1        -1             # GLSS   -->  Z3SS   DN     DB          
      2.72291101E-04    3      1000025         3        -3             # GLSS   -->  Z3SS   ST     SB          
      2.30539517E-04    3      1000025         4        -4             # GLSS   -->  Z3SS   CH     CB          
      3.83930542E-02    3      1000025         5        -5             # GLSS   -->  Z3SS   BT     BB          
      6.44788099E-03    2      1000035        21                       # GLSS   -->  Z4SS   GL                 
      1.09805271E-03    3      1000035         2        -2             # GLSS   -->  Z4SS   UP     UB          
      1.23030413E-03    3      1000035         1        -1             # GLSS   -->  Z4SS   DN     DB          
      1.23030320E-03    3      1000035         3        -3             # GLSS   -->  Z4SS   ST     SB          
      1.09801919E-03    3      1000035         4        -4             # GLSS   -->  Z4SS   CH     CB          
      1.57422014E-02    3      1000035         5        -5             # GLSS   -->  Z4SS   BT     BB          
#         PDG         Width
DECAY   1000002  1.34473276E+01   # UPL   decays
#          BR          NDA       ID1       ID2       ID3       ID4
      6.38994505E-04    2      1000022         2                       # UPL    -->  Z1SS   UP                 
      9.71648246E-02    2      1000023         2                       # UPL    -->  Z2SS   UP                 
      4.11065528E-03    2      1000025         2                       # UPL    -->  Z3SS   UP                 
      1.94541048E-02    2      1000035         2                       # UPL    -->  Z4SS   UP                 
      6.31163478E-01    2      1000021         2                       # UPL    -->  GLSS   UP                 
      2.31314927E-01    2      1000024         1                       # UPL    -->  W1SS+  DN                 
      1.61530711E-02    2      1000037         1                       # UPL    -->  W2SS+  DN                 
#         PDG         Width
DECAY   1000001  1.37272406E+01   # DNL   decays
#          BR          NDA       ID1       ID2       ID3       ID4
      1.95999034E-02    2      1000022         1                       # DNL    -->  Z1SS   DN                 
      6.54530302E-02    2      1000023         1                       # DNL    -->  Z2SS   DN                 
      6.80189300E-03    2      1000025         1                       # DNL    -->  Z3SS   DN                 
      2.64627188E-02    2      1000035         1                       # DNL    -->  Z4SS   DN                 
      6.65425062E-01    2      1000021         1                       # DNL    -->  GLSS   DN                 
      1.32212624E-01    2     -1000024         2                       # DNL    -->  W1SS-  UP                 
      8.40447918E-02    2     -1000037         2                       # DNL    -->  W2SS-  UP                 
#         PDG         Width
DECAY   1000003  1.37271757E+01   # STL   decays
#          BR          NDA       ID1       ID2       ID3       ID4
      1.96000002E-02    2      1000022         3                       # STL    -->  Z1SS   ST                 
      6.54533505E-02    2      1000023         3                       # STL    -->  Z2SS   ST                 
      6.80192653E-03    2      1000025         3                       # STL    -->  Z3SS   ST                 
      2.64628474E-02    2      1000035         3                       # STL    -->  Z4SS   ST                 
      6.65428579E-01    2      1000021         3                       # STL    -->  GLSS   ST                 
      1.32210582E-01    2     -1000024         4                       # STL    -->  W1SS-  CH                 
      8.40427130E-02    2     -1000037         4                       # STL    -->  W2SS-  CH                 
#         PDG         Width
DECAY   1000004  1.34469280E+01   # CHL   decays
#          BR          NDA       ID1       ID2       ID3       ID4
      6.39003760E-04    2      1000022         4                       # CHL    -->  Z1SS   CH                 
      9.71661955E-02    2      1000023         4                       # CHL    -->  Z2SS   CH                 
      4.11069952E-03    2      1000025         4                       # CHL    -->  Z3SS   CH                 
      1.94542762E-02    2      1000035         4                       # CHL    -->  Z4SS   CH                 
      6.31152987E-01    2      1000021         4                       # CHL    -->  GLSS   CH                 
      2.31323093E-01    2      1000024         3                       # CHL    -->  W1SS+  ST                 
      1.61537156E-02    2      1000037         3                       # CHL    -->  W2SS+  ST                 
#         PDG         Width
DECAY   1000005  5.21273613E+00   # BT1   decays
#          BR          NDA       ID1       ID2       ID3       ID4
      1.73190415E-01    2      1000022         5                       # BT1    -->  Z1SS   BT                 
      2.09883273E-01    2      1000023         5                       # BT1    -->  Z2SS   BT                 
      7.17245489E-02    2      1000025         5                       # BT1    -->  Z3SS   BT                 
      4.42016236E-02    2      1000035         5                       # BT1    -->  Z4SS   BT                 
      3.07323903E-01    2      1000021         5                       # BT1    -->  GLSS   BT                 
      1.93676218E-01    2     -1000024         6                       # BT1    -->  W1SS-  TP                 
#         PDG         Width
DECAY   1000006  3.02412820E+00   # TP1   decays
#          BR          NDA       ID1       ID2       ID3       ID4
      6.38908222E-02    2      1000022         6                       # TP1    -->  Z1SS   TP                 
      7.91162997E-02    2      1000023         6                       # TP1    -->  Z2SS   TP                 
      5.80069959E-01    2      1000024         5                       # TP1    -->  W1SS+  BT                 
      2.76922852E-01    2      1000037         5                       # TP1    -->  W2SS+  BT                 
#         PDG         Width
DECAY   2000002  9.36685181E+00   # UPR   decays
#          BR          NDA       ID1       ID2       ID3       ID4
      7.57010877E-02    2      1000022         2                       # UPR    -->  Z1SS   UP                 
      1.77976862E-02    2      1000023         2                       # UPR    -->  Z2SS   UP                 
      1.85932545E-03    2      1000025         2                       # UPR    -->  Z3SS   UP                 
      2.79807462E-03    2      1000035         2                       # UPR    -->  Z4SS   UP                 
      9.01843786E-01    2      1000021         2                       # UPR    -->  GLSS   UP                 
#         PDG         Width
DECAY   2000001  8.85575676E+00   # DNR   decays
#          BR          NDA       ID1       ID2       ID3       ID4
      2.01192554E-02    2      1000022         1                       # DNR    -->  Z1SS   DN                 
      4.73140273E-03    2      1000023         1                       # DNR    -->  Z2SS   DN                 
      4.95656335E-04    2      1000025         1                       # DNR    -->  Z3SS   DN                 
      7.46975886E-04    2      1000035         1                       # DNR    -->  Z4SS   DN                 
      9.73906636E-01    2      1000021         1                       # DNR    -->  GLSS   DN                 
#         PDG         Width
DECAY   2000003  8.85576153E+00   # STR   decays
#          BR          NDA       ID1       ID2       ID3       ID4
      2.01192461E-02    2      1000022         3                       # STR    -->  Z1SS   ST                 
      4.73140040E-03    2      1000023         3                       # STR    -->  Z2SS   ST                 
      4.95656219E-04    2      1000025         3                       # STR    -->  Z3SS   ST                 
      7.46975827E-04    2      1000035         3                       # STR    -->  Z4SS   ST                 
      9.73906696E-01    2      1000021         3                       # STR    -->  GLSS   ST                 
#         PDG         Width
DECAY   2000004  9.36644363E+00   # CHR   decays
#          BR          NDA       ID1       ID2       ID3       ID4
      7.57032186E-02    2      1000022         4                       # CHR    -->  Z1SS   CH                 
      1.77981891E-02    2      1000023         4                       # CHR    -->  Z2SS   CH                 
      1.85937108E-03    2      1000025         4                       # CHR    -->  Z3SS   CH                 
      2.79813819E-03    2      1000035         4                       # CHR    -->  Z4SS   CH                 
      9.01841044E-01    2      1000021         4                       # CHR    -->  GLSS   CH                 
#         PDG         Width
DECAY   2000005  8.10156536E+00   # BT2   decays
#          BR          NDA       ID1       ID2       ID3       ID4
      1.98416132E-02    2      1000022         5                       # BT2    -->  Z1SS   BT                 
      2.41825394E-02    2      1000023         5                       # BT2    -->  Z2SS   BT                 
      1.03261359E-01    2      1000025         5                       # BT2    -->  Z3SS   BT                 
      8.36196542E-02    2      1000035         5                       # BT2    -->  Z4SS   BT                 
      6.13700509E-01    2      1000021         5                       # BT2    -->  GLSS   BT                 
      2.38451958E-02    2     -1000024         6                       # BT2    -->  W1SS-  TP                 
      1.29169136E-01    2     -1000037         6                       # BT2    -->  W2SS-  TP                 
      2.37997342E-03    2          -24   1000006                       # BT2    -->  W-     TP1                
#         PDG         Width
DECAY   2000006  6.92147636E+00   # TP2   decays
#          BR          NDA       ID1       ID2       ID3       ID4
      2.86260098E-01    2      1000024         5                       # TP2    -->  W1SS+  BT                 
      3.21382433E-01    2      1000037         5                       # TP2    -->  W2SS+  BT                 
      5.12904394E-03    2           23   1000006                       # TP2    -->  Z0     TP1                
      7.44549325E-05    2           25   1000006                       # TP2    -->  HL0    TP1                
      2.53931922E-03    2      1000022         6                       # TP2    -->  Z1SS   TP                 
      6.54137284E-02    2      1000023         6                       # TP2    -->  Z2SS   TP                 
      7.68781528E-02    2      1000025         6                       # TP2    -->  Z3SS   TP                 
      2.42322758E-01    2      1000035         6                       # TP2    -->  Z4SS   TP                 
#         PDG         Width
DECAY   1000011  4.17136765E+00   # EL-   decays
#          BR          NDA       ID1       ID2       ID3       ID4
      2.24328358E-02    2      1000022        11                       # EL-    -->  Z1SS   E-                 
      3.73902112E-01    2      1000023        11                       # EL-    -->  Z2SS   E-                 
      5.36761573E-03    2      1000025        11                       # EL-    -->  Z3SS   E-                 
      3.31059657E-02    2      1000035        11                       # EL-    -->  Z4SS   E-                 
      3.67085636E-01    2     -1000024        12                       # EL-    -->  W1SS-  NUE                
      1.98105827E-01    2     -1000037        12                       # EL-    -->  W2SS-  NUE                
#         PDG         Width
DECAY   1000013  4.17136717E+00   # MUL-  decays
#          BR          NDA       ID1       ID2       ID3       ID4
      2.24328302E-02    2      1000022        13                       # MUL-   -->  Z1SS   MU-                
      3.73902053E-01    2      1000023        13                       # MUL-   -->  Z2SS   MU-                
      5.36761433E-03    2      1000025        13                       # MUL-   -->  Z3SS   MU-                
      3.31059583E-02    2      1000035        13                       # MUL-   -->  Z4SS   MU-                
      3.67085695E-01    2     -1000024        14                       # MUL-   -->  W1SS-  NUM                
      1.98105857E-01    2     -1000037        14                       # MUL-   -->  W2SS-  NUM                
#         PDG         Width
DECAY   1000015  3.30105472E+00   # TAU1- decays
#          BR          NDA       ID1       ID2       ID3       ID4
      4.16260093E-01    2      1000022        15                       # TAU1-  -->  Z1SS   TAU-               
      2.03524545E-01    2      1000023        15                       # TAU1-  -->  Z2SS   TAU-               
      4.54138704E-02    2      1000025        15                       # TAU1-  -->  Z3SS   TAU-               
      1.21922931E-02    2      1000035        15                       # TAU1-  -->  Z4SS   TAU-               
      3.13741267E-01    2     -1000024        16                       # TAU1-  -->  W1SS-  NUT                
      8.86800047E-03    2     -1000037        16                       # TAU1-  -->  W2SS-  NUT                
#         PDG         Width
DECAY   1000012  4.36379719E+00   # NUEL  decays
#          BR          NDA       ID1       ID2       ID3       ID4
      1.69314176E-01    2      1000022        12                       # NUEL   -->  Z1SS   NUE                
      1.03334002E-01    2      1000023        12                       # NUEL   -->  Z2SS   NUE                
      2.30760220E-02    2      1000025        12                       # NUEL   -->  Z3SS   NUE                
      7.30421320E-02    2      1000035        12                       # NUEL   -->  Z4SS   NUE                
      5.96480250E-01    2      1000024        11                       # NUEL   -->  W1SS+  E-                 
      3.47533338E-02    2      1000037        11                       # NUEL   -->  W2SS+  E-                 
#         PDG         Width
DECAY   1000014  4.36379671E+00   # NUML  decays
#          BR          NDA       ID1       ID2       ID3       ID4
      1.69314191E-01    2      1000022        14                       # NUML   -->  Z1SS   NUM                
      1.03334017E-01    2      1000023        14                       # NUML   -->  Z2SS   NUM                
      2.30760258E-02    2      1000025        14                       # NUML   -->  Z3SS   NUM                
      7.30421394E-02    2      1000035        14                       # NUML   -->  Z4SS   NUM                
      5.96480191E-01    2      1000024        13                       # NUML   -->  W1SS+  MU-                
      3.47533301E-02    2      1000037        13                       # NUML   -->  W2SS+  MU-                
#         PDG         Width
DECAY   1000016  4.69534206E+00   # NUTL  decays
#          BR          NDA       ID1       ID2       ID3       ID4
      1.44281179E-01    2      1000022        16                       # NUTL   -->  Z1SS   NUT                
      8.74451697E-02    2      1000023        16                       # NUTL   -->  Z2SS   NUT                
      1.80653427E-02    2      1000025        16                       # NUTL   -->  Z3SS   NUT                
      5.46406545E-02    2      1000035        16                       # NUTL   -->  Z4SS   NUT                
      6.11718535E-01    2      1000024        15                       # NUTL   -->  W1SS+  TAU-               
      8.38466510E-02    2      1000037        15                       # NUTL   -->  W2SS+  TAU-               
      2.82179599E-07    3      1000015        16       -15             # NUTL   -->  TAU1-  NUT    TAU+        
      2.82179599E-07    3      1000015        12       -11             # NUTL   -->  TAU1-  NUE    E+          
      2.82179599E-07    3      1000015        14       -13             # NUTL   -->  TAU1-  NUM    MU+         
      8.46538796E-07    3      1000015         2        -1             # NUTL   -->  TAU1-  UP     DB          
      8.46538796E-07    3      1000015         4        -3             # NUTL   -->  TAU1-  CH     SB          
#         PDG         Width
DECAY   2000011  1.76097429E+00   # ER-   decays
#          BR          NDA       ID1       ID2       ID3       ID4
      7.77445436E-01    2      1000022        11                       # ER-    -->  Z1SS   E-                 
      1.81056082E-01    2      1000023        11                       # ER-    -->  Z2SS   E-                 
      1.71090532E-02    2      1000025        11                       # ER-    -->  Z3SS   E-                 
      2.43894104E-02    2      1000035        11                       # ER-    -->  Z4SS   E-                 
#         PDG         Width
DECAY   2000013  1.76097405E+00   # MUR-  decays
#          BR          NDA       ID1       ID2       ID3       ID4
      7.77445436E-01    2      1000022        13                       # MUR-   -->  Z1SS   MU-                
      1.81056112E-01    2      1000023        13                       # MUR-   -->  Z2SS   MU-                
      1.71090513E-02    2      1000025        13                       # MUR-   -->  Z3SS   MU-                
      2.43894085E-02    2      1000035        13                       # MUR-   -->  Z4SS   MU-                
#         PDG         Width
DECAY   2000015  4.01524401E+00   # TAU2- decays
#          BR          NDA       ID1       ID2       ID3       ID4
      4.82699014E-02    2      1000022        15                       # TAU2-  -->  Z1SS   TAU-               
      3.21745038E-01    2      1000023        15                       # TAU2-  -->  Z2SS   TAU-               
      1.05631329E-01    2      1000025        15                       # TAU2-  -->  Z3SS   TAU-               
      1.02190405E-01    2      1000035        15                       # TAU2-  -->  Z4SS   TAU-               
      1.82246625E-01    2     -1000024        16                       # TAU2-  -->  W1SS-  NUT                
      2.39916682E-01    2     -1000037        16                       # TAU2-  -->  W2SS-  NUT                
#         PDG         Width
DECAY   1000023  3.82961446E-07   # Z2SS  decays
#          BR          NDA       ID1       ID2       ID3       ID4
      8.84062238E-03    2      1000022        22                       # Z2SS   -->  Z1SS   GM                 
      1.65607431E-04    3     -1000024         2        -1             # Z2SS   -->  W1SS-  UP     DB          
      5.52024794E-05    3     -1000024        12       -11             # Z2SS   -->  W1SS-  NUE    E+          
      5.52024794E-05    3     -1000024        14       -13             # Z2SS   -->  W1SS-  NUM    MU+         
      1.65607431E-04    3      1000024         1        -2             # Z2SS   -->  W1SS+  DN     UB          
      5.52024794E-05    3      1000024        11       -12             # Z2SS   -->  W1SS+  E-     ANUE        
      5.52024794E-05    3      1000024        13       -14             # Z2SS   -->  W1SS+  MU-    ANUM        
      1.18374608E-01    3      1000022         2        -2             # Z2SS   -->  Z1SS   UP     UB          
      1.71530515E-01    3      1000022         1        -1             # Z2SS   -->  Z1SS   DN     DB          
      1.71530515E-01    3      1000022         3        -3             # Z2SS   -->  Z1SS   ST     SB          
      1.18374579E-01    3      1000022         4        -4             # Z2SS   -->  Z1SS   CH     CB          
      1.80952862E-01    3      1000022         5        -5             # Z2SS   -->  Z1SS   BT     BB          
      2.09573638E-02    3      1000022        11       -11             # Z2SS   -->  Z1SS   E-     E+          
      2.09573638E-02    3      1000022        13       -13             # Z2SS   -->  Z1SS   MU-    MU+         
      3.77784409E-02    3      1000022        15       -15             # Z2SS   -->  Z1SS   TAU-   TAU+        
      5.09889051E-02    3      1000022        12       -12             # Z2SS   -->  Z1SS   NUE    ANUE        
      5.09889051E-02    3      1000022        14       -14             # Z2SS   -->  Z1SS   NUM    ANUM        
      4.81732339E-02    3      1000022        16       -16             # Z2SS   -->  Z1SS   NUT    ANUT        
#         PDG         Width
DECAY   1000025  2.81801343E-01   # Z3SS  decays
#          BR          NDA       ID1       ID2       ID3       ID4
      5.20517460E-07    2      1000022        22                       # Z3SS   -->  Z1SS   GM                 
      1.28766260E-07    2      1000023        22                       # Z3SS   -->  Z2SS   GM                 
      3.77137035E-01    2      1000024       -24                       # Z3SS   -->  W1SS+  W-                 
      3.77137035E-01    2     -1000024        24                       # Z3SS   -->  W1SS-  W+                 
      1.93400964E-01    2      1000022        23                       # Z3SS   -->  Z1SS   Z0                 
      2.45094728E-02    2      1000023        23                       # Z3SS   -->  Z2SS   Z0                 
      4.75153357E-08    3      1000022         2        -2             # Z3SS   -->  Z1SS   UP     UB          
      8.43993959E-08    3      1000022         1        -1             # Z3SS   -->  Z1SS   DN     DB          
      8.43993604E-08    3      1000022         3        -3             # Z3SS   -->  Z1SS   ST     SB          
      4.75142663E-08    3      1000022         4        -4             # Z3SS   -->  Z1SS   CH     CB          
      2.62003468E-05    3      1000022         5        -5             # Z3SS   -->  Z1SS   BT     BB          
      1.54465511E-07    3      1000022        11       -11             # Z3SS   -->  Z1SS   E-     E+          
      1.54465511E-07    3      1000022        13       -13             # Z3SS   -->  Z1SS   MU-    MU+         
      1.13896112E-05    3      1000022        15       -15             # Z3SS   -->  Z1SS   TAU-   TAU+        
      2.95398422E-07    3      1000022        12       -12             # Z3SS   -->  Z1SS   NUE    ANUE        
      2.95398422E-07    3      1000022        14       -14             # Z3SS   -->  Z1SS   NUM    ANUM        
      4.29457941E-07    3      1000022        16       -16             # Z3SS   -->  Z1SS   NUT    ANUT        
      1.24272262E-07    3      1000023         2        -2             # Z3SS   -->  Z2SS   UP     UB          
      1.22614608E-07    3      1000023         1        -1             # Z3SS   -->  Z2SS   DN     DB          
      1.22614523E-07    3      1000023         3        -3             # Z3SS   -->  Z2SS   ST     SB          
      1.24269448E-07    3      1000023         4        -4             # Z3SS   -->  Z2SS   CH     CB          
      1.34895763E-05    3      1000023         5        -5             # Z3SS   -->  Z2SS   BT     BB          
      6.84740158E-08    3      1000023        11       -11             # Z3SS   -->  Z2SS   E-     E+          
      6.84740158E-08    3      1000023        13       -13             # Z3SS   -->  Z2SS   MU-    MU+         
      4.29285956E-06    3      1000023        15       -15             # Z3SS   -->  Z2SS   TAU-   TAU+        
      8.26863413E-08    3      1000023        12       -12             # Z3SS   -->  Z2SS   NUE    ANUE        
      8.26863413E-08    3      1000023        14       -14             # Z3SS   -->  Z2SS   NUM    ANUM        
      1.20966178E-07    3      1000023        16       -16             # Z3SS   -->  Z2SS   NUT    ANUT        
      2.77569462E-02    2      1000022        25                       # Z3SS   -->  Z1SS   HL0                
#         PDG         Width
DECAY   1000035  6.21846378E-01   # Z4SS  decays
#          BR          NDA       ID1       ID2       ID3       ID4
      1.11385141E-07    2      1000022        22                       # Z4SS   -->  Z1SS   GM                 
      1.08350442E-07    2      1000023        22                       # Z4SS   -->  Z2SS   GM                 
      4.53185258E-08    2      1000025        22                       # Z4SS   -->  Z3SS   GM                 
      4.12902892E-01    2      1000024       -24                       # Z4SS   -->  W1SS+  W-                 
      4.12902892E-01    2     -1000024        24                       # Z4SS   -->  W1SS-  W+                 
      6.32883161E-02    2      1000022        23                       # Z4SS   -->  Z1SS   Z0                 
      1.77294873E-02    2      1000023        23                       # Z4SS   -->  Z2SS   Z0                 
      1.77352803E-07    3      1000022         2        -2             # Z4SS   -->  Z1SS   UP     UB          
      7.34849323E-07    3      1000022         1        -1             # Z4SS   -->  Z1SS   DN     DB          
      7.34848925E-07    3      1000022         3        -3             # Z4SS   -->  Z1SS   ST     SB          
      1.77348781E-07    3      1000022         4        -4             # Z4SS   -->  Z1SS   CH     CB          
      1.00425104E-05    3      1000022         5        -5             # Z4SS   -->  Z1SS   BT     BB          
      6.20157039E-07    3      1000022        11       -11             # Z4SS   -->  Z1SS   E-     E+          
      6.20157039E-07    3      1000022        13       -13             # Z4SS   -->  Z1SS   MU-    MU+         
      5.27783595E-06    3      1000022        15       -15             # Z4SS   -->  Z1SS   TAU-   TAU+        
      2.31185822E-06    3      1000022        12       -12             # Z4SS   -->  Z1SS   NUE    ANUE        
      2.31185822E-06    3      1000022        14       -14             # Z4SS   -->  Z1SS   NUM    ANUM        
      3.39081771E-06    3      1000022        16       -16             # Z4SS   -->  Z1SS   NUT    ANUT        
      2.02124716E-06    3      1000023         2        -2             # Z4SS   -->  Z2SS   UP     UB          
      1.67132600E-06    3      1000023         1        -1             # Z4SS   -->  Z2SS   DN     DB          
      1.67132532E-06    3      1000023         3        -3             # Z4SS   -->  Z2SS   ST     SB          
      2.02120077E-06    3      1000023         4        -4             # Z4SS   -->  Z2SS   CH     CB          
      1.28826368E-05    3      1000023         5        -5             # Z4SS   -->  Z2SS   BT     BB          
      1.30443652E-06    3      1000023        11       -11             # Z4SS   -->  Z2SS   E-     E+          
      1.30443652E-06    3      1000023        13       -13             # Z4SS   -->  Z2SS   MU-    MU+         
      4.18070431E-06    3      1000023        15       -15             # Z4SS   -->  Z2SS   TAU-   TAU+        
      9.94910010E-07    3      1000023        12       -12             # Z4SS   -->  Z2SS   NUE    ANUE        
      9.94910010E-07    3      1000023        14       -14             # Z4SS   -->  Z2SS   NUM    ANUM        
      1.46909099E-06    3      1000023        16       -16             # Z4SS   -->  Z2SS   NUT    ANUT        
      1.46554135E-06    3      1000025         2        -2             # Z4SS   -->  Z3SS   UP     UB          
      1.94642962E-06    3      1000025         1        -1             # Z4SS   -->  Z3SS   DN     DB          
      1.94642962E-06    3      1000025         3        -3             # Z4SS   -->  Z3SS   ST     SB          
      1.46554146E-06    3      1000025         4        -4             # Z4SS   -->  Z3SS   CH     CB          
      1.47694755E-06    3      1000025         5        -5             # Z4SS   -->  Z3SS   BT     BB          
      4.40700774E-07    3      1000025        11       -11             # Z4SS   -->  Z3SS   E-     E+          
      4.40700774E-07    3      1000025        13       -13             # Z4SS   -->  Z3SS   MU-    MU+         
      4.68660289E-07    3      1000025        15       -15             # Z4SS   -->  Z3SS   TAU-   TAU+        
      8.37643711E-07    3      1000025        12       -12             # Z4SS   -->  Z3SS   NUE    ANUE        
      8.37643711E-07    3      1000025        14       -14             # Z4SS   -->  Z3SS   NUM    ANUM        
      8.31088244E-07    3      1000025        16       -16             # Z4SS   -->  Z3SS   NUT    ANUT        
      6.57089874E-02    2      1000022        25                       # Z4SS   -->  Z1SS   HL0                
      2.73982100E-02    2      1000023        25                       # Z4SS   -->  Z2SS   HL0                
#         PDG         Width
DECAY   1000024  2.13828139E-06   # W1SS+ decays
#          BR          NDA       ID1       ID2       ID3       ID4
      3.34066719E-01    3      1000022         2        -1             # W1SS+  -->  Z1SS   UP     DB          
      3.34066719E-01    3      1000022         4        -3             # W1SS+  -->  Z1SS   CH     SB          
      1.09086312E-01    3      1000022       -11        12             # W1SS+  -->  Z1SS   E+     NUE         
      1.09086312E-01    3      1000022       -13        14             # W1SS+  -->  Z1SS   MU+    NUM         
      1.13694035E-01    3      1000022       -15        16             # W1SS+  -->  Z1SS   TAU+   NUT         
#         PDG         Width
DECAY   1000037  4.58639681E-01   # W2SS+ decays
#          BR          NDA       ID1       ID2       ID3       ID4
      1.29720797E-06    3      1000022         2        -1             # W2SS+  -->  Z1SS   UP     DB          
      1.29720752E-06    3      1000022         4        -3             # W2SS+  -->  Z1SS   CH     SB          
      1.27001965E-06    3      1000022       -11        12             # W2SS+  -->  Z1SS   E+     NUE         
      1.27001965E-06    3      1000022       -13        14             # W2SS+  -->  Z1SS   MU+    NUM         
      1.00092420E-05    3      1000022       -15        16             # W2SS+  -->  Z1SS   TAU+   NUT         
      2.49457862E-02    2      1000022        24                       # W2SS+  -->  Z1SS   W+                 
      2.61112336E-06    3      1000023         2        -1             # W2SS+  -->  Z2SS   UP     DB          
      2.61111404E-06    3      1000023         4        -3             # W2SS+  -->  Z2SS   CH     SB          
      3.54774238E-06    3      1000023       -11        12             # W2SS+  -->  Z2SS   E+     NUE         
      3.54774238E-06    3      1000023       -13        14             # W2SS+  -->  Z2SS   MU+    NUM         
      2.42313108E-05    3      1000023       -15        16             # W2SS+  -->  Z2SS   TAU+   NUT         
      6.06435239E-01    2      1000023        24                       # W2SS+  -->  Z2SS   W+                 
      1.36462286E-05    3      1000025         2        -1             # W2SS+  -->  Z3SS   UP     DB          
      1.36462286E-05    3      1000025         4        -3             # W2SS+  -->  Z3SS   CH     SB          
      4.52805352E-06    3      1000025       -11        12             # W2SS+  -->  Z3SS   E+     NUE         
      4.52805352E-06    3      1000025       -13        14             # W2SS+  -->  Z3SS   MU+    NUM         
      4.67812606E-06    3      1000025       -15        16             # W2SS+  -->  Z3SS   TAU+   NUT         
      9.68936528E-11    3      1000035         2        -1             # W2SS+  -->  Z4SS   UP     DB          
      3.25010505E-11    3      1000035       -11        12             # W2SS+  -->  Z4SS   E+     NUE         
      3.25010505E-11    3      1000035       -13        14             # W2SS+  -->  Z4SS   MU+    NUM         
      3.32420098E-11    3      1000035       -15        16             # W2SS+  -->  Z4SS   TAU+   NUT         
      2.70692885E-01    2      1000024        23                       # W2SS+  -->  W1SS+  Z0                 
      2.26273187E-06    3      1000024         1        -1             # W2SS+  -->  W1SS+  DN     DB          
      2.26268003E-06    3      1000024         3        -3             # W2SS+  -->  W1SS+  ST     SB          
      6.13961174E-06    3      1000024         2        -2             # W2SS+  -->  W1SS+  UP     UB          
      6.13960810E-06    3      1000024         4        -4             # W2SS+  -->  W1SS+  CH     CB          
      4.14592387E-06    3      1000024        12       -12             # W2SS+  -->  W1SS+  NUE    ANUE        
      4.14592387E-06    3      1000024        14       -14             # W2SS+  -->  W1SS+  NUM    ANUM        
      1.15252642E-05    3      1000024        16       -16             # W2SS+  -->  W1SS+  NUT    ANUT        
      1.58384353E-06    3      1000024        11       -11             # W2SS+  -->  W1SS+  E-     E+          
      1.58384353E-06    3      1000024        13       -13             # W2SS+  -->  W1SS+  MU-    MU+         
      2.34789013E-06    3      1000024        15       -15             # W2SS+  -->  W1SS+  TAU-   TAU+        
      9.77912992E-02    2      1000024        25                       # W2SS+  -->  W1SS+  HL0                
#         PDG         Width
DECAY        25  9.54300538E-03   # HL0   decays
#          BR          NDA       ID1       ID2       ID3       ID4
      2.65359779E-09    2           11       -11                       # HL0    -->  E-     E+                 
      1.12038986E-04    2           13       -13                       # HL0    -->  MU-    MU+                
      3.20328288E-02    2           15       -15                       # HL0    -->  TAU-   TAU+               
      3.33605499E-06    2            1        -1                       # HL0    -->  DN     DB                 
      1.34793285E-03    2            3        -3                       # HL0    -->  ST     SB                 
      4.48679984E-01    2            5        -5                       # HL0    -->  BT     BB                 
      7.39157542E-07    2            2        -2                       # HL0    -->  UP     UB                 
      1.41493976E-02    2            4        -4                       # HL0    -->  CH     CB                 
      5.48995507E-04    2           22        22                       # HL0    -->  GM     GM                 
      1.26040578E-02    2           21        21                       # HL0    -->  GL     GL                 
      1.77448746E-04    3           24        11       -12             # HL0    -->  W+     E-     ANUE        
      1.77448746E-04    3           24        13       -14             # HL0    -->  W+     MU-    ANUM        
      1.77448746E-04    3           24        15       -16             # HL0    -->  W+     TAU-   ANUT        
      5.32346196E-04    3           24        -2         1             # HL0    -->  W+     UB     DN          
      5.32346196E-04    3           24        -4         3             # HL0    -->  W+     CB     ST          
      1.77448746E-04    3          -24       -11        12             # HL0    -->  W-     E+     NUE         
      1.77448746E-04    3          -24       -13        14             # HL0    -->  W-     MU+    NUM         
      1.77448746E-04    3          -24       -15        16             # HL0    -->  W-     TAU+   NUT         
      5.32346196E-04    3          -24         2        -1             # HL0    -->  W-     UP     DB          
      5.32346196E-04    3          -24         4        -3             # HL0    -->  W-     CH     SB          
      4.57580609E-06    3           23        12       -12             # HL0    -->  Z0     NUE    ANUE        
      4.57580609E-06    3           23        14       -14             # HL0    -->  Z0     NUM    ANUM        
      4.57580609E-06    3           23        16       -16             # HL0    -->  Z0     NUT    ANUT        
      2.30295723E-06    3           23        11       -11             # HL0    -->  Z0     E-     E+          
      2.30295723E-06    3           23        13       -13             # HL0    -->  Z0     MU-    MU+         
      2.30295723E-06    3           23        15       -15             # HL0    -->  Z0     TAU-   TAU+        
      7.88973648E-06    3           23         2        -2             # HL0    -->  Z0     UP     UB          
      7.88973648E-06    3           23         4        -4             # HL0    -->  Z0     CH     CB          
      1.01639234E-05    3           23         1        -1             # HL0    -->  Z0     DN     DB          
      1.01639234E-05    3           23         3        -3             # HL0    -->  Z0     ST     SB          
      1.01639234E-05    3           23         5        -5             # HL0    -->  Z0     BT     BB          
      3.21533501E-01    2      1000022   1000022                       # HL0    -->  Z1SS   Z1SS               
      1.65725961E-01    2      1000022   1000023                       # HL0    -->  Z1SS   Z2SS               
#         PDG         Width
DECAY        35  8.78859997E+00   # HH0   decays
#          BR          NDA       ID1       ID2       ID3       ID4
      8.17767898E-09    2           11       -11                       # HH0    -->  E-     E+                 
      3.45275999E-04    2           13       -13                       # HH0    -->  MU-    MU+                
      9.88656357E-02    2           15       -15                       # HH0    -->  TAU-   TAU+               
      1.01491232E-05    2            1        -1                       # HH0    -->  DN     DB                 
      4.10075858E-03    2            3        -3                       # HH0    -->  ST     SB                 
      7.20815182E-01    2            5        -5                       # HH0    -->  BT     BB                 
      1.83187948E-12    2            2        -2                       # HH0    -->  UP     UB                 
      3.05702059E-08    2            4        -4                       # HH0    -->  CH     CB                 
      2.52078518E-08    2           22        22                       # HH0    -->  GM     GM                 
      4.46744707E-05    2           21        21                       # HH0    -->  GL     GL                 
      1.01038822E-05    2           24       -24                       # HH0    -->  W+     W-                 
      4.48266746E-06    2           23        23                       # HH0    -->  Z0     Z0                 
      2.05077082E-02    2      1000022   1000022                       # HH0    -->  Z1SS   Z1SS               
      2.69531962E-02    2      1000022   1000023                       # HH0    -->  Z1SS   Z2SS               
      6.50155172E-03    2      1000022   1000025                       # HH0    -->  Z1SS   Z3SS               
      1.34712391E-04    2      1000022   1000035                       # HH0    -->  Z1SS   Z4SS               
      8.50111805E-03    2      1000023   1000023                       # HH0    -->  Z2SS   Z2SS               
      3.51646077E-03    2      1000023   1000025                       # HH0    -->  Z2SS   Z3SS               
      9.24249980E-06    2      1000023   1000035                       # HH0    -->  Z2SS   Z4SS               
      7.97162578E-02    2      1000024  -1000024                       # HH0    -->  W1SS+  W1SS-              
      1.49812093E-02    2      1000024  -1000037                       # HH0    -->  W1SS+  W2SS-              
      1.49812093E-02    2     -1000024   1000037                       # HH0    -->  W1SS-  W2SS+              
      9.89729529E-07    2           25        25                       # HH0    -->  HL0    HL0                
#         PDG         Width
DECAY        36  8.80591965E+00   # HA0   decays
#          BR          NDA       ID1       ID2       ID3       ID4
      8.10958856E-09    2           11       -11                       # HA0    -->  E-     E+                 
      3.42401356E-04    2           13       -13                       # HA0    -->  MU-    MU+                
      9.80600417E-02    2           15       -15                       # HA0    -->  TAU-   TAU+               
      1.00654315E-05    2            1        -1                       # HA0    -->  DN     DB                 
      4.06694412E-03    2            3        -3                       # HA0    -->  ST     SB                 
      7.15422750E-01    2            5        -5                       # HA0    -->  BT     BB                 
      1.25805302E-12    2            2        -2                       # HA0    -->  UP     UB                 
      2.10142641E-08    2            4        -4                       # HA0    -->  CH     CB                 
      2.63864806E-08    2           22        22                       # HA0    -->  GM     GM                 
      7.08266307E-05    2           21        21                       # HA0    -->  GL     GL                 
      2.23565884E-02    2      1000022   1000022                       # HA0    -->  Z1SS   Z1SS               
      3.13767157E-02    2      1000022   1000023                       # HA0    -->  Z1SS   Z2SS               
      3.20344395E-03    2      1000022   1000025                       # HA0    -->  Z1SS   Z3SS               
      4.30409884E-04    2      1000022   1000035                       # HA0    -->  Z1SS   Z4SS               
      1.10563636E-02    2      1000023   1000023                       # HA0    -->  Z2SS   Z2SS               
      1.03601185E-03    2      1000023   1000025                       # HA0    -->  Z2SS   Z3SS               
      8.39363638E-05    2      1000023   1000035                       # HA0    -->  Z2SS   Z4SS               
      1.00366041E-01    2      1000024  -1000024                       # HA0    -->  W1SS+  W1SS-              
      6.05605403E-03    2      1000024  -1000037                       # HA0    -->  W1SS+  W2SS-              
      6.05605403E-03    2     -1000024   1000037                       # HA0    -->  W1SS-  W2SS+              
      5.22110395E-06    2           25        23                       # HA0    -->  HL0    Z0                 
#         PDG         Width
DECAY        37  4.45598888E+00   # H+    decays
#          BR          NDA       ID1       ID2       ID3       ID4
      1.69263128E-08    2           12       -11                       # H+     -->  NUE    E+                 
      7.14659283E-04    2           14       -13                       # H+     -->  NUM    MU+                
      2.04672635E-01    2           16       -15                       # H+     -->  NUT    TAU+               
      1.90595347E-05    2            2        -1                       # H+     -->  UP     DB                 
      7.70068169E-03    2            4        -3                       # H+     -->  CH     SB                 
      5.06657064E-01    2            6        -5                       # H+     -->  TP     BB                 
      8.59803408E-02    2      1000024   1000022                       # H+     -->  W1SS+  Z1SS               
      2.17638053E-02    2      1000024   1000023                       # H+     -->  W1SS+  Z2SS               
      5.68782687E-02    2      1000024   1000025                       # H+     -->  W1SS+  Z3SS               
      3.97199504E-02    2      1000024   1000035                       # H+     -->  W1SS+  Z4SS               
      4.11441596E-03    2      1000037   1000022                       # H+     -->  W2SS+  Z1SS               
      7.17625991E-02    2      1000037   1000023                       # H+     -->  W2SS+  Z2SS               
      1.64939393E-05    2           25        24                       # H+     -->  HL0    W+                 
