  65
  401    712.1797    0.73908E-24
  402    708.2142    0.80372E-24
  403    712.1797    0.73912E-24
  404    708.2155    0.80404E-24
  405   3000.0916    0.43863E-26
  406   3002.5991    0.31103E-26
  407    712.1797    0.73908E-24
  408    708.2142    0.80372E-24
  409    712.1797    0.73912E-24
  410    708.2155    0.80404E-24
  411   3000.0916    0.43863E-26
  412   3002.5991    0.31103E-26
  413    710.3993    0.15556E-23
  414    709.2007    0.42005E-24
  415    710.3993    0.15556E-23
  416    709.2020    0.42014E-24
  417   3000.5220    0.31024E-26
  418   3002.8484    0.31147E-26
  419    710.3993    0.15556E-23
  420    709.2007    0.42005E-24
  421    710.3993    0.15556E-23
  422    709.2020    0.42014E-24
  423   3000.5220    0.31024E-26
  424   3002.8484    0.31147E-26
  425    350.0221    0.17817E-23
  426    341.8814    0.17893E-23
  427    350.0221    0.17817E-23
  428    341.8814    0.17893E-23
  429    349.9152    0.43946E-24
  430    341.8814    0.17893E-23
  431    350.0221    0.17817E-23
  432    341.8814    0.17893E-23
  433    350.0221    0.17817E-23
  434    341.8814    0.17893E-23
  435    349.9152    0.43946E-24
  436    341.8814    0.17893E-23
  437    350.0171    0.43925E-24
  438      0.0000    0.10000E+31
  439    350.0171    0.43925E-24
  440      0.0000    0.10000E+31
  441    350.1326    0.17808E-23
  442      0.0000    0.10000E+31
  443    350.0171    0.43925E-24
  444      0.0000    0.10000E+31
  445    350.0171    0.43925E-24
  446      0.0000    0.10000E+31
  447    350.1326    0.17808E-23
  448      0.0000    0.10000E+31
  449    700.0000    0.48426E-22
  450     99.9981    0.10000E+31
  451    599.7878    0.99727E-25
  452  -1051.4825    0.76558E-25
  453   1062.0229    0.69243E-25
  454    599.7517    0.99711E-25
  455   1061.5696    0.69125E-25
  456    599.7517    0.99711E-25
  457   1061.5696    0.69125E-25
  203    106.8540    0.17587E-21
  204   1007.8627    0.17747E-24
  205   1000.0000    0.17096E-24
  206   1018.7549    0.18382E-24
  207   1018.7549    0.18382E-24
  458      0.0000    0.10000E+31
    6    172.5000    0.57395E-24
   12    172.5000    0.57395E-24
   4
   401  0.11292125E+00     0   450     1     0     0     0
   401  0.27679393E+00     0   451     1     0     0     0
   401  0.58508050E-01     0   449     1     0     0     0
   401  0.55177677E+00     0   456     2     0     0     0
   4
   402  0.11228275E+00     0   450     2     0     0     0
   402  0.28532004E+00     0   451     2     0     0     0
   402  0.29279990E-01     0   449     2     0     0     0
   402  0.57311714E+00     0   454     1     0     0     0
   4
   403  0.11292654E+00     0   450     3     0     0     0
   403  0.27680692E+00     0   451     3     0     0     0
   403  0.58510795E-01     0   449     3     0     0     0
   403  0.55175573E+00     0   456     4     0     0     0
   4
   404  0.11232738E+00     0   450     4     0     0     0
   404  0.28541499E+00     0   451     4     0     0     0
   404  0.28897908E-01     0   449     4     0     0     0
   404  0.57335973E+00     0   454     3     0     0     0
   7
   405  0.11253319E-01     0   450     5     0     0     0
   405  0.22533050E-04     0   451     5     0     0     0
   405  0.58411306E-03     0   452     5     0     0     0
   405  0.57500042E-03     0   453     5     0     0     0
   405  0.98640841E+00     0   449     5     0     0     0
   405  0.42769178E-04     0   456     6     0     0     0
   405  0.11138547E-02     0   457     6     0     0     0
   7
   406  0.69497299E+00     0   449     6     0     0     0
   406  0.31755358E-01     0   450     6     0     0     0
   406  0.12981185E-02     0   451     6     0     0     0
   406  0.68251535E-01     0   452     6     0     0     0
   406  0.66686466E-01     0   453     6     0     0     0
   406  0.26240905E-02     0   454     5     0     0     0
   406  0.13441135E+00     0   455     5     0     0     0
   4
   407  0.11292125E+00     0   450     7     0     0     0
   407  0.27679393E+00     0   451     7     0     0     0
   407  0.58508050E-01     0   449     7     0     0     0
   407  0.55177677E+00     0   454     8     0     0     0
   4
   408  0.11228275E+00     0   450     8     0     0     0
   408  0.28532004E+00     0   451     8     0     0     0
   408  0.29279990E-01     0   449     8     0     0     0
   408  0.57311714E+00     0   456     7     0     0     0
   4
   409  0.11292654E+00     0   450     9     0     0     0
   409  0.27680692E+00     0   451     9     0     0     0
   409  0.58510795E-01     0   449     9     0     0     0
   409  0.55175573E+00     0   454    10     0     0     0
   4
   410  0.11232738E+00     0   450    10     0     0     0
   410  0.28541499E+00     0   451    10     0     0     0
   410  0.28897908E-01     0   449    10     0     0     0
   410  0.57335973E+00     0   456     9     0     0     0
   7
   411  0.11253319E-01     0   450    11     0     0     0
   411  0.22533050E-04     0   451    11     0     0     0
   411  0.58411306E-03     0   452    11     0     0     0
   411  0.57500042E-03     0   453    11     0     0     0
   411  0.98640841E+00     0   449    11     0     0     0
   411  0.42769178E-04     0   454    12     0     0     0
   411  0.11138547E-02     0   455    12     0     0     0
   7
   412  0.69497299E+00     0   449    12     0     0     0
   412  0.31755358E-01     0   450    12     0     0     0
   412  0.12981185E-02     0   451    12     0     0     0
   412  0.68251535E-01     0   452    12     0     0     0
   412  0.66686466E-01     0   453    12     0     0     0
   412  0.26240905E-02     0   456    11     0     0     0
   412  0.13441135E+00     0   457    11     0     0     0
   2
   413  0.90975320E+00     0   450     1     0     0     0
   413  0.90246782E-01     0   449     1     0     0     0
   2
   414  0.98085642E+00     0   450     2     0     0     0
   414  0.19143580E-01     0   449     2     0     0     0
   2
   415  0.90975320E+00     0   450     3     0     0     0
   415  0.90246782E-01     0   449     3     0     0     0
   2
   416  0.98105717E+00     0   450     4     0     0     0
   416  0.18942777E-01     0   449     4     0     0     0
   7
   417  0.20754838E-02     0   450     5     0     0     0
   417  0.53395640E-01     0   451     5     0     0     0
   417  0.44798176E-03     0   452     5     0     0     0
   417  0.15349890E-02     0   453     5     0     0     0
   417  0.69780058E+00     0   449     5     0     0     0
   417  0.10739533E+00     0   456     6     0     0     0
   417  0.13734999E+00     0   457     6     0     0     0
   7
   418  0.69601476E+00     0   449     6     0     0     0
   418  0.10854055E+00     0   454     5     0     0     0
   418  0.22626163E-02     0   455     5     0     0     0
   418  0.19423360E-02     0   450     6     0     0     0
   418  0.54563444E-01     0   451     6     0     0     0
   418  0.68403699E-01     0   452     6     0     0     0
   418  0.68272583E-01     0   453     6     0     0     0
   2
   419  0.90975320E+00     0   450     7     0     0     0
   419  0.90246782E-01     0   449     7     0     0     0
   2
   420  0.98085642E+00     0   450     8     0     0     0
   420  0.19143580E-01     0   449     8     0     0     0
   2
   421  0.90975320E+00     0   450     9     0     0     0
   421  0.90246782E-01     0   449     9     0     0     0
   2
   422  0.98105717E+00     0   450    10     0     0     0
   422  0.18942777E-01     0   449    10     0     0     0
   7
   423  0.20754838E-02     0   450    11     0     0     0
   423  0.53395640E-01     0   451    11     0     0     0
   423  0.44798176E-03     0   452    11     0     0     0
   423  0.15349890E-02     0   453    11     0     0     0
   423  0.69780058E+00     0   449    11     0     0     0
   423  0.10739533E+00     0   454    12     0     0     0
   423  0.13734999E+00     0   455    12     0     0     0
   7
   424  0.69601476E+00     0   449    12     0     0     0
   424  0.10854055E+00     0   456    11     0     0     0
   424  0.22626163E-02     0   457    11     0     0     0
   424  0.19423360E-02     0   450    12     0     0     0
   424  0.54563444E-01     0   451    12     0     0     0
   424  0.68403699E-01     0   452    12     0     0     0
   424  0.68272583E-01     0   453    12     0     0     0
   1
   425  0.10000000E+01     0   450   121     0     0     0
   1
   426  0.10000000E+01     0   450   122     0     0     0
   1
   427  0.10000000E+01     0   450   123     0     0     0
   1
   428  0.10000000E+01     0   450   124     0     0     0
   1
   429  0.10000000E+01     0   450   125     0     0     0
   1
   430  0.10000000E+01     0   450   126     0     0     0
   1
   431  0.10000000E+01     0   450   127     0     0     0
   1
   432  0.10000000E+01     0   450   128     0     0     0
   1
   433  0.10000000E+01     0   450   129     0     0     0
   1
   434  0.10000000E+01     0   450   130     0     0     0
   1
   435  0.10000000E+01     0   450   131     0     0     0
   1
   436  0.10000000E+01     0   450   132     0     0     0
   1
   437  0.10000000E+01     0   450   121     0     0     0
   0
   1
   439  0.10000000E+01     0   450   123     0     0     0
   0
   1
   441  0.10000000E+01     0   450   125     0     0     0
   0
   1
   443  0.10000000E+01     0   450   127     0     0     0
   0
   1
   445  0.10000000E+01     0   450   129     0     0     0
   0
   1
   447  0.10000000E+01     0   450   131     0     0     0
   0
  14
   449  0.12281201E-01     0   454     1     8     0     0
   449  0.12281201E-01     0   456     2     7     0     0
   449  0.12280719E-01     0   454     3    10     0     0
   449  0.12280719E-01     0   456     4     9     0     0
   449  0.35966638E+00     0   450     2     8     0     0
   449  0.10343208E+00     0   450     1     7     0     0
   449  0.10343208E+00     0   450     3     9     0     0
   449  0.35965693E+00     0   450     4    10     0     0
   449  0.75691387E-04     0   450     5    11     0     0
   449  0.65919696E-04     0   450     6    12     0     0
   449  0.67813904E-02     0   451     2     8     0     0
   449  0.54923645E-02     0   451     1     7     0     0
   449  0.54923645E-02     0   451     3     9     0     0
   449  0.67809052E-02     0   451     4    10     0     0
   0
  20
   451  0.16060617E-03     0   450   200     0     0     0
   451  0.18706350E-02     0   450   203     0     0     0
   451  0.82164496E-01     0   425   127     0     0     0
   451  0.82164496E-01     0   431   121     0     0     0
   451  0.82164496E-01     0   427   129     0     0     0
   451  0.82164496E-01     0   433   123     0     0     0
   451  0.10693486E-04     0   437   127     0     0     0
   451  0.10693486E-04     0   443   121     0     0     0
   451  0.10693486E-04     0   439   129     0     0     0
   451  0.10693486E-04     0   445   123     0     0     0
   451  0.20763806E-04     0   429   131     0     0     0
   451  0.20763806E-04     0   435   125     0     0     0
   451  0.82136415E-01     0   441   131     0     0     0
   451  0.82136415E-01     0   447   125     0     0     0
   451  0.84158957E-01     0   426   128     0     0     0
   451  0.84158957E-01     0   432   122     0     0     0
   451  0.84158957E-01     0   428   130     0     0     0
   451  0.84158957E-01     0   434   124     0     0     0
   451  0.84158957E-01     0   430   132     0     0     0
   451  0.84158957E-01     0   436   126     0     0     0
  40
   452  0.30368575E+00     0   454   199     0     0     0
   452  0.30368575E+00     0   456   198     0     0     0
   452  0.69413513E-01     0   450   200     0     0     0
   452  0.29222795E+00     0   451   200     0     0     0
   452  0.16402336E-01     0   450   203     0     0     0
   452  0.75250948E-02     0   451   203     0     0     0
   452  0.10487821E-03     0   402     8     0     0     0
   452  0.10487821E-03     0   408     2     0     0     0
   452  0.18466772E-03     0   401     7     0     0     0
   452  0.18466772E-03     0   407     1     0     0     0
   452  0.18466770E-03     0   403     9     0     0     0
   452  0.18466770E-03     0   409     3     0     0     0
   452  0.10487704E-03     0   404    10     0     0     0
   452  0.10487704E-03     0   410     4     0     0     0
   452  0.48111018E-04     0   414     8     0     0     0
   452  0.48111018E-04     0   420     2     0     0     0
   452  0.11959936E-04     0   413     7     0     0     0
   452  0.11959936E-04     0   419     1     0     0     0
   452  0.11959935E-04     0   415     9     0     0     0
   452  0.11959935E-04     0   421     3     0     0     0
   452  0.48110502E-04     0   416    10     0     0     0
   452  0.48110502E-04     0   422     4     0     0     0
   452  0.40406176E-04     0   425   127     0     0     0
   452  0.40406176E-04     0   431   121     0     0     0
   452  0.40406176E-04     0   427   129     0     0     0
   452  0.40406176E-04     0   433   123     0     0     0
   452  0.96022770E-04     0   437   127     0     0     0
   452  0.96022770E-04     0   443   121     0     0     0
   452  0.96022770E-04     0   439   129     0     0     0
   452  0.96022770E-04     0   445   123     0     0     0
   452  0.91116456E-03     0   429   131     0     0     0
   452  0.91116456E-03     0   435   125     0     0     0
   452  0.85454987E-03     0   441   131     0     0     0
   452  0.85454987E-03     0   447   125     0     0     0
   452  0.26400512E-03     0   426   128     0     0     0
   452  0.26400512E-03     0   432   122     0     0     0
   452  0.26400512E-03     0   428   130     0     0     0
   452  0.26400512E-03     0   434   124     0     0     0
   452  0.26400512E-03     0   430   132     0     0     0
   452  0.26400512E-03     0   436   126     0     0     0
  40
   453  0.28358364E+00     0   454   199     0     0     0
   453  0.28358364E+00     0   456   198     0     0     0
   453  0.15466735E-01     0   450   200     0     0     0
   453  0.78422381E-02     0   451   200     0     0     0
   453  0.59546296E-01     0   450   203     0     0     0
   453  0.25253761E+00     0   451   203     0     0     0
   453  0.44861920E-02     0   402     8     0     0     0
   453  0.44861920E-02     0   408     2     0     0     0
   453  0.53273449E-02     0   401     7     0     0     0
   453  0.53273449E-02     0   407     1     0     0     0
   453  0.53273444E-02     0   403     9     0     0     0
   453  0.53273444E-02     0   409     3     0     0     0
   453  0.44861445E-02     0   404    10     0     0     0
   453  0.44861445E-02     0   410     4     0     0     0
   453  0.17726619E-03     0   414     8     0     0     0
   453  0.17726619E-03     0   420     2     0     0     0
   453  0.44075565E-04     0   413     7     0     0     0
   453  0.44075565E-04     0   419     1     0     0     0
   453  0.44075558E-04     0   415     9     0     0     0
   453  0.44075558E-04     0   421     3     0     0     0
   453  0.17726436E-03     0   416    10     0     0     0
   453  0.17726436E-03     0   422     4     0     0     0
   453  0.31237283E-02     0   425   127     0     0     0
   453  0.31237283E-02     0   431   121     0     0     0
   453  0.31237283E-02     0   427   129     0     0     0
   453  0.31237283E-02     0   433   123     0     0     0
   453  0.34410399E-03     0   437   127     0     0     0
   453  0.34410399E-03     0   443   121     0     0     0
   453  0.34410399E-03     0   439   129     0     0     0
   453  0.34410399E-03     0   445   123     0     0     0
   453  0.10660753E-02     0   429   131     0     0     0
   453  0.10660753E-02     0   435   125     0     0     0
   453  0.38374842E-02     0   441   131     0     0     0
   453  0.38374842E-02     0   447   125     0     0     0
   453  0.56036240E-02     0   426   128     0     0     0
   453  0.56036240E-02     0   432   122     0     0     0
   453  0.56036240E-02     0   428   130     0     0     0
   453  0.56036240E-02     0   434   124     0     0     0
   453  0.56036240E-02     0   430   132     0     0     0
   453  0.56036240E-02     0   436   126     0     0     0
   8
   454  0.20601721E-02     0   450   198     0     0     0
   454  0.17149746E+00     0   426   127     0     0     0
   454  0.17149746E+00     0   428   129     0     0     0
   454  0.17155065E+00     0   430   131     0     0     0
   454  0.16115960E+00     0   431   122     0     0     0
   454  0.16115960E+00     0   433   124     0     0     0
   454  0.20612651E-04     0   435   126     0     0     0
   454  0.16105443E+00     0   447   126     0     0     0
  15
   455  0.73500641E-01     0   450   198     0     0     0
   455  0.28580236E+00     0   451   198     0     0     0
   455  0.69250190E-02     0   402     7     0     0     0
   455  0.13134746E-01     0   407     2     0     0     0
   455  0.69249780E-02     0   404     9     0     0     0
   455  0.13374448E-01     0   409     4     0     0     0
   455  0.60216989E-02     0   426   127     0     0     0
   455  0.60216989E-02     0   428   129     0     0     0
   455  0.74637309E-02     0   430   131     0     0     0
   455  0.11500617E-01     0   431   122     0     0     0
   455  0.11500617E-01     0   433   124     0     0     0
   455  0.14480627E-02     0   435   126     0     0     0
   455  0.11498935E-01     0   447   126     0     0     0
   455  0.28292087E+00     0   454   200     0     0     0
   455  0.26196155E+00     0   454   203     0     0     0
   8
   456  0.20601721E-02     0   450   199     0     0     0
   456  0.17149746E+00     0   432   121     0     0     0
   456  0.17149746E+00     0   434   123     0     0     0
   456  0.17155065E+00     0   436   125     0     0     0
   456  0.16115960E+00     0   425   128     0     0     0
   456  0.16115960E+00     0   427   130     0     0     0
   456  0.20612651E-04     0   429   132     0     0     0
   456  0.16105443E+00     0   441   132     0     0     0
  15
   457  0.73500641E-01     0   450   199     0     0     0
   457  0.28580236E+00     0   451   199     0     0     0
   457  0.69250190E-02     0   408     1     0     0     0
   457  0.13134746E-01     0   401     8     0     0     0
   457  0.69249780E-02     0   410     3     0     0     0
   457  0.13374448E-01     0   403    10     0     0     0
   457  0.60216989E-02     0   432   121     0     0     0
   457  0.60216989E-02     0   434   123     0     0     0
   457  0.74637309E-02     0   436   125     0     0     0
   457  0.11500617E-01     0   425   128     0     0     0
   457  0.11500617E-01     0   427   130     0     0     0
   457  0.14480627E-02     0   429   132     0     0     0
   457  0.11498935E-01     0   441   132     0     0     0
   457  0.28292087E+00     0   456   200     0     0     0
   457  0.26196155E+00     0   456   203     0     0     0
  28
   203  0.21257976E-03     0   123   129     0     0     0
   203  0.60785450E-01     0   125   131     0     0     0
   203  0.25561624E-02     0     3     9     0     0     0
   203  0.84671259E+00     0     5    11     0     0     0
   203  0.37053172E-01     0     4    10     0     0     0
   203  0.15098789E-02     0    59    59     0     0     0
   203  0.34211684E-01     0    13    13     0     0     0
   203  0.90880028E-03     0   198   121   128     0     0
   203  0.90880028E-03     0   198   123   130     0     0
   203  0.90880028E-03     0   198   125   132     0     0
   203  0.27264007E-02     0   198     8     1     0     0
   203  0.27264007E-02     0   198    10     3     0     0
   203  0.90880028E-03     0   199   127   122     0     0
   203  0.90880028E-03     0   199   129   124     0     0
   203  0.90880028E-03     0   199   131   126     0     0
   203  0.27264007E-02     0   199     2     7     0     0
   203  0.27264007E-02     0   199     4     9     0     0
   203  0.41073148E-04     0   200   122   128     0     0
   203  0.41073148E-04     0   200   124   130     0     0
   203  0.41073148E-04     0   200   126   132     0     0
   203  0.20671705E-04     0   200   121   127     0     0
   203  0.20671705E-04     0   200   123   129     0     0
   203  0.20671705E-04     0   200   125   131     0     0
   203  0.70819508E-04     0   200     2     8     0     0
   203  0.70819508E-04     0   200     4    10     0     0
   203  0.91232971E-04     0   200     1     7     0     0
   203  0.91232971E-04     0   200     3     9     0     0
   203  0.91232971E-04     0   200     5    11     0     0
  23
   204  0.31124044E-04     0   123   129     0     0     0
   204  0.89142369E-02     0   125   131     0     0     0
   204  0.36486180E-03     0     3     9     0     0     0
   204  0.89962378E-01     0     5    11     0     0     0
   204  0.16530497E-04     0     4    10     0     0     0
   204  0.75437051E+00     0     6    12     0     0     0
   204  0.41752838E-03     0    13    13     0     0     0
   204  0.18863012E-02     0   198   199     0     0     0
   204  0.95773028E-03     0   200   200     0     0     0
   204  0.93055790E-03     0   450   450     0     0     0
   204  0.30749522E-02     0   450   451     0     0     0
   204  0.84909340E-02     0   203   203     0     0     0
   204  0.28756878E-03     0   425   431     0     0     0
   204  0.21550318E-03     0   437   443     0     0     0
   204  0.28754512E-03     0   427   433     0     0     0
   204  0.21548272E-03     0   439   445     0     0     0
   204  0.20957846E-03     0   429   435     0     0     0
   204  0.28093738E-03     0   441   447     0     0     0
   204  0.63009590E-01     0   429   447     0     0     0
   204  0.63009590E-01     0   441   435     0     0     0
   204  0.10221723E-02     0   426   432     0     0     0
   204  0.10221723E-02     0   428   434     0     0     0
   204  0.10221723E-02     0   430   436     0     0     0
  12
   205  0.29818932E-04     0   123   129     0     0     0
   205  0.85405456E-02     0   125   131     0     0     0
   205  0.34958494E-03     0     3     9     0     0     0
   205  0.86279199E-01     0     5    11     0     0     0
   205  0.15241190E-04     0     4    10     0     0     0
   205  0.77225989E+00     0     6    12     0     0     0
   205  0.42693081E-03     0    13    13     0     0     0
   205  0.13056677E-02     0   450   450     0     0     0
   205  0.75831269E-02     0   450   451     0     0     0
   205  0.17589177E-02     0   203   200     0     0     0
   205  0.60725510E-01     0   429   447     0     0     0
   205  0.60725510E-01     0   441   435     0     0     0
  10
   206  0.32661843E-04     0   124   129     0     0     0
   206  0.93547953E-02     0   126   131     0     0     0
   206  0.36726648E-03     0     4     9     0     0     0
   206  0.84104973E+00     0     6    11     0     0     0
   206  0.11817362E-01     0   454   450     0     0     0
   206  0.19889532E-02     0   203   198     0     0     0
   206  0.12130504E-02     0   431   426     0     0     0
   206  0.12130149E-02     0   433   428     0     0     0
   206  0.13176014E+00     0   435   430     0     0     0
   206  0.12031125E-02     0   447   430     0     0     0
  10
   207  0.32661843E-04     0   130   123     0     0     0
   207  0.93547953E-02     0   132   125     0     0     0
   207  0.36726648E-03     0    10     3     0     0     0
   207  0.84104973E+00     0    12     5     0     0     0
   207  0.11817362E-01     0   456   450     0     0     0
   207  0.19889532E-02     0   203   199     0     0     0
   207  0.12130504E-02     0   425   432     0     0     0
   207  0.12130149E-02     0   427   434     0     0     0
   207  0.13176014E+00     0   429   436     0     0     0
   207  0.12031125E-02     0   441   436     0     0     0
   0
   5
     6  0.33333334E+00   100     2     7     5     0     0
     6  0.33333334E+00   100     4     9     5     0     0
     6  0.11111111E+00   100   122   127     5     0     0
     6  0.11111111E+00   100   124   129     5     0     0
     6  0.11111111E+00   100   126   131     5     0     0
   5
    12  0.33333334E+00   100     8     1    11     0     0
    12  0.33333334E+00   100    10     3    11     0     0
    12  0.11111111E+00   100   128   121    11     0     0
    12  0.11111111E+00   100   130   123    11     0     0
    12  0.11111111E+00   100   132   125    11     0     0
      4.00000000     -0.24964957
      0.99898887     -0.00381858      0.04244599     -0.01431313
     -0.01031497     -0.98824781      0.12385093     -0.08899990
      0.01976028     -0.02495111     -0.70591736     -0.70757878
     -0.03904147      0.15076227      0.69608939     -0.70086092
     -0.99198109      0.12638621     -0.12638621     -0.99198109
     -0.98445404      0.17564243     -0.17564243     -0.98445404
      1.57071400     -1.57079577     -1.57078540
    262.50000000   4200.00000000   4200.00000000
   1050.00000000
    T
