# SUSY Les Houches Accord 2 - MSSM spectrum + Decays
# SPheno v3.1.8  
# W. Porod, Comput. Phys. Commun. 153 (2003) 275-315, hep-ph/0301101
# in case of problems send email to porod@physik.uni-wuerzburg.de
# Created: 22.03.2012,  12:30
Block SPINFO         # Program information
     1   SPheno      # spectrum calculator
     2   v3.1.8      # version number
#
Block SPhenoINFO     # SPheno specific information
    1      2         # using 2-loop RGEs
    2      1         # using running masses for boundary conditions at mZ
Block MODSEL  # Model selection
    4    1    # MSSM with explicit R-parity violation
Block MINPAR  # Input parameters
    3    1.00000000E+01  # tanb at m_Z    
    4    1.00000000E+00  # Sign(mu)
Block SMINPUTS  # SM parameters
         1     1.27934000E+02  # alpha_em^-1(MZ)^MSbar
         2     1.16639000E-05  # G_mu [GeV^-2]
         3     1.17200000E-01  # alpha_s(MZ)^MSbar
         4     9.11876000E+01  # m_Z(pole)
         5     4.25000000E+00  # m_b(m_b), MSbar
         6     1.72500000E+02  # m_t(pole)
         7     1.77700000E+00  # m_tau(pole)
         8     0.00000000E+00  # m_nu_3
        11     5.10998910E-04  # m_e(pole)
        12     0.00000000E+00  # m_nu_1
        13     1.05658000E-01  # m_muon(pole)
        14     0.00000000E+00  # m_nu_2
        21     5.00000000E-03  # m_d(2 GeV), MSbar
        22     3.00000000E-03  # m_u(2 GeV), MSbar
        23     1.05000000E-01  # m_s(2 GeV), MSbar
        24     1.27000000E+00  # m_c(m_c), MSbar
Block EXTPAR  # 
   0    5.75497182E+02  # scale Q where the parameters below are defined
   1    1.14833992E+02  # M_1
   2    2.15471229E+02  # M_2
   3    6.46661967E+02  # M_3
  11   -5.14951691E+02  # A_t
  12   -7.73575857E+02  # A_b
  13   -1.70124280E+02  # A_l
  23    3.75765162E+02  # mu 
  31    3.52309370E+02  # M_(L,11)
  32    3.52304576E+02  # M_(L,22)
  33    3.50951067E+02  # M_(L,33)
  34    3.16622384E+02  # M_(E,11)
  35    3.16611623E+02  # M_(E,22)
  36    3.13564451E+02  # M_(E,33)
  41    6.58905736E+02  # M_(Q,11)
  42    6.58903713E+02  # M_(Q,22)
  43    5.93367775E+02  # M_(Q,33)
  44    6.40934697E+02  # M_(U,11)
  45    6.40932159E+02  # M_(U,22)
  46    4.98224648E+02  # M_(U,33)
  47    6.38832559E+02  # M_(D,11)
  48    6.38830888E+02  # M_(D,22)
  49    6.35036262E+02  # M_(D,33)
Block gauge Q=  5.75497182E+02  # (SUSY scale)
   1    3.61304079E-01  # g'(Q)^DRbar
   2    6.44863188E-01  # g(Q)^DRbar
   3    1.08650743E+00  # g3(Q)^DRbar
Block Yu Q=  5.75497182E+02  # (SUSY scale)
  1  1     8.81099729E-06   # Y_u(Q)^DRbar
  2  2     3.72998875E-03   # Y_c(Q)^DRbar
  3  3     8.79065969E-01   # Y_t(Q)^DRbar
Block Yd Q=  5.75497182E+02  # (SUSY scale)
  1  1     1.35906186E-04   # Y_d(Q)^DRbar
  2  2     2.85402971E-03   # Y_s(Q)^DRbar
  3  3     1.38208374E-01   # Y_b(Q)^DRbar
Block Ye Q=  5.75497182E+02  # (SUSY scale)
  1  1     2.88350307E-05   # Y_e(Q)^DRbar
  2  2     5.96215106E-03   # Y_mu(Q)^DRbar
  3  3     1.00283639E-01   # Y_tau(Q)^DRbar
Block Au Q=  5.75497182E+02  # (SUSY scale)
  1  1    -6.73270423E+02   # A_u(Q)^DRbar
  2  2    -6.73267008E+02   # A_c(Q)^DRbar
  3  3    -5.14951691E+02   # A_t(Q)^DRbar
Block Ad Q=  5.75497182E+02  # (SUSY scale)
  1  1    -8.29166862E+02   # A_d(Q)^DRbar
  2  2    -8.29164221E+02   # A_s(Q)^DRbar
  3  3    -7.73575857E+02   # A_b(Q)^DRbar
Block Ae Q=  5.75497182E+02  # (SUSY scale)
  1  1    -1.71071004E+02   # A_e(Q)^DRbar
  2  2    -1.71067657E+02   # A_mu(Q)^DRbar
  3  3    -1.70124280E+02   # A_tau(Q)^DRbar
Block MSOFT Q=  5.75497182E+02  # soft SUSY breaking masses at Q
   1    1.14833992E+02  # M_1
   2    2.15471229E+02  # M_2
   3    6.46661967E+02  # M_3
  21    1.15492874E+05  # M^2_(H,d)
  22   -1.38095881E+05  # M^2_(H,u)
  31    3.52309370E+02  # M_(L,11)
  32    3.52304576E+02  # M_(L,22)
  33    3.50951067E+02  # M_(L,33)
  34    3.16622384E+02  # M_(E,11)
  35    3.16611623E+02  # M_(E,22)
  36    3.13564451E+02  # M_(E,33)
  41    6.58905736E+02  # M_(Q,11)
  42    6.58903713E+02  # M_(Q,22)
  43    5.93367775E+02  # M_(Q,33)
  44    6.40934697E+02  # M_(U,11)
  45    6.40932159E+02  # M_(U,22)
  46    4.98224648E+02  # M_(U,33)
  47    6.38832559E+02  # M_(D,11)
  48    6.38830888E+02  # M_(D,22)
  49    6.35036262E+02  # M_(D,33)
Block RVKAPPA Q=  5.75497182E+02  # bilinear RP parameters at Q
         1     5.87020647E-02  # epsilon_1
         2    -6.33499447E-02  # epsilon_2
         3     6.34925032E-02  # epsilon_3
Block RVD Q=  5.75497182E+02  # bilinear RP parameters at Q
         1     4.09071071E+00  # Re( B_1 epsilon_1)
         2    -4.50521263E+00  # Re( B_2 epsilon_2)
         3     4.32510420E+00  # Re( B_3 epsilon_3)
Block RVSNVEV Q=  5.75497182E+02  # sneutrino vevs at Q
         1    -3.94137859E-03  # v_L_1
         2     4.44005699E-03  # v_L_2
         3    -4.09361911E-03  # v_L_3
Block SPhenoRP  # additional RP parameters
         4     2.95190229E-03  # Lambda_1 = v_d epsilon_1 + mu v_L1
         5     6.59739555E-02  # Lambda_2 = v_d epsilon_2 + mu v_L2
         6     6.59739555E-02  # Lambda_3 = v_d epsilon_3 + mu v_L3
         7     2.36751687E-03  # m^2_atm [eV^2]
         8     7.60116732E-05  # m^2_sol [eV^2]
         9     9.39172807E-01  # tan^2 theta_atm
        10     4.62941372E-01  # tan^2 theta_sol
        11     1.66590734E-03  # U_e3^2
        15     2.49338194E+01  # v_d
        16     2.49338194E+02  # v_u
Block MASS  # Mass spectrum
#   PDG code      mass          particle
         6     1.72500000E+02  # m_t(pole)
        23     9.11876000E+01  # m_Z(pole)
        24     8.03201820E+01  # W+
        25     1.10719109E+02  # leightest neutral scalar
   1000016     3.45865736E+02  # 2nd neutral scalar
   1000014     3.47298218E+02  # 3rd neutral scalar
   1000012     3.47303291E+02  # 4th neutral scalar
        35     5.07725322E+02  # 5th neutral scalar
   1000019     3.45865736E+02  # leightest pseudoscalar
   1000018     3.47298218E+02  # 2nd pseudoscalar
   1000017     3.47303291E+02  # 3rd pseudoscalar
        36     5.07468164E+02  # 4th pseudoscalar
   1000015     3.14482215E+02  # leightest charged scalar
   2000013     3.20385735E+02  # 2nd charged scalar
   2000011     3.20407606E+02  # 3rd charged scalar
   1000011     3.56492708E+02  # 4th charged scalar
   1000013     3.56497521E+02  # 5th charged scalar
   2000015     3.57571041E+02  # 6th charged scalar
        37     5.14152386E+02  # 7th charged scalar
   1000001     6.86628975E+02  # ~d_L
   2000001     6.64460245E+02  # ~d_R
   1000002     6.82242284E+02  # ~u_L
   2000002     6.65049194E+02  # ~u_R
   1000003     6.86628149E+02  # ~s_L
   2000003     6.64457188E+02  # ~s_R
   1000004     6.82248245E+02  # ~c_L
   2000004     6.65038985E+02  # ~c_R
   1000005     6.15731135E+02  # ~b_1
   2000005     6.62054309E+02  # ~b_2
   1000006     4.93803884E+02  # ~t_1
   2000006     6.70703819E+02  # ~t_2
   1000021     6.87365673E+02  # ~g
        12     4.33452493E-14  # nu_1
        14     8.71857511E-12  # nu_2
        16     4.94320789E-11  # nu_3
   1000022     1.10664494E+02  # chi_10
   1000023     2.05499401E+02  # chi_20
   1000025     3.83079731E+02  # chi_30
   1000035     4.01858064E+02  # chi_40
       -11     5.10998910E-04  # e+
       -13     1.05658000E-01  # mu+
       -15     1.77700000E+00  # tau+
   1000024     2.05136795E+02  # chi_1+
   1000037     4.02634558E+02  # chi_2+
# Higgs mixing
Block alpha # Effective Higgs mixing angle
          -1.09961556E-01   # alpha
Block Hmix Q=  5.75497182E+02  # Higgs mixing parameters
   1    3.75765162E+02  # mu
   2    9.71765506E+00  # tan[beta](Q)
   3    2.44750026E+02  # v(Q)
   4    2.50701836E+05  # m^2_A(Q)
Block staumix  # stau mixing matrix
   1  1     2.46802148E-01   # R_sta(1,1)
   1  2     9.69065890E-01   # R_sta(1,2)
   2  1    -9.69065890E-01   # R_sta(2,1)
   2  2     2.46802148E-01   # R_sta(2,2)
Block stopmix # stop mixing matrix
   1  1     4.89754664E-01   # Re[R_st(1,1)]
   1  2     8.71860292E-01   # Re[R_st(1,2)]
   2  1    -8.71860292E-01   # Re[R_st(2,1)]
   2  2     4.89754664E-01   # Re[R_st(2,2)]
Block sbotmix # sbottom mixing matrix
   1  1     9.82959185E-01   # Re[R_sb(1,1)]
   1  2     1.83823940E-01   # Re[R_sb(1,2)]
   2  1    -1.83823940E-01   # Re[R_sb(2,1)]
   2  2     9.82959185E-01   # Re[R_sb(2,2)]
Block Nmix # neutralino mixing matrix
   1  1    -9.87016668E-01   # Re[N(1,1)]
   1  2     4.96178703E-02   # Re[N(1,2)]
   1  3    -1.42495300E-01   # Re[N(1,3)]
   1  4     5.50568157E-02   # Re[N(1,4)]
   2  1    -9.68337873E-02   # Re[N(2,1)]
   2  2    -9.40642499E-01   # Re[N(2,2)]
   2  3     2.77817132E-01   # Re[N(2,3)]
   2  4    -1.69211548E-01   # Re[N(2,4)]
   3  1     5.67092763E-02   # Re[N(3,1)]
   3  2    -8.37361152E-02   # Re[N(3,2)]
   3  3    -6.96458674E-01   # Re[N(3,3)]
   3  4    -7.10434822E-01   # Re[N(3,4)]
   4  1     1.14914630E-01   # Re[N(4,1)]
   4  2    -3.25143075E-01   # Re[N(4,2)]
   4  3    -6.46109934E-01   # Re[N(4,3)]
   4  4     6.80895412E-01   # Re[N(4,4)]
Block Umix # chargino mixing matrix
   1  1    -9.13694240E-01   # Re[U(1,1)]
   1  2     4.06402290E-01   # Re[U(1,2)]
   2  1    -4.06402307E-01   # Re[U(2,1)]
   2  2    -9.13694202E-01   # Re[U(2,2)]
Block Vmix # chargino mixing matrix
   1  1    -9.69994752E-01   # Re[V(1,1)]
   1  2     2.43125855E-01   # Re[V(1,2)]
   2  1    -2.43125855E-01   # Re[V(2,1)]
   2  2    -9.69994752E-01   # Re[V(2,2)]
DECAY   2000001     3.58614641E-01   # ~d_R
#    BR                NDA      ID1      ID2
     9.84560511E-01    2     1000022         1   # BR(~d_R -> chi^0_1 d)
     8.08259617E-03    2     1000023         1   # BR(~d_R -> chi^0_2 d)
     1.62222528E-03    2     1000025         1   # BR(~d_R -> chi^0_3 d)
     5.73241365E-03    2     1000035         1   # BR(~d_R -> chi^0_4 d)
     2.24224862E-06    2    -1000024         2   # BR(~d_R -> chi^-_1 u)
DECAY   1000001     6.64101365E+00   # ~d_L
#    BR                NDA      ID1      ID2
     2.17680458E-02    2     1000022         1   # BR(~d_L -> chi^0_1 d)
     2.99961832E-01    2     1000023         1   # BR(~d_L -> chi^0_2 d)
     1.92457517E-03    2     1000025         1   # BR(~d_L -> chi^0_3 d)
     2.32170305E-02    2     1000035         1   # BR(~d_L -> chi^0_4 d)
     5.92306261E-01    2    -1000024         2   # BR(~d_L -> chi^-_1 u)
     6.08222555E-02    2    -1000037         2   # BR(~d_L -> chi^-_2 u)
DECAY   2000003     3.59167645E-01   # ~s_R
#    BR                NDA      ID1      ID2
     9.83069548E-01    2     1000022         3   # BR(~s_R -> chi^0_1 s)
     8.55976448E-03    2     1000023         3   # BR(~s_R -> chi^0_2 s)
     1.65855640E-03    2     1000025         3   # BR(~s_R -> chi^0_3 s)
     5.72004017E-03    2     1000035         3   # BR(~s_R -> chi^0_4 s)
     9.87170437E-04    2    -1000024         4   # BR(~s_R -> chi^-_1 c)
     4.92076588E-06    2    -1000037         4   # BR(~s_R -> chi^-_2 c)
DECAY   1000003     6.64065409E+00   # ~s_L
#    BR                NDA      ID1      ID2
     2.17681437E-02    2     1000022         3   # BR(~s_L -> chi^0_1 s)
     2.99951961E-01    2     1000023         3   # BR(~s_L -> chi^0_2 s)
     1.92998466E-03    2     1000025         3   # BR(~s_L -> chi^0_3 s)
     2.32245501E-02    2     1000035         3   # BR(~s_L -> chi^0_4 s)
     5.92278146E-01    2    -1000024         4   # BR(~s_L -> chi^-_1 c)
     6.08472138E-02    2    -1000037         4   # BR(~s_L -> chi^-_2 c)
DECAY   1000005     7.41675339E+00   # ~b_1
#    BR                NDA      ID1      ID2
     2.17628446E-02    2     1000022         5   # BR(~b_1 -> chi^0_1 b)
     2.30993332E-01    2     1000023         5   # BR(~b_1 -> chi^0_2 b)
     5.70556224E-03    2     1000025         5   # BR(~b_1 -> chi^0_3 b)
     1.50710709E-02    2     1000035         5   # BR(~b_1 -> chi^0_4 b)
     3.53274030E-01    2    -1000024         6   # BR(~b_1 -> chi^-_1 t)
     2.83408457E-01    2    -1000037         6   # BR(~b_1 -> chi^-_2 t)
     8.97847006E-02    2     1000006       -24   # BR(~b_1 -> ~t_1 W^-)
DECAY   2000005     9.03329165E-01   # ~b_2
#    BR                NDA      ID1      ID2
     3.59608822E-01    2     1000022         5   # BR(~b_2 -> chi^0_1 b)
     2.39078056E-02    2     1000023         5   # BR(~b_2 -> chi^0_2 b)
     7.24537860E-02    2     1000025         5   # BR(~b_2 -> chi^0_3 b)
     8.77398628E-02    2     1000035         5   # BR(~b_2 -> chi^0_4 b)
     3.55772113E-02    2    -1000024         6   # BR(~b_2 -> chi^-_1 t)
     3.22500865E-01    2    -1000037         6   # BR(~b_2 -> chi^-_2 t)
     9.82116047E-02    2     1000006       -24   # BR(~b_2 -> ~t_1 W^-)
DECAY   2000002     1.43589303E+00   # ~u_R
#    BR                NDA      ID1      ID2
     9.84548103E-01    2     1000022         2   # BR(~u_R -> chi^0_1 u)
     8.08359441E-03    2     1000023         2   # BR(~u_R -> chi^0_2 u)
     1.62481345E-03    2     1000025         2   # BR(~u_R -> chi^0_3 u)
     5.74348073E-03    2     1000035         2   # BR(~u_R -> chi^0_4 u)
DECAY   1000002     6.84128745E+00   # ~u_L
#    BR                NDA      ID1      ID2
     7.34212692E-03    2     1000022         2   # BR(~u_L -> chi^0_1 u)
     3.11555595E-01    2     1000023         2   # BR(~u_L -> chi^0_2 u)
     1.10558287E-03    2     1000025         2   # BR(~u_L -> chi^0_3 u)
     1.70438613E-02    2     1000035         2   # BR(~u_L -> chi^0_4 u)
     6.42240293E-01    2     1000024         1   # BR(~u_L -> chi^+_1 d)
     2.07125404E-02    2     1000037         1   # BR(~u_L -> chi^+_2 d)
DECAY   2000004     1.43861534E+00   # ~c_R
#    BR                NDA      ID1      ID2
     9.82250375E-01    2     1000022         4   # BR(~c_R -> chi^0_1 c)
     8.81395311E-03    2     1000023         4   # BR(~c_R -> chi^0_2 c)
     1.67916651E-03    2     1000025         4   # BR(~c_R -> chi^0_3 c)
     5.71417754E-03    2     1000035         4   # BR(~c_R -> chi^0_4 c)
     1.54207188E-03    2     1000024         3   # BR(~c_R -> chi^+_1 s)
DECAY   1000004     6.83881720E+00   # ~c_L
#    BR                NDA      ID1      ID2
     7.43365997E-03    2     1000022         4   # BR(~c_L -> chi^0_1 c)
     3.11507053E-01    2     1000023         4   # BR(~c_L -> chi^0_2 c)
     1.10688417E-03    2     1000025         4   # BR(~c_L -> chi^0_3 c)
     1.70678097E-02    2     1000035         4   # BR(~c_L -> chi^0_4 c)
     6.42147119E-01    2     1000024         3   # BR(~c_L -> chi^+_1 s)
     2.07374746E-02    2     1000037         3   # BR(~c_L -> chi^+_2 s)
DECAY   1000006     3.26333852E+00   # ~t_1
#    BR                NDA      ID1      ID2
     2.00457627E-01    2     1000022         6   # BR(~t_1 -> chi^0_1 t)
     1.48071012E-01    2     1000023         6   # BR(~t_1 -> chi^0_2 t)
     5.01255385E-01    2     1000024         5   # BR(~t_1 -> chi^+_1 b)
     1.50215974E-01    2     1000037         5   # BR(~t_1 -> chi^+_2 b)
DECAY   2000006     1.00339567E+01   # ~t_2
#    BR                NDA      ID1      ID2
     2.11122741E-02    2     1000022         6   # BR(~t_2 -> chi^0_1 t)
     9.06721730E-02    2     1000023         6   # BR(~t_2 -> chi^0_2 t)
     9.43769427E-02    2     1000025         6   # BR(~t_2 -> chi^0_3 t)
     2.62035481E-01    2     1000035         6   # BR(~t_2 -> chi^0_4 t)
     2.14596878E-01    2     1000024         5   # BR(~t_2 -> chi^+_1 b)
     1.74507478E-01    2     1000037         5   # BR(~t_2 -> chi^+_2 b)
     1.07272224E-01    2     1000006        23   # BR(~t_2 -> ~t_1 Z)
     3.54265481E-02    2     1000006        25   # BR(~t_2 -> ~t_1 S^0_1)
DECAY   1000024     4.06946063E-03   # chi^+_1
#    BR                NDA      ID1      ID2
     9.99987309E-01    2     1000022        24   # BR(chi^+_1 -> chi^0_1 W^+)
#    BR                NDA      ID1      ID2       ID3
     6.34723850E-06    3     1000022        -1         2   # BR(chi^+_1 -> chi^0_1 d_bar u)
     6.34293384E-06    3     1000022        -3         4   # BR(chi^+_1 -> chi^0_1 s_bar c)
DECAY   1000037     2.02132058E+00   # chi^+_2
#    BR                NDA      ID1      ID2
     9.50489451E-02    2     1000022        24   # BR(chi^+_2 -> chi^0_1 W^+)
     3.44772811E-01    2     1000023        24   # BR(chi^+_2 -> chi^0_2 W^+)
     3.35725333E-05    2    -1000015        12   # BR(chi^+_2 -> S^+_1 nu_1)
     6.06788773E-05    2    -1000015        14   # BR(chi^+_2 -> S^+_1 nu_2)
     1.00011119E-04    2    -1000015        16   # BR(chi^+_2 -> S^+_1 nu_3)
     4.33764484E-03    2    -1000011        12   # BR(chi^+_2 -> S^+_4 nu_1)
     2.00487334E-03    2    -1000011        14   # BR(chi^+_2 -> S^+_4 nu_2)
     1.07692298E-05    2    -1000011        16   # BR(chi^+_2 -> S^+_4 nu_3)
     9.17870309E-04    2    -1000013        12   # BR(chi^+_2 -> S^+_5 nu_1)
     2.36442706E-03    2    -1000013        14   # BR(chi^+_2 -> S^+_5 nu_2)
     3.07237336E-03    2    -1000013        16   # BR(chi^+_2 -> S^+_5 nu_3)
     1.16875252E-03    2    -2000015        12   # BR(chi^+_2 -> S^+_6 nu_1)
     2.11242600E-03    2    -2000015        14   # BR(chi^+_2 -> S^+_6 nu_2)
     3.48166299E-03    2    -2000015        16   # BR(chi^+_2 -> S^+_6 nu_3)
     3.08735447E-01    2     1000024        23   # BR(chi^+_2 -> chi^+_1 Z)
     2.17770045E-03    2         -15   1000019   # BR(chi^+_2 -> tau^+ P^0_1)
     1.59744615E-03    2         -13   1000018   # BR(chi^+_2 -> mu^+ P^0_2)
     1.59547855E-03    2         -11   1000017   # BR(chi^+_2 -> e^+ P^0_3)
     2.20877206E-01    2     1000024        25   # BR(chi^+_2 -> chi^+_1 S^0_1)
     2.17770045E-03    2         -15   1000016   # BR(chi^+_2 -> tau^+ S^0_2)
     1.59744615E-03    2         -13   1000014   # BR(chi^+_2 -> mu^+ S^0_3)
     1.59547855E-03    2         -11   1000012   # BR(chi^+_2 -> e^+ S^0_4)
#    BR                NDA      ID1      ID2       ID3
     2.11309122E-06    3     1000024         2        -2   # BR(chi^+_2 -> chi^+_1 u u_bar)
     2.11114109E-06    3     1000024         4        -4   # BR(chi^+_2 -> chi^+_1 c c_bar)
     3.79520943E-05    3     1000024         5        -5   # BR(chi^+_2 -> chi^+_1 b b_bar)
     1.04899479E-04    3     1000022        -5         6   # BR(chi^+_2 -> chi^0_1 b_bar t)
     6.63462751E-06    3     1000023        -5         6   # BR(chi^+_2 -> chi^0_2 b_bar t)
DECAY   1000022     9.18608578E-14   # chi^0_1
#    BR                NDA      ID1      ID2
     1.32609779E-04    2         -11       -24   # BR(chi^0_1 -> e^+ W^-)
     1.32609779E-04    2          11        24   # BR(chi^0_1 -> e^- W^+)
     1.66807981E-01    2         -13       -24   # BR(chi^0_1 -> mu^+ W^-)
     1.66807981E-01    2          13        24   # BR(chi^0_1 -> mu^- W^+)
     1.51991120E-01    2         -15       -24   # BR(chi^0_1 -> tau^+ W^-)
     1.51991120E-01    2          15        24   # BR(chi^0_1 -> tau^- W^+)
     1.25891816E-06    2          12        23   # BR(chi^0_1 -> nu_1 Z)
     7.86228054E-05    2          14        23   # BR(chi^0_1 -> nu_2 Z)
     2.12698793E-01    2          16        23   # BR(chi^0_1 -> nu_3 Z)
     1.55515178E-06    2          14        22   # BR(chi^0_1 -> nu_2 photon)
     1.59246796E-05    2          16        22   # BR(chi^0_1 -> nu_3 photon)
#    BR                NDA      ID1      ID2       ID3
     1.58609084E-05    3          12         5        -5   # BR(chi^0_1 -> nu_1 b b_bar)
     1.72954760E-05    3          14         3        -3   # BR(chi^0_1 -> nu_2 s s_bar)
     4.11102916E-02    3          14         5        -5   # BR(chi^0_1 -> nu_2 b b_bar)
     7.80881585E-05    3          16         5        -5   # BR(chi^0_1 -> nu_3 b b_bar)
     1.74305222E-06    3         -11         3        -4   # BR(chi^0_1 -> e^+ s c_bar)
     1.74305222E-06    3          11        -3         4   # BR(chi^0_1 -> e^- s_bar c)
     2.03750411E-06    3         -13         3        -4   # BR(chi^0_1 -> mu^+ s c_bar)
     2.03750411E-06    3          13        -3         4   # BR(chi^0_1 -> mu^- s_bar c)
     2.07314368E-06    3         -15         3        -4   # BR(chi^0_1 -> tau^+ s c_bar)
     2.07314368E-06    3          15        -3         4   # BR(chi^0_1 -> tau^- s_bar c)
     1.68707367E-06    3          16        16        16   # BR(chi^0_1 -> nu_3 nu_3 nu_3)
     6.35057764E-06    3          12       -13        11   # BR(chi^0_1 -> nu_1 mu^+ e^-)
     6.35057764E-06    3          12       -11        13   # BR(chi^0_1 -> nu_1 e^+ mu^-)
     1.22038767E-05    3          12       -13        13   # BR(chi^0_1 -> nu_1 mu^+ mu^-)
     2.18229158E-03    3          12       -15        11   # BR(chi^0_1 -> nu_1 tau^+ e^-)
     2.18229158E-03    3          12       -11        15   # BR(chi^0_1 -> nu_1 e^+ tau^-)
     2.54215089E-03    3          12       -15        13   # BR(chi^0_1 -> nu_1 tau^+ mu^-)
     2.54215089E-03    3          12       -13        15   # BR(chi^0_1 -> nu_1 mu^+ tau^-)
     4.37404599E-03    3          12       -15        15   # BR(chi^0_1 -> nu_1 tau^+ tau^-)
     1.60023554E-05    3          14       -13        11   # BR(chi^0_1 -> nu_2 mu^+ e^-)
     1.60023554E-05    3          14       -11        13   # BR(chi^0_1 -> nu_2 e^+ mu^-)
     1.12896211E-04    3          14       -13        13   # BR(chi^0_1 -> nu_2 mu^+ mu^-)
     3.94406579E-03    3          14       -15        11   # BR(chi^0_1 -> nu_2 tau^+ e^-)
     3.94406579E-03    3          14       -11        15   # BR(chi^0_1 -> nu_2 e^+ tau^-)
     4.60021939E-03    3          14       -15        13   # BR(chi^0_1 -> nu_2 tau^+ mu^-)
     4.60021939E-03    3          14       -13        15   # BR(chi^0_1 -> nu_2 mu^+ tau^-)
     3.60897245E-02    3          14       -15        15   # BR(chi^0_1 -> nu_2 tau^+ tau^-)
     2.27283813E-06    3          16       -11        11   # BR(chi^0_1 -> nu_3 e^+ e^-)
     2.07276255E-05    3          16       -13        11   # BR(chi^0_1 -> nu_3 mu^+ e^-)
     2.07276255E-05    3          16       -11        13   # BR(chi^0_1 -> nu_3 e^+ mu^-)
     5.96293142E-05    3          16       -13        13   # BR(chi^0_1 -> nu_3 mu^+ mu^-)
     6.50051721E-03    3          16       -15        11   # BR(chi^0_1 -> nu_3 tau^+ e^-)
     6.50051721E-03    3          16       -11        15   # BR(chi^0_1 -> nu_3 e^+ tau^-)
     7.57559186E-03    3          16       -15        13   # BR(chi^0_1 -> nu_3 tau^+ mu^-)
     7.57559186E-03    3          16       -13        15   # BR(chi^0_1 -> nu_3 mu^+ tau^-)
     1.26761783E-02    3          16       -15        15   # BR(chi^0_1 -> nu_3 tau^+ tau^-)
DECAY   1000023     7.07053213E-04   # chi^0_2
#    BR                NDA      ID1      ID2
     9.92308233E-01    2     1000022        23   # BR(chi^0_2 -> chi^0_1 Z)
     3.96131572E-05    2     1000022        22   # BR(chi^0_2 -> chi^0_1 photon)
#    BR                NDA      ID1      ID2       ID3
     1.26756931E-05    3     1000022         2        -2   # BR(chi^0_2 -> chi^0_1 u u_bar)
     1.72016307E-05    3     1000022         4        -4   # BR(chi^0_2 -> chi^0_1 c c_bar)
     2.77457169E-05    3     1000022         1        -1   # BR(chi^0_2 -> chi^0_1 d d_bar)
     2.78099968E-05    3     1000022         3        -3   # BR(chi^0_2 -> chi^0_1 s s_bar)
     1.95116822E-04    3     1000022         5        -5   # BR(chi^0_2 -> chi^0_1 b b_bar)
     1.27233856E-03    3     1000022        12        12   # BR(chi^0_2 -> chi^0_1 nu_1 nu_1)
     1.27615292E-03    3     1000022        14        14   # BR(chi^0_2 -> chi^0_1 nu_2 nu_2)
     1.28167751E-03    3     1000022        16        16   # BR(chi^0_2 -> chi^0_1 nu_3 nu_3)
     1.08896074E-03    3     1000022       -11        11   # BR(chi^0_2 -> chi^0_1 e^+ e^-)
     1.08987525E-03    3     1000022       -13        13   # BR(chi^0_2 -> chi^0_1 mu^+ mu^-)
     1.36250749E-03    3     1000022       -15        15   # BR(chi^0_2 -> chi^0_1 tau^+ tau^-)
DECAY   1000025     1.89342398E+00   # chi^0_3
#    BR                NDA      ID1      ID2
     3.00217202E-01    2     1000024       -24   # BR(chi^0_3 -> chi^+_1 W^-)
     3.00217202E-01    2    -1000024        24   # BR(chi^0_3 -> chi^-_1 W^+)
     8.55331670E-04    2    -1000015        15   # BR(chi^0_3 -> S^+_1 tau^-)
     8.55331670E-04    2     1000015       -15   # BR(chi^0_3 -> S^-_1 tau^+)
     1.63355104E-04    2    -2000013        13   # BR(chi^0_3 -> S^+_2 mu^-)
     1.63355104E-04    2     2000013       -13   # BR(chi^0_3 -> S^-_2 mu^+)
     1.61417980E-04    2    -2000011        11   # BR(chi^0_3 -> S^+_3 e^-)
     1.61417980E-04    2     2000011       -11   # BR(chi^0_3 -> S^-_3 e^+)
     2.17583398E-05    2    -1000011        11   # BR(chi^0_3 -> S^+_4 e^-)
     2.17583398E-05    2     1000011       -11   # BR(chi^0_3 -> S^-_4 e^+)
     2.26774666E-05    2    -1000013        13   # BR(chi^0_3 -> S^+_5 mu^-)
     2.26774666E-05    2     1000013       -13   # BR(chi^0_3 -> S^-_5 mu^+)
     2.56552512E-04    2    -2000015        15   # BR(chi^0_3 -> S^+_6 tau^-)
     2.56552512E-04    2     2000015       -15   # BR(chi^0_3 -> S^-_6 tau^+)
     1.26632170E-01    2     1000022        23   # BR(chi^0_3 -> chi^0_1 Z)
     2.36775628E-01    2     1000023        23   # BR(chi^0_3 -> chi^0_2 Z)
     3.51049899E-05    2          12   1000019   # BR(chi^0_3 -> nu_1 P^0_1)
     6.34479296E-05    2          14   1000019   # BR(chi^0_3 -> nu_2 P^0_1)
     1.04576240E-04    2          16   1000019   # BR(chi^0_3 -> nu_3 P^0_1)
     2.73450459E-05    2          12   1000018   # BR(chi^0_3 -> nu_1 P^0_2)
     7.00249414E-05    2          14   1000018   # BR(chi^0_3 -> nu_2 P^0_2)
     9.11608065E-05    2          16   1000018   # BR(chi^0_3 -> nu_3 P^0_2)
     1.28568988E-04    2          12   1000017   # BR(chi^0_3 -> nu_1 P^0_3)
     5.96016841E-05    2          14   1000017   # BR(chi^0_3 -> nu_2 P^0_3)
     2.17655669E-02    2     1000022        25   # BR(chi^0_3 -> chi^0_1 S^0_1)
     1.02568196E-02    2     1000023        25   # BR(chi^0_3 -> chi^0_2 S^0_1)
     3.51049901E-05    2          12   1000016   # BR(chi^0_3 -> nu_1 S^0_2)
     6.34479291E-05    2          14   1000016   # BR(chi^0_3 -> nu_2 S^0_2)
     1.04576240E-04    2          16   1000016   # BR(chi^0_3 -> nu_3 S^0_2)
     2.73451193E-05    2          12   1000014   # BR(chi^0_3 -> nu_1 S^0_3)
     7.00248619E-05    2          14   1000014   # BR(chi^0_3 -> nu_2 S^0_3)
     9.11608126E-05    2          16   1000014   # BR(chi^0_3 -> nu_3 S^0_3)
     1.28568915E-04    2          12   1000012   # BR(chi^0_3 -> nu_1 S^0_4)
     5.96017641E-05    2          14   1000012   # BR(chi^0_3 -> nu_2 S^0_4)
     9.48796232E-06    2     1000023        22   # BR(chi^0_3 -> chi^0_2 photon)
#    BR                NDA      ID1      ID2       ID3
     1.54329380E-06    3     1000022         5        -5   # BR(chi^0_3 -> chi^0_1 b b_bar)
DECAY   1000035     2.27651456E+00   # chi^0_4
#    BR                NDA      ID1      ID2
     3.37878828E-01    2     1000024       -24   # BR(chi^0_4 -> chi^+_1 W^-)
     3.37878828E-01    2    -1000024        24   # BR(chi^0_4 -> chi^-_1 W^+)
     7.26432664E-04    2    -1000015        15   # BR(chi^0_4 -> S^+_1 tau^-)
     7.26432664E-04    2     1000015       -15   # BR(chi^0_4 -> S^-_1 tau^+)
     8.09911249E-04    2    -2000013        13   # BR(chi^0_4 -> S^+_2 mu^-)
     8.09911249E-04    2     2000013       -13   # BR(chi^0_4 -> S^-_2 mu^+)
     8.10788831E-04    2    -2000011        11   # BR(chi^0_4 -> S^+_3 e^-)
     8.10788831E-04    2     2000011       -11   # BR(chi^0_4 -> S^-_3 e^+)
     1.19129667E-03    2    -1000011        11   # BR(chi^0_4 -> S^+_4 e^-)
     1.19129667E-03    2     1000011       -11   # BR(chi^0_4 -> S^-_4 e^+)
     1.19357632E-03    2    -1000013        13   # BR(chi^0_4 -> S^+_5 mu^-)
     1.19357632E-03    2     1000013       -13   # BR(chi^0_4 -> S^-_5 mu^+)
     1.75505273E-03    2    -2000015        15   # BR(chi^0_4 -> S^+_6 tau^-)
     1.75505273E-03    2     2000015       -15   # BR(chi^0_4 -> S^-_6 tau^+)
     2.47935186E-02    2     1000022        23   # BR(chi^0_4 -> chi^0_1 Z)
     1.99952687E-02    2     1000023        23   # BR(chi^0_4 -> chi^0_2 Z)
     6.70076421E-04    2          12   1000019   # BR(chi^0_4 -> nu_1 P^0_1)
     1.21108030E-03    2          14   1000019   # BR(chi^0_4 -> nu_2 P^0_1)
     1.99612854E-03    2          16   1000019   # BR(chi^0_4 -> nu_3 P^0_1)
     5.36013554E-04    2          12   1000018   # BR(chi^0_4 -> nu_1 P^0_2)
     1.37261856E-03    2          14   1000018   # BR(chi^0_4 -> nu_2 P^0_2)
     1.78692067E-03    2          16   1000018   # BR(chi^0_4 -> nu_3 P^0_2)
     2.52043543E-03    2          12   1000017   # BR(chi^0_4 -> nu_1 P^0_3)
     1.16841704E-03    2          14   1000017   # BR(chi^0_4 -> nu_2 P^0_3)
     6.06321032E-06    2          16   1000017   # BR(chi^0_4 -> nu_3 P^0_3)
     8.28994230E-02    2     1000022        25   # BR(chi^0_4 -> chi^0_1 S^0_1)
     1.61008292E-01    2     1000023        25   # BR(chi^0_4 -> chi^0_2 S^0_1)
     6.70076423E-04    2          12   1000016   # BR(chi^0_4 -> nu_1 S^0_2)
     1.21108029E-03    2          14   1000016   # BR(chi^0_4 -> nu_2 S^0_2)
     1.99612855E-03    2          16   1000016   # BR(chi^0_4 -> nu_3 S^0_2)
     5.36014992E-04    2          12   1000014   # BR(chi^0_4 -> nu_1 S^0_3)
     1.37261701E-03    2          14   1000014   # BR(chi^0_4 -> nu_2 S^0_3)
     1.78692079E-03    2          16   1000014   # BR(chi^0_4 -> nu_3 S^0_3)
     2.52043399E-03    2          12   1000012   # BR(chi^0_4 -> nu_1 S^0_4)
     1.16841861E-03    2          14   1000012   # BR(chi^0_4 -> nu_2 S^0_4)
     6.06308212E-06    2          16   1000012   # BR(chi^0_4 -> nu_3 S^0_4)
     1.42214655E-05    2     1000023        22   # BR(chi^0_4 -> chi^0_2 photon)
#    BR                NDA      ID1      ID2       ID3
     1.42647885E-06    3     1000022         5        -5   # BR(chi^0_4 -> chi^0_1 b b_bar)
     1.01299799E-06    3     1000023         1        -1   # BR(chi^0_4 -> chi^0_2 d d_bar)
     1.01323865E-06    3     1000023         3        -3   # BR(chi^0_4 -> chi^0_2 s s_bar)
     2.33697313E-06    3     1000023         5        -5   # BR(chi^0_4 -> chi^0_2 b b_bar)
     4.44095920E-06    3     1000024         5        -6   # BR(chi^0_4 -> chi^+_1 b t_bar)
     4.44095920E-06    3    -1000024        -5         6   # BR(chi^0_4 -> chi^-_1 b_bar t)
DECAY   1000021     1.39925283E+00   # ~g
#    BR                NDA      ID1      ID2
     2.35384048E-02    2     2000002        -2   # BR(~g -> ~u_R u_bar)
     2.35384048E-02    2    -2000002         2   # BR(~g -> ~u^*_R u)
     1.27236830E-03    2     1000002        -2   # BR(~g -> ~u_L u_bar)
     1.27236830E-03    2    -1000002         2   # BR(~g -> ~u^*_L u)
     2.34644159E-02    2     2000004        -4   # BR(~g -> ~c_R c_bar)
     2.34644159E-02    2    -2000004         4   # BR(~g -> ~c^*_R c)
     1.24311577E-03    2     1000004        -4   # BR(~g -> ~c_L c_bar)
     1.24311577E-03    2    -1000004         4   # BR(~g -> ~c^*_L c)
     1.48124004E-01    2     1000006        -6   # BR(~g -> ~t_1 t_bar)
     1.48124004E-01    2    -1000006         6   # BR(~g -> ~t^*_1 t)
     2.47755946E-02    2     2000001        -1   # BR(~g -> ~d_R d_bar)
     2.47755946E-02    2    -2000001         1   # BR(~g -> ~d^*_R d)
     2.64756771E-05    2     1000001        -1   # BR(~g -> ~d_L d_bar)
     2.64756771E-05    2    -1000001         1   # BR(~g -> ~d^*_L d)
     2.47800605E-02    2     2000003        -3   # BR(~g -> ~s_R s_bar)
     2.47800605E-02    2    -2000003         3   # BR(~g -> ~s^*_R s)
     2.63234493E-05    2     1000003        -3   # BR(~g -> ~s_L s_bar)
     2.63234493E-05    2    -1000003         3   # BR(~g -> ~s^*_L s)
     2.19728279E-01    2     1000005        -5   # BR(~g -> ~b_1 b_bar)
     2.19728279E-01    2    -1000005         5   # BR(~g -> ~b^*_1 b)
     3.15707646E-02    2     2000005        -5   # BR(~g -> ~b_2 b_bar)
     3.15707646E-02    2    -2000005         5   # BR(~g -> ~b^*_2 b)
     7.03751484E-06    2     1000022        21   # BR(~g -> chi^0_1 g)
     1.58611624E-04    2     1000023        21   # BR(~g -> chi^0_2 g)
     3.12908090E-04    2     1000025        21   # BR(~g -> chi^0_3 g)
     2.97515375E-04    2     1000035        21   # BR(~g -> chi^0_4 g)
#    BR                NDA      ID1      ID2       ID3
     9.28700005E-05    3     1000022         6        -6   # BR(~g -> chi^0_1 t t_bar)
     2.39248506E-04    3     1000023         6        -6   # BR(~g -> chi^0_2 t t_bar)
     8.08281699E-04    3     1000024         5        -6   # BR(~g -> chi^+_1 b t_bar)
     8.08281699E-04    3    -1000024        -5         6   # BR(~g -> chi^-_1 b_bar t)
     8.78156768E-05    3     1000037         5        -6   # BR(~g -> chi^+_2 b t_bar)
     8.78156768E-05    3    -1000037        -5         6   # BR(~g -> chi^-_2 b_bar t)
DECAY        25     1.91983661E-03   # S^0_1
#    BR                NDA      ID1      ID2
     3.48957574E-04    2           3        -3   # BR(S^0_1 -> s s_bar)
     8.15160486E-01    2           5        -5   # BR(S^0_1 -> b b_bar)
     5.32075110E-02    2           4        -4   # BR(S^0_1 -> c c_bar)
     4.51714436E-04    2         -13        13   # BR(S^0_1 -> mu^+ mu^-)
     1.27599506E-01    2         -15        15   # BR(S^0_1 -> tau^+ tau^-)
# writing decays into V V* as 3-body decays
#    BR                NDA      ID1      ID2       ID3
     0.00000000E+00    3          24        11        12   # BR(S^0_1 -> W^+ d u)
     0.00000000E+00    3          24        13        14   # BR(S^0_1 -> W^+ s c)
     0.00000000E+00    3          24        15        16   # BR(S^0_1 -> W^+ b t)
     0.00000000E+00    3          24         1        -2   # BR(S^0_1 -> W^+ ~c_L ~u^*_R)
     0.00000000E+00    3          24         3        -4   # BR(S^0_1 -> W^+ ~t_1 ~u^*_L)
     0.00000000E+00    3         -24       -11       -12   # BR(S^0_1 -> W^- d_bar u_bar)
     0.00000000E+00    3         -24       -13       -14   # BR(S^0_1 -> W^- s_bar c_bar)
     0.00000000E+00    3         -24       -15       -16   # BR(S^0_1 -> W^- b_bar t_bar)
     0.00000000E+00    3         -24        -1         2   # BR(S^0_1 -> W^- ~c^*_L ~u_R)
     0.00000000E+00    3         -24        -3         4   # BR(S^0_1 -> W^- ~t^*_1 ~u_L)
     1.13075401E-04    3          23        11       -11   # BR(S^0_1 -> Z d d_bar)
     1.13075401E-04    3          23        13       -13   # BR(S^0_1 -> Z s s_bar)
     9.69217721E-05    3          23        15       -15   # BR(S^0_1 -> Z b b_bar)
     6.46145148E-04    3          23        12       -12   # BR(S^0_1 -> Z u u_bar)
     4.52301603E-04    3          23         1        -1   # BR(S^0_1 -> Z ~u_R ~u^*_R)
     4.52301603E-04    3          23         3        -3   # BR(S^0_1 -> Z ~u_L ~u^*_L)
     4.52301603E-04    3          23         5        -5   # BR(S^0_1 -> Z ~c_R ~c^*_R)
     4.52301603E-04    3          23         2        -2   # BR(S^0_1 -> Z ~u_R ~u^*_R)
     4.52301603E-04    3          23         4        -4   # BR(S^0_1 -> Z ~u_L ~u^*_L)
DECAY   1000016     2.01779558E+00   # S^0_2
#    BR                NDA      ID1      ID2
     3.55736083E-02    2          12   1000022   # BR(S^0_2 -> nu_1 chi^0_1)
     4.00779306E-02    2          12   1000023   # BR(S^0_2 -> nu_1 chi^0_2)
     6.42948986E-02    2          14   1000022   # BR(S^0_2 -> nu_2 chi^0_1)
     7.24359043E-02    2          14   1000023   # BR(S^0_2 -> nu_2 chi^0_2)
     1.05972233E-01    2          16   1000022   # BR(S^0_2 -> nu_3 chi^0_1)
     1.19390414E-01    2          16   1000023   # BR(S^0_2 -> nu_3 chi^0_2)
     2.81127503E-01    2         -15  -1000024   # BR(S^0_2 -> tau^+ chi^-_1)
     2.81127503E-01    2          15   1000024   # BR(S^0_2 -> tau^- chi^+_1)
DECAY   1000014     2.03806391E+00   # S^0_3
#    BR                NDA      ID1      ID2
     2.97370851E-02    2          12   1000022   # BR(S^0_3 -> nu_1 chi^0_1)
     3.37406600E-02    2          12   1000023   # BR(S^0_3 -> nu_1 chi^0_2)
     7.61501624E-02    2          14   1000022   # BR(S^0_3 -> nu_2 chi^0_1)
     8.64024410E-02    2          14   1000023   # BR(S^0_3 -> nu_2 chi^0_2)
     9.91349430E-02    2          16   1000022   # BR(S^0_3 -> nu_3 chi^0_1)
     1.12481718E-01    2          16   1000023   # BR(S^0_3 -> nu_3 chi^0_2)
     2.81176439E-01    2         -13  -1000024   # BR(S^0_3 -> mu^+ chi^-_1)
     2.81176439E-01    2          13   1000024   # BR(S^0_3 -> mu^- chi^+_1)
DECAY   1000012     2.03813545E+00   # S^0_4
#    BR                NDA      ID1      ID2
     1.39851018E-01    2          12   1000022   # BR(S^0_4 -> nu_1 chi^0_1)
     1.58683442E-01    2          12   1000023   # BR(S^0_4 -> nu_1 chi^0_2)
     6.48319031E-02    2          14   1000022   # BR(S^0_4 -> nu_2 chi^0_1)
     7.35622070E-02    2          14   1000023   # BR(S^0_4 -> nu_2 chi^0_2)
     3.36421509E-04    2          16   1000022   # BR(S^0_4 -> nu_3 chi^0_1)
     3.81724237E-04    2          16   1000023   # BR(S^0_4 -> nu_3 chi^0_2)
     2.81176585E-01    2         -11  -1000024   # BR(S^0_4 -> e^+ chi^-_1)
     2.81176585E-01    2          11   1000024   # BR(S^0_4 -> e^- chi^+_1)
DECAY        35     1.22238220E+00   # S^0_5
#    BR                NDA      ID1      ID2
     2.27685549E-04    2           3        -3   # BR(S^0_5 -> s s_bar)
     5.33906463E-01    2           5        -5   # BR(S^0_5 -> b b_bar)
     4.35555667E-06    2           4        -4   # BR(S^0_5 -> c c_bar)
     1.20815609E-01    2           6        -6   # BR(S^0_5 -> t t_bar)
     1.70982826E-02    2     1000022   1000022   # BR(S^0_5 -> chi^0_1 chi^0_1)
     6.38440010E-02    2     1000022   1000023   # BR(S^0_5 -> chi^0_1 chi^0_2)
     4.73865674E-02    2     1000022   1000025   # BR(S^0_5 -> chi^0_1 chi^0_3)
     3.82881029E-02    2     1000023   1000023   # BR(S^0_5 -> chi^0_2 chi^0_2)
     2.90483066E-04    2         -13        13   # BR(S^0_5 -> mu^+ mu^-)
     8.21756659E-02    2         -15        15   # BR(S^0_5 -> tau^+ tau^-)
     9.54671719E-02    2     1000024  -1000024   # BR(S^0_5 -> chi^+_1 chi^-_1)
     4.95028637E-04    2          23        23   # BR(S^0_5 -> Z Z)
DECAY   1000019     2.01779558E+00   # P^0_1
#    BR                NDA      ID1      ID2
     3.55736082E-02    2          12   1000022   # BR(P^0_1 -> nu_1 chi^0_1)
     4.00779305E-02    2          12   1000023   # BR(P^0_1 -> nu_1 chi^0_2)
     6.42948991E-02    2          14   1000022   # BR(P^0_1 -> nu_2 chi^0_1)
     7.24359049E-02    2          14   1000023   # BR(P^0_1 -> nu_2 chi^0_2)
     1.05972233E-01    2          16   1000022   # BR(P^0_1 -> nu_3 chi^0_1)
     1.19390413E-01    2          16   1000023   # BR(P^0_1 -> nu_3 chi^0_2)
     2.81127503E-01    2         -15  -1000024   # BR(P^0_1 -> tau^+ chi^-_1)
     2.81127503E-01    2          15   1000024   # BR(P^0_1 -> tau^- chi^+_1)
DECAY   1000018     2.03806391E+00   # P^0_2
#    BR                NDA      ID1      ID2
     2.97370053E-02    2          12   1000022   # BR(P^0_2 -> nu_1 chi^0_1)
     3.37405695E-02    2          12   1000023   # BR(P^0_2 -> nu_1 chi^0_2)
     7.61502489E-02    2          14   1000022   # BR(P^0_2 -> nu_2 chi^0_1)
     8.64025391E-02    2          14   1000023   # BR(P^0_2 -> nu_2 chi^0_2)
     9.91349363E-02    2          16   1000022   # BR(P^0_2 -> nu_3 chi^0_1)
     1.12481710E-01    2          16   1000023   # BR(P^0_2 -> nu_3 chi^0_2)
     2.81176439E-01    2         -13  -1000024   # BR(P^0_2 -> mu^+ chi^-_1)
     2.81176439E-01    2          13   1000024   # BR(P^0_2 -> mu^- chi^+_1)
DECAY   1000017     2.03813545E+00   # P^0_3
#    BR                NDA      ID1      ID2
     1.39851098E-01    2          12   1000022   # BR(P^0_3 -> nu_1 chi^0_1)
     1.58683533E-01    2          12   1000023   # BR(P^0_3 -> nu_1 chi^0_2)
     6.48318160E-02    2          14   1000022   # BR(P^0_3 -> nu_2 chi^0_1)
     7.35621082E-02    2          14   1000023   # BR(P^0_3 -> nu_2 chi^0_2)
     3.36428622E-04    2          16   1000022   # BR(P^0_3 -> nu_3 chi^0_1)
     3.81732307E-04    2          16   1000023   # BR(P^0_3 -> nu_3 chi^0_2)
     2.81176586E-01    2         -11  -1000024   # BR(P^0_3 -> e^+ chi^-_1)
     2.81176586E-01    2          11   1000024   # BR(P^0_3 -> e^- chi^+_1)
DECAY        36     1.76405909E+00   # P^0_4
#    BR                NDA      ID1      ID2
     1.57878333E-04    2           3        -3   # BR(P^0_4 -> s s_bar)
     3.70235934E-01    2           5        -5   # BR(P^0_4 -> b b_bar)
     2.69663443E-06    2           4        -4   # BR(P^0_4 -> c c_bar)
     1.27783896E-01    2           6        -6   # BR(P^0_4 -> t t_bar)
     1.70968522E-02    2     1000022   1000022   # BR(P^0_4 -> chi^0_1 chi^0_1)
     8.60435044E-02    2     1000022   1000023   # BR(P^0_4 -> chi^0_1 chi^0_2)
     1.56225962E-03    2     1000022   1000025   # BR(P^0_4 -> chi^0_1 chi^0_3)
     9.88297548E-02    2     1000023   1000023   # BR(P^0_4 -> chi^0_2 chi^0_2)
     2.01423597E-04    2         -13        13   # BR(P^0_4 -> mu^+ mu^-)
     5.69841343E-02    2         -15        15   # BR(P^0_4 -> tau^+ tau^-)
     2.40480673E-01    2     1000024  -1000024   # BR(P^0_4 -> chi^+_1 chi^-_1)
     6.20588961E-04    2          25        23   # BR(P^0_4 -> S^0_1 Z)
DECAY  -1000015     1.28646677E+00   # S^+_1
#    BR                NDA      ID1      ID2
     9.13662638E-01    2         -15   1000022   # BR(S^+_1 -> tau^+ chi^0_1)
     3.29833163E-02    2         -15   1000023   # BR(S^+_1 -> tau^+ chi^0_2)
     9.22067174E-03    2     1000024        12   # BR(S^+_1 -> chi^+_1 nu_1)
     1.66653879E-02    2     1000024        14   # BR(S^+_1 -> chi^+_1 nu_2)
     2.74679807E-02    2     1000024        16   # BR(S^+_1 -> chi^+_1 nu_3)
DECAY  -2000013     1.26279201E+00   # S^+_2
#    BR                NDA      ID1      ID2
     9.95379883E-01    2         -13   1000022   # BR(S^+_2 -> mu^+ chi^0_1)
     4.36078526E-03    2         -13   1000023   # BR(S^+_2 -> mu^+ chi^0_2)
     3.75418391E-05    2     1000024        12   # BR(S^+_2 -> chi^+_1 nu_1)
     9.64004438E-05    2     1000024        14   # BR(S^+_2 -> chi^+_1 nu_2)
     1.25389219E-04    2     1000024        16   # BR(S^+_2 -> chi^+_1 nu_3)
DECAY  -2000011     1.26264434E+00   # S^+_3
#    BR                NDA      ID1      ID2
     9.95779630E-01    2         -11   1000022   # BR(S^+_3 -> e^+ chi^0_1)
     4.22036368E-03    2         -11   1000023   # BR(S^+_3 -> e^+ chi^0_2)
DECAY  -1000011     2.05600660E+00   # S^+_4
#    BR                NDA      ID1      ID2
     1.49746108E-01    2         -11   1000022   # BR(S^+_4 -> e^+ chi^0_1)
     3.14470387E-01    2         -11   1000023   # BR(S^+_4 -> e^+ chi^0_2)
     3.65800705E-01    2     1000024        12   # BR(S^+_4 -> chi^+_1 nu_1)
     1.69074488E-01    2     1000024        14   # BR(S^+_4 -> chi^+_1 nu_2)
     9.08188210E-04    2     1000024        16   # BR(S^+_4 -> chi^+_1 nu_3)
DECAY  -1000013     2.05566545E+00   # S^+_5
#    BR                NDA      ID1      ID2
     1.49906421E-01    2         -13   1000022   # BR(S^+_5 -> mu^+ chi^0_1)
     3.14418331E-01    2         -13   1000023   # BR(S^+_5 -> mu^+ chi^0_2)
     7.73730278E-02    2     1000024        12   # BR(S^+_5 -> chi^+_1 nu_1)
     1.99312584E-01    2     1000024        14   # BR(S^+_5 -> chi^+_1 nu_2)
     2.58989512E-01    2     1000024        16   # BR(S^+_5 -> chi^+_1 nu_3)
DECAY  -2000015     1.97656271E+00   # S^+_6
#    BR                NDA      ID1      ID2
     1.85826664E-01    2         -15   1000022   # BR(S^+_6 -> tau^+ chi^0_1)
     3.02982242E-01    2         -15   1000023   # BR(S^+_6 -> tau^+ chi^0_2)
     8.83438713E-02    2     1000024        12   # BR(S^+_6 -> chi^+_1 nu_1)
     1.59674662E-01    2     1000024        14   # BR(S^+_6 -> chi^+_1 nu_2)
     2.63172557E-01    2     1000024        16   # BR(S^+_6 -> chi^+_1 nu_3)
DECAY        37     9.53057707E-01   # S^+_7
#    BR                NDA      ID1      ID2
     2.64100662E-04    2          -3         4   # BR(S^+_7 -> s_bar c)
     6.69643439E-01    2          -5         6   # BR(S^+_7 -> b_bar t)
     5.46823934E-05    2         -13        12   # BR(S^+_7 -> mu^+ nu_1)
     1.40414230E-04    2         -13        14   # BR(S^+_7 -> mu^+ nu_2)
     1.82638468E-04    2         -13        16   # BR(S^+_7 -> mu^+ nu_3)
     1.84682792E-02    2         -15        12   # BR(S^+_7 -> tau^+ nu_1)
     3.33794669E-02    2         -15        14   # BR(S^+_7 -> tau^+ nu_2)
     5.50162016E-02    2         -15        16   # BR(S^+_7 -> tau^+ nu_3)
     2.14082657E-01    2     1000024   1000022   # BR(S^+_7 -> chi^+_1 chi^0_1)
     1.08829375E-03    2     1000024   1000023   # BR(S^+_7 -> chi^+_1 chi^0_2)
     6.46836260E-03    2     1000037   1000022   # BR(S^+_7 -> chi^+_2 chi^0_1)
     1.21078996E-03    2          25        24   # BR(S^+_7 -> S^0_1 W^+)
Block SPhenoLowEnergy  # low energy observables
    1    0.00000000E+00   # BR(b -> s gamma)
    2    0.00000000E+00   # BR(b -> s mu+ mu-)
    3    0.00000000E+00   # BR(b -> s nu nu)
    4    0.00000000E+00   # BR(Bd -> mu+ mu-)
    5    0.00000000E+00   # BR(Bs -> mu+ mu-)
    6    0.00000000E+00   # BR(B_u -> tau nu)
    7    0.00000000E+00   # BR(B_u -> tau nu)/BR(B_u -> tau nu)_SM
    8    0.00000000E+00   # |Delta(M_Bd)| [ps^-1] 
    9    0.00000000E+00   # |Delta(M_Bs)| [ps^-1] 
   20    0.00000000E+00   # Delta(g-2)_electron/2
   21    0.00000000E+00   # Delta(g-2)_muon/2
   22    0.00000000E+00   # Delta(g-2)_tau/2
   23    0.00000000E+00   # electric dipole moment of the electron
   24    0.00000000E+00   # electric dipole moment of the muon
   25    0.00000000E+00   # electric dipole moment of the tau
   26    0.00000000E+00   # Br(mu -> e gamma)
   27    0.00000000E+00   # Br(tau -> e gamma)
   28    0.00000000E+00   # Br(tau -> mu gamma)
   29    0.00000000E+00   # Br(mu -> 3 e)
   30    0.00000000E+00   # Br(tau -> 3 e)
   31    0.00000000E+00   # Br(tau -> 3 mu)
   39    0.00000000E+00   # Delta(rho_parameter)
   40    0.00000000E+00   # BR(Z -> e mu)
   41    0.00000000E+00   # BR(Z -> e tau)
   42    0.00000000E+00   # BR(Z -> mu tau)
