#  ISAJET SUSY parameters in SUSY Les Houches Accord 2 format
#  Created by ISALHA 2.0 Last revision: C. Balazs 21 Apr 2009
Block SPINFO   # Program information
     1   ISASUGRA from ISAJET          # Spectrum Calculator
     2   7.80   29-OCT-2009 12:50:36   # Version number
Block MODSEL   # Model selection
     1     2   # Minimal gauge mediated (GMSB) model               
Block SMINPUTS   # Standard Model inputs
     1     1.27836258E+02   # alpha_em^(-1)
     2     1.16570000E-05   # G_Fermi
     3     1.17200002E-01   # alpha_s(M_Z)
     4     9.11699982E+01   # m_{Z}(pole)
     5     4.19999981E+00   # m_{b}(m_{b})
     6     1.72500000E+02   # m_{top}(pole)
     7     1.77699995E+00   # m_{tau}(pole)
Block MINPAR   # SUSY breaking input parameters
     1     3.50000000E+04   # Lambda scale of soft SSB
     2     2.50000000E+05   # M_mess overall messenger scale
     3     2.50000000E+01   # tan(beta)
     4     1.00000000E+00   # sign(mu)
     5     3.00000000E+00   # N_5 messenger index
     6     1.00000000E+00   # c_grav gravitino mass factor
    51     3.00000000E+00   # N5_1  U(1)_Y messenger index
    52     3.00000000E+00   # N5_2 SU(2)_L messenger index
    53     3.00000000E+00   # N5_3 SU(3)_C messenger index
   101     1.00000000E+00   # Rsl
   102     0.00000000E+00   # dmH_d^2
   103     0.00000000E+00   # dmH_u^2
   104     0.00000000E+00   # d_Y
Block MASS   # Scalar and gaugino mass spectrum
#  PDG code   mass                 particle
        24     8.04229965E+01   #  W^+
        25     1.10213234E+02   #  h^0            
        35     3.44012390E+02   #  H^0            
        36     3.41674255E+02   #  A^0            
        37     3.53552277E+02   #  H^+            
   1000001     7.94693359E+02   #  dnl            
   1000002     7.90377563E+02   #  upl            
   1000003     7.94693359E+02   #  stl            
   1000004     7.90378845E+02   #  chl            
   1000005     7.43131409E+02   #  b1             
   1000006     6.98822388E+02   #  t1             
   1000011     2.35366272E+02   #  el-            
   1000012     2.19309402E+02   #  nuel           
   1000013     2.35366318E+02   #  mul-           
   1000014     2.19309402E+02   #  numl           
   1000015     9.51759338E+01   #  tau1           
   1000016     2.15350708E+02   #  nutl           
   1000021     8.11939697E+02   #  glss           
   1000022     1.37193573E+02   #  z1ss           
   1000023     2.37336227E+02   #  z2ss           
   1000024     2.37240356E+02   #  w1ss           
   1000025    -3.05430908E+02   #  z3ss           
   1000035     3.51908112E+02   #  z4ss           
   1000037     3.50881561E+02   #  w2ss           
   1000039     2.10492290E-09   #  gvss
   2000001     7.62816345E+02   #  dnr            
   2000002     7.63964233E+02   #  upr            
   2000003     7.62816345E+02   #  str            
   2000004     7.63965515E+02   #  chr            
   2000005     7.69070679E+02   #  b2             
   2000006     7.85015259E+02   #  t2             
   2000011     1.15628487E+02   #  er-            
   2000013     1.15628532E+02   #  mur-           
   2000015     2.40197815E+02   #  tau2           
Block ALPHA   # Effective Higgs mixing parameter
         -4.67791967E-02   # alpha
Block STOPMIX   # stop mixing matrix
  1  1     3.57513875E-01   # O_{11}
  1  2     9.33907866E-01   # O_{12}
  2  1    -9.33907866E-01   # O_{21}
  2  2     3.57513875E-01   # O_{22}
Block SBOTMIX   # sbottom mixing matrix
  1  1     6.19978249E-01   # O_{11}
  1  2     7.84618974E-01   # O_{12}
  2  1    -7.84618974E-01   # O_{21}
  2  2     6.19978249E-01   # O_{22}
Block STAUMIX   # stau mixing matrix
  1  1     2.76610583E-01   # O_{11}
  1  2     9.60982084E-01   # O_{12}
  2  1    -9.60982084E-01   # O_{21}
  2  2     2.76610583E-01   # O_{22}
Block NMIX   # neutralino mixing matrix
  1  1     9.72999632E-01   #
  1  2    -5.96419796E-02   #
  1  3     2.00247258E-01   #
  1  4    -9.80624259E-02   #
  2  1    -1.84773505E-01   #
  2  2    -7.64251530E-01   #
  2  3     4.79130596E-01   #
  2  4    -3.90143692E-01   #
  3  1     6.58593923E-02   #
  3  2    -8.83750916E-02   #
  3  3    -6.94509387E-01   #
  3  4    -7.10991919E-01   #
  4  1    -1.21629171E-01   #
  4  2     6.36044264E-01   #
  4  3     4.97987688E-01   #
  4  4    -5.76769054E-01   #
Block UMIX   # chargino U mixing matrix
  1  1    -7.16213822E-01   # U_{11}
  1  2     6.97880864E-01   # U_{12}
  2  1    -6.97880864E-01   # U_{21}
  2  2    -7.16213822E-01   # U_{22}
Block VMIX   # chargino V mixing matrix
  1  1    -8.26575041E-01   # V_{11}
  1  2     5.62826514E-01   # V_{12}
  2  1    -5.62826514E-01   # V_{21}
  2  2    -8.26575041E-01   # V_{22}
Block GAUGE Q=  6.95453979E+02   #
     1     3.57524991E-01   # g`
     2     6.52378619E-01   # g_2
     3     1.21928000E+00   # g_3
Block YU Q=  6.95453979E+02   #
  3  3     8.74642611E-01   # y_t
Block YD Q=  6.95453979E+02   #
  3  3     3.28015000E-01   # y_b
Block YE Q=  6.95453979E+02   #
  3  3     2.60433108E-01   # y_tau
Block HMIX Q=  6.95453979E+02   # Higgs mixing parameters
     1     2.96646240E+02   # mu(Q)
     2     2.50000000E+01   # tan(beta)(M_GUT)
     3     2.49810699E+02   # Higgs vev at Q
     4     1.16741297E+05   # m_A^2(Q)
Block MSOFT Q=  6.95453979E+02   # DRbar SUSY breaking parameters
     1     1.44740570E+02   # M_1(Q)          
     2     2.74053284E+02   # M_2(Q)          
     3     7.60883911E+02   # M_3(Q)          
    31     2.28829285E+02   # MeL(Q)          
    32     2.28829285E+02   # MmuL(Q)         
    33     2.25109039E+02   # MtauL(Q)        
    34     1.07656342E+02   # MeR(Q)          
    35     1.07656342E+02   # MmuR(Q)         
    36     1.02348549E+02   # MtauR(Q)        
    41     7.53381897E+02   # MqL1(Q)         
    42     7.53381897E+02   # MqL2(Q)         
    43     7.23870361E+02   # MqL3(Q)         
    44     7.26635803E+02   # MuR(Q)          
    45     7.26635803E+02   # McR(Q)          
    46     6.68153198E+02   # MtR(Q)          
    47     7.24197449E+02   # MdR(Q)          
    48     7.24197449E+02   # MsR(Q)          
    49     7.16986877E+02   # MbR(Q)          
Block AU Q=  6.95453979E+02   #
  1  1    -2.62824127E+02   # A_u
  2  2    -2.62824127E+02   # A_c
  3  3    -2.62824127E+02   # A_t
Block AD Q=  6.95453979E+02   #
  1  1    -2.94382294E+02   # A_d
  2  2    -2.94382294E+02   # A_s
  3  3    -2.94382294E+02   # A_b
Block AE Q=  6.95453979E+02   #
  1  1    -2.72096481E+01   # A_e
  2  2    -2.72096481E+01   # A_mu
  3  3    -2.72096481E+01   # A_tau
#  ISAJET decay tables in SUSY Les Houches accord format
#  Created by ISALHD. Last revision: C. Balazs, 2005 May 25
Block DCINFO                           # Program information
     1   ISASUGRA from ISAJET          # Spectrum Calculator
     2   7.80   29-OCT-2009 12:50:36   # Version number
#         PDG         Width
DECAY         6  1.14680779E+00   # TP    decays
#          BR          NDA       ID1       ID2       ID3       ID4
      3.33333343E-01    3            2        -1         5             # TP     -->  UP     DB     BT          
      3.33333343E-01    3            4        -3         5             # TP     -->  CH     SB     BT          
      1.11111112E-01    3          -11        12         5             # TP     -->  E+     NUE    BT          
      1.11111112E-01    3          -13        14         5             # TP     -->  MU+    NUM    BT          
      1.11111112E-01    3          -15        16         5             # TP     -->  TAU+   NUT    BT          
#         PDG         Width
DECAY   1000021  1.92326915E+00   # GLSS  decays
#          BR          NDA       ID1       ID2       ID3       ID4
      1.40833028E-03    3      1000024         5        -6             # GLSS   -->  W1SS+  BT     TB          
      1.40833028E-03    3     -1000024         6        -5             # GLSS   -->  W1SS-  TP     BB          
      2.58065434E-03    3      1000037         5        -6             # GLSS   -->  W2SS+  BT     TB          
      2.58065434E-03    3     -1000037         6        -5             # GLSS   -->  W2SS-  TP     BB          
      2.73667837E-07    2      1000022        21                       # GLSS   -->  Z1SS   GL                 
      1.47793919E-03    3      1000022         6        -6             # GLSS   -->  Z1SS   TP     TB          
      1.00963109E-04    2      1000023        21                       # GLSS   -->  Z2SS   GL                 
      1.82485220E-03    3      1000023         6        -6             # GLSS   -->  Z2SS   TP     TB          
      3.22474778E-04    2      1000025        21                       # GLSS   -->  Z3SS   GL                 
      2.58867233E-03    3      1000025         6        -6             # GLSS   -->  Z3SS   TP     TB          
      2.41209156E-04    2      1000035        21                       # GLSS   -->  Z4SS   GL                 
      2.79433653E-03    3      1000035         6        -6             # GLSS   -->  Z4SS   TP     TB          
      1.36415316E-02    2     -1000002         2                       # GLSS   -->  UBL    UP                 
      1.36415316E-02    2      1000002        -2                       # GLSS   -->  UPL    UB                 
      8.77422374E-03    2     -1000001         1                       # GLSS   -->  DBL    DN                 
      8.77422374E-03    2      1000001        -1                       # GLSS   -->  DNL    DB                 
      6.53251782E-02    2     -2000002         2                       # GLSS   -->  UBR    UP                 
      6.53251782E-02    2      2000002        -2                       # GLSS   -->  UPR    UB                 
      6.83889613E-02    2     -2000001         1                       # GLSS   -->  DBR    DN                 
      6.83889613E-02    2      2000001        -1                       # GLSS   -->  DNR    DB                 
      8.77366588E-03    2     -1000003         3                       # GLSS   -->  SBL    ST                 
      8.77366588E-03    2      1000003        -3                       # GLSS   -->  STL    SB                 
      6.83884695E-02    2     -2000003         3                       # GLSS   -->  SBR    ST                 
      6.83884695E-02    2      2000003        -3                       # GLSS   -->  STR    SB                 
      1.36138685E-02    2     -1000004         4                       # GLSS   -->  CBL    CH                 
      1.36138685E-02    2      1000004        -4                       # GLSS   -->  CHL    CB                 
      6.52975291E-02    2     -2000004         4                       # GLSS   -->  CBR    CH                 
      6.52975291E-02    2      2000004        -4                       # GLSS   -->  CHR    CB                 
      1.20897144E-01    2     -1000005         5                       # GLSS   -->  BB1    BT                 
      1.20897144E-01    2      1000005        -5                       # GLSS   -->  BT1    BB                 
      5.82350679E-02    2     -2000005         5                       # GLSS   -->  BB2    BT                 
      5.82350679E-02    2      2000005        -5                       # GLSS   -->  BT2    BB                 
      4.76752291E-08    2      1000039        21                       # GLSS   -->  GVSS   GL                 
#         PDG         Width
DECAY   1000002  7.74058771E+00   # UPL   decays
#          BR          NDA       ID1       ID2       ID3       ID4
      5.68857929E-03    2      1000022         2                       # UPL    -->  Z1SS   UP                 
      2.26627260E-01    2      1000023         2                       # UPL    -->  Z2SS   UP                 
      1.81111135E-03    2      1000025         2                       # UPL    -->  Z3SS   UP                 
      1.04078479E-01    2      1000035         2                       # UPL    -->  Z4SS   UP                 
      4.86248195E-01    2      1000024         1                       # UPL    -->  W1SS+  DN                 
      1.75546363E-01    2      1000037         1                       # UPL    -->  W2SS+  DN                 
#         PDG         Width
DECAY   1000001  7.57927084E+00   # DNL   decays
#          BR          NDA       ID1       ID2       ID3       ID4
      2.35126168E-02    2      1000022         1                       # DNL    -->  Z1SS   DN                 
      1.95325300E-01    2      1000023         1                       # DNL    -->  Z2SS   DN                 
      3.23426211E-03    2      1000025         1                       # DNL    -->  Z3SS   DN                 
      1.23617895E-01    2      1000035         1                       # DNL    -->  Z4SS   DN                 
      3.75682920E-01    2     -1000024         2                       # DNL    -->  W1SS-  UP                 
      2.78627038E-01    2     -1000037         2                       # DNL    -->  W2SS-  UP                 
#         PDG         Width
DECAY   1000003  7.57923222E+00   # STL   decays
#          BR          NDA       ID1       ID2       ID3       ID4
      2.35127360E-02    2      1000022         3                       # STL    -->  Z1SS   ST                 
      1.95326298E-01    2      1000023         3                       # STL    -->  Z2SS   ST                 
      3.23427864E-03    2      1000025         3                       # STL    -->  Z3SS   ST                 
      1.23618528E-01    2      1000035         3                       # STL    -->  Z4SS   ST                 
      3.75682235E-01    2     -1000024         4                       # STL    -->  W1SS-  CH                 
      2.78625965E-01    2     -1000037         4                       # STL    -->  W2SS-  CH                 
#         PDG         Width
DECAY   1000004  7.74058771E+00   # CHL   decays
#          BR          NDA       ID1       ID2       ID3       ID4
      5.68855461E-03    2      1000022         4                       # CHL    -->  Z1SS   CH                 
      2.26626188E-01    2      1000023         4                       # CHL    -->  Z2SS   CH                 
      1.81110203E-03    2      1000025         4                       # CHL    -->  Z3SS   CH                 
      1.04077868E-01    2      1000035         4                       # CHL    -->  Z4SS   CH                 
      4.86249268E-01    2      1000024         3                       # CHL    -->  W1SS+  ST                 
      1.75546944E-01    2      1000037         3                       # CHL    -->  W2SS+  ST                 
#         PDG         Width
DECAY   1000005  6.89179134E+00   # BT1   decays
#          BR          NDA       ID1       ID2       ID3       ID4
      8.61837268E-02    2      1000022         5                       # BT1    -->  Z1SS   BT                 
      2.00433239E-01    2      1000023         5                       # BT1    -->  Z2SS   BT                 
      6.09531812E-02    2      1000025         5                       # BT1    -->  Z3SS   BT                 
      1.40791666E-02    2      1000035         5                       # BT1    -->  Z4SS   BT                 
      3.93518895E-01    2     -1000024         6                       # BT1    -->  W1SS-  TP                 
      2.44831756E-01    2     -1000037         6                       # BT1    -->  W2SS-  TP                 
#         PDG         Width
DECAY   1000006  1.41243505E+01   # TP1   decays
#          BR          NDA       ID1       ID2       ID3       ID4
      8.92230794E-02    2      1000022         6                       # TP1    -->  Z1SS   TP                 
      1.24482736E-01    2      1000023         6                       # TP1    -->  Z2SS   TP                 
      2.52448440E-01    2      1000025         6                       # TP1    -->  Z3SS   TP                 
      4.91958074E-02    2      1000035         6                       # TP1    -->  Z4SS   TP                 
      3.24703991E-01    2      1000024         5                       # TP1    -->  W1SS+  BT                 
      1.59945875E-01    2      1000037         5                       # TP1    -->  W2SS+  BT                 
#         PDG         Width
DECAY   2000002  1.60050774E+00   # UPR   decays
#          BR          NDA       ID1       ID2       ID3       ID4
      9.56717491E-01    2      1000022         2                       # UPR    -->  Z1SS   UP                 
      3.00715379E-02    2      1000023         2                       # UPR    -->  Z2SS   UP                 
      3.30364308E-03    2      1000025         2                       # UPR    -->  Z3SS   UP                 
      9.90733039E-03    2      1000035         2                       # UPR    -->  Z4SS   UP                 
#         PDG         Width
DECAY   2000001  3.99433345E-01   # DNR   decays
#          BR          NDA       ID1       ID2       ID3       ID4
      9.56746757E-01    2      1000022         1                       # DNR    -->  Z1SS   DN                 
      3.00591383E-02    2      1000023         1                       # DNR    -->  Z2SS   DN                 
      3.30062117E-03    2      1000025         1                       # DNR    -->  Z3SS   DN                 
      9.89355054E-03    2      1000035         1                       # DNR    -->  Z4SS   DN                 
#         PDG         Width
DECAY   2000003  3.99433345E-01   # STR   decays
#          BR          NDA       ID1       ID2       ID3       ID4
      9.56746757E-01    2      1000022         3                       # STR    -->  Z1SS   ST                 
      3.00591383E-02    2      1000023         3                       # STR    -->  Z2SS   ST                 
      3.30062117E-03    2      1000025         3                       # STR    -->  Z3SS   ST                 
      9.89355054E-03    2      1000035         3                       # STR    -->  Z4SS   ST                 
#         PDG         Width
DECAY   2000004  1.60050011E+00   # CHR   decays
#          BR          NDA       ID1       ID2       ID3       ID4
      9.56717551E-01    2      1000022         4                       # CHR    -->  Z1SS   CH                 
      3.00715212E-02    2      1000023         4                       # CHR    -->  Z2SS   CH                 
      3.30363913E-03    2      1000025         4                       # CHR    -->  Z3SS   CH                 
      9.90731362E-03    2      1000035         4                       # CHR    -->  Z4SS   CH                 
#         PDG         Width
DECAY   2000005  1.03394880E+01   # BT2   decays
#          BR          NDA       ID1       ID2       ID3       ID4
      6.22277567E-03    2      1000022         5                       # BT2    -->  Z1SS   BT                 
      5.78583106E-02    2      1000023         5                       # BT2    -->  Z2SS   BT                 
      6.98518381E-02    2      1000025         5                       # BT2    -->  Z3SS   BT                 
      1.26058936E-01    2      1000035         5                       # BT2    -->  Z4SS   BT                 
      1.77455038E-01    2     -1000024         6                       # BT2    -->  W1SS-  TP                 
      5.62553108E-01    2     -1000037         6                       # BT2    -->  W2SS-  TP                 
#         PDG         Width
DECAY   2000006  1.52735405E+01   # TP2   decays
#          BR          NDA       ID1       ID2       ID3       ID4
      1.30147636E-01    2      1000024         5                       # TP2    -->  W1SS+  BT                 
      2.65942127E-01    2      1000037         5                       # TP2    -->  W2SS+  BT                 
      6.51912717E-03    2      1000022         6                       # TP2    -->  Z1SS   TP                 
      1.04121886E-01    2      1000023         6                       # TP2    -->  Z2SS   TP                 
      1.96477011E-01    2      1000025         6                       # TP2    -->  Z3SS   TP                 
      2.96792209E-01    2      1000035         6                       # TP2    -->  Z4SS   TP                 
#         PDG         Width
DECAY   1000011  9.75612625E-02   # EL-   decays
#          BR          NDA       ID1       ID2       ID3       ID4
      9.99348760E-01    2      1000022        11                       # EL-    -->  Z1SS   E-                 
      2.56762665E-04    3      1000015        11       -15             # EL-    -->  TAU1-  E-     TAU+        
      3.94512230E-04    3     -1000015        11        15             # EL-    -->  TAU1+  E-     TAU-        
      1.92379024E-09    2           11   1000039                       # EL-    -->  E-     GVSS               
#         PDG         Width
DECAY   1000013  9.75612327E-02   # MUL-  decays
#          BR          NDA       ID1       ID2       ID3       ID4
      9.99348760E-01    2      1000022        13                       # MUL-   -->  Z1SS   MU-                
      2.56764062E-04    3      1000015        13       -15             # MUL-   -->  TAU1-  MU-    TAU+        
      3.94513831E-04    3     -1000015        13        15             # MUL-   -->  TAU1+  MU-    TAU-        
      1.92379135E-09    2           13   1000039                       # MUL-   -->  MU-    GVSS               
#         PDG         Width
DECAY   1000015  2.02648748E-12   # TAU1- decays
#          BR          NDA       ID1       ID2       ID3       ID4
      1.00000000E+00    2           15   1000039                       # TAU1-  -->  TAU-   GVSS               
#         PDG         Width
DECAY   1000012  1.20892398E-01   # NUEL  decays
#          BR          NDA       ID1       ID2       ID3       ID4
      9.99568820E-01    2      1000022        12                       # NUEL   -->  Z1SS   NUE                
      3.32447271E-05    3      1000015        12       -15             # NUEL   -->  TAU1-  NUE    TAU+        
      7.51227271E-05    3     -1000015        12        15             # NUEL   -->  TAU1+  NUE    TAU-        
      3.22802720E-04    3     -1000015        11        16             # NUEL   -->  TAU1+  E-     NUT         
      1.09043863E-09    2           12   1000039                       # NUEL   -->  NUE    GVSS               
#         PDG         Width
DECAY   1000014  1.20892406E-01   # NUML  decays
#          BR          NDA       ID1       ID2       ID3       ID4
      9.99568760E-01    2      1000022        14                       # NUML   -->  Z1SS   NUM                
      3.32447235E-05    3      1000015        14       -15             # NUML   -->  TAU1-  NUM    TAU+        
      7.51227199E-05    3     -1000015        14        15             # NUML   -->  TAU1+  NUM    TAU-        
      3.22890497E-04    3     -1000015        13        16             # NUML   -->  TAU1+  MU-    NUT         
      1.09043863E-09    2           14   1000039                       # NUML   -->  NUM    GVSS               
#         PDG         Width
DECAY   1000016  2.08873108E-01   # NUTL  decays
#          BR          NDA       ID1       ID2       ID3       ID4
      5.41310668E-01    2      1000022        16                       # NUTL   -->  Z1SS   NUT                
      4.58625466E-01    2           24   1000015                       # NUTL   -->  W+     TAU1-              
      2.80216082E-05    3     -1000015        16        15             # NUTL   -->  TAU1+  NUT    TAU-        
      3.58472862E-05    3      1000015        16       -15             # NUTL   -->  TAU1-  NUT    TAU+        
      5.76186265E-10    2           16   1000039                       # NUTL   -->  NUT    GVSS               
#         PDG         Width
DECAY   2000011  4.76305871E-07   # ER-   decays
#          BR          NDA       ID1       ID2       ID3       ID4
      3.71359110E-01    3      1000015        11       -15             # ER-    -->  TAU1-  E-     TAU+        
      6.28629625E-01    3     -1000015        11        15             # ER-    -->  TAU1+  E-     TAU-        
      1.40225817E-10    3      1000015        12       -16             # ER-    -->  TAU1-  NUE    ANUT        
      1.12759280E-05    2           11   1000039                       # ER-    -->  E-     GVSS               
#         PDG         Width
DECAY   2000013  4.76314511E-07   # MUR-  decays
#          BR          NDA       ID1       ID2       ID3       ID4
      3.71357024E-01    3      1000015        13       -15             # MUR-   -->  TAU1-  MU-    TAU+        
      6.28625751E-01    3     -1000015        13        15             # MUR-   -->  TAU1+  MU-    TAU-        
      5.96995915E-06    3      1000015        14       -16             # MUR-   -->  TAU1-  NUM    ANUT        
      1.12757070E-05    2           13   1000039                       # MUR-   -->  MU-    GVSS               
#         PDG         Width
DECAY   2000015  2.91426122E-01   # TAU2- decays
#          BR          NDA       ID1       ID2       ID3       ID4
      4.26199585E-01    2      1000022        15                       # TAU2-  -->  Z1SS   TAU-               
      5.71119133E-04    2      1000023        15                       # TAU2-  -->  Z2SS   TAU-               
      1.54810818E-03    2     -1000024        16                       # TAU2-  -->  W1SS-  NUT                
      2.78177738E-01    2           23   1000015                       # TAU2-  -->  Z0     TAU1-              
      2.93503404E-01    2           25   1000015                       # TAU2-  -->  HL0    TAU1-              
#         PDG         Width
DECAY   1000022  2.84896851E-01   # Z1SS  decays
#          BR          NDA       ID1       ID2       ID3       ID4
      9.72831026E-02    2      2000011       -11                       # Z1SS   -->  ER-    E+                 
      9.72831026E-02    2     -2000011        11                       # Z1SS   -->  ER+    E-                 
      9.72817913E-02    2      2000013       -13                       # Z1SS   -->  MUR-   MU+                
      9.72817913E-02    2     -2000013        13                       # Z1SS   -->  MUR+   MU-                
      3.05435091E-01    2      1000015       -15                       # Z1SS   -->  TAU1-  TAU+               
      3.05435091E-01    2     -1000015        15                       # Z1SS   -->  TAU1+  TAU-               
      3.00964080E-11    2      1000039        22                       # Z1SS   -->  GVSS   GM                 
      6.23723566E-13    3      1000039        11       -11             # Z1SS   -->  GVSS   E-     E+          
      1.19372296E-12    2      1000039        23                       # Z1SS   -->  GVSS   Z0                 
      2.75176843E-15    2      1000039        25                       # Z1SS   -->  GVSS   HL0                
#         PDG         Width
DECAY   1000023  2.71273702E-01   # Z2SS  decays
#          BR          NDA       ID1       ID2       ID3       ID4
      2.03592364E-07    2      1000022        22                       # Z2SS   -->  Z1SS   GM                 
      1.60138793E-02    2      1000022        23                       # Z2SS   -->  Z1SS   Z0                 
      2.66769700E-08    3      1000022         2        -2             # Z2SS   -->  Z1SS   UP     UB          
      4.07999927E-08    3      1000022         1        -1             # Z2SS   -->  Z1SS   DN     DB          
      4.07999927E-08    3      1000022         3        -3             # Z2SS   -->  Z1SS   ST     SB          
      2.66767834E-08    3      1000022         4        -4             # Z2SS   -->  Z1SS   CH     CB          
      7.34041487E-06    3      1000022         5        -5             # Z2SS   -->  Z1SS   BT     BB          
      7.78862668E-05    3      1000022        15       -15             # Z2SS   -->  Z1SS   TAU-   TAU+        
      3.77236080E-04    2      1000011       -11                       # Z2SS   -->  EL-    E+                 
      3.77236080E-04    2     -1000011        11                       # Z2SS   -->  EL+    E-                 
      3.76685348E-04    2      1000013       -13                       # Z2SS   -->  MUL-   MU+                
      3.76685348E-04    2     -1000013        13                       # Z2SS   -->  MUL+   MU-                
      4.41822074E-02    2      2000011       -11                       # Z2SS   -->  ER-    E+                 
      4.41822074E-02    2     -2000011        11                       # Z2SS   -->  ER+    E-                 
      4.41821776E-02    2      2000013       -13                       # Z2SS   -->  MUR-   MU+                
      4.41821776E-02    2     -2000013        13                       # Z2SS   -->  MUR+   MU-                
      3.43045354E-01    2      1000015       -15                       # Z2SS   -->  TAU1-  TAU+               
      3.43045354E-01    2     -1000015        15                       # Z2SS   -->  TAU1+  TAU-               
      1.72706321E-02    2      1000012       -12                       # Z2SS   -->  NUEL   ANUE               
      1.72706321E-02    2     -1000012        12                       # Z2SS   -->  ANUEL  NUE                
      1.72706321E-02    2      1000014       -14                       # Z2SS   -->  NUML   ANUM               
      1.72706321E-02    2     -1000014        14                       # Z2SS   -->  ANUML  NUM                
      2.52453052E-02    2      1000016       -16                       # Z2SS   -->  NUTL   ANUT               
      2.52453052E-02    2     -1000016        16                       # Z2SS   -->  ANUTL  NUT                
      2.02648426E-10    2      1000039        22                       # Z2SS   -->  GVSS   GM                 
      4.38386003E-12    3      1000039        11       -11             # Z2SS   -->  GVSS   E-     E+          
      1.60313027E-10    2      1000039        23                       # Z2SS   -->  GVSS   Z0                 
      1.84169052E-11    2      1000039        25                       # Z2SS   -->  GVSS   HL0                
#         PDG         Width
DECAY   1000025  3.48602355E-01   # Z3SS  decays
#          BR          NDA       ID1       ID2       ID3       ID4
      1.31607758E-09    2      1000022        22                       # Z3SS   -->  Z1SS   GM                 
      5.31442936E-07    2      1000023        22                       # Z3SS   -->  Z2SS   GM                 
      1.03251066E-03    3     -1000024         2        -1             # Z3SS   -->  W1SS-  UP     DB          
      3.44170228E-04    3     -1000024        12       -11             # Z3SS   -->  W1SS-  NUE    E+          
      3.44170228E-04    3     -1000024        14       -13             # Z3SS   -->  W1SS-  NUM    MU+         
      1.03251066E-03    3      1000024         1        -2             # Z3SS   -->  W1SS+  DN     UB          
      3.44170228E-04    3      1000024        11       -12             # Z3SS   -->  W1SS+  E-     ANUE        
      3.44170228E-04    3      1000024        13       -14             # Z3SS   -->  W1SS+  MU-    ANUM        
      1.03251066E-03    3     -1000024         4        -3             # Z3SS   -->  W1SS-  CH     SB          
      3.44170228E-04    3     -1000024        16       -15             # Z3SS   -->  W1SS-  NUT    TAU+        
      1.03251066E-03    3      1000024         3        -4             # Z3SS   -->  W1SS+  ST     CB          
      3.44170228E-04    3      1000024        15       -16             # Z3SS   -->  W1SS+  TAU-   ANUT        
      3.76556844E-01    2      1000022        23                       # Z3SS   -->  Z1SS   Z0                 
      6.33764596E-09    3      1000022         2        -2             # Z3SS   -->  Z1SS   UP     UB          
      2.79946555E-09    3      1000022         1        -1             # Z3SS   -->  Z1SS   DN     DB          
      2.79946555E-09    3      1000022         3        -3             # Z3SS   -->  Z1SS   ST     SB          
      6.33759889E-09    3      1000022         4        -4             # Z3SS   -->  Z1SS   CH     CB          
      2.13262465E-05    3      1000022         5        -5             # Z3SS   -->  Z1SS   BT     BB          
      3.70535145E-06    3      1000022        15       -15             # Z3SS   -->  Z1SS   TAU-   TAU+        
      2.13862513E-04    3      1000023         2        -2             # Z3SS   -->  Z2SS   UP     UB          
      2.74502585E-04    3      1000023         1        -1             # Z3SS   -->  Z2SS   DN     DB          
      2.74502585E-04    3      1000023         3        -3             # Z3SS   -->  Z2SS   ST     SB          
      2.13862513E-04    3      1000023         4        -4             # Z3SS   -->  Z2SS   CH     CB          
      2.65359093E-04    3      1000023         5        -5             # Z3SS   -->  Z2SS   BT     BB          
      6.24275199E-05    3      1000023        11       -11             # Z3SS   -->  Z2SS   E-     E+          
      6.24275199E-05    3      1000023        13       -13             # Z3SS   -->  Z2SS   MU-    MU+         
      6.20205901E-05    3      1000023        15       -15             # Z3SS   -->  Z2SS   TAU-   TAU+        
      1.24211132E-04    3      1000023        12       -12             # Z3SS   -->  Z2SS   NUE    ANUE        
      1.24211132E-04    3      1000023        14       -14             # Z3SS   -->  Z2SS   NUM    ANUM        
      1.24211132E-04    3      1000023        16       -16             # Z3SS   -->  Z2SS   NUT    ANUT        
      3.23187634E-02    2      1000022        25                       # Z3SS   -->  Z1SS   HL0                
      8.28216609E-04    2      1000011       -11                       # Z3SS   -->  EL-    E+                 
      8.28216609E-04    2     -1000011        11                       # Z3SS   -->  EL+    E-                 
      8.28215037E-04    2      1000013       -13                       # Z3SS   -->  MUL-   MU+                
      8.28215037E-04    2     -1000013        13                       # Z3SS   -->  MUL+   MU-                
      7.09292339E-03    2      2000011       -11                       # Z3SS   -->  ER-    E+                 
      7.09292339E-03    2     -2000011        11                       # Z3SS   -->  ER+    E-                 
      7.09292199E-03    2      2000013       -13                       # Z3SS   -->  MUR-   MU+                
      7.09292199E-03    2     -2000013        13                       # Z3SS   -->  MUR+   MU-                
      2.03956619E-01    2      1000015       -15                       # Z3SS   -->  TAU1-  TAU+               
      2.03956619E-01    2     -1000015        15                       # Z3SS   -->  TAU1+  TAU-               
      5.10847941E-02    2      2000015       -15                       # Z3SS   -->  TAU2-  TAU+               
      5.10847941E-02    2     -2000015        15                       # Z3SS   -->  TAU2+  TAU-               
      6.71539130E-03    2      1000012       -12                       # Z3SS   -->  NUEL   ANUE               
      6.71539130E-03    2     -1000012        12                       # Z3SS   -->  ANUEL  NUE                
      6.71539130E-03    2      1000014       -14                       # Z3SS   -->  NUML   ANUM               
      6.71539130E-03    2     -1000014        14                       # Z3SS   -->  ANUML  NUM                
      7.23651238E-03    2      1000016       -16                       # Z3SS   -->  NUTL   ANUT               
      7.23651238E-03    2     -1000016        16                       # Z3SS   -->  ANUTL  NUT                
      4.54703332E-13    2      1000039        22                       # Z3SS   -->  GVSS   GM                 
      1.00266746E-14    3      1000039        11       -11             # Z3SS   -->  GVSS   E-     E+          
      3.34103384E-10    2      1000039        23                       # Z3SS   -->  GVSS   Z0                 
      3.12747633E-10    2      1000039        25                       # Z3SS   -->  GVSS   HL0                
#         PDG         Width
DECAY   1000035  1.97732997E+00   # Z4SS  decays
#          BR          NDA       ID1       ID2       ID3       ID4
      3.13175952E-09    2      1000022        22                       # Z4SS   -->  Z1SS   GM                 
      1.64419063E-07    2      1000023        22                       # Z4SS   -->  Z2SS   GM                 
      8.88711469E-08    2      1000025        22                       # Z4SS   -->  Z3SS   GM                 
      1.22884057E-01    2      1000024       -24                       # Z4SS   -->  W1SS+  W-                 
      1.22884057E-01    2     -1000024        24                       # Z4SS   -->  W1SS-  W+                 
      4.94106654E-13    3     -1000037         2        -1             # Z4SS   -->  W2SS-  UP     DB          
      1.64702223E-13    3     -1000037        12       -11             # Z4SS   -->  W2SS-  NUE    E+          
      1.64702223E-13    3     -1000037        14       -13             # Z4SS   -->  W2SS-  NUM    MU+         
      4.94106654E-13    3      1000037         1        -2             # Z4SS   -->  W2SS+  DN     UB          
      1.64702223E-13    3      1000037        11       -12             # Z4SS   -->  W2SS+  E-     ANUE        
      1.64702223E-13    3      1000037        13       -14             # Z4SS   -->  W2SS+  MU-    ANUM        
      9.64359194E-03    2      1000022        23                       # Z4SS   -->  Z1SS   Z0                 
      2.87294533E-04    2      1000023        23                       # Z4SS   -->  Z2SS   Z0                 
      5.78262771E-08    3      1000022         2        -2             # Z4SS   -->  Z1SS   UP     UB          
      1.40086598E-07    3      1000022         1        -1             # Z4SS   -->  Z1SS   DN     DB          
      1.40086598E-07    3      1000022         3        -3             # Z4SS   -->  Z1SS   ST     SB          
      5.78258614E-08    3      1000022         4        -4             # Z4SS   -->  Z1SS   CH     CB          
      2.06725190E-06    3      1000022         5        -5             # Z4SS   -->  Z1SS   BT     BB          
      3.48265559E-07    3      1000022        15       -15             # Z4SS   -->  Z1SS   TAU-   TAU+        
      1.28660417E-07    3      1000023         2        -2             # Z4SS   -->  Z2SS   UP     UB          
      1.20791711E-07    3      1000023         1        -1             # Z4SS   -->  Z2SS   DN     DB          
      1.20791711E-07    3      1000023         3        -3             # Z4SS   -->  Z2SS   ST     SB          
      1.28659437E-07    3      1000023         4        -4             # Z4SS   -->  Z2SS   CH     CB          
      1.68977294E-07    3      1000023         5        -5             # Z4SS   -->  Z2SS   BT     BB          
      1.25894170E-10    3      1000023        15       -15             # Z4SS   -->  Z2SS   TAU-   TAU+        
      7.64091601E-06    3      1000025         2        -2             # Z4SS   -->  Z3SS   UP     UB          
      9.89279397E-06    3      1000025         1        -1             # Z4SS   -->  Z3SS   DN     DB          
      9.89279397E-06    3      1000025         3        -3             # Z4SS   -->  Z3SS   ST     SB          
      7.64091601E-06    3      1000025         4        -4             # Z4SS   -->  Z3SS   CH     CB          
      8.81787128E-06    3      1000025         5        -5             # Z4SS   -->  Z3SS   BT     BB          
      2.23912366E-06    3      1000025        11       -11             # Z4SS   -->  Z3SS   E-     E+          
      2.23912366E-06    3      1000025        13       -13             # Z4SS   -->  Z3SS   MU-    MU+         
      2.19589197E-06    3      1000025        15       -15             # Z4SS   -->  Z3SS   TAU-   TAU+        
      4.45515161E-06    3      1000025        12       -12             # Z4SS   -->  Z3SS   NUE    ANUE        
      4.45515161E-06    3      1000025        14       -14             # Z4SS   -->  Z3SS   NUM    ANUM        
      4.45515161E-06    3      1000025        16       -16             # Z4SS   -->  Z3SS   NUT    ANUT        
      3.84197682E-02    2      1000022        25                       # Z4SS   -->  Z1SS   HL0                
      1.71534729E-03    2      1000023        25                       # Z4SS   -->  Z2SS   HL0                
      3.70665416E-02    2      1000011       -11                       # Z4SS   -->  EL-    E+                 
      3.70665416E-02    2     -1000011        11                       # Z4SS   -->  EL+    E-                 
      3.70665081E-02    2      1000013       -13                       # Z4SS   -->  MUL-   MU+                
      3.70665081E-02    2     -1000013        13                       # Z4SS   -->  MUL+   MU-                
      5.32796187E-03    2      2000011       -11                       # Z4SS   -->  ER-    E+                 
      5.32796187E-03    2     -2000011        11                       # Z4SS   -->  ER+    E-                 
      5.32796048E-03    2      2000013       -13                       # Z4SS   -->  MUR-   MU+                
      5.32796048E-03    2     -2000013        13                       # Z4SS   -->  MUR+   MU-                
      5.07450942E-03    2      1000015       -15                       # Z4SS   -->  TAU1-  TAU+               
      5.07450942E-03    2     -1000015        15                       # Z4SS   -->  TAU1+  TAU-               
      5.13229519E-02    2      2000015       -15                       # Z4SS   -->  TAU2-  TAU+               
      5.13229519E-02    2     -2000015        15                       # Z4SS   -->  TAU2+  TAU-               
      6.92271888E-02    2      1000012       -12                       # Z4SS   -->  NUEL   ANUE               
      6.92271888E-02    2     -1000012        12                       # Z4SS   -->  ANUEL  NUE                
      6.92271888E-02    2      1000014       -14                       # Z4SS   -->  NUML   ANUM               
      6.92271888E-02    2     -1000014        14                       # Z4SS   -->  ANUML  NUM                
      7.24082589E-02    2      1000016       -16                       # Z4SS   -->  NUTL   ANUT               
      7.24082589E-02    2     -1000016        16                       # Z4SS   -->  ANUTL  NUT                
      2.83033180E-11    2      1000039        22                       # Z4SS   -->  GVSS   GM                 
      6.30763616E-13    3      1000039        11       -11             # Z4SS   -->  GVSS   E-     E+          
      2.99278907E-10    2      1000039        23                       # Z4SS   -->  GVSS   Z0                 
      7.17178747E-11    2      1000039        25                       # Z4SS   -->  GVSS   HL0                
      3.77982735E-16    2      1000039        35                       # Z4SS   -->  GVSS   HH0                
      8.61802396E-16    2      1000039        36                       # Z4SS   -->  GVSS   HA0                
#         PDG         Width
DECAY   1000024  2.28260458E-01   # W1SS+ decays
#          BR          NDA       ID1       ID2       ID3       ID4
      5.82352229E-08    3      1000022         2        -1             # W1SS+  -->  Z1SS   UP     DB          
      5.82350950E-08    3      1000022         4        -3             # W1SS+  -->  Z1SS   CH     SB          
      4.72248539E-05    3      1000022       -15        16             # W1SS+  -->  Z1SS   TAU+   NUT         
      8.67623538E-02    2      1000022        24                       # W1SS+  -->  Z1SS   W+                 
      6.32358789E-02    2      1000012       -11                       # W1SS+  -->  NUEL   E+                 
      6.32348731E-02    2      1000014       -13                       # W1SS+  -->  NUML   MU+                
      1.08422376E-01    2      1000016       -15                       # W1SS+  -->  NUTL   TAU+               
      5.55752311E-04    2     -1000011        12                       # W1SS+  -->  EL+    NUE                
      5.55722916E-04    2     -1000013        14                       # W1SS+  -->  MUL+   NUM                
      6.77185714E-01    2     -1000015        16                       # W1SS+  -->  TAU1+  NUT                
#         PDG         Width
DECAY   1000037  1.66061389E+00   # W2SS+ decays
#          BR          NDA       ID1       ID2       ID3       ID4
      1.92857726E-07    3      1000022         2        -1             # W2SS+  -->  Z1SS   UP     DB          
      1.92857414E-07    3      1000022         4        -3             # W2SS+  -->  Z1SS   CH     SB          
      1.46362908E-07    3      1000022       -15        16             # W2SS+  -->  Z1SS   TAU+   NUT         
      3.73243243E-02    2      1000022        24                       # W2SS+  -->  Z1SS   W+                 
      9.83550450E-08    3      1000023         2        -1             # W2SS+  -->  Z2SS   UP     DB          
      9.83547679E-08    3      1000023         4        -3             # W2SS+  -->  Z2SS   CH     SB          
      5.16682405E-07    3      1000023       -15        16             # W2SS+  -->  Z2SS   TAU+   NUT         
      1.33235112E-01    2      1000023        24                       # W2SS+  -->  Z2SS   W+                 
      3.13608325E-05    3      1000025         2        -1             # W2SS+  -->  Z3SS   UP     DB          
      3.13608325E-05    3      1000025         4        -3             # W2SS+  -->  Z3SS   CH     SB          
      1.04464207E-05    3      1000025       -11        12             # W2SS+  -->  Z3SS   E+     NUE         
      1.04464207E-05    3      1000025       -13        14             # W2SS+  -->  Z3SS   MU+    NUM         
      1.04487863E-05    3      1000025       -15        16             # W2SS+  -->  Z3SS   TAU+   NUT         
      1.04611516E-01    2      1000012       -11                       # W2SS+  -->  NUEL   E+                 
      1.04611523E-01    2      1000014       -13                       # W2SS+  -->  NUML   MU+                
      1.36528924E-01    2      1000016       -15                       # W2SS+  -->  NUTL   TAU+               
      1.31058678E-01    2     -1000011        12                       # W2SS+  -->  EL+    NUE                
      1.31058589E-01    2     -1000013        14                       # W2SS+  -->  MUL+   NUM                
      5.49678365E-03    2     -1000015        16                       # W2SS+  -->  TAU1+  NUT                
      1.41509861E-01    2     -2000015        16                       # W2SS+  -->  TAU2+  NUT                
      7.09103420E-02    2      1000024        23                       # W2SS+  -->  W1SS+  Z0                 
      1.79513620E-07    3      1000024         1        -1             # W2SS+  -->  W1SS+  DN     DB          
      1.79512242E-07    3      1000024         3        -3             # W2SS+  -->  W1SS+  ST     SB          
      2.02029483E-07    3      1000024         2        -2             # W2SS+  -->  W1SS+  UP     UB          
      2.02029483E-07    3      1000024         4        -4             # W2SS+  -->  W1SS+  CH     CB          
      3.55825759E-03    2      1000024        25                       # W2SS+  -->  W1SS+  HL0                
#         PDG         Width
DECAY        25  5.01673389E-03   # HL0   decays
#          BR          NDA       ID1       ID2       ID3       ID4
      5.11056397E-09    2           11       -11                       # HL0    -->  E-     E+                 
      2.15776061E-04    2           13       -13                       # HL0    -->  MU-    MU+                
      6.17055409E-02    2           15       -15                       # HL0    -->  TAU-   TAU+               
      6.41842871E-06    2            1        -1                       # HL0    -->  DN     DB                 
      2.59336620E-03    2            3        -3                       # HL0    -->  ST     SB                 
      8.55288446E-01    2            5        -5                       # HL0    -->  BT     BB                 
      1.49939183E-06    2            2        -2                       # HL0    -->  UP     UB                 
      2.84114666E-02    2            4        -4                       # HL0    -->  CH     CB                 
      1.23210822E-03    2           22        22                       # HL0    -->  GM     GM                 
      2.79453080E-02    2           21        21                       # HL0    -->  GL     GL                 
      1.19313388E-03    3           24        11       -12             # HL0    -->  W+     E-     ANUE        
      1.19313388E-03    3           24        13       -14             # HL0    -->  W+     MU-    ANUM        
      1.19313388E-03    3           24        15       -16             # HL0    -->  W+     TAU-   ANUT        
      3.57940164E-03    3           24        -2         1             # HL0    -->  W+     UB     DN          
      3.57940164E-03    3           24        -4         3             # HL0    -->  W+     CB     ST          
      1.19313388E-03    3          -24       -11        12             # HL0    -->  W-     E+     NUE         
      1.19313388E-03    3          -24       -13        14             # HL0    -->  W-     MU+    NUM         
      1.19313388E-03    3          -24       -15        16             # HL0    -->  W-     TAU+   NUT         
      3.57940164E-03    3          -24         2        -1             # HL0    -->  W-     UP     DB          
      3.57940164E-03    3          -24         4        -3             # HL0    -->  W-     CH     SB          
      7.68314421E-05    3           23        12       -12             # HL0    -->  Z0     NUE    ANUE        
      7.68314421E-05    3           23        14       -14             # HL0    -->  Z0     NUM    ANUM        
      7.68314421E-05    3           23        16       -16             # HL0    -->  Z0     NUT    ANUT        
      3.86684915E-05    3           23        11       -11             # HL0    -->  Z0     E-     E+          
      3.86684915E-05    3           23        13       -13             # HL0    -->  Z0     MU-    MU+         
      3.86684915E-05    3           23        15       -15             # HL0    -->  Z0     TAU-   TAU+        
      1.32474961E-04    3           23         2        -2             # HL0    -->  Z0     UP     UB          
      1.32474961E-04    3           23         4        -4             # HL0    -->  Z0     CH     CB          
      1.70660409E-04    3           23         1        -1             # HL0    -->  Z0     DN     DB          
      1.70660409E-04    3           23         3        -3             # HL0    -->  Z0     ST     SB          
      1.70660409E-04    3           23         5        -5             # HL0    -->  Z0     BT     BB          
#         PDG         Width
DECAY        35  3.56601024E+00   # HH0   decays
#          BR          NDA       ID1       ID2       ID3       ID4
      1.02401954E-08    2           11       -11                       # HH0    -->  E-     E+                 
      4.32359288E-04    2           13       -13                       # HH0    -->  MU-    MU+                
      1.23814568E-01    2           15       -15                       # HH0    -->  TAU-   TAU+               
      1.26697250E-05    2            1        -1                       # HH0    -->  DN     DB                 
      5.11920964E-03    2            3        -3                       # HH0    -->  ST     SB                 
      8.67503107E-01    2            5        -5                       # HH0    -->  BT     BB                 
      1.42145289E-11    2            2        -2                       # HH0    -->  UP     UB                 
      2.28947172E-07    2            4        -4                       # HH0    -->  CH     CB                 
      2.13185700E-07    2           22        22                       # HH0    -->  GM     GM                 
      5.40211331E-05    2           21        21                       # HH0    -->  GL     GL                 
      1.24112325E-04    2           24       -24                       # HH0    -->  W+     W-                 
      5.81970016E-05    2           23        23                       # HH0    -->  Z0     Z0                 
      2.40544206E-03    2      1000022   1000022                       # HH0    -->  Z1SS   Z1SS               
      3.47424735E-04    2           25        25                       # HH0    -->  HL0    HL0                
      2.25142412E-05    2      2000011  -2000011                       # HH0    -->  ER-    ER+                
      2.24410087E-05    2      2000013  -2000013                       # HH0    -->  MUR-   MUR+               
      5.50904006E-05    2      1000015  -1000015                       # HH0    -->  TAU1-  TAU1+              
      1.42127192E-05    2      1000015  -2000015                       # HH0    -->  TAU1-  TAU2+              
      1.42127192E-05    2      2000015  -1000015                       # HH0    -->  TAU2-  TAU1+              
#         PDG         Width
DECAY        36  3.56028628E+00   # HA0   decays
#          BR          NDA       ID1       ID2       ID3       ID4
      1.01929629E-08    2           11       -11                       # HA0    -->  E-     E+                 
      4.30365209E-04    2           13       -13                       # HA0    -->  MU-    MU+                
      1.23256542E-01    2           15       -15                       # HA0    -->  TAU-   TAU+               
      1.26122632E-05    2            1        -1                       # HA0    -->  DN     DB                 
      5.09599317E-03    2            3        -3                       # HA0    -->  ST     SB                 
      8.63949060E-01    2            5        -5                       # HA0    -->  BT     BB                 
      1.03309227E-11    2            2        -2                       # HA0    -->  UP     UB                 
      1.66550123E-07    2            4        -4                       # HA0    -->  CH     CB                 
      6.04146351E-08    2           22        22                       # HA0    -->  GM     GM                 
      4.27602899E-05    2           21        21                       # HA0    -->  GL     GL                 
      7.07970047E-03    2      1000022   1000022                       # HA0    -->  Z1SS   Z1SS               
      8.96382699E-05    2           25        23                       # HA0    -->  HL0    Z0                 
      2.15127711E-05    2      1000015  -2000015                       # HA0    -->  TAU1-  TAU2+              
      2.15127711E-05    2      2000015  -1000015                       # HA0    -->  TAU2-  TAU1+              
#         PDG         Width
DECAY        37  2.15880704E+00   # H+    decays
#          BR          NDA       ID1       ID2       ID3       ID4
      1.73945391E-08    2           12       -11                       # H+     -->  NUE    E+                 
      7.34428701E-04    2           14       -13                       # H+     -->  NUM    MU+                
      2.10341051E-01    2           16       -15                       # H+     -->  NUT    TAU+               
      1.95867833E-05    2            2        -1                       # H+     -->  UP     DB                 
      7.91406725E-03    2            4        -3                       # H+     -->  CH     SB                 
      7.80577898E-01    2            6        -5                       # H+     -->  TP     BB                 
      1.82058415E-04    2           25        24                       # H+     -->  HL0    W+                 
      2.30937090E-04    2     -1000015   1000016                       # H+     -->  TAU1+  NUTL               
