##******************************************************************
##                      MadGraph/MadEvent                          *
##******************************************************************
## Les Houches friendly file for the (MS)SM parameters of MadGraph *
##      SM parameter set and decay widths produced by MSSMCalc     *
##******************************************************************
##*Please note the following IMPORTANT issues:                     *
##                                                                 *
##0. REFRAIN from editing this file by hand! Some of the parame-   *
##   ters are not independent. Always use a calculator.            *
##                                                                 *
##1. alpha_S(MZ) has been used in the calculation of the parameters*
##   This value is KEPT by madgraph when no pdf are used lpp(i)=0, *
##   but, for consistency, it will be reset by madgraph to the     *
##   value expected IF the pdfs for collisions with hadrons are    *
##   used.                                                         *
##                                                                 *
##2. Values of the charm and bottom kinematic (pole) masses are    *
##   those used in the matrix elements and phase space UNLESS they *
##   are set to ZERO from the start in the model (particles.dat)   *
##   This happens, for example,  when using 5-flavor QCD where     *
##   charm and bottom are treated as partons in the initial state  *
##   and a zero mass might be hardwired in the model definition.   *
##                                                                 *
##       The SUSY decays have calculated using SDECAY 1.1a         *
##                                                                 *
##******************************************************************
#
BLOCK DCINFO  # Decay Program information
     1   SDECAY      # decay calculator
     2   1.1a        # version number
#
BLOCK SPINFO  # Spectrum calculator information
     1   SOFTSUSY                                          
     2   3.1.1                                             
#
BLOCK MODSEL  # Model selection
     1     1   #                                                 
#
BLOCK SMINPUTS  # Standard Model inputs
     1     1.27934000E+02   # alpha_em^-1(M_Z)^MSbar
     2     1.16637000E-05   # G_F [GeV^-2]
     3     1.17200000E-01   # alpha_S(M_Z)^MSbar
     4     9.11876000E+01   # M_Z pole mass
     5     4.25000000E+00   # mb(mb)^MSbar
     6     1.74300000E+02   # mt pole mass
     7     1.77700000E+00   # mtau pole mass
#
BLOCK MINPAR  # Input parameters - minimal models
     1     1.00000000E+02   #  m0                 
     2     2.50000000E+02   #  m12                
     3     1.00000000E+01   #  tanb               
     4     1.00000000E+00   #  sign(mu)           
     5    -1.00000000E+02   #  A0                 
#
BLOCK MASS  # Mass Spectrum
# PDG code           mass       particle
         5     4.87884433E+00   # b-quark pole mass calculated from mb(mb)_Msbar
         6     1.74300000E+02   # t-quark pole mass (not read by ME)
        24     7.98290131E+01   # W+
        25     1.10607989E+02   # h
        35     3.98170887E+02   # H
        36     3.97212570E+02   # A
        37     4.05549436E+02   # H+
   1000001     2.00000000E+04   # ~d_L
   2000001     2.00000000E+04   # ~d_R
   1000002     2.00000000E+04   # ~u_L
   2000002     2.00000000E+04   # ~u_R
   1000003     2.00000000E+04   # ~s_L
   2000003     2.00000000E+04   # ~s_R
   1000004     2.00000000E+04   # ~c_L
   2000004     2.00000000E+04   # ~c_R
   1000005     2.00000000E+04   # ~b_1
   2000005     2.00000000E+04   # ~b_2
   1000006     2.00000000E+04   # ~t_1
   2000006     2.00000000E+04   # ~t_2
   1000011     2.00000000E+04   # ~e_L
   2000011     2.00000000E+04   # ~e_R
   1000012     2.00000000E+04   # ~nu_eL
   1000013     2.00000000E+04   # ~mu_L
   2000013     2.00000000E+04   # ~mu_R
   1000014     2.00000000E+04   # ~nu_muL
   1000015     2.00000000E+04   # ~tau_1
   2000015     2.00000000E+04   # ~tau_2
   1000016     2.00000000E+04   # ~nu_tauL
   1000021	8.50000000E+02		# ~g
   1000022	5.00000000E+02		# ~chi_10
   1000023     2.00000000E+04	# ~chi_20
   1000025     2.00000000E+04   # ~chi_30
   1000035     2.00000000E+04   # ~chi_40
   1000024	5.02000000E+02		# ~chi_1+
   1000037     2.00000000E+04   # ~chi_2+
#
BLOCK NMIX  # Neutralino Mixing Matrix
  1  1     1.00000000E+00   # N_11
  1  2     0.00000000E+00   # N_12
  1  3     0.00000000E+00   # N_13
  1  4     0.00000000E+00   # N_14
  2  1     0.00000000E+00   # N_21
  2  2     1.00000000E+00   # N_22
  2  3     0.00000000E+00   # N_23
  2  4     0.00000000E+00   # N_24
  3  1     0.00000000E+00   # N_31
  3  2     0.00000000E+00   # N_32
  3  3     1.00000000E+00   # N_33
  3  4     0.00000000E+00   # N_34
  4  1     0.00000000E+00   # N_41
  4  2     0.00000000E+00   # N_42
  4  3     0.00000000E+00   # N_43
  4  4     1.00000000E+00   # N_44
#
BLOCK UMIX  # Chargino Mixing Matrix U
  1  1     1.00000000E+00   # U_11
  1  2     0.00000000E+00   # U_12
  2  1     0.00000000E+00   # U_21
  2  2     1.00000000E+00   # U_22
#
BLOCK VMIX  # Chargino Mixing Matrix V
  1  1     1.00000000E+00   # V_11
  1  2     0.00000000E+00   # V_12
  2  1     0.00000000E+00   # V_21
  2  2     1.00000000E+00   # V_22
#
BLOCK STOPMIX  # Stop Mixing Matrix
  1  1     1.00000000E+00   # O_{11}
  1  2     0.00000000E+00   # O_{12}
  2  1     0.00000000E+00   # O_{21}
  2  2     1.00000000E+00   # O_{22}
#
BLOCK SBOTMIX  # Sbottom Mixing Matrix
  1  1     1.00000000E+00   # O_{11}
  1  2     0.00000000E+00   # O_{12}
  2  1     0.00000000E+00   # O_{21}
  2  2     1.00000000E+00   # O_{22}
#
BLOCK STAUMIX  # Stau Mixing Matrix
  1  1     1.00000000E+00   # O_{11}
  1  2     0.00000000E+00   # O_{12}
  2  1     0.00000000E+00   # O_{21}
  2  2     1.00000000E+00   # O_{22}
#
BLOCK ALPHA  # Higgs mixing
          -1.13934314E-01   # Mixing angle in the neutral Higgs boson sector
#
BLOCK HMIX Q=  4.65561046E+02  # DRbar Higgs Parameters
     1     3.55716850E+02   #  mu(Q)MSSM DRbar    
     2     9.74992464E+00   #  tan beta(Q)MSSM DRb
     3     2.44905729E+02   #  higgs vev(Q)MSSM DR
     4     1.64985488E+05   #  mA^2(Q)MSSM DRbar  
#
BLOCK GAUGE Q=  4.65561046E+02  # The gauge couplings
     3     1.09893287E+00   # g3(Q) MSbar
#
BLOCK AU Q=  4.65561046E+02  # The trilinear couplings
  3  3    -4.97600543E+02   # A_t(Q) DRbar
#
BLOCK AD Q=  4.65561046E+02  # The trilinear couplings
  3  3    -7.94284921E+02   # A_b(Q) DRbar
#
BLOCK AE Q=  4.65561046E+02  # The trilinear couplings
  3  3    -2.51715518E+02   # A_tau(Q) DRbar
#
BLOCK YU Q=  4.65561046E+02  # The Yukawa couplings
  3  3     8.89798264E-01   # y_t(Q) DRbar
#
BLOCK YD Q=  4.65561046E+02  # The Yukawa couplings
  3  3     1.39617144E-01   # y_b(Q) DRbar
#
BLOCK YE Q=  4.65561046E+02  # The Yukawa couplings
  3  3     1.00907973E-01   # y_tau(Q) DRbar
#
BLOCK MSOFT Q=  4.65561046E+02  # The soft SUSY breaking masses at the scale Q
     1     1.01416758E+02   #  M_1(Q)             
     2     1.91552625E+02   #  M_2(Q)             
     3     5.86558837E+02   #  M_3(Q)             
    21     3.23520246E+04   #  mH1^2(Q)           
    22    -1.27447967E+05   #  mH2^2(Q)           
    31     1.95524696E+02   #  meL(Q)             
    32     1.95521899E+02   #  mmuL(Q)            
    33     1.94686596E+02   #  mtauL(Q)           
    34     1.35968147E+02   #  meR(Q)             
    35     1.35959993E+02   #  mmuR(Q)            
    36     1.33507526E+02   #  mtauR(Q)           
    41     5.45795972E+02   #  mqL1(Q)            
    42     5.45794270E+02   #  mqL2(Q)            
    43     4.97181267E+02   #  mqL3(Q)            
    44     5.27765096E+02   #  muR(Q)             
    45     5.27763351E+02   #  mcR(Q)             
    46     4.22055892E+02   #  mtR(Q)             
    47     5.25671068E+02   #  mdR(Q)             
    48     5.25669244E+02   #  msR(Q)             
    49     5.22368423E+02   #  mbR(Q)             
#
#
#
#                             =================
#                             |The decay table|
#                             =================
#
# - The multi-body decays for the inos, stops and sbottoms are included.
#
# - The SUSY decays of the top quark are included.
#
#
#         PDG            Width
DECAY        23     2.41180436E+00   # Z width (SM calculation)
DECAY        24     2.00313003E+00   # W width (SM calculation)
#
#         PDG            Width
#DECAY         6     1.54039542E+00   # top decays
#          BR         NDA      ID1       ID2
#     1.00000000E+00    2           5        24   # BR(t ->  b    W+)
#     0.00000000E+00    2           5        37   # BR(t ->  b    H+)
#     0.00000000E+00    2     1000006   1000022   # BR(t -> ~t_1 ~chi_10)
#     0.00000000E+00    2     1000006   1000023   # BR(t -> ~t_1 ~chi_20)
#     0.00000000E+00    2     1000006   1000025   # BR(t -> ~t_1 ~chi_30)
#     0.00000000E+00    2     1000006   1000035   # BR(t -> ~t_1 ~chi_40)
#     0.00000000E+00    2     2000006   1000022   # BR(t -> ~t_2 ~chi_10)
#     0.00000000E+00    2     2000006   1000023   # BR(t -> ~t_2 ~chi_20)
#     0.00000000E+00    2     2000006   1000025   # BR(t -> ~t_2 ~chi_30)
#     0.00000000E+00    2     2000006   1000035   # BR(t -> ~t_2 ~chi_40)
#
#         PDG            Width
DECAY        25     1.99991042E-03   # h decays
#          BR         NDA      ID1       ID2
     1.44581664E-01    2          15       -15   # BR(H1 -> tau- tau+)
     8.21947785E-01    2           5        -5   # BR(H1 -> b bb)
     3.19407848E-02    2          24       -24   # BR(H1 -> W+ W-)
     1.52976605E-03    2          23        23   # BR(H1 -> Z Z)
#
#         PDG            Width
DECAY        35     5.77175301E-01   # H decays
#          BR         NDA      ID1       ID2
     1.37924413E-01    2          15       -15   # BR(H -> tau- tau+)
     4.75376754E-02    2           6        -6   # BR(H -> t tb)
     7.91497395E-01    2           5        -5   # BR(H -> b bb)
     3.88197203E-03    2          24       -24   # BR(H -> W+ W-)
     1.80582818E-03    2          23        23   # BR(H -> Z Z)
     0.00000000E+00    2          24       -37   # BR(H -> W+ H-)
     0.00000000E+00    2         -24        37   # BR(H -> W- H+)
     0.00000000E+00    2          37       -37   # BR(H -> H+ H-)
     1.73527168E-02    2          25        25   # BR(H -> h h)
     0.00000000E+00    2          36        36   # BR(H -> A A)
#
#         PDG            Width
DECAY        36     6.32257458E-01   # A decays
#          BR         NDA      ID1       ID2
     1.25935458E-01    2          15       -15   # BR(A -> tau- tau+)
     1.48143447E-01    2           6        -6   # BR(A -> t tb)
     7.23072958E-01    2           5        -5   # BR(A -> b bb)
     2.84813771E-03    2          23        25   # BR(A -> Z h)
     0.00000000E+00    2          23        35   # BR(A -> Z H)
     0.00000000E+00    2          24       -37   # BR(A -> W+ H-)
     0.00000000E+00    2         -24        37   # BR(A -> W- H+)
#
#         PDG            Width
DECAY        37     5.45747716E-01   # H+ decays
#          BR         NDA      ID1       ID2
     1.48963509E-01    2         -15        16   # BR(H+ -> tau+ nu_tau)
     8.47273621E-01    2           6        -5   # BR(H+ -> t bb)
     3.76287012E-03    2          24        25   # BR(H+ -> W+ h)
     0.00000000E+00    2          24        35   # BR(H+ -> W+ H)
     0.00000000E+00    2          24        36   # BR(H+ -> W+ A)
#
#         PDG            Width
DECAY   1000021     7.89249762E-08   # gluino decays
#           BR         NDA      ID1       ID2       ID3
     0.0    3     1000022         5        -5   # BR(~g -> ~chi_10 b  bb)
     0.0    3     1000023         5        -5   # BR(~g -> ~chi_20 b  bb)
     0.0    3     1000022         6        -6   # BR(~g -> ~chi_10 t  tb)
     0.0    3     1000023         6        -6   # BR(~g -> ~chi_20 t  tb)
     0.5    3     1000024         5        -6   # BR(~g -> ~chi_1+ b  tb)
     0.5    3    -1000024         6        -5   # BR(~g -> ~chi_1- t  bb)
#
#         PDG            Width
DECAY   1000006     3.23202029E+01   # stop1 decays
#          BR         NDA      ID1       ID2
     0.00000000E+00    2     1000022         6   # BR(~t_1 -> ~chi_10 t )
     0.00000000E+00    2     1000023         6   # BR(~t_1 -> ~chi_20 t )
     0.00000000E+00    2     1000025         6   # BR(~t_1 -> ~chi_30 t )
     0.00000000E+00    2     1000035         6   # BR(~t_1 -> ~chi_40 t )
     0.00000000E+00    2     1000024         5   # BR(~t_1 -> ~chi_1+ b )
     0.00000000E+00    2     1000037         5   # BR(~t_1 -> ~chi_2+ b )
     1.00000000E+00    2     1000021         6   # BR(~t_1 -> ~g      t )
     0.00000000E+00    2     1000005        37   # BR(~t_1 -> ~b_1    H+)
     0.00000000E+00    2     2000005        37   # BR(~t_1 -> ~b_2    H+)
     0.00000000E+00    2     1000005        24   # BR(~t_1 -> ~b_1    W+)
     0.00000000E+00    2     2000005        24   # BR(~t_1 -> ~b_2    W+)
#
#         PDG            Width
DECAY   2000006     1.32506771E+03   # stop2 decays
#          BR         NDA      ID1       ID2
     0.00000000E+00    2     1000022         6   # BR(~t_2 -> ~chi_10 t )
     0.00000000E+00    2     1000023         6   # BR(~t_2 -> ~chi_20 t )
     0.00000000E+00    2     1000025         6   # BR(~t_2 -> ~chi_30 t )
     0.00000000E+00    2     1000035         6   # BR(~t_2 -> ~chi_40 t )
     0.00000000E+00    2     1000024         5   # BR(~t_2 -> ~chi_1+ b )
     0.00000000E+00    2     1000037         5   # BR(~t_2 -> ~chi_2+ b )
     1.00000000E+00    2     1000021         6   # BR(~t_2 -> ~g      t )
     0.00000000E+00    2     1000006        25   # BR(~t_2 -> ~t_1    h )
     0.00000000E+00    2     1000006        35   # BR(~t_2 -> ~t_1    H )
     0.00000000E+00    2     1000006        36   # BR(~t_2 -> ~t_1    A )
     0.00000000E+00    2     1000005        37   # BR(~t_2 -> ~b_1    H+)
     0.00000000E+00    2     2000005        37   # BR(~t_2 -> ~b_2    H+)
     0.00000000E+00    2     1000006        23   # BR(~t_2 -> ~t_1    Z )
     0.00000000E+00    2     1000005        24   # BR(~t_2 -> ~b_1    W+)
     0.00000000E+00    2     2000005        24   # BR(~t_2 -> ~b_2    W+)
#
#         PDG            Width
DECAY   1000005     5.21226090E+06   # sbottom1 decays
#          BR         NDA      ID1       ID2
     5.43517658E-07    2     1000022         5   # BR(~b_1 -> ~chi_10 b )
     0.00000000E+00    2     1000023         5   # BR(~b_1 -> ~chi_20 b )
     0.00000000E+00    2     1000025         5   # BR(~b_1 -> ~chi_30 b )
     0.00000000E+00    2     1000035         5   # BR(~b_1 -> ~chi_40 b )
     0.00000000E+00    2    -1000024         6   # BR(~b_1 -> ~chi_1- t )
     0.00000000E+00    2    -1000037         6   # BR(~b_1 -> ~chi_2- t )
     2.45528532E-04    2     1000021         5   # BR(~b_1 -> ~g      b )
     9.07333985E-12    2     1000006       -37   # BR(~b_1 -> ~t_1    H-)
     0.00000000E+00    2     2000006       -37   # BR(~b_1 -> ~t_2    H-)
     9.99753928E-01    2     1000006       -24   # BR(~b_1 -> ~t_1    W-)
     0.00000000E+00    2     2000006       -24   # BR(~b_1 -> ~t_2    W-)
#
#         PDG            Width
DECAY   2000005     1.29110158E+03   # sbottom2 decays
#          BR         NDA      ID1       ID2
     8.77686430E-03    2     1000022         5   # BR(~b_2 -> ~chi_10 b )
     0.00000000E+00    2     1000023         5   # BR(~b_2 -> ~chi_20 b )
     0.00000000E+00    2     1000025         5   # BR(~b_2 -> ~chi_30 b )
     0.00000000E+00    2     1000035         5   # BR(~b_2 -> ~chi_40 b )
     0.00000000E+00    2    -1000024         6   # BR(~b_2 -> ~chi_1- t )
     0.00000000E+00    2    -1000037         6   # BR(~b_2 -> ~chi_2- t )
     9.91214626E-01    2     1000021         5   # BR(~b_2 -> ~g      b )
     0.00000000E+00    2     1000005        25   # BR(~b_2 -> ~b_1    h )
     0.00000000E+00    2     1000005        35   # BR(~b_2 -> ~b_1    H )
     0.00000000E+00    2     1000005        36   # BR(~b_2 -> ~b_1    A )
     8.50972746E-06    2     1000006       -37   # BR(~b_2 -> ~t_1    H-)
     0.00000000E+00    2     2000006       -37   # BR(~b_2 -> ~t_2    H-)
     0.00000000E+00    2     1000005        23   # BR(~b_2 -> ~b_1    Z )
     0.00000000E+00    2     1000006       -24   # BR(~b_2 -> ~t_1    W-)
     0.00000000E+00    2     2000006       -24   # BR(~b_2 -> ~t_2    W-)
#
#         PDG            Width
DECAY   1000002     1.28259188E+03   # sup_L decays
#          BR         NDA      ID1       ID2
     2.20877446E-03    2     1000022         2   # BR(~u_L -> ~chi_10 u)
     0.00000000E+00    2     1000023         2   # BR(~u_L -> ~chi_20 u)
     0.00000000E+00    2     1000025         2   # BR(~u_L -> ~chi_30 u)
     0.00000000E+00    2     1000035         2   # BR(~u_L -> ~chi_40 u)
     0.00000000E+00    2     1000024         1   # BR(~u_L -> ~chi_1+ d)
     0.00000000E+00    2     1000037         1   # BR(~u_L -> ~chi_2+ d)
     9.97791226E-01    2     1000021         2   # BR(~u_L -> ~g      u)
#
#         PDG            Width
DECAY   2000002     1.32508622E+03   # sup_R decays
#          BR         NDA      ID1       ID2
     3.42070562E-02    2     1000022         2   # BR(~u_R -> ~chi_10 u)
     0.00000000E+00    2     1000023         2   # BR(~u_R -> ~chi_20 u)
     0.00000000E+00    2     1000025         2   # BR(~u_R -> ~chi_30 u)
     0.00000000E+00    2     1000035         2   # BR(~u_R -> ~chi_40 u)
     0.00000000E+00    2     1000024         1   # BR(~u_R -> ~chi_1+ d)
     0.00000000E+00    2     1000037         1   # BR(~u_R -> ~chi_2+ d)
     9.65792944E-01    2     1000021         2   # BR(~u_R -> ~g      u)
#
#         PDG            Width
DECAY   1000001     1.28259188E+03   # sdown_L decays
#          BR         NDA      ID1       ID2
     2.20877446E-03    2     1000022         1   # BR(~d_L -> ~chi_10 d)
     0.00000000E+00    2     1000023         1   # BR(~d_L -> ~chi_20 d)
     0.00000000E+00    2     1000025         1   # BR(~d_L -> ~chi_30 d)
     0.00000000E+00    2     1000035         1   # BR(~d_L -> ~chi_40 d)
     0.00000000E+00    2    -1000024         2   # BR(~d_L -> ~chi_1- u)
     0.00000000E+00    2    -1000037         2   # BR(~d_L -> ~chi_2- u)
     9.97791226E-01    2     1000021         1   # BR(~d_L -> ~g      d)
#
#         PDG            Width
DECAY   2000001     1.29109074E+03   # sdown_R decays
#          BR         NDA      ID1       ID2
     8.77693899E-03    2     1000022         1   # BR(~d_R -> ~chi_10 d)
     0.00000000E+00    2     1000023         1   # BR(~d_R -> ~chi_20 d)
     0.00000000E+00    2     1000025         1   # BR(~d_R -> ~chi_30 d)
     0.00000000E+00    2     1000035         1   # BR(~d_R -> ~chi_40 d)
     0.00000000E+00    2    -1000024         2   # BR(~d_R -> ~chi_1- u)
     0.00000000E+00    2    -1000037         2   # BR(~d_R -> ~chi_2- u)
     9.91223061E-01    2     1000021         1   # BR(~d_R -> ~g      d)
#
#         PDG            Width
DECAY   1000004     1.28259188E+03   # scharm_L decays
#          BR         NDA      ID1       ID2
     2.20877446E-03    2     1000022         4   # BR(~c_L -> ~chi_10 c)
     0.00000000E+00    2     1000023         4   # BR(~c_L -> ~chi_20 c)
     0.00000000E+00    2     1000025         4   # BR(~c_L -> ~chi_30 c)
     0.00000000E+00    2     1000035         4   # BR(~c_L -> ~chi_40 c)
     0.00000000E+00    2     1000024         3   # BR(~c_L -> ~chi_1+ s)
     0.00000000E+00    2     1000037         3   # BR(~c_L -> ~chi_2+ s)
     9.97791226E-01    2     1000021         4   # BR(~c_L -> ~g      c)
#
#         PDG            Width
DECAY   2000004     1.32508622E+03   # scharm_R decays
#          BR         NDA      ID1       ID2
     3.42070562E-02    2     1000022         4   # BR(~c_R -> ~chi_10 c)
     0.00000000E+00    2     1000023         4   # BR(~c_R -> ~chi_20 c)
     0.00000000E+00    2     1000025         4   # BR(~c_R -> ~chi_30 c)
     0.00000000E+00    2     1000035         4   # BR(~c_R -> ~chi_40 c)
     0.00000000E+00    2     1000024         3   # BR(~c_R -> ~chi_1+ s)
     0.00000000E+00    2     1000037         3   # BR(~c_R -> ~chi_2+ s)
     9.65792944E-01    2     1000021         4   # BR(~c_R -> ~g      c)
#
#         PDG            Width
DECAY   1000003     1.28259188E+03   # sstrange_L decays
#          BR         NDA      ID1       ID2
     2.20877446E-03    2     1000022         3   # BR(~s_L -> ~chi_10 s)
     0.00000000E+00    2     1000023         3   # BR(~s_L -> ~chi_20 s)
     0.00000000E+00    2     1000025         3   # BR(~s_L -> ~chi_30 s)
     0.00000000E+00    2     1000035         3   # BR(~s_L -> ~chi_40 s)
     0.00000000E+00    2    -1000024         4   # BR(~s_L -> ~chi_1- c)
     0.00000000E+00    2    -1000037         4   # BR(~s_L -> ~chi_2- c)
     9.97791226E-01    2     1000021         3   # BR(~s_L -> ~g      s)
#
#         PDG            Width
DECAY   2000003     1.29109074E+03   # sstrange_R decays
#          BR         NDA      ID1       ID2
     8.77693899E-03    2     1000022         3   # BR(~s_R -> ~chi_10 s)
     0.00000000E+00    2     1000023         3   # BR(~s_R -> ~chi_20 s)
     0.00000000E+00    2     1000025         3   # BR(~s_R -> ~chi_30 s)
     0.00000000E+00    2     1000035         3   # BR(~s_R -> ~chi_40 s)
     0.00000000E+00    2    -1000024         4   # BR(~s_R -> ~chi_1- c)
     0.00000000E+00    2    -1000037         4   # BR(~s_R -> ~chi_2- c)
     9.91223061E-01    2     1000021         3   # BR(~s_R -> ~g      s)
#
#         PDG            Width
DECAY   1000011     2.54966056E+01   # selectron_L decays
#          BR         NDA      ID1       ID2
     1.00000000E+00    2     1000022        11   # BR(~e_L -> ~chi_10 e-)
     0.00000000E+00    2     1000023        11   # BR(~e_L -> ~chi_20 e-)
     0.00000000E+00    2     1000025        11   # BR(~e_L -> ~chi_30 e-)
     0.00000000E+00    2     1000035        11   # BR(~e_L -> ~chi_40 e-)
     0.00000000E+00    2    -1000024        12   # BR(~e_L -> ~chi_1- nu_e)
     0.00000000E+00    2    -1000037        12   # BR(~e_L -> ~chi_2- nu_e)
#
#         PDG            Width
DECAY   2000011     1.01986422E+02   # selectron_R decays
#          BR         NDA      ID1       ID2
     1.00000000E+00    2     1000022        11   # BR(~e_R -> ~chi_10 e-)
     0.00000000E+00    2     1000023        11   # BR(~e_R -> ~chi_20 e-)
     0.00000000E+00    2     1000025        11   # BR(~e_R -> ~chi_30 e-)
     0.00000000E+00    2     1000035        11   # BR(~e_R -> ~chi_40 e-)
     0.00000000E+00    2    -1000024        12   # BR(~e_R -> ~chi_1- nu_e)
     0.00000000E+00    2    -1000037        12   # BR(~e_R -> ~chi_2- nu_e)
#
#         PDG            Width
DECAY   1000013     2.54966056E+01   # smuon_L decays
#          BR         NDA      ID1       ID2
     1.00000000E+00    2     1000022        13   # BR(~mu_L -> ~chi_10 mu-)
     0.00000000E+00    2     1000023        13   # BR(~mu_L -> ~chi_20 mu-)
     0.00000000E+00    2     1000025        13   # BR(~mu_L -> ~chi_30 mu-)
     0.00000000E+00    2     1000035        13   # BR(~mu_L -> ~chi_40 mu-)
     0.00000000E+00    2    -1000024        14   # BR(~mu_L -> ~chi_1- nu_mu)
     0.00000000E+00    2    -1000037        14   # BR(~mu_L -> ~chi_2- nu_mu)
#
#         PDG            Width
DECAY   2000013     1.01986422E+02   # smuon_R decays
#          BR         NDA      ID1       ID2
     1.00000000E+00    2     1000022        13   # BR(~mu_R -> ~chi_10 mu-)
     0.00000000E+00    2     1000023        13   # BR(~mu_R -> ~chi_20 mu-)
     0.00000000E+00    2     1000025        13   # BR(~mu_R -> ~chi_30 mu-)
     0.00000000E+00    2     1000035        13   # BR(~mu_R -> ~chi_40 mu-)
     0.00000000E+00    2    -1000024        14   # BR(~mu_R -> ~chi_1- nu_mu)
     0.00000000E+00    2    -1000037        14   # BR(~mu_R -> ~chi_2- nu_mu)
#
#         PDG            Width
DECAY   1000015     2.54966052E+01   # stau_1 decays
#          BR         NDA      ID1       ID2
     1.00000000E+00    2     1000022        15   # BR(~tau_1 -> ~chi_10  tau-)
     0.00000000E+00    2     1000023        15   # BR(~tau_1 -> ~chi_20  tau-)
     0.00000000E+00    2     1000025        15   # BR(~tau_1 -> ~chi_30  tau-)
     0.00000000E+00    2     1000035        15   # BR(~tau_1 -> ~chi_40  tau-)
     0.00000000E+00    2    -1000024        16   # BR(~tau_1 -> ~chi_1-  nu_tau)
     0.00000000E+00    2    -1000037        16   # BR(~tau_1 -> ~chi_2-  nu_tau)
     0.00000000E+00    2     1000016       -37   # BR(~tau_1 -> ~nu_tauL H-)
     0.00000000E+00    2     1000016       -24   # BR(~tau_1 -> ~nu_tauL W-)
#
#         PDG            Width
DECAY   2000015     1.01986421E+02   # stau_2 decays
#          BR         NDA      ID1       ID2
     1.00000000E+00    2     1000022        15   # BR(~tau_2 -> ~chi_10  tau-)
     0.00000000E+00    2     1000023        15   # BR(~tau_2 -> ~chi_20  tau-)
     0.00000000E+00    2     1000025        15   # BR(~tau_2 -> ~chi_30  tau-)
     0.00000000E+00    2     1000035        15   # BR(~tau_2 -> ~chi_40  tau-)
     0.00000000E+00    2    -1000024        16   # BR(~tau_2 -> ~chi_1-  nu_tau)
     0.00000000E+00    2    -1000037        16   # BR(~tau_2 -> ~chi_2-  nu_tau)
     0.00000000E+00    2     1000016       -37   # BR(~tau_2 -> ~nu_tauL H-)
     0.00000000E+00    2     1000016       -24   # BR(~tau_2 -> ~nu_tauL W-)
     0.00000000E+00    2     1000015        25   # BR(~tau_2 -> ~tau_1 h)
     0.00000000E+00    2     1000015        35   # BR(~tau_2 -> ~tau_1 H)
     0.00000000E+00    2     1000015        36   # BR(~tau_2 -> ~tau_1 A)
     0.00000000E+00    2     1000015        23   # BR(~tau_2 -> ~tau_1 Z)
#
#         PDG            Width
DECAY   1000012     2.54966056E+01   # snu_eL decays
#          BR         NDA      ID1       ID2
     1.00000000E+00    2     1000022        12   # BR(~nu_eL -> ~chi_10 nu_e)
     0.00000000E+00    2     1000023        12   # BR(~nu_eL -> ~chi_20 nu_e)
     0.00000000E+00    2     1000025        12   # BR(~nu_eL -> ~chi_30 nu_e)
     0.00000000E+00    2     1000035        12   # BR(~nu_eL -> ~chi_40 nu_e)
     0.00000000E+00    2     1000024        11   # BR(~nu_eL -> ~chi_1+ e-)
     0.00000000E+00    2     1000037        11   # BR(~nu_eL -> ~chi_2+ e-)
#
#         PDG            Width
DECAY   1000014     2.54966056E+01   # snu_muL decays
#          BR         NDA      ID1       ID2
     1.00000000E+00    2     1000022        14   # BR(~nu_muL -> ~chi_10 nu_mu)
     0.00000000E+00    2     1000023        14   # BR(~nu_muL -> ~chi_20 nu_mu)
     0.00000000E+00    2     1000025        14   # BR(~nu_muL -> ~chi_30 nu_mu)
     0.00000000E+00    2     1000035        14   # BR(~nu_muL -> ~chi_40 nu_mu)
     0.00000000E+00    2     1000024        13   # BR(~nu_muL -> ~chi_1+ mu-)
     0.00000000E+00    2     1000037        13   # BR(~nu_muL -> ~chi_2+ mu-)
#
#         PDG            Width
DECAY   1000016     2.54966056E+01   # snu_tauL decays
#          BR         NDA      ID1       ID2
     1.00000000E+00    2     1000022        16   # BR(~nu_tauL -> ~chi_10 nu_tau)
     0.00000000E+00    2     1000023        16   # BR(~nu_tauL -> ~chi_20 nu_tau)
     0.00000000E+00    2     1000025        16   # BR(~nu_tauL -> ~chi_30 nu_tau)
     0.00000000E+00    2     1000035        16   # BR(~nu_tauL -> ~chi_40 nu_tau)
     0.00000000E+00    2     1000024        15   # BR(~nu_tauL -> ~chi_1+ tau-)
     0.00000000E+00    2     1000037        15   # BR(~nu_tauL -> ~chi_2+ tau-)
     0.00000000E+00    2    -1000015       -37   # BR(~nu_tauL -> ~tau_1+ H-)
     0.00000000E+00    2    -2000015       -37   # BR(~nu_tauL -> ~tau_2+ H-)
     0.00000000E+00    2    -1000015       -24   # BR(~nu_tauL -> ~tau_1+ W-)
     0.00000000E+00    2    -2000015       -24   # BR(~nu_tauL -> ~tau_2+ W-)
#
#         PDG            Width
DECAY   1000024     1.70414503E-02   # chargino1+ decays
#          BR         NDA      ID1       ID2
     0.0    2     1000022        24   # BR(~chi_1+ -> ~chi_10  W+)
    0.108    3     1000022         -11        12   # BR(~chi_1+ -> ~chi_10  e+  nu_e)
   0.108    3     1000022         -13        14   # BR(~chi_1+ -> ~chi_10  mu+  nu_mu)
  0.108    3     1000022       -15        16   # BR(~chi_1+ -> ~chi_10 tau+ nu_tau)
    0.338    3     1000022         2        -1   # BR(~chi_1+ -> ~chi_10 u    db)
    0.338    3     1000022         4        -3   # BR(~chi_1+ -> ~chi_10 c    sb)
    0.0    3     1000022         6        -5   # BR(~chi_1+ -> ~chi_10 t    bb)
#
#         PDG            Width
DECAY   1000037     2.48689510E+00   # chargino2+ decays
#          BR         NDA      ID1       ID2
     0.00000000E+00    2     1000002        -1   # BR(~chi_2+ -> ~u_L   db)
     0.00000000E+00    2     2000002        -1   # BR(~chi_2+ -> ~u_R   db)
     0.00000000E+00    2    -1000001         2   # BR(~chi_2+ -> ~d_L*  u )
     0.00000000E+00    2    -2000001         2   # BR(~chi_2+ -> ~d_R*  u )
     0.00000000E+00    2     1000004        -3   # BR(~chi_2+ -> ~c_L   sb)
     0.00000000E+00    2     2000004        -3   # BR(~chi_2+ -> ~c_R   sb)
     0.00000000E+00    2    -1000003         4   # BR(~chi_2+ -> ~s_L*  c )
     0.00000000E+00    2    -2000003         4   # BR(~chi_2+ -> ~s_R*  c )
     0.00000000E+00    2     1000006        -5   # BR(~chi_2+ -> ~t_1   bb)
     0.00000000E+00    2     2000006        -5   # BR(~chi_2+ -> ~t_2   bb)
     0.00000000E+00    2    -1000005         6   # BR(~chi_2+ -> ~b_1*  t )
     0.00000000E+00    2    -2000005         6   # BR(~chi_2+ -> ~b_2*  t )
     2.00968837E-02    2     1000012       -11   # BR(~chi_2+ -> ~nu_eL  e+  )
     2.00968837E-02    2     1000014       -13   # BR(~chi_2+ -> ~nu_muL  mu+ )
     2.74507395E-02    2     1000016       -15   # BR(~chi_2+ -> ~nu_tau1 tau+)
     5.20406111E-02    2    -1000011        12   # BR(~chi_2+ -> ~e_L+    nu_e)
     0.00000000E+00    2    -2000011        12   # BR(~chi_2+ -> ~e_R+    nu_e)
     5.20406111E-02    2    -1000013        14   # BR(~chi_2+ -> ~mu_L+   nu_mu)
     0.00000000E+00    2    -2000013        14   # BR(~chi_2+ -> ~mu_R+   nu_mu)
     2.82859898E-04    2    -1000015        16   # BR(~chi_2+ -> ~tau_1+  nu_tau)
     5.66729336E-02    2    -2000015        16   # BR(~chi_2+ -> ~tau_2+  nu_tau)
     2.31513269E-01    2     1000024        23   # BR(~chi_2+ -> ~chi_1+  Z )
     6.76715120E-02    2     1000022        24   # BR(~chi_2+ -> ~chi_10  W+)
     2.93654849E-01    2     1000023        24   # BR(~chi_2+ -> ~chi_20  W+)
     0.00000000E+00    2     1000025        24   # BR(~chi_2+ -> ~chi_30  W+)
     0.00000000E+00    2     1000035        24   # BR(~chi_2+ -> ~chi_40  W+)
     1.78478848E-01    2     1000024        25   # BR(~chi_2+ -> ~chi_1+  h )
     0.00000000E+00    2     1000024        35   # BR(~chi_2+ -> ~chi_1+  H )
     0.00000000E+00    2     1000024        36   # BR(~chi_2+ -> ~chi_1+  A )
     0.00000000E+00    2     1000022        37   # BR(~chi_2+ -> ~chi_10  H+)
     0.00000000E+00    2     1000023        37   # BR(~chi_2+ -> ~chi_20  H+)
     0.00000000E+00    2     1000025        37   # BR(~chi_2+ -> ~chi_30  H+)
     0.00000000E+00    2     1000035        37   # BR(~chi_2+ -> ~chi_40  H+)
#
#         PDG            Width
DECAY   1000022     0.00000000E+00   # neutralino1 decays
#
#         PDG            Width
DECAY   1000023     2.07770048E-02   # neutralino2 decays
#          BR         NDA      ID1       ID2
     1.0    2     1000022        23   # BR(~chi_20 -> ~chi_10   Z )
    0.0    3     1000022        -2         2   # BR(~chi_20 -> ~chi_10 ub      u)
    0.0    3     1000022        -1         1   # BR(~chi_20 -> ~chi_10 db      d)
    0.0    3     1000022        -4         4   # BR(~chi_20 -> ~chi_10 cb      c)
    0.0    3     1000022        -3         3   # BR(~chi_20 -> ~chi_10 sb      s)
    0.0    3     1000022        -6         6   # BR(~chi_20 -> ~chi_10 tb      t)
    0.0    3     1000022        -5         5   # BR(~chi_20 -> ~chi_10 bb      b)
     0.0    3     1000022       -11        11   # BR(~chi_20 -> ~chi_10 e+      e-)
   0.0    3     1000022       -13        13   # BR(~chi_20 -> ~chi_10 mu+     mu-)
 0.0    3     1000022       -15        15   # BR(~chi_20 -> ~chi_10 tau+    tau-)
 0.0    3     1000022       -12        12   # BR(~chi_20 -> ~chi_10 nu_eb   nu_e)
 0.0    3     1000022       -14        14   # BR(~chi_20 -> ~chi_10 nu_mub  nu_mu)
 0.0    3     1000022       -16        16   # BR(~chi_20 -> ~chi_10 nu_taub nu_tau)
#
#         PDG            Width
DECAY   1000025     1.91598495E+00   # neutralino3 decays
#          BR         NDA      ID1       ID2
     1.13226601E-01    2     1000022        23   # BR(~chi_30 -> ~chi_10   Z )
     2.11969194E-01    2     1000023        23   # BR(~chi_30 -> ~chi_20   Z )
     2.95329778E-01    2     1000024       -24   # BR(~chi_30 -> ~chi_1+   W-)
     2.95329778E-01    2    -1000024        24   # BR(~chi_30 -> ~chi_1-   W+)
     0.00000000E+00    2     1000037       -24   # BR(~chi_30 -> ~chi_2+   W-)
     0.00000000E+00    2    -1000037        24   # BR(~chi_30 -> ~chi_2-   W+)
     2.13076490E-02    2     1000022        25   # BR(~chi_30 -> ~chi_10   h )
     0.00000000E+00    2     1000022        35   # BR(~chi_30 -> ~chi_10   H )
     0.00000000E+00    2     1000022        36   # BR(~chi_30 -> ~chi_10   A )
     1.24538329E-02    2     1000023        25   # BR(~chi_30 -> ~chi_20   h )
     0.00000000E+00    2     1000023        35   # BR(~chi_30 -> ~chi_20   H )
     0.00000000E+00    2     1000023        36   # BR(~chi_30 -> ~chi_20   A )
     0.00000000E+00    2     1000024       -37   # BR(~chi_30 -> ~chi_1+   H-)
     0.00000000E+00    2    -1000024        37   # BR(~chi_30 -> ~chi_1-   H+)
     0.00000000E+00    2     1000037       -37   # BR(~chi_30 -> ~chi_2+   H-)
     0.00000000E+00    2    -1000037        37   # BR(~chi_30 -> ~chi_2-   H+)
     0.00000000E+00    2     1000002        -2   # BR(~chi_30 -> ~u_L      ub)
     0.00000000E+00    2    -1000002         2   # BR(~chi_30 -> ~u_L*     u )
     0.00000000E+00    2     2000002        -2   # BR(~chi_30 -> ~u_R      ub)
     0.00000000E+00    2    -2000002         2   # BR(~chi_30 -> ~u_R*     u )
     0.00000000E+00    2     1000001        -1   # BR(~chi_30 -> ~d_L      db)
     0.00000000E+00    2    -1000001         1   # BR(~chi_30 -> ~d_L*     d )
     0.00000000E+00    2     2000001        -1   # BR(~chi_30 -> ~d_R      db)
     0.00000000E+00    2    -2000001         1   # BR(~chi_30 -> ~d_R*     d )
     0.00000000E+00    2     1000004        -4   # BR(~chi_30 -> ~c_L      cb)
     0.00000000E+00    2    -1000004         4   # BR(~chi_30 -> ~c_L*     c )
     0.00000000E+00    2     2000004        -4   # BR(~chi_30 -> ~c_R      cb)
     0.00000000E+00    2    -2000004         4   # BR(~chi_30 -> ~c_R*     c )
     0.00000000E+00    2     1000003        -3   # BR(~chi_30 -> ~s_L      sb)
     0.00000000E+00    2    -1000003         3   # BR(~chi_30 -> ~s_L*     s )
     0.00000000E+00    2     2000003        -3   # BR(~chi_30 -> ~s_R      sb)
     0.00000000E+00    2    -2000003         3   # BR(~chi_30 -> ~s_R*     s )
     0.00000000E+00    2     1000006        -6   # BR(~chi_30 -> ~t_1      tb)
     0.00000000E+00    2    -1000006         6   # BR(~chi_30 -> ~t_1*     t )
     0.00000000E+00    2     2000006        -6   # BR(~chi_30 -> ~t_2      tb)
     0.00000000E+00    2    -2000006         6   # BR(~chi_30 -> ~t_2*     t )
     0.00000000E+00    2     1000005        -5   # BR(~chi_30 -> ~b_1      bb)
     0.00000000E+00    2    -1000005         5   # BR(~chi_30 -> ~b_1*     b )
     0.00000000E+00    2     2000005        -5   # BR(~chi_30 -> ~b_2      bb)
     0.00000000E+00    2    -2000005         5   # BR(~chi_30 -> ~b_2*     b )
     5.57220455E-04    2     1000011       -11   # BR(~chi_30 -> ~e_L-     e+)
     5.57220455E-04    2    -1000011        11   # BR(~chi_30 -> ~e_L+     e-)
     1.25266782E-03    2     2000011       -11   # BR(~chi_30 -> ~e_R-     e+)
     1.25266782E-03    2    -2000011        11   # BR(~chi_30 -> ~e_R+     e-)
     5.57220455E-04    2     1000013       -13   # BR(~chi_30 -> ~mu_L-    mu+)
     5.57220455E-04    2    -1000013        13   # BR(~chi_30 -> ~mu_L+    mu-)
     1.25266782E-03    2     2000013       -13   # BR(~chi_30 -> ~mu_R-    mu+)
     1.25266782E-03    2    -2000013        13   # BR(~chi_30 -> ~mu_R+    mu-)
     5.26279239E-03    2     1000015       -15   # BR(~chi_30 -> ~tau_1-   tau+)
     5.26279239E-03    2    -1000015        15   # BR(~chi_30 -> ~tau_1+   tau-)
     6.72814564E-03    2     2000015       -15   # BR(~chi_30 -> ~tau_2-   tau+)
     6.72814564E-03    2    -2000015        15   # BR(~chi_30 -> ~tau_2+   tau-)
     3.18920485E-03    2     1000012       -12   # BR(~chi_30 -> ~nu_eL    nu_eb)
     3.18920485E-03    2    -1000012        12   # BR(~chi_30 -> ~nu_eL*   nu_e )
     3.18920485E-03    2     1000014       -14   # BR(~chi_30 -> ~nu_muL   nu_mub)
     3.18920485E-03    2    -1000014        14   # BR(~chi_30 -> ~nu_muL*  nu_mu )
     3.20245934E-03    2     1000016       -16   # BR(~chi_30 -> ~nu_tau1  nu_taub)
     3.20245934E-03    2    -1000016        16   # BR(~chi_30 -> ~nu_tau1* nu_tau )
#
#         PDG            Width
DECAY   1000035     2.58585079E+00   # neutralino4 decays
#          BR         NDA      ID1       ID2
     2.15369294E-02    2     1000022        23   # BR(~chi_40 -> ~chi_10   Z )
     1.85499971E-02    2     1000023        23   # BR(~chi_40 -> ~chi_20   Z )
     0.00000000E+00    2     1000025        23   # BR(~chi_40 -> ~chi_30   Z )
     2.49541430E-01    2     1000024       -24   # BR(~chi_40 -> ~chi_1+   W-)
     2.49541430E-01    2    -1000024        24   # BR(~chi_40 -> ~chi_1-   W+)
     0.00000000E+00    2     1000037       -24   # BR(~chi_40 -> ~chi_2+   W-)
     0.00000000E+00    2    -1000037        24   # BR(~chi_40 -> ~chi_2-   W+)
     6.93213268E-02    2     1000022        25   # BR(~chi_40 -> ~chi_10   h )
     0.00000000E+00    2     1000022        35   # BR(~chi_40 -> ~chi_10   H )
     0.00000000E+00    2     1000022        36   # BR(~chi_40 -> ~chi_10   A )
     1.47602336E-01    2     1000023        25   # BR(~chi_40 -> ~chi_20   h )
     0.00000000E+00    2     1000023        35   # BR(~chi_40 -> ~chi_20   H )
     0.00000000E+00    2     1000023        36   # BR(~chi_40 -> ~chi_20   A )
     0.00000000E+00    2     1000025        25   # BR(~chi_40 -> ~chi_30   h )
     0.00000000E+00    2     1000025        35   # BR(~chi_40 -> ~chi_30   H )
     0.00000000E+00    2     1000025        36   # BR(~chi_40 -> ~chi_30   A )
     0.00000000E+00    2     1000024       -37   # BR(~chi_40 -> ~chi_1+   H-)
     0.00000000E+00    2    -1000024        37   # BR(~chi_40 -> ~chi_1-   H+)
     0.00000000E+00    2     1000037       -37   # BR(~chi_40 -> ~chi_2+   H-)
     0.00000000E+00    2    -1000037        37   # BR(~chi_40 -> ~chi_2-   H+)
     0.00000000E+00    2     1000002        -2   # BR(~chi_40 -> ~u_L      ub)
     0.00000000E+00    2    -1000002         2   # BR(~chi_40 -> ~u_L*     u )
     0.00000000E+00    2     2000002        -2   # BR(~chi_40 -> ~u_R      ub)
     0.00000000E+00    2    -2000002         2   # BR(~chi_40 -> ~u_R*     u )
     0.00000000E+00    2     1000001        -1   # BR(~chi_40 -> ~d_L      db)
     0.00000000E+00    2    -1000001         1   # BR(~chi_40 -> ~d_L*     d )
     0.00000000E+00    2     2000001        -1   # BR(~chi_40 -> ~d_R      db)
     0.00000000E+00    2    -2000001         1   # BR(~chi_40 -> ~d_R*     d )
     0.00000000E+00    2     1000004        -4   # BR(~chi_40 -> ~c_L      cb)
     0.00000000E+00    2    -1000004         4   # BR(~chi_40 -> ~c_L*     c )
     0.00000000E+00    2     2000004        -4   # BR(~chi_40 -> ~c_R      cb)
     0.00000000E+00    2    -2000004         4   # BR(~chi_40 -> ~c_R*     c )
     0.00000000E+00    2     1000003        -3   # BR(~chi_40 -> ~s_L      sb)
     0.00000000E+00    2    -1000003         3   # BR(~chi_40 -> ~s_L*     s )
     0.00000000E+00    2     2000003        -3   # BR(~chi_40 -> ~s_R      sb)
     0.00000000E+00    2    -2000003         3   # BR(~chi_40 -> ~s_R*     s )
     0.00000000E+00    2     1000006        -6   # BR(~chi_40 -> ~t_1      tb)
     0.00000000E+00    2    -1000006         6   # BR(~chi_40 -> ~t_1*     t )
     0.00000000E+00    2     2000006        -6   # BR(~chi_40 -> ~t_2      tb)
     0.00000000E+00    2    -2000006         6   # BR(~chi_40 -> ~t_2*     t )
     0.00000000E+00    2     1000005        -5   # BR(~chi_40 -> ~b_1      bb)
     0.00000000E+00    2    -1000005         5   # BR(~chi_40 -> ~b_1*     b )
     0.00000000E+00    2     2000005        -5   # BR(~chi_40 -> ~b_2      bb)
     0.00000000E+00    2    -2000005         5   # BR(~chi_40 -> ~b_2*     b )
     9.64835418E-03    2     1000011       -11   # BR(~chi_40 -> ~e_L-     e+)
     9.64835418E-03    2    -1000011        11   # BR(~chi_40 -> ~e_L+     e-)
     3.75684470E-03    2     2000011       -11   # BR(~chi_40 -> ~e_R-     e+)
     3.75684470E-03    2    -2000011        11   # BR(~chi_40 -> ~e_R+     e-)
     9.64835418E-03    2     1000013       -13   # BR(~chi_40 -> ~mu_L-    mu+)
     9.64835418E-03    2    -1000013        13   # BR(~chi_40 -> ~mu_L+    mu-)
     3.75684470E-03    2     2000013       -13   # BR(~chi_40 -> ~mu_R-    mu+)
     3.75684470E-03    2    -2000013        13   # BR(~chi_40 -> ~mu_R+    mu-)
     2.68215241E-03    2     1000015       -15   # BR(~chi_40 -> ~tau_1-   tau+)
     2.68215241E-03    2    -1000015        15   # BR(~chi_40 -> ~tau_1+   tau-)
     1.62289809E-02    2     2000015       -15   # BR(~chi_40 -> ~tau_2-   tau+)
     1.62289809E-02    2    -2000015        15   # BR(~chi_40 -> ~tau_2+   tau-)
     2.53796547E-02    2     1000012       -12   # BR(~chi_40 -> ~nu_eL    nu_eb)
     2.53796547E-02    2    -1000012        12   # BR(~chi_40 -> ~nu_eL*   nu_e )
     2.53796547E-02    2     1000014       -14   # BR(~chi_40 -> ~nu_muL   nu_mub)
     2.53796547E-02    2    -1000014        14   # BR(~chi_40 -> ~nu_muL*  nu_mu )
     2.54724352E-02    2     1000016       -16   # BR(~chi_40 -> ~nu_tau1  nu_taub)
     2.54724352E-02    2    -1000016        16   # BR(~chi_40 -> ~nu_tau1* nu_tau )
