#  ISAJET SUSY parameters in SUSY Les Houches Accord 2 format
#  Created by ISALHA 2.0 Last revision: C. Balazs 21 Apr 2009
Block SPINFO   # Program information
     1   ISASUGRA from ISAJET          # Spectrum Calculator
     2   7.80   29-OCT-2009 12:50:36   # Version number
Block MODSEL   # Model selection
     1     1   # Minimal supergravity (mSUGRA) model               
Block SMINPUTS   # Standard Model inputs
     1     1.27836807E+02   # alpha_em^(-1)
     2     1.16570000E-05   # G_Fermi
     3     1.17200002E-01   # alpha_s(M_Z)
     4     9.11699982E+01   # m_{Z}(pole)
     5     4.19999981E+00   # m_{b}(m_{b})
     6     1.72500000E+02   # m_{top}(pole)
     7     1.77699995E+00   # m_{tau}(pole)
Block MINPAR   # SUSY breaking input parameters
     1     2.46000000E+03   # m_0
     2     3.30000000E+02   # m_{1/2}
     3     1.00000000E+01   # tan(beta)
     4     1.00000000E+00   # sign(mu)
     5     0.00000000E+00   # A_0
Block EXTPAR   # Non-universal SUSY breaking parameters
     0     2.15380756E+16   # Input scale
Block MASS   # Scalar and gaugino mass spectrum
#  PDG code   mass                 particle
        24     8.04229965E+01   #  W^+
        25     1.15809113E+02   #  h^0            
        35     2.47557983E+03   #  H^0            
        36     2.45932520E+03   #  A^0            
        37     2.47697852E+03   #  H^+            
   1000001     2.52673706E+03   #  dnl            
   1000002     2.52546729E+03   #  upl            
   1000003     2.52673706E+03   #  stl            
   1000004     2.52546777E+03   #  chl            
   1000005     2.07750415E+03   #  b1             
   1000006     1.50046667E+03   #  t1             
   1000011     2.46482422E+03   #  el-            
   1000012     2.46433057E+03   #  nuel           
   1000013     2.46482422E+03   #  mul-           
   1000014     2.46433057E+03   #  numl           
   1000015     2.43795532E+03   #  tau1           
   1000016     2.45323608E+03   #  nutl           
   1000021     8.98147156E+02   #  glss           
   1000022     1.37593643E+02   #  z1ss           
   1000023     2.54865372E+02   #  z2ss           
   1000024     2.56214844E+02   #  w1ss           
   1000025    -3.98291168E+02   #  z3ss           
   1000035     4.24003418E+02   #  z4ss           
   1000037     4.22184357E+02   #  w2ss           
   2000001     2.53003711E+03   #  dnr            
   2000002     2.52901147E+03   #  upr            
   2000003     2.53003711E+03   #  str            
   2000004     2.52901196E+03   #  chr            
   2000005     2.50517432E+03   #  b2             
   2000006     2.08749902E+03   #  t2             
   2000011     2.46062744E+03   #  er-            
   2000013     2.46062744E+03   #  mur-           
   2000015     2.45347705E+03   #  tau2           
Block ALPHA   # Effective Higgs mixing parameter
         -1.00014754E-01   # alpha
Block STOPMIX   # stop mixing matrix
  1  1     3.38267684E-02   # O_{11}
  1  2     9.99427736E-01   # O_{12}
  2  1    -9.99427736E-01   # O_{21}
  2  2     3.38267684E-02   # O_{22}
Block SBOTMIX   # sbottom mixing matrix
  1  1     9.99970794E-01   # O_{11}
  1  2     7.64356414E-03   # O_{12}
  2  1    -7.64356414E-03   # O_{21}
  2  2     9.99970794E-01   # O_{22}
Block STAUMIX   # stau mixing matrix
  1  1     1.40014857E-01   # O_{11}
  1  2     9.90149379E-01   # O_{12}
  2  1    -9.90149379E-01   # O_{21}
  2  2     1.40014857E-01   # O_{22}
Block NMIX   # neutralino mixing matrix
  1  1     9.88058388E-01   #
  1  2    -4.17335518E-02   #
  1  3     1.36080742E-01   #
  1  4    -5.89988716E-02   #
  2  1    -9.55745205E-02   #
  2  2    -9.16912198E-01   #
  2  3     3.14801633E-01   #
  2  4    -2.25915164E-01   #
  3  1     5.09093367E-02   #
  3  2    -7.03940019E-02   #
  3  3    -6.98987961E-01   #
  3  4    -7.09837258E-01   #
  4  1    -1.09609723E-01   #
  4  2     3.90608728E-01   #
  4  3     6.27533436E-01   #
  4  4    -6.64539337E-01   #
Block UMIX   # chargino U mixing matrix
  1  1    -8.97312880E-01   # U_{11}
  1  2     4.41395044E-01   # U_{12}
  2  1    -4.41395044E-01   # U_{21}
  2  2    -8.97312880E-01   # U_{22}
Block VMIX   # chargino V mixing matrix
  1  1    -9.49339330E-01   # V_{11}
  1  2     3.14252734E-01   # V_{12}
  2  1    -3.14252734E-01   # V_{21}
  2  2    -9.49339330E-01   # V_{22}
Block GAUGE Q=  1.75230432E+03   #
     1     3.57526422E-01   # g`
     2     6.52363896E-01   # g_2
     3     1.21932793E+00   # g_3
Block YU Q=  1.75230432E+03   #
  3  3     8.51268709E-01   # y_t
Block YD Q=  1.75230432E+03   #
  3  3     1.31125137E-01   # y_b
Block YE Q=  1.75230432E+03   #
  3  3     1.01826057E-01   # y_tau
Block HMIX Q=  1.75230432E+03   # Higgs mixing parameters
     1     3.87236572E+02   # mu(Q)
     2     1.00000000E+01   # tan(beta)(M_GUT)
     3     2.51596954E+02   # Higgs vev at Q
     4     6.04828050E+06   # m_A^2(Q)
Block MSOFT Q=  1.75230432E+03   # DRbar SUSY breaking parameters
     1     1.40999237E+02   # M_1(Q)          
     2     2.59645721E+02   # M_2(Q)          
     3     7.58760132E+02   # M_3(Q)          
    31     2.45656494E+03   # MeL(Q)          
    32     2.45656494E+03   # MmuL(Q)         
    33     2.44574487E+03   # MtauL(Q)        
    34     2.45785767E+03   # MeR(Q)          
    35     2.45785767E+03   # MmuR(Q)         
    36     2.43610986E+03   # MtauR(Q)        
    41     2.48424023E+03   # MqL1(Q)         
    42     2.48424023E+03   # MqL2(Q)         
    43     2.04558191E+03   # MqL3(Q)         
    44     2.48744189E+03   # MuR(Q)          
    45     2.48744189E+03   # McR(Q)          
    46     1.50107434E+03   # MtR(Q)          
    47     2.48807886E+03   # MdR(Q)          
    48     2.48807886E+03   # MsR(Q)          
    49     2.47000635E+03   # MbR(Q)          
Block AU Q=  1.75230432E+03   #
  1  1    -5.49161682E+02   # A_u
  2  2    -5.49161682E+02   # A_c
  3  3    -5.49161682E+02   # A_t
Block AD Q=  1.75230432E+03   #
  1  1    -8.09783386E+02   # A_d
  2  2    -8.09783386E+02   # A_s
  3  3    -8.09783386E+02   # A_b
Block AE Q=  1.75230432E+03   #
  1  1    -1.92951462E+02   # A_e
  2  2    -1.92951462E+02   # A_mu
  3  3    -1.92951462E+02   # A_tau
#  ISAJET decay tables in SUSY Les Houches accord format
#  Created by ISALHD. Last revision: C. Balazs, 2005 May 25
Block DCINFO                           # Program information
     1   ISASUGRA from ISAJET          # Spectrum Calculator
     2   7.80   29-OCT-2009 12:50:36   # Version number
#         PDG         Width
DECAY         6  1.14680779E+00   # TP    decays
#          BR          NDA       ID1       ID2       ID3       ID4
      3.33333343E-01    3            2        -1         5             # TP     -->  UP     DB     BT          
      3.33333343E-01    3            4        -3         5             # TP     -->  CH     SB     BT          
      1.11111112E-01    3          -11        12         5             # TP     -->  E+     NUE    BT          
      1.11111112E-01    3          -13        14         5             # TP     -->  MU+    NUM    BT          
      1.11111112E-01    3          -15        16         5             # TP     -->  TAU+   NUT    BT          
#         PDG         Width
DECAY   1000021  1.19959237E-03   # GLSS  decays
#          BR          NDA       ID1       ID2       ID3       ID4
      4.49063964E-02    3      1000024         1        -2             # GLSS   -->  W1SS+  DN     UB          
      4.49063964E-02    3     -1000024         2        -1             # GLSS   -->  W1SS-  UP     DB          
      4.49063778E-02    3      1000024         3        -4             # GLSS   -->  W1SS+  ST     CB          
      4.49063778E-02    3     -1000024         4        -3             # GLSS   -->  W1SS-  CH     SB          
      5.74228652E-02    3      1000024         5        -6             # GLSS   -->  W1SS+  BT     TB          
      5.74228652E-02    3     -1000024         6        -5             # GLSS   -->  W1SS-  TP     BB          
      3.01423622E-03    3      1000037         1        -2             # GLSS   -->  W2SS+  DN     UB          
      3.01423622E-03    3     -1000037         2        -1             # GLSS   -->  W2SS-  UP     DB          
      3.01423552E-03    3      1000037         3        -4             # GLSS   -->  W2SS+  ST     CB          
      3.01423552E-03    3     -1000037         4        -3             # GLSS   -->  W2SS-  CH     SB          
      1.20568573E-01    3      1000037         5        -6             # GLSS   -->  W2SS+  BT     TB          
      1.20568573E-01    3     -1000037         6        -5             # GLSS   -->  W2SS-  TP     BB          
      2.59215758E-05    2      1000022        21                       # GLSS   -->  Z1SS   GL                 
      1.94918308E-02    3      1000022         2        -2             # GLSS   -->  Z1SS   UP     UB          
      6.47532661E-03    3      1000022         1        -1             # GLSS   -->  Z1SS   DN     DB          
      6.47532661E-03    3      1000022         3        -3             # GLSS   -->  Z1SS   ST     SB          
      1.94918178E-02    3      1000022         4        -4             # GLSS   -->  Z1SS   CH     CB          
      9.15997848E-03    3      1000022         5        -5             # GLSS   -->  Z1SS   BT     BB          
      7.71355852E-02    3      1000022         6        -6             # GLSS   -->  Z1SS   TP     TB          
      4.41094860E-03    2      1000023        21                       # GLSS   -->  Z2SS   GL                 
      2.32589729E-02    3      1000023         2        -2             # GLSS   -->  Z2SS   UP     UB          
      2.14151032E-02    3      1000023         1        -1             # GLSS   -->  Z2SS   DN     DB          
      2.14151032E-02    3      1000023         3        -3             # GLSS   -->  Z2SS   ST     SB          
      2.32589506E-02    3      1000023         4        -4             # GLSS   -->  Z2SS   CH     CB          
      5.02570122E-02    3      1000023         5        -5             # GLSS   -->  Z2SS   BT     BB          
      1.89623237E-02    3      1000023         6        -6             # GLSS   -->  Z2SS   TP     TB          
      2.65093520E-02    2      1000025        21                       # GLSS   -->  Z3SS   GL                 
      2.53747294E-05    3      1000025         2        -2             # GLSS   -->  Z3SS   UP     UB          
      3.31878873E-05    3      1000025         1        -1             # GLSS   -->  Z3SS   DN     DB          
      3.31878873E-05    3      1000025         3        -3             # GLSS   -->  Z3SS   ST     SB          
      2.53747075E-05    3      1000025         4        -4             # GLSS   -->  Z3SS   CH     CB          
      1.86544878E-03    3      1000025         5        -5             # GLSS   -->  Z3SS   BT     BB          
      3.15031931E-02    3      1000025         6        -6             # GLSS   -->  Z3SS   TP     TB          
      2.16070730E-02    2      1000035        21                       # GLSS   -->  Z4SS   GL                 
      1.48219499E-03    3      1000035         2        -2             # GLSS   -->  Z4SS   UP     UB          
      1.75240694E-03    3      1000035         1        -1             # GLSS   -->  Z4SS   DN     DB          
      1.75240694E-03    3      1000035         3        -3             # GLSS   -->  Z4SS   ST     SB          
      1.48219371E-03    3      1000035         4        -4             # GLSS   -->  Z4SS   CH     CB          
      5.45003172E-03    3      1000035         5        -5             # GLSS   -->  Z4SS   BT     BB          
      5.75790890E-02    3      1000035         6        -6             # GLSS   -->  Z4SS   TP     TB          
#         PDG         Width
DECAY   1000002  1.39526093E+02   # UPL   decays
#          BR          NDA       ID1       ID2       ID3       ID4
      1.46936346E-03    2      1000022         2                       # UPL    -->  Z1SS   UP                 
      6.51768148E-02    2      1000023         2                       # UPL    -->  Z2SS   UP                 
      2.70168821E-04    2      1000025         2                       # UPL    -->  Z3SS   UP                 
      9.87880398E-03    2      1000035         2                       # UPL    -->  Z4SS   UP                 
      7.74466455E-01    2      1000021         2                       # UPL    -->  GLSS   UP                 
      1.34519428E-01    2      1000024         1                       # UPL    -->  W1SS+  DN                 
      1.42189432E-02    2      1000037         1                       # UPL    -->  W2SS+  DN                 
#         PDG         Width
DECAY   1000001  1.39544708E+02   # DNL   decays
#          BR          NDA       ID1       ID2       ID3       ID4
      3.75946029E-03    2      1000022         1                       # DNL    -->  Z1SS   DN                 
      6.04065806E-02    2      1000023         1                       # DNL    -->  Z2SS   DN                 
      4.60626499E-04    2      1000025         1                       # DNL    -->  Z3SS   DN                 
      1.21416412E-02    2      1000035         1                       # DNL    -->  Z4SS   DN                 
      7.74941444E-01    2      1000021         1                       # DNL    -->  GLSS   DN                 
      1.20226257E-01    2     -1000024         2                       # DNL    -->  W1SS-  UP                 
      2.80639939E-02    2     -1000037         2                       # DNL    -->  W2SS-  UP                 
#         PDG         Width
DECAY   1000003  1.39544693E+02   # STL   decays
#          BR          NDA       ID1       ID2       ID3       ID4
      3.75946076E-03    2      1000022         3                       # STL    -->  Z1SS   ST                 
      6.04065880E-02    2      1000023         3                       # STL    -->  Z2SS   ST                 
      4.60626557E-04    2      1000025         3                       # STL    -->  Z3SS   ST                 
      1.21416422E-02    2      1000035         3                       # STL    -->  Z4SS   ST                 
      7.74941504E-01    2      1000021         3                       # STL    -->  GLSS   ST                 
      1.20226182E-01    2     -1000024         4                       # STL    -->  W1SS-  CH                 
      2.80639790E-02    2     -1000037         4                       # STL    -->  W2SS-  CH                 
#         PDG         Width
DECAY   1000004  1.39526031E+02   # CHL   decays
#          BR          NDA       ID1       ID2       ID3       ID4
      1.46936334E-03    2      1000022         4                       # CHL    -->  Z1SS   CH                 
      6.51768148E-02    2      1000023         4                       # CHL    -->  Z2SS   CH                 
      2.70168850E-04    2      1000025         4                       # CHL    -->  Z3SS   CH                 
      9.87880211E-03    2      1000035         4                       # CHL    -->  Z4SS   CH                 
      7.74466455E-01    2      1000021         4                       # CHL    -->  GLSS   CH                 
      1.34519503E-01    2      1000024         3                       # CHL    -->  W1SS+  ST                 
      1.42189516E-02    2      1000037         3                       # CHL    -->  W2SS+  ST                 
#         PDG         Width
DECAY   1000005  1.31668442E+02   # BT1   decays
#          BR          NDA       ID1       ID2       ID3       ID4
      3.39347590E-03    2      1000022         5                       # BT1    -->  Z1SS   BT                 
      5.27313240E-02    2      1000023         5                       # BT1    -->  Z2SS   BT                 
      2.92991125E-03    2      1000025         5                       # BT1    -->  Z3SS   BT                 
      1.22617241E-02    2      1000035         5                       # BT1    -->  Z4SS   BT                 
      5.95860124E-01    2      1000021         5                       # BT1    -->  GLSS   BT                 
      1.21130064E-01    2     -1000024         6                       # BT1    -->  W1SS-  TP                 
      2.06307590E-01    2     -1000037         6                       # BT1    -->  W2SS-  TP                 
      5.38585382E-03    2          -24   1000006                       # BT1    -->  W-     TP1                
#         PDG         Width
DECAY   1000006  7.31703033E+01   # TP1   decays
#          BR          NDA       ID1       ID2       ID3       ID4
      4.72810179E-01    2      1000021         6                       # TP1    -->  GLSS   TP                 
      4.42934409E-02    2      1000022         6                       # TP1    -->  Z1SS   TP                 
      1.58252120E-02    2      1000023         6                       # TP1    -->  Z2SS   TP                 
      1.21722251E-01    2      1000025         6                       # TP1    -->  Z3SS   TP                 
      1.01332113E-01    2      1000035         6                       # TP1    -->  Z4SS   TP                 
      3.08089256E-02    2      1000024         5                       # TP1    -->  W1SS+  BT                 
      2.13207886E-01    2      1000037         5                       # TP1    -->  W2SS+  BT                 
#         PDG         Width
DECAY   2000002  1.13961891E+02   # UPR   decays
#          BR          NDA       ID1       ID2       ID3       ID4
      4.86852936E-02    2      1000022         2                       # UPR    -->  Z1SS   UP                 
      4.48978302E-04    2      1000023         2                       # UPR    -->  Z2SS   UP                 
      1.23648046E-04    2      1000025         2                       # UPR    -->  Z3SS   UP                 
      5.69299911E-04    2      1000035         2                       # UPR    -->  Z4SS   UP                 
      9.50172782E-01    2      1000021         2                       # UPR    -->  GLSS   UP                 
#         PDG         Width
DECAY   2000001  1.09768814E+02   # DNR   decays
#          BR          NDA       ID1       ID2       ID3       ID4
      1.26414429E-02    2      1000022         1                       # DNR    -->  Z1SS   DN                 
      1.16581432E-04    2      1000023         1                       # DNR    -->  Z2SS   DN                 
      3.21071639E-05    2      1000025         1                       # DNR    -->  Z3SS   DN                 
      1.47828527E-04    2      1000035         1                       # DNR    -->  Z4SS   DN                 
      9.87062097E-01    2      1000021         1                       # DNR    -->  GLSS   DN                 
#         PDG         Width
DECAY   2000003  1.09768814E+02   # STR   decays
#          BR          NDA       ID1       ID2       ID3       ID4
      1.26414429E-02    2      1000022         3                       # STR    -->  Z1SS   ST                 
      1.16581432E-04    2      1000023         3                       # STR    -->  Z2SS   ST                 
      3.21071639E-05    2      1000025         3                       # STR    -->  Z3SS   ST                 
      1.47828527E-04    2      1000035         3                       # STR    -->  Z4SS   ST                 
      9.87062097E-01    2      1000021         3                       # STR    -->  GLSS   ST                 
#         PDG         Width
DECAY   2000004  1.13961830E+02   # CHR   decays
#          BR          NDA       ID1       ID2       ID3       ID4
      4.86853048E-02    2      1000022         4                       # CHR    -->  Z1SS   CH                 
      4.48978361E-04    2      1000023         4                       # CHR    -->  Z2SS   CH                 
      1.23648075E-04    2      1000025         4                       # CHR    -->  Z3SS   CH                 
      5.69299969E-04    2      1000035         4                       # CHR    -->  Z4SS   CH                 
      9.50172722E-01    2      1000021         4                       # CHR    -->  GLSS   CH                 
#         PDG         Width
DECAY   2000005  1.09915192E+02   # BT2   decays
#          BR          NDA       ID1       ID2       ID3       ID4
      1.26142092E-02    2      1000022         5                       # BT2    -->  Z1SS   BT                 
      7.97408866E-04    2      1000023         5                       # BT2    -->  Z2SS   BT                 
      3.84441065E-03    2      1000025         5                       # BT2    -->  Z3SS   BT                 
      3.29183484E-03    2      1000035         5                       # BT2    -->  Z4SS   BT                 
      9.71318007E-01    2      1000021         5                       # BT2    -->  GLSS   BT                 
      1.32019701E-03    2     -1000024         6                       # BT2    -->  W1SS-  TP                 
      6.39208080E-03    2     -1000037         6                       # BT2    -->  W2SS-  TP                 
      1.62434378E-06    2          -24   1000006                       # BT2    -->  W-     TP1                
      1.46513150E-04    2          -24   2000006                       # BT2    -->  W-     TP2                
      7.82060888E-05    2           23   1000005                       # BT2    -->  Z0     BT1                
      1.95542307E-04    2           25   1000005                       # BT2    -->  HL0    BT1                
#         PDG         Width
DECAY   2000006  1.31028305E+02   # TP2   decays
#          BR          NDA       ID1       ID2       ID3       ID4
      5.88102758E-01    2      1000021         6                       # TP2    -->  GLSS   TP                 
      1.14846878E-01    2      1000024         5                       # TP2    -->  W1SS+  BT                 
      1.98059548E-02    2      1000037         5                       # TP2    -->  W2SS+  BT                 
      2.84512527E-03    2           23   1000006                       # TP2    -->  Z0     TP1                
      5.78226103E-03    2           25   1000006                       # TP2    -->  HL0    TP1                
      1.80097879E-03    2      1000022         6                       # TP2    -->  Z1SS   TP                 
      6.42046407E-02    2      1000023         6                       # TP2    -->  Z2SS   TP                 
      1.01602949E-01    2      1000025         6                       # TP2    -->  Z3SS   TP                 
      1.01008490E-01    2      1000035         6                       # TP2    -->  Z4SS   TP                 
#         PDG         Width
DECAY   1000011  3.33764458E+01   # EL-   decays
#          BR          NDA       ID1       ID2       ID3       ID4
      7.76397809E-02    2      1000022        11                       # EL-    -->  Z1SS   E-                 
      2.85933375E-01    2      1000023        11                       # EL-    -->  Z2SS   E-                 
      5.30368648E-04    2      1000025        11                       # EL-    -->  Z3SS   E-                 
      3.19488347E-02    2      1000035        11                       # EL-    -->  Z4SS   E-                 
      4.89823163E-01    2     -1000024        12                       # EL-    -->  W1SS-  NUE                
      1.14124492E-01    2     -1000037        12                       # EL-    -->  W2SS-  NUE                
#         PDG         Width
DECAY   1000013  3.33764458E+01   # MUL-  decays
#          BR          NDA       ID1       ID2       ID3       ID4
      7.76397809E-02    2      1000022        13                       # MUL-   -->  Z1SS   MU-                
      2.85933375E-01    2      1000023        13                       # MUL-   -->  Z2SS   MU-                
      5.30368648E-04    2      1000025        13                       # MUL-   -->  Z3SS   MU-                
      3.19488347E-02    2      1000035        13                       # MUL-   -->  Z4SS   MU-                
      4.89823163E-01    2     -1000024        14                       # MUL-   -->  W1SS-  NUM                
      1.14124492E-01    2     -1000037        14                       # MUL-   -->  W2SS-  NUM                
#         PDG         Width
DECAY   1000015  1.37259951E+01   # TAU1- decays
#          BR          NDA       ID1       ID2       ID3       ID4
      8.67245078E-01    2      1000022        15                       # TAU1-  -->  Z1SS   TAU-               
      3.76023725E-02    2      1000023        15                       # TAU1-  -->  Z2SS   TAU-               
      1.68776717E-02    2      1000025        15                       # TAU1-  -->  Z3SS   TAU-               
      1.32193081E-02    2      1000035        15                       # TAU1-  -->  Z4SS   TAU-               
      5.59536554E-02    2     -1000024        16                       # TAU1-  -->  W1SS-  NUT                
      9.10196733E-03    2     -1000037        16                       # TAU1-  -->  W2SS-  NUT                
#         PDG         Width
DECAY   1000012  3.34173355E+01   # NUEL  decays
#          BR          NDA       ID1       ID2       ID3       ID4
      1.05494283E-01    2      1000022        12                       # NUEL   -->  Z1SS   NUE                
      2.26991996E-01    2      1000023        12                       # NUEL   -->  Z2SS   NUE                
      2.84915883E-03    2      1000025        12                       # NUEL   -->  Z3SS   NUE                
      5.94164729E-02    2      1000035        12                       # NUEL   -->  Z4SS   NUE                
      5.47484696E-01    2      1000024        11                       # NUEL   -->  W1SS+  E-                 
      5.77634014E-02    2      1000037        11                       # NUEL   -->  W2SS+  E-                 
#         PDG         Width
DECAY   1000014  3.34173355E+01   # NUML  decays
#          BR          NDA       ID1       ID2       ID3       ID4
      1.05494283E-01    2      1000022        14                       # NUML   -->  Z1SS   NUM                
      2.26991996E-01    2      1000023        14                       # NUML   -->  Z2SS   NUM                
      2.84915883E-03    2      1000025        14                       # NUML   -->  Z3SS   NUM                
      5.94164729E-02    2      1000035        14                       # NUML   -->  Z4SS   NUM                
      5.47484696E-01    2      1000024        13                       # NUML   -->  W1SS+  MU-                
      5.77634014E-02    2      1000037        13                       # NUML   -->  W2SS+  MU-                
#         PDG         Width
DECAY   1000016  3.37616119E+01   # NUTL  decays
#          BR          NDA       ID1       ID2       ID3       ID4
      1.03942543E-01    2      1000022        16                       # NUTL   -->  Z1SS   NUT                
      2.23621935E-01    2      1000023        16                       # NUTL   -->  Z2SS   NUT                
      2.80604395E-03    2      1000025        16                       # NUTL   -->  Z3SS   NUT                
      5.85134476E-02    2      1000035        16                       # NUTL   -->  Z4SS   NUT                
      5.42330623E-01    2      1000024        15                       # NUTL   -->  W1SS+  TAU-               
      6.87854439E-02    2      1000037        15                       # NUTL   -->  W2SS+  TAU-               
      1.40008158E-10    3      1000015        16       -15             # NUTL   -->  TAU1-  NUT    TAU+        
      1.40008158E-10    3      1000015        12       -11             # NUTL   -->  TAU1-  NUE    E+          
      1.40008158E-10    3      1000015        14       -13             # NUTL   -->  TAU1-  NUM    MU+         
      4.20024460E-10    3      1000015         2        -1             # NUTL   -->  TAU1-  UP     DB          
      4.20024460E-10    3      1000015         4        -3             # NUTL   -->  TAU1-  CH     SB          
#         PDG         Width
DECAY   2000011  1.24261932E+01   # ER-   decays
#          BR          NDA       ID1       ID2       ID3       ID4
      9.77128208E-01    2      1000022        11                       # ER-    -->  Z1SS   E-                 
      9.00372025E-03    2      1000023        11                       # ER-    -->  Z2SS   E-                 
      2.47537205E-03    2      1000025        11                       # ER-    -->  Z3SS   E-                 
      1.13926167E-02    2      1000035        11                       # ER-    -->  Z4SS   E-                 
#         PDG         Width
DECAY   2000013  1.24261932E+01   # MUR-  decays
#          BR          NDA       ID1       ID2       ID3       ID4
      9.77128208E-01    2      1000022        13                       # MUR-   -->  Z1SS   MU-                
      9.00372025E-03    2      1000023        13                       # MUR-   -->  Z2SS   MU-                
      2.47537205E-03    2      1000025        13                       # MUR-   -->  Z3SS   MU-                
      1.13926167E-02    2      1000035        13                       # MUR-   -->  Z4SS   MU-                
#         PDG         Width
DECAY   2000015  3.32962875E+01   # TAU2- decays
#          BR          NDA       ID1       ID2       ID3       ID4
      8.18229169E-02    2      1000022        15                       # TAU2-  -->  Z1SS   TAU-               
      2.76068300E-01    2      1000023        15                       # TAU2-  -->  Z2SS   TAU-               
      9.16785933E-03    2      1000025        15                       # TAU2-  -->  Z3SS   TAU-               
      4.24037799E-02    2      1000035        15                       # TAU2-  -->  Z4SS   TAU-               
      4.68453616E-01    2     -1000024        16                       # TAU2-  -->  W1SS-  NUT                
      1.22083567E-01    2     -1000037        16                       # TAU2-  -->  W2SS-  NUT                
#         PDG         Width
DECAY   1000023  7.74087850E-03   # Z2SS  decays
#          BR          NDA       ID1       ID2       ID3       ID4
      6.25457733E-06    2      1000022        22                       # Z2SS   -->  Z1SS   GM                 
      2.79211551E-01    2      1000022        23                       # Z2SS   -->  Z1SS   Z0                 
      1.61000884E-08    3      1000022         2        -2             # Z2SS   -->  Z1SS   UP     UB          
      3.32097230E-08    3      1000022         1        -1             # Z2SS   -->  Z1SS   DN     DB          
      3.32097230E-08    3      1000022         3        -3             # Z2SS   -->  Z1SS   ST     SB          
      1.61000777E-08    3      1000022         4        -4             # Z2SS   -->  Z1SS   CH     CB          
      8.62712994E-08    3      1000022         5        -5             # Z2SS   -->  Z1SS   BT     BB          
      7.56788694E-08    3      1000022        11       -11             # Z2SS   -->  Z1SS   E-     E+          
      7.56788694E-08    3      1000022        13       -13             # Z2SS   -->  Z1SS   MU-    MU+         
      8.17494552E-08    3      1000022        15       -15             # Z2SS   -->  Z1SS   TAU-   TAU+        
      7.76243141E-08    3      1000022        12       -12             # Z2SS   -->  Z1SS   NUE    ANUE        
      7.76243141E-08    3      1000022        14       -14             # Z2SS   -->  Z1SS   NUM    ANUM        
      7.90474246E-08    3      1000022        16       -16             # Z2SS   -->  Z1SS   NUT    ANUT        
      7.20781505E-01    2      1000022        25                       # Z2SS   -->  Z1SS   HL0                
#         PDG         Width
DECAY   1000025  1.29538345E+00   # Z3SS  decays
#          BR          NDA       ID1       ID2       ID3       ID4
      1.85507361E-07    2      1000022        22                       # Z3SS   -->  Z1SS   GM                 
      9.45622503E-07    2      1000023        22                       # Z3SS   -->  Z2SS   GM                 
      2.84247249E-01    2      1000024       -24                       # Z3SS   -->  W1SS+  W-                 
      2.84247249E-01    2     -1000024        24                       # Z3SS   -->  W1SS-  W+                 
      1.76706672E-01    2      1000022        23                       # Z3SS   -->  Z1SS   Z0                 
      2.26816028E-01    2      1000023        23                       # Z3SS   -->  Z2SS   Z0                 
      5.62758763E-11    3      1000022         2        -2             # Z3SS   -->  Z1SS   UP     UB          
      2.53879470E-11    3      1000022         1        -1             # Z3SS   -->  Z1SS   DN     DB          
      2.53879470E-11    3      1000022         3        -3             # Z3SS   -->  Z1SS   ST     SB          
      5.62758277E-11    3      1000022         4        -4             # Z3SS   -->  Z1SS   CH     CB          
      3.68813291E-09    3      1000022         5        -5             # Z3SS   -->  Z1SS   BT     BB          
      1.08241471E-10    3      1000022        11       -11             # Z3SS   -->  Z1SS   E-     E+          
      1.08241471E-10    3      1000022        13       -13             # Z3SS   -->  Z1SS   MU-    MU+         
      2.89127500E-09    3      1000022        15       -15             # Z3SS   -->  Z1SS   TAU-   TAU+        
      8.59344054E-11    3      1000022        12       -12             # Z3SS   -->  Z1SS   NUE    ANUE        
      8.59344054E-11    3      1000022        14       -14             # Z3SS   -->  Z1SS   NUM    ANUM        
      8.75224546E-11    3      1000022        16       -16             # Z3SS   -->  Z1SS   NUT    ANUT        
      1.97615882E-11    3      1000023         2        -2             # Z3SS   -->  Z2SS   UP     UB          
      3.10754235E-11    3      1000023         1        -1             # Z3SS   -->  Z2SS   DN     DB          
      3.10754235E-11    3      1000023         3        -3             # Z3SS   -->  Z2SS   ST     SB          
      1.97615743E-11    3      1000023         4        -4             # Z3SS   -->  Z2SS   CH     CB          
      1.67234704E-09    3      1000023         5        -5             # Z3SS   -->  Z2SS   BT     BB          
      3.84580475E-12    3      1000023        11       -11             # Z3SS   -->  Z2SS   E-     E+          
      3.84580475E-12    3      1000023        13       -13             # Z3SS   -->  Z2SS   MU-    MU+         
      2.32553712E-10    3      1000023        15       -15             # Z3SS   -->  Z2SS   TAU-   TAU+        
      1.61296948E-11    3      1000023        12       -12             # Z3SS   -->  Z2SS   NUE    ANUE        
      1.61296948E-11    3      1000023        14       -14             # Z3SS   -->  Z2SS   NUM    ANUM        
      1.64290474E-11    3      1000023        16       -16             # Z3SS   -->  Z2SS   NUT    ANUT        
      2.46666837E-02    2      1000022        25                       # Z3SS   -->  Z1SS   HL0                
      3.31493351E-03    2      1000023        25                       # Z3SS   -->  Z2SS   HL0                
#         PDG         Width
DECAY   1000035  1.83439267E+00   # Z4SS  decays
#          BR          NDA       ID1       ID2       ID3       ID4
      9.57705311E-08    2      1000022        22                       # Z4SS   -->  Z1SS   GM                 
      3.28651254E-07    2      1000023        22                       # Z4SS   -->  Z2SS   GM                 
      1.61311959E-08    2      1000025        22                       # Z4SS   -->  Z3SS   GM                 
      3.61113071E-01    2      1000024       -24                       # Z4SS   -->  W1SS+  W-                 
      3.61113071E-01    2     -1000024        24                       # Z4SS   -->  W1SS-  W+                 
      6.08682419E-12    3     -1000037         2        -1             # Z4SS   -->  W2SS-  UP     DB          
      2.02894147E-12    3     -1000037        12       -11             # Z4SS   -->  W2SS-  NUE    E+          
      2.02894147E-12    3     -1000037        14       -13             # Z4SS   -->  W2SS-  NUM    MU+         
      6.08682419E-12    3      1000037         1        -2             # Z4SS   -->  W2SS+  DN     UB          
      2.02894147E-12    3      1000037        11       -12             # Z4SS   -->  W2SS+  E-     ANUE        
      2.02894147E-12    3      1000037        13       -14             # Z4SS   -->  W2SS+  MU-    ANUM        
      2.29276102E-02    2      1000022        23                       # Z4SS   -->  Z1SS   Z0                 
      1.04008187E-02    2      1000023        23                       # Z4SS   -->  Z2SS   Z0                 
      1.03354802E-09    3      1000022         2        -2             # Z4SS   -->  Z1SS   UP     UB          
      1.46821932E-09    3      1000022         1        -1             # Z4SS   -->  Z1SS   DN     DB          
      1.46821932E-09    3      1000022         3        -3             # Z4SS   -->  Z1SS   ST     SB          
      1.03354736E-09    3      1000022         4        -4             # Z4SS   -->  Z1SS   CH     CB          
      5.07751707E-09    3      1000022         5        -5             # Z4SS   -->  Z1SS   BT     BB          
      2.81817281E-09    3      1000022        11       -11             # Z4SS   -->  Z1SS   E-     E+          
      2.81817281E-09    3      1000022        13       -13             # Z4SS   -->  Z1SS   MU-    MU+         
      5.03125941E-09    3      1000022        15       -15             # Z4SS   -->  Z1SS   TAU-   TAU+        
      4.38870407E-09    3      1000022        12       -12             # Z4SS   -->  Z1SS   NUE    ANUE        
      4.38870407E-09    3      1000022        14       -14             # Z4SS   -->  Z1SS   NUM    ANUM        
      4.46979076E-09    3      1000022        16       -16             # Z4SS   -->  Z1SS   NUT    ANUT        
      3.06520942E-09    3      1000023         2        -2             # Z4SS   -->  Z2SS   UP     UB          
      3.48074325E-09    3      1000023         1        -1             # Z4SS   -->  Z2SS   DN     DB          
      3.48074325E-09    3      1000023         3        -3             # Z4SS   -->  Z2SS   ST     SB          
      3.06520676E-09    3      1000023         4        -4             # Z4SS   -->  Z2SS   CH     CB          
      9.06798991E-09    3      1000023         5        -5             # Z4SS   -->  Z2SS   BT     BB          
      9.66596914E-10    3      1000023        11       -11             # Z4SS   -->  Z2SS   E-     E+          
      9.66596914E-10    3      1000023        13       -13             # Z4SS   -->  Z2SS   MU-    MU+         
      1.15860566E-09    3      1000023        15       -15             # Z4SS   -->  Z2SS   TAU-   TAU+        
      1.43010193E-09    3      1000023        12       -12             # Z4SS   -->  Z2SS   NUE    ANUE        
      1.43010193E-09    3      1000023        14       -14             # Z4SS   -->  Z2SS   NUM    ANUM        
      1.45666756E-09    3      1000023        16       -16             # Z4SS   -->  Z2SS   NUT    ANUT        
      6.14994121E-07    3      1000025         2        -2             # Z4SS   -->  Z3SS   UP     UB          
      7.93155493E-07    3      1000025         1        -1             # Z4SS   -->  Z3SS   DN     DB          
      7.93155493E-07    3      1000025         3        -3             # Z4SS   -->  Z3SS   ST     SB          
      6.14994121E-07    3      1000025         4        -4             # Z4SS   -->  Z3SS   CH     CB          
      5.18887987E-07    3      1000025         5        -5             # Z4SS   -->  Z3SS   BT     BB          
      1.79920818E-07    3      1000025        11       -11             # Z4SS   -->  Z3SS   E-     E+          
      1.79920818E-07    3      1000025        13       -13             # Z4SS   -->  Z3SS   MU-    MU+         
      1.68046000E-07    3      1000025        15       -15             # Z4SS   -->  Z3SS   TAU-   TAU+        
      3.57931356E-07    3      1000025        12       -12             # Z4SS   -->  Z3SS   NUE    ANUE        
      3.57931356E-07    3      1000025        14       -14             # Z4SS   -->  Z3SS   NUM    ANUM        
      3.57931015E-07    3      1000025        16       -16             # Z4SS   -->  Z3SS   NUT    ANUT        
      9.98870879E-02    2      1000022        25                       # Z4SS   -->  Z1SS   HL0                
      1.44552827E-01    2      1000023        25                       # Z4SS   -->  Z2SS   HL0                
#         PDG         Width
DECAY   1000024  1.65486820E-02   # W1SS+ decays
#          BR          NDA       ID1       ID2       ID3       ID4
      2.27239862E-08    3      1000022         2        -1             # W1SS+  -->  Z1SS   UP     DB          
      2.27239809E-08    3      1000022         4        -3             # W1SS+  -->  Z1SS   CH     SB          
      7.57785443E-08    3      1000022       -11        12             # W1SS+  -->  Z1SS   E+     NUE         
      7.57785443E-08    3      1000022       -13        14             # W1SS+  -->  Z1SS   MU+    NUM         
      7.94518300E-08    3      1000022       -15        16             # W1SS+  -->  Z1SS   TAU+   NUT         
      9.99999762E-01    2      1000022        24                       # W1SS+  -->  Z1SS   W+                 
      3.93430205E-10    3      1000023         2        -1             # W1SS+  -->  Z2SS   UP     DB          
      1.31149439E-10    3      1000023       -11        12             # W1SS+  -->  Z2SS   E+     NUE         
      1.31149439E-10    3      1000023       -13        14             # W1SS+  -->  Z2SS   MU+    NUM         
#         PDG         Width
DECAY   1000037  1.50192499E+00   # W2SS+ decays
#          BR          NDA       ID1       ID2       ID3       ID4
      2.18905205E-09    3      1000022         2        -1             # W2SS+  -->  Z1SS   UP     DB          
      2.18905138E-09    3      1000022         4        -3             # W2SS+  -->  Z1SS   CH     SB          
      6.17420204E-09    3      1000022       -11        12             # W2SS+  -->  Z1SS   E+     NUE         
      6.17420204E-09    3      1000022       -13        14             # W2SS+  -->  Z1SS   MU+    NUM         
      8.94019170E-09    3      1000022       -15        16             # W2SS+  -->  Z1SS   TAU+   NUT         
      1.15917906E-01    2      1000022        24                       # W2SS+  -->  Z1SS   W+                 
      2.69281730E-09    3      1000023         2        -1             # W2SS+  -->  Z2SS   UP     DB          
      2.69281641E-09    3      1000023         4        -3             # W2SS+  -->  Z2SS   CH     SB          
      1.09228782E-09    3      1000023       -11        12             # W2SS+  -->  Z2SS   E+     NUE         
      1.09228782E-09    3      1000023       -13        14             # W2SS+  -->  Z2SS   MU+    NUM         
      1.51418211E-09    3      1000023       -15        16             # W2SS+  -->  Z2SS   TAU+   NUT         
      3.60636204E-01    2      1000023        24                       # W2SS+  -->  Z2SS   W+                 
      1.86937598E-06    3      1000025         2        -1             # W2SS+  -->  Z3SS   UP     DB          
      1.86937598E-06    3      1000025         4        -3             # W2SS+  -->  Z3SS   CH     SB          
      6.23105677E-07    3      1000025       -11        12             # W2SS+  -->  Z3SS   E+     NUE         
      6.23105677E-07    3      1000025       -13        14             # W2SS+  -->  Z3SS   MU+    NUM         
      6.23123242E-07    3      1000025       -15        16             # W2SS+  -->  Z3SS   TAU+   NUT         
      3.13665330E-01    2      1000024        23                       # W2SS+  -->  W1SS+  Z0                 
      3.47437568E-09    3      1000024         1        -1             # W2SS+  -->  W1SS+  DN     DB          
      3.47437301E-09    3      1000024         3        -3             # W2SS+  -->  W1SS+  ST     SB          
      6.11123063E-09    3      1000024         2        -2             # W2SS+  -->  W1SS+  UP     UB          
      6.11123063E-09    3      1000024         4        -4             # W2SS+  -->  W1SS+  CH     CB          
      2.25391905E-09    3      1000024        12       -12             # W2SS+  -->  W1SS+  NUE    ANUE        
      2.25391905E-09    3      1000024        14       -14             # W2SS+  -->  W1SS+  NUM    ANUM        
      2.35701081E-09    3      1000024        16       -16             # W2SS+  -->  W1SS+  NUT    ANUT        
      1.27982791E-09    3      1000024        11       -11             # W2SS+  -->  W1SS+  E-     E+          
      1.27982791E-09    3      1000024        13       -13             # W2SS+  -->  W1SS+  MU-    MU+         
      1.30360645E-09    3      1000024        15       -15             # W2SS+  -->  W1SS+  TAU-   TAU+        
      2.09774882E-01    2      1000024        25                       # W2SS+  -->  W1SS+  HL0                
#         PDG         Width
DECAY        25  4.12393222E-03   # HL0   decays
#          BR          NDA       ID1       ID2       ID3       ID4
      4.80535123E-09    2           11       -11                       # HL0    -->  E-     E+                 
      2.02889598E-04    2           13       -13                       # HL0    -->  MU-    MU+                
      5.80289066E-02    2           15       -15                       # HL0    -->  TAU-   TAU+               
      6.03058470E-06    2            1        -1                       # HL0    -->  DN     DB                 
      2.43665837E-03    2            3        -3                       # HL0    -->  ST     SB                 
      7.97993600E-01    2            5        -5                       # HL0    -->  BT     BB                 
      1.91617141E-06    2            2        -2                       # HL0    -->  UP     UB                 
      3.60330194E-02    2            4        -4                       # HL0    -->  CH     CB                 
      1.87680579E-03    2           22        22                       # HL0    -->  GM     GM                 
      3.94452624E-02    2           21        21                       # HL0    -->  GL     GL                 
      3.29841767E-03    3           24        11       -12             # HL0    -->  W+     E-     ANUE        
      3.29841767E-03    3           24        13       -14             # HL0    -->  W+     MU-    ANUM        
      3.29841767E-03    3           24        15       -16             # HL0    -->  W+     TAU-   ANUT        
      9.89525300E-03    3           24        -2         1             # HL0    -->  W+     UB     DN          
      9.89525300E-03    3           24        -4         3             # HL0    -->  W+     CB     ST          
      3.29841767E-03    3          -24       -11        12             # HL0    -->  W-     E+     NUE         
      3.29841767E-03    3          -24       -13        14             # HL0    -->  W-     MU+    NUM         
      3.29841767E-03    3          -24       -15        16             # HL0    -->  W-     TAU+   NUT         
      9.89525300E-03    3          -24         2        -1             # HL0    -->  W-     UP     DB          
      9.89525300E-03    3          -24         4        -3             # HL0    -->  W-     CH     SB          
      3.14835139E-04    3           23        12       -12             # HL0    -->  Z0     NUE    ANUE        
      3.14835139E-04    3           23        14       -14             # HL0    -->  Z0     NUM    ANUM        
      3.14835139E-04    3           23        16       -16             # HL0    -->  Z0     NUT    ANUT        
      1.58453375E-04    3           23        11       -11             # HL0    -->  Z0     E-     E+          
      1.58453375E-04    3           23        13       -13             # HL0    -->  Z0     MU-    MU+         
      1.58453375E-04    3           23        15       -15             # HL0    -->  Z0     TAU-   TAU+        
      5.42847789E-04    3           23         2        -2             # HL0    -->  Z0     UP     UB          
      5.42847789E-04    3           23         4        -4             # HL0    -->  Z0     CH     CB          
      6.99321739E-04    3           23         1        -1             # HL0    -->  Z0     DN     DB          
      6.99321739E-04    3           23         3        -3             # HL0    -->  Z0     ST     SB          
      6.99321739E-04    3           23         5        -5             # HL0    -->  Z0     BT     BB          
#         PDG         Width
DECAY        35  3.64148903E+01   # HH0   decays
#          BR          NDA       ID1       ID2       ID3       ID4
      1.15520959E-09    2           11       -11                       # HH0    -->  E-     E+                 
      4.87750294E-05    2           13       -13                       # HH0    -->  MU-    MU+                
      1.39698731E-02    2           15       -15                       # HH0    -->  TAU-   TAU+               
      1.40547797E-06    2            1        -1                       # HH0    -->  DN     DB                 
      5.67884184E-04    2            3        -3                       # HH0    -->  ST     SB                 
      7.48385713E-02    2            5        -5                       # HH0    -->  BT     BB                 
      4.52857023E-11    2            2        -2                       # HH0    -->  UP     UB                 
      5.76187119E-07    2            4        -4                       # HH0    -->  CH     CB                 
      2.97343656E-02    2            6        -6                       # HH0    -->  TP     TB                 
      1.31890374E-07    2           22        22                       # HH0    -->  GM     GM                 
      7.34214927E-06    2           21        21                       # HH0    -->  GL     GL                 
      1.61330463E-05    2           24       -24                       # HH0    -->  W+     W-                 
      8.26595533E-06    2           23        23                       # HH0    -->  Z0     Z0                 
      3.22215958E-03    2      1000022   1000022                       # HH0    -->  Z1SS   Z1SS               
      2.18684003E-02    2      1000022   1000023                       # HH0    -->  Z1SS   Z2SS               
      5.20899110E-02    2      1000022   1000025                       # HH0    -->  Z1SS   Z3SS               
      1.88526232E-02    2      1000022   1000035                       # HH0    -->  Z1SS   Z4SS               
      3.38559374E-02    2      1000023   1000023                       # HH0    -->  Z2SS   Z2SS               
      1.10335395E-01    2      1000023   1000025                       # HH0    -->  Z2SS   Z3SS               
      3.13369334E-02    2      1000023   1000035                       # HH0    -->  Z2SS   Z4SS               
      2.76110251E-03    2      1000025   1000025                       # HH0    -->  Z3SS   Z3SS               
      4.32693549E-02    2      1000025   1000035                       # HH0    -->  Z3SS   Z4SS               
      3.00425701E-02    2      1000035   1000035                       # HH0    -->  Z4SS   Z4SS               
      8.10083151E-02    2      1000024  -1000024                       # HH0    -->  W1SS+  W1SS-              
      2.70957146E-02    2      1000037  -1000037                       # HH0    -->  W2SS+  W2SS-              
      2.12505117E-01    2      1000024  -1000037                       # HH0    -->  W1SS+  W2SS-              
      2.12505117E-01    2     -1000024   1000037                       # HH0    -->  W1SS-  W2SS+              
      5.80381457E-05    2           25        25                       # HH0    -->  HL0    HL0                
#         PDG         Width
DECAY        36  3.61540642E+01   # HA0   decays
#          BR          NDA       ID1       ID2       ID3       ID4
      1.15598386E-09    2           11       -11                       # HA0    -->  E-     E+                 
      4.88077276E-05    2           13       -13                       # HA0    -->  MU-    MU+                
      1.39792655E-02    2           15       -15                       # HA0    -->  TAU-   TAU+               
      1.40648478E-06    2            1        -1                       # HA0    -->  DN     DB                 
      5.68290998E-04    2            3        -3                       # HA0    -->  ST     SB                 
      7.48926774E-02    2            5        -5                       # HA0    -->  BT     BB                 
      4.50030117E-11    2            2        -2                       # HA0    -->  UP     UB                 
      5.72997919E-07    2            4        -4                       # HA0    -->  CH     CB                 
      3.00129019E-02    2            6        -6                       # HA0    -->  TP     TB                 
      3.89328335E-07    2           22        22                       # HA0    -->  GM     GM                 
      1.19780771E-05    2           21        21                       # HA0    -->  GL     GL                 
      3.88421724E-03    2      1000022   1000022                       # HA0    -->  Z1SS   Z1SS               
      2.85658333E-02    2      1000022   1000023                       # HA0    -->  Z1SS   Z2SS               
      3.27080674E-02    2      1000022   1000025                       # HA0    -->  Z1SS   Z3SS               
      3.15960944E-02    2      1000022   1000035                       # HA0    -->  Z1SS   Z4SS               
      4.71768901E-02    2      1000023   1000023                       # HA0    -->  Z2SS   Z2SS               
      6.58710673E-02    2      1000023   1000025                       # HA0    -->  Z2SS   Z3SS               
      5.42417020E-02    2      1000023   1000035                       # HA0    -->  Z2SS   Z4SS               
      2.04741256E-03    2      1000025   1000025                       # HA0    -->  Z3SS   Z3SS               
      2.93034874E-02    2      1000025   1000035                       # HA0    -->  Z3SS   Z4SS               
      5.21033145E-02    2      1000035   1000035                       # HA0    -->  Z4SS   Z4SS               
      1.10919312E-01    2      1000024  -1000024                       # HA0    -->  W1SS+  W1SS-              
      5.58636598E-02    2      1000037  -1000037                       # HA0    -->  W2SS+  W2SS-              
      1.83093309E-01    2      1000024  -1000037                       # HA0    -->  W1SS+  W2SS-              
      1.83093309E-01    2     -1000024   1000037                       # HA0    -->  W1SS-  W2SS+              
      1.60695872E-05    2           25        23                       # HA0    -->  HL0    Z0                 
#         PDG         Width
DECAY        37  3.60823212E+01   # H+    decays
#          BR          NDA       ID1       ID2       ID3       ID4
      1.16659660E-09    2           12       -11                       # H+     -->  NUE    E+                 
      4.92558174E-05    2           14       -13                       # H+     -->  NUM    MU+                
      1.41076064E-02    2           16       -15                       # H+     -->  NUT    TAU+               
      1.31366460E-06    2            2        -1                       # H+     -->  UP     DB                 
      5.31304395E-04    2            4        -3                       # H+     -->  CH     SB                 
      9.70990360E-02    2            6        -5                       # H+     -->  TP     BB                 
      4.34033945E-02    2      1000024   1000022                       # H+     -->  W1SS+  Z1SS               
      2.21442417E-04    2      1000024   1000023                       # H+     -->  W1SS+  Z2SS               
      2.21630067E-01    2      1000024   1000025                       # H+     -->  W1SS+  Z3SS               
      2.38327220E-01    2      1000024   1000035                       # H+     -->  W1SS+  Z4SS               
      3.63927148E-02    2      1000037   1000022                       # H+     -->  W2SS+  Z1SS               
      3.04718256E-01    2      1000037   1000023                       # H+     -->  W2SS+  Z2SS               
      4.12080288E-02    2      1000037   1000025                       # H+     -->  W2SS+  Z3SS               
      2.29409779E-03    2      1000037   1000035                       # H+     -->  W2SS+  Z4SS               
      1.62537090E-05    2           25        24                       # H+     -->  HL0    W+                 
