#  ISAJET SUSY parameters in SUSY Les Houches Accord 2 format
#  Created by ISALHA 2.0 Last revision: C. Balazs 21 Apr 2009
Block SPINFO   # Program information
     1   ISASUGRA from ISAJET          # Spectrum Calculator
     2   7.80   29-OCT-2009 12:50:36   # Version number
Block MODSEL   # Model selection
     1     1   # Minimal supergravity (mSUGRA) model               
Block SMINPUTS   # Standard Model inputs
     1     1.27832382E+02   # alpha_em^(-1)
     2     1.16570000E-05   # G_Fermi
     3     1.17200002E-01   # alpha_s(M_Z)
     4     9.11699982E+01   # m_{Z}(pole)
     5     4.19999981E+00   # m_{b}(m_{b})
     6     1.72500000E+02   # m_{top}(pole)
     7     1.77699995E+00   # m_{tau}(pole)
Block MINPAR   # SUSY breaking input parameters
     1     1.80000000E+02   # m_0
     2     3.00000000E+02   # m_{1/2}
     3     1.00000000E+01   # tan(beta)
     4     1.00000000E+00   # sign(mu)
     5     0.00000000E+00   # A_0
Block EXTPAR   # Non-universal SUSY breaking parameters
     0     2.12631590E+16   # Input scale
Block MASS   # Scalar and gaugino mass spectrum
#  PDG code   mass                 particle
        24     8.04229965E+01   #  W^+
        25     1.10755150E+02   #  h^0            
        35     4.72782104E+02   #  H^0            
        36     4.69412201E+02   #  A^0            
        37     4.80098724E+02   #  H^+            
   1000001     6.86597473E+02   #  dnl            
   1000002     6.81643555E+02   #  upl            
   1000003     6.86597473E+02   #  stl            
   1000004     6.81645020E+02   #  chl            
   1000005     6.26401428E+02   #  b1             
   1000006     4.98886627E+02   #  t1             
   1000011     2.75574371E+02   #  el-            
   1000012     2.62537231E+02   #  nuel           
   1000013     2.75574432E+02   #  mul-           
   1000014     2.62537231E+02   #  numl           
   1000015     2.09891678E+02   #  tau1           
   1000016     2.60466278E+02   #  nutl           
   1000021     7.22842407E+02   #  glss           
   1000022     1.18794952E+02   #  z1ss           
   1000023     2.20319275E+02   #  z2ss           
   1000024     2.20440872E+02   #  w1ss           
   1000025    -3.98185883E+02   #  z3ss           
   1000035     4.18529297E+02   #  z4ss           
   1000037     4.17697876E+02   #  w2ss           
   2000001     6.60793884E+02   #  dnr            
   2000002     6.61861206E+02   #  upr            
   2000003     6.60793884E+02   #  str            
   2000004     6.61862671E+02   #  chr            
   2000005     6.58585388E+02   #  b2             
   2000006     6.81514282E+02   #  t2             
   2000011     2.15421967E+02   #  er-            
   2000013     2.15421997E+02   #  mur-           
   2000015     2.76741150E+02   #  tau2           
Block ALPHA   # Effective Higgs mixing parameter
         -1.07665189E-01   # alpha
Block STOPMIX   # stop mixing matrix
  1  1     5.01791954E-01   # O_{11}
  1  2     8.64988327E-01   # O_{12}
  2  1    -8.64988327E-01   # O_{21}
  2  2     5.01791954E-01   # O_{22}
Block SBOTMIX   # sbottom mixing matrix
  1  1     9.53937352E-01   # O_{11}
  1  2     3.00005823E-01   # O_{12}
  2  1    -3.00005823E-01   # O_{21}
  2  2     9.53937352E-01   # O_{22}
Block STAUMIX   # stau mixing matrix
  1  1     2.25842774E-01   # O_{11}
  1  2     9.74163771E-01   # O_{12}
  2  1    -9.74163771E-01   # O_{21}
  2  2     2.25842774E-01   # O_{22}
Block NMIX   # neutralino mixing matrix
  1  1     9.88938391E-01   #
  1  2    -4.31077518E-02   #
  1  3     1.32319123E-01   #
  1  4    -5.13259582E-02   #
  2  1    -8.62482116E-02   #
  2  2    -9.43385839E-01   #
  2  3     2.71125734E-01   #
  2  4    -1.70515135E-01   #
  3  1    -5.32760285E-02   #
  3  2     7.74189234E-02   #
  3  3     6.98557496E-01   #
  3  4     7.09355772E-01   #
  4  1    -1.08276859E-01   #
  4  2     3.19642544E-01   #
  4  3     6.48845315E-01   #
  4  4    -6.81985736E-01   #
Block UMIX   # chargino U mixing matrix
  1  1    -9.19582367E-01   # U_{11}
  1  2     3.92897308E-01   # U_{12}
  2  1    -3.92897308E-01   # U_{21}
  2  2    -9.19582367E-01   # U_{22}
Block VMIX   # chargino V mixing matrix
  1  1    -9.68637407E-01   # V_{11}
  1  2     2.48478487E-01   # V_{12}
  2  1    -2.48478487E-01   # V_{21}
  2  2    -9.68637407E-01   # V_{22}
Block GAUGE Q=  5.53893005E+02   #
     1     3.57525319E-01   # g`
     2     6.52419388E-01   # g_2
     3     1.21937680E+00   # g_3
Block YU Q=  5.53893005E+02   #
  3  3     8.75370324E-01   # y_t
Block YD Q=  5.53893005E+02   #
  3  3     1.35907441E-01   # y_b
Block YE Q=  5.53893005E+02   #
  3  3     1.02023654E-01   # y_tau
Block HMIX Q=  5.53893005E+02   # Higgs mixing parameters
     1     3.92436859E+02   # mu(Q)
     2     1.00000000E+01   # tan(beta)(M_GUT)
     3     2.50334564E+02   # Higgs vev at Q
     4     2.20347812E+05   # m_A^2(Q)
Block MSOFT Q=  5.53893005E+02   # DRbar SUSY breaking parameters
     1     1.23053917E+02   # M_1(Q)          
     2     2.31145386E+02   # M_2(Q)          
     3     6.85489014E+02   # M_3(Q)          
    31     2.70062714E+02   # MeL(Q)          
    32     2.70062714E+02   # MmuL(Q)         
    33     2.68074402E+02   # MtauL(Q)        
    34     2.11095352E+02   # MeR(Q)          
    35     2.11095352E+02   # MmuR(Q)         
    36     2.08439087E+02   # MtauR(Q)        
    41     6.49750122E+02   # MqL1(Q)         
    42     6.49750122E+02   # MqL2(Q)         
    43     5.98733337E+02   # MqL3(Q)         
    44     6.29437500E+02   # MuR(Q)          
    45     6.29437500E+02   # McR(Q)          
    46     5.12410828E+02   # MtR(Q)          
    47     6.26903870E+02   # MdR(Q)          
    48     6.26903870E+02   # MsR(Q)          
    49     6.27072632E+02   # MbR(Q)          
Block AU Q=  5.53893005E+02   #
  1  1    -5.54522156E+02   # A_u
  2  2    -5.54522156E+02   # A_c
  3  3    -5.54522156E+02   # A_t
Block AD Q=  5.53893005E+02   #
  1  1    -8.25568604E+02   # A_d
  2  2    -8.25568604E+02   # A_s
  3  3    -8.25568604E+02   # A_b
Block AE Q=  5.53893005E+02   #
  1  1    -1.82421249E+02   # A_e
  2  2    -1.82421249E+02   # A_mu
  3  3    -1.82421249E+02   # A_tau
#  ISAJET decay tables in SUSY Les Houches accord format
#  Created by ISALHD. Last revision: C. Balazs, 2005 May 25
Block DCINFO                           # Program information
     1   ISASUGRA from ISAJET          # Spectrum Calculator
     2   7.80   29-OCT-2009 12:50:36   # Version number
#         PDG         Width
DECAY         6  1.14680779E+00   # TP    decays
#          BR          NDA       ID1       ID2       ID3       ID4
      3.33333343E-01    3            2        -1         5             # TP     -->  UP     DB     BT          
      3.33333343E-01    3            4        -3         5             # TP     -->  CH     SB     BT          
      1.11111112E-01    3          -11        12         5             # TP     -->  E+     NUE    BT          
      1.11111112E-01    3          -13        14         5             # TP     -->  MU+    NUM    BT          
      1.11111112E-01    3          -15        16         5             # TP     -->  TAU+   NUT    BT          
#         PDG         Width
DECAY   1000021  5.08350706E+00   # GLSS  decays
#          BR          NDA       ID1       ID2       ID3       ID4
      3.27637186E-04    3      1000024         5        -6             # GLSS   -->  W1SS+  BT     TB          
      3.27637186E-04    3     -1000024         6        -5             # GLSS   -->  W1SS-  TP     BB          
      5.20680187E-05    3      1000037         5        -6             # GLSS   -->  W2SS+  BT     TB          
      5.20680187E-05    3     -1000037         6        -5             # GLSS   -->  W2SS-  TP     BB          
      5.22191669E-07    2      1000022        21                       # GLSS   -->  Z1SS   GL                 
      4.68281942E-05    3      1000022         6        -6             # GLSS   -->  Z1SS   TP     TB          
      8.76015918E-07    2      1000023        21                       # GLSS   -->  Z2SS   GL                 
      1.22168145E-04    3      1000023         6        -6             # GLSS   -->  Z2SS   TP     TB          
      3.85018793E-05    2      1000025        21                       # GLSS   -->  Z3SS   GL                 
      2.70378077E-05    2      1000035        21                       # GLSS   -->  Z4SS   GL                 
      2.07697414E-02    2     -1000002         2                       # GLSS   -->  UBL    UP                 
      2.07697414E-02    2      1000002        -2                       # GLSS   -->  UPL    UB                 
      1.61887612E-02    2     -1000001         1                       # GLSS   -->  DBL    DN                 
      1.61887612E-02    2      1000001        -1                       # GLSS   -->  DNL    DB                 
      4.42315228E-02    2     -2000002         2                       # GLSS   -->  UBR    UP                 
      4.42315228E-02    2      2000002        -2                       # GLSS   -->  UPR    UB                 
      4.57227975E-02    2     -2000001         1                       # GLSS   -->  DBR    DN                 
      4.57227975E-02    2      2000001        -1                       # GLSS   -->  DNR    DB                 
      1.61885396E-02    2     -1000003         3                       # GLSS   -->  SBL    ST                 
      1.61885396E-02    2      1000003        -3                       # GLSS   -->  STL    SB                 
      4.57226001E-02    2     -2000003         3                       # GLSS   -->  SBR    ST                 
      4.57226001E-02    2      2000003        -3                       # GLSS   -->  STR    SB                 
      2.07577907E-02    2     -1000004         4                       # GLSS   -->  CBL    CH                 
      2.07577907E-02    2      1000004        -4                       # GLSS   -->  CHL    CB                 
      4.42195423E-02    2     -2000004         4                       # GLSS   -->  CBR    CH                 
      4.42195423E-02    2      2000004        -4                       # GLSS   -->  CHR    CB                 
      1.01577088E-01    2     -1000005         5                       # GLSS   -->  BB1    BT                 
      1.01577088E-01    2      1000005        -5                       # GLSS   -->  BT1    BB                 
      5.10156378E-02    2     -2000005         5                       # GLSS   -->  BB2    BT                 
      5.10156378E-02    2      2000005        -5                       # GLSS   -->  BT2    BB                 
      9.31082517E-02    2     -1000006         6                       # GLSS   -->  TB1    TP                 
      9.31082517E-02    2      1000006        -6                       # GLSS   -->  TP1    TB                 
#         PDG         Width
DECAY   1000002  6.72936821E+00   # UPL   decays
#          BR          NDA       ID1       ID2       ID3       ID4
      7.64223654E-03    2      1000022         2                       # UPL    -->  Z1SS   UP                 
      3.14602643E-01    2      1000023         2                       # UPL    -->  Z2SS   UP                 
      8.47024086E-04    2      1000025         2                       # UPL    -->  Z3SS   UP                 
      1.48749491E-02    2      1000035         2                       # UPL    -->  Z4SS   UP                 
      6.41499460E-01    2      1000024         1                       # UPL    -->  W1SS+  DN                 
      2.05337200E-02    2      1000037         1                       # UPL    -->  W2SS+  DN                 
#         PDG         Width
DECAY   1000001  6.56517982E+00   # DNL   decays
#          BR          NDA       ID1       ID2       ID3       ID4
      2.08392143E-02    2      1000022         1                       # DNL    -->  Z1SS   DN                 
      3.04783165E-01    2      1000023         1                       # DNL    -->  Z2SS   DN                 
      1.47366477E-03    2      1000025         1                       # DNL    -->  Z3SS   DN                 
      2.00355351E-02    2      1000035         1                       # DNL    -->  Z4SS   DN                 
      5.98942518E-01    2     -1000024         2                       # DNL    -->  W1SS-  UP                 
      5.39259501E-02    2     -1000037         2                       # DNL    -->  W2SS-  UP                 
#         PDG         Width
DECAY   1000003  6.56513500E+00   # STL   decays
#          BR          NDA       ID1       ID2       ID3       ID4
      2.08393577E-02    2      1000022         3                       # STL    -->  Z1SS   ST                 
      3.04785252E-01    2      1000023         3                       # STL    -->  Z2SS   ST                 
      1.47367478E-03    2      1000025         3                       # STL    -->  Z3SS   ST                 
      2.00356711E-02    2      1000035         3                       # STL    -->  Z4SS   ST                 
      5.98940790E-01    2     -1000024         4                       # STL    -->  W1SS-  CH                 
      5.39252684E-02    2     -1000037         4                       # STL    -->  W2SS-  CH                 
#         PDG         Width
DECAY   1000004  6.72936726E+00   # CHL   decays
#          BR          NDA       ID1       ID2       ID3       ID4
      7.64219183E-03    2      1000022         4                       # CHL    -->  Z1SS   CH                 
      3.14600617E-01    2      1000023         4                       # CHL    -->  Z2SS   CH                 
      8.47014715E-04    2      1000025         4                       # CHL    -->  Z3SS   CH                 
      1.48747638E-02    2      1000035         4                       # CHL    -->  Z4SS   CH                 
      6.41501606E-01    2      1000024         3                       # CHL    -->  W1SS+  ST                 
      2.05338784E-02    2      1000037         3                       # CHL    -->  W2SS+  ST                 
#         PDG         Width
DECAY   1000005  7.06928253E+00   # BT1   decays
#          BR          NDA       ID1       ID2       ID3       ID4
      2.50567477E-02    2      1000022         5                       # BT1    -->  Z1SS   BT                 
      2.37853900E-01    2      1000023         5                       # BT1    -->  Z2SS   BT                 
      5.02472930E-03    2      1000025         5                       # BT1    -->  Z3SS   BT                 
      1.17047336E-02    2      1000035         5                       # BT1    -->  Z4SS   BT                 
      3.59564960E-01    2     -1000024         6                       # BT1    -->  W1SS-  TP                 
      2.43202612E-01    2     -1000037         6                       # BT1    -->  W2SS-  TP                 
      1.17592260E-01    2          -24   1000006                       # BT1    -->  W-     TP1                
#         PDG         Width
DECAY   1000006  3.07582164E+00   # TP1   decays
#          BR          NDA       ID1       ID2       ID3       ID4
      2.05359071E-01    2      1000022         6                       # TP1    -->  Z1SS   TP                 
      1.47903413E-01    2      1000023         6                       # TP1    -->  Z2SS   TP                 
      5.27632654E-01    2      1000024         5                       # TP1    -->  W1SS+  BT                 
      1.19104825E-01    2      1000037         5                       # TP1    -->  W2SS+  BT                 
#         PDG         Width
DECAY   2000002  1.38734651E+00   # UPR   decays
#          BR          NDA       ID1       ID2       ID3       ID4
      9.87857282E-01    2      1000022         2                       # UPR    -->  Z1SS   UP                 
      6.34292513E-03    2      1000023         2                       # UPR    -->  Z2SS   UP                 
      1.24618784E-03    2      1000025         2                       # UPR    -->  Z3SS   UP                 
      4.55367053E-03    2      1000035         2                       # UPR    -->  Z4SS   UP                 
#         PDG         Width
DECAY   2000001  3.46193641E-01   # DNR   decays
#          BR          NDA       ID1       ID2       ID3       ID4
      9.87883508E-01    2      1000022         1                       # DNR    -->  Z1SS   DN                 
      6.33934699E-03    2      1000023         1                       # DNR    -->  Z2SS   DN                 
      1.24192121E-03    2      1000025         1                       # DNR    -->  Z3SS   DN                 
      4.53516841E-03    2      1000035         1                       # DNR    -->  Z4SS   DN                 
#         PDG         Width
DECAY   2000003  3.46193641E-01   # STR   decays
#          BR          NDA       ID1       ID2       ID3       ID4
      9.87883508E-01    2      1000022         3                       # STR    -->  Z1SS   ST                 
      6.33934699E-03    2      1000023         3                       # STR    -->  Z2SS   ST                 
      1.24192121E-03    2      1000025         3                       # STR    -->  Z3SS   ST                 
      4.53516841E-03    2      1000035         3                       # STR    -->  Z4SS   ST                 
#         PDG         Width
DECAY   2000004  1.38733757E+00   # CHR   decays
#          BR          NDA       ID1       ID2       ID3       ID4
      9.87857282E-01    2      1000022         4                       # CHR    -->  Z1SS   CH                 
      6.34291954E-03    2      1000023         4                       # CHR    -->  Z2SS   CH                 
      1.24617945E-03    2      1000025         4                       # CHR    -->  Z3SS   CH                 
      4.55363141E-03    2      1000035         4                       # CHR    -->  Z4SS   CH                 
#         PDG         Width
DECAY   2000005  1.36569262E+00   # BT2   decays
#          BR          NDA       ID1       ID2       ID3       ID4
      2.13366747E-01    2      1000022         5                       # BT2    -->  Z1SS   BT                 
      6.90263063E-02    2      1000023         5                       # BT2    -->  Z2SS   BT                 
      4.67499755E-02    2      1000025         5                       # BT2    -->  Z3SS   BT                 
      6.69632107E-02    2      1000035         5                       # BT2    -->  Z4SS   BT                 
      1.06636494E-01    2     -1000024         6                       # BT2    -->  W1SS-  TP                 
      3.44392896E-01    2     -1000037         6                       # BT2    -->  W2SS-  TP                 
      1.52864337E-01    2          -24   1000006                       # BT2    -->  W-     TP1                
#         PDG         Width
DECAY   2000006  1.00089159E+01   # TP2   decays
#          BR          NDA       ID1       ID2       ID3       ID4
      2.09683985E-01    2      1000024         5                       # TP2    -->  W1SS+  BT                 
      1.73026219E-01    2      1000037         5                       # TP2    -->  W2SS+  BT                 
      1.26630574E-01    2           23   1000006                       # TP2    -->  Z0     TP1                
      4.81954515E-02    2           25   1000006                       # TP2    -->  HL0    TP1                
      2.28078105E-02    2      1000022         6                       # TP2    -->  Z1SS   TP                 
      8.96313563E-02    2      1000023         6                       # TP2    -->  Z2SS   TP                 
      8.53055045E-02    2      1000025         6                       # TP2    -->  Z3SS   TP                 
      2.44719118E-01    2      1000035         6                       # TP2    -->  Z4SS   TP                 
#         PDG         Width
DECAY   1000011  5.95214486E-01   # EL-   decays
#          BR          NDA       ID1       ID2       ID3       ID4
      3.23518664E-01    2      1000022        11                       # EL-    -->  Z1SS   E-                 
      2.49061659E-01    2      1000023        11                       # EL-    -->  Z2SS   E-                 
      4.27419692E-01    2     -1000024        12                       # EL-    -->  W1SS-  NUE                
      6.20636986E-10    3      1000015        11       -15             # EL-    -->  TAU1-  E-     TAU+        
      3.24707816E-10    3     -1000015        11        15             # EL-    -->  TAU1+  E-     TAU-        
#         PDG         Width
DECAY   1000013  5.95214725E-01   # MUL-  decays
#          BR          NDA       ID1       ID2       ID3       ID4
      3.23518515E-01    2      1000022        13                       # MUL-   -->  Z1SS   MU-                
      2.49061391E-01    2      1000023        13                       # MUL-   -->  Z2SS   MU-                
      4.27420169E-01    2     -1000024        14                       # MUL-   -->  W1SS-  NUM                
      6.20639429E-10    3      1000015        13       -15             # MUL-   -->  TAU1-  MU-    TAU+        
      3.24709148E-10    3     -1000015        13        15             # MUL-   -->  TAU1+  MU-    TAU-        
#         PDG         Width
DECAY   1000015  4.67305273E-01   # TAU1- decays
#          BR          NDA       ID1       ID2       ID3       ID4
      1.00000000E+00    2      1000022        15                       # TAU1-  -->  Z1SS   TAU-               
#         PDG         Width
DECAY   1000012  4.98574078E-01   # NUEL  decays
#          BR          NDA       ID1       ID2       ID3       ID4
      4.82439071E-01    2      1000022        12                       # NUEL   -->  Z1SS   NUE                
      1.55646339E-01    2      1000023        12                       # NUEL   -->  Z2SS   NUE                
      3.61914545E-01    2      1000024        11                       # NUEL   -->  W1SS+  E-                 
      5.76718062E-10    3      1000015        12       -15             # NUEL   -->  TAU1-  NUE    TAU+        
      2.12750359E-10    3     -1000015        12        15             # NUEL   -->  TAU1+  NUE    TAU-        
      7.08658354E-10    3     -1000015        11        16             # NUEL   -->  TAU1+  E-     NUT         
#         PDG         Width
DECAY   1000014  4.98573363E-01   # NUML  decays
#          BR          NDA       ID1       ID2       ID3       ID4
      4.82439756E-01    2      1000022        14                       # NUML   -->  Z1SS   NUM                
      1.55646563E-01    2      1000023        14                       # NUML   -->  Z2SS   NUM                
      3.61913711E-01    2      1000024        13                       # NUML   -->  W1SS+  MU-                
      5.76718895E-10    3      1000015        14       -15             # NUML   -->  TAU1-  NUM    TAU+        
      2.12750664E-10    3     -1000015        14        15             # NUML   -->  TAU1+  NUM    TAU-        
      7.08762216E-10    3     -1000015        13        16             # NUML   -->  TAU1+  MU-    NUT         
#         PDG         Width
DECAY   1000016  4.73210543E-01   # NUTL  decays
#          BR          NDA       ID1       ID2       ID3       ID4
      5.00150621E-01    2      1000022        16                       # NUTL   -->  Z1SS   NUT                
      1.50560364E-01    2      1000023        16                       # NUTL   -->  Z2SS   NUT                
      3.49200428E-01    2      1000024        15                       # NUTL   -->  W1SS+  TAU-               
      5.25693600E-10    3     -1000015        16        15             # NUTL   -->  TAU1+  NUT    TAU-        
      9.83714290E-06    3      1000015        16       -15             # NUTL   -->  TAU1-  NUT    TAU+        
      9.83696009E-06    3      1000015        12       -11             # NUTL   -->  TAU1-  NUE    E+          
      9.83696009E-06    3      1000015        14       -13             # NUTL   -->  TAU1-  NUM    MU+         
      2.95108784E-05    3      1000015         2        -1             # NUTL   -->  TAU1-  UP     DB          
      2.95108784E-05    3      1000015         4        -3             # NUTL   -->  TAU1-  CH     SB          
#         PDG         Width
DECAY   2000011  5.18944979E-01   # ER-   decays
#          BR          NDA       ID1       ID2       ID3       ID4
      1.00000000E+00    2      1000022        11                       # ER-    -->  Z1SS   E-                 
      1.13990794E-12    3      1000015        11       -15             # ER-    -->  TAU1-  E-     TAU+        
      1.08834252E-12    3     -1000015        11        15             # ER-    -->  TAU1+  E-     TAU-        
      4.55325415E-18    3      1000015        12       -16             # ER-    -->  TAU1-  NUE    ANUT        
#         PDG         Width
DECAY   2000013  5.18944621E-01   # MUR-  decays
#          BR          NDA       ID1       ID2       ID3       ID4
      1.00000000E+00    2      1000022        13                       # MUR-   -->  Z1SS   MU-                
      1.13995369E-12    3      1000015        13       -15             # MUR-   -->  TAU1-  MU-    TAU+        
      1.08838622E-12    3     -1000015        13        15             # MUR-   -->  TAU1+  MU-    TAU-        
      1.94059124E-13    3      1000015        14       -16             # MUR-   -->  TAU1-  NUM    ANUT        
#         PDG         Width
DECAY   2000015  6.08114958E-01   # TAU2- decays
#          BR          NDA       ID1       ID2       ID3       ID4
      3.69204193E-01    2      1000022        15                       # TAU2-  -->  Z1SS   TAU-               
      2.32945189E-01    2      1000023        15                       # TAU2-  -->  Z2SS   TAU-               
      3.97850543E-01    2     -1000024        16                       # TAU2-  -->  W1SS-  NUT                
#         PDG         Width
DECAY   1000023  1.63655693E-03   # Z2SS  decays
#          BR          NDA       ID1       ID2       ID3       ID4
      1.17556456E-05    2      1000022        22                       # Z2SS   -->  Z1SS   GM                 
      5.80933034E-01    2      1000022        23                       # Z2SS   -->  Z1SS   Z0                 
      8.01705301E-06    3      1000022         2        -2             # Z2SS   -->  Z1SS   UP     UB          
      1.69498089E-05    3      1000022         1        -1             # Z2SS   -->  Z1SS   DN     DB          
      1.69498089E-05    3      1000022         3        -3             # Z2SS   -->  Z1SS   ST     SB          
      8.01697843E-06    3      1000022         4        -4             # Z2SS   -->  Z1SS   CH     CB          
      1.50365406E-04    3      1000022         5        -5             # Z2SS   -->  Z1SS   BT     BB          
      3.04314611E-03    3      1000022        11       -11             # Z2SS   -->  Z1SS   E-     E+          
      3.04314215E-03    3      1000022        13       -13             # Z2SS   -->  Z1SS   MU-    MU+         
      2.88632908E-03    3      1000022        15       -15             # Z2SS   -->  Z1SS   TAU-   TAU+        
      4.85381205E-03    3      1000022        12       -12             # Z2SS   -->  Z1SS   NUE    ANUE        
      4.85381205E-03    3      1000022        14       -14             # Z2SS   -->  Z1SS   NUM    ANUM        
      5.15677547E-03    3      1000022        16       -16             # Z2SS   -->  Z1SS   NUT    ANUT        
      4.92211524E-03    2      2000011       -11                       # Z2SS   -->  ER-    E+                 
      4.92211524E-03    2     -2000011        11                       # Z2SS   -->  ER+    E-                 
      4.92095482E-03    2      2000013       -13                       # Z2SS   -->  MUR-   MU+                
      4.92095482E-03    2     -2000013        13                       # Z2SS   -->  MUR+   MU-                
      1.87665865E-01    2      1000015       -15                       # Z2SS   -->  TAU1-  TAU+               
      1.87665865E-01    2     -1000015        15                       # Z2SS   -->  TAU1+  TAU-               
#         PDG         Width
DECAY   1000025  1.92262602E+00   # Z3SS  decays
#          BR          NDA       ID1       ID2       ID3       ID4
      1.69816488E-07    2      1000022        22                       # Z3SS   -->  Z1SS   GM                 
      2.34721583E-07    2      1000023        22                       # Z3SS   -->  Z2SS   GM                 
      2.95204669E-01    2      1000024       -24                       # Z3SS   -->  W1SS+  W-                 
      2.95204669E-01    2     -1000024        24                       # Z3SS   -->  W1SS-  W+                 
      1.19986437E-01    2      1000022        23                       # Z3SS   -->  Z1SS   Z0                 
      2.27577895E-01    2      1000023        23                       # Z3SS   -->  Z2SS   Z0                 
      1.72483752E-08    3      1000022         2        -2             # Z3SS   -->  Z1SS   UP     UB          
      7.26254301E-09    3      1000022         1        -1             # Z3SS   -->  Z1SS   DN     DB          
      7.26254301E-09    3      1000022         3        -3             # Z3SS   -->  Z1SS   ST     SB          
      1.72481780E-08    3      1000022         4        -4             # Z3SS   -->  Z1SS   CH     CB          
      2.38857342E-06    3      1000022         5        -5             # Z3SS   -->  Z1SS   BT     BB          
      2.71830118E-07    3      1000022        15       -15             # Z3SS   -->  Z1SS   TAU-   TAU+        
      1.32609399E-08    3      1000023         2        -2             # Z3SS   -->  Z2SS   UP     UB          
      1.97967349E-08    3      1000023         1        -1             # Z3SS   -->  Z2SS   DN     DB          
      1.97967349E-08    3      1000023         3        -3             # Z3SS   -->  Z2SS   ST     SB          
      1.32607898E-08    3      1000023         4        -4             # Z3SS   -->  Z2SS   CH     CB          
      1.18824880E-06    3      1000023         5        -5             # Z3SS   -->  Z2SS   BT     BB          
      8.80208688E-08    3      1000023        15       -15             # Z3SS   -->  Z2SS   TAU-   TAU+        
      2.09634490E-02    2      1000022        25                       # Z3SS   -->  Z1SS   HL0                
      9.76176560E-03    2      1000023        25                       # Z3SS   -->  Z2SS   HL0                
      2.74199352E-04    2      1000011       -11                       # Z3SS   -->  EL-    E+                 
      2.74199352E-04    2     -1000011        11                       # Z3SS   -->  EL+    E-                 
      2.74199090E-04    2      1000013       -13                       # Z3SS   -->  MUL-   MU+                
      2.74199090E-04    2     -1000013        13                       # Z3SS   -->  MUL+   MU-                
      7.47898768E-04    2      2000011       -11                       # Z3SS   -->  ER-    E+                 
      7.47898768E-04    2     -2000011        11                       # Z3SS   -->  ER+    E-                 
      7.47898477E-04    2      2000013       -13                       # Z3SS   -->  MUR-   MU+                
      7.47898477E-04    2     -2000013        13                       # Z3SS   -->  MUR+   MU-                
      4.73232707E-03    2      1000015       -15                       # Z3SS   -->  TAU1-  TAU+               
      4.73232707E-03    2     -1000015        15                       # Z3SS   -->  TAU1+  TAU-               
      4.07616841E-03    2      2000015       -15                       # Z3SS   -->  TAU2-  TAU+               
      4.07616841E-03    2     -2000015        15                       # Z3SS   -->  TAU2+  TAU-               
      1.58574374E-03    2      1000012       -12                       # Z3SS   -->  NUEL   ANUE               
      1.58574374E-03    2     -1000012        12                       # Z3SS   -->  ANUEL  NUE                
      1.58574374E-03    2      1000014       -14                       # Z3SS   -->  NUML   ANUM               
      1.58574374E-03    2     -1000014        14                       # Z3SS   -->  ANUML  NUM                
      1.62430224E-03    2      1000016       -16                       # Z3SS   -->  NUTL   ANUT               
      1.62430224E-03    2     -1000016        16                       # Z3SS   -->  ANUTL  NUT                
#         PDG         Width
DECAY   1000035  2.58510184E+00   # Z4SS  decays
#          BR          NDA       ID1       ID2       ID3       ID4
      2.38397917E-07    2      1000022        22                       # Z4SS   -->  Z1SS   GM                 
      1.15840448E-09    2      1000023        22                       # Z4SS   -->  Z2SS   GM                 
      3.08678416E-09    2      1000025        22                       # Z4SS   -->  Z3SS   GM                 
      2.74398029E-01    2      1000024       -24                       # Z4SS   -->  W1SS+  W-                 
      2.74398029E-01    2     -1000024        24                       # Z4SS   -->  W1SS-  W+                 
      2.03049500E-02    2      1000022        23                       # Z4SS   -->  Z1SS   Z0                 
      1.53880445E-02    2      1000023        23                       # Z4SS   -->  Z2SS   Z0                 
      2.00911956E-07    3      1000022         2        -2             # Z4SS   -->  Z1SS   UP     UB          
      2.11660165E-07    3      1000022         1        -1             # Z4SS   -->  Z1SS   DN     DB          
      2.11660165E-07    3      1000022         3        -3             # Z4SS   -->  Z1SS   ST     SB          
      2.00909753E-07    3      1000022         4        -4             # Z4SS   -->  Z1SS   CH     CB          
      1.94606696E-06    3      1000022         5        -5             # Z4SS   -->  Z1SS   BT     BB          
      1.96955810E-07    3      1000022        15       -15             # Z4SS   -->  Z1SS   TAU-   TAU+        
      8.56968427E-07    3      1000023         2        -2             # Z4SS   -->  Z2SS   UP     UB          
      9.89199066E-07    3      1000023         1        -1             # Z4SS   -->  Z2SS   DN     DB          
      9.89199066E-07    3      1000023         3        -3             # Z4SS   -->  Z2SS   ST     SB          
      8.56958707E-07    3      1000023         4        -4             # Z4SS   -->  Z2SS   CH     CB          
      2.44461353E-06    3      1000023         5        -5             # Z4SS   -->  Z2SS   BT     BB          
      6.72860523E-08    3      1000023        15       -15             # Z4SS   -->  Z2SS   TAU-   TAU+        
      1.43246112E-07    3      1000025         2        -2             # Z4SS   -->  Z3SS   UP     UB          
      1.85214404E-07    3      1000025         1        -1             # Z4SS   -->  Z3SS   DN     DB          
      1.85214404E-07    3      1000025         3        -3             # Z4SS   -->  Z3SS   ST     SB          
      1.43246112E-07    3      1000025         4        -4             # Z4SS   -->  Z3SS   CH     CB          
      9.37903550E-08    3      1000025         5        -5             # Z4SS   -->  Z3SS   BT     BB          
      4.19526991E-08    3      1000025        11       -11             # Z4SS   -->  Z3SS   E-     E+          
      4.19526991E-08    3      1000025        13       -13             # Z4SS   -->  Z3SS   MU-    MU+         
      3.77842966E-08    3      1000025        15       -15             # Z4SS   -->  Z3SS   TAU-   TAU+        
      8.34726848E-08    3      1000025        12       -12             # Z4SS   -->  Z3SS   NUE    ANUE        
      8.34726848E-08    3      1000025        14       -14             # Z4SS   -->  Z3SS   NUM    ANUM        
      8.34726848E-08    3      1000025        16       -16             # Z4SS   -->  Z3SS   NUT    ANUT        
      7.70323649E-02    2      1000022        25                       # Z4SS   -->  Z1SS   HL0                
      1.60775140E-01    2      1000023        25                       # Z4SS   -->  Z2SS   HL0                
      7.39875901E-03    2      1000011       -11                       # Z4SS   -->  EL-    E+                 
      7.39875901E-03    2     -1000011        11                       # Z4SS   -->  EL+    E-                 
      7.39875389E-03    2      1000013       -13                       # Z4SS   -->  MUL-   MU+                
      7.39875389E-03    2     -1000013        13                       # Z4SS   -->  MUL+   MU-                
      2.60824128E-03    2      2000011       -11                       # Z4SS   -->  ER-    E+                 
      2.60824128E-03    2     -2000011        11                       # Z4SS   -->  ER+    E-                 
      2.60824035E-03    2      2000013       -13                       # Z4SS   -->  MUR-   MU+                
      2.60824035E-03    2     -2000013        13                       # Z4SS   -->  MUR+   MU-                
      2.61815870E-03    2      1000015       -15                       # Z4SS   -->  TAU1-  TAU+               
      2.61815870E-03    2     -1000015        15                       # Z4SS   -->  TAU1+  TAU-               
      1.17866211E-02    2      2000015       -15                       # Z4SS   -->  TAU2-  TAU+               
      1.17866211E-02    2     -2000015        15                       # Z4SS   -->  TAU2+  TAU-               
      1.80194546E-02    2      1000012       -12                       # Z4SS   -->  NUEL   ANUE               
      1.80194546E-02    2     -1000012        12                       # Z4SS   -->  ANUEL  NUE                
      1.80194546E-02    2      1000014       -14                       # Z4SS   -->  NUML   ANUM               
      1.80194546E-02    2     -1000014        14                       # Z4SS   -->  ANUML  NUM                
      1.83887444E-02    2      1000016       -16                       # Z4SS   -->  NUTL   ANUT               
      1.83887444E-02    2     -1000016        16                       # Z4SS   -->  ANUTL  NUT                
#         PDG         Width
DECAY   1000024  6.63673552E-03   # W1SS+ decays
#          BR          NDA       ID1       ID2       ID3       ID4
      5.74955220E-06    3      1000022         2        -1             # W1SS+  -->  Z1SS   UP     DB          
      5.74953310E-06    3      1000022         4        -3             # W1SS+  -->  Z1SS   CH     SB          
      2.01980164E-03    3      1000022       -11        12             # W1SS+  -->  Z1SS   E+     NUE         
      2.01980048E-03    3      1000022       -13        14             # W1SS+  -->  Z1SS   MU+    NUM         
      2.06163549E-03    3      1000022       -15        16             # W1SS+  -->  Z1SS   TAU+   NUT         
      9.05827820E-01    2      1000022        24                       # W1SS+  -->  Z1SS   W+                 
      1.03357019E-14    3      1000023       -11        12             # W1SS+  -->  Z2SS   E+     NUE         
      1.03357019E-14    3      1000023       -13        14             # W1SS+  -->  Z2SS   MU+    NUM         
      8.80594254E-02    2     -1000015        16                       # W1SS+  -->  TAU1+  NUT                
#         PDG         Width
DECAY   1000037  2.43639851E+00   # W2SS+ decays
#          BR          NDA       ID1       ID2       ID3       ID4
      3.03403851E-07    3      1000022         2        -1             # W2SS+  -->  Z1SS   UP     DB          
      3.03403169E-07    3      1000022         4        -3             # W2SS+  -->  Z1SS   CH     SB          
      1.30543199E-07    3      1000022       -15        16             # W2SS+  -->  Z1SS   TAU+   NUT         
      7.71028474E-02    2      1000022        24                       # W2SS+  -->  Z1SS   W+                 
      8.19916011E-07    3      1000023         2        -1             # W2SS+  -->  Z2SS   UP     DB          
      8.19914135E-07    3      1000023         4        -3             # W2SS+  -->  Z2SS   CH     SB          
      1.70292637E-07    3      1000023       -15        16             # W2SS+  -->  Z2SS   TAU+   NUT         
      3.03289741E-01    2      1000023        24                       # W2SS+  -->  Z2SS   W+                 
      4.37727550E-07    3      1000025         2        -1             # W2SS+  -->  Z3SS   UP     DB          
      4.37727550E-07    3      1000025         4        -3             # W2SS+  -->  Z3SS   CH     SB          
      1.45845121E-07    3      1000025       -11        12             # W2SS+  -->  Z3SS   E+     NUE         
      1.45845121E-07    3      1000025       -13        14             # W2SS+  -->  Z3SS   MU+    NUM         
      1.45845419E-07    3      1000025       -15        16             # W2SS+  -->  Z3SS   TAU+   NUT         
      1.63055640E-02    2      1000012       -11                       # W2SS+  -->  NUEL   E+                 
      1.63055584E-02    2      1000014       -13                       # W2SS+  -->  NUML   MU+                
      2.21500844E-02    2      1000016       -15                       # W2SS+  -->  NUTL   TAU+               
      3.55283022E-02    2     -1000011        12                       # W2SS+  -->  EL+    NUE                
      3.55282836E-02    2     -1000013        14                       # W2SS+  -->  MUL+   NUM                
      1.17347611E-03    2     -1000015        16                       # W2SS+  -->  TAU1+  NUT                
      3.92768010E-02    2     -2000015        16                       # W2SS+  -->  TAU2+  NUT                
      2.57568121E-01    2      1000024        23                       # W2SS+  -->  W1SS+  Z0                 
      8.64564413E-07    3      1000024         1        -1             # W2SS+  -->  W1SS+  DN     DB          
      8.64554409E-07    3      1000024         3        -3             # W2SS+  -->  W1SS+  ST     SB          
      1.87562171E-06    3      1000024         2        -2             # W2SS+  -->  W1SS+  UP     UB          
      1.87562171E-06    3      1000024         4        -4             # W2SS+  -->  W1SS+  CH     CB          
      1.95761874E-01    2      1000024        25                       # W2SS+  -->  W1SS+  HL0                
#         PDG         Width
DECAY        25  4.36436897E-03   # HL0   decays
#          BR          NDA       ID1       ID2       ID3       ID4
      5.02954478E-09    2           11       -11                       # HL0    -->  E-     E+                 
      2.12355313E-04    2           13       -13                       # HL0    -->  MU-    MU+                
      6.07282259E-02    2           15       -15                       # HL0    -->  TAU-   TAU+               
      6.31620333E-06    2            1        -1                       # HL0    -->  DN     DB                 
      2.55206204E-03    2            3        -3                       # HL0    -->  ST     SB                 
      8.41082871E-01    2            5        -5                       # HL0    -->  BT     BB                 
      1.73000046E-06    2            2        -2                       # HL0    -->  UP     UB                 
      3.27563621E-02    2            4        -4                       # HL0    -->  CH     CB                 
      1.46164990E-03    2           22        22                       # HL0    -->  GM     GM                 
      3.28362957E-02    2           21        21                       # HL0    -->  GL     GL                 
      1.49379019E-03    3           24        11       -12             # HL0    -->  W+     E-     ANUE        
      1.49379019E-03    3           24        13       -14             # HL0    -->  W+     MU-    ANUM        
      1.49379019E-03    3           24        15       -16             # HL0    -->  W+     TAU-   ANUT        
      4.48137056E-03    3           24        -2         1             # HL0    -->  W+     UB     DN          
      4.48137056E-03    3           24        -4         3             # HL0    -->  W+     CB     ST          
      1.49379019E-03    3          -24       -11        12             # HL0    -->  W-     E+     NUE         
      1.49379019E-03    3          -24       -13        14             # HL0    -->  W-     MU+    NUM         
      1.49379019E-03    3          -24       -15        16             # HL0    -->  W-     TAU+   NUT         
      4.48137056E-03    3          -24         2        -1             # HL0    -->  W-     UP     DB          
      4.48137056E-03    3          -24         4        -3             # HL0    -->  W-     CH     SB          
      1.00831065E-04    3           23        12       -12             # HL0    -->  Z0     NUE    ANUE        
      1.00831065E-04    3           23        14       -14             # HL0    -->  Z0     NUM    ANUM        
      1.00831065E-04    3           23        16       -16             # HL0    -->  Z0     NUT    ANUT        
      5.07472614E-05    3           23        11       -11             # HL0    -->  Z0     E-     E+          
      5.07472614E-05    3           23        13       -13             # HL0    -->  Z0     MU-    MU+         
      5.07472614E-05    3           23        15       -15             # HL0    -->  Z0     TAU-   TAU+        
      1.73855820E-04    3           23         2        -2             # HL0    -->  Z0     UP     UB          
      1.73855820E-04    3           23         4        -4             # HL0    -->  Z0     CH     CB          
      2.23969138E-04    3           23         1        -1             # HL0    -->  Z0     DN     DB          
      2.23969138E-04    3           23         3        -3             # HL0    -->  Z0     ST     SB          
      2.23969138E-04    3           23         5        -5             # HL0    -->  Z0     BT     BB          
#         PDG         Width
DECAY        35  9.67001379E-01   # HH0   decays
#          BR          NDA       ID1       ID2       ID3       ID4
      8.29476843E-09    2           11       -11                       # HH0    -->  E-     E+                 
      3.50219983E-04    2           13       -13                       # HH0    -->  MU-    MU+                
      1.00299902E-01    2           15       -15                       # HH0    -->  TAU-   TAU+               
      1.02301001E-05    2            1        -1                       # HH0    -->  DN     DB                 
      4.13347827E-03    2            3        -3                       # HH0    -->  ST     SB                 
      6.73362017E-01    2            5        -5                       # HH0    -->  BT     BB                 
      3.82385873E-10    2            2        -2                       # HH0    -->  UP     UB                 
      5.90902073E-06    2            4        -4                       # HH0    -->  CH     CB                 
      1.19172290E-01    2            6        -6                       # HH0    -->  TP     TB                 
      2.58752334E-06    2           22        22                       # HH0    -->  GM     GM                 
      2.84272130E-04    2           21        21                       # HH0    -->  GL     GL                 
      1.91223458E-03    2           24       -24                       # HH0    -->  W+     W-                 
      9.34548909E-04    2           23        23                       # HH0    -->  Z0     Z0                 
      1.45416334E-02    2      1000022   1000022                       # HH0    -->  Z1SS   Z1SS               
      4.60780747E-02    2      1000022   1000023                       # HH0    -->  Z1SS   Z2SS               
      9.92866978E-03    2      1000023   1000023                       # HH0    -->  Z2SS   Z2SS               
      2.42619216E-02    2      1000024  -1000024                       # HH0    -->  W1SS+  W1SS-              
      3.23239435E-03    2           25        25                       # HH0    -->  HL0    HL0                
      1.89633298E-04    2      2000011  -2000011                       # HH0    -->  ER-    ER+                
      1.89529295E-04    2      2000013  -2000013                       # HH0    -->  MUR-   MUR+               
      1.11033174E-03    2      1000015  -1000015                       # HH0    -->  TAU1-  TAU1+              
#         PDG         Width
DECAY        36  1.38729656E+00   # HA0   decays
#          BR          NDA       ID1       ID2       ID3       ID4
      5.75013503E-09    2           11       -11                       # HA0    -->  E-     E+                 
      2.42781025E-04    2           13       -13                       # HA0    -->  MU-    MU+                
      6.95342273E-02    2           15       -15                       # HA0    -->  TAU-   TAU+               
      7.09224514E-06    2            1        -1                       # HA0    -->  DN     DB                 
      2.86562624E-03    2            3        -3                       # HA0    -->  ST     SB                 
      4.66927558E-01    2            5        -5                       # HA0    -->  BT     BB                 
      2.26929073E-10    2            2        -2                       # HA0    -->  UP     UB                 
      3.50999539E-06    2            4        -4                       # HA0    -->  CH     CB                 
      1.43412635E-01    2            6        -6                       # HA0    -->  TP     TB                 
      3.95383609E-07    2           22        22                       # HA0    -->  GM     GM                 
      1.43817218E-04    2           21        21                       # HA0    -->  GL     GL                 
      1.58159956E-02    2      1000022   1000022                       # HA0    -->  Z1SS   Z1SS               
      7.74869993E-02    2      1000022   1000023                       # HA0    -->  Z1SS   Z2SS               
      6.48185983E-02    2      1000023   1000023                       # HA0    -->  Z2SS   Z2SS               
      1.57587394E-01    2      1000024  -1000024                       # HA0    -->  W1SS+  W1SS-              
      1.15336734E-03    2           25        23                       # HA0    -->  HL0    Z0                 
#         PDG         Width
DECAY        37  8.78208101E-01   # H+    decays
#          BR          NDA       ID1       ID2       ID3       ID4
      9.29022104E-09    2           12       -11                       # H+     -->  NUE    E+                 
      3.92249873E-04    2           14       -13                       # H+     -->  NUM    MU+                
      1.12343311E-01    2           16       -15                       # H+     -->  NUT    TAU+               
      1.04614001E-05    2            2        -1                       # H+     -->  UP     DB                 
      4.23189253E-03    2            4        -3                       # H+     -->  CH     SB                 
      7.16431379E-01    2            6        -5                       # H+     -->  TP     BB                 
      1.61495417E-01    2      1000024   1000022                       # H+     -->  W1SS+  Z1SS               
      7.39278912E-04    2      1000024   1000023                       # H+     -->  W1SS+  Z2SS               
      2.01153941E-03    2           25        24                       # H+     -->  HL0    W+                 
      2.34452868E-03    2     -1000015   1000016                       # H+     -->  TAU1+  NUTL               
