  65
  401   1214.9050    0.59229E-25
  402   1212.2781    0.58676E-25
  403   1214.8851    0.59230E-25
  404   1212.2588    0.58677E-25
  405   1050.2058    0.56151E-25
  406    938.8854    0.83308E-25
  407   1214.9050    0.59229E-25
  408   1212.2781    0.58676E-25
  409   1214.8851    0.59230E-25
  410   1212.2588    0.58677E-25
  411   1050.2058    0.56151E-25
  412    938.8854    0.83308E-25
  413   1162.1663    0.11003E-23
  414   1166.4897    0.27387E-24
  415   1162.1063    0.11004E-23
  416   1166.4806    0.27388E-24
  417   1110.4933    0.43079E-25
  418   1124.1516    0.33451E-25
  419   1162.1663    0.11003E-23
  420   1166.4897    0.27387E-24
  421   1162.1063    0.11004E-23
  422   1166.4806    0.27388E-24
  423   1110.4933    0.43079E-25
  424   1124.1516    0.33451E-25
  425    395.3234    0.32558E-23
  426    387.1745    0.32548E-23
  427    395.3234    0.32558E-23
  428    387.1745    0.32548E-23
  429     40.8040    0.23408E-11
  430    369.4397    0.16688E-24
  431    395.3234    0.32558E-23
  432    387.1745    0.32548E-23
  433    395.3234    0.32558E-23
  434    387.1745    0.32548E-23
  435     40.8040    0.23408E-11
  436    369.4397    0.16688E-24
  437    223.8035    0.32230E-22
  438      0.0000    0.10000E+31
  439    224.3929    0.14411E-20
  440      0.0000    0.10000E+31
  441    406.7343    0.17709E-24
  442      0.0000    0.10000E+31
  443    223.8035    0.32230E-22
  444      0.0000    0.10000E+31
  445    224.3929    0.14411E-20
  446      0.0000    0.10000E+31
  447    406.7343    0.17709E-24
  448      0.0000    0.10000E+31
  449   1328.3500    0.28810E-25
  450    244.0042    0.58284E-24
  451    458.0675    0.47979E-24
  452   -705.1143    0.12415E-24
  453    717.3398    0.11409E-24
  454    458.1786    0.48107E-24
  455    717.7548    0.11676E-24
  456    458.1786    0.48107E-24
  457    717.7548    0.11676E-24
  203    118.8413    0.25418E-24
  204    460.6427    0.15392E-25
  205    460.9750    0.15355E-25
  206    471.4597    0.18711E-25
  207    471.4597    0.18711E-25
  458      0.0000    0.10000E+31
    6    173.3000    0.56017E-24
   12    173.3000    0.56017E-24
   6
   401  0.15755618E-01     0   450     1     0     0     0
   401  0.31682232E+00     0   451     1     0     0     0
   401  0.56706893E-03     0   452     1     0     0     0
   401  0.11324731E-01     0   453     1     0     0     0
   401  0.62614858E+00     0   456     2     0     0     0
   401  0.29381696E-01     0   457     2     0     0     0
   6
   402  0.12457056E-01     0   450     2     0     0     0
   402  0.31929246E+00     0   451     2     0     0     0
   402  0.33843017E-03     0   452     2     0     0     0
   402  0.90136072E-02     0   453     2     0     0     0
   402  0.64605421E+00     0   454     1     0     0     0
   402  0.12844182E-01     0   455     1     0     0     0
   6
   403  0.15755797E-01     0   450     3     0     0     0
   403  0.31682333E+00     0   451     3     0     0     0
   403  0.56705804E-03     0   452     3     0     0     0
   403  0.11324493E-01     0   453     3     0     0     0
   403  0.62614840E+00     0   456     4     0     0     0
   403  0.29380914E-01     0   457     4     0     0     0
   6
   404  0.12457141E-01     0   450     4     0     0     0
   404  0.31929192E+00     0   451     4     0     0     0
   404  0.33842147E-03     0   452     4     0     0     0
   404  0.90133557E-02     0   453     4     0     0     0
   404  0.64605522E+00     0   454     3     0     0     0
   404  0.12843898E-01     0   455     3     0     0     0
   7
   405  0.55949133E-01     0   450     5     0     0     0
   405  0.21053283E+00     0   451     5     0     0     0
   405  0.14072341E+00     0   452     5     0     0     0
   405  0.10004792E+00     0   453     5     0     0     0
   405  0.35242715E+00     0   456     6     0     0     0
   405  0.12281285E+00     0   457     6     0     0     0
   405  0.17506676E-01     0   199   406     0     0     0
   6
   406  0.18523400E+00     0   450     6     0     0     0
   406  0.10565826E+00     0   451     6     0     0     0
   406  0.17038555E+00     0   452     6     0     0     0
   406  0.28897505E-01     0   453     6     0     0     0
   406  0.26507202E+00     0   454     5     0     0     0
   406  0.24475265E+00     0   455     5     0     0     0
   6
   407  0.15755618E-01     0   450     7     0     0     0
   407  0.31682232E+00     0   451     7     0     0     0
   407  0.56706893E-03     0   452     7     0     0     0
   407  0.11324731E-01     0   453     7     0     0     0
   407  0.62614858E+00     0   454     8     0     0     0
   407  0.29381696E-01     0   455     8     0     0     0
   6
   408  0.12457056E-01     0   450     8     0     0     0
   408  0.31929246E+00     0   451     8     0     0     0
   408  0.33843017E-03     0   452     8     0     0     0
   408  0.90136072E-02     0   453     8     0     0     0
   408  0.64605421E+00     0   456     7     0     0     0
   408  0.12844182E-01     0   457     7     0     0     0
   6
   409  0.15755797E-01     0   450     9     0     0     0
   409  0.31682333E+00     0   451     9     0     0     0
   409  0.56705804E-03     0   452     9     0     0     0
   409  0.11324493E-01     0   453     9     0     0     0
   409  0.62614840E+00     0   454    10     0     0     0
   409  0.29380914E-01     0   455    10     0     0     0
   6
   410  0.12457141E-01     0   450    10     0     0     0
   410  0.31929192E+00     0   451    10     0     0     0
   410  0.33842147E-03     0   452    10     0     0     0
   410  0.90133557E-02     0   453    10     0     0     0
   410  0.64605522E+00     0   456     9     0     0     0
   410  0.12843898E-01     0   457     9     0     0     0
   7
   411  0.55949133E-01     0   450    11     0     0     0
   411  0.21053283E+00     0   451    11     0     0     0
   411  0.14072341E+00     0   452    11     0     0     0
   411  0.10004792E+00     0   453    11     0     0     0
   411  0.35242715E+00     0   454    12     0     0     0
   411  0.12281285E+00     0   455    12     0     0     0
   411  0.17506676E-01     0   198   412     0     0     0
   6
   412  0.18523400E+00     0   450    12     0     0     0
   412  0.10565826E+00     0   451    12     0     0     0
   412  0.17038555E+00     0   452    12     0     0     0
   412  0.28897505E-01     0   453    12     0     0     0
   412  0.26507202E+00     0   456    11     0     0     0
   412  0.24475265E+00     0   457    11     0     0     0
   4
   413  0.99711877E+00     0   450     1     0     0     0
   413  0.59376564E-03     0   451     1     0     0     0
   413  0.44800964E-03     0   452     1     0     0     0
   413  0.18394825E-02     0   453     1     0     0     0
   4
   414  0.99709851E+00     0   450     2     0     0     0
   414  0.59496472E-03     0   451     2     0     0     0
   414  0.45156275E-03     0   452     2     0     0     0
   414  0.18549704E-02     0   453     2     0     0     0
   4
   415  0.99711907E+00     0   450     3     0     0     0
   415  0.59374905E-03     0   451     3     0     0     0
   415  0.44796022E-03     0   452     3     0     0     0
   415  0.18392669E-02     0   453     3     0     0     0
   4
   416  0.99709857E+00     0   450     4     0     0     0
   416  0.59496181E-03     0   451     4     0     0     0
   416  0.45155367E-03     0   452     4     0     0     0
   416  0.18549305E-02     0   453     4     0     0     0
   7
   417  0.89622019E-02     0   450     5     0     0     0
   417  0.58199793E-01     0   451     5     0     0     0
   417  0.14787279E+00     0   452     5     0     0     0
   417  0.16018897E+00     0   453     5     0     0     0
   417  0.87696984E-01     0   456     6     0     0     0
   417  0.43895075E+00     0   457     6     0     0     0
   417  0.98128542E-01     0   199   406     0     0     0
   8
   418  0.22245893E+00     0   454     5     0     0     0
   418  0.26134714E+00     0   455     5     0     0     0
   418  0.70120014E-01     0   200   406     0     0     0
   418  0.38622152E-01     0   203   406     0     0     0
   418  0.21662576E-01     0   450     6     0     0     0
   418  0.90349920E-01     0   451     6     0     0     0
   418  0.98691218E-01     0   452     6     0     0     0
   418  0.19674806E+00     0   453     6     0     0     0
   4
   419  0.99711877E+00     0   450     7     0     0     0
   419  0.59376564E-03     0   451     7     0     0     0
   419  0.44800964E-03     0   452     7     0     0     0
   419  0.18394825E-02     0   453     7     0     0     0
   4
   420  0.99709851E+00     0   450     8     0     0     0
   420  0.59496472E-03     0   451     8     0     0     0
   420  0.45156275E-03     0   452     8     0     0     0
   420  0.18549704E-02     0   453     8     0     0     0
   4
   421  0.99711907E+00     0   450     9     0     0     0
   421  0.59374905E-03     0   451     9     0     0     0
   421  0.44796022E-03     0   452     9     0     0     0
   421  0.18392669E-02     0   453     9     0     0     0
   4
   422  0.99709857E+00     0   450    10     0     0     0
   422  0.59496181E-03     0   451    10     0     0     0
   422  0.45155367E-03     0   452    10     0     0     0
   422  0.18549305E-02     0   453    10     0     0     0
   7
   423  0.89622019E-02     0   450    11     0     0     0
   423  0.58199793E-01     0   451    11     0     0     0
   423  0.14787279E+00     0   452    11     0     0     0
   423  0.16018897E+00     0   453    11     0     0     0
   423  0.87696984E-01     0   454    12     0     0     0
   423  0.43895075E+00     0   455    12     0     0     0
   423  0.98128542E-01     0   198   412     0     0     0
   8
   424  0.22245893E+00     0   456    11     0     0     0
   424  0.26134714E+00     0   457    11     0     0     0
   424  0.70120014E-01     0   200   412     0     0     0
   424  0.38622152E-01     0   203   412     0     0     0
   424  0.21662576E-01     0   450    12     0     0     0
   424  0.90349920E-01     0   451    12     0     0     0
   424  0.98691218E-01     0   452    12     0     0     0
   424  0.19674806E+00     0   453    12     0     0     0
   4
   425  0.91212004E+00     0   450   121     0     0     0
   425  0.14050171E-03     0   429   121   131     0     0
   425  0.47662645E-03     0   435   121   125     0     0
   425  0.87262824E-01     0   121   130     0     0     0
   5
   426  0.91219509E+00     0   450   122     0     0     0
   426  0.10280970E-03     0   429   122   131     0     0
   426  0.38498189E-03     0   435   122   125     0     0
   426  0.18786116E-02     0   435   121   126     0     0
   426  0.85438482E-01     0   129   121     0     0     0
   4
   427  0.91212004E+00     0   450   123     0     0     0
   427  0.14050180E-03     0   429   123   131     0     0
   427  0.47662668E-03     0   435   123   125     0     0
   427  0.87262832E-01     0   121   128     0     0     0
   5
   428  0.91219485E+00     0   450   124     0     0     0
   428  0.10280967E-03     0   429   124   131     0     0
   428  0.38498180E-03     0   435   124   125     0     0
   428  0.18788426E-02     0   435   123   126     0     0
   428  0.85438468E-01     0   127   121     0     0     0
   3
   429  0.73828578E-01     0   125   130     0     0     0
   429  0.46220967E+00     0   125   124     0     0     0
   429  0.46396175E+00     0   123   126     0     0     0
   3
   430  0.39034307E-01     0   450   126     0     0     0
   430  0.96095014E+00     0   198   429     0     0     0
   430  0.15594316E-04     0   429   126   131     0     0
   4
   431  0.91212004E+00     0   450   127     0     0     0
   431  0.14050171E-03     0   435   127   125     0     0
   431  0.47662645E-03     0   429   127   131     0     0
   431  0.87262824E-01     0   127   124     0     0     0
   5
   432  0.91219509E+00     0   450   128     0     0     0
   432  0.10280970E-03     0   435   128   125     0     0
   432  0.38498189E-03     0   429   128   131     0     0
   432  0.18786116E-02     0   429   127   132     0     0
   432  0.85438482E-01     0   123   127     0     0     0
   4
   433  0.91212004E+00     0   450   129     0     0     0
   433  0.14050180E-03     0   435   129   125     0     0
   433  0.47662668E-03     0   429   129   131     0     0
   433  0.87262832E-01     0   127   122     0     0     0
   5
   434  0.91219485E+00     0   450   130     0     0     0
   434  0.10280967E-03     0   435   130   125     0     0
   434  0.38498180E-03     0   429   130   131     0     0
   434  0.18788426E-02     0   429   129   132     0     0
   434  0.85438468E-01     0   121   127     0     0     0
   3
   435  0.73828578E-01     0   131   124     0     0     0
   435  0.46220967E+00     0   131   130     0     0     0
   435  0.46396175E+00     0   129   132     0     0     0
   3
   436  0.39034307E-01     0   450   132     0     0     0
   436  0.96095014E+00     0   199   435     0     0     0
   436  0.15594316E-04     0   435   132   125     0     0
   4
   437  0.61672963E-02     0   429   121   131     0     0
   437  0.15752025E-01     0   435   121   125     0     0
   437  0.48904023E+00     0   123   122     0     0     0
   437  0.48904040E+00     0   121   124     0     0     0
   0
   3
   439  0.28292903E+00     0   429   123   131     0     0
   439  0.71705317E+00     0   435   123   125     0     0
   439  0.17764158E-04     0   429   124   132     0     0
   0
   3
   441  0.73683850E-01     0   450   125     0     0     0
   441  0.58614141E+00     0   200   429     0     0     0
   441  0.34017470E+00     0   203   429     0     0     0
   0
   4
   443  0.61672963E-02     0   435   127   125     0     0
   443  0.15752025E-01     0   429   127   131     0     0
   443  0.48904023E+00     0   129   128     0     0     0
   443  0.48904040E+00     0   127   130     0     0     0
   0
   3
   445  0.28292903E+00     0   435   129   125     0     0
   445  0.71705317E+00     0   429   129   131     0     0
   445  0.17764158E-04     0   435   130   126     0     0
   0
   3
   447  0.73683850E-01     0   450   131     0     0     0
   447  0.58614141E+00     0   200   435     0     0     0
   447  0.34017470E+00     0   203   435     0     0     0
   0
  24
   449  0.18167384E-01     0   408     2     0     0     0
   449  0.18167384E-01     0   402     8     0     0     0
   449  0.17390260E-01     0   407     1     0     0     0
   449  0.17390260E-01     0   401     7     0     0     0
   449  0.34066036E-01     0   420     2     0     0     0
   449  0.34066036E-01     0   414     8     0     0     0
   449  0.35785902E-01     0   419     1     0     0     0
   449  0.35785902E-01     0   413     7     0     0     0
   449  0.17396068E-01     0   409     3     0     0     0
   449  0.17396068E-01     0   403     9     0     0     0
   449  0.35809968E-01     0   421     3     0     0     0
   449  0.35809968E-01     0   415     9     0     0     0
   449  0.18172039E-01     0   410     4     0     0     0
   449  0.18172039E-01     0   404    10     0     0     0
   449  0.34068614E-01     0   422     4     0     0     0
   449  0.34068614E-01     0   416    10     0     0     0
   449  0.89590497E-01     0   411     5     0     0     0
   449  0.89590497E-01     0   405    11     0     0     0
   449  0.60435440E-01     0   423     5     0     0     0
   449  0.60435440E-01     0   417    11     0     0     0
   449  0.89370057E-01     0   412     6     0     0     0
   449  0.89370057E-01     0   406    12     0     0     0
   449  0.49747702E-01     0   424     6     0     0     0
   449  0.49747702E-01     0   418    12     0     0     0
   6
   450  0.13757667E-01     0   437   127     0     0     0
   450  0.13757667E-01     0   443   121     0     0     0
   450  0.12999075E-01     0   439   129     0     0     0
   450  0.12999075E-01     0   445   123     0     0     0
   450  0.47324327E+00     0   429   131     0     0     0
   450  0.47324327E+00     0   435   125     0     0     0
  20
   451  0.11539288E-02     0   450   200     0     0     0
   451  0.97989123E-02     0   450   203     0     0     0
   451  0.44620778E-01     0   425   127     0     0     0
   451  0.44620778E-01     0   431   121     0     0     0
   451  0.44620674E-01     0   427   129     0     0     0
   451  0.44620674E-01     0   433   123     0     0     0
   451  0.37304664E-03     0   437   127     0     0     0
   451  0.37304664E-03     0   443   121     0     0     0
   451  0.37181383E-03     0   439   129     0     0     0
   451  0.37181383E-03     0   445   123     0     0     0
   451  0.19677708E+00     0   429   131     0     0     0
   451  0.19677708E+00     0   435   125     0     0     0
   451  0.24086934E-01     0   441   131     0     0     0
   451  0.24086934E-01     0   447   125     0     0     0
   451  0.52507937E-01     0   426   128     0     0     0
   451  0.52507937E-01     0   432   122     0     0     0
   451  0.52507937E-01     0   428   130     0     0     0
   451  0.52507937E-01     0   434   124     0     0     0
   451  0.78657448E-01     0   430   132     0     0     0
   451  0.78657448E-01     0   436   126     0     0     0
  26
   452  0.19823159E+00     0   454   199     0     0     0
   452  0.19823159E+00     0   456   198     0     0     0
   452  0.70402317E-01     0   450   200     0     0     0
   452  0.17589147E+00     0   451   200     0     0     0
   452  0.77764460E-04     0   451     5    11     0     0
   452  0.14113623E-01     0   450   203     0     0     0
   452  0.10350444E-02     0   450   205     0     0     0
   452  0.59568733E-02     0   451   203     0     0     0
   452  0.11458925E-03     0   425   127     0     0     0
   452  0.11458925E-03     0   431   121     0     0     0
   452  0.11458920E-03     0   427   129     0     0     0
   452  0.11458920E-03     0   433   123     0     0     0
   452  0.27951287E-03     0   437   127     0     0     0
   452  0.27951287E-03     0   443   121     0     0     0
   452  0.27918268E-03     0   439   129     0     0     0
   452  0.27918268E-03     0   445   123     0     0     0
   452  0.10899204E+00     0   429   131     0     0     0
   452  0.10899204E+00     0   435   125     0     0     0
   452  0.56492757E-01     0   441   131     0     0     0
   452  0.56492757E-01     0   447   125     0     0     0
   452  0.57078019E-03     0   426   128     0     0     0
   452  0.57078019E-03     0   432   122     0     0     0
   452  0.57078019E-03     0   428   130     0     0     0
   452  0.57078019E-03     0   434   124     0     0     0
   452  0.61574043E-03     0   430   132     0     0     0
   452  0.61574043E-03     0   436   126     0     0     0
  27
   453  0.19923808E+00     0   454   199     0     0     0
   453  0.19923808E+00     0   456   198     0     0     0
   453  0.14503279E-01     0   450   200     0     0     0
   453  0.89068543E-02     0   451   200     0     0     0
   453  0.77034339E-04     0   451     5    11     0     0
   453  0.59534434E-01     0   450   203     0     0     0
   453  0.79258243E-02     0   450   204     0     0     0
   453  0.14070072E-03     0   450   205     0     0     0
   453  0.15154080E+00     0   451   203     0     0     0
   453  0.46955319E-02     0   425   127     0     0     0
   453  0.46955319E-02     0   431   121     0     0     0
   453  0.46955305E-02     0   427   129     0     0     0
   453  0.46955305E-02     0   433   123     0     0     0
   453  0.11264855E-02     0   437   127     0     0     0
   453  0.11264855E-02     0   443   121     0     0     0
   453  0.11252046E-02     0   439   129     0     0     0
   453  0.11252046E-02     0   445   123     0     0     0
   453  0.74910469E-01     0   429   131     0     0     0
   453  0.74910469E-01     0   435   125     0     0     0
   453  0.64499944E-01     0   441   131     0     0     0
   453  0.64499944E-01     0   447   125     0     0     0
   453  0.92340680E-02     0   426   128     0     0     0
   453  0.92340680E-02     0   432   122     0     0     0
   453  0.92340680E-02     0   428   130     0     0     0
   453  0.92340680E-02     0   434   124     0     0     0
   453  0.99261217E-02     0   430   132     0     0     0
   453  0.99261217E-02     0   436   126     0     0     0
   8
   454  0.10767940E-01     0   450   198     0     0     0
   454  0.11138011E+00     0   426   127     0     0     0
   454  0.11138000E+00     0   428   129     0     0     0
   454  0.17358106E+00     0   430   131     0     0     0
   454  0.85118771E-01     0   431   122     0     0     0
   454  0.85118674E-01     0   433   124     0     0     0
   454  0.37939188E+00     0   435   126     0     0     0
   454  0.43261655E-01     0   447   126     0     0     0
  12
   455  0.72352760E-01     0   450   198     0     0     0
   455  0.31498016E-02     0   450   206     0     0     0
   455  0.20650661E+00     0   451   198     0     0     0
   455  0.90179425E-02     0   426   127     0     0     0
   455  0.90179425E-02     0   428   129     0     0     0
   455  0.12293700E+00     0   430   131     0     0     0
   455  0.19594925E-01     0   431   122     0     0     0
   455  0.19594921E-01     0   433   124     0     0     0
   455  0.12267061E+00     0   435   126     0     0     0
   455  0.58680270E-01     0   447   126     0     0     0
   455  0.19262917E+00     0   454   200     0     0     0
   455  0.16384807E+00     0   454   203     0     0     0
   8
   456  0.10767940E-01     0   450   199     0     0     0
   456  0.11138011E+00     0   432   121     0     0     0
   456  0.11138000E+00     0   434   123     0     0     0
   456  0.17358106E+00     0   436   125     0     0     0
   456  0.85118771E-01     0   425   128     0     0     0
   456  0.85118674E-01     0   427   130     0     0     0
   456  0.37939188E+00     0   429   132     0     0     0
   456  0.43261655E-01     0   441   132     0     0     0
  12
   457  0.72352760E-01     0   450   199     0     0     0
   457  0.31498016E-02     0   450   207     0     0     0
   457  0.20650661E+00     0   451   199     0     0     0
   457  0.90179425E-02     0   432   121     0     0     0
   457  0.90179425E-02     0   434   123     0     0     0
   457  0.12293700E+00     0   436   125     0     0     0
   457  0.19594925E-01     0   425   128     0     0     0
   457  0.19594921E-01     0   427   130     0     0     0
   457  0.12267061E+00     0   429   132     0     0     0
   457  0.58680270E-01     0   441   132     0     0     0
   457  0.19262917E+00     0   456   200     0     0     0
   457  0.16384807E+00     0   456   203     0     0     0
   9
   203  0.10785657E-03     0   125   131     0     0     0
   203  0.17817508E-02     0     5    11     0     0     0
   203  0.79058671E-04     0     4    10     0     0     0
   203  0.66909182E-04     0    13    13     0     0     0
   203  0.25254983E-04     0   198     8     1     0     0
   203  0.25254983E-04     0   198    10     3     0     0
   203  0.25254983E-04     0   199     2     7     0     0
   203  0.25254983E-04     0   199     4     9     0     0
   203  0.99786353E+00     0   429   435     0     0     0
   9
   204  0.13911826E-03     0   123   129     0     0     0
   204  0.39842058E-01     0   125   131     0     0     0
   204  0.16423531E-02     0     3     9     0     0     0
   204  0.53833318E+00     0     5    11     0     0     0
   204  0.14685604E-03     0     6    12     0     0     0
   204  0.16610727E-04     0    13    13     0     0     0
   204  0.31726712E+00     0   429   435     0     0     0
   204  0.51306348E-01     0   429   447     0     0     0
   204  0.51306348E-01     0   441   435     0     0     0
   9
   205  0.13889010E-03     0   123   129     0     0     0
   205  0.39779074E-01     0   125   131     0     0     0
   205  0.16396480E-02     0     3     9     0     0     0
   205  0.53752458E+00     0     5    11     0     0     0
   205  0.28386040E-03     0     6    12     0     0     0
   205  0.23633198E-04     0    13    13     0     0     0
   205  0.31688443E+00     0   429   435     0     0     0
   205  0.51862929E-01     0   429   447     0     0     0
   205  0.51862929E-01     0   441   435     0     0     0
   5
   206  0.17309671E-03     0   124   129     0     0     0
   206  0.49576148E-01     0   126   131     0     0     0
   206  0.18652311E-02     0     4     9     0     0     0
   206  0.45599708E+00     0     6    11     0     0     0
   206  0.49238849E+00     0   435   430     0     0     0
   5
   207  0.17309671E-03     0   130   123     0     0     0
   207  0.49576148E-01     0   132   125     0     0     0
   207  0.18652311E-02     0    10     3     0     0     0
   207  0.45599708E+00     0    12     5     0     0     0
   207  0.49238849E+00     0   429   436     0     0     0
   0
   5
     6  0.33333334E+00   100     2     7     5     0     0
     6  0.33333334E+00   100     4     9     5     0     0
     6  0.11111111E+00   100   122   127     5     0     0
     6  0.11111111E+00   100   124   129     5     0     0
     6  0.11111111E+00   100   126   131     5     0     0
   5
    12  0.33333334E+00   100     8     1    11     0     0
    12  0.33333334E+00   100    10     3    11     0     0
    12  0.11111111E+00   100   128   121    11     0     0
    12  0.11111111E+00   100   130   123    11     0     0
    12  0.11111111E+00   100   132   125    11     0     0
     42.20410156     -0.02521710
      0.99691892     -0.01017171      0.07297774     -0.02689013
     -0.02753214     -0.97229910      0.19315989     -0.12870876
      0.03196776     -0.04707853     -0.70407712     -0.70783979
     -0.06612370      0.22872442      0.67944044     -0.69402725
     -0.98312175      0.18295255     -0.18295255     -0.98312175
     -0.96159387      0.27447635     -0.27447635     -0.96159387
     -1.10324526     -0.79681993     -1.19058144
   -999.16101074   8349.90039063  -2707.54003906
    701.53900146
    F
  0.00000000E+00  0.00000000E+00  0.00000000E+00  0.47361702E-01  0.13204000E-19  0.00000000E+00  0.00000000E+00  0.00000000E+00  0.76427598E-19 -0.47361702E-01 -0.13204000E-19 -0.00000000E+00  0.00000000E+00  0.00000000E+00  0.00000000E+00  0.00000000E+00  0.00000000E+00  0.43172801E-06 -0.00000000E+00 -0.00000000E+00 -0.76427598E-19 -0.00000000E+00 -0.00000000E+00 -0.43172801E-06  0.00000000E+00  0.00000000E+00  0.00000000E+00
  0.11140200E-21  0.18216880E-43  0.00000000E+00  0.00000000E+00  0.24391200E-20  0.00000000E+00  0.00000000E+00  0.00000000E+00  0.91823103E-19  0.62929301E-09  0.10218701E-30  0.00000000E+00  0.47684101E-32  0.13778200E-07  0.00000000E+00  0.00000000E+00  0.00000000E+00  0.51869398E-06  0.00000000E+00  0.00000000E+00  0.00000000E+00  0.00000000E+00  0.00000000E+00  0.00000000E+00  0.00000000E+00  0.00000000E+00  0.00000000E+00
  0.00000000E+00  0.00000000E+00  0.00000000E+00  0.00000000E+00  0.00000000E+00  0.00000000E+00  0.00000000E+00  0.00000000E+00  0.00000000E+00  0.00000000E+00  0.00000000E+00  0.00000000E+00  0.00000000E+00  0.00000000E+00  0.00000000E+00  0.00000000E+00  0.00000000E+00  0.00000000E+00  0.00000000E+00  0.00000000E+00  0.00000000E+00  0.00000000E+00  0.00000000E+00  0.00000000E+00  0.00000000E+00  0.00000000E+00  0.00000000E+00
