  65
  401   2000.8307    0.26723E-25
  402   1999.3210    0.26624E-25
  403   2000.8307    0.26723E-25
  404   1999.3215    0.26624E-25
  405   1999.2406    0.30417E-25
  406   1829.9374    0.14529E-25
  407   2000.8307    0.26723E-25
  408   1999.3210    0.26624E-25
  409   2000.8307    0.26723E-25
  410   1999.3215    0.26624E-25
  411   1999.2406    0.30417E-25
  412   1829.9374    0.14529E-25
  413   2000.1520    0.58578E-24
  414   1999.6959    0.14648E-24
  415   2000.1520    0.58578E-24
  416   1999.6964    0.14648E-24
  417   2001.7450    0.17873E-25
  418   2164.5774    0.82517E-26
  419   2000.1520    0.58578E-24
  420   1999.6959    0.14648E-24
  421   2000.1520    0.58578E-24
  422   1999.6964    0.14648E-24
  423   2001.7450    0.17873E-25
  424   2164.5774    0.82517E-26
  425   2000.5267    0.24473E-25
  426   1999.0170    0.24430E-25
  427   2000.5267    0.24473E-25
  428   1999.0170    0.24430E-25
  429    152.9162    0.23433E-23
  430   1999.0170    0.24300E-25
  431   2000.5267    0.24473E-25
  432   1999.0170    0.24430E-25
  433   2000.5267    0.24473E-25
  434   1999.0170    0.24430E-25
  435    152.9162    0.23433E-23
  436   1999.0170    0.24300E-25
  437    152.8868    0.23420E-23
  438      0.0000    0.10000E+31
  439    152.8869    0.23420E-23
  440      0.0000    0.10000E+31
  441   2000.5481    0.24343E-25
  442      0.0000    0.10000E+31
  443    152.8868    0.23420E-23
  444      0.0000    0.10000E+31
  445    152.8869    0.23420E-23
  446      0.0000    0.10000E+31
  447   2000.5481    0.24343E-25
  448      0.0000    0.10000E+31
  449   2000.0000    0.26974E-24
  450     94.8564    0.10000E+31
  451    210.8842    0.27584E-22
  452   -305.6614    0.15580E-23
  453    349.9209    0.55456E-24
  454    208.8891    0.21700E-22
  455    349.0001    0.64610E-24
  456    208.8891    0.21700E-22
  457    349.0001    0.64610E-24
  203    119.0437    0.13104E-21
  204    504.3650    0.44249E-24
  205    500.0000    0.25186E-24
  206    509.4123    0.51934E-24
  207    509.4123    0.51934E-24
  458      0.0000    0.10000E+31
    6    172.5000    0.57395E-24
   12    172.5000    0.57395E-24
   6
   401  0.19286804E-01     0   450     1     0     0     0
   401  0.21091668E+00     0   451     1     0     0     0
   401  0.30636759E-02     0   452     1     0     0     0
   401  0.10820995E+00     0   453     1     0     0     0
   401  0.39984530E+00     0   456     2     0     0     0
   401  0.25867757E+00     0   457     2     0     0     0
   6
   402  0.48890784E-02     0   450     2     0     0     0
   402  0.24204098E+00     0   451     2     0     0     0
   402  0.17503665E-02     0   452     2     0     0     0
   402  0.91687784E-01     0   453     2     0     0     0
   402  0.50231463E+00     0   454     1     0     0     0
   402  0.15731719E+00     0   455     1     0     0     0
   6
   403  0.19286819E-01     0   450     3     0     0     0
   403  0.21091683E+00     0   451     3     0     0     0
   403  0.30636780E-02     0   452     3     0     0     0
   403  0.10821003E+00     0   453     3     0     0     0
   403  0.39984521E+00     0   456     4     0     0     0
   403  0.25867748E+00     0   457     4     0     0     0
   6
   404  0.48890747E-02     0   450     4     0     0     0
   404  0.24204083E+00     0   451     4     0     0     0
   404  0.17503655E-02     0   452     4     0     0     0
   404  0.91687731E-01     0   453     4     0     0     0
   404  0.50231481E+00     0   454     3     0     0     0
   404  0.15731725E+00     0   455     3     0     0     0
   7
   405  0.48385713E-01     0   450     5     0     0     0
   405  0.11436328E+00     0   451     5     0     0     0
   405  0.26763736E-02     0   452     5     0     0     0
   405  0.25367361E-01     0   453     5     0     0     0
   405  0.31314167E+00     0   456     6     0     0     0
   405  0.36890343E+00     0   457     6     0     0     0
   405  0.12716213E+00     0   199   406     0     0     0
   6
   406  0.32548640E-01     0   450     6     0     0     0
   406  0.44975989E-01     0   451     6     0     0     0
   406  0.21140286E+00     0   452     6     0     0     0
   406  0.31109148E+00     0   453     6     0     0     0
   406  0.12566358E-01     0   454     5     0     0     0
   406  0.38741466E+00     0   455     5     0     0     0
   6
   407  0.19286804E-01     0   450     7     0     0     0
   407  0.21091668E+00     0   451     7     0     0     0
   407  0.30636759E-02     0   452     7     0     0     0
   407  0.10820995E+00     0   453     7     0     0     0
   407  0.39984530E+00     0   454     8     0     0     0
   407  0.25867757E+00     0   455     8     0     0     0
   6
   408  0.48890784E-02     0   450     8     0     0     0
   408  0.24204098E+00     0   451     8     0     0     0
   408  0.17503665E-02     0   452     8     0     0     0
   408  0.91687784E-01     0   453     8     0     0     0
   408  0.50231463E+00     0   456     7     0     0     0
   408  0.15731719E+00     0   457     7     0     0     0
   6
   409  0.19286819E-01     0   450     9     0     0     0
   409  0.21091683E+00     0   451     9     0     0     0
   409  0.30636780E-02     0   452     9     0     0     0
   409  0.10821003E+00     0   453     9     0     0     0
   409  0.39984521E+00     0   454    10     0     0     0
   409  0.25867748E+00     0   455    10     0     0     0
   6
   410  0.48890747E-02     0   450    10     0     0     0
   410  0.24204083E+00     0   451    10     0     0     0
   410  0.17503655E-02     0   452    10     0     0     0
   410  0.91687731E-01     0   453    10     0     0     0
   410  0.50231481E+00     0   456     9     0     0     0
   410  0.15731725E+00     0   457     9     0     0     0
   7
   411  0.48385713E-01     0   450    11     0     0     0
   411  0.11436328E+00     0   451    11     0     0     0
   411  0.26763736E-02     0   452    11     0     0     0
   411  0.25367361E-01     0   453    11     0     0     0
   411  0.31314167E+00     0   454    12     0     0     0
   411  0.36890343E+00     0   455    12     0     0     0
   411  0.12716213E+00     0   198   412     0     0     0
   6
   412  0.32548640E-01     0   450    12     0     0     0
   412  0.44975989E-01     0   451    12     0     0     0
   412  0.21140286E+00     0   452    12     0     0     0
   412  0.31109148E+00     0   453    12     0     0     0
   412  0.12566358E-01     0   456    11     0     0     0
   412  0.38741466E+00     0   457    11     0     0     0
   4
   413  0.95677364E+00     0   450     1     0     0     0
   413  0.25076149E-01     0   451     1     0     0     0
   413  0.39451760E-02     0   452     1     0     0     0
   413  0.14205148E-01     0   453     1     0     0     0
   4
   414  0.95677412E+00     0   450     2     0     0     0
   414  0.25075955E-01     0   451     2     0     0     0
   414  0.39451006E-02     0   452     2     0     0     0
   414  0.14204776E-01     0   453     2     0     0     0
   4
   415  0.95677364E+00     0   450     3     0     0     0
   415  0.25076149E-01     0   451     3     0     0     0
   415  0.39451760E-02     0   452     3     0     0     0
   415  0.14205148E-01     0   453     3     0     0     0
   4
   416  0.95677418E+00     0   450     4     0     0     0
   416  0.25075961E-01     0   451     4     0     0     0
   416  0.39451011E-02     0   452     4     0     0     0
   416  0.14204777E-01     0   453     4     0     0     0
   7
   417  0.14284671E-01     0   450     5     0     0     0
   417  0.77973820E-01     0   451     5     0     0     0
   417  0.91912923E-02     0   452     5     0     0     0
   417  0.63224077E-01     0   453     5     0     0     0
   417  0.23887414E+00     0   456     6     0     0     0
   417  0.45841619E+00     0   457     6     0     0     0
   417  0.13803586E+00     0   199   406     0     0     0
   9
   418  0.24561818E+00     0   454     5     0     0     0
   418  0.36773004E-01     0   455     5     0     0     0
   418  0.21660130E+00     0   200   406     0     0     0
   418  0.31792078E-01     0   198   405     0     0     0
   418  0.52440297E-01     0   198   417     0     0     0
   418  0.41910917E-01     0   450     6     0     0     0
   418  0.12441246E+00     0   451     6     0     0     0
   418  0.18655960E+00     0   452     6     0     0     0
   418  0.63892260E-01     0   453     6     0     0     0
   4
   419  0.95677364E+00     0   450     7     0     0     0
   419  0.25076149E-01     0   451     7     0     0     0
   419  0.39451760E-02     0   452     7     0     0     0
   419  0.14205148E-01     0   453     7     0     0     0
   4
   420  0.95677412E+00     0   450     8     0     0     0
   420  0.25075955E-01     0   451     8     0     0     0
   420  0.39451006E-02     0   452     8     0     0     0
   420  0.14204776E-01     0   453     8     0     0     0
   4
   421  0.95677364E+00     0   450     9     0     0     0
   421  0.25076149E-01     0   451     9     0     0     0
   421  0.39451760E-02     0   452     9     0     0     0
   421  0.14205148E-01     0   453     9     0     0     0
   4
   422  0.95677418E+00     0   450    10     0     0     0
   422  0.25075961E-01     0   451    10     0     0     0
   422  0.39451011E-02     0   452    10     0     0     0
   422  0.14204777E-01     0   453    10     0     0     0
   7
   423  0.14284671E-01     0   450    11     0     0     0
   423  0.77973820E-01     0   451    11     0     0     0
   423  0.91912923E-02     0   452    11     0     0     0
   423  0.63224077E-01     0   453    11     0     0     0
   423  0.23887414E+00     0   454    12     0     0     0
   423  0.45841619E+00     0   455    12     0     0     0
   423  0.13803586E+00     0   198   412     0     0     0
   9
   424  0.24561818E+00     0   456    11     0     0     0
   424  0.36773004E-01     0   457    11     0     0     0
   424  0.21660130E+00     0   200   412     0     0     0
   424  0.31792078E-01     0   199   411     0     0     0
   424  0.52440297E-01     0   199   423     0     0     0
   424  0.41910917E-01     0   450    12     0     0     0
   424  0.12441246E+00     0   451    12     0     0     0
   424  0.18655960E+00     0   452    12     0     0     0
   424  0.63892260E-01     0   453    12     0     0     0
   6
   425  0.71292199E-01     0   450   121     0     0     0
   425  0.25421670E+00     0   451   121     0     0     0
   425  0.74447657E-03     0   452   121     0     0     0
   425  0.70778906E-01     0   453   121     0     0     0
   425  0.36611483E+00     0   456   122     0     0     0
   425  0.23685290E+00     0   457   122     0     0     0
   6
   426  0.11050292E+00     0   450   122     0     0     0
   426  0.16529968E+00     0   451   122     0     0     0
   426  0.43189554E-02     0   452   122     0     0     0
   426  0.11471215E+00     0   453   122     0     0     0
   426  0.46084008E+00     0   454   121     0     0     0
   426  0.14432620E+00     0   455   121     0     0     0
   6
   427  0.71292199E-01     0   450   123     0     0     0
   427  0.25421670E+00     0   451   123     0     0     0
   427  0.74447657E-03     0   452   123     0     0     0
   427  0.70778906E-01     0   453   123     0     0     0
   427  0.36611483E+00     0   456   124     0     0     0
   427  0.23685290E+00     0   457   124     0     0     0
   6
   428  0.11050292E+00     0   450   124     0     0     0
   428  0.16529968E+00     0   451   124     0     0     0
   428  0.43189554E-02     0   452   124     0     0     0
   428  0.11471215E+00     0   453   124     0     0     0
   428  0.46084008E+00     0   454   123     0     0     0
   428  0.14432620E+00     0   455   123     0     0     0
   1
   429  0.10000000E+01     0   450   125     0     0     0
   7
   430  0.10991777E+00     0   450   126     0     0     0
   430  0.16442437E+00     0   451   126     0     0     0
   430  0.42960853E-02     0   452   126     0     0     0
   430  0.11410471E+00     0   453   126     0     0     0
   430  0.46052051E+00     0   454   125     0     0     0
   430  0.14661951E+00     0   455   125     0     0     0
   430  0.11713643E-03     0   198   429     0     0     0
   6
   431  0.71292199E-01     0   450   127     0     0     0
   431  0.25421670E+00     0   451   127     0     0     0
   431  0.74447657E-03     0   452   127     0     0     0
   431  0.70778906E-01     0   453   127     0     0     0
   431  0.36611483E+00     0   454   128     0     0     0
   431  0.23685290E+00     0   455   128     0     0     0
   6
   432  0.11050292E+00     0   450   128     0     0     0
   432  0.16529968E+00     0   451   128     0     0     0
   432  0.43189554E-02     0   452   128     0     0     0
   432  0.11471215E+00     0   453   128     0     0     0
   432  0.46084008E+00     0   456   127     0     0     0
   432  0.14432620E+00     0   457   127     0     0     0
   6
   433  0.71292199E-01     0   450   129     0     0     0
   433  0.25421670E+00     0   451   129     0     0     0
   433  0.74447657E-03     0   452   129     0     0     0
   433  0.70778906E-01     0   453   129     0     0     0
   433  0.36611483E+00     0   454   130     0     0     0
   433  0.23685290E+00     0   455   130     0     0     0
   6
   434  0.11050292E+00     0   450   130     0     0     0
   434  0.16529968E+00     0   451   130     0     0     0
   434  0.43189554E-02     0   452   130     0     0     0
   434  0.11471215E+00     0   453   130     0     0     0
   434  0.46084008E+00     0   456   129     0     0     0
   434  0.14432620E+00     0   457   129     0     0     0
   1
   435  0.10000000E+01     0   450   131     0     0     0
   7
   436  0.10991777E+00     0   450   132     0     0     0
   436  0.16442437E+00     0   451   132     0     0     0
   436  0.42960853E-02     0   452   132     0     0     0
   436  0.11410471E+00     0   453   132     0     0     0
   436  0.46052051E+00     0   456   131     0     0     0
   436  0.14661951E+00     0   457   131     0     0     0
   436  0.11713643E-03     0   199   435     0     0     0
   1
   437  0.10000000E+01     0   450   121     0     0     0
   0
   1
   439  0.10000000E+01     0   450   123     0     0     0
   0
   8
   441  0.71091183E-01     0   450   125     0     0     0
   441  0.25382131E+00     0   451   125     0     0     0
   441  0.32396161E-02     0   452   125     0     0     0
   441  0.71962558E-01     0   453   125     0     0     0
   441  0.36412707E+00     0   456   126     0     0     0
   441  0.23563808E+00     0   457   126     0     0     0
   441  0.59499107E-04     0   200   429     0     0     0
   441  0.60628296E-04     0   203   429     0     0     0
   0
   1
   443  0.10000000E+01     0   450   127     0     0     0
   0
   1
   445  0.10000000E+01     0   450   129     0     0     0
   0
   8
   447  0.71091183E-01     0   450   131     0     0     0
   447  0.25382131E+00     0   451   131     0     0     0
   447  0.32396161E-02     0   452   131     0     0     0
   447  0.71962558E-01     0   453   131     0     0     0
   447  0.36412707E+00     0   454   132     0     0     0
   447  0.23563808E+00     0   455   132     0     0     0
   447  0.59499107E-04     0   200   435     0     0     0
   447  0.60628296E-04     0   203   435     0     0     0
   0
  32
   449  0.66290689E-02     0   454     1     8     0     0
   449  0.66290689E-02     0   456     2     7     0     0
   449  0.66290689E-02     0   454     3    10     0     0
   449  0.66290689E-02     0   456     4     9     0     0
   449  0.18740891E-01     0   454     5    12     0     0
   449  0.18740891E-01     0   456     6    11     0     0
   449  0.41329227E-02     0   455     1     8     0     0
   449  0.41329227E-02     0   457     2     7     0     0
   449  0.41329227E-02     0   455     3    10     0     0
   449  0.41329227E-02     0   457     4     9     0     0
   449  0.18253621E+00     0   455     5    12     0     0
   449  0.18253621E+00     0   457     6    11     0     0
   449  0.40324881E-04     0   450    13     0     0     0
   449  0.22153177E-02     0   450     1     7     0     0
   449  0.22153177E-02     0   450     3     9     0     0
   449  0.22127696E-02     0   450     5    11     0     0
   449  0.26445521E-01     0   450     6    12     0     0
   449  0.32480014E-03     0   451    13     0     0     0
   449  0.75200461E-02     0   451     1     7     0     0
   449  0.75200461E-02     0   451     3     9     0     0
   449  0.76138480E-02     0   451     5    11     0     0
   449  0.38855441E-01     0   451     6    12     0     0
   449  0.11164437E-02     0   452    13     0     0     0
   449  0.95072202E-04     0   452     1     7     0     0
   449  0.95072202E-04     0   452     3     9     0     0
   449  0.63651067E-03     0   452     5    11     0     0
   449  0.18167052E+00     0   452     6    12     0     0
   449  0.63467887E-03     0   453    13     0     0     0
   449  0.38483615E-02     0   453     1     7     0     0
   449  0.38483615E-02     0   453     3     9     0     0
   449  0.41661235E-02     0   453     5    11     0     0
   449  0.26332316E+00     0   453     6    12     0     0
   0
   8
   451  0.20511067E+00     0   450   200     0     0     0
   451  0.62692976E-04     0   450     5    11     0     0
   451  0.12894012E+00     0   437   127     0     0     0
   451  0.12894012E+00     0   443   121     0     0     0
   451  0.12893987E+00     0   439   129     0     0     0
   451  0.12893987E+00     0   445   123     0     0     0
   451  0.13953331E+00     0   429   131     0     0     0
   451  0.13953331E+00     0   435   125     0     0     0
  11
   452  0.21823281E+00     0   454   199     0     0     0
   452  0.21823281E+00     0   456   198     0     0     0
   452  0.45873645E+00     0   450   200     0     0     0
   452  0.19674914E-01     0   451   200     0     0     0
   452  0.44918995E-01     0   450   203     0     0     0
   452  0.42531909E-02     0   437   127     0     0     0
   452  0.42531909E-02     0   443   121     0     0     0
   452  0.42531895E-02     0   439   129     0     0     0
   452  0.42531895E-02     0   445   123     0     0     0
   452  0.11595684E-01     0   429   131     0     0     0
   452  0.11595684E-01     0   435   125     0     0     0
  17
   453  0.40098864E+00     0   454   199     0     0     0
   453  0.40098864E+00     0   456   198     0     0     0
   453  0.25290698E-01     0   450   200     0     0     0
   453  0.39530224E-02     0   451   200     0     0     0
   453  0.11522125E-04     0   452     2     8     0     0
   453  0.14864189E-04     0   452     1     7     0     0
   453  0.14864189E-04     0   452     3     9     0     0
   453  0.11522125E-04     0   452     4    10     0     0
   453  0.12925730E-04     0   452     5    11     0     0
   453  0.87166362E-01     0   450   203     0     0     0
   453  0.33300024E-01     0   451   203     0     0     0
   453  0.73756240E-02     0   437   127     0     0     0
   453  0.73756240E-02     0   443   121     0     0     0
   453  0.73756226E-02     0   439   129     0     0     0
   453  0.73756226E-02     0   445   123     0     0     0
   453  0.93721971E-02     0   429   131     0     0     0
   453  0.93721971E-02     0   435   125     0     0     0
   2
   454  0.97763097E+00     0   450   198     0     0     0
   454  0.22369057E-01     0   435   126     0     0     0
  10
   455  0.90867959E-01     0   450   198     0     0     0
   455  0.49553412E+00     0   451   198     0     0     0
   455  0.44658969E-04     0   452     2     7     0     0
   455  0.44658969E-04     0   452     4     9     0     0
   455  0.14884868E-04     0   452   127   122     0     0
   455  0.14884868E-04     0   452   129   124     0     0
   455  0.14884894E-04     0   452   131   126     0     0
   455  0.48400401E-02     0   435   126     0     0     0
   455  0.35518271E+00     0   454   200     0     0     0
   455  0.53441394E-01     0   454   203     0     0     0
   2
   456  0.97763097E+00     0   450   199     0     0     0
   456  0.22369057E-01     0   429   132     0     0     0
  10
   457  0.90867959E-01     0   450   199     0     0     0
   457  0.49553412E+00     0   451   199     0     0     0
   457  0.44658969E-04     0   452     8     1     0     0
   457  0.44658969E-04     0   452    10     3     0     0
   457  0.14884868E-04     0   452   121   128     0     0
   457  0.14884868E-04     0   452   123   130     0     0
   457  0.14884894E-04     0   452   125   132     0     0
   457  0.48400401E-02     0   429   132     0     0     0
   457  0.35518271E+00     0   456   200     0     0     0
   457  0.53441394E-01     0   456   203     0     0     0
  28
   203  0.20212309E-03     0   123   129     0     0     0
   203  0.57814039E-01     0   125   131     0     0     0
   203  0.24264508E-02     0     3     9     0     0     0
   203  0.79155493E+00     0     5    11     0     0     0
   203  0.30112913E-01     0     4    10     0     0     0
   203  0.17308352E-02     0    59    59     0     0     0
   203  0.34986544E-01     0    13    13     0     0     0
   203  0.41344231E-02     0   198   121   128     0     0
   203  0.41344231E-02     0   198   123   130     0     0
   203  0.41344231E-02     0   198   125   132     0     0
   203  0.12403269E-01     0   198     8     1     0     0
   203  0.12403269E-01     0   198    10     3     0     0
   203  0.41344231E-02     0   199   127   122     0     0
   203  0.41344231E-02     0   199   129   124     0     0
   203  0.41344231E-02     0   199   131   126     0     0
   203  0.12403269E-01     0   199     2     7     0     0
   203  0.12403269E-01     0   199     4     9     0     0
   203  0.46181475E-03     0   200   122   128     0     0
   203  0.46181475E-03     0   200   124   130     0     0
   203  0.46181475E-03     0   200   126   132     0     0
   203  0.23242674E-03     0   200   121   127     0     0
   203  0.23242674E-03     0   200   123   129     0     0
   203  0.23242674E-03     0   200   125   131     0     0
   203  0.79627428E-03     0   200     2     8     0     0
   203  0.79627428E-03     0   200     4    10     0     0
   203  0.10257973E-02     0   200     1     7     0     0
   203  0.10257973E-02     0   200     3     9     0     0
   203  0.10257973E-02     0   200     5    11     0     0
  19
   204  0.87124274E-04     0   123   129     0     0     0
   204  0.24951873E-01     0   125   131     0     0     0
   204  0.10276475E-02     0     3     9     0     0     0
   204  0.27573797E+00     0     5    11     0     0     0
   204  0.11499143E-04     0     4    10     0     0     0
   204  0.27491528E+00     0     6    12     0     0     0
   204  0.41522202E-03     0    13    13     0     0     0
   204  0.54653762E-02     0   198   199     0     0     0
   204  0.26867348E-02     0   200   200     0     0     0
   204  0.22304505E-01     0   450   450     0     0     0
   204  0.80091551E-01     0   450   451     0     0     0
   204  0.13943827E+00     0   450   452     0     0     0
   204  0.29825522E-02     0   450   453     0     0     0
   204  0.33521973E-01     0   451   451     0     0     0
   204  0.11242155E+00     0   454   456     0     0     0
   204  0.22164959E-01     0   203   203     0     0     0
   204  0.60362695E-03     0   437   443     0     0     0
   204  0.60350646E-03     0   439   445     0     0     0
   204  0.56875212E-03     0   429   435     0     0     0
  13
   205  0.49418846E-04     0   123   129     0     0     0
   205  0.14153959E-01     0   125   131     0     0     0
   205  0.58295316E-03     0     3     9     0     0     0
   205  0.15662114E+00     0     5    11     0     0     0
   205  0.23327579E+00     0     6    12     0     0     0
   205  0.20168380E-03     0    13    13     0     0     0
   205  0.20302545E-01     0   450   450     0     0     0
   205  0.10816615E+00     0   450   451     0     0     0
   205  0.15506637E-01     0   450   452     0     0     0
   205  0.15778804E-01     0   450   453     0     0     0
   205  0.10732183E+00     0   451   451     0     0     0
   205  0.32538056E+00     0   454   456     0     0     0
   205  0.26584915E-02     0   203   200     0     0     0
   8
   206  0.10382163E-03     0   124   129     0     0     0
   206  0.29735388E-01     0   126   131     0     0     0
   206  0.11292063E-02     0     4     9     0     0     0
   206  0.65891057E+00     0     6    11     0     0     0
   206  0.27640650E+00     0   454   450     0     0     0
   206  0.77216350E-02     0   454   451     0     0     0
   206  0.20048864E-01     0   455   450     0     0     0
   206  0.59442106E-02     0   203   198     0     0     0
   8
   207  0.10382163E-03     0   130   123     0     0     0
   207  0.29735388E-01     0   132   125     0     0     0
   207  0.11292063E-02     0    10     3     0     0     0
   207  0.65891057E+00     0    12     5     0     0     0
   207  0.27640650E+00     0   456   450     0     0     0
   207  0.77216350E-02     0   456   451     0     0     0
   207  0.20048864E-01     0   457   450     0     0     0
   207  0.59442106E-02     0   203   199     0     0     0
   0
   5
     6  0.33333334E+00   100     2     7     5     0     0
     6  0.33333334E+00   100     4     9     5     0     0
     6  0.11111111E+00   100   122   127     5     0     0
     6  0.11111111E+00   100   124   129     5     0     0
     6  0.11111111E+00   100   126   131     5     0     0
   5
    12  0.33333334E+00   100     8     1    11     0     0
    12  0.33333334E+00   100    10     3    11     0     0
    12  0.11111111E+00   100   128   121    11     0     0
    12  0.11111111E+00   100   130   123    11     0     0
    12  0.11111111E+00   100   132   125    11     0     0
      6.00000000     -0.18020763
      0.97743118     -0.05895937      0.18438832     -0.08457585
     -0.15965734     -0.82345831      0.42962983     -0.33443090
      0.06412090     -0.08517057     -0.69381702     -0.71221691
     -0.12258194      0.55784065      0.54775679     -0.61135107
     -0.86843467      0.49580356     -0.49580356     -0.86843467
     -0.77306837      0.63432264     -0.63432264     -0.77306837
      0.78483748     -0.92334485     -1.57000625
   4899.00000000      0.00000000      0.00000000
    300.00000000
    T
