  65
  401    811.9113    0.23420E-23
  402    808.4351    0.28814E-23
  403    811.9113    0.23423E-23
  404    808.4362    0.28851E-23
  405   3000.0916    0.45486E-26
  406   3002.5991    0.32748E-26
  407    811.9113    0.23420E-23
  408    808.4351    0.28814E-23
  409    811.9113    0.23423E-23
  410    808.4362    0.28851E-23
  411   3000.0916    0.45486E-26
  412   3002.5991    0.32748E-26
  413    810.3500    0.72652E-23
  414    809.2995    0.25772E-23
  415    810.3501    0.72652E-23
  416    809.3006    0.25801E-23
  417   3000.5220    0.32446E-26
  418   3002.8484    0.32578E-26
  419    810.3500    0.72652E-23
  420    809.2995    0.25772E-23
  421    810.3501    0.72652E-23
  422    809.3006    0.25801E-23
  423   3000.5220    0.32446E-26
  424   3002.8484    0.32578E-26
  425    700.0023    0.45984E-22
  426    695.9675    0.39655E-22
  427    700.0023    0.45984E-22
  428    695.9675    0.39655E-22
  429    699.9515    0.98413E-23
  430    695.9675    0.39655E-22
  431    700.0023    0.45984E-22
  432    695.9675    0.39655E-22
  433    700.0023    0.45984E-22
  434    695.9675    0.39655E-22
  435    699.9515    0.98413E-23
  436    695.9675    0.39655E-22
  437    700.0024    0.98128E-23
  438      0.0000    0.10000E+31
  439    700.0024    0.98128E-23
  440      0.0000    0.10000E+31
  441    700.0577    0.45881E-22
  442      0.0000    0.10000E+31
  443    700.0024    0.98128E-23
  444      0.0000    0.10000E+31
  445    700.0024    0.98128E-23
  446      0.0000    0.10000E+31
  447    700.0577    0.45881E-22
  448      0.0000    0.10000E+31
  449    800.0000    0.15051E-20
  450    649.9980    0.10000E+31
  451    749.7825    0.20047E-23
  452  -1201.1533    0.69054E-25
  453   1213.0662    0.63698E-25
  454    749.5218    0.19924E-23
  455   1211.4103    0.63568E-25
  456    749.5218    0.19924E-23
  457   1211.4103    0.63568E-25
  203    106.8526    0.17587E-21
  204   1007.9222    0.20502E-24
  205   1000.0000    0.19659E-24
  206   1021.4937    0.21496E-24
  207   1021.4937    0.21496E-24
  458      0.0000    0.10000E+31
    6    172.5000    0.57395E-24
   12    172.5000    0.57395E-24
   4
   401  0.78813240E-01     0   450     1     0     0     0
   401  0.25195265E+00     0   451     1     0     0     0
   401  0.15377802E+00     0   449     1     0     0     0
   401  0.51545602E+00     0   456     2     0     0     0
   4
   402  0.36946900E-01     0   450     2     0     0     0
   402  0.28965911E+00     0   451     2     0     0     0
   402  0.95738366E-01     0   449     2     0     0     0
   402  0.57765561E+00     0   454     1     0     0     0
   4
   403  0.78823313E-01     0   450     3     0     0     0
   403  0.25198534E+00     0   451     3     0     0     0
   403  0.15379947E+00     0   449     3     0     0     0
   403  0.51539183E+00     0   456     4     0     0     0
   4
   404  0.36992844E-01     0   450     4     0     0     0
   404  0.28995645E+00     0   451     4     0     0     0
   404  0.94637074E-01     0   449     4     0     0     0
   404  0.57841361E+00     0   454     3     0     0     0
   7
   405  0.10568983E-01     0   450     5     0     0     0
   405  0.47692269E-04     0   451     5     0     0     0
   405  0.55378675E-03     0   452     5     0     0     0
   405  0.56837167E-03     0   453     5     0     0     0
   405  0.98716289E+00     0   449     5     0     0     0
   405  0.40490700E-04     0   456     6     0     0     0
   405  0.10578741E-02     0   457     6     0     0     0
   7
   406  0.70601583E+00     0   449     6     0     0     0
   406  0.30383356E-01     0   450     6     0     0     0
   406  0.14113775E-02     0   451     6     0     0     0
   406  0.65767862E-01     0   452     6     0     0     0
   406  0.64190313E-01     0   453     6     0     0     0
   406  0.27943410E-02     0   454     5     0     0     0
   406  0.12943690E+00     0   455     5     0     0     0
   4
   407  0.78813240E-01     0   450     7     0     0     0
   407  0.25195265E+00     0   451     7     0     0     0
   407  0.15377802E+00     0   449     7     0     0     0
   407  0.51545602E+00     0   454     8     0     0     0
   4
   408  0.36946900E-01     0   450     8     0     0     0
   408  0.28965911E+00     0   451     8     0     0     0
   408  0.95738366E-01     0   449     8     0     0     0
   408  0.57765561E+00     0   456     7     0     0     0
   4
   409  0.78823313E-01     0   450     9     0     0     0
   409  0.25198534E+00     0   451     9     0     0     0
   409  0.15379947E+00     0   449     9     0     0     0
   409  0.51539183E+00     0   454    10     0     0     0
   4
   410  0.36992844E-01     0   450    10     0     0     0
   410  0.28995645E+00     0   451    10     0     0     0
   410  0.94637074E-01     0   449    10     0     0     0
   410  0.57841361E+00     0   456     9     0     0     0
   7
   411  0.10568983E-01     0   450    11     0     0     0
   411  0.47692269E-04     0   451    11     0     0     0
   411  0.55378675E-03     0   452    11     0     0     0
   411  0.56837167E-03     0   453    11     0     0     0
   411  0.98716289E+00     0   449    11     0     0     0
   411  0.40490700E-04     0   454    12     0     0     0
   411  0.10578741E-02     0   455    12     0     0     0
   7
   412  0.70601583E+00     0   449    12     0     0     0
   412  0.30383356E-01     0   450    12     0     0     0
   412  0.14113775E-02     0   451    12     0     0     0
   412  0.65767862E-01     0   452    12     0     0     0
   412  0.64190313E-01     0   453    12     0     0     0
   412  0.27943410E-02     0   456    11     0     0     0
   412  0.12943690E+00     0   457    11     0     0     0
   3
   413  0.63807446E+00     0   450     1     0     0     0
   413  0.28811095E-03     0   451     1     0     0     0
   413  0.36163747E+00     0   449     1     0     0     0
   3
   414  0.89575738E+00     0   450     2     0     0     0
   414  0.39575883E-03     0   451     2     0     0     0
   414  0.10384683E+00     0   449     2     0     0     0
   3
   415  0.63807344E+00     0   450     3     0     0     0
   415  0.28811090E-03     0   451     3     0     0     0
   415  0.36163843E+00     0   449     3     0     0     0
   3
   416  0.89673066E+00     0   450     4     0     0     0
   416  0.39610523E-03     0   451     4     0     0     0
   416  0.10287321E+00     0   449     4     0     0     0
   7
   417  0.28464100E-02     0   450     5     0     0     0
   417  0.52351378E-01     0   451     5     0     0     0
   417  0.41798622E-03     0   452     5     0     0     0
   417  0.15304220E-02     0   453     5     0     0     0
   417  0.70428652E+00     0   449     5     0     0     0
   417  0.10713468E+00     0   456     6     0     0     0
   417  0.13143259E+00     0   457     6     0     0     0
   7
   418  0.70242196E+00     0   449     6     0     0     0
   418  0.10818210E+00     0   454     5     0     0     0
   418  0.22527557E-02     0   455     5     0     0     0
   418  0.14613817E-02     0   450     6     0     0     0
   418  0.55071980E-01     0   451     6     0     0     0
   418  0.65507129E-01     0   452     6     0     0     0
   418  0.65102749E-01     0   453     6     0     0     0
   3
   419  0.63807446E+00     0   450     7     0     0     0
   419  0.28811095E-03     0   451     7     0     0     0
   419  0.36163747E+00     0   449     7     0     0     0
   3
   420  0.89575738E+00     0   450     8     0     0     0
   420  0.39575883E-03     0   451     8     0     0     0
   420  0.10384683E+00     0   449     8     0     0     0
   3
   421  0.63807344E+00     0   450     9     0     0     0
   421  0.28811090E-03     0   451     9     0     0     0
   421  0.36163843E+00     0   449     9     0     0     0
   3
   422  0.89673066E+00     0   450    10     0     0     0
   422  0.39610523E-03     0   451    10     0     0     0
   422  0.10287321E+00     0   449    10     0     0     0
   7
   423  0.28464100E-02     0   450    11     0     0     0
   423  0.52351378E-01     0   451    11     0     0     0
   423  0.41798622E-03     0   452    11     0     0     0
   423  0.15304220E-02     0   453    11     0     0     0
   423  0.70428652E+00     0   449    11     0     0     0
   423  0.10713468E+00     0   454    12     0     0     0
   423  0.13143259E+00     0   455    12     0     0     0
   7
   424  0.70242196E+00     0   449    12     0     0     0
   424  0.10818210E+00     0   456    11     0     0     0
   424  0.22527557E-02     0   457    11     0     0     0
   424  0.14613817E-02     0   450    12     0     0     0
   424  0.55071980E-01     0   451    12     0     0     0
   424  0.65507129E-01     0   452    12     0     0     0
   424  0.65102749E-01     0   453    12     0     0     0
   1
   425  0.10000000E+01     0   450   121     0     0     0
   1
   426  0.10000000E+01     0   450   122     0     0     0
   1
   427  0.10000000E+01     0   450   123     0     0     0
   1
   428  0.10000000E+01     0   450   124     0     0     0
   1
   429  0.10000000E+01     0   450   125     0     0     0
   1
   430  0.10000000E+01     0   450   126     0     0     0
   1
   431  0.10000000E+01     0   450   127     0     0     0
   1
   432  0.10000000E+01     0   450   128     0     0     0
   1
   433  0.10000000E+01     0   450   129     0     0     0
   1
   434  0.10000000E+01     0   450   130     0     0     0
   1
   435  0.10000000E+01     0   450   131     0     0     0
   1
   436  0.10000000E+01     0   450   132     0     0     0
   1
   437  0.10000000E+01     0   450   121     0     0     0
   0
   1
   439  0.10000000E+01     0   450   123     0     0     0
   0
   1
   441  0.10000000E+01     0   450   125     0     0     0
   0
   1
   443  0.10000000E+01     0   450   127     0     0     0
   0
   1
   445  0.10000000E+01     0   450   129     0     0     0
   0
   1
   447  0.10000000E+01     0   450   131     0     0     0
   0
  13
   449  0.26630066E-01     0   454     1     8     0     0
   449  0.26630066E-01     0   456     2     7     0     0
   449  0.26628722E-01     0   454     3    10     0     0
   449  0.26628722E-01     0   456     4     9     0     0
   449  0.32044706E+00     0   450     2     8     0     0
   449  0.10008431E+00     0   450     1     7     0     0
   449  0.10008407E+00     0   450     3     9     0     0
   449  0.32043228E+00     0   450     4    10     0     0
   449  0.16327987E-04     0   450     5    11     0     0
   449  0.15028264E-01     0   451     2     8     0     0
   449  0.11181658E-01     0   451     1     7     0     0
   449  0.11181613E-01     0   451     3     9     0     0
   449  0.15026943E-01     0   451     4    10     0     0
   0
  19
   451  0.82762803E-04     0   450   200     0     0     0
   451  0.81826754E-01     0   425   127     0     0     0
   451  0.81826754E-01     0   431   121     0     0     0
   451  0.81826590E-01     0   427   129     0     0     0
   451  0.81826590E-01     0   433   123     0     0     0
   451  0.26344758E-03     0   437   127     0     0     0
   451  0.26344758E-03     0   443   121     0     0     0
   451  0.26344703E-03     0   439   129     0     0     0
   451  0.26344703E-03     0   445   123     0     0     0
   451  0.26915534E-03     0   429   131     0     0     0
   451  0.26915534E-03     0   435   125     0     0     0
   451  0.81674084E-01     0   441   131     0     0     0
   451  0.81674084E-01     0   447   125     0     0     0
   451  0.84611699E-01     0   426   128     0     0     0
   451  0.84611699E-01     0   432   122     0     0     0
   451  0.84611699E-01     0   428   130     0     0     0
   451  0.84611699E-01     0   434   124     0     0     0
   451  0.84611699E-01     0   430   132     0     0     0
   451  0.84611699E-01     0   436   126     0     0     0
  36
   452  0.29989460E+00     0   454   199     0     0     0
   452  0.29989460E+00     0   456   198     0     0     0
   452  0.11130857E+00     0   450   200     0     0     0
   452  0.27680176E+00     0   451   200     0     0     0
   452  0.34107536E-02     0   450   203     0     0     0
   452  0.50910506E-02     0   451   203     0     0     0
   452  0.84854124E-04     0   402     8     0     0     0
   452  0.84854124E-04     0   408     2     0     0     0
   452  0.12827668E-03     0   401     7     0     0     0
   452  0.12827668E-03     0   407     1     0     0     0
   452  0.12827662E-03     0   403     9     0     0     0
   452  0.12827662E-03     0   409     3     0     0     0
   452  0.84853411E-04     0   404    10     0     0     0
   452  0.84853411E-04     0   410     4     0     0     0
   452  0.19216388E-04     0   414     8     0     0     0
   452  0.19216388E-04     0   420     2     0     0     0
   452  0.19216230E-04     0   416    10     0     0     0
   452  0.19216230E-04     0   422     4     0     0     0
   452  0.23913513E-04     0   425   127     0     0     0
   452  0.23913513E-04     0   431   121     0     0     0
   452  0.23913513E-04     0   427   129     0     0     0
   452  0.23913513E-04     0   433   123     0     0     0
   452  0.21079952E-04     0   437   127     0     0     0
   452  0.21079952E-04     0   443   121     0     0     0
   452  0.21079952E-04     0   439   129     0     0     0
   452  0.21079952E-04     0   445   123     0     0     0
   452  0.48454540E-03     0   429   131     0     0     0
   452  0.48454540E-03     0   435   125     0     0     0
   452  0.48730400E-03     0   441   131     0     0     0
   452  0.48730400E-03     0   447   125     0     0     0
   452  0.90963680E-04     0   426   128     0     0     0
   452  0.90963680E-04     0   432   122     0     0     0
   452  0.90963680E-04     0   428   130     0     0     0
   452  0.90963680E-04     0   434   124     0     0     0
   452  0.90963680E-04     0   430   132     0     0     0
   452  0.90963680E-04     0   436   126     0     0     0
  40
   453  0.28448707E+00     0   454   199     0     0     0
   453  0.28448707E+00     0   456   198     0     0     0
   453  0.34785301E-02     0   450   200     0     0     0
   453  0.54357955E-02     0   451   200     0     0     0
   453  0.97518168E-01     0   450   203     0     0     0
   453  0.24357356E+00     0   451   203     0     0     0
   453  0.43564411E-02     0   402     8     0     0     0
   453  0.43564411E-02     0   408     2     0     0     0
   453  0.59577259E-02     0   401     7     0     0     0
   453  0.59577259E-02     0   407     1     0     0     0
   453  0.59577236E-02     0   403     9     0     0     0
   453  0.59577236E-02     0   409     3     0     0     0
   453  0.43564057E-02     0   404    10     0     0     0
   453  0.43564057E-02     0   410     4     0     0     0
   453  0.54738420E-03     0   414     8     0     0     0
   453  0.54738420E-03     0   420     2     0     0     0
   453  0.13627634E-03     0   413     7     0     0     0
   453  0.13627634E-03     0   419     1     0     0     0
   453  0.13627631E-03     0   415     9     0     0     0
   453  0.13627631E-03     0   421     3     0     0     0
   453  0.54737984E-03     0   416    10     0     0     0
   453  0.54737984E-03     0   422     4     0     0     0
   453  0.14144214E-02     0   425   127     0     0     0
   453  0.14144214E-02     0   431   121     0     0     0
   453  0.14144214E-02     0   427   129     0     0     0
   453  0.14144214E-02     0   433   123     0     0     0
   453  0.59316715E-03     0   437   127     0     0     0
   453  0.59316715E-03     0   443   121     0     0     0
   453  0.59316715E-03     0   439   129     0     0     0
   453  0.59316715E-03     0   445   123     0     0     0
   453  0.10146932E-02     0   429   131     0     0     0
   453  0.10146932E-02     0   435   125     0     0     0
   453  0.18332213E-02     0   441   131     0     0     0
   453  0.18332213E-02     0   447   125     0     0     0
   453  0.38837073E-02     0   426   128     0     0     0
   453  0.38837073E-02     0   432   122     0     0     0
   453  0.38837073E-02     0   428   130     0     0     0
   453  0.38837073E-02     0   434   124     0     0     0
   453  0.38837073E-02     0   430   132     0     0     0
   453  0.38837073E-02     0   436   126     0     0     0
   8
   454  0.11516369E-01     0   450   198     0     0     0
   454  0.17826927E+00     0   426   127     0     0     0
   454  0.17826894E+00     0   428   129     0     0     0
   454  0.17833427E+00     0   430   131     0     0     0
   454  0.15130642E+00     0   431   122     0     0     0
   454  0.15130642E+00     0   433   124     0     0     0
   454  0.18570639E-04     0   435   126     0     0     0
   454  0.15097977E+00     0   447   126     0     0     0
  15
   455  0.74060485E-01     0   450   198     0     0     0
   455  0.30098298E+00     0   451   198     0     0     0
   455  0.76974584E-02     0   402     7     0     0     0
   455  0.13239721E-01     0   407     2     0     0     0
   455  0.76974230E-02     0   404     9     0     0     0
   455  0.13424767E-01     0   409     4     0     0     0
   455  0.37434120E-02     0   426   127     0     0     0
   455  0.37434120E-02     0   428   129     0     0     0
   455  0.45873290E-02     0   430   131     0     0     0
   455  0.64541651E-02     0   431   122     0     0     0
   455  0.64541651E-02     0   433   124     0     0     0
   455  0.84983837E-03     0   435   126     0     0     0
   455  0.64532496E-02     0   447   126     0     0     0
   455  0.28558400E+00     0   454   200     0     0     0
   455  0.26502755E+00     0   454   203     0     0     0
   8
   456  0.11516369E-01     0   450   199     0     0     0
   456  0.17826927E+00     0   432   121     0     0     0
   456  0.17826894E+00     0   434   123     0     0     0
   456  0.17833427E+00     0   436   125     0     0     0
   456  0.15130642E+00     0   425   128     0     0     0
   456  0.15130642E+00     0   427   130     0     0     0
   456  0.18570639E-04     0   429   132     0     0     0
   456  0.15097977E+00     0   441   132     0     0     0
  15
   457  0.74060485E-01     0   450   199     0     0     0
   457  0.30098298E+00     0   451   199     0     0     0
   457  0.76974584E-02     0   408     1     0     0     0
   457  0.13239721E-01     0   401     8     0     0     0
   457  0.76974230E-02     0   410     3     0     0     0
   457  0.13424767E-01     0   403    10     0     0     0
   457  0.37434120E-02     0   432   121     0     0     0
   457  0.37434120E-02     0   434   123     0     0     0
   457  0.45873290E-02     0   436   125     0     0     0
   457  0.64541651E-02     0   425   128     0     0     0
   457  0.64541651E-02     0   427   130     0     0     0
   457  0.84983837E-03     0   429   132     0     0     0
   457  0.64532496E-02     0   441   132     0     0     0
   457  0.28558400E+00     0   456   200     0     0     0
   457  0.26502755E+00     0   456   203     0     0     0
  28
   203  0.21257915E-03     0   123   129     0     0     0
   203  0.60785275E-01     0   125   131     0     0     0
   203  0.25561557E-02     0     3     9     0     0     0
   203  0.84671199E+00     0     5    11     0     0     0
   203  0.37053011E-01     0     4    10     0     0     0
   203  0.15151404E-02     0    59    59     0     0     0
   203  0.34211483E-01     0    13    13     0     0     0
   203  0.90856937E-03     0   198   121   128     0     0
   203  0.90856937E-03     0   198   123   130     0     0
   203  0.90856937E-03     0   198   125   132     0     0
   203  0.27257083E-02     0   198     8     1     0     0
   203  0.27257083E-02     0   198    10     3     0     0
   203  0.90856937E-03     0   199   127   122     0     0
   203  0.90856937E-03     0   199   129   124     0     0
   203  0.90856937E-03     0   199   131   126     0     0
   203  0.27257083E-02     0   199     2     7     0     0
   203  0.27257083E-02     0   199     4     9     0     0
   203  0.41055235E-04     0   200   122   128     0     0
   203  0.41055235E-04     0   200   124   130     0     0
   203  0.41055235E-04     0   200   126   132     0     0
   203  0.20662688E-04     0   200   121   127     0     0
   203  0.20662688E-04     0   200   123   129     0     0
   203  0.20662688E-04     0   200   125   131     0     0
   203  0.70788614E-04     0   200     2     8     0     0
   203  0.70788614E-04     0   200     4    10     0     0
   203  0.91193178E-04     0   200     1     7     0     0
   203  0.91193178E-04     0   200     3     9     0     0
   203  0.91193178E-04     0   200     5    11     0     0
  10
   204  0.35956557E-04     0   123   129     0     0     0
   204  0.10298319E-01     0   125   131     0     0     0
   204  0.42151238E-03     0     3     9     0     0     0
   204  0.10392975E+00     0     5    11     0     0     0
   204  0.19097059E-04     0     4    10     0     0     0
   204  0.87151223E+00     0     6    12     0     0     0
   204  0.48233152E-03     0    13    13     0     0     0
   204  0.21798653E-02     0   198   199     0     0     0
   204  0.11067829E-02     0   200   200     0     0     0
   204  0.10014154E-01     0   203   203     0     0     0
   8
   205  0.34288016E-04     0   123   129     0     0     0
   205  0.98205525E-02     0   125   131     0     0     0
   205  0.40197867E-03     0     3     9     0     0     0
   205  0.99210218E-01     0     5    11     0     0     0
   205  0.17525450E-04     0     4    10     0     0     0
   205  0.88800156E+00     0     6    12     0     0     0
   205  0.49091666E-03     0    13    13     0     0     0
   205  0.20229230E-02     0   203   200     0     0     0
   5
   206  0.38298942E-04     0   124   129     0     0     0
   206  0.10969339E-01     0   126   131     0     0     0
   206  0.43064725E-03     0     4     9     0     0     0
   206  0.98621583E+00     0     6    11     0     0     0
   206  0.23459056E-02     0   203   198     0     0     0
   5
   207  0.38298942E-04     0   130   123     0     0     0
   207  0.10969339E-01     0   132   125     0     0     0
   207  0.43064725E-03     0    10     3     0     0     0
   207  0.98621583E+00     0    12     5     0     0     0
   207  0.23459056E-02     0   203   199     0     0     0
   0
   5
     6  0.33333334E+00   100     2     7     5     0     0
     6  0.33333334E+00   100     4     9     5     0     0
     6  0.11111111E+00   100   122   127     5     0     0
     6  0.11111111E+00   100   124   129     5     0     0
     6  0.11111111E+00   100   126   131     5     0     0
   5
    12  0.33333334E+00   100     8     1    11     0     0
    12  0.33333334E+00   100    10     3    11     0     0
    12  0.11111111E+00   100   128   121    11     0     0
    12  0.11111111E+00   100   130   123    11     0     0
    12  0.11111111E+00   100   132   125    11     0     0
      4.00000000     -0.24965002
      0.99630845     -0.04167137      0.06156397     -0.04292513
     -0.05246480     -0.98755652      0.11822658     -0.08945377
     -0.01228137      0.02112905      0.70632935      0.70746148
     -0.06682669      0.15016358      0.69522047     -0.69975251
     -0.99149561      0.13014030     -0.13014030     -0.99149561
     -0.98512012      0.17186733     -0.17186733     -0.98512012
      1.57071400     -1.57079530     -1.57077336
    300.00000000   4800.00000000   4800.00000000
   1200.00000000
    T
