#  ISAJET SUSY parameters in SUSY Les Houches Accord 2 format
#  Created by ISALHA 2.0 Last revision: C. Balazs 21 Apr 2009
Block SPINFO   # Program information
     1   ISASUGRA from ISAJET          # Spectrum Calculator
     2   7.80   29-OCT-2009 12:50:36   # Version number
Block MODSEL   # Model selection
     1     1   # Minimal supergravity (mSUGRA) model               
Block SMINPUTS   # Standard Model inputs
     1     1.27838768E+02   # alpha_em^(-1)
     2     1.16570000E-05   # G_Fermi
     3     1.17200002E-01   # alpha_s(M_Z)
     4     9.11699982E+01   # m_{Z}(pole)
     5     4.19999981E+00   # m_{b}(m_{b})
     6     1.72500000E+02   # m_{top}(pole)
     7     1.77699995E+00   # m_{tau}(pole)
Block MINPAR   # SUSY breaking input parameters
     1     1.30000000E+03   # m_0
     2     3.30000000E+02   # m_{1/2}
     3     1.00000000E+01   # tan(beta)
     4     1.00000000E+00   # sign(mu)
     5     0.00000000E+00   # A_0
Block EXTPAR   # Non-universal SUSY breaking parameters
     0     2.17129731E+16   # Input scale
Block MASS   # Scalar and gaugino mass spectrum
#  PDG code   mass                 particle
        24     8.04229965E+01   #  W^+
        25     1.12958237E+02   #  h^0            
        35     1.37360046E+03   #  H^0            
        36     1.36449634E+03   #  A^0            
        37     1.37618066E+03   #  H^+            
   1000001     1.46301782E+03   #  dnl            
   1000002     1.46083093E+03   #  upl            
   1000003     1.46301782E+03   #  stl            
   1000004     1.46083167E+03   #  chl            
   1000005     1.22938538E+03   #  b1             
   1000006     9.31598267E+02   #  t1             
   1000011     1.31603577E+03   #  el-            
   1000012     1.31375549E+03   #  nuel           
   1000013     1.31603577E+03   #  mul-           
   1000014     1.31375549E+03   #  numl           
   1000015     1.29215576E+03   #  tau1           
   1000016     1.30792432E+03   #  nutl           
   1000021     8.54251892E+02   #  glss           
   1000022     1.35762894E+02   #  z1ss           
   1000023     2.54270004E+02   #  z2ss           
   1000024     2.54994629E+02   #  w1ss           
   1000025    -4.38095795E+02   #  z3ss           
   1000035     4.57860291E+02   #  z4ss           
   1000037     4.57183533E+02   #  w2ss           
   2000001     1.45490869E+03   #  dnr            
   2000002     1.45492236E+03   #  upr            
   2000003     1.45490869E+03   #  str            
   2000004     1.45492310E+03   #  chr            
   2000005     1.43982556E+03   #  b2             
   2000006     1.24306836E+03   #  t2             
   2000011     1.30484180E+03   #  er-            
   2000013     1.30484180E+03   #  mur-           
   2000015     1.31063965E+03   #  tau2           
Block ALPHA   # Effective Higgs mixing parameter
         -1.00717478E-01   # alpha
Block STOPMIX   # stop mixing matrix
  1  1     1.23050198E-01   # O_{11}
  1  2     9.92400467E-01   # O_{12}
  2  1    -9.92400467E-01   # O_{21}
  2  2     1.23050198E-01   # O_{22}
Block SBOTMIX   # sbottom mixing matrix
  1  1     9.99731064E-01   # O_{11}
  1  2     2.31910124E-02   # O_{12}
  2  1    -2.31910124E-02   # O_{21}
  2  2     9.99731064E-01   # O_{22}
Block STAUMIX   # stau mixing matrix
  1  1     1.90709010E-01   # O_{11}
  1  2     9.81646597E-01   # O_{12}
  2  1    -9.81646597E-01   # O_{21}
  2  2     1.90709010E-01   # O_{22}
Block NMIX   # neutralino mixing matrix
  1  1     9.91060615E-01   #
  1  2    -3.50852907E-02   #
  1  3     1.19556874E-01   #
  1  4    -4.76863496E-02   #
  2  1    -7.35860839E-02   #
  2  2    -9.46189702E-01   #
  2  3     2.63180941E-01   #
  2  4    -1.73337922E-01   #
  3  1     4.78893965E-02   #
  3  2    -6.84861019E-02   #
  3  3    -6.99971914E-01   #
  3  4    -7.09264278E-01   #
  4  1    -1.00451380E-01   #
  4  2     3.14330786E-01   #
  4  3     6.53055727E-01   #
  4  4    -6.81633532E-01   #
Block UMIX   # chargino U mixing matrix
  1  1    -9.28108454E-01   # U_{11}
  1  2     3.72309983E-01   # U_{12}
  2  1    -3.72309983E-01   # U_{21}
  2  2    -9.28108454E-01   # U_{22}
Block VMIX   # chargino V mixing matrix
  1  1    -9.69529986E-01   # V_{11}
  1  2     2.44972691E-01   # V_{12}
  2  1    -2.44972691E-01   # V_{21}
  2  2    -9.69529986E-01   # V_{22}
Block GAUGE Q=  1.04009705E+03   #
     1     3.57521236E-01   # g`
     2     6.52373612E-01   # g_2
     3     1.21924329E+00   # g_3
Block YU Q=  1.04009705E+03   #
  3  3     8.62291634E-01   # y_t
Block YD Q=  1.04009705E+03   #
  3  3     1.34187683E-01   # y_b
Block YE Q=  1.04009705E+03   #
  3  3     1.01752177E-01   # y_tau
Block HMIX Q=  1.04009705E+03   # Higgs mixing parameters
     1     4.29322418E+02   # mu(Q)
     2     1.00000000E+01   # tan(beta)(M_GUT)
     3     2.51094864E+02   # Higgs vev at Q
     4     1.86185025E+06   # m_A^2(Q)
Block MSOFT Q=  1.04009705E+03   # DRbar SUSY breaking parameters
     1     1.38681076E+02   # M_1(Q)          
     2     2.57579620E+02   # M_2(Q)          
     3     7.53504578E+02   # M_3(Q)          
    31     1.31122632E+03   # MeL(Q)          
    32     1.31122632E+03   # MmuL(Q)         
    33     1.30551782E+03   # MtauL(Q)        
    34     1.30287549E+03   # MeR(Q)          
    35     1.30287549E+03   # MmuR(Q)         
    36     1.29119702E+03   # MtauR(Q)        
    41     1.42591956E+03   # MqL1(Q)         
    42     1.42591956E+03   # MqL2(Q)         
    43     1.19706018E+03   # MqL3(Q)         
    44     1.41944812E+03   # MuR(Q)          
    45     1.41944812E+03   # McR(Q)          
    46     9.03715515E+02   # MtR(Q)          
    47     1.41876831E+03   # MdR(Q)          
    48     1.41876831E+03   # MsR(Q)          
    49     1.41159351E+03   # MbR(Q)          
Block AU Q=  1.04009705E+03   #
  1  1    -5.71991943E+02   # A_u
  2  2    -5.71991943E+02   # A_c
  3  3    -5.71991943E+02   # A_t
Block AD Q=  1.04009705E+03   #
  1  1    -8.49914429E+02   # A_d
  2  2    -8.49914429E+02   # A_s
  3  3    -8.49914429E+02   # A_b
Block AE Q=  1.04009705E+03   #
  1  1    -1.96104248E+02   # A_e
  2  2    -1.96104248E+02   # A_mu
  3  3    -1.96104248E+02   # A_tau
#  ISAJET decay tables in SUSY Les Houches accord format
#  Created by ISALHD. Last revision: C. Balazs, 2005 May 25
Block DCINFO                           # Program information
     1   ISASUGRA from ISAJET          # Spectrum Calculator
     2   7.80   29-OCT-2009 12:50:36   # Version number
#         PDG         Width
DECAY         6  1.14680779E+00   # TP    decays
#          BR          NDA       ID1       ID2       ID3       ID4
      3.33333343E-01    3            2        -1         5             # TP     -->  UP     DB     BT          
      3.33333343E-01    3            4        -3         5             # TP     -->  CH     SB     BT          
      1.11111112E-01    3          -11        12         5             # TP     -->  E+     NUE    BT          
      1.11111112E-01    3          -13        14         5             # TP     -->  MU+    NUM    BT          
      1.11111112E-01    3          -15        16         5             # TP     -->  TAU+   NUT    BT          
#         PDG         Width
DECAY   1000021  7.99631421E-03   # GLSS  decays
#          BR          NDA       ID1       ID2       ID3       ID4
      5.98480925E-02    3      1000024         1        -2             # GLSS   -->  W1SS+  DN     UB          
      5.98480925E-02    3     -1000024         2        -1             # GLSS   -->  W1SS-  UP     DB          
      5.98480180E-02    3      1000024         3        -4             # GLSS   -->  W1SS+  ST     CB          
      5.98480180E-02    3     -1000024         4        -3             # GLSS   -->  W1SS-  CH     SB          
      6.95202574E-02    3      1000024         5        -6             # GLSS   -->  W1SS+  BT     TB          
      6.95202574E-02    3     -1000024         6        -5             # GLSS   -->  W1SS-  TP     BB          
      1.77498406E-03    3      1000037         1        -2             # GLSS   -->  W2SS+  DN     UB          
      1.77498406E-03    3     -1000037         2        -1             # GLSS   -->  W2SS-  UP     DB          
      1.77498255E-03    3      1000037         3        -4             # GLSS   -->  W2SS+  ST     CB          
      1.77498255E-03    3     -1000037         4        -3             # GLSS   -->  W2SS-  CH     SB          
      8.73356238E-02    3      1000037         5        -6             # GLSS   -->  W2SS+  BT     TB          
      8.73356238E-02    3     -1000037         6        -5             # GLSS   -->  W2SS-  TP     BB          
      7.30890577E-07    2      1000022        21                       # GLSS   -->  Z1SS   GL                 
      2.58329958E-02    3      1000022         2        -2             # GLSS   -->  Z1SS   UP     UB          
      8.36405158E-03    3      1000022         1        -1             # GLSS   -->  Z1SS   DN     DB          
      8.36405158E-03    3      1000022         3        -3             # GLSS   -->  Z1SS   ST     SB          
      2.58329343E-02    3      1000022         4        -4             # GLSS   -->  Z1SS   CH     CB          
      1.17734168E-02    3      1000022         5        -5             # GLSS   -->  Z1SS   BT     BB          
      9.07923430E-02    3      1000022         6        -6             # GLSS   -->  Z1SS   TP     TB          
      2.28256732E-03    2      1000023        21                       # GLSS   -->  Z2SS   GL                 
      3.08998171E-02    3      1000023         2        -2             # GLSS   -->  Z2SS   UP     UB          
      2.89102718E-02    3      1000023         1        -1             # GLSS   -->  Z2SS   DN     DB          
      2.89102718E-02    3      1000023         3        -3             # GLSS   -->  Z2SS   ST     SB          
      3.08997370E-02    3      1000023         4        -4             # GLSS   -->  Z2SS   CH     CB          
      6.98874518E-02    3      1000023         5        -5             # GLSS   -->  Z2SS   BT     BB          
      1.51063316E-02    3      1000023         6        -6             # GLSS   -->  Z2SS   TP     TB          
      1.51354475E-02    2      1000025        21                       # GLSS   -->  Z3SS   GL                 
      2.05513225E-05    3      1000025         2        -2             # GLSS   -->  Z3SS   UP     UB          
      2.65769504E-05    3      1000025         1        -1             # GLSS   -->  Z3SS   DN     DB          
      2.65769504E-05    3      1000025         3        -3             # GLSS   -->  Z3SS   ST     SB          
      2.05512679E-05    3      1000025         4        -4             # GLSS   -->  Z3SS   CH     CB          
      1.78842444E-03    3      1000025         5        -5             # GLSS   -->  Z3SS   BT     BB          
      8.03675223E-03    3      1000025         6        -6             # GLSS   -->  Z3SS   TP     TB          
      1.34236421E-02    2      1000035        21                       # GLSS   -->  Z4SS   GL                 
      8.52308178E-04    3      1000035         2        -2             # GLSS   -->  Z4SS   UP     UB          
      1.01847271E-03    3      1000035         1        -1             # GLSS   -->  Z4SS   DN     DB          
      1.01847271E-03    3      1000035         3        -3             # GLSS   -->  Z4SS   ST     SB          
      8.52306024E-04    3      1000035         4        -4             # GLSS   -->  Z4SS   CH     CB          
      3.95327713E-03    3      1000035         5        -5             # GLSS   -->  Z4SS   BT     BB          
      1.57656334E-02    3      1000035         6        -6             # GLSS   -->  Z4SS   TP     TB          
#         PDG         Width
DECAY   1000002  5.47670708E+01   # UPL   decays
#          BR          NDA       ID1       ID2       ID3       ID4
      2.36776192E-03    2      1000022         2                       # UPL    -->  Z1SS   UP                 
      9.72334146E-02    2      1000023         2                       # UPL    -->  Z2SS   UP                 
      3.31562129E-04    2      1000025         2                       # UPL    -->  Z3SS   UP                 
      7.99557380E-03    2      1000035         2                       # UPL    -->  Z4SS   UP                 
      6.82694077E-01    2      1000021         2                       # UPL    -->  GLSS   UP                 
      1.98412091E-01    2      1000024         1                       # UPL    -->  W1SS+  DN                 
      1.09653929E-02    2      1000037         1                       # UPL    -->  W2SS+  DN                 
#         PDG         Width
DECAY   1000001  5.48285942E+01   # DNL   decays
#          BR          NDA       ID1       ID2       ID3       ID4
      5.18177031E-03    2      1000022         1                       # DNL    -->  Z1SS   DN                 
      9.18978453E-02    2      1000023         1                       # DNL    -->  Z2SS   DN                 
      5.55598235E-04    2      1000025         1                       # DNL    -->  Z3SS   DN                 
      1.01185627E-02    2      1000035         1                       # DNL    -->  Z4SS   DN                 
      6.84969783E-01    2      1000021         1                       # DNL    -->  GLSS   DN                 
      1.81922644E-01    2     -1000024         2                       # DNL    -->  W1SS-  UP                 
      2.53537353E-02    2     -1000037         2                       # DNL    -->  W2SS-  UP                 
#         PDG         Width
DECAY   1000003  5.48285713E+01   # STL   decays
#          BR          NDA       ID1       ID2       ID3       ID4
      5.18177217E-03    2      1000022         3                       # STL    -->  Z1SS   ST                 
      9.18978825E-02    2      1000023         3                       # STL    -->  Z2SS   ST                 
      5.55598468E-04    2      1000025         3                       # STL    -->  Z3SS   ST                 
      1.01185665E-02    2      1000035         3                       # STL    -->  Z4SS   ST                 
      6.84970081E-01    2      1000021         3                       # STL    -->  GLSS   ST                 
      1.81922376E-01    2     -1000024         4                       # STL    -->  W1SS-  CH                 
      2.53536943E-02    2     -1000037         4                       # STL    -->  W2SS-  CH                 
#         PDG         Width
DECAY   1000004  5.47669792E+01   # CHL   decays
#          BR          NDA       ID1       ID2       ID3       ID4
      2.36776331E-03    2      1000022         4                       # CHL    -->  Z1SS   CH                 
      9.72334519E-02    2      1000023         4                       # CHL    -->  Z2SS   CH                 
      3.31562274E-04    2      1000025         4                       # CHL    -->  Z3SS   CH                 
      7.99557753E-03    2      1000035         4                       # CHL    -->  Z4SS   CH                 
      6.82693660E-01    2      1000021         4                       # CHL    -->  GLSS   CH                 
      1.98412567E-01    2      1000024         3                       # CHL    -->  W1SS+  ST                 
      1.09654171E-02    2      1000037         3                       # CHL    -->  W2SS+  ST                 
#         PDG         Width
DECAY   1000005  4.81023064E+01   # BT1   decays
#          BR          NDA       ID1       ID2       ID3       ID4
      5.16328495E-03    2      1000022         5                       # BT1    -->  Z1SS   BT                 
      8.66074711E-02    2      1000023         5                       # BT1    -->  Z2SS   BT                 
      3.96085810E-03    2      1000025         5                       # BT1    -->  Z3SS   BT                 
      1.16122989E-02    2      1000035         5                       # BT1    -->  Z4SS   BT                 
      4.11199838E-01    2      1000021         5                       # BT1    -->  GLSS   BT                 
      1.75354153E-01    2     -1000024         6                       # BT1    -->  W1SS-  TP                 
      2.79945254E-01    2     -1000037         6                       # BT1    -->  W2SS-  TP                 
      2.61568557E-02    2          -24   1000006                       # BT1    -->  W-     TP1                
#         PDG         Width
DECAY   1000006  1.72952843E+01   # TP1   decays
#          BR          NDA       ID1       ID2       ID3       ID4
      1.07871518E-01    2      1000022         6                       # TP1    -->  Z1SS   TP                 
      3.42147835E-02    2      1000023         6                       # TP1    -->  Z2SS   TP                 
      2.27744430E-01    2      1000025         6                       # TP1    -->  Z3SS   TP                 
      1.63987949E-01    2      1000035         6                       # TP1    -->  Z4SS   TP                 
      7.39454925E-02    2      1000024         5                       # TP1    -->  W1SS+  BT                 
      3.92235816E-01    2      1000037         5                       # TP1    -->  W2SS+  BT                 
#         PDG         Width
DECAY   2000002  4.01627007E+01   # UPR   decays
#          BR          NDA       ID1       ID2       ID3       ID4
      7.90382698E-02    2      1000022         2                       # UPR    -->  Z1SS   UP                 
      4.16755851E-04    2      1000023         2                       # UPR    -->  Z2SS   UP                 
      1.55294474E-04    2      1000025         2                       # UPR    -->  Z3SS   UP                 
      6.70751091E-04    2      1000035         2                       # UPR    -->  Z4SS   UP                 
      9.19718921E-01    2      1000021         2                       # UPR    -->  GLSS   UP                 
#         PDG         Width
DECAY   2000001  3.77434273E+01   # DNR   decays
#          BR          NDA       ID1       ID2       ID3       ID4
      2.10259091E-02    2      1000022         1                       # DNR    -->  Z1SS   DN                 
      1.10866080E-04    2      1000023         1                       # DNR    -->  Z2SS   DN                 
      4.13115849E-05    2      1000025         1                       # DNR    -->  Z3SS   DN                 
      1.78433780E-04    2      1000035         1                       # DNR    -->  Z4SS   DN                 
      9.78643477E-01    2      1000021         1                       # DNR    -->  GLSS   DN                 
#         PDG         Width
DECAY   2000003  3.77434273E+01   # STR   decays
#          BR          NDA       ID1       ID2       ID3       ID4
      2.10259091E-02    2      1000022         3                       # STR    -->  Z1SS   ST                 
      1.10866080E-04    2      1000023         3                       # STR    -->  Z2SS   ST                 
      4.13115849E-05    2      1000025         3                       # STR    -->  Z3SS   ST                 
      1.78433780E-04    2      1000035         3                       # STR    -->  Z4SS   ST                 
      9.78643477E-01    2      1000021         3                       # STR    -->  GLSS   ST                 
#         PDG         Width
DECAY   2000004  4.01626091E+01   # CHR   decays
#          BR          NDA       ID1       ID2       ID3       ID4
      7.90383518E-02    2      1000022         4                       # CHR    -->  Z1SS   CH                 
      4.16756287E-04    2      1000023         4                       # CHR    -->  Z2SS   CH                 
      1.55294620E-04    2      1000025         4                       # CHR    -->  Z3SS   CH                 
      6.70751615E-04    2      1000035         4                       # CHR    -->  Z4SS   CH                 
      9.19718862E-01    2      1000021         4                       # CHR    -->  GLSS   CH                 
#         PDG         Width
DECAY   2000005  3.75184402E+01   # BT2   decays
#          BR          NDA       ID1       ID2       ID3       ID4
      2.09638812E-02    2      1000022         5                       # BT2    -->  Z1SS   BT                 
      6.12525619E-04    2      1000023         5                       # BT2    -->  Z2SS   BT                 
      5.92732430E-03    2      1000025         5                       # BT2    -->  Z3SS   BT                 
      5.55018988E-03    2      1000035         5                       # BT2    -->  Z4SS   BT                 
      9.53479171E-01    2      1000021         5                       # BT2    -->  GLSS   BT                 
      9.74426453E-04    2     -1000024         6                       # BT2    -->  W1SS-  TP                 
      1.09437900E-02    2     -1000037         6                       # BT2    -->  W2SS-  TP                 
      7.96183085E-05    2          -24   1000006                       # BT2    -->  W-     TP1                
      3.43731692E-04    2          -24   2000006                       # BT2    -->  W-     TP2                
      2.04976182E-04    2           23   1000005                       # BT2    -->  Z0     BT1                
      9.20260441E-04    2           25   1000005                       # BT2    -->  HL0    BT1                
#         PDG         Width
DECAY   2000006  4.55682716E+01   # TP2   decays
#          BR          NDA       ID1       ID2       ID3       ID4
      3.56737316E-01    2      1000021         6                       # TP2    -->  GLSS   TP                 
      1.80680797E-01    2      1000024         5                       # TP2    -->  W1SS+  BT                 
      3.38402167E-02    2      1000037         5                       # TP2    -->  W2SS+  BT                 
      1.52208041E-02    2           23   1000006                       # TP2    -->  Z0     TP1                
      2.50135269E-02    2           25   1000006                       # TP2    -->  HL0    TP1                
      2.62648100E-03    2      1000022         6                       # TP2    -->  Z1SS   TP                 
      9.12205875E-02    2      1000023         6                       # TP2    -->  Z2SS   TP                 
      1.38552278E-01    2      1000025         6                       # TP2    -->  Z3SS   TP                 
      1.56107992E-01    2      1000035         6                       # TP2    -->  Z4SS   TP                 
#         PDG         Width
DECAY   1000011  1.67286396E+01   # EL-   decays
#          BR          NDA       ID1       ID2       ID3       ID4
      8.41827393E-02    2      1000022        11                       # EL-    -->  Z1SS   E-                 
      2.98735321E-01    2      1000023        11                       # EL-    -->  Z2SS   E-                 
      4.65487712E-04    2      1000025        11                       # EL-    -->  Z3SS   E-                 
      1.71775315E-02    2      1000035        11                       # EL-    -->  Z4SS   E-                 
      5.28456748E-01    2     -1000024        12                       # EL-    -->  W1SS-  NUE                
      7.09822103E-02    2     -1000037        12                       # EL-    -->  W2SS-  NUE                
#         PDG         Width
DECAY   1000013  1.67286396E+01   # MUL-  decays
#          BR          NDA       ID1       ID2       ID3       ID4
      8.41827393E-02    2      1000022        13                       # MUL-   -->  Z1SS   MU-                
      2.98735321E-01    2      1000023        13                       # MUL-   -->  Z2SS   MU-                
      4.65487712E-04    2      1000025        13                       # MUL-   -->  Z3SS   MU-                
      1.71775315E-02    2      1000035        13                       # MUL-   -->  Z4SS   MU-                
      5.28456748E-01    2     -1000024        14                       # MUL-   -->  W1SS-  NUM                
      7.09822103E-02    2     -1000037        14                       # MUL-   -->  W2SS-  NUM                
#         PDG         Width
DECAY   1000015  7.25878859E+00   # TAU1- decays
#          BR          NDA       ID1       ID2       ID3       ID4
      8.49919021E-01    2      1000022        15                       # TAU1-  -->  Z1SS   TAU-               
      4.52730693E-02    2      1000023        15                       # TAU1-  -->  Z2SS   TAU-               
      1.29447551E-02    2      1000025        15                       # TAU1-  -->  Z3SS   TAU-               
      8.89617950E-03    2      1000035        15                       # TAU1-  -->  Z4SS   TAU-               
      7.66324401E-02    2     -1000024        16                       # TAU1-  -->  W1SS-  NUT                
      6.33453391E-03    2     -1000037        16                       # TAU1-  -->  W2SS-  NUT                
#         PDG         Width
DECAY   1000012  1.67852306E+01   # NUEL  decays
#          BR          NDA       ID1       ID2       ID3       ID4
      1.08397618E-01    2      1000022        12                       # NUEL   -->  Z1SS   NUE                
      2.50408769E-01    2      1000023        12                       # NUEL   -->  Z2SS   NUE                
      2.33931281E-03    2      1000025        12                       # NUEL   -->  Z3SS   NUE                
      3.47253494E-02    2      1000035        12                       # NUEL   -->  Z4SS   NUE                
      5.73583841E-01    2      1000024        11                       # NUEL   -->  W1SS+  E-                 
      3.05450950E-02    2      1000037        11                       # NUEL   -->  W2SS+  E-                 
#         PDG         Width
DECAY   1000014  1.67852306E+01   # NUML  decays
#          BR          NDA       ID1       ID2       ID3       ID4
      1.08397618E-01    2      1000022        14                       # NUML   -->  Z1SS   NUM                
      2.50408769E-01    2      1000023        14                       # NUML   -->  Z2SS   NUM                
      2.33931281E-03    2      1000025        14                       # NUML   -->  Z3SS   NUM                
      3.47253494E-02    2      1000035        14                       # NUML   -->  Z4SS   NUM                
      5.73583841E-01    2      1000024        13                       # NUML   -->  W1SS+  MU-                
      3.05450950E-02    2      1000037        13                       # NUML   -->  W2SS+  MU-                
#         PDG         Width
DECAY   1000016  1.69198437E+01   # NUTL  decays
#          BR          NDA       ID1       ID2       ID3       ID4
      1.07037261E-01    2      1000022        16                       # NUTL   -->  Z1SS   NUT                
      2.47141942E-01    2      1000023        16                       # NUTL   -->  Z2SS   NUT                
      2.30523734E-03    2      1000025        16                       # NUTL   -->  Z3SS   NUT                
      3.42114791E-02    2      1000035        16                       # NUTL   -->  Z4SS   NUT                
      5.68181992E-01    2      1000024        15                       # NUTL   -->  W1SS+  TAU-               
      4.11220714E-02    2      1000037        15                       # NUTL   -->  W2SS+  TAU-               
      6.07627837E-10    3      1000015        16       -15             # NUTL   -->  TAU1-  NUT    TAU+        
      6.07627837E-10    3      1000015        12       -11             # NUTL   -->  TAU1-  NUE    E+          
      6.07627837E-10    3      1000015        14       -13             # NUTL   -->  TAU1-  NUM    MU+         
      1.82288362E-09    3      1000015         2        -1             # NUTL   -->  TAU1-  UP     DB          
      1.82288362E-09    3      1000015         4        -3             # NUTL   -->  TAU1-  CH     SB          
#         PDG         Width
DECAY   2000011  6.47500420E+00   # ER-   decays
#          BR          NDA       ID1       ID2       ID3       ID4
      9.85060334E-01    2      1000022        11                       # ER-    -->  Z1SS   E-                 
      5.13667986E-03    2      1000023        11                       # ER-    -->  Z2SS   E-                 
      1.85059488E-03    2      1000025        11                       # ER-    -->  Z3SS   E-                 
      7.95248244E-03    2      1000035        11                       # ER-    -->  Z4SS   E-                 
#         PDG         Width
DECAY   2000013  6.47500420E+00   # MUR-  decays
#          BR          NDA       ID1       ID2       ID3       ID4
      9.85060334E-01    2      1000022        13                       # MUR-   -->  Z1SS   MU-                
      5.13667986E-03    2      1000023        13                       # MUR-   -->  Z2SS   MU-                
      1.85059488E-03    2      1000025        13                       # MUR-   -->  Z3SS   MU-                
      7.95248244E-03    2      1000035        13                       # MUR-   -->  Z4SS   MU-                
#         PDG         Width
DECAY   2000015  1.64506550E+01   # TAU2- decays
#          BR          NDA       ID1       ID2       ID3       ID4
      9.46056023E-02    2      1000022        15                       # TAU2-  -->  Z1SS   TAU-               
      2.86238343E-01    2      1000023        15                       # TAU2-  -->  Z2SS   TAU-               
      8.55361484E-03    2      1000025        15                       # TAU2-  -->  Z3SS   TAU-               
      2.77446453E-02    2      1000035        15                       # TAU2-  -->  Z4SS   TAU-               
      5.02653062E-01    2     -1000024        16                       # TAU2-  -->  W1SS-  NUT                
      8.02046731E-02    2     -1000037        16                       # TAU2-  -->  W2SS-  NUT                
#         PDG         Width
DECAY   1000023  8.20050482E-03   # Z2SS  decays
#          BR          NDA       ID1       ID2       ID3       ID4
      2.63659172E-06    2      1000022        22                       # Z2SS   -->  Z1SS   GM                 
      1.66676462E-01    2      1000022        23                       # Z2SS   -->  Z1SS   Z0                 
      1.58114105E-07    3      1000022         2        -2             # Z2SS   -->  Z1SS   UP     UB          
      3.01704063E-07    3      1000022         1        -1             # Z2SS   -->  Z1SS   DN     DB          
      3.01704063E-07    3      1000022         3        -3             # Z2SS   -->  Z1SS   ST     SB          
      1.58113778E-07    3      1000022         4        -4             # Z2SS   -->  Z1SS   CH     CB          
      7.15822011E-07    3      1000022         5        -5             # Z2SS   -->  Z1SS   BT     BB          
      9.87510020E-07    3      1000022        11       -11             # Z2SS   -->  Z1SS   E-     E+          
      9.87510020E-07    3      1000022        13       -13             # Z2SS   -->  Z1SS   MU-    MU+         
      1.04921162E-06    3      1000022        15       -15             # Z2SS   -->  Z1SS   TAU-   TAU+        
      1.05141305E-06    3      1000022        12       -12             # Z2SS   -->  Z1SS   NUE    ANUE        
      1.05141305E-06    3      1000022        14       -14             # Z2SS   -->  Z1SS   NUM    ANUM        
      1.07073208E-06    3      1000022        16       -16             # Z2SS   -->  Z1SS   NUT    ANUT        
      8.33313107E-01    2      1000022        25                       # Z2SS   -->  Z1SS   HL0                
#         PDG         Width
DECAY   1000025  2.04304528E+00   # Z3SS  decays
#          BR          NDA       ID1       ID2       ID3       ID4
      1.10406830E-08    2      1000022        22                       # Z3SS   -->  Z1SS   GM                 
      6.11112284E-07    2      1000023        22                       # Z3SS   -->  Z2SS   GM                 
      2.97296673E-01    2      1000024       -24                       # Z3SS   -->  W1SS+  W-                 
      2.97296673E-01    2     -1000024        24                       # Z3SS   -->  W1SS-  W+                 
      1.24414660E-01    2      1000022        23                       # Z3SS   -->  Z1SS   Z0                 
      2.50713497E-01    2      1000023        23                       # Z3SS   -->  Z2SS   Z0                 
      6.19951035E-10    3      1000022         2        -2             # Z3SS   -->  Z1SS   UP     UB          
      2.68829653E-10    3      1000022         1        -1             # Z3SS   -->  Z1SS   DN     DB          
      2.68829653E-10    3      1000022         3        -3             # Z3SS   -->  Z1SS   ST     SB          
      6.19949703E-10    3      1000022         4        -4             # Z3SS   -->  Z1SS   CH     CB          
      4.80184070E-08    3      1000022         5        -5             # Z3SS   -->  Z1SS   BT     BB          
      1.68739811E-09    3      1000022        11       -11             # Z3SS   -->  Z1SS   E-     E+          
      1.68739811E-09    3      1000022        13       -13             # Z3SS   -->  Z1SS   MU-    MU+         
      4.64605279E-08    3      1000022        15       -15             # Z3SS   -->  Z1SS   TAU-   TAU+        
      1.32636557E-09    3      1000022        12       -12             # Z3SS   -->  Z1SS   NUE    ANUE        
      1.32636557E-09    3      1000022        14       -14             # Z3SS   -->  Z1SS   NUM    ANUM        
      1.35172118E-09    3      1000022        16       -16             # Z3SS   -->  Z1SS   NUT    ANUT        
      3.84935611E-10    3      1000023         2        -2             # Z3SS   -->  Z2SS   UP     UB          
      6.04204353E-10    3      1000023         1        -1             # Z3SS   -->  Z2SS   DN     DB          
      6.04204353E-10    3      1000023         3        -3             # Z3SS   -->  Z2SS   ST     SB          
      3.84934751E-10    3      1000023         4        -4             # Z3SS   -->  Z2SS   CH     CB          
      3.58453534E-08    3      1000023         5        -5             # Z3SS   -->  Z2SS   BT     BB          
      1.06846844E-10    3      1000023        11       -11             # Z3SS   -->  Z2SS   E-     E+          
      1.06846844E-10    3      1000023        13       -13             # Z3SS   -->  Z2SS   MU-    MU+         
      6.06626127E-09    3      1000023        15       -15             # Z3SS   -->  Z2SS   TAU-   TAU+        
      4.53730858E-10    3      1000023        12       -12             # Z3SS   -->  Z2SS   NUE    ANUE        
      4.53730858E-10    3      1000023        14       -14             # Z3SS   -->  Z2SS   NUM    ANUM        
      4.62547028E-10    3      1000023        16       -16             # Z3SS   -->  Z2SS   NUT    ANUT        
      2.12625992E-02    2      1000022        25                       # Z3SS   -->  Z1SS   HL0                
      9.01516341E-03    2      1000023        25                       # Z3SS   -->  Z2SS   HL0                
#         PDG         Width
DECAY   1000035  2.40206838E+00   # Z4SS  decays
#          BR          NDA       ID1       ID2       ID3       ID4
      9.51894744E-11    2      1000022        22                       # Z4SS   -->  Z1SS   GM                 
      1.36601841E-07    2      1000023        22                       # Z4SS   -->  Z2SS   GM                 
      4.31181268E-09    2      1000025        22                       # Z4SS   -->  Z3SS   GM                 
      3.38706970E-01    2      1000024       -24                       # Z4SS   -->  W1SS+  W-                 
      3.38706970E-01    2     -1000024        24                       # Z4SS   -->  W1SS-  W+                 
      2.22894046E-02    2      1000022        23                       # Z4SS   -->  Z1SS   Z0                 
      1.53684430E-02    2      1000023        23                       # Z4SS   -->  Z2SS   Z0                 
      9.81962867E-09    3      1000022         2        -2             # Z4SS   -->  Z1SS   UP     UB          
      1.09674314E-08    3      1000022         1        -1             # Z4SS   -->  Z1SS   DN     DB          
      1.09674314E-08    3      1000022         3        -3             # Z4SS   -->  Z1SS   ST     SB          
      9.81960913E-09    3      1000022         4        -4             # Z4SS   -->  Z1SS   CH     CB          
      5.64202125E-08    3      1000022         5        -5             # Z4SS   -->  Z1SS   BT     BB          
      3.44499114E-08    3      1000022        11       -11             # Z4SS   -->  Z1SS   E-     E+          
      3.44499114E-08    3      1000022        13       -13             # Z4SS   -->  Z1SS   MU-    MU+         
      7.59458274E-08    3      1000022        15       -15             # Z4SS   -->  Z1SS   TAU-   TAU+        
      4.91059886E-08    3      1000022        12       -12             # Z4SS   -->  Z1SS   NUE    ANUE        
      4.91059886E-08    3      1000022        14       -14             # Z4SS   -->  Z1SS   NUM    ANUM        
      5.00416739E-08    3      1000022        16       -16             # Z4SS   -->  Z1SS   NUT    ANUT        
      3.50895561E-08    3      1000023         2        -2             # Z4SS   -->  Z2SS   UP     UB          
      4.16293702E-08    3      1000023         1        -1             # Z4SS   -->  Z2SS   DN     DB          
      4.16293702E-08    3      1000023         3        -3             # Z4SS   -->  Z2SS   ST     SB          
      3.50894815E-08    3      1000023         4        -4             # Z4SS   -->  Z2SS   CH     CB          
      1.19896043E-07    3      1000023         5        -5             # Z4SS   -->  Z2SS   BT     BB          
      1.48519170E-08    3      1000023        11       -11             # Z4SS   -->  Z2SS   E-     E+          
      1.48519170E-08    3      1000023        13       -13             # Z4SS   -->  Z2SS   MU-    MU+         
      2.03908268E-08    3      1000023        15       -15             # Z4SS   -->  Z2SS   TAU-   TAU+        
      2.56160870E-08    3      1000023        12       -12             # Z4SS   -->  Z2SS   NUE    ANUE        
      2.56160870E-08    3      1000023        14       -14             # Z4SS   -->  Z2SS   NUM    ANUM        
      2.61141686E-08    3      1000023        16       -16             # Z4SS   -->  Z2SS   NUT    ANUT        
      1.35499818E-07    3      1000025         2        -2             # Z4SS   -->  Z3SS   UP     UB          
      1.74791111E-07    3      1000025         1        -1             # Z4SS   -->  Z3SS   DN     DB          
      1.74791111E-07    3      1000025         3        -3             # Z4SS   -->  Z3SS   ST     SB          
      1.35499818E-07    3      1000025         4        -4             # Z4SS   -->  Z3SS   CH     CB          
      8.45566959E-08    3      1000025         5        -5             # Z4SS   -->  Z3SS   BT     BB          
      3.96491195E-08    3      1000025        11       -11             # Z4SS   -->  Z3SS   E-     E+          
      3.96491195E-08    3      1000025        13       -13             # Z4SS   -->  Z3SS   MU-    MU+         
      3.55224863E-08    3      1000025        15       -15             # Z4SS   -->  Z3SS   TAU-   TAU+        
      7.88531764E-08    3      1000025        12       -12             # Z4SS   -->  Z3SS   NUE    ANUE        
      7.88531764E-08    3      1000025        14       -14             # Z4SS   -->  Z3SS   NUM    ANUM        
      7.88529277E-08    3      1000025        16       -16             # Z4SS   -->  Z3SS   NUT    ANUT        
      9.13013592E-02    2      1000022        25                       # Z4SS   -->  Z1SS   HL0                
      1.93624586E-01    2      1000023        25                       # Z4SS   -->  Z2SS   HL0                
#         PDG         Width
DECAY   1000024  1.08243143E-02   # W1SS+ decays
#          BR          NDA       ID1       ID2       ID3       ID4
      3.42207215E-07    3      1000022         2        -1             # W1SS+  -->  Z1SS   UP     DB          
      3.42206903E-07    3      1000022         4        -3             # W1SS+  -->  Z1SS   CH     SB          
      1.58931948E-06    3      1000022       -11        12             # W1SS+  -->  Z1SS   E+     NUE         
      1.58931948E-06    3      1000022       -13        14             # W1SS+  -->  Z1SS   MU+    NUM         
      1.65332369E-06    3      1000022       -15        16             # W1SS+  -->  Z1SS   TAU+   NUT         
      9.99994516E-01    2      1000022        24                       # W1SS+  -->  Z1SS   W+                 
      9.71600231E-12    3      1000023       -11        12             # W1SS+  -->  Z2SS   E+     NUE         
      9.71600231E-12    3      1000023       -13        14             # W1SS+  -->  Z2SS   MU+    NUM         
#         PDG         Width
DECAY   1000037  2.17065716E+00   # W2SS+ decays
#          BR          NDA       ID1       ID2       ID3       ID4
      1.62575198E-08    3      1000022         2        -1             # W2SS+  -->  Z1SS   UP     DB          
      1.62575127E-08    3      1000022         4        -3             # W2SS+  -->  Z1SS   CH     SB          
      6.48823431E-08    3      1000022       -11        12             # W2SS+  -->  Z1SS   E+     NUE         
      6.48823431E-08    3      1000022       -13        14             # W2SS+  -->  Z1SS   MU+    NUM         
      1.11723644E-07    3      1000022       -15        16             # W2SS+  -->  Z1SS   TAU+   NUT         
      1.00719981E-01    2      1000022        24                       # W2SS+  -->  Z1SS   W+                 
      3.24269926E-08    3      1000023         2        -1             # W2SS+  -->  Z2SS   UP     DB          
      3.24269820E-08    3      1000023         4        -3             # W2SS+  -->  Z2SS   CH     SB          
      1.84799038E-08    3      1000023       -11        12             # W2SS+  -->  Z2SS   E+     NUE         
      1.84799038E-08    3      1000023       -13        14             # W2SS+  -->  Z2SS   MU+    NUM         
      2.71049654E-08    3      1000023       -15        16             # W2SS+  -->  Z2SS   TAU+   NUT         
      3.43246818E-01    2      1000023        24                       # W2SS+  -->  Z2SS   W+                 
      4.45328453E-07    3      1000025         2        -1             # W2SS+  -->  Z3SS   UP     DB          
      4.45328453E-07    3      1000025         4        -3             # W2SS+  -->  Z3SS   CH     SB          
      1.48430857E-07    3      1000025       -11        12             # W2SS+  -->  Z3SS   E+     NUE         
      1.48430857E-07    3      1000025       -13        14             # W2SS+  -->  Z3SS   MU+    NUM         
      1.48447072E-07    3      1000025       -15        16             # W2SS+  -->  Z3SS   TAU+   NUT         
      3.10716510E-01    2      1000024        23                       # W2SS+  -->  W1SS+  Z0                 
      3.60814028E-08    3      1000024         1        -1             # W2SS+  -->  W1SS+  DN     DB          
      3.60813317E-08    3      1000024         3        -3             # W2SS+  -->  W1SS+  ST     SB          
      7.58860921E-08    3      1000024         2        -2             # W2SS+  -->  W1SS+  UP     UB          
      7.58860921E-08    3      1000024         4        -4             # W2SS+  -->  W1SS+  CH     CB          
      3.98657640E-08    3      1000024        12       -12             # W2SS+  -->  W1SS+  NUE    ANUE        
      3.98657640E-08    3      1000024        14       -14             # W2SS+  -->  W1SS+  NUM    ANUM        
      4.31623306E-08    3      1000024        16       -16             # W2SS+  -->  W1SS+  NUT    ANUT        
      1.89764133E-08    3      1000024        11       -11             # W2SS+  -->  W1SS+  E-     E+          
      1.89764133E-08    3      1000024        13       -13             # W2SS+  -->  W1SS+  MU-    MU+         
      1.93458902E-08    3      1000024        15       -15             # W2SS+  -->  W1SS+  TAU-   TAU+        
      2.45314658E-01    2      1000024        25                       # W2SS+  -->  W1SS+  HL0                
#         PDG         Width
DECAY        25  3.99236288E-03   # HL0   decays
#          BR          NDA       ID1       ID2       ID3       ID4
      4.90956387E-09    2           11       -11                       # HL0    -->  E-     E+                 
      2.07289573E-04    2           13       -13                       # HL0    -->  MU-    MU+                
      5.92830852E-02    2           15       -15                       # HL0    -->  TAU-   TAU+               
      6.16368561E-06    2            1        -1                       # HL0    -->  DN     DB                 
      2.49043759E-03    2            3        -3                       # HL0    -->  ST     SB                 
      8.18489492E-01    2            5        -5                       # HL0    -->  BT     BB                 
      1.93104711E-06    2            2        -2                       # HL0    -->  UP     UB                 
      3.64521593E-02    2            4        -4                       # HL0    -->  CH     CB                 
      1.75636227E-03    2           22        22                       # HL0    -->  GM     GM                 
      3.76240984E-02    2           21        21                       # HL0    -->  GL     GL                 
      2.27912026E-03    3           24        11       -12             # HL0    -->  W+     E-     ANUE        
      2.27912026E-03    3           24        13       -14             # HL0    -->  W+     MU-    ANUM        
      2.27912026E-03    3           24        15       -16             # HL0    -->  W+     TAU-   ANUT        
      6.83736103E-03    3           24        -2         1             # HL0    -->  W+     UB     DN          
      6.83736103E-03    3           24        -4         3             # HL0    -->  W+     CB     ST          
      2.27912026E-03    3          -24       -11        12             # HL0    -->  W-     E+     NUE         
      2.27912026E-03    3          -24       -13        14             # HL0    -->  W-     MU+    NUM         
      2.27912026E-03    3          -24       -15        16             # HL0    -->  W-     TAU+   NUT         
      6.83736103E-03    3          -24         2        -1             # HL0    -->  W-     UP     DB          
      6.83736103E-03    3          -24         4        -3             # HL0    -->  W-     CH     SB          
      1.82260206E-04    3           23        12       -12             # HL0    -->  Z0     NUE    ANUE        
      1.82260206E-04    3           23        14       -14             # HL0    -->  Z0     NUM    ANUM        
      1.82260206E-04    3           23        16       -16             # HL0    -->  Z0     NUT    ANUT        
      9.17297366E-05    3           23        11       -11             # HL0    -->  Z0     E-     E+          
      9.17297366E-05    3           23        13       -13             # HL0    -->  Z0     MU-    MU+         
      9.17297366E-05    3           23        15       -15             # HL0    -->  Z0     TAU-   TAU+        
      3.14258301E-04    3           23         2        -2             # HL0    -->  Z0     UP     UB          
      3.14258301E-04    3           23         4        -4             # HL0    -->  Z0     CH     CB          
      4.04842140E-04    3           23         1        -1             # HL0    -->  Z0     DN     DB          
      4.04842140E-04    3           23         3        -3             # HL0    -->  Z0     ST     SB          
      4.04842140E-04    3           23         5        -5             # HL0    -->  Z0     BT     BB          
#         PDG         Width
DECAY        35  1.69532146E+01   # HH0   decays
#          BR          NDA       ID1       ID2       ID3       ID4
      1.37660627E-09    2           11       -11                       # HH0    -->  E-     E+                 
      5.81227978E-05    2           13       -13                       # HH0    -->  MU-    MU+                
      1.66470949E-02    2           15       -15                       # HH0    -->  TAU-   TAU+               
      1.68214081E-06    2            1        -1                       # HH0    -->  DN     DB                 
      6.79669960E-04    2            3        -3                       # HH0    -->  ST     SB                 
      9.38707367E-02    2            5        -5                       # HH0    -->  BT     BB                 
      5.49695289E-11    2            2        -2                       # HH0    -->  UP     UB                 
      7.46691740E-07    2            4        -4                       # HH0    -->  CH     CB                 
      3.65829095E-02    2            6        -6                       # HH0    -->  TP     TB                 
      4.89501076E-07    2           22        22                       # HH0    -->  GM     GM                 
      1.65110505E-05    2           21        21                       # HH0    -->  GL     GL                 
      5.36027619E-05    2           24       -24                       # HH0    -->  W+     W-                 
      2.73527749E-05    2           23        23                       # HH0    -->  Z0     Z0                 
      2.81468686E-03    2      1000022   1000022                       # HH0    -->  Z1SS   Z1SS               
      1.79950446E-02    2      1000022   1000023                       # HH0    -->  Z1SS   Z2SS               
      5.42517416E-02    2      1000022   1000025                       # HH0    -->  Z1SS   Z3SS               
      2.11302675E-02    2      1000022   1000035                       # HH0    -->  Z1SS   Z4SS               
      2.67976895E-02    2      1000023   1000023                       # HH0    -->  Z2SS   Z2SS               
      1.29538432E-01    2      1000023   1000025                       # HH0    -->  Z2SS   Z3SS               
      4.01098691E-02    2      1000023   1000035                       # HH0    -->  Z2SS   Z4SS               
      1.65067823E-03    2      1000025   1000025                       # HH0    -->  Z3SS   Z3SS               
      2.96667852E-02    2      1000025   1000035                       # HH0    -->  Z3SS   Z4SS               
      1.30300978E-02    2      1000035   1000035                       # HH0    -->  Z4SS   Z4SS               
      6.17472194E-02    2      1000024  -1000024                       # HH0    -->  W1SS+  W1SS-              
      1.02237966E-02    2      1000037  -1000037                       # HH0    -->  W2SS+  W2SS-              
      2.21469417E-01    2      1000024  -1000037                       # HH0    -->  W1SS+  W2SS-              
      2.21469417E-01    2     -1000024   1000037                       # HH0    -->  W1SS-  W2SS+              
      1.65859456E-04    2           25        25                       # HH0    -->  HL0    HL0                
#         PDG         Width
DECAY        36  1.67850895E+01   # HA0   decays
#          BR          NDA       ID1       ID2       ID3       ID4
      1.38147072E-09    2           11       -11                       # HA0    -->  E-     E+                 
      5.83281835E-05    2           13       -13                       # HA0    -->  MU-    MU+                
      1.67060290E-02    2           15       -15                       # HA0    -->  TAU-   TAU+               
      1.68817235E-06    2            1        -1                       # HA0    -->  DN     DB                 
      6.82107056E-04    2            3        -3                       # HA0    -->  ST     SB                 
      9.42095071E-02    2            5        -5                       # HA0    -->  BT     BB                 
      5.40161006E-11    2            2        -2                       # HA0    -->  UP     UB                 
      7.34299704E-07    2            4        -4                       # HA0    -->  CH     CB                 
      3.79253142E-02    2            6        -6                       # HA0    -->  TP     TB                 
      3.50154977E-07    2           22        22                       # HA0    -->  GM     GM                 
      2.64900773E-05    2           21        21                       # HA0    -->  GL     GL                 
      3.45034408E-03    2      1000022   1000022                       # HA0    -->  Z1SS   Z1SS               
      2.43189726E-02    2      1000022   1000023                       # HA0    -->  Z1SS   Z2SS               
      3.07314266E-02    2      1000022   1000025                       # HA0    -->  Z1SS   Z3SS               
      3.87805663E-02    2      1000022   1000035                       # HA0    -->  Z1SS   Z4SS               
      4.05900367E-02    2      1000023   1000023                       # HA0    -->  Z2SS   Z2SS               
      6.33707568E-02    2      1000023   1000025                       # HA0    -->  Z2SS   Z3SS               
      8.43890011E-02    2      1000023   1000035                       # HA0    -->  Z2SS   Z4SS               
      1.84747763E-03    2      1000025   1000025                       # HA0    -->  Z3SS   Z3SS               
      1.31536489E-02    2      1000025   1000035                       # HA0    -->  Z3SS   Z4SS               
      3.56828421E-02    2      1000035   1000035                       # HA0    -->  Z4SS   Z4SS               
      9.25302282E-02    2      1000024  -1000024                       # HA0    -->  W1SS+  W1SS-              
      3.49097662E-02    2      1000037  -1000037                       # HA0    -->  W2SS+  W2SS-              
      1.93290651E-01    2      1000024  -1000037                       # HA0    -->  W1SS+  W2SS-              
      1.93290651E-01    2     -1000024   1000037                       # HA0    -->  W1SS-  W2SS+              
      5.30356592E-05    2           25        23                       # HA0    -->  HL0    Z0                 
#         PDG         Width
DECAY        37  1.66968594E+01   # H+    decays
#          BR          NDA       ID1       ID2       ID3       ID4
      1.40066281E-09    2           12       -11                       # H+     -->  NUE    E+                 
      5.91385142E-05    2           14       -13                       # H+     -->  NUM    MU+                
      1.69381220E-02    2           16       -15                       # H+     -->  NUT    TAU+               
      1.57723855E-06    2            2        -1                       # H+     -->  UP     DB                 
      6.37947873E-04    2            4        -3                       # H+     -->  CH     SB                 
      1.19993128E-01    2            6        -5                       # H+     -->  TP     BB                 
      3.79664302E-02    2      1000024   1000022                       # H+     -->  W1SS+  Z1SS               
      1.42971316E-04    2      1000024   1000023                       # H+     -->  W1SS+  Z2SS               
      2.30569348E-01    2      1000024   1000025                       # H+     -->  W1SS+  Z3SS               
      2.35261321E-01    2      1000024   1000035                       # H+     -->  W1SS+  Z4SS               
      4.59683686E-02    2      1000037   1000022                       # H+     -->  W2SS+  Z1SS               
      2.86764771E-01    2      1000037   1000023                       # H+     -->  W2SS+  Z2SS               
      2.35249195E-02    2      1000037   1000025                       # H+     -->  W2SS+  Z3SS               
      2.11781007E-03    2      1000037   1000035                       # H+     -->  W2SS+  Z4SS               
      5.41783193E-05    2           25        24                       # H+     -->  HL0    W+                 
