  65
  401    225.5735    0.38136E-24
  402    212.7720    0.30283E-24
  403    225.5687    0.38141E-24
  404    212.7712    0.30285E-24
  405    201.8526    0.12057E-23
  406    158.5928    0.49676E-24
  407    225.5735    0.38136E-24
  408    212.7720    0.30283E-24
  409    225.5687    0.38141E-24
  410    212.7712    0.30285E-24
  411    201.8526    0.12057E-23
  412    158.5928    0.49676E-24
  413    213.7916    0.60792E-23
  414    210.3356    0.15489E-23
  415    213.7917    0.60792E-23
  416    210.3348    0.15490E-23
  417    215.8102    0.41642E-23
  418    309.2661    0.20301E-24
  419    213.7916    0.60792E-23
  420    210.3356    0.15489E-23
  421    213.7917    0.60792E-23
  422    210.3348    0.15490E-23
  423    215.8102    0.41642E-23
  424    309.2661    0.20301E-24
  425     75.4004    0.17277E-23
  426      8.5882    0.16180E-20
  427     75.3972    0.17279E-23
  428      8.5598    0.16229E-20
  429     49.9566    0.59482E-23
  430      7.8342    0.17839E-10
  431     75.4004    0.17277E-23
  432      8.5882    0.16180E-20
  433     75.3972    0.17279E-23
  434      8.5598    0.16229E-20
  435     49.9566    0.59482E-23
  436      7.8342    0.17839E-10
  437     53.0515    0.53670E-23
  438      0.0000    0.10000E+31
  439     53.1458    0.55755E-23
  440      0.0000    0.10000E+31
  441     77.5532    0.17771E-23
  442      0.0000    0.10000E+31
  443     53.0515    0.53670E-23
  444      0.0000    0.10000E+31
  445     53.1458    0.55755E-23
  446      0.0000    0.10000E+31
  447     77.5532    0.17771E-23
  448      0.0000    0.10000E+31
  449    239.0610    0.25098E-24
  450     14.1291    0.12019E-22
  451     45.4107    0.12910E-22
  452   -142.7153    0.10838E-23
  453    183.3360    0.32055E-24
  454     30.7368    0.22619E-23
  455    182.3834    0.35773E-24
  456     30.7368    0.22619E-23
  457    182.3834    0.35773E-24
  203     86.4290    0.11515E-23
  204    141.4227    0.10714E-23
  205    130.9770    0.88546E-24
  206    152.6836    0.19580E-23
  207    152.6836    0.19580E-23
  458      0.0000    0.10000E+31
    6    173.3000    0.55476E-24
   12    173.3000    0.55476E-24
   6
   401  0.19560954E+00     0   450     1     0     0     0
   401  0.15797046E+00     0   451     1     0     0     0
   401  0.11225254E-01     0   452     1     0     0     0
   401  0.19429557E-01     0   453     1     0     0     0
   401  0.55262947E+00     0   456     2     0     0     0
   401  0.63135698E-01     0   457     2     0     0     0
   6
   402  0.49575869E-01     0   450     2     0     0     0
   402  0.24537118E+00     0   451     2     0     0     0
   402  0.43840124E-02     0   452     2     0     0     0
   402  0.61053606E-02     0   453     2     0     0     0
   402  0.68699795E+00     0   454     1     0     0     0
   402  0.75656637E-02     0   455     1     0     0     0
   6
   403  0.19562794E+00     0   450     3     0     0     0
   403  0.15798479E+00     0   451     3     0     0     0
   403  0.11225677E-01     0   452     3     0     0     0
   403  0.19428182E-01     0   453     3     0     0     0
   403  0.55263960E+00     0   456     4     0     0     0
   403  0.63093811E-01     0   457     4     0     0     0
   6
   404  0.49573593E-01     0   450     4     0     0     0
   404  0.24535801E+00     0   451     4     0     0     0
   404  0.43829433E-02     0   452     4     0     0     0
   404  0.60978765E-02     0   453     4     0     0     0
   404  0.68702203E+00     0   454     3     0     0     0
   404  0.75655915E-02     0   455     3     0     0     0
   4
   405  0.57823515E+00     0   450     5     0     0     0
   405  0.39731964E+00     0   451     5     0     0     0
   405  0.13578560E-01     0   452     5     0     0     0
   405  0.10866617E-01     0   453     5     0     0     0
   1
   406  0.10000000E+01     0   454     5     0     0     0
   6
   407  0.19560954E+00     0   450     7     0     0     0
   407  0.15797046E+00     0   451     7     0     0     0
   407  0.11225254E-01     0   452     7     0     0     0
   407  0.19429557E-01     0   453     7     0     0     0
   407  0.55262947E+00     0   454     8     0     0     0
   407  0.63135698E-01     0   455     8     0     0     0
   6
   408  0.49575869E-01     0   450     8     0     0     0
   408  0.24537118E+00     0   451     8     0     0     0
   408  0.43840124E-02     0   452     8     0     0     0
   408  0.61053606E-02     0   453     8     0     0     0
   408  0.68699795E+00     0   456     7     0     0     0
   408  0.75656637E-02     0   457     7     0     0     0
   6
   409  0.19562794E+00     0   450     9     0     0     0
   409  0.15798479E+00     0   451     9     0     0     0
   409  0.11225677E-01     0   452     9     0     0     0
   409  0.19428182E-01     0   453     9     0     0     0
   409  0.55263960E+00     0   454    10     0     0     0
   409  0.63093811E-01     0   455    10     0     0     0
   6
   410  0.49573593E-01     0   450    10     0     0     0
   410  0.24535801E+00     0   451    10     0     0     0
   410  0.43829433E-02     0   452    10     0     0     0
   410  0.60978765E-02     0   453    10     0     0     0
   410  0.68702203E+00     0   456     9     0     0     0
   410  0.75655915E-02     0   457     9     0     0     0
   4
   411  0.57823515E+00     0   450    11     0     0     0
   411  0.39731964E+00     0   451    11     0     0     0
   411  0.13578560E-01     0   452    11     0     0     0
   411  0.10866617E-01     0   453    11     0     0     0
   1
   412  0.10000000E+01     0   456    11     0     0     0
   4
   413  0.51596338E+00     0   450     1     0     0     0
   413  0.47365201E+00     0   451     1     0     0     0
   413  0.65616984E-02     0   452     1     0     0     0
   413  0.38228927E-02     0   453     1     0     0     0
   4
   414  0.51718301E+00     0   450     2     0     0     0
   414  0.47342396E+00     0   451     2     0     0     0
   414  0.62333629E-02     0   452     2     0     0     0
   414  0.31596732E-02     0   453     2     0     0     0
   4
   415  0.51596338E+00     0   450     3     0     0     0
   415  0.47365201E+00     0   451     3     0     0     0
   415  0.65617086E-02     0   452     3     0     0     0
   415  0.38229108E-02     0   453     3     0     0     0
   4
   416  0.51718795E+00     0   450     4     0     0     0
   416  0.47342458E+00     0   451     4     0     0     0
   416  0.62321029E-02     0   452     4     0     0     0
   416  0.31553153E-02     0   453     4     0     0     0
   5
   417  0.34963945E+00     0   450     5     0     0     0
   417  0.49169174E+00     0   451     5     0     0     0
   417  0.80572620E-01     0   452     5     0     0     0
   417  0.50209161E-01     0   453     5     0     0     0
   417  0.27886983E-01     0   456     6     0     0     0
  10
   418  0.88145472E-01     0   454     5     0     0     0
   418  0.51434004E+00     0   455     5     0     0     0
   418  0.14126091E+00     0   200   406     0     0     0
   418  0.65299906E-02     0   203   406     0     0     0
   418  0.34081811E-04     0   204   406     0     0     0
   418  0.25711516E-01     0   205   406     0     0     0
   418  0.15326287E+00     0   198   405     0     0     0
   418  0.96076438E-02     0   198   417     0     0     0
   418  0.16874878E-03     0   450     6     0     0     0
   418  0.60938749E-01     0   451     6     0     0     0
   4
   419  0.51596338E+00     0   450     7     0     0     0
   419  0.47365201E+00     0   451     7     0     0     0
   419  0.65616984E-02     0   452     7     0     0     0
   419  0.38228927E-02     0   453     7     0     0     0
   4
   420  0.51718301E+00     0   450     8     0     0     0
   420  0.47342396E+00     0   451     8     0     0     0
   420  0.62333629E-02     0   452     8     0     0     0
   420  0.31596732E-02     0   453     8     0     0     0
   4
   421  0.51596338E+00     0   450     9     0     0     0
   421  0.47365201E+00     0   451     9     0     0     0
   421  0.65617086E-02     0   452     9     0     0     0
   421  0.38229108E-02     0   453     9     0     0     0
   4
   422  0.51718795E+00     0   450    10     0     0     0
   422  0.47342458E+00     0   451    10     0     0     0
   422  0.62321029E-02     0   452    10     0     0     0
   422  0.31553153E-02     0   453    10     0     0     0
   5
   423  0.34963945E+00     0   450    11     0     0     0
   423  0.49169174E+00     0   451    11     0     0     0
   423  0.80572620E-01     0   452    11     0     0     0
   423  0.50209161E-01     0   453    11     0     0     0
   423  0.27886983E-01     0   454    12     0     0     0
  10
   424  0.88145472E-01     0   456    11     0     0     0
   424  0.51434004E+00     0   457    11     0     0     0
   424  0.14126091E+00     0   200   412     0     0     0
   424  0.65299906E-02     0   203   412     0     0     0
   424  0.34081811E-04     0   204   412     0     0     0
   424  0.25711516E-01     0   205   412     0     0     0
   424  0.15326287E+00     0   199   411     0     0     0
   424  0.96076438E-02     0   199   423     0     0     0
   424  0.16874878E-03     0   450    12     0     0     0
   424  0.60938749E-01     0   451    12     0     0     0
   4
   425  0.74717198E-02     0   450   121     0     0     0
   425  0.37908199E+00     0   451   121     0     0     0
   425  0.60406864E+00     0   456   122     0     0     0
   425  0.93776081E-02     0   121   130     0     0     0
   1
   426  0.10000000E+01     0   129   121     0     0     0
   4
   427  0.74720918E-02     0   450   123     0     0     0
   427  0.37906501E+00     0   451   123     0     0     0
   427  0.60408473E+00     0   456   124     0     0     0
   427  0.93781725E-02     0   121   128     0     0     0
   1
   428  0.10000000E+01     0   127   121     0     0     0
   3
   429  0.85777819E+00     0   450   125     0     0     0
   429  0.41902374E-01     0   451   125     0     0     0
   429  0.10031946E+00     0   456   126     0     0     0
   1
   430  0.10000000E+01     0   129   125     0     0     0
   4
   431  0.74717198E-02     0   450   127     0     0     0
   431  0.37908199E+00     0   451   127     0     0     0
   431  0.60406864E+00     0   454   128     0     0     0
   431  0.93776081E-02     0   127   124     0     0     0
   1
   432  0.10000000E+01     0   123   127     0     0     0
   4
   433  0.74720918E-02     0   450   129     0     0     0
   433  0.37906501E+00     0   451   129     0     0     0
   433  0.60408473E+00     0   454   130     0     0     0
   433  0.93781725E-02     0   127   122     0     0     0
   1
   434  0.10000000E+01     0   121   127     0     0     0
   3
   435  0.85777819E+00     0   450   131     0     0     0
   435  0.41902374E-01     0   451   131     0     0     0
   435  0.10031946E+00     0   454   132     0     0     0
   1
   436  0.10000000E+01     0   123   131     0     0     0
   4
   437  0.88582516E+00     0   450   121     0     0     0
   437  0.73182888E-01     0   451   121     0     0     0
   437  0.20495897E-01     0   123   122     0     0     0
   437  0.20496059E-01     0   121   124     0     0     0
   0
   2
   439  0.92235976E+00     0   450   123     0     0     0
   439  0.77640198E-01     0   451   123     0     0     0
   0
   3
   441  0.33379760E-01     0   450   125     0     0     0
   441  0.39678589E+00     0   451   125     0     0     0
   441  0.56983429E+00     0   456   126     0     0     0
   0
   4
   443  0.88582516E+00     0   450   127     0     0     0
   443  0.73182888E-01     0   451   127     0     0     0
   443  0.20495897E-01     0   129   128     0     0     0
   443  0.20496059E-01     0   127   130     0     0     0
   0
   2
   445  0.92235976E+00     0   450   129     0     0     0
   445  0.77640198E-01     0   451   129     0     0     0
   0
   3
   447  0.33379760E-01     0   450   131     0     0     0
   447  0.39678589E+00     0   451   131     0     0     0
   447  0.56983429E+00     0   454   132     0     0     0
   0
  21
   449  0.29035831E-04     0   452    13     0     0     0
   449  0.53367365E-01     0   408     2     0     0     0
   449  0.53367365E-01     0   402     8     0     0     0
   449  0.14854530E-01     0   407     1     0     0     0
   449  0.14854530E-01     0   401     7     0     0     0
   449  0.63032620E-01     0   420     2     0     0     0
   449  0.63032620E-01     0   414     8     0     0     0
   449  0.49530882E-01     0   419     1     0     0     0
   449  0.49530882E-01     0   413     7     0     0     0
   449  0.14863234E-01     0   409     3     0     0     0
   449  0.14863234E-01     0   403     9     0     0     0
   449  0.49529165E-01     0   421     3     0     0     0
   449  0.49529165E-01     0   415     9     0     0     0
   449  0.53308215E-01     0   410     4     0     0     0
   449  0.53308215E-01     0   404    10     0     0     0
   449  0.62974587E-01     0   422     4     0     0     0
   449  0.62974587E-01     0   416    10     0     0     0
   449  0.90288691E-01     0   411     5     0     0     0
   449  0.90288691E-01     0   405    11     0     0     0
   449  0.48236281E-01     0   423     5     0     0     0
   449  0.48236281E-01     0   417    11     0     0     0
   6
   450  0.15556039E+00     0   426   128     0     0     0
   450  0.15556039E+00     0   432   122     0     0     0
   450  0.15676901E+00     0   428   130     0     0     0
   450  0.15676901E+00     0   434   124     0     0     0
   450  0.18767059E+00     0   430   132     0     0     0
   450  0.18767059E+00     0   436   126     0     0     0
   9
   451  0.12212942E-03     0   450   121   127     0     0
   451  0.12060774E-03     0   450   123   129     0     0
   451  0.18499028E-03     0   450   125   131     0     0
   451  0.16587746E+00     0   426   128     0     0     0
   451  0.16587746E+00     0   432   122     0     0     0
   451  0.16595888E+00     0   428   130     0     0     0
   451  0.16595888E+00     0   434   124     0     0     0
   451  0.16794984E+00     0   430   132     0     0     0
   451  0.16794984E+00     0   436   126     0     0     0
  25
   452  0.24478339E+00     0   454   199     0     0     0
   452  0.24478339E+00     0   456   198     0     0     0
   452  0.15933840E+00     0   450   200     0     0     0
   452  0.34790989E-02     0   451   200     0     0     0
   452  0.10727670E-04     0   450     5    11     0     0
   452  0.19387992E-01     0   450   203     0     0     0
   452  0.44294415E-03     0   451   203     0     0     0
   452  0.48111980E-02     0   425   127     0     0     0
   452  0.48111980E-02     0   431   121     0     0     0
   452  0.48115095E-02     0   427   129     0     0     0
   452  0.48115095E-02     0   433   123     0     0     0
   452  0.84920442E-02     0   437   127     0     0     0
   452  0.84920442E-02     0   443   121     0     0     0
   452  0.84823528E-02     0   439   129     0     0     0
   452  0.84823528E-02     0   445   123     0     0     0
   452  0.62980102E-02     0   429   131     0     0     0
   452  0.62980102E-02     0   435   125     0     0     0
   452  0.80266511E-02     0   441   131     0     0     0
   452  0.80266511E-02     0   447   125     0     0     0
   452  0.40971085E-01     0   426   128     0     0     0
   452  0.40971085E-01     0   432   122     0     0     0
   452  0.40973064E-01     0   428   130     0     0     0
   452  0.40973064E-01     0   434   124     0     0     0
   452  0.41021105E-01     0   430   132     0     0     0
   452  0.41021105E-01     0   436   126     0     0     0
  32
   453  0.16022548E+00     0   454   199     0     0     0
   453  0.16022548E+00     0   456   198     0     0     0
   453  0.22186903E-01     0   450   200     0     0     0
   453  0.13219729E-02     0   451   200     0     0     0
   453  0.13385132E-04     0   450     1     7     0     0
   453  0.13386843E-04     0   450     3     9     0     0
   453  0.25812487E-04     0   450     5    11     0     0
   453  0.22655413E-04     0   451     2     8     0     0
   453  0.22656037E-04     0   451     4    10     0     0
   453  0.19111054E-04     0   451     5    11     0     0
   453  0.24368767E-01     0   450   203     0     0     0
   453  0.63342840E-03     0   450   204     0     0     0
   453  0.13889478E-02     0   450   205     0     0     0
   453  0.20731550E-02     0   451   203     0     0     0
   453  0.19890996E-01     0   425   127     0     0     0
   453  0.19890996E-01     0   431   121     0     0     0
   453  0.19891676E-01     0   427   129     0     0     0
   453  0.19891676E-01     0   433   123     0     0     0
   453  0.93270363E-02     0   437   127     0     0     0
   453  0.93270363E-02     0   443   121     0     0     0
   453  0.93209706E-02     0   439   129     0     0     0
   453  0.93209706E-02     0   445   123     0     0     0
   453  0.86246366E-02     0   429   131     0     0     0
   453  0.86246366E-02     0   435   125     0     0     0
   453  0.20490997E-01     0   441   131     0     0     0
   453  0.20490997E-01     0   447   125     0     0     0
   453  0.75375102E-01     0   426   128     0     0     0
   453  0.75375102E-01     0   432   122     0     0     0
   453  0.75377300E-01     0   428   130     0     0     0
   453  0.75377300E-01     0   434   124     0     0     0
   453  0.75430781E-01     0   430   132     0     0     0
   453  0.75430781E-01     0   436   126     0     0     0
   3
   454  0.32859585E+00     0   426   127     0     0     0
   454  0.32896346E+00     0   428   129     0     0     0
   454  0.34244069E+00     0   430   131     0     0     0
  25
   455  0.21434036E-04     0   450     2     7     0     0
   455  0.21436637E-04     0   450     4     9     0     0
   455  0.10569470E-01     0   450   198     0     0     0
   455  0.49599451E-02     0   450   206     0     0     0
   455  0.17398896E-04     0   451     2     7     0     0
   455  0.17400494E-04     0   451     4     9     0     0
   455  0.18890758E+00     0   451   198     0     0     0
   455  0.15902930E-04     0   452     2     7     0     0
   455  0.15903011E-04     0   452     4     9     0     0
   455  0.49869884E-01     0   406    11     0     0     0
   455  0.54202449E-01     0   426   127     0     0     0
   455  0.54204039E-01     0   428   129     0     0     0
   455  0.54831129E-01     0   430   131     0     0     0
   455  0.13725348E+00     0   431   122     0     0     0
   455  0.13725823E+00     0   433   124     0     0     0
   455  0.10035904E-01     0   435   126     0     0     0
   455  0.12669912E+00     0   447   126     0     0     0
   455  0.11656762E+00     0   454   200     0     0     0
   455  0.34410496E-04     0   454     1     7     0     0
   455  0.34411449E-04     0   454     3     9     0     0
   455  0.51637177E-04     0   454     2     8     0     0
   455  0.51643987E-04     0   454     4    10     0     0
   455  0.32823343E-01     0   454   203     0     0     0
   455  0.43903887E-02     0   454   204     0     0     0
   455  0.17145889E-01     0   454   205     0     0     0
   3
   456  0.32859585E+00     0   432   121     0     0     0
   456  0.32896346E+00     0   434   123     0     0     0
   456  0.34244069E+00     0   436   125     0     0     0
  25
   457  0.21434036E-04     0   450     8     1     0     0
   457  0.21436637E-04     0   450    10     3     0     0
   457  0.10569470E-01     0   450   199     0     0     0
   457  0.49599451E-02     0   450   207     0     0     0
   457  0.17398896E-04     0   451     8     1     0     0
   457  0.17400494E-04     0   451    10     3     0     0
   457  0.18890758E+00     0   451   199     0     0     0
   457  0.15902930E-04     0   452     8     1     0     0
   457  0.15903011E-04     0   452    10     3     0     0
   457  0.49869884E-01     0   412     5     0     0     0
   457  0.54202449E-01     0   432   121     0     0     0
   457  0.54204039E-01     0   434   123     0     0     0
   457  0.54831129E-01     0   436   125     0     0     0
   457  0.13725348E+00     0   425   128     0     0     0
   457  0.13725823E+00     0   427   130     0     0     0
   457  0.10035904E-01     0   429   132     0     0     0
   457  0.12669912E+00     0   441   132     0     0     0
   457  0.11656762E+00     0   456   200     0     0     0
   457  0.34410496E-04     0   456     7     1     0     0
   457  0.34411449E-04     0   456     9     3     0     0
   457  0.51637177E-04     0   456     8     2     0     0
   457  0.51643987E-04     0   456    10     4     0     0
   457  0.32823343E-01     0   456   203     0     0     0
   457  0.43903887E-02     0   456   204     0     0     0
   457  0.17145889E-01     0   456   205     0     0     0
  12
   203  0.13895746E-02     0   125   131     0     0     0
   203  0.58682916E-04     0     3     9     0     0     0
   203  0.24141520E-01     0     5    11     0     0     0
   203  0.21419080E-03     0     4    10     0     0     0
   203  0.10049112E-04     0    59    59     0     0     0
   203  0.93721232E-04     0    13    13     0     0     0
   203  0.14303078E+00     0   450   450     0     0     0
   203  0.23665970E-01     0   450   451     0     0     0
   203  0.13729052E+00     0   454   456     0     0     0
   203  0.22310197E+00     0   426   432     0     0     0
   203  0.22313233E+00     0   428   434     0     0     0
   203  0.22387072E+00     0   430   436     0     0     0
  29
   204  0.20197411E-04     0   123   129     0     0     0
   204  0.57793884E-02     0   125   131     0     0     0
   204  0.24185813E-03     0     3     9     0     0     0
   204  0.92896454E-01     0     5    11     0     0     0
   204  0.11006179E-03     0     4    10     0     0     0
   204  0.25474347E-03     0    13    13     0     0     0
   204  0.35340763E-04     0   198   121   128     0     0
   204  0.35340763E-04     0   198   123   130     0     0
   204  0.35340763E-04     0   198   125   132     0     0
   204  0.10602229E-03     0   198     8     1     0     0
   204  0.10602229E-03     0   198    10     3     0     0
   204  0.35340763E-04     0   199   127   122     0     0
   204  0.35340763E-04     0   199   129   124     0     0
   204  0.35340763E-04     0   199   131   126     0     0
   204  0.10602229E-03     0   199     2     7     0     0
   204  0.10602229E-03     0   199     4     9     0     0
   204  0.12123374E-04     0   200     1     7     0     0
   204  0.12123374E-04     0   200     3     9     0     0
   204  0.12123374E-04     0   200     5    11     0     0
   204  0.16370842E+00     0   450   450     0     0     0
   204  0.33694543E-01     0   450   451     0     0     0
   204  0.13867947E-02     0   451   451     0     0     0
   204  0.24579005E+00     0   454   456     0     0     0
   204  0.18991297E-01     0   437   443     0     0     0
   204  0.18946676E-01     0   439   445     0     0     0
   204  0.20039111E-01     0   429   435     0     0     0
   204  0.13243169E+00     0   426   432     0     0     0
   204  0.13243824E+00     0   428   434     0     0     0
   204  0.13259801E+00     0   430   436     0     0     0
  13
   205  0.19848227E-04     0   123   129     0     0     0
   205  0.56827506E-02     0   125   131     0     0     0
   205  0.23793899E-03     0     3     9     0     0     0
   205  0.92702836E-01     0     5    11     0     0     0
   205  0.19230753E-04     0     4    10     0     0     0
   205  0.16342148E-04     0    13    13     0     0     0
   205  0.32025188E+00     0   450   450     0     0     0
   205  0.89165837E-01     0   450   451     0     0     0
   205  0.64071571E-02     0   451   451     0     0     0
   205  0.48538914E+00     0   454   456     0     0     0
   205  0.45396275E-04     0   429   435     0     0     0
   205  0.30856736E-04     0   429   447     0     0     0
   205  0.30856736E-04     0   441   435     0     0     0
   9
   206  0.51163010E-04     0   124   129     0     0     0
   206  0.14649916E-01     0   126   131     0     0     0
   206  0.59477414E-03     0     4     9     0     0     0
   206  0.36285844E+00     0   454   450     0     0     0
   206  0.35220805E+00     0   454   451     0     0     0
   206  0.89575998E-01     0   431   426     0     0     0
   206  0.89580074E-01     0   433   428     0     0     0
   206  0.15410123E-01     0   435   430     0     0     0
   206  0.75071633E-01     0   447   430     0     0     0
   9
   207  0.51163010E-04     0   130   123     0     0     0
   207  0.14649916E-01     0   132   125     0     0     0
   207  0.59477414E-03     0    10     3     0     0     0
   207  0.36285844E+00     0   456   450     0     0     0
   207  0.35220805E+00     0   456   451     0     0     0
   207  0.89575998E-01     0   425   432     0     0     0
   207  0.89580074E-01     0   427   434     0     0     0
   207  0.15410123E-01     0   429   436     0     0     0
   207  0.75071633E-01     0   441   436     0     0     0
   0
   7
     6  0.33011404E+00   100     2     7     5     0     0
     6  0.33011404E+00   100     4     9     5     0     0
     6  0.11003801E+00   100   122   127     5     0     0
     6  0.11003801E+00   100   124   129     5     0     0
     6  0.11003801E+00   100   126   131     5     0     0
     6  0.64795492E-02     0   206     5     0     0     0
     6  0.31783485E-02     0   450   406     0     0     0
   7
    12  0.33011404E+00   100     8     1    11     0     0
    12  0.33011404E+00   100    10     3    11     0     0
    12  0.11003801E+00   100   128   121    11     0     0
    12  0.11003801E+00   100   130   123    11     0     0
    12  0.11003801E+00   100   132   125    11     0     0
    12  0.64795492E-02     0   207    11     0     0     0
    12  0.31783485E-02     0   450   412     0     0     0
      3.94145012     -0.54447323
     -0.68295974      0.47351804     -0.52458107      0.18482821
     -0.68228209     -0.68349385      0.22707108     -0.12556171
     -0.13831881      0.21284404      0.63061160      0.73341274
      0.22118995     -0.51314133     -0.52495921      0.64201117
     -0.93247920      0.36122355     -0.36122355     -0.93247920
     -0.72211373      0.69177437     -0.69177437     -0.72211373
     -0.84617525     -0.40956894     -1.26109409
   -173.69900513   -110.04799652    -68.55660248
    130.46000671
    F
  0.00000000E+00  0.00000000E+00  0.00000000E+00  0.48802100E-01 -0.22392199E-20  0.00000000E+00  0.00000000E+00  0.00000000E+00  0.51349201E-18 -0.48802100E-01  0.22392199E-20 -0.00000000E+00  0.00000000E+00  0.00000000E+00  0.00000000E+00  0.00000000E+00  0.00000000E+00  0.51305301E-06 -0.00000000E+00 -0.00000000E+00 -0.51349201E-18 -0.00000000E+00 -0.00000000E+00 -0.51305301E-06  0.00000000E+00  0.00000000E+00  0.00000000E+00
  0.80046102E-21  0.13208793E-38  0.00000000E+00  0.23358244E-39  0.17525901E-19  0.00000000E+00  0.00000000E+00  0.00000000E+00  0.78137099E-18  0.79977702E-09  0.13197500E-26  0.00000000E+00  0.23338301E-27  0.17510899E-07  0.00000000E+00  0.00000000E+00  0.00000000E+00  0.78070298E-06  0.00000000E+00  0.00000000E+00  0.00000000E+00  0.00000000E+00  0.00000000E+00  0.00000000E+00  0.00000000E+00  0.00000000E+00  0.00000000E+00
  0.00000000E+00  0.00000000E+00  0.00000000E+00  0.00000000E+00  0.00000000E+00  0.00000000E+00  0.00000000E+00  0.00000000E+00  0.00000000E+00  0.00000000E+00  0.00000000E+00  0.00000000E+00  0.00000000E+00  0.00000000E+00  0.00000000E+00  0.00000000E+00  0.00000000E+00  0.00000000E+00  0.00000000E+00  0.00000000E+00  0.00000000E+00  0.00000000E+00  0.00000000E+00  0.00000000E+00  0.00000000E+00  0.00000000E+00  0.00000000E+00
