#  ISAJET SUSY parameters in SUSY Les Houches Accord 2 format
#  Created by ISALHA 2.0 Last revision: C. Balazs 21 Apr 2009
Block SPINFO   # Program information
     1   ISASUGRA from ISAJET          # Spectrum Calculator
     2   7.80   29-OCT-2009 12:50:36   # Version number
Block MODSEL   # Model selection
     1     1   # Minimal supergravity (mSUGRA) model               
Block SMINPUTS   # Standard Model inputs
     1     1.27844101E+02   # alpha_em^(-1)
     2     1.16570000E-05   # G_Fermi
     3     1.17200002E-01   # alpha_s(M_Z)
     4     9.11699982E+01   # m_{Z}(pole)
     5     4.19999981E+00   # m_{b}(m_{b})
     6     1.72500000E+02   # m_{top}(pole)
     7     1.77699995E+00   # m_{tau}(pole)
Block MINPAR   # SUSY breaking input parameters
     1     1.38000000E+03   # m_0
     2     7.50000000E+02   # m_{1/2}
     3     1.00000000E+01   # tan(beta)
     4     1.00000000E+00   # sign(mu)
     5     0.00000000E+00   # A_0
Block EXTPAR   # Non-universal SUSY breaking parameters
     0     1.65636208E+16   # Input scale
Block MASS   # Scalar and gaugino mass spectrum
#  PDG code   mass                 particle
        24     8.04229965E+01   #  W^+
        25     1.16429161E+02   #  h^0            
        35     1.68920105E+03   #  H^0            
        36     1.67806311E+03   #  A^0            
        37     1.69227527E+03   #  H^+            
   1000001     2.04598108E+03   #  dnl            
   1000002     2.04441101E+03   #  upl            
   1000003     2.04598108E+03   #  stl            
   1000004     2.04441150E+03   #  chl            
   1000005     1.80428894E+03   #  b1             
   1000006     1.44295190E+03   #  t1             
   1000011     1.46442651E+03   #  el-            
   1000012     1.46179932E+03   #  nuel           
   1000013     1.46442651E+03   #  mul-           
   1000014     1.46179932E+03   #  numl           
   1000015     1.39282874E+03   #  tau1           
   1000016     1.45544580E+03   #  nutl           
   1000021     1.74173047E+03   #  glss           
   1000022     3.19540680E+02   #  z1ss           
   1000023     6.03477905E+02   #  z2ss           
   1000024     6.04354797E+02   #  w1ss           
   1000025    -8.66190552E+02   #  z3ss           
   1000035     8.79827942E+02   #  z4ss           
   1000037     8.79970032E+02   #  w2ss           
   2000001     2.00278540E+03   #  dnr            
   2000002     2.00698608E+03   #  upr            
   2000003     2.00278540E+03   #  str            
   2000004     2.00698657E+03   #  chr            
   2000005     1.98432922E+03   #  b2             
   2000006     1.82278784E+03   #  t2             
   2000011     1.40637000E+03   #  er-            
   2000013     1.40637000E+03   #  mur-           
   2000015     1.45866101E+03   #  tau2           
Block ALPHA   # Effective Higgs mixing parameter
         -1.00361168E-01   # alpha
Block STOPMIX   # stop mixing matrix
  1  1     1.61398351E-01   # O_{11}
  1  2     9.86889362E-01   # O_{12}
  2  1    -9.86889362E-01   # O_{21}
  2  2     1.61398351E-01   # O_{22}
Block SBOTMIX   # sbottom mixing matrix
  1  1     9.99305367E-01   # O_{11}
  1  2     3.72664593E-02   # O_{12}
  2  1    -3.72664593E-02   # O_{21}
  2  2     9.99305367E-01   # O_{22}
Block STAUMIX   # stau mixing matrix
  1  1     9.26131904E-02   # O_{11}
  1  2     9.95702147E-01   # O_{12}
  2  1    -9.95702147E-01   # O_{21}
  2  2     9.26131904E-02   # O_{22}
Block NMIX   # neutralino mixing matrix
  1  1     9.97797787E-01   #
  1  2    -8.26214254E-03   #
  1  3     6.01237342E-02   #
  1  4    -2.67750174E-02   #
  2  1    -2.23375354E-02   #
  2  2    -9.74853396E-01   #
  2  3     1.77675277E-01   #
  2  4    -1.32640719E-01   #
  3  1     2.32468098E-02   #
  3  2    -3.28231081E-02   #
  3  3    -7.05438375E-01   #
  3  4    -7.07629204E-01   #
  4  1    -5.79711124E-02   #
  4  2     2.20262229E-01   #
  4  3     6.83500886E-01   #
  4  4    -6.93506062E-01   #
Block UMIX   # chargino U mixing matrix
  1  1    -9.68133152E-01   # U_{11}
  1  2     2.50436008E-01   # U_{12}
  2  1    -2.50436008E-01   # U_{21}
  2  2    -9.68133152E-01   # U_{22}
Block VMIX   # chargino V mixing matrix
  1  1    -9.82207656E-01   # V_{11}
  1  2     1.87797934E-01   # V_{12}
  2  1    -1.87797934E-01   # V_{21}
  2  2    -9.82207656E-01   # V_{22}
Block GAUGE Q=  1.55516736E+03   #
     1     3.57491225E-01   # g`
     2     6.52497232E-01   # g_2
     3     1.22103894E+00   # g_3
Block YU Q=  1.55516736E+03   #
  3  3     8.44147921E-01   # y_t
Block YD Q=  1.55516736E+03   #
  3  3     1.29385531E-01   # y_b
Block YE Q=  1.55516736E+03   #
  3  3     1.02122426E-01   # y_tau
Block HMIX Q=  1.55516736E+03   # Higgs mixing parameters
     1     8.57814453E+02   # mu(Q)
     2     1.00000000E+01   # tan(beta)(M_GUT)
     3     2.51396423E+02   # Higgs vev at Q
     4     2.81589575E+06   # m_A^2(Q)
Block MSOFT Q=  1.55516736E+03   # DRbar SUSY breaking parameters
     1     3.22568359E+02   # M_1(Q)          
     2     5.90917664E+02   # M_2(Q)          
     3     1.60925330E+03   # M_3(Q)          
    31     1.45821118E+03   # MeL(Q)          
    32     1.45821118E+03   # MmuL(Q)         
    33     1.45199292E+03   # MtauL(Q)        
    34     1.40422339E+03   # MeR(Q)          
    35     1.40422339E+03   # MmuR(Q)         
    36     1.39142993E+03   # MtauR(Q)        
    41     1.96230481E+03   # MqL1(Q)         
    42     1.96230481E+03   # MqL2(Q)         
    43     1.72952014E+03   # MqL3(Q)         
    44     1.92392493E+03   # MuR(Q)          
    45     1.92392493E+03   # McR(Q)          
    46     1.39839111E+03   # MtR(Q)          
    47     1.91917065E+03   # MdR(Q)          
    48     1.91917065E+03   # MsR(Q)          
    49     1.91673523E+03   # MbR(Q)          
Block AU Q=  1.55516736E+03   #
  1  1    -1.24552393E+03   # A_u
  2  2    -1.24552393E+03   # A_c
  3  3    -1.24552393E+03   # A_t
Block AD Q=  1.55516736E+03   #
  1  1    -1.82187427E+03   # A_d
  2  2    -1.82187427E+03   # A_s
  3  3    -1.82187427E+03   # A_b
Block AE Q=  1.55516736E+03   #
  1  1    -4.34831024E+02   # A_e
  2  2    -4.34831024E+02   # A_mu
  3  3    -4.34831024E+02   # A_tau
#  ISAJET decay tables in SUSY Les Houches accord format
#  Created by ISALHD. Last revision: C. Balazs, 2005 May 25
Block DCINFO                           # Program information
     1   ISASUGRA from ISAJET          # Spectrum Calculator
     2   7.80   29-OCT-2009 12:50:36   # Version number
#         PDG         Width
DECAY         6  1.14680779E+00   # TP    decays
#          BR          NDA       ID1       ID2       ID3       ID4
      3.33333343E-01    3            2        -1         5             # TP     -->  UP     DB     BT          
      3.33333343E-01    3            4        -3         5             # TP     -->  CH     SB     BT          
      1.11111112E-01    3          -11        12         5             # TP     -->  E+     NUE    BT          
      1.11111112E-01    3          -13        14         5             # TP     -->  MU+    NUM    BT          
      1.11111112E-01    3          -15        16         5             # TP     -->  TAU+   NUT    BT          
#         PDG         Width
DECAY   1000021  2.64782000E+00   # GLSS  decays
#          BR          NDA       ID1       ID2       ID3       ID4
      2.49367533E-03    3      1000024         1        -2             # GLSS   -->  W1SS+  DN     UB          
      2.49367533E-03    3     -1000024         2        -1             # GLSS   -->  W1SS-  UP     DB          
      2.49367347E-03    3      1000024         3        -4             # GLSS   -->  W1SS+  ST     CB          
      2.49367347E-03    3     -1000024         4        -3             # GLSS   -->  W1SS-  CH     SB          
      5.53062046E-03    3      1000024         5        -6             # GLSS   -->  W1SS+  BT     TB          
      5.53062046E-03    3     -1000024         6        -5             # GLSS   -->  W1SS-  TP     BB          
      6.00667518E-05    3      1000037         1        -2             # GLSS   -->  W2SS+  DN     UB          
      6.00667518E-05    3     -1000037         2        -1             # GLSS   -->  W2SS-  UP     DB          
      6.00667008E-05    3      1000037         3        -4             # GLSS   -->  W2SS+  ST     CB          
      6.00667008E-05    3     -1000037         4        -3             # GLSS   -->  W2SS-  CH     SB          
      3.08508496E-03    3      1000037         5        -6             # GLSS   -->  W2SS+  BT     TB          
      3.08508496E-03    3     -1000037         6        -5             # GLSS   -->  W2SS-  TP     BB          
      5.09270330E-06    2      1000022        21                       # GLSS   -->  Z1SS   GL                 
      1.23945379E-03    3      1000022         2        -2             # GLSS   -->  Z1SS   UP     UB          
      3.70080932E-04    3      1000022         1        -1             # GLSS   -->  Z1SS   DN     DB          
      3.70080932E-04    3      1000022         3        -3             # GLSS   -->  Z1SS   ST     SB          
      1.23945193E-03    3      1000022         4        -4             # GLSS   -->  Z1SS   CH     CB          
      5.18413610E-04    3      1000022         5        -5             # GLSS   -->  Z1SS   BT     BB          
      1.17463416E-04    3      1000022         6        -6             # GLSS   -->  Z1SS   TP     TB          
      2.62316826E-06    2      1000023        21                       # GLSS   -->  Z2SS   GL                 
      1.26243813E-03    3      1000023         2        -2             # GLSS   -->  Z2SS   UP     UB          
      1.23446842E-03    3      1000023         1        -1             # GLSS   -->  Z2SS   DN     DB          
      1.23446842E-03    3      1000023         3        -3             # GLSS   -->  Z2SS   ST     SB          
      1.26243616E-03    3      1000023         4        -4             # GLSS   -->  Z2SS   CH     CB          
      3.64803779E-03    3      1000023         5        -5             # GLSS   -->  Z2SS   BT     BB          
      1.97241246E-03    3      1000023         6        -6             # GLSS   -->  Z2SS   TP     TB          
      5.60046974E-05    2      1000025        21                       # GLSS   -->  Z3SS   GL                 
      3.38216381E-07    3      1000025         2        -2             # GLSS   -->  Z3SS   UP     UB          
      4.24884405E-07    3      1000025         1        -1             # GLSS   -->  Z3SS   DN     DB          
      4.24884405E-07    3      1000025         3        -3             # GLSS   -->  Z3SS   ST     SB          
      3.38215727E-07    3      1000025         4        -4             # GLSS   -->  Z3SS   CH     CB          
      1.28303232E-04    3      1000025         5        -5             # GLSS   -->  Z3SS   BT     BB          
      1.24157534E-03    3      1000025         6        -6             # GLSS   -->  Z3SS   TP     TB          
      3.81470163E-05    2      1000035        21                       # GLSS   -->  Z4SS   GL                 
      2.86533723E-05    3      1000035         2        -2             # GLSS   -->  Z4SS   UP     UB          
      3.33150638E-05    3      1000035         1        -1             # GLSS   -->  Z4SS   DN     DB          
      3.33150638E-05    3      1000035         3        -3             # GLSS   -->  Z4SS   ST     SB          
      2.86533195E-05    3      1000035         4        -4             # GLSS   -->  Z4SS   CH     CB          
      2.23995754E-04    3      1000035         5        -5             # GLSS   -->  Z4SS   BT     BB          
      2.07910757E-03    3      1000035         6        -6             # GLSS   -->  Z4SS   TP     TB          
      4.77092057E-01    2     -1000006         6                       # GLSS   -->  TB1    TP                 
      4.77092057E-01    2      1000006        -6                       # GLSS   -->  TP1    TB                 
#         PDG         Width
DECAY   1000002  3.04021759E+01   # UPL   decays
#          BR          NDA       ID1       ID2       ID3       ID4
      8.20710137E-03    2      1000022         2                       # UPL    -->  Z1SS   UP                 
      2.26051405E-01    2      1000023         2                       # UPL    -->  Z2SS   UP                 
      1.55476038E-04    2      1000025         2                       # UPL    -->  Z3SS   UP                 
      8.25893413E-03    2      1000035         2                       # UPL    -->  Z4SS   UP                 
      2.89205939E-01    2      1000021         2                       # UPL    -->  GLSS   UP                 
      4.54868048E-01    2      1000024         1                       # UPL    -->  W1SS+  DN                 
      1.32530937E-02    2      1000037         1                       # UPL    -->  W2SS+  DN                 
#         PDG         Width
DECAY   1000001  3.04149609E+01   # DNL   decays
#          BR          NDA       ID1       ID2       ID3       ID4
      9.83880740E-03    2      1000022         1                       # DNL    -->  Z1SS   DN                 
      2.22429574E-01    2      1000023         1                       # DNL    -->  Z2SS   DN                 
      2.62296264E-04    2      1000025         1                       # DNL    -->  Z3SS   DN                 
      1.00278268E-02    2      1000035         1                       # DNL    -->  Z4SS   DN                 
      2.91639656E-01    2      1000021         1                       # DNL    -->  GLSS   DN                 
      4.42208797E-01    2     -1000024         2                       # DNL    -->  W1SS-  UP                 
      2.35929936E-02    2     -1000037         2                       # DNL    -->  W2SS-  UP                 
#         PDG         Width
DECAY   1000003  3.04149437E+01   # STL   decays
#          BR          NDA       ID1       ID2       ID3       ID4
      9.83881298E-03    2      1000022         3                       # STL    -->  Z1SS   ST                 
      2.22429693E-01    2      1000023         3                       # STL    -->  Z2SS   ST                 
      2.62296409E-04    2      1000025         3                       # STL    -->  Z3SS   ST                 
      1.00278324E-02    2      1000035         3                       # STL    -->  Z4SS   ST                 
      2.91639835E-01    2      1000021         3                       # STL    -->  GLSS   ST                 
      4.42208618E-01    2     -1000024         4                       # STL    -->  W1SS-  CH                 
      2.35929769E-02    2     -1000037         4                       # STL    -->  W2SS-  CH                 
#         PDG         Width
DECAY   1000004  3.04020996E+01   # CHL   decays
#          BR          NDA       ID1       ID2       ID3       ID4
      8.20711721E-03    2      1000022         4                       # CHL    -->  Z1SS   CH                 
      2.26051837E-01    2      1000023         4                       # CHL    -->  Z2SS   CH                 
      1.55476286E-04    2      1000025         4                       # CHL    -->  Z3SS   CH                 
      8.25894997E-03    2      1000035         4                       # CHL    -->  Z4SS   CH                 
      2.89204091E-01    2      1000021         4                       # CHL    -->  GLSS   CH                 
      4.54869360E-01    2      1000024         3                       # CHL    -->  W1SS+  ST                 
      1.32531347E-02    2      1000037         3                       # CHL    -->  W2SS+  ST                 
#         PDG         Width
DECAY   1000005  3.70712051E+01   # BT1   decays
#          BR          NDA       ID1       ID2       ID3       ID4
      7.23586278E-03    2      1000022         5                       # BT1    -->  Z1SS   BT                 
      1.53051138E-01    2      1000023         5                       # BT1    -->  Z2SS   BT                 
      5.06400643E-03    2      1000025         5                       # BT1    -->  Z3SS   BT                 
      1.05258888E-02    2      1000035         5                       # BT1    -->  Z4SS   BT                 
      1.31178685E-02    2      1000021         5                       # BT1    -->  GLSS   BT                 
      3.03819358E-01    2     -1000024         6                       # BT1    -->  W1SS-  TP                 
      3.90913963E-01    2     -1000037         6                       # BT1    -->  W2SS-  TP                 
      1.16271928E-01    2          -24   1000006                       # BT1    -->  W-     TP1                
#         PDG         Width
DECAY   1000006  1.88056545E+01   # TP1   decays
#          BR          NDA       ID1       ID2       ID3       ID4
      1.50173679E-01    2      1000022         6                       # TP1    -->  Z1SS   TP                 
      3.23032476E-02    2      1000023         6                       # TP1    -->  Z2SS   TP                 
      2.17703357E-01    2      1000025         6                       # TP1    -->  Z3SS   TP                 
      1.62098810E-01    2      1000035         6                       # TP1    -->  Z4SS   TP                 
      6.83636293E-02    2      1000024         5                       # TP1    -->  W1SS+  BT                 
      3.69357288E-01    2      1000037         5                       # TP1    -->  W2SS+  BT                 
#         PDG         Width
DECAY   2000002  1.13137360E+01   # UPR   decays
#          BR          NDA       ID1       ID2       ID3       ID4
      3.79260689E-01    2      1000022         2                       # UPR    -->  Z1SS   UP                 
      1.65543810E-04    2      1000023         2                       # UPR    -->  Z2SS   UP                 
      1.43497440E-04    2      1000025         2                       # UPR    -->  Z3SS   UP                 
      8.79443076E-04    2      1000035         2                       # UPR    -->  Z4SS   UP                 
      6.19550824E-01    2      1000021         2                       # UPR    -->  GLSS   UP                 
#         PDG         Width
DECAY   2000001  7.89164114E+00   # DNR   decays
#          BR          NDA       ID1       ID2       ID3       ID4
      1.35616228E-01    2      1000022         1                       # DNR    -->  Z1SS   DN                 
      5.91587632E-05    2      1000023         1                       # DNR    -->  Z2SS   DN                 
      5.12244878E-05    2      1000025         1                       # DNR    -->  Z3SS   DN                 
      3.13912344E-04    2      1000035         1                       # DNR    -->  Z4SS   DN                 
      8.63959432E-01    2      1000021         1                       # DNR    -->  GLSS   DN                 
#         PDG         Width
DECAY   2000003  7.89164114E+00   # STR   decays
#          BR          NDA       ID1       ID2       ID3       ID4
      1.35616228E-01    2      1000022         3                       # STR    -->  Z1SS   ST                 
      5.91587632E-05    2      1000023         3                       # STR    -->  Z2SS   ST                 
      5.12244878E-05    2      1000025         3                       # STR    -->  Z3SS   ST                 
      3.13912344E-04    2      1000035         3                       # STR    -->  Z4SS   ST                 
      8.63959432E-01    2      1000021         3                       # STR    -->  GLSS   ST                 
#         PDG         Width
DECAY   2000004  1.13136473E+01   # CHR   decays
#          BR          NDA       ID1       ID2       ID3       ID4
      3.79263341E-01    2      1000022         4                       # CHR    -->  Z1SS   CH                 
      1.65544960E-04    2      1000023         4                       # CHR    -->  Z2SS   CH                 
      1.43498444E-04    2      1000025         4                       # CHR    -->  Z3SS   CH                 
      8.79449188E-04    2      1000035         4                       # CHR    -->  Z4SS   CH                 
      6.19548142E-01    2      1000021         4                       # CHR    -->  GLSS   CH                 
#         PDG         Width
DECAY   2000005  8.10626602E+00   # BT2   decays
#          BR          NDA       ID1       ID2       ID3       ID4
      1.30133078E-01    2      1000022         5                       # BT2    -->  Z1SS   BT                 
      2.73761980E-04    2      1000023         5                       # BT2    -->  Z2SS   BT                 
      2.82494612E-02    2      1000025         5                       # BT2    -->  Z3SS   BT                 
      2.84834988E-02    2      1000035         5                       # BT2    -->  Z4SS   BT                 
      7.38890946E-01    2      1000021         5                       # BT2    -->  GLSS   BT                 
      5.21563576E-04    2     -1000024         6                       # BT2    -->  W1SS-  TP                 
      6.03179857E-02    2     -1000037         6                       # BT2    -->  W2SS-  TP                 
      2.29444494E-03    2          -24   1000006                       # BT2    -->  W-     TP1                
      2.10749824E-03    2          -24   2000006                       # BT2    -->  W-     TP2                
      1.46773295E-03    2           23   1000005                       # BT2    -->  Z0     BT1                
      7.25991791E-03    2           25   1000005                       # BT2    -->  HL0    BT1                
#         PDG         Width
DECAY   2000006  3.81257133E+01   # TP2   decays
#          BR          NDA       ID1       ID2       ID3       ID4
      2.76966631E-01    2      1000024         5                       # TP2    -->  W1SS+  BT                 
      4.45320867E-02    2      1000037         5                       # TP2    -->  W2SS+  BT                 
      6.31822795E-02    2           23   1000006                       # TP2    -->  Z0     TP1                
      7.92243779E-02    2           25   1000006                       # TP2    -->  HL0    TP1                
      6.76960405E-03    2      1000022         6                       # TP2    -->  Z1SS   TP                 
      1.38140097E-01    2      1000023         6                       # TP2    -->  Z2SS   TP                 
      1.81762367E-01    2      1000025         6                       # TP2    -->  Z3SS   TP                 
      2.09422499E-01    2      1000035         6                       # TP2    -->  Z4SS   TP                 
#         PDG         Width
DECAY   1000011  1.41315022E+01   # EL-   decays
#          BR          NDA       ID1       ID2       ID3       ID4
      1.15437113E-01    2      1000022        11                       # EL-    -->  Z1SS   E-                 
      2.92944640E-01    2      1000023        11                       # EL-    -->  Z2SS   E-                 
      7.40919204E-05    2      1000025        11                       # EL-    -->  Z3SS   E-                 
      6.32278249E-03    2      1000035        11                       # EL-    -->  Z4SS   E-                 
      5.62885106E-01    2     -1000024        12                       # EL-    -->  W1SS-  NUE                
      2.23362893E-02    2     -1000037        12                       # EL-    -->  W2SS-  NUE                
#         PDG         Width
DECAY   1000013  1.41315022E+01   # MUL-  decays
#          BR          NDA       ID1       ID2       ID3       ID4
      1.15437113E-01    2      1000022        13                       # MUL-   -->  Z1SS   MU-                
      2.92944640E-01    2      1000023        13                       # MUL-   -->  Z2SS   MU-                
      7.40919204E-05    2      1000025        13                       # MUL-   -->  Z3SS   MU-                
      6.32278249E-03    2      1000035        13                       # MUL-   -->  Z4SS   MU-                
      5.62885106E-01    2     -1000024        14                       # MUL-   -->  W1SS-  NUM                
      2.23362893E-02    2     -1000037        14                       # MUL-   -->  W2SS-  NUM                
#         PDG         Width
DECAY   1000015  6.66906261E+00   # TAU1- decays
#          BR          NDA       ID1       ID2       ID3       ID4
      9.44310606E-01    2      1000022        15                       # TAU1-  -->  Z1SS   TAU-               
      1.02906665E-02    2      1000023        15                       # TAU1-  -->  Z2SS   TAU-               
      8.23211856E-03    2      1000025        15                       # TAU1-  -->  Z3SS   TAU-               
      6.72898395E-03    2      1000035        15                       # TAU1-  -->  Z4SS   TAU-               
      1.94752440E-02    2     -1000024        16                       # TAU1-  -->  W1SS-  NUT                
      1.09623373E-02    2     -1000037        16                       # TAU1-  -->  W2SS-  NUT                
#         PDG         Width
DECAY   1000012  1.41539660E+01   # NUEL  decays
#          BR          NDA       ID1       ID2       ID3       ID4
      1.22149937E-01    2      1000022        12                       # NUEL   -->  Z1SS   NUE                
      2.77202755E-01    2      1000023        12                       # NUEL   -->  Z2SS   NUE                
      3.80614656E-04    2      1000025        12                       # NUEL   -->  Z3SS   NUE                
      1.12392977E-02    2      1000035        12                       # NUEL   -->  Z4SS   NUE                
      5.76560378E-01    2      1000024        11                       # NUEL   -->  W1SS+  E-                 
      1.24669923E-02    2      1000037        11                       # NUEL   -->  W2SS+  E-                 
#         PDG         Width
DECAY   1000014  1.41539660E+01   # NUML  decays
#          BR          NDA       ID1       ID2       ID3       ID4
      1.22149937E-01    2      1000022        14                       # NUML   -->  Z1SS   NUM                
      2.77202755E-01    2      1000023        14                       # NUML   -->  Z2SS   NUM                
      3.80614656E-04    2      1000025        14                       # NUML   -->  Z3SS   NUM                
      1.12392977E-02    2      1000035        14                       # NUML   -->  Z4SS   NUM                
      5.76560378E-01    2      1000024        13                       # NUML   -->  W1SS+  MU-                
      1.24669923E-02    2      1000037        13                       # NUML   -->  W2SS+  MU-                
#         PDG         Width
DECAY   1000016  1.41765652E+01   # NUTL  decays
#          BR          NDA       ID1       ID2       ID3       ID4
      1.21318549E-01    2      1000022        16                       # NUTL   -->  Z1SS   NUT                
      2.74568170E-01    2      1000023        16                       # NUTL   -->  Z2SS   NUT                
      3.74782045E-04    2      1000025        16                       # NUTL   -->  Z3SS   NUT                
      1.10618239E-02    2      1000035        16                       # NUTL   -->  Z4SS   NUT                
      5.71968734E-01    2      1000024        15                       # NUTL   -->  W1SS+  TAU-               
      2.07056366E-02    2      1000037        15                       # NUTL   -->  W2SS+  TAU-               
      2.51872535E-07    3      1000015        16       -15             # NUTL   -->  TAU1-  NUT    TAU+        
      2.51872535E-07    3      1000015        12       -11             # NUTL   -->  TAU1-  NUE    E+          
      2.51872535E-07    3      1000015        14       -13             # NUTL   -->  TAU1-  NUM    MU+         
      7.55617691E-07    3      1000015         2        -1             # NUTL   -->  TAU1-  UP     DB          
      7.55617691E-07    3      1000015         4        -3             # NUTL   -->  TAU1-  CH     SB          
#         PDG         Width
DECAY   2000011  6.41814137E+00   # ER-   decays
#          BR          NDA       ID1       ID2       ID3       ID4
      9.98010457E-01    2      1000022        11                       # ER-    -->  Z1SS   E-                 
      3.70170630E-04    2      1000023        11                       # ER-    -->  Z2SS   E-                 
      2.32019476E-04    2      1000025        11                       # ER-    -->  Z3SS   E-                 
      1.38741976E-03    2      1000035        11                       # ER-    -->  Z4SS   E-                 
#         PDG         Width
DECAY   2000013  6.41814137E+00   # MUR-  decays
#          BR          NDA       ID1       ID2       ID3       ID4
      9.98010457E-01    2      1000022        13                       # MUR-   -->  Z1SS   MU-                
      3.70170630E-04    2      1000023        13                       # MUR-   -->  Z2SS   MU-                
      2.32019476E-04    2      1000025        13                       # MUR-   -->  Z3SS   MU-                
      1.38741976E-03    2      1000035        13                       # MUR-   -->  Z4SS   MU-                
#         PDG         Width
DECAY   2000015  1.40618715E+01   # TAU2- decays
#          BR          NDA       ID1       ID2       ID3       ID4
      1.18051685E-01    2      1000022        15                       # TAU2-  -->  Z1SS   TAU-               
      2.88090825E-01    2      1000023        15                       # TAU2-  -->  Z2SS   TAU-               
      5.00072632E-03    2      1000025        15                       # TAU2-  -->  Z3SS   TAU-               
      1.17727956E-02    2      1000035        15                       # TAU2-  -->  Z4SS   TAU-               
      5.52508295E-01    2     -1000024        16                       # TAU2-  -->  W1SS-  NUT                
      2.45757122E-02    2     -1000037        16                       # TAU2-  -->  W2SS-  NUT                
#         PDG         Width
DECAY   1000023  2.66475715E-02   # Z2SS  decays
#          BR          NDA       ID1       ID2       ID3       ID4
      6.14657097E-07    2      1000022        22                       # Z2SS   -->  Z1SS   GM                 
      5.80075309E-02    2      1000022        23                       # Z2SS   -->  Z1SS   Z0                 
      1.46448929E-06    3      1000022         2        -2             # Z2SS   -->  Z1SS   UP     UB          
      1.71151169E-06    3      1000022         1        -1             # Z2SS   -->  Z1SS   DN     DB          
      1.71151169E-06    3      1000022         3        -3             # Z2SS   -->  Z1SS   ST     SB          
      1.46448770E-06    3      1000022         4        -4             # Z2SS   -->  Z1SS   CH     CB          
      3.22990013E-06    3      1000022         5        -5             # Z2SS   -->  Z1SS   BT     BB          
      2.00835566E-05    3      1000022        11       -11             # Z2SS   -->  Z1SS   E-     E+          
      2.00835566E-05    3      1000022        13       -13             # Z2SS   -->  Z1SS   MU-    MU+         
      2.08786714E-05    3      1000022        15       -15             # Z2SS   -->  Z1SS   TAU-   TAU+        
      2.03839481E-05    3      1000022        12       -12             # Z2SS   -->  Z1SS   NUE    ANUE        
      2.03839481E-05    3      1000022        14       -14             # Z2SS   -->  Z1SS   NUM    ANUM        
      2.07842477E-05    3      1000022        16       -16             # Z2SS   -->  Z1SS   NUT    ANUT        
      9.41859722E-01    2      1000022        25                       # Z2SS   -->  Z1SS   HL0                
#         PDG         Width
DECAY   1000025  4.21519899E+00   # Z3SS  decays
#          BR          NDA       ID1       ID2       ID3       ID4
      1.42950052E-09    2      1000022        22                       # Z3SS   -->  Z1SS   GM                 
      2.96053031E-07    2      1000023        22                       # Z3SS   -->  Z2SS   GM                 
      2.90808082E-01    2      1000024       -24                       # Z3SS   -->  W1SS+  W-                 
      2.90808082E-01    2     -1000024        24                       # Z3SS   -->  W1SS-  W+                 
      1.19333290E-01    2      1000022        23                       # Z3SS   -->  Z1SS   Z0                 
      2.76143640E-01    2      1000023        23                       # Z3SS   -->  Z2SS   Z0                 
      4.98111108E-10    3      1000022         2        -2             # Z3SS   -->  Z1SS   UP     UB          
      1.56240035E-10    3      1000022         1        -1             # Z3SS   -->  Z1SS   DN     DB          
      1.56240035E-10    3      1000022         3        -3             # Z3SS   -->  Z1SS   ST     SB          
      4.98110553E-10    3      1000022         4        -4             # Z3SS   -->  Z1SS   CH     CB          
      1.90137115E-07    3      1000022         5        -5             # Z3SS   -->  Z1SS   BT     BB          
      4.47917659E-09    3      1000022        11       -11             # Z3SS   -->  Z1SS   E-     E+          
      4.47917659E-09    3      1000022        13       -13             # Z3SS   -->  Z1SS   MU-    MU+         
      4.90460081E-07    3      1000022        15       -15             # Z3SS   -->  Z1SS   TAU-   TAU+        
      2.68770783E-09    3      1000022        12       -12             # Z3SS   -->  Z1SS   NUE    ANUE        
      2.68770783E-09    3      1000022        14       -14             # Z3SS   -->  Z1SS   NUM    ANUM        
      2.74774203E-09    3      1000022        16       -16             # Z3SS   -->  Z1SS   NUT    ANUT        
      9.89724969E-11    3      1000023         2        -2             # Z3SS   -->  Z2SS   UP     UB          
      1.63426161E-10    3      1000023         1        -1             # Z3SS   -->  Z2SS   DN     DB          
      1.63426161E-10    3      1000023         3        -3             # Z3SS   -->  Z2SS   ST     SB          
      9.89723720E-11    3      1000023         4        -4             # Z3SS   -->  Z2SS   CH     CB          
      4.39456969E-08    3      1000023         5        -5             # Z3SS   -->  Z2SS   BT     BB          
      8.68168176E-11    3      1000023        11       -11             # Z3SS   -->  Z2SS   E-     E+          
      8.68168176E-11    3      1000023        13       -13             # Z3SS   -->  Z2SS   MU-    MU+         
      1.86606748E-08    3      1000023        15       -15             # Z3SS   -->  Z2SS   TAU-   TAU+        
      4.30828900E-10    3      1000023        12       -12             # Z3SS   -->  Z2SS   NUE    ANUE        
      4.30828900E-10    3      1000023        14       -14             # Z3SS   -->  Z2SS   NUM    ANUM        
      4.41223835E-10    3      1000023        16       -16             # Z3SS   -->  Z2SS   NUT    ANUT        
      1.73178166E-02    2      1000022        25                       # Z3SS   -->  Z1SS   HL0                
      5.58801647E-03    2      1000023        25                       # Z3SS   -->  Z2SS   HL0                
#         PDG         Width
DECAY   1000035  4.56760979E+00   # Z4SS  decays
#          BR          NDA       ID1       ID2       ID3       ID4
      2.05819539E-08    2      1000022        22                       # Z4SS   -->  Z1SS   GM                 
      3.49197684E-08    2      1000023        22                       # Z4SS   -->  Z2SS   GM                 
      3.76905812E-10    2      1000025        22                       # Z4SS   -->  Z3SS   GM                 
      3.02521467E-01    2      1000024       -24                       # Z4SS   -->  W1SS+  W-                 
      3.02521467E-01    2     -1000024        24                       # Z4SS   -->  W1SS-  W+                 
      1.68074053E-02    2      1000022        23                       # Z4SS   -->  Z1SS   Z0                 
      7.23836804E-03    2      1000023        23                       # Z4SS   -->  Z2SS   Z0                 
      1.46125485E-08    3      1000022         2        -2             # Z4SS   -->  Z1SS   UP     UB          
      1.22817756E-08    3      1000022         1        -1             # Z4SS   -->  Z1SS   DN     DB          
      1.22817756E-08    3      1000022         3        -3             # Z4SS   -->  Z1SS   ST     SB          
      1.46125343E-08    3      1000022         4        -4             # Z4SS   -->  Z1SS   CH     CB          
      1.86067609E-07    3      1000022         5        -5             # Z4SS   -->  Z1SS   BT     BB          
      1.56623599E-07    3      1000022        11       -11             # Z4SS   -->  Z1SS   E-     E+          
      1.56623599E-07    3      1000022        13       -13             # Z4SS   -->  Z1SS   MU-    MU+         
      6.15900717E-07    3      1000022        15       -15             # Z4SS   -->  Z1SS   TAU-   TAU+        
      1.90558097E-07    3      1000022        12       -12             # Z4SS   -->  Z1SS   NUE    ANUE        
      1.90558097E-07    3      1000022        14       -14             # Z4SS   -->  Z1SS   NUM    ANUM        
      1.94712229E-07    3      1000022        16       -16             # Z4SS   -->  Z1SS   NUT    ANUT        
      1.79083894E-08    3      1000023         2        -2             # Z4SS   -->  Z2SS   UP     UB          
      2.12837694E-08    3      1000023         1        -1             # Z4SS   -->  Z2SS   DN     DB          
      2.12837694E-08    3      1000023         3        -3             # Z4SS   -->  Z2SS   ST     SB          
      1.79083663E-08    3      1000023         4        -4             # Z4SS   -->  Z2SS   CH     CB          
      8.06264353E-08    3      1000023         5        -5             # Z4SS   -->  Z2SS   BT     BB          
      2.56054182E-08    3      1000023        11       -11             # Z4SS   -->  Z2SS   E-     E+          
      2.56054182E-08    3      1000023        13       -13             # Z4SS   -->  Z2SS   MU-    MU+         
      4.35263132E-08    3      1000023        15       -15             # Z4SS   -->  Z2SS   TAU-   TAU+        
      4.40267947E-08    3      1000023        12       -12             # Z4SS   -->  Z2SS   NUE    ANUE        
      4.40267947E-08    3      1000023        14       -14             # Z4SS   -->  Z2SS   NUM    ANUM        
      4.50831017E-08    3      1000023        16       -16             # Z4SS   -->  Z2SS   NUT    ANUT        
      1.22647448E-08    3      1000025         2        -2             # Z4SS   -->  Z3SS   UP     UB          
      1.58165250E-08    3      1000025         1        -1             # Z4SS   -->  Z3SS   DN     DB          
      1.58165250E-08    3      1000025         3        -3             # Z4SS   -->  Z3SS   ST     SB          
      1.22647448E-08    3      1000025         4        -4             # Z4SS   -->  Z3SS   CH     CB          
      2.75752798E-09    3      1000025         5        -5             # Z4SS   -->  Z3SS   BT     BB          
      3.58803054E-09    3      1000025        11       -11             # Z4SS   -->  Z3SS   E-     E+          
      3.58803054E-09    3      1000025        13       -13             # Z4SS   -->  Z3SS   MU-    MU+         
      2.89521318E-09    3      1000025        15       -15             # Z4SS   -->  Z3SS   TAU-   TAU+        
      7.13788717E-09    3      1000025        12       -12             # Z4SS   -->  Z3SS   NUE    ANUE        
      7.13788717E-09    3      1000025        14       -14             # Z4SS   -->  Z3SS   NUM    ANUM        
      7.13787607E-09    3      1000025        16       -16             # Z4SS   -->  Z3SS   NUT    ANUT        
      1.08097523E-01    2      1000022        25                       # Z4SS   -->  Z1SS   HL0                
      2.62811631E-01    2      1000023        25                       # Z4SS   -->  Z2SS   HL0                
#         PDG         Width
DECAY   1000024  2.34804228E-02   # W1SS+ decays
#          BR          NDA       ID1       ID2       ID3       ID4
      3.64254606E-06    3      1000022         2        -1             # W1SS+  -->  Z1SS   UP     DB          
      3.64254379E-06    3      1000022         4        -3             # W1SS+  -->  Z1SS   CH     SB          
      4.65779376E-05    3      1000022       -11        12             # W1SS+  -->  Z1SS   E+     NUE         
      4.65779376E-05    3      1000022       -13        14             # W1SS+  -->  Z1SS   MU+    NUM         
      4.79605005E-05    3      1000022       -15        16             # W1SS+  -->  Z1SS   TAU+   NUT         
      9.99851584E-01    2      1000022        24                       # W1SS+  -->  Z1SS   W+                 
      1.74371229E-11    3      1000023       -11        12             # W1SS+  -->  Z2SS   E+     NUE         
      1.74371229E-11    3      1000023       -13        14             # W1SS+  -->  Z2SS   MU+    NUM         
#         PDG         Width
DECAY   1000037  4.43655872E+00   # W2SS+ decays
#          BR          NDA       ID1       ID2       ID3       ID4
      2.07861746E-08    3      1000022         2        -1             # W2SS+  -->  Z1SS   UP     DB          
      2.07861639E-08    3      1000022         4        -3             # W2SS+  -->  Z1SS   CH     SB          
      2.87353970E-07    3      1000022       -11        12             # W2SS+  -->  Z1SS   E+     NUE         
      2.87353970E-07    3      1000022       -13        14             # W2SS+  -->  Z1SS   MU+    NUM         
      7.67391896E-07    3      1000022       -15        16             # W2SS+  -->  Z1SS   TAU+   NUT         
      1.16809681E-01    2      1000022        24                       # W2SS+  -->  Z1SS   W+                 
      1.47240007E-08    3      1000023         2        -1             # W2SS+  -->  Z2SS   UP     DB          
      1.47239945E-08    3      1000023         4        -3             # W2SS+  -->  Z2SS   CH     SB          
      2.65842548E-08    3      1000023       -11        12             # W2SS+  -->  Z2SS   E+     NUE         
      2.65842548E-08    3      1000023       -13        14             # W2SS+  -->  Z2SS   MU+    NUM         
      4.72261839E-08    3      1000023       -15        16             # W2SS+  -->  Z2SS   TAU+   NUT         
      3.05942059E-01    2      1000023        24                       # W2SS+  -->  Z2SS   W+                 
      4.57552574E-08    3      1000025         2        -1             # W2SS+  -->  Z3SS   UP     DB          
      4.57552574E-08    3      1000025         4        -3             # W2SS+  -->  Z3SS   CH     SB          
      1.52513859E-08    3      1000025       -11        12             # W2SS+  -->  Z3SS   E+     NUE         
      1.52513859E-08    3      1000025       -13        14             # W2SS+  -->  Z3SS   MU+    NUM         
      1.52534874E-08    3      1000025       -15        16             # W2SS+  -->  Z3SS   TAU+   NUT         
      3.35269114E-16    3      1000035       -11        12             # W2SS+  -->  Z4SS   E+     NUE         
      3.35269114E-16    3      1000035       -13        14             # W2SS+  -->  Z4SS   MU+    NUM         
      2.94745535E-01    2      1000024        23                       # W2SS+  -->  W1SS+  Z0                 
      1.98796464E-08    3      1000024         1        -1             # W2SS+  -->  W1SS+  DN     DB          
      1.98796233E-08    3      1000024         3        -3             # W2SS+  -->  W1SS+  ST     SB          
      3.42249429E-08    3      1000024         2        -2             # W2SS+  -->  W1SS+  UP     UB          
      3.42249429E-08    3      1000024         4        -4             # W2SS+  -->  W1SS+  CH     CB          
      6.00532033E-08    3      1000024        12       -12             # W2SS+  -->  W1SS+  NUE    ANUE        
      6.00532033E-08    3      1000024        14       -14             # W2SS+  -->  W1SS+  NUM    ANUM        
      7.93491068E-08    3      1000024        16       -16             # W2SS+  -->  W1SS+  NUT    ANUT        
      3.51005269E-08    3      1000024        11       -11             # W2SS+  -->  W1SS+  E-     E+          
      3.51005269E-08    3      1000024        13       -13             # W2SS+  -->  W1SS+  MU-    MU+         
      3.59463073E-08    3      1000024        15       -15             # W2SS+  -->  W1SS+  TAU-   TAU+        
      2.82500654E-01    2      1000024        25                       # W2SS+  -->  W1SS+  HL0                
#         PDG         Width
DECAY        25  4.19240119E-03   # HL0   decays
#          BR          NDA       ID1       ID2       ID3       ID4
      4.78504569E-09    2           11       -11                       # HL0    -->  E-     E+                 
      2.02032272E-04    2           13       -13                       # HL0    -->  MU-    MU+                
      5.77845685E-02    2           15       -15                       # HL0    -->  TAU-   TAU+               
      6.00461999E-06    2            1        -1                       # HL0    -->  DN     DB                 
      2.42616725E-03    2            3        -3                       # HL0    -->  ST     SB                 
      7.93957114E-01    2            5        -5                       # HL0    -->  BT     BB                 
      1.89468483E-06    2            2        -2                       # HL0    -->  UP     UB                 
      3.55998017E-02    2            4        -4                       # HL0    -->  CH     CB                 
      1.86751201E-03    2           22        22                       # HL0    -->  GM     GM                 
      3.95682827E-02    2           21        21                       # HL0    -->  GL     GL                 
      3.52758914E-03    3           24        11       -12             # HL0    -->  W+     E-     ANUE        
      3.52758914E-03    3           24        13       -14             # HL0    -->  W+     MU-    ANUM        
      3.52758914E-03    3           24        15       -16             # HL0    -->  W+     TAU-   ANUT        
      1.05827674E-02    3           24        -2         1             # HL0    -->  W+     UB     DN          
      1.05827674E-02    3           24        -4         3             # HL0    -->  W+     CB     ST          
      3.52758914E-03    3          -24       -11        12             # HL0    -->  W-     E+     NUE         
      3.52758914E-03    3          -24       -13        14             # HL0    -->  W-     MU+    NUM         
      3.52758914E-03    3          -24       -15        16             # HL0    -->  W-     TAU+   NUT         
      1.05827674E-02    3          -24         2        -1             # HL0    -->  W-     UP     DB          
      1.05827674E-02    3          -24         4        -3             # HL0    -->  W-     CH     SB          
      3.48120840E-04    3           23        12       -12             # HL0    -->  Z0     NUE    ANUE        
      3.48120840E-04    3           23        14       -14             # HL0    -->  Z0     NUM    ANUM        
      3.48120840E-04    3           23        16       -16             # HL0    -->  Z0     NUT    ANUT        
      1.75205729E-04    3           23        11       -11             # HL0    -->  Z0     E-     E+          
      1.75205729E-04    3           23        13       -13             # HL0    -->  Z0     MU-    MU+         
      1.75205729E-04    3           23        15       -15             # HL0    -->  Z0     TAU-   TAU+        
      6.00239960E-04    3           23         2        -2             # HL0    -->  Z0     UP     UB          
      6.00239960E-04    3           23         4        -4             # HL0    -->  Z0     CH     CB          
      7.73256936E-04    3           23         1        -1             # HL0    -->  Z0     DN     DB          
      7.73256936E-04    3           23         3        -3             # HL0    -->  Z0     ST     SB          
      7.73256936E-04    3           23         5        -5             # HL0    -->  Z0     BT     BB          
#         PDG         Width
DECAY        35  1.09337587E+01   # HH0   decays
#          BR          NDA       ID1       ID2       ID3       ID4
      2.62509148E-09    2           11       -11                       # HH0    -->  E-     E+                 
      1.10836103E-04    2           13       -13                       # HH0    -->  MU-    MU+                
      3.17449495E-02    2           15       -15                       # HH0    -->  TAU-   TAU+               
      3.20265349E-06    2            1        -1                       # HH0    -->  DN     DB                 
      1.29403407E-03    2            3        -3                       # HH0    -->  ST     SB                 
      1.69611707E-01    2            5        -5                       # HH0    -->  BT     BB                 
      1.03913170E-10    2            2        -2                       # HH0    -->  UP     UB                 
      1.37887844E-06    2            4        -4                       # HH0    -->  CH     CB                 
      6.93436265E-02    2            6        -6                       # HH0    -->  TP     TB                 
      6.44063050E-07    2           22        22                       # HH0    -->  GM     GM                 
      2.40555328E-05    2           21        21                       # HH0    -->  GL     GL                 
      6.78566794E-05    2           24       -24                       # HH0    -->  W+     W-                 
      3.46952002E-05    2           23        23                       # HH0    -->  Z0     Z0                 
      1.04370981E-03    2      1000022   1000022                       # HH0    -->  Z1SS   Z1SS               
      8.02866463E-03    2      1000022   1000023                       # HH0    -->  Z1SS   Z2SS               
      7.17333108E-02    2      1000022   1000025                       # HH0    -->  Z1SS   Z3SS               
      2.26950068E-02    2      1000022   1000035                       # HH0    -->  Z1SS   Z4SS               
      1.10307746E-02    2      1000023   1000023                       # HH0    -->  Z2SS   Z2SS               
      1.67590350E-01    2      1000023   1000025                       # HH0    -->  Z2SS   Z3SS               
      2.09871493E-02    2      1000023   1000035                       # HH0    -->  Z2SS   Z4SS               
      2.27510836E-02    2      1000024  -1000024                       # HH0    -->  W1SS+  W1SS-              
      2.00862899E-01    2      1000024  -1000037                       # HH0    -->  W1SS+  W2SS-              
      2.00862899E-01    2     -1000024   1000037                       # HH0    -->  W1SS-  W2SS+              
      1.77138179E-04    2           25        25                       # HH0    -->  HL0    HL0                
#         PDG         Width
DECAY        36  1.04813147E+01   # HA0   decays
#          BR          NDA       ID1       ID2       ID3       ID4
      2.72073031E-09    2           11       -11                       # HA0    -->  E-     E+                 
      1.14874136E-04    2           13       -13                       # HA0    -->  MU-    MU+                
      3.29016410E-02    2           15       -15                       # HA0    -->  TAU-   TAU+               
      3.31949900E-06    2            1        -1                       # HA0    -->  DN     DB                 
      1.34124549E-03    2            3        -3                       # HA0    -->  ST     SB                 
      1.75802439E-01    2            5        -5                       # HA0    -->  BT     BB                 
      1.06213323E-10    2            2        -2                       # HA0    -->  UP     UB                 
      1.41044654E-06    2            4        -4                       # HA0    -->  CH     CB                 
      7.33622983E-02    2            6        -6                       # HA0    -->  TP     TB                 
      7.84304035E-08    2           22        22                       # HA0    -->  GM     GM                 
      4.05745050E-05    2           21        21                       # HA0    -->  GL     GL                 
      1.50807144E-03    2      1000022   1000022                       # HA0    -->  Z1SS   Z1SS               
      1.48321306E-02    2      1000022   1000023                       # HA0    -->  Z1SS   Z2SS               
      2.74493266E-02    2      1000022   1000025                       # HA0    -->  Z1SS   Z3SS               
      6.35583401E-02    2      1000022   1000035                       # HA0    -->  Z1SS   Z4SS               
      3.13184559E-02    2      1000023   1000023                       # HA0    -->  Z2SS   Z2SS               
      2.68720984E-02    2      1000023   1000025                       # HA0    -->  Z2SS   Z3SS               
      1.37034595E-01    2      1000023   1000035                       # HA0    -->  Z2SS   Z4SS               
      6.45952150E-02    2      1000024  -1000024                       # HA0    -->  W1SS+  W1SS-              
      1.74597099E-01    2      1000024  -1000037                       # HA0    -->  W1SS+  W2SS-              
      1.74597099E-01    2     -1000024   1000037                       # HA0    -->  W1SS-  W2SS+              
      6.96199932E-05    2           25        23                       # HA0    -->  HL0    Z0                 
#         PDG         Width
DECAY        37  1.06821375E+01   # H+    decays
#          BR          NDA       ID1       ID2       ID3       ID4
      2.69219069E-09    2           12       -11                       # H+     -->  NUE    E+                 
      1.13669143E-04    2           14       -13                       # H+     -->  NUM    MU+                
      3.25565152E-02    2           16       -15                       # H+     -->  NUT    TAU+               
      3.03158345E-06    2            2        -1                       # H+     -->  UP     DB                 
      1.22615928E-03    2            4        -3                       # H+     -->  CH     SB                 
      2.23287135E-01    2            6        -5                       # H+     -->  TP     BB                 
      2.21346784E-02    2      1000024   1000022                       # H+     -->  W1SS+  Z1SS               
      5.48621847E-06    2      1000024   1000023                       # H+     -->  W1SS+  Z2SS               
      2.10066780E-01    2      1000024   1000025                       # H+     -->  W1SS+  Z3SS               
      2.06799850E-01    2      1000024   1000035                       # H+     -->  W1SS+  Z4SS               
      8.21084231E-02    2      1000037   1000022                       # H+     -->  W2SS+  Z1SS               
      2.21629038E-01    2      1000037   1000023                       # H+     -->  W2SS+  Z2SS               
      6.93121547E-05    2           25        24                       # H+     -->  HL0    W+                 
