#  ISAJET SUSY parameters in SUSY Les Houches Accord 2 format
#  Created by ISALHA 2.0 Last revision: C. Balazs 21 Apr 2009
Block SPINFO   # Program information
     1   ISASUGRA from ISAJET          # Spectrum Calculator
     2   7.80   29-OCT-2009 12:50:36   # Version number
Block MODSEL   # Model selection
     1     0   #   MsR(Q)          MbR(Q)                          
Block SMINPUTS   # Standard Model inputs
     1     1.27837601E+02   # alpha_em^(-1)
     2     1.16570000E-05   # G_Fermi
     3     1.17200002E-01   # alpha_s(M_Z)
     4     9.11699982E+01   # m_{Z}(pole)
     5     4.19999981E+00   # m_{b}(m_{b})
     6     1.72500000E+02   # m_{top}(pole)
     7     1.77699995E+00   # m_{tau}(pole)
Block MINPAR   # SUSY breaking input parameters
Block MASS   # Scalar and gaugino mass spectrum
#  PDG code   mass                 particle
        24     8.04229965E+01   #  W^+
        25     1.20300003E+02   #  h^0            
        35     2.51774731E+03   #  H^0            
        36     2.50000000E+03   #  A^0            
        37     2.51616333E+03   #  H^+            
   1000001     6.52158386E+02   #  dnl            
   1000002     6.48231201E+02   #  upl            
   1000003     6.52158386E+02   #  stl            
   1000004     6.48232605E+02   #  chl            
   1000005     6.50384460E+02   #  b1             
   1000006     6.64692627E+02   #  t1             
   1000011     2.50035645E+03   #  el-            
   1000012     2.49933496E+03   #  nuel           
   1000013     2.50035645E+03   #  mul-           
   1000014     2.49933496E+03   #  numl           
   1000015     2.50029565E+03   #  tau1           
   1000016     2.49933496E+03   #  nutl           
   1000021     4.00000000E+02   #  glss           
   1000022     1.49481934E+02   #  z1ss           
   1000023     2.42853882E+03   #  z2ss           
   1000024     2.42832593E+03   #  w1ss           
   1000025    -2.50040601E+03   #  z3ss           
   1000035     2.57238525E+03   #  z4ss           
   1000037     2.57219092E+03   #  w2ss           
   2000001     6.50395447E+02   #  dnr            
   2000002     6.49208374E+02   #  upr            
   2000003     6.50395447E+02   #  str            
   2000004     6.49209778E+02   #  chr            
   2000005     6.52181885E+02   #  b2             
   2000006     6.65715820E+02   #  t2             
   2000011     2.50030859E+03   #  er-            
   2000013     2.50030859E+03   #  mur-           
   2000015     2.50037036E+03   #  tau2           
Block ALPHA   # Effective Higgs mixing parameter
         -3.22553903E-01   # alpha
Block STOPMIX   # stop mixing matrix
  1  1     7.24029243E-01   # O_{11}
  1  2     6.89769328E-01   # O_{12}
  2  1    -6.89769328E-01   # O_{21}
  2  2     7.24029243E-01   # O_{22}
Block SBOTMIX   # sbottom mixing matrix
  1  1     5.52335052E-07   # O_{11}
  1  2    -1.00000000E+00   # O_{12}
  2  1     1.00000000E+00   # O_{21}
  2  2     5.52335052E-07   # O_{22}
Block STAUMIX   # stau mixing matrix
  1  1     2.81731172E-06   # O_{11}
  1  2    -1.00000000E+00   # O_{12}
  2  1     1.00000000E+00   # O_{21}
  2  2     2.81731172E-06   # O_{22}
Block NMIX   # neutralino mixing matrix
  1  1     9.99830484E-01   #
  1  2    -4.00799792E-04   #
  1  3     1.71788409E-02   #
  1  4    -6.62148744E-03   #
  2  1     1.22056603E-02   #
  2  2     7.08085597E-01   #
  2  3    -5.02838492E-01   #
  2  4     4.95600075E-01   #
  3  1    -7.46043026E-03   #
  3  2     7.19459588E-03   #
  3  3     7.06954181E-01   #
  3  4     7.07183778E-01   #
  4  1     1.15966070E-02   #
  4  2    -7.06089973E-01   #
  4  3    -4.97065961E-01   #
  4  4     5.04210234E-01   #
Block UMIX   # chargino U mixing matrix
  1  1    -7.02002406E-01   # U_{11}
  1  2     7.12174535E-01   # U_{12}
  2  1    -7.12174535E-01   # U_{21}
  2  2    -7.02002406E-01   # U_{22}
Block VMIX   # chargino V mixing matrix
  1  1    -7.12174356E-01   # V_{11}
  1  2     7.02002585E-01   # V_{12}
  2  1    -7.02002585E-01   # V_{21}
  2  2    -7.12174356E-01   # V_{22}
Block GAUGE Q=  0.00000000E+00   #
     1     0.00000000E+00   # g`
     2     0.00000000E+00   # g_2
     3     0.00000000E+00   # g_3
Block YU Q=  0.00000000E+00   #
  3  3     0.00000000E+00   # y_t
Block YD Q=  0.00000000E+00   #
  3  3     0.00000000E+00   # y_b
Block YE Q=  0.00000000E+00   #
  3  3     0.00000000E+00   # y_tau
Block HMIX Q=  0.00000000E+00   # Higgs mixing parameters
     1     0.00000000E+00   # mu(Q)
     2     0.00000000E+00   # tan(beta)(M_GUT)
     3     0.00000000E+00   # Higgs vev at Q
     4     6.25000000E+06   # m_A^2(Q)
Block MSOFT Q=  0.00000000E+00   # DRbar SUSY breaking parameters
     1     0.00000000E+00   # M_1(Q)          
     2     0.00000000E+00   # M_2(Q)          
     3     0.00000000E+00   # M_3(Q)          
    31     0.00000000E+00   # MeL(Q)          
    32     0.00000000E+00   # MmuL(Q)         
    33     0.00000000E+00   # MtauL(Q)        
    34     0.00000000E+00   # MeR(Q)          
    35     0.00000000E+00   # MmuR(Q)         
    36     0.00000000E+00   # MtauR(Q)        
    41     0.00000000E+00   # MqL1(Q)         
    42     0.00000000E+00   # MqL2(Q)         
    43     0.00000000E+00   # MqL3(Q)         
    44     0.00000000E+00   # MuR(Q)          
    45     0.00000000E+00   # McR(Q)          
    46     0.00000000E+00   # MtR(Q)          
    47     0.00000000E+00   # MdR(Q)          
    48     0.00000000E+00   # MsR(Q)          
    49     0.00000000E+00   # MbR(Q)          
Block AU Q=  0.00000000E+00   #
  1  1     0.00000000E+00   # A_u
  2  2     0.00000000E+00   # A_c
  3  3     0.00000000E+00   # A_t
Block AD Q=  0.00000000E+00   #
  1  1     0.00000000E+00   # A_d
  2  2     0.00000000E+00   # A_s
  3  3     0.00000000E+00   # A_b
Block AE Q=  0.00000000E+00   #
  1  1     0.00000000E+00   # A_e
  2  2     0.00000000E+00   # A_mu
  3  3     0.00000000E+00   # A_tau
#         PDG         Width
DECAY   1000021  2.13064210E-04   # GLSS  decays
#          BR          NDA       ID1       ID2       ID3       ID4
      1.56918803E-04    2      1000022        21                       # GLSS   -->  Z1SS   GL                 
      3.48214626E-01    3      1000022         2        -2             # GLSS   -->  Z1SS   UP     UB          
      1.01276994E-01    3      1000022         1        -1             # GLSS   -->  Z1SS   DN     DB          
      1.01276994E-01    3      1000022         3        -3             # GLSS   -->  Z1SS   ST     SB          
      3.48210841E-01    3      1000022         4        -4             # GLSS   -->  Z1SS   CH     CB          
      1.00848481E-01    3      1000022         5        -5             # GLSS   -->  Z1SS   BT     BB          
      1.51559507E-05    2      1000039        21                       # GLSS   -->  GVSS   GL                 
#         PDG         Width
DECAY   1000002  1.60555019E+01   # UPL   decays
#          BR          NDA       ID1       ID2       ID3       ID4
      5.08968346E-03    2      1000022         2                       # UPL    -->  Z1SS   UP                 
      9.94910359E-01    2      1000021         2                       # UPL    -->  GLSS   UP                 
#         PDG         Width
DECAY   1000001  1.63812218E+01   # DNL   decays
#          BR          NDA       ID1       ID2       ID3       ID4
      5.06965164E-03    2      1000022         1                       # DNL    -->  Z1SS   DN                 
      9.94930327E-01    2      1000021         1                       # DNL    -->  GLSS   DN                 
#         PDG         Width
DECAY   1000003  1.63812218E+01   # STL   decays
#          BR          NDA       ID1       ID2       ID3       ID4
      5.06965164E-03    2      1000022         3                       # STL    -->  Z1SS   ST                 
      9.94930327E-01    2      1000021         3                       # STL    -->  GLSS   ST                 
#         PDG         Width
DECAY   1000004  1.60552559E+01   # CHL   decays
#          BR          NDA       ID1       ID2       ID3       ID4
      5.08972630E-03    2      1000022         4                       # CHL    -->  Z1SS   CH                 
      9.94910300E-01    2      1000021         4                       # CHL    -->  GLSS   CH                 
#         PDG         Width
DECAY   1000005  1.64763050E+01   # BT1   decays
#          BR          NDA       ID1       ID2       ID3       ID4
      2.00040434E-02    2      1000022         5                       # BT1    -->  Z1SS   BT                 
      9.79995906E-01    2      1000021         5                       # BT1    -->  GLSS   BT                 
#         PDG         Width
DECAY   1000006  1.85890465E+01   # TP1   decays
#          BR          NDA       ID1       ID2       ID3       ID4
      9.66955138E-09    2      1000022         4                       # TP1    -->  Z1SS   CH                 
      9.65531528E-01    2      1000021         6                       # TP1    -->  GLSS   TP                 
      3.44684906E-02    2      1000022         6                       # TP1    -->  Z1SS   TP                 
#         PDG         Width
DECAY   2000002  1.73701477E+01   # UPR   decays
#          BR          NDA       ID1       ID2       ID3       ID4
      7.57416338E-02    2      1000022         2                       # UPR    -->  Z1SS   UP                 
      9.24258351E-01    2      1000021         2                       # UPR    -->  GLSS   UP                 
#         PDG         Width
DECAY   2000001  1.64822063E+01   # DNR   decays
#          BR          NDA       ID1       ID2       ID3       ID4
      2.00001597E-02    2      1000022         1                       # DNR    -->  Z1SS   DN                 
      9.79999840E-01    2      1000021         1                       # DNR    -->  GLSS   DN                 
#         PDG         Width
DECAY   2000003  1.64822063E+01   # STR   decays
#          BR          NDA       ID1       ID2       ID3       ID4
      2.00001597E-02    2      1000022         3                       # STR    -->  Z1SS   ST                 
      9.79999840E-01    2      1000021         3                       # STR    -->  GLSS   ST                 
#         PDG         Width
DECAY   2000004  1.73698921E+01   # CHR   decays
#          BR          NDA       ID1       ID2       ID3       ID4
      7.57422000E-02    2      1000022         4                       # CHR    -->  Z1SS   CH                 
      9.24257815E-01    2      1000021         4                       # CHR    -->  GLSS   CH                 
#         PDG         Width
DECAY   2000005  1.63782310E+01   # BT2   decays
#          BR          NDA       ID1       ID2       ID3       ID4
      5.07030217E-03    2      1000022         5                       # BT2    -->  Z1SS   BT                 
      9.94929731E-01    2      1000021         5                       # BT2    -->  GLSS   BT                 
#         PDG         Width
DECAY   2000006  5.92412758E+00   # TP2   decays
#          BR          NDA       ID1       ID2       ID3       ID4
      3.03416456E-08    2      1000022         4                       # TP2    -->  Z1SS   CH                 
      9.00741518E-01    2      1000021         6                       # TP2    -->  GLSS   TP                 
      9.92585123E-02    2      1000022         6                       # TP2    -->  Z1SS   TP                 
#         PDG         Width
DECAY   1000011  3.20173049E+00   # EL-   decays
#          BR          NDA       ID1       ID2       ID3       ID4
      9.84158218E-01    2      1000022        11                       # EL-    -->  Z1SS   E-                 
      5.38449083E-03    2      1000023        11                       # EL-    -->  Z2SS   E-                 
      1.04477694E-02    2     -1000024        12                       # EL-    -->  W1SS-  NUE                
      9.62539798E-06    2           11   1000039                       # EL-    -->  E-     GVSS               
#         PDG         Width
DECAY   1000013  3.20173049E+00   # MUL-  decays
#          BR          NDA       ID1       ID2       ID3       ID4
      9.84158218E-01    2      1000022        13                       # MUL-   -->  Z1SS   MU-                
      5.38448477E-03    2      1000023        13                       # MUL-   -->  Z2SS   MU-                
      1.04477694E-02    2     -1000024        14                       # MUL-   -->  W1SS-  NUM                
      9.62539798E-06    2           13   1000039                       # MUL-   -->  MU-    GVSS               
#         PDG         Width
DECAY   1000015  1.26222897E+01   # TAU1- decays
#          BR          NDA       ID1       ID2       ID3       ID4
      9.99987483E-01    2      1000022        15                       # TAU1-  -->  Z1SS   TAU-               
      3.72085310E-06    2      1000023        15                       # TAU1-  -->  Z2SS   TAU-               
      6.41875067E-06    2     -1000024        16                       # TAU1-  -->  W1SS-  NUT                
      2.44124658E-06    2           15   1000039                       # TAU1-  -->  TAU-   GVSS               
#         PDG         Width
DECAY   1000012  3.20856476E+00   # NUEL  decays
#          BR          NDA       ID1       ID2       ID3       ID4
      9.84523118E-01    2      1000022        12                       # NUEL   -->  Z1SS   NUE                
      5.03116241E-03    2      1000023        12                       # NUEL   -->  Z2SS   NUE                
      1.04361018E-02    2      1000024        11                       # NUEL   -->  W1SS+  E-                 
      9.58528926E-06    2           12   1000039                       # NUEL   -->  NUE    GVSS               
#         PDG         Width
DECAY   1000014  3.20856476E+00   # NUML  decays
#          BR          NDA       ID1       ID2       ID3       ID4
      9.84523118E-01    2      1000022        14                       # NUML   -->  Z1SS   NUM                
      5.03116241E-03    2      1000023        14                       # NUML   -->  Z2SS   NUM                
      1.04360916E-02    2      1000024        13                       # NUML   -->  W1SS+  MU-                
      9.58528926E-06    2           14   1000039                       # NUML   -->  NUM    GVSS               
#         PDG         Width
DECAY   1000016  3.20855260E+00   # NUTL  decays
#          BR          NDA       ID1       ID2       ID3       ID4
      9.84526873E-01    2      1000022        16                       # NUTL   -->  Z1SS   NUT                
      5.03118150E-03    2      1000023        16                       # NUTL   -->  Z2SS   NUT                
      1.04323858E-02    2      1000024        15                       # NUTL   -->  W1SS+  TAU-               
      9.58532564E-06    2           16   1000039                       # NUTL   -->  NUT    GVSS               
#         PDG         Width
DECAY   2000011  1.26222334E+01   # ER-   decays
#          BR          NDA       ID1       ID2       ID3       ID4
      9.99997139E-01    2      1000022        11                       # ER-    -->  Z1SS   E-                 
      4.80593144E-07    2      1000023        11                       # ER-    -->  Z2SS   E-                 
      2.83869438E-40    3      1000015        12       -16             # ER-    -->  TAU1-  NUE    ANUT        
      2.44132502E-06    2           11   1000039                       # ER-    -->  E-     GVSS               
#         PDG         Width
DECAY   2000013  1.26222334E+01   # MUR-  decays
#          BR          NDA       ID1       ID2       ID3       ID4
      9.99997139E-01    2      1000022        13                       # MUR-   -->  Z1SS   MU-                
      4.80592632E-07    2      1000023        13                       # MUR-   -->  Z2SS   MU-                
      1.21620574E-35    3      1000015        14       -16             # MUR-   -->  TAU1-  NUM    ANUT        
      2.44132502E-06    2           13   1000039                       # MUR-   -->  MU-    GVSS               
#         PDG         Width
DECAY   2000015  3.20174360E+00   # TAU2- decays
#          BR          NDA       ID1       ID2       ID3       ID4
      9.84163702E-01    2      1000022        15                       # TAU2-  -->  Z1SS   TAU-               
      5.38468268E-03    2      1000023        15                       # TAU2-  -->  Z2SS   TAU-               
      1.04516475E-02    2     -1000024        16                       # TAU2-  -->  W1SS-  NUT                
#         PDG         Width
DECAY   1000022  1.92892213E-11   # Z1SS  decays
#          BR          NDA       ID1       ID2       ID3       ID4
      9.36365068E-01    2      1000039        22                       # Z1SS   -->  GVSS   GM                 
      1.95385683E-02    3      1000039        11       -11             # Z1SS   -->  GVSS   E-     E+          
      4.40963209E-02    2      1000039        23                       # Z1SS   -->  GVSS   Z0                 
      6.54690613E-09    2      1000039        25                       # Z1SS   -->  GVSS   HL0                
#         PDG         Width
DECAY   1000023  1.33721039E+02   # Z2SS  decays
#          BR          NDA       ID1       ID2       ID3       ID4
      8.32781453E-08    2      1000022        22                       # Z2SS   -->  Z1SS   GM                 
      1.00231834E-03    2      1000022        23                       # Z2SS   -->  Z1SS   Z0                 
      5.85598094E-08    3      1000022         5        -5             # Z2SS   -->  Z1SS   BT     BB          
      4.99407997E-06    3      1000022        11       -11             # Z2SS   -->  Z1SS   E-     E+          
      4.99407997E-06    3      1000022        13       -13             # Z2SS   -->  Z1SS   MU-    MU+         
      5.08070889E-06    3      1000022        15       -15             # Z2SS   -->  Z1SS   TAU-   TAU+        
      4.83881240E-06    3      1000022        12       -12             # Z2SS   -->  Z1SS   NUE    ANUE        
      4.83881240E-06    3      1000022        14       -14             # Z2SS   -->  Z1SS   NUM    ANUM        
      4.83881240E-06    3      1000022        16       -16             # Z2SS   -->  Z1SS   NUT    ANUT        
      5.36348531E-03    2      1000022        25                       # Z2SS   -->  Z1SS   HL0                
      4.99067120E-02    2      1000002        -2                       # Z2SS   -->  UPL    UB                 
      4.99067120E-02    2     -1000002         2                       # Z2SS   -->  UBL    UP                 
      4.91883941E-02    2      1000001        -1                       # Z2SS   -->  DNL    DB                 
      4.91883941E-02    2     -1000001         1                       # Z2SS   -->  DBL    DN                 
      4.91883941E-02    2      1000003        -3                       # Z2SS   -->  STL    SB                 
      4.91883941E-02    2     -1000003         3                       # Z2SS   -->  SBL    ST                 
      4.99066748E-02    2      1000004        -4                       # Z2SS   -->  CHL    CB                 
      4.99066748E-02    2     -1000004         4                       # Z2SS   -->  CBL    CH                 
      7.90995909E-06    2      2000002        -2                       # Z2SS   -->  UPR    UB                 
      7.90995909E-06    2     -2000002         2                       # Z2SS   -->  UBR    UP                 
      1.97637610E-06    2      2000001        -1                       # Z2SS   -->  DNR    DB                 
      1.97637610E-06    2     -2000001         1                       # Z2SS   -->  DBR    DN                 
      1.97637610E-06    2      2000003        -3                       # Z2SS   -->  STR    SB                 
      1.97637610E-06    2     -2000003         3                       # Z2SS   -->  SBR    ST                 
      7.90995364E-06    2      2000004        -4                       # Z2SS   -->  CHR    CB                 
      7.90995364E-06    2     -2000004         4                       # Z2SS   -->  CBR    CH                 
      3.16876103E-04    2      1000005        -5                       # Z2SS   -->  BT1    BB                 
      3.16876103E-04    2     -1000005         5                       # Z2SS   -->  BB1    BT                 
      4.95375991E-02    2      2000005        -5                       # Z2SS   -->  BT2    BB                 
      4.95375991E-02    2     -2000005         5                       # Z2SS   -->  BB2    BT                 
      2.05311880E-01    2      1000006        -6                       # Z2SS   -->  TP1    TB                 
      2.05311880E-01    2     -1000006         6                       # Z2SS   -->  TB1    TP                 
      4.34259549E-02    2      2000006        -6                       # Z2SS   -->  TP2    TB                 
      4.34259549E-02    2     -2000006         6                       # Z2SS   -->  TB2    TP                 
      2.46491254E-08    2      1000039        22                       # Z2SS   -->  GVSS   GM                 
      6.28264496E-10    3      1000039        11       -11             # Z2SS   -->  GVSS   E-     E+          
      1.14049165E-07    2      1000039        23                       # Z2SS   -->  GVSS   Z0                 
      9.51821022E-09    2      1000039        25                       # Z2SS   -->  GVSS   HL0                
#         PDG         Width
DECAY   1000025  1.03344200E+02   # Z3SS  decays
#          BR          NDA       ID1       ID2       ID3       ID4
      1.40909782E-08    2      1000022        22                       # Z3SS   -->  Z1SS   GM                 
      5.10006516E-11    2      1000023        22                       # Z3SS   -->  Z2SS   GM                 
      8.21937465E-06    3     -1000024         2        -1             # Z3SS   -->  W1SS-  UP     DB          
      2.73979140E-06    3     -1000024        12       -11             # Z3SS   -->  W1SS-  NUE    E+          
      2.73979140E-06    3     -1000024        14       -13             # Z3SS   -->  W1SS-  NUM    MU+         
      8.21937465E-06    3      1000024         1        -2             # Z3SS   -->  W1SS+  DN     UB          
      2.73979140E-06    3      1000024        11       -12             # Z3SS   -->  W1SS+  E-     ANUE        
      2.73979140E-06    3      1000024        13       -14             # Z3SS   -->  W1SS+  MU-    ANUM        
      8.21937465E-06    3     -1000024         4        -3             # Z3SS   -->  W1SS-  CH     SB          
      2.73979140E-06    3     -1000024        16       -15             # Z3SS   -->  W1SS-  NUT    TAU+        
      8.21937465E-06    3      1000024         3        -4             # Z3SS   -->  W1SS+  ST     CB          
      2.73979140E-06    3      1000024        15       -16             # Z3SS   -->  W1SS+  TAU-   ANUT        
      1.39641250E-02    2      1000022        23                       # Z3SS   -->  Z1SS   Z0                 
      1.87510892E-07    3      1000022         5        -5             # Z3SS   -->  Z1SS   BT     BB          
      2.33655548E-08    3      1000022        15       -15             # Z3SS   -->  Z1SS   TAU-   TAU+        
      1.83129032E-06    3      1000023         2        -2             # Z3SS   -->  Z2SS   UP     UB          
      2.36146093E-06    3      1000023         1        -1             # Z3SS   -->  Z2SS   DN     DB          
      2.36146093E-06    3      1000023         3        -3             # Z3SS   -->  Z2SS   ST     SB          
      1.83129032E-06    3      1000023         4        -4             # Z3SS   -->  Z2SS   CH     CB          
      2.28295085E-06    3      1000023         5        -5             # Z3SS   -->  Z2SS   BT     BB          
      5.35696245E-07    3      1000023        11       -11             # Z3SS   -->  Z2SS   E-     E+          
      5.35696245E-07    3      1000023        13       -13             # Z3SS   -->  Z2SS   MU-    MU+         
      5.32511194E-07    3      1000023        15       -15             # Z3SS   -->  Z2SS   TAU-   TAU+        
      1.06586708E-06    3      1000023        12       -12             # Z3SS   -->  Z2SS   NUE    ANUE        
      1.06586708E-06    3      1000023        14       -14             # Z3SS   -->  Z2SS   NUM    ANUM        
      1.06586708E-06    3      1000023        16       -16             # Z3SS   -->  Z2SS   NUT    ANUT        
      2.69526802E-03    2      1000022        25                       # Z3SS   -->  Z1SS   HL0                
      4.51443157E-06    2      1000002        -2                       # Z3SS   -->  UPL    UB                 
      4.51443157E-06    2     -1000002         2                       # Z3SS   -->  UBL    UP                 
      9.72575344E-06    2      1000001        -1                       # Z3SS   -->  DNL    DB                 
      9.72575344E-06    2     -1000001         1                       # Z3SS   -->  DBL    DN                 
      9.72575344E-06    2      1000003        -3                       # Z3SS   -->  STL    SB                 
      9.72575344E-06    2     -1000003         3                       # Z3SS   -->  SBL    ST                 
      4.51442884E-06    2      1000004        -4                       # Z3SS   -->  CHL    CB                 
      4.51442884E-06    2     -1000004         4                       # Z3SS   -->  CBL    CH                 
      3.97134727E-06    2      2000002        -2                       # Z3SS   -->  UPR    UB                 
      3.97134727E-06    2     -2000002         2                       # Z3SS   -->  UBR    UP                 
      9.92311584E-07    2      2000001        -1                       # Z3SS   -->  DNR    DB                 
      9.92311584E-07    2     -2000001         1                       # Z3SS   -->  DBR    DN                 
      9.92311584E-07    2      2000003        -3                       # Z3SS   -->  STR    SB                 
      9.92311584E-07    2     -2000003         3                       # Z3SS   -->  SBR    ST                 
      3.97134454E-06    2      2000004        -4                       # Z3SS   -->  CHR    CB                 
      3.97134454E-06    2     -2000004         4                       # Z3SS   -->  CBR    CH                 
      8.38349049E-04    2      1000005        -5                       # Z3SS   -->  BT1    BB                 
      8.38349049E-04    2     -1000005         5                       # Z3SS   -->  BB1    BT                 
      8.46936775E-04    2      2000005        -5                       # Z3SS   -->  BT2    BB                 
      8.46936775E-04    2     -2000005         5                       # Z3SS   -->  BB2    BT                 
      2.10852772E-01    2      1000006        -6                       # Z3SS   -->  TP1    TB                 
      2.10852772E-01    2     -1000006         6                       # Z3SS   -->  TB1    TP                 
      2.79061258E-01    2      2000006        -6                       # Z3SS   -->  TP2    TB                 
      2.79061258E-01    2     -2000006         6                       # Z3SS   -->  TB2    TP                 
      7.63984384E-16    2      1000011       -11                       # Z3SS   -->  EL-    E+                 
      7.63984384E-16    2     -1000011        11                       # Z3SS   -->  EL+    E-                 
      2.07792954E-14    2      2000011       -11                       # Z3SS   -->  ER-    E+                 
      2.07792954E-14    2     -2000011        11                       # Z3SS   -->  ER+    E-                 
      4.76602395E-12    2      1000012       -12                       # Z3SS   -->  NUEL   ANUE               
      4.76602395E-12    2     -1000012        12                       # Z3SS   -->  ANUEL  NUE                
      4.76602395E-12    2      1000014       -14                       # Z3SS   -->  NUML   ANUM               
      4.76602395E-12    2     -1000014        14                       # Z3SS   -->  ANUML  NUM                
      4.76602395E-12    2      1000016       -16                       # Z3SS   -->  NUTL   ANUT               
      4.76602395E-12    2     -1000016        16                       # Z3SS   -->  ANUTL  NUT                
      2.81564160E-12    2      1000039        22                       # Z3SS   -->  GVSS   GM                 
      7.19020790E-14    3      1000039        11       -11             # Z3SS   -->  GVSS   E-     E+          
      2.97104847E-08    2      1000039        23                       # Z3SS   -->  GVSS   Z0                 
      1.18295169E-07    2      1000039        25                       # Z3SS   -->  GVSS   HL0                
      1.32557177E-21    2      1000039        36                       # Z3SS   -->  GVSS   HA0                
#         PDG         Width
DECAY   1000035  1.36057724E+02   # Z4SS  decays
#          BR          NDA       ID1       ID2       ID3       ID4
      4.77189488E-09    2      1000022        22                       # Z4SS   -->  Z1SS   GM                 
      3.03506331E-10    2      1000023        22                       # Z4SS   -->  Z2SS   GM                 
      1.02115294E-09    2      1000025        22                       # Z4SS   -->  Z3SS   GM                 
      7.44470255E-03    2      1000024       -24                       # Z4SS   -->  W1SS+  W-                 
      7.44470255E-03    2     -1000024        24                       # Z4SS   -->  W1SS-  W+                 
      1.10473123E-03    2      1000022        23                       # Z4SS   -->  Z1SS   Z0                 
      2.42296933E-10    2      1000023        23                       # Z4SS   -->  Z2SS   Z0                 
      9.67291811E-08    3      1000022         5        -5             # Z4SS   -->  Z1SS   BT     BB          
      1.20532739E-08    3      1000022        15       -15             # Z4SS   -->  Z1SS   TAU-   TAU+        
      1.81635879E-16    3      1000023         5        -5             # Z4SS   -->  Z2SS   BT     BB          
      2.28725117E-17    3      1000023        15       -15             # Z4SS   -->  Z2SS   TAU-   TAU+        
      1.41514340E-06    3      1000025         2        -2             # Z4SS   -->  Z3SS   UP     UB          
      1.82483689E-06    3      1000025         1        -1             # Z4SS   -->  Z3SS   DN     DB          
      1.82483689E-06    3      1000025         3        -3             # Z4SS   -->  Z3SS   ST     SB          
      1.41514340E-06    3      1000025         4        -4             # Z4SS   -->  Z3SS   CH     CB          
      1.76422191E-06    3      1000025         5        -5             # Z4SS   -->  Z3SS   BT     BB          
      4.13963335E-07    3      1000025        11       -11             # Z4SS   -->  Z3SS   E-     E+          
      4.13963335E-07    3      1000025        13       -13             # Z4SS   -->  Z3SS   MU-    MU+         
      4.11443125E-07    3      1000025        15       -15             # Z4SS   -->  Z3SS   TAU-   TAU+        
      8.23656876E-07    3      1000025        12       -12             # Z4SS   -->  Z3SS   NUE    ANUE        
      8.23656876E-07    3      1000025        14       -14             # Z4SS   -->  Z3SS   NUM    ANUM        
      8.23656876E-07    3      1000025        16       -16             # Z4SS   -->  Z3SS   NUT    ANUT        
      5.14977239E-03    2      1000022        25                       # Z4SS   -->  Z1SS   HL0                
      5.75151304E-08    2      1000023        25                       # Z4SS   -->  Z2SS   HL0                
      5.18838800E-02    2      1000002        -2                       # Z4SS   -->  UPL    UB                 
      5.18838800E-02    2     -1000002         2                       # Z4SS   -->  UBL    UP                 
      5.24256043E-02    2      1000001        -1                       # Z4SS   -->  DNL    DB                 
      5.24256043E-02    2     -1000001         1                       # Z4SS   -->  DBL    DN                 
      5.24256043E-02    2      1000003        -3                       # Z4SS   -->  STL    SB                 
      5.24256043E-02    2     -1000003         3                       # Z4SS   -->  SBL    ST                 
      5.18838465E-02    2      1000004        -4                       # Z4SS   -->  CHL    CB                 
      5.18838465E-02    2     -1000004         4                       # Z4SS   -->  CBL    CH                 
      7.55819474E-06    2      2000002        -2                       # Z4SS   -->  UPR    UB                 
      7.55819474E-06    2     -2000002         2                       # Z4SS   -->  UBR    UP                 
      1.88860793E-06    2      2000001        -1                       # Z4SS   -->  DNR    DB                 
      1.88860793E-06    2     -2000001         1                       # Z4SS   -->  DBR    DN                 
      1.88860793E-06    2      2000003        -3                       # Z4SS   -->  STR    SB                 
      1.88860793E-06    2     -2000003         3                       # Z4SS   -->  SBR    ST                 
      7.55818883E-06    2      2000004        -4                       # Z4SS   -->  CHR    CB                 
      7.55818883E-06    2     -2000004         4                       # Z4SS   -->  CBR    CH                 
      3.27664369E-04    2      1000005        -5                       # Z4SS   -->  BT1    BB                 
      3.27664369E-04    2     -1000005         5                       # Z4SS   -->  BB1    BT                 
      5.27164526E-02    2      2000005        -5                       # Z4SS   -->  BT2    BB                 
      5.27164526E-02    2     -2000005         5                       # Z4SS   -->  BB2    BT                 
      5.67076989E-02    2      1000006        -6                       # Z4SS   -->  TP1    TB                 
      5.67076989E-02    2     -1000006         6                       # Z4SS   -->  TB1    TP                 
      1.70663878E-01    2      2000006        -6                       # Z4SS   -->  TP2    TB                 
      1.70663878E-01    2     -2000006         6                       # Z4SS   -->  TB2    TP                 
      5.94008452E-05    2      1000011       -11                       # Z4SS   -->  EL-    E+                 
      5.94008452E-05    2     -1000011        11                       # Z4SS   -->  EL+    E-                 
      5.94007834E-05    2      1000013       -13                       # Z4SS   -->  MUL-   MU+                
      5.94007834E-05    2     -1000013        13                       # Z4SS   -->  MUL+   MU-                
      1.97408774E-08    2      2000011       -11                       # Z4SS   -->  ER-    E+                 
      1.97408774E-08    2     -2000011        11                       # Z4SS   -->  ER+    E-                 
      1.97408578E-08    2      2000013       -13                       # Z4SS   -->  MUR-   MU+                
      1.97408578E-08    2     -2000013        13                       # Z4SS   -->  MUR+   MU-                
      1.58645264E-07    2      1000015       -15                       # Z4SS   -->  TAU1-  TAU+               
      1.58645264E-07    2     -1000015        15                       # Z4SS   -->  TAU1+  TAU-               
      5.93569821E-05    2      2000015       -15                       # Z4SS   -->  TAU2-  TAU+               
      5.93569821E-05    2     -2000015        15                       # Z4SS   -->  TAU2+  TAU-               
      6.33186428E-05    2      1000012       -12                       # Z4SS   -->  NUEL   ANUE               
      6.33186428E-05    2     -1000012        12                       # Z4SS   -->  ANUEL  NUE                
      6.33186428E-05    2      1000014       -14                       # Z4SS   -->  NUML   ANUM               
      6.33186428E-05    2     -1000014        14                       # Z4SS   -->  ANUML  NUM                
      6.33186428E-05    2      1000016       -16                       # Z4SS   -->  NUTL   ANUT               
      6.33186428E-05    2     -1000016        16                       # Z4SS   -->  ANUTL  NUT                
      2.84189436E-08    2      1000039        22                       # Z4SS   -->  GVSS   GM                 
      7.27061966E-10    3      1000039        11       -11             # Z4SS   -->  GVSS   E-     E+          
      1.53720123E-07    2      1000039        23                       # Z4SS   -->  GVSS   Z0                 
      1.33033202E-08    2      1000039        25                       # Z4SS   -->  GVSS   HL0                
      1.62309998E-13    2      1000039        35                       # Z4SS   -->  GVSS   HH0                
      1.20532924E-13    2      1000039        36                       # Z4SS   -->  GVSS   HA0                
#         PDG         Width
DECAY   1000024  1.33861206E+02   # W1SS+ decays
#          BR          NDA       ID1       ID2       ID3       ID4
      9.77781838E-06    3      1000022       -11        12             # W1SS+  -->  Z1SS   E+     NUE         
      9.77781838E-06    3      1000022       -13        14             # W1SS+  -->  Z1SS   MU+    NUM         
      9.86452142E-06    3      1000022       -15        16             # W1SS+  -->  Z1SS   TAU+   NUT         
      6.36816677E-03    2      1000022        24                       # W1SS+  -->  Z1SS   W+                 
      1.00218192E-01    2      1000002        -1                       # W1SS+  -->  UPL    DB                 
      9.71943066E-02    2     -1000001         2                       # W1SS+  -->  DBL    UP                 
      1.00218117E-01    2      1000004        -3                       # W1SS+  -->  CHL    SB                 
      9.73757505E-02    2     -1000003         4                       # W1SS+  -->  SBL    CH                 
      2.71573126E-01    2      1000006        -5                       # W1SS+  -->  TP1    BB                 
      8.28204956E-03    2      2000006        -5                       # W1SS+  -->  TP2    BB                 
      6.30820286E-04    2     -1000005         6                       # W1SS+  -->  BB1    TP                 
      3.18110049E-01    2     -2000005         6                       # W1SS+  -->  BB2    TP                 
#         PDG         Width
DECAY   1000037  1.36155838E+02   # W2SS+ decays
#          BR          NDA       ID1       ID2       ID3       ID4
      1.13760805E-08    3      1000022       -15        16             # W2SS+  -->  Z1SS   TAU+   NUT         
      6.21908903E-03    2      1000022        24                       # W2SS+  -->  Z1SS   W+                 
      5.40561384E-14    3      1000023       -15        16             # W2SS+  -->  Z2SS   TAU+   NUT         
      7.47540500E-03    2      1000023        24                       # W2SS+  -->  Z2SS   W+                 
      6.06576214E-06    3      1000025         2        -1             # W2SS+  -->  Z3SS   UP     DB          
      6.06576214E-06    3      1000025         4        -3             # W2SS+  -->  Z3SS   CH     SB          
      2.02192064E-06    3      1000025       -11        12             # W2SS+  -->  Z3SS   E+     NUE         
      2.02192064E-06    3      1000025       -13        14             # W2SS+  -->  Z3SS   MU+    NUM         
      2.02192064E-06    3      1000025       -15        16             # W2SS+  -->  Z3SS   TAU+   NUT         
      1.03105649E-01    2      1000002        -1                       # W2SS+  -->  UPL    DB                 
      1.05940424E-01    2     -1000001         2                       # W2SS+  -->  DBL    UP                 
      1.03105582E-01    2      1000004        -3                       # W2SS+  -->  CHL    SB                 
      1.06115200E-01    2     -1000003         4                       # W2SS+  -->  SBL    CH                 
      5.78637980E-03    2      1000006        -5                       # W2SS+  -->  TP1    BB                 
      2.93094218E-01    2      2000006        -5                       # W2SS+  -->  TP2    BB                 
      6.49215304E-04    2     -1000005         6                       # W2SS+  -->  BB1    TP                 
      2.61623561E-01    2     -2000005         6                       # W2SS+  -->  BB2    TP                 
      1.22222555E-04    2      1000012       -11                       # W2SS+  -->  NUEL   E+                 
      1.22222424E-04    2      1000014       -13                       # W2SS+  -->  NUML   MU+                
      1.22181722E-04    2      1000016       -15                       # W2SS+  -->  NUTL   TAU+               
      1.22336642E-04    2     -1000011        12                       # W2SS+  -->  EL+    NUE                
      1.22336642E-04    2     -1000013        14                       # W2SS+  -->  MUL+   NUM                
      2.80726567E-07    2     -1000015        16                       # W2SS+  -->  TAU1+  NUT                
      1.22289930E-04    2     -2000015        16                       # W2SS+  -->  TAU2+  NUT                
      6.13245275E-03    2      1000024        23                       # W2SS+  -->  W1SS+  Z0                 
      4.44508828E-07    2      1000024        25                       # W2SS+  -->  W1SS+  HL0                
#         PDG         Width
DECAY        25  4.47622361E-03   # HL0   decays
#          BR          NDA       ID1       ID2       ID3       ID4
      4.58920679E-09    2           11       -11                       # HL0    -->  E-     E+                 
      1.93763699E-04    2           13       -13                       # HL0    -->  MU-    MU+                
      5.54245077E-02    2           15       -15                       # HL0    -->  TAU-   TAU+               
      5.75605327E-06    2            1        -1                       # HL0    -->  DN     DB                 
      2.32573412E-03    2            3        -3                       # HL0    -->  ST     SB                 
      7.57571042E-01    2            5        -5                       # HL0    -->  BT     BB                 
      1.83192276E-06    2            2        -2                       # HL0    -->  UP     UB                 
      3.42487469E-02    2            4        -4                       # HL0    -->  CH     CB                 
      1.99986808E-03    2           22        22                       # HL0    -->  GM     GM                 
      4.12218086E-02    2           21        21                       # HL0    -->  GL     GL                 
      5.42662852E-03    3           24        11       -12             # HL0    -->  W+     E-     ANUE        
      5.42662852E-03    3           24        13       -14             # HL0    -->  W+     MU-    ANUM        
      5.42662852E-03    3           24        15       -16             # HL0    -->  W+     TAU-   ANUT        
      1.62798855E-02    3           24        -2         1             # HL0    -->  W+     UB     DN          
      1.62798855E-02    3           24        -4         3             # HL0    -->  W+     CB     ST          
      5.42662852E-03    3          -24       -11        12             # HL0    -->  W-     E+     NUE         
      5.42662852E-03    3          -24       -13        14             # HL0    -->  W-     MU+    NUM         
      5.42662852E-03    3          -24       -15        16             # HL0    -->  W-     TAU+   NUT         
      1.62798855E-02    3          -24         2        -1             # HL0    -->  W-     UP     DB          
      1.62798855E-02    3          -24         4        -3             # HL0    -->  W-     CH     SB          
      6.37948222E-04    3           23        12       -12             # HL0    -->  Z0     NUE    ANUE        
      6.37948222E-04    3           23        14       -14             # HL0    -->  Z0     NUM    ANUM        
      6.37948222E-04    3           23        16       -16             # HL0    -->  Z0     NUT    ANUT        
      3.21072934E-04    3           23        11       -11             # HL0    -->  Z0     E-     E+          
      3.21072934E-04    3           23        13       -13             # HL0    -->  Z0     MU-    MU+         
      3.21072934E-04    3           23        15       -15             # HL0    -->  Z0     TAU-   TAU+        
      1.09996868E-03    3           23         2        -2             # HL0    -->  Z0     UP     UB          
      1.09996868E-03    3           23         4        -4             # HL0    -->  Z0     CH     CB          
      1.41703070E-03    3           23         1        -1             # HL0    -->  Z0     DN     DB          
      1.41703070E-03    3           23         3        -3             # HL0    -->  Z0     ST     SB          
      1.41703070E-03    3           23         5        -5             # HL0    -->  Z0     BT     BB          
#         PDG         Width
DECAY        35  1.29233673E+02   # HH0   decays
#          BR          NDA       ID1       ID2       ID3       ID4
      2.97810041E-11    2           11       -11                       # HH0    -->  E-     E+                 
      1.25740769E-06    2           13       -13                       # HH0    -->  MU-    MU+                
      3.60139791E-04    2           15       -15                       # HH0    -->  TAU-   TAU+               
      3.62285810E-08    2            1        -1                       # HH0    -->  DN     DB                 
      1.46381817E-05    2            3        -3                       # HH0    -->  ST     SB                 
      3.25549324E-03    2            5        -5                       # HH0    -->  BT     BB                 
      1.43878340E-10    2            2        -2                       # HH0    -->  UP     UB                 
      1.82728638E-06    2            4        -4                       # HH0    -->  CH     CB                 
      9.43657979E-02    2            6        -6                       # HH0    -->  TP     TB                 
      2.33470956E-07    2           22        22                       # HH0    -->  GM     GM                 
      3.19910141E-05    2           21        21                       # HH0    -->  GL     GL                 
      2.57742013E-05    2           24       -24                       # HH0    -->  W+     W-                 
      1.32065061E-05    2           23        23                       # HH0    -->  Z0     Z0                 
      9.78246408E-06    2      1000022   1000022                       # HH0    -->  Z1SS   Z1SS               
      2.34521031E-02    2           25        25                       # HH0    -->  HL0    HL0                
      3.13921773E-05    2      1000002  -1000002                       # HH0    -->  UPL    UBL                
      6.29363012E-06    2      2000002  -2000002                       # HH0    -->  UPR    UBR                
      3.13702658E-05    2      1000004  -1000004                       # HH0    -->  CHL    CBL                
      6.28383077E-06    2      2000004  -2000004                       # HH0    -->  CHR    CBR                
      4.69230326E-05    2      1000001  -1000001                       # HH0    -->  DNL    DBL                
      1.57236138E-06    2      2000001  -2000001                       # HH0    -->  DNR    DBR                
      4.69282386E-05    2      1000003  -1000003                       # HH0    -->  STL    SBL                
      1.57140926E-06    2      2000003  -2000003                       # HH0    -->  STR    SBR                
      1.38212818E-06    2      1000005  -1000005                       # HH0    -->  BT1    BB1                
      4.80042581E-05    2      2000005  -2000005                       # HH0    -->  BT2    BB2                
      1.30910585E-02    2      1000005  -2000005                       # HH0    -->  BT1    BB2                
      1.30910585E-02    2      2000005  -1000005                       # HH0    -->  BT2    BB1                
      4.49904263E-01    2      1000006  -1000006                       # HH0    -->  TP1    TB1                
      3.99963230E-01    2      2000006  -2000006                       # HH0    -->  TP2    TB2                
      1.09817518E-03    2      1000006  -2000006                       # HH0    -->  TP1    TB2                
      1.09817518E-03    2      2000006  -1000006                       # HH0    -->  TP2    TB1                
#         PDG         Width
DECAY        36  1.26611626E+02   # HA0   decays
#          BR          NDA       ID1       ID2       ID3       ID4
      3.01996657E-11    2           11       -11                       # HA0    -->  E-     E+                 
      1.27508451E-06    2           13       -13                       # HA0    -->  MU-    MU+                
      3.65203363E-04    2           15       -15                       # HA0    -->  TAU-   TAU+               
      3.67397028E-08    2            1        -1                       # HA0    -->  DN     DB                 
      1.48446989E-05    2            3        -3                       # HA0    -->  ST     SB                 
      3.30396253E-03    2            5        -5                       # HA0    -->  BT     BB                 
      1.45129755E-10    2            2        -2                       # HA0    -->  UP     UB                 
      1.84458645E-06    2            4        -4                       # HA0    -->  CH     CB                 
      9.66354609E-02    2            6        -6                       # HA0    -->  TP     TB                 
      2.35233415E-07    2           22        22                       # HA0    -->  GM     GM                 
      3.07817281E-05    2           21        21                       # HA0    -->  GL     GL                 
      1.68815586E-05    2      1000022   1000022                       # HA0    -->  Z1SS   Z1SS               
      2.59692042E-05    2           25        23                       # HA0    -->  HL0    Z0                 
      5.16706677E-10    2      1000002  -2000002                       # HA0    -->  UPL    UBR                
      5.16706677E-10    2      2000002  -1000002                       # HA0    -->  UPR    UBL                
      3.00286101E-05    2      1000004  -2000004                       # HA0    -->  CHL    CBR                
      3.00286101E-05    2      2000004  -1000004                       # HA0    -->  CHR    CBL                
      1.61252034E-09    2      1000001  -2000001                       # HA0    -->  DNL    DBR                
      1.61252034E-09    2      2000001  -1000001                       # HA0    -->  DNR    DBL                
      6.51539835E-07    2      1000003  -2000003                       # HA0    -->  STL    SBR                
      6.51539835E-07    2      2000003  -1000003                       # HA0    -->  STR    SBL                
      1.34219443E-02    2      1000005  -2000005                       # HA0    -->  BT1    BB2                
      1.34219443E-02    2      2000005  -1000005                       # HA0    -->  BT2    BB1                
      4.36349124E-01    2      1000006  -2000006                       # HA0    -->  TP1    TB2                
      4.36349124E-01    2      2000006  -1000006                       # HA0    -->  TP2    TB1                
#         PDG         Width
DECAY        37  1.25655342E+02   # H+    decays
#          BR          NDA       ID1       ID2       ID3       ID4
      3.06262342E-11    2           12       -11                       # H+     -->  NUE    E+                 
      1.29309490E-06    2           14       -13                       # H+     -->  NUM    MU+                
      3.70361842E-04    2           16       -15                       # H+     -->  NUT    TAU+               
      3.46222784E-08    2            2        -1                       # H+     -->  UP     DB                 
      1.56643328E-05    2            4        -3                       # H+     -->  CH     SB                 
      9.33292061E-02    2            6        -5                       # H+     -->  TP     BB                 
      2.63570128E-05    2           25        24                       # H+     -->  HL0    W+                 
      7.96157910E-05    2      1000002  -1000001                       # H+     -->  UPL    DBL                
      3.23996874E-09    2      2000002  -2000001                       # H+     -->  UPR    DBR                
      7.95859814E-05    2      1000004  -1000003                       # H+     -->  CHL    SBL                
      1.30911076E-06    2      2000004  -2000003                       # H+     -->  CHR    SBR                
      1.46023789E-02    2      1000006  -1000005                       # H+     -->  TP1    BB1                
      4.25622910E-01    2      1000006  -2000005                       # H+     -->  TP1    BB2                
      1.22470465E-02    2      2000006  -1000005                       # H+     -->  TP2    BB1                
      4.53624219E-01    2      2000006  -2000005                       # H+     -->  TP2    BB2                
