#  ISAJET SUSY parameters in SUSY Les Houches Accord 2 format
#  Created by ISALHA 2.0 Last revision: C. Balazs 21 Apr 2009
Block SPINFO   # Program information
     1   ISASUGRA from ISAJET          # Spectrum Calculator
     2   7.80   29-OCT-2009 12:50:36   # Version number
Block MODSEL   # Model selection
     1     1   # Minimal supergravity (mSUGRA) model               
Block SMINPUTS   # Standard Model inputs
     1     1.27843956E+02   # alpha_em^(-1)
     2     1.16570000E-05   # G_Fermi
     3     1.17200002E-01   # alpha_s(M_Z)
     4     9.11699982E+01   # m_{Z}(pole)
     5     4.19999981E+00   # m_{b}(m_{b})
     6     1.72500000E+02   # m_{top}(pole)
     7     1.77699995E+00   # m_{tau}(pole)
Block MINPAR   # SUSY breaking input parameters
     1     2.50000000E+02   # m_0
     2     1.00000000E+03   # m_{1/2}
     3     1.00000000E+01   # tan(beta)
     4     1.00000000E+00   # sign(mu)
     5     0.00000000E+00   # A_0
Block EXTPAR   # Non-universal SUSY breaking parameters
     0     1.38123249E+16   # Input scale
Block MASS   # Scalar and gaugino mass spectrum
#  PDG code   mass                 particle
        24     8.04229965E+01   #  W^+
        25     1.17847359E+02   #  h^0            
        35     1.34520496E+03   #  H^0            
        36     1.33630334E+03   #  A^0            
        37     1.35030701E+03   #  H^+            
   1000001     2.00796094E+03   #  dnl            
   1000002     2.00625964E+03   #  upl            
   1000003     2.00796094E+03   #  stl            
   1000004     2.00626001E+03   #  chl            
   1000005     1.85434973E+03   #  b1             
   1000006     1.55400464E+03   #  t1             
   1000011     7.12781250E+02   #  el-            
   1000012     7.03929260E+02   #  nuel           
   1000013     7.12781250E+02   #  mul-           
   1000014     7.03929260E+02   #  numl           
   1000015     4.42488129E+02   #  tau1           
   1000016     6.96188965E+02   #  nutl           
   1000021     2.19010376E+03   #  glss           
   1000022     4.25328644E+02   #  z1ss           
   1000023     8.00263672E+02   #  z2ss           
   1000024     8.01737183E+02   #  w1ss           
   1000025    -1.15055225E+03   #  z3ss           
   1000035     1.16056470E+03   #  z4ss           
   1000037     1.16060535E+03   #  w2ss           
   2000001     1.91763953E+03   #  dnr            
   2000002     1.92751929E+03   #  upr            
   2000003     1.91763953E+03   #  str            
   2000004     1.92751978E+03   #  chr            
   2000005     1.90572083E+03   #  b2             
   2000006     1.88318677E+03   #  t2             
   2000011     4.45579803E+02   #  er-            
   2000013     4.45579803E+02   #  mur-           
   2000015     7.07742737E+02   #  tau2           
Block ALPHA   # Effective Higgs mixing parameter
         -1.00734554E-01   # alpha
Block STOPMIX   # stop mixing matrix
  1  1     2.52907902E-01   # O_{11}
  1  2     9.67490375E-01   # O_{12}
  2  1    -9.67490375E-01   # O_{21}
  2  2     2.52907902E-01   # O_{22}
Block SBOTMIX   # sbottom mixing matrix
  1  1     9.83873963E-01   # O_{11}
  1  2     1.78863078E-01   # O_{12}
  2  1    -1.78863078E-01   # O_{21}
  2  2     9.83873963E-01   # O_{22}
Block STAUMIX   # stau mixing matrix
  1  1     6.59302697E-02   # O_{11}
  1  2     9.97824252E-01   # O_{12}
  2  1    -9.97824252E-01   # O_{21}
  2  2     6.59302697E-02   # O_{22}
Block NMIX   # neutralino mixing matrix
  1  1     9.98791814E-01   #
  1  2    -4.72506694E-03   #
  1  3     4.47238535E-02   #
  1  4    -1.98089331E-02   #
  2  1    -1.26305008E-02   #
  2  2    -9.85920370E-01   #
  2  3     1.33896366E-01   #
  2  4    -9.93656293E-02   #
  3  1     1.74742937E-02   #
  3  2    -2.48360578E-02   #
  3  3    -7.06180096E-01   #
  3  4    -7.07380652E-01   #
  4  1    -4.41595390E-02   #
  4  2     1.65294155E-01   #
  4  3     6.93816245E-01   #
  4  4    -6.99533403E-01   #
Block UMIX   # chargino U mixing matrix
  1  1    -9.81668472E-01   # U_{11}
  1  2     1.90596402E-01   # U_{12}
  2  1    -1.90596402E-01   # U_{21}
  2  2    -9.81668472E-01   # U_{22}
Block VMIX   # chargino V mixing matrix
  1  1    -9.89789307E-01   # V_{11}
  1  2     1.42538190E-01   # V_{12}
  2  1    -1.42538190E-01   # V_{21}
  2  2    -9.89789307E-01   # V_{22}
Block GAUGE Q=  1.64092322E+03   #
     1     3.57492298E-01   # g`
     2     6.52492166E-01   # g_2
     3     1.22104871E+00   # g_3
Block YU Q=  1.64092322E+03   #
  3  3     8.39988232E-01   # y_t
Block YD Q=  1.64092322E+03   #
  3  3     1.27119854E-01   # y_b
Block YE Q=  1.64092322E+03   #
  3  3     1.02409035E-01   # y_tau
Block HMIX Q=  1.64092322E+03   # Higgs mixing parameters
     1     1.14420154E+03   # mu(Q)
     2     1.00000000E+01   # tan(beta)(M_GUT)
     3     2.51386337E+02   # Higgs vev at Q
     4     1.78570662E+06   # m_A^2(Q)
Block MSOFT Q=  1.64092322E+03   # DRbar SUSY breaking parameters
     1     4.32672272E+02   # M_1(Q)          
     2     7.89363953E+02   # M_2(Q)          
     3     2.09936621E+03   # M_3(Q)          
    31     7.04308472E+02   # MeL(Q)          
    32     7.04308472E+02   # MmuL(Q)         
    33     6.96767822E+02   # MtauL(Q)        
    34     4.43932861E+02   # MeR(Q)          
    35     4.43932861E+02   # MmuR(Q)         
    36     4.35783539E+02   # MtauR(Q)        
    41     1.90569141E+03   # MqL1(Q)         
    42     1.90569141E+03   # MqL2(Q)         
    43     1.77145532E+03   # MqL3(Q)         
    44     1.82964880E+03   # MuR(Q)          
    45     1.82964880E+03   # McR(Q)          
    46     1.52000952E+03   # MtR(Q)          
    47     1.81968591E+03   # MdR(Q)          
    48     1.81968591E+03   # MsR(Q)          
    49     1.81965857E+03   # MbR(Q)          
Block AU Q=  1.64092322E+03   #
  1  1    -1.65099597E+03   # A_u
  2  2    -1.65099597E+03   # A_c
  3  3    -1.65099597E+03   # A_t
Block AD Q=  1.64092322E+03   #
  1  1    -2.39723389E+03   # A_d
  2  2    -2.39723389E+03   # A_s
  3  3    -2.39723389E+03   # A_b
Block AE Q=  1.64092322E+03   #
  1  1    -5.76015686E+02   # A_e
  2  2    -5.76015686E+02   # A_mu
  3  3    -5.76015686E+02   # A_tau
#  ISAJET decay tables in SUSY Les Houches accord format
#  Created by ISALHD. Last revision: C. Balazs, 2005 May 25
Block DCINFO                           # Program information
     1   ISASUGRA from ISAJET          # Spectrum Calculator
     2   7.80   29-OCT-2009 12:50:36   # Version number
#         PDG         Width
DECAY         6  1.14680779E+00   # TP    decays
#          BR          NDA       ID1       ID2       ID3       ID4
      3.33333343E-01    3            2        -1         5             # TP     -->  UP     DB     BT          
      3.33333343E-01    3            4        -3         5             # TP     -->  CH     SB     BT          
      1.11111112E-01    3          -11        12         5             # TP     -->  E+     NUE    BT          
      1.11111112E-01    3          -13        14         5             # TP     -->  MU+    NUM    BT          
      1.11111112E-01    3          -15        16         5             # TP     -->  TAU+   NUT    BT          
#         PDG         Width
DECAY   1000021  3.40463448E+01   # GLSS  decays
#          BR          NDA       ID1       ID2       ID3       ID4
      1.77332181E-02    2     -1000002         2                       # GLSS   -->  UBL    UP                 
      1.77332181E-02    2      1000002        -2                       # GLSS   -->  UPL    UB                 
      1.74206402E-02    2     -1000001         1                       # GLSS   -->  DBL    DN                 
      1.74206402E-02    2      1000001        -1                       # GLSS   -->  DNL    DB                 
      3.48315649E-02    2     -2000002         2                       # GLSS   -->  UBR    UP                 
      3.48315649E-02    2      2000002        -2                       # GLSS   -->  UPR    UB                 
      3.73222195E-02    2     -2000001         1                       # GLSS   -->  DBR    DN                 
      3.73222195E-02    2      2000001        -1                       # GLSS   -->  DNR    DB                 
      1.74206290E-02    2     -1000003         3                       # GLSS   -->  SBL    ST                 
      1.74206290E-02    2      1000003        -3                       # GLSS   -->  STL    SB                 
      3.73222120E-02    2     -2000003         3                       # GLSS   -->  SBR    ST                 
      3.73222120E-02    2      2000003        -3                       # GLSS   -->  STR    SB                 
      1.77327003E-02    2     -1000004         4                       # GLSS   -->  CBL    CH                 
      1.77327003E-02    2      1000004        -4                       # GLSS   -->  CHL    CB                 
      3.48310322E-02    2     -2000004         4                       # GLSS   -->  CBR    CH                 
      3.48310322E-02    2      2000004        -4                       # GLSS   -->  CHR    CB                 
      5.46249785E-02    2     -1000005         5                       # GLSS   -->  BB1    BT                 
      5.46249785E-02    2      1000005        -5                       # GLSS   -->  BT1    BB                 
      4.06853519E-02    2     -2000005         5                       # GLSS   -->  BB2    BT                 
      4.06853519E-02    2      2000005        -5                       # GLSS   -->  BT2    BB                 
      1.39296785E-01    2     -1000006         6                       # GLSS   -->  TB1    TP                 
      1.39296785E-01    2      1000006        -6                       # GLSS   -->  TP1    TB                 
      5.07786460E-02    2     -2000006         6                       # GLSS   -->  TB2    TP                 
      5.07786460E-02    2      2000006        -6                       # GLSS   -->  TP2    TB                 
#         PDG         Width
DECAY   1000002  1.80065594E+01   # UPL   decays
#          BR          NDA       ID1       ID2       ID3       ID4
      1.35936635E-02    2      1000022         2                       # UPL    -->  Z1SS   UP                 
      3.23868632E-01    2      1000023         2                       # UPL    -->  Z2SS   UP                 
      9.88706597E-05    2      1000025         2                       # UPL    -->  Z3SS   UP                 
      5.13123162E-03    2      1000035         2                       # UPL    -->  Z4SS   UP                 
      6.48871183E-01    2      1000024         1                       # UPL    -->  W1SS+  DN                 
      8.43640044E-03    2      1000037         1                       # UPL    -->  W2SS+  DN                 
#         PDG         Width
DECAY   1000001  1.79557037E+01   # DNL   decays
#          BR          NDA       ID1       ID2       ID3       ID4
      1.51310693E-02    2      1000022         1                       # DNL    -->  Z1SS   DN                 
      3.22230339E-01    2      1000023         1                       # DNL    -->  Z2SS   DN                 
      1.66940896E-04    2      1000025         1                       # DNL    -->  Z3SS   DN                 
      6.27555232E-03    2      1000035         1                       # DNL    -->  Z4SS   DN                 
      6.41030431E-01    2     -1000024         2                       # DNL    -->  W1SS-  UP                 
      1.51656242E-02    2     -1000037         2                       # DNL    -->  W2SS-  UP                 
#         PDG         Width
DECAY   1000003  1.79556866E+01   # STL   decays
#          BR          NDA       ID1       ID2       ID3       ID4
      1.51310833E-02    2      1000022         3                       # STL    -->  Z1SS   ST                 
      3.22230637E-01    2      1000023         3                       # STL    -->  Z2SS   ST                 
      1.66941056E-04    2      1000025         3                       # STL    -->  Z3SS   ST                 
      6.27555791E-03    2      1000035         3                       # STL    -->  Z4SS   ST                 
      6.41030192E-01    2     -1000024         4                       # STL    -->  W1SS-  CH                 
      1.51656074E-02    2     -1000037         4                       # STL    -->  W2SS-  CH                 
#         PDG         Width
DECAY   1000004  1.80065556E+01   # CHL   decays
#          BR          NDA       ID1       ID2       ID3       ID4
      1.35936541E-02    2      1000022         4                       # CHL    -->  Z1SS   CH                 
      3.23868334E-01    2      1000023         4                       # CHL    -->  Z2SS   CH                 
      9.88705215E-05    2      1000025         4                       # CHL    -->  Z3SS   CH                 
      5.13122464E-03    2      1000035         4                       # CHL    -->  Z4SS   CH                 
      6.48871481E-01    2      1000024         3                       # CHL    -->  W1SS+  ST                 
      8.43640696E-03    2      1000037         3                       # CHL    -->  W2SS+  ST                 
#         PDG         Width
DECAY   1000005  2.99064140E+01   # BT1   decays
#          BR          NDA       ID1       ID2       ID3       ID4
      9.59869847E-03    2      1000022         5                       # BT1    -->  Z1SS   BT                 
      1.64323613E-01    2      1000023         5                       # BT1    -->  Z2SS   BT                 
      3.76352132E-03    2      1000025         5                       # BT1    -->  Z3SS   BT                 
      5.28290169E-03    2      1000035         5                       # BT1    -->  Z4SS   BT                 
      3.16934556E-01    2     -1000024         6                       # BT1    -->  W1SS-  TP                 
      2.97523648E-01    2     -1000037         6                       # BT1    -->  W2SS-  TP                 
      2.02573076E-01    2          -24   1000006                       # BT1    -->  W-     TP1                
#         PDG         Width
DECAY   1000006  1.18046188E+01   # TP1   decays
#          BR          NDA       ID1       ID2       ID3       ID4
      2.37417877E-01    2      1000022         6                       # TP1    -->  Z1SS   TP                 
      4.98679802E-02    2      1000023         6                       # TP1    -->  Z2SS   TP                 
      1.91762030E-01    2      1000025         6                       # TP1    -->  Z3SS   TP                 
      1.13106571E-01    2      1000035         6                       # TP1    -->  Z4SS   TP                 
      1.07777774E-01    2      1000024         5                       # TP1    -->  W1SS+  BT                 
      3.00067812E-01    2      1000037         5                       # TP1    -->  W2SS+  BT                 
#         PDG         Width
DECAY   2000002  3.93824077E+00   # UPR   decays
#          BR          NDA       ID1       ID2       ID3       ID4
      9.98862326E-01    2      1000022         2                       # UPR    -->  Z1SS   UP                 
      1.20899182E-04    2      1000023         2                       # UPR    -->  Z2SS   UP                 
      1.39984419E-04    2      1000025         2                       # UPR    -->  Z3SS   UP                 
      8.76767561E-04    2      1000035         2                       # UPR    -->  Z4SS   UP                 
#         PDG         Width
DECAY   2000001  9.78467166E-01   # DNR   decays
#          BR          NDA       ID1       ID2       ID3       ID4
      9.98873532E-01    2      1000022         1                       # DNR    -->  Z1SS   DN                 
      1.20508266E-04    2      1000023         1                       # DNR    -->  Z2SS   DN                 
      1.38536096E-04    2      1000025         1                       # DNR    -->  Z3SS   DN                 
      8.67422670E-04    2      1000035         1                       # DNR    -->  Z4SS   DN                 
#         PDG         Width
DECAY   2000003  9.78467166E-01   # STR   decays
#          BR          NDA       ID1       ID2       ID3       ID4
      9.98873532E-01    2      1000022         3                       # STR    -->  Z1SS   ST                 
      1.20508266E-04    2      1000023         3                       # STR    -->  Z2SS   ST                 
      1.38536096E-04    2      1000025         3                       # STR    -->  Z3SS   ST                 
      8.67422670E-04    2      1000035         3                       # STR    -->  Z4SS   ST                 
#         PDG         Width
DECAY   2000004  3.93823791E+00   # CHR   decays
#          BR          NDA       ID1       ID2       ID3       ID4
      9.98862326E-01    2      1000022         4                       # CHR    -->  Z1SS   CH                 
      1.20899167E-04    2      1000023         4                       # CHR    -->  Z2SS   CH                 
      1.39984302E-04    2      1000025         4                       # CHR    -->  Z3SS   CH                 
      8.76766921E-04    2      1000035         4                       # CHR    -->  Z4SS   CH                 
#         PDG         Width
DECAY   2000005  2.59349990E+00   # BT2   decays
#          BR          NDA       ID1       ID2       ID3       ID4
      3.58825207E-01    2      1000022         5                       # BT2    -->  Z1SS   BT                 
      4.06373329E-02    2      1000023         5                       # BT2    -->  Z2SS   BT                 
      5.26603796E-02    2      1000025         5                       # BT2    -->  Z3SS   BT                 
      6.46157041E-02    2      1000035         5                       # BT2    -->  Z4SS   BT                 
      7.88863450E-02    2     -1000024         6                       # BT2    -->  W1SS-  TP                 
      2.81143904E-01    2     -1000037         6                       # BT2    -->  W2SS-  TP                 
      1.23231098E-01    2          -24   1000006                       # BT2    -->  W-     TP1                
#         PDG         Width
DECAY   2000006  3.23858147E+01   # TP2   decays
#          BR          NDA       ID1       ID2       ID3       ID4
      2.73307800E-01    2      1000024         5                       # TP2    -->  W1SS+  BT                 
      4.58849818E-02    2      1000037         5                       # TP2    -->  W2SS+  BT                 
      1.17157832E-01    2           23   1000006                       # TP2    -->  Z0     TP1                
      1.12822294E-01    2           25   1000006                       # TP2    -->  HL0    TP1                
      1.15207741E-02    2      1000022         6                       # TP2    -->  Z1SS   TP                 
      1.33019283E-01    2      1000023         6                       # TP2    -->  Z2SS   TP                 
      1.33499801E-01    2      1000025         6                       # TP2    -->  Z3SS   TP                 
      1.72787249E-01    2      1000035         6                       # TP2    -->  Z4SS   TP                 
#         PDG         Width
DECAY   1000011  3.68479222E-01   # EL-   decays
#          BR          NDA       ID1       ID2       ID3       ID4
      9.99998331E-01    2      1000022        11                       # EL-    -->  Z1SS   E-                 
      6.28946452E-07    3      1000015        11       -15             # EL-    -->  TAU1-  E-     TAU+        
      1.08632685E-06    3     -1000015        11        15             # EL-    -->  TAU1+  E-     TAU-        
#         PDG         Width
DECAY   1000013  3.68479222E-01   # MUL-  decays
#          BR          NDA       ID1       ID2       ID3       ID4
      9.99998331E-01    2      1000022        13                       # MUL-   -->  Z1SS   MU-                
      6.28946452E-07    3      1000015        13       -15             # MUL-   -->  TAU1-  MU-    TAU+        
      1.08632685E-06    3     -1000015        13        15             # MUL-   -->  TAU1+  MU-    TAU-        
#         PDG         Width
DECAY   1000015  1.29424799E-02   # TAU1- decays
#          BR          NDA       ID1       ID2       ID3       ID4
      1.00000000E+00    2      1000022        15                       # TAU1-  -->  Z1SS   TAU-               
#         PDG         Width
DECAY   1000012  3.66183519E-01   # NUEL  decays
#          BR          NDA       ID1       ID2       ID3       ID4
      9.99994576E-01    2      1000022        12                       # NUEL   -->  Z1SS   NUE                
      4.64918514E-07    3      1000015        12       -15             # NUEL   -->  TAU1-  NUE    TAU+        
      8.43957253E-07    3     -1000015        12        15             # NUEL   -->  TAU1+  NUE    TAU-        
      4.14179431E-06    3     -1000015        11        16             # NUEL   -->  TAU1+  E-     NUT         
#         PDG         Width
DECAY   1000014  3.66183519E-01   # NUML  decays
#          BR          NDA       ID1       ID2       ID3       ID4
      9.99994576E-01    2      1000022        14                       # NUML   -->  Z1SS   NUM                
      4.64918514E-07    3      1000015        14       -15             # NUML   -->  TAU1-  NUM    TAU+        
      8.43957253E-07    3     -1000015        14        15             # NUML   -->  TAU1+  NUM    TAU-        
      4.14186707E-06    3     -1000015        13        16             # NUML   -->  TAU1+  MU-    NUT         
#         PDG         Width
DECAY   1000016  5.24046004E-01   # NUTL  decays
#          BR          NDA       ID1       ID2       ID3       ID4
      6.73418820E-01    2      1000022        16                       # NUTL   -->  Z1SS   NUT                
      3.26580495E-01    2           24   1000015                       # NUTL   -->  W+     TAU1-              
      2.83422708E-07    3     -1000015        16        15             # NUTL   -->  TAU1+  NUT    TAU-        
      4.99204134E-07    3      1000015        16       -15             # NUTL   -->  TAU1-  NUT    TAU+        
#         PDG         Width
DECAY   2000011  1.78409126E-02   # ER-   decays
#          BR          NDA       ID1       ID2       ID3       ID4
      1.00000000E+00    2      1000022        11                       # ER-    -->  Z1SS   E-                 
      1.51444735E-18    3      1000015        11       -15             # ER-    -->  TAU1-  E-     TAU+        
      6.88691708E-19    3     -1000015        11        15             # ER-    -->  TAU1+  E-     TAU-        
      2.20971772E-23    3      1000015        12       -16             # ER-    -->  TAU1-  NUE    ANUT        
#         PDG         Width
DECAY   2000013  1.78406648E-02   # MUR-  decays
#          BR          NDA       ID1       ID2       ID3       ID4
      1.00000000E+00    2      1000022        13                       # MUR-   -->  Z1SS   MU-                
      1.51446834E-18    3      1000015        13       -15             # MUR-   -->  TAU1-  MU-    TAU+        
      6.88701272E-19    3     -1000015        13        15             # MUR-   -->  TAU1+  MU-    TAU-        
      9.38714441E-19    3      1000015        14       -16             # MUR-   -->  TAU1-  NUM    ANUT        
#         PDG         Width
DECAY   2000015  5.69060326E-01   # TAU2- decays
#          BR          NDA       ID1       ID2       ID3       ID4
      6.39202893E-01    2      1000022        15                       # TAU2-  -->  Z1SS   TAU-               
      1.64797917E-01    2           23   1000015                       # TAU2-  -->  Z0     TAU1-              
      1.95999235E-01    2           25   1000015                       # TAU2-  -->  HL0    TAU1-              
#         PDG         Width
DECAY   1000023  9.98224139E-01   # Z2SS  decays
#          BR          NDA       ID1       ID2       ID3       ID4
      3.05806003E-09    2      1000022        22                       # Z2SS   -->  Z1SS   GM                 
      1.08704320E-03    2      1000022        23                       # Z2SS   -->  Z1SS   Z0                 
      1.97984406E-07    3      1000022         2        -2             # Z2SS   -->  Z1SS   UP     UB          
      2.16306191E-07    3      1000022         1        -1             # Z2SS   -->  Z1SS   DN     DB          
      2.16306191E-07    3      1000022         3        -3             # Z2SS   -->  Z1SS   ST     SB          
      1.97984235E-07    3      1000022         4        -4             # Z2SS   -->  Z1SS   CH     CB          
      3.44359393E-07    3      1000022         5        -5             # Z2SS   -->  Z1SS   BT     BB          
      4.02590628E-09    3      1000022        15       -15             # Z2SS   -->  Z1SS   TAU-   TAU+        
      1.96111444E-02    2      1000022        25                       # Z2SS   -->  Z1SS   HL0                
      7.10522681E-02    2      1000011       -11                       # Z2SS   -->  EL-    E+                 
      7.10522681E-02    2     -1000011        11                       # Z2SS   -->  EL+    E-                 
      7.10522234E-02    2      1000013       -13                       # Z2SS   -->  MUL-   MU+                
      7.10522234E-02    2     -1000013        13                       # Z2SS   -->  MUL+   MU-                
      1.54843277E-04    2      2000011       -11                       # Z2SS   -->  ER-    E+                 
      1.54843277E-04    2     -2000011        11                       # Z2SS   -->  ER+    E-                 
      1.54843263E-04    2      2000013       -13                       # Z2SS   -->  MUR-   MU+                
      1.54843263E-04    2     -2000013        13                       # Z2SS   -->  MUR+   MU-                
      7.57435896E-03    2      1000015       -15                       # Z2SS   -->  TAU1-  TAU+               
      7.57435896E-03    2     -1000015        15                       # Z2SS   -->  TAU1+  TAU-               
      7.84493536E-02    2      2000015       -15                       # Z2SS   -->  TAU2-  TAU+               
      7.84493536E-02    2     -2000015        15                       # Z2SS   -->  TAU2+  TAU-               
      8.27886686E-02    2      1000012       -12                       # Z2SS   -->  NUEL   ANUE               
      8.27886686E-02    2     -1000012        12                       # Z2SS   -->  ANUEL  NUE                
      8.27886686E-02    2      1000014       -14                       # Z2SS   -->  NUML   ANUM               
      8.27886686E-02    2     -1000014        14                       # Z2SS   -->  ANUML  NUM                
      9.56350937E-02    2      1000016       -16                       # Z2SS   -->  NUTL   ANUT               
      9.56350937E-02    2     -1000016        16                       # Z2SS   -->  ANUTL  NUT                
#         PDG         Width
DECAY   1000025  6.19361925E+00   # Z3SS  decays
#          BR          NDA       ID1       ID2       ID3       ID4
      1.85132176E-08    2      1000022        22                       # Z3SS   -->  Z1SS   GM                 
      1.68873811E-07    2      1000023        22                       # Z3SS   -->  Z2SS   GM                 
      2.86885530E-01    2      1000024       -24                       # Z3SS   -->  W1SS+  W-                 
      2.86885530E-01    2     -1000024        24                       # Z3SS   -->  W1SS-  W+                 
      1.06433034E-01    2      1000022        23                       # Z3SS   -->  Z1SS   Z0                 
      2.73684949E-01    2      1000023        23                       # Z3SS   -->  Z2SS   Z0                 
      1.16911114E-09    3      1000022         2        -2             # Z3SS   -->  Z1SS   UP     UB          
      3.29496375E-10    3      1000022         1        -1             # Z3SS   -->  Z1SS   DN     DB          
      3.29496375E-10    3      1000022         3        -3             # Z3SS   -->  Z1SS   ST     SB          
      1.16910959E-09    3      1000022         4        -4             # Z3SS   -->  Z1SS   CH     CB          
      1.29141506E-06    3      1000022         5        -5             # Z3SS   -->  Z1SS   BT     BB          
      1.67159897E-07    3      1000022        15       -15             # Z3SS   -->  Z1SS   TAU-   TAU+        
      2.36189485E-10    3      1000023         2        -2             # Z3SS   -->  Z2SS   UP     UB          
      3.91185084E-10    3      1000023         1        -1             # Z3SS   -->  Z2SS   DN     DB          
      3.91185084E-10    3      1000023         3        -3             # Z3SS   -->  Z2SS   ST     SB          
      2.36189235E-10    3      1000023         4        -4             # Z3SS   -->  Z2SS   CH     CB          
      2.25662774E-07    3      1000023         5        -5             # Z3SS   -->  Z2SS   BT     BB          
      2.03319797E-08    3      1000023        15       -15             # Z3SS   -->  Z2SS   TAU-   TAU+        
      1.58451181E-02    2      1000022        25                       # Z3SS   -->  Z1SS   HL0                
      6.05934067E-03    2      1000023        25                       # Z3SS   -->  Z2SS   HL0                
      3.44427026E-05    2      1000011       -11                       # Z3SS   -->  EL-    E+                 
      3.44427026E-05    2     -1000011        11                       # Z3SS   -->  EL+    E-                 
      3.44427026E-05    2      1000013       -13                       # Z3SS   -->  MUL-   MU+                
      3.44427026E-05    2     -1000013        13                       # Z3SS   -->  MUL+   MU-                
      1.04228493E-04    2      2000011       -11                       # Z3SS   -->  ER-    E+                 
      1.04228493E-04    2     -2000011        11                       # Z3SS   -->  ER+    E-                 
      1.04228493E-04    2      2000013       -13                       # Z3SS   -->  MUR-   MU+                
      1.04228493E-04    2     -2000013        13                       # Z3SS   -->  MUR+   MU-                
      7.22587341E-03    2      1000015       -15                       # Z3SS   -->  TAU1-  TAU+               
      7.22587341E-03    2     -1000015        15                       # Z3SS   -->  TAU1+  TAU-               
      4.04968718E-03    2      2000015       -15                       # Z3SS   -->  TAU2-  TAU+               
      4.04968718E-03    2     -2000015        15                       # Z3SS   -->  TAU2+  TAU-               
      1.81543059E-04    2      1000012       -12                       # Z3SS   -->  NUEL   ANUE               
      1.81543059E-04    2     -1000012        12                       # Z3SS   -->  ANUEL  NUE                
      1.81543059E-04    2      1000014       -14                       # Z3SS   -->  NUML   ANUM               
      1.81543059E-04    2     -1000014        14                       # Z3SS   -->  ANUML  NUM                
      1.86324934E-04    2      1000016       -16                       # Z3SS   -->  NUTL   ANUT               
      1.86324934E-04    2     -1000016        16                       # Z3SS   -->  ANUTL  NUT                
#         PDG         Width
DECAY   1000035  6.75458241E+00   # Z4SS  decays
#          BR          NDA       ID1       ID2       ID3       ID4
      9.11162985E-08    2      1000022        22                       # Z4SS   -->  Z1SS   GM                 
      6.01739902E-09    2      1000023        22                       # Z4SS   -->  Z2SS   GM                 
      6.38285605E-11    2      1000025        22                       # Z4SS   -->  Z3SS   GM                 
      2.68369824E-01    2      1000024       -24                       # Z4SS   -->  W1SS+  W-                 
      2.68369824E-01    2     -1000024        24                       # Z4SS   -->  W1SS-  W+                 
      1.48574524E-02    2      1000022        23                       # Z4SS   -->  Z1SS   Z0                 
      6.55291881E-03    2      1000023        23                       # Z4SS   -->  Z2SS   Z0                 
      3.08349435E-08    3      1000022         2        -2             # Z4SS   -->  Z1SS   UP     UB          
      2.30772272E-08    3      1000022         1        -1             # Z4SS   -->  Z1SS   DN     DB          
      2.30772272E-08    3      1000022         3        -3             # Z4SS   -->  Z1SS   ST     SB          
      3.08349115E-08    3      1000022         4        -4             # Z4SS   -->  Z1SS   CH     CB          
      1.17875845E-06    3      1000022         5        -5             # Z4SS   -->  Z1SS   BT     BB          
      1.48868324E-07    3      1000022        15       -15             # Z4SS   -->  Z1SS   TAU-   TAU+        
      3.71787330E-08    3      1000023         2        -2             # Z4SS   -->  Z2SS   UP     UB          
      4.46027677E-08    3      1000023         1        -1             # Z4SS   -->  Z2SS   DN     DB          
      4.46027677E-08    3      1000023         3        -3             # Z4SS   -->  Z2SS   ST     SB          
      3.71786975E-08    3      1000023         4        -4             # Z4SS   -->  Z2SS   CH     CB          
      2.77265769E-07    3      1000023         5        -5             # Z4SS   -->  Z2SS   BT     BB          
      1.87575910E-08    3      1000023        15       -15             # Z4SS   -->  Z2SS   TAU-   TAU+        
      1.82443005E-09    3      1000025         2        -2             # Z4SS   -->  Z3SS   UP     UB          
      2.35272690E-09    3      1000025         1        -1             # Z4SS   -->  Z3SS   DN     DB          
      2.35272690E-09    3      1000025         3        -3             # Z4SS   -->  Z3SS   ST     SB          
      1.82443005E-09    3      1000025         4        -4             # Z4SS   -->  Z3SS   CH     CB          
      5.33700639E-10    3      1000025        11       -11             # Z4SS   -->  Z3SS   E-     E+          
      5.33700639E-10    3      1000025        13       -13             # Z4SS   -->  Z3SS   MU-    MU+         
      3.64515390E-10    3      1000025        15       -15             # Z4SS   -->  Z3SS   TAU-   TAU+        
      1.06189635E-09    3      1000025        12       -12             # Z4SS   -->  Z3SS   NUE    ANUE        
      1.06189635E-09    3      1000025        14       -14             # Z4SS   -->  Z3SS   NUM    ANUM        
      1.06189635E-09    3      1000025        16       -16             # Z4SS   -->  Z3SS   NUT    ANUT        
      1.00651540E-01    2      1000022        25                       # Z4SS   -->  Z1SS   HL0                
      2.69982874E-01    2      1000023        25                       # Z4SS   -->  Z2SS   HL0                
      2.78951274E-03    2      1000011       -11                       # Z4SS   -->  EL-    E+                 
      2.78951274E-03    2     -1000011        11                       # Z4SS   -->  EL+    E-                 
      2.78951274E-03    2      1000013       -13                       # Z4SS   -->  MUL-   MU+                
      2.78951274E-03    2     -1000013        13                       # Z4SS   -->  MUL+   MU-                
      6.19404251E-04    2      2000011       -11                       # Z4SS   -->  ER-    E+                 
      6.19404251E-04    2     -2000011        11                       # Z4SS   -->  ER+    E-                 
      6.19404251E-04    2      2000013       -13                       # Z4SS   -->  MUR-   MU+                
      6.19404251E-04    2     -2000013        13                       # Z4SS   -->  MUR+   MU-                
      6.17123768E-03    2      1000015       -15                       # Z4SS   -->  TAU1-  TAU+               
      6.17123768E-03    2     -1000015        15                       # Z4SS   -->  TAU1+  TAU-               
      6.90796552E-03    2      2000015       -15                       # Z4SS   -->  TAU2-  TAU+               
      6.90796552E-03    2     -2000015        15                       # Z4SS   -->  TAU2+  TAU-               
      5.19222906E-03    2      1000012       -12                       # Z4SS   -->  NUEL   ANUE               
      5.19222906E-03    2     -1000012        12                       # Z4SS   -->  ANUEL  NUE                
      5.19222906E-03    2      1000014       -14                       # Z4SS   -->  NUML   ANUM               
      5.19222906E-03    2     -1000014        14                       # Z4SS   -->  ANUML  NUM                
      5.32525312E-03    2      1000016       -16                       # Z4SS   -->  NUTL   ANUT               
      5.32525312E-03    2     -1000016        16                       # Z4SS   -->  ANUTL  NUT                
#         PDG         Width
DECAY   1000024  1.02378738E+00   # W1SS+ decays
#          BR          NDA       ID1       ID2       ID3       ID4
      4.10523683E-07    3      1000022         2        -1             # W1SS+  -->  Z1SS   UP     DB          
      4.10523484E-07    3      1000022         4        -3             # W1SS+  -->  Z1SS   CH     SB          
      3.88962373E-09    3      1000022       -15        16             # W1SS+  -->  Z1SS   TAU+   NUT         
      1.81698296E-02    2      1000022        24                       # W1SS+  -->  Z1SS   W+                 
      1.31016127E-11    3      1000023         2        -1             # W1SS+  -->  Z2SS   UP     DB          
      4.36007827E-12    3      1000023       -11        12             # W1SS+  -->  Z2SS   E+     NUE         
      4.36007827E-12    3      1000023       -13        14             # W1SS+  -->  Z2SS   MU+    NUM         
      1.69510782E-01    2      1000012       -11                       # W1SS+  -->  NUEL   E+                 
      1.69510707E-01    2      1000014       -13                       # W1SS+  -->  NUML   MU+                
      1.95759028E-01    2      1000016       -15                       # W1SS+  -->  NUTL   TAU+               
      1.39551565E-01    2     -1000011        12                       # W1SS+  -->  EL+    NUE                
      1.39551565E-01    2     -1000013        14                       # W1SS+  -->  MUL+   NUM                
      1.44808087E-02    2     -1000015        16                       # W1SS+  -->  TAU1+  NUT                
      1.53464839E-01    2     -2000015        16                       # W1SS+  -->  TAU2+  NUT                
#         PDG         Width
DECAY   1000037  6.80934620E+00   # W2SS+ decays
#          BR          NDA       ID1       ID2       ID3       ID4
      3.94120683E-08    3      1000022         2        -1             # W2SS+  -->  Z1SS   UP     DB          
      3.94120576E-08    3      1000022         4        -3             # W2SS+  -->  Z1SS   CH     SB          
      1.39825175E-07    3      1000022       -15        16             # W2SS+  -->  Z1SS   TAU+   NUT         
      1.03861511E-01    2      1000022        24                       # W2SS+  -->  Z1SS   W+                 
      3.06841592E-08    3      1000023         2        -1             # W2SS+  -->  Z2SS   UP     DB          
      3.06841557E-08    3      1000023         4        -3             # W2SS+  -->  Z2SS   CH     SB          
      2.20736798E-08    3      1000023       -15        16             # W2SS+  -->  Z2SS   TAU+   NUT         
      2.82400459E-01    2      1000023        24                       # W2SS+  -->  Z2SS   W+                 
      6.27720276E-09    3      1000025         2        -1             # W2SS+  -->  Z3SS   UP     DB          
      6.27720276E-09    3      1000025         4        -3             # W2SS+  -->  Z3SS   CH     SB          
      2.09238893E-09    3      1000025       -11        12             # W2SS+  -->  Z3SS   E+     NUE         
      2.09238893E-09    3      1000025       -13        14             # W2SS+  -->  Z3SS   MU+    NUM         
      2.09238893E-09    3      1000025       -15        16             # W2SS+  -->  Z3SS   TAU+   NUT         
      5.82469068E-03    2      1000012       -11                       # W2SS+  -->  NUEL   E+                 
      5.82469068E-03    2      1000014       -13                       # W2SS+  -->  NUML   MU+                
      1.32415295E-02    2      1000016       -15                       # W2SS+  -->  NUTL   TAU+               
      1.01100216E-02    2     -1000011        12                       # W2SS+  -->  EL+    NUE                
      1.01100216E-02    2     -1000013        14                       # W2SS+  -->  MUL+   NUM                
      1.10164750E-02    2     -1000015        16                       # W2SS+  -->  TAU1+  NUT                
      1.13901449E-02    2     -2000015        16                       # W2SS+  -->  TAU2+  NUT                
      2.70598799E-01    2      1000024        23                       # W2SS+  -->  W1SS+  Z0                 
      4.04833109E-08    3      1000024         1        -1             # W2SS+  -->  W1SS+  DN     DB          
      4.04832754E-08    3      1000024         3        -3             # W2SS+  -->  W1SS+  ST     SB          
      7.08813701E-08    3      1000024         2        -2             # W2SS+  -->  W1SS+  UP     UB          
      7.08813701E-08    3      1000024         4        -4             # W2SS+  -->  W1SS+  CH     CB          
      2.75620997E-01    2      1000024        25                       # W2SS+  -->  W1SS+  HL0                
#         PDG         Width
DECAY        25  4.32594307E-03   # HL0   decays
#          BR          NDA       ID1       ID2       ID3       ID4
      4.72868944E-09    2           11       -11                       # HL0    -->  E-     E+                 
      1.99652844E-04    2           13       -13                       # HL0    -->  MU-    MU+                
      5.71059175E-02    2           15       -15                       # HL0    -->  TAU-   TAU+               
      5.93282357E-06    2            1        -1                       # HL0    -->  DN     DB                 
      2.39715818E-03    2            3        -3                       # HL0    -->  ST     SB                 
      7.83119380E-01    2            5        -5                       # HL0    -->  BT     BB                 
      1.85808506E-06    2            2        -2                       # HL0    -->  UP     UB                 
      3.48474160E-02    2            4        -4                       # HL0    -->  CH     CB                 
      1.89225620E-03    2           22        22                       # HL0    -->  GM     GM                 
      3.98800634E-02    2           21        21                       # HL0    -->  GL     GL                 
      4.12061112E-03    3           24        11       -12             # HL0    -->  W+     E-     ANUE        
      4.12061112E-03    3           24        13       -14             # HL0    -->  W+     MU-    ANUM        
      4.12061112E-03    3           24        15       -16             # HL0    -->  W+     TAU-   ANUT        
      1.23618329E-02    3           24        -2         1             # HL0    -->  W+     UB     DN          
      1.23618329E-02    3           24        -4         3             # HL0    -->  W+     CB     ST          
      4.12061112E-03    3          -24       -11        12             # HL0    -->  W-     E+     NUE         
      4.12061112E-03    3          -24       -13        14             # HL0    -->  W-     MU+    NUM         
      4.12061112E-03    3          -24       -15        16             # HL0    -->  W-     TAU+   NUT         
      1.23618329E-02    3          -24         2        -1             # HL0    -->  W-     UP     DB          
      1.23618329E-02    3          -24         4        -3             # HL0    -->  W-     CH     SB          
      4.36274218E-04    3           23        12       -12             # HL0    -->  Z0     NUE    ANUE        
      4.36274218E-04    3           23        14       -14             # HL0    -->  Z0     NUM    ANUM        
      4.36274218E-04    3           23        16       -16             # HL0    -->  Z0     NUT    ANUT        
      2.19572452E-04    3           23        11       -11             # HL0    -->  Z0     E-     E+          
      2.19572452E-04    3           23        13       -13             # HL0    -->  Z0     MU-    MU+         
      2.19572452E-04    3           23        15       -15             # HL0    -->  Z0     TAU-   TAU+        
      7.52236519E-04    3           23         2        -2             # HL0    -->  Z0     UP     UB          
      7.52236519E-04    3           23         4        -4             # HL0    -->  Z0     CH     CB          
      9.69065994E-04    3           23         1        -1             # HL0    -->  Z0     DN     DB          
      9.69065994E-04    3           23         3        -3             # HL0    -->  Z0     ST     SB          
      9.69065994E-04    3           23         5        -5             # HL0    -->  Z0     BT     BB          
#         PDG         Width
DECAY        35  2.55305648E+00   # HH0   decays
#          BR          NDA       ID1       ID2       ID3       ID4
      8.95216168E-09    2           11       -11                       # HH0    -->  E-     E+                 
      3.77976423E-04    2           13       -13                       # HH0    -->  MU-    MU+                
      1.08257100E-01    2           15       -15                       # HH0    -->  TAU-   TAU+               
      1.09408584E-05    2            1        -1                       # HH0    -->  DN     DB                 
      4.42066044E-03    2            3        -3                       # HH0    -->  ST     SB                 
      6.38189375E-01    2            5        -5                       # HH0    -->  BT     BB                 
      3.57650881E-10    2            2        -2                       # HH0    -->  UP     UB                 
      4.86986482E-06    2            4        -4                       # HH0    -->  CH     CB                 
      2.37787694E-01    2            6        -6                       # HH0    -->  TP     TB                 
      6.81600454E-07    2           22        22                       # HH0    -->  GM     GM                 
      1.01533951E-04    2           21        21                       # HH0    -->  GL     GL                 
      3.44993314E-04    2           24       -24                       # HH0    -->  W+     W-                 
      1.76001486E-04    2           23        23                       # HH0    -->  Z0     Z0                 
      1.14215957E-03    2      1000022   1000022                       # HH0    -->  Z1SS   Z1SS               
      1.80009252E-03    2      1000022   1000023                       # HH0    -->  Z1SS   Z2SS               
      7.24972284E-04    2           25        25                       # HH0    -->  HL0    HL0                
      4.29464781E-05    2      2000011  -2000011                       # HH0    -->  ER-    ER+                
      4.29221363E-05    2      2000013  -2000013                       # HH0    -->  MUR-   MUR+               
      2.29020210E-04    2      1000015  -1000015                       # HH0    -->  TAU1-  TAU1+              
      3.17309867E-03    2      1000015  -2000015                       # HH0    -->  TAU1-  TAU2+              
      3.17309867E-03    2      2000015  -1000015                       # HH0    -->  TAU2-  TAU1+              
#         PDG         Width
DECAY        36  2.58451867E+00   # HA0   decays
#          BR          NDA       ID1       ID2       ID3       ID4
      8.78654927E-09    2           11       -11                       # HA0    -->  E-     E+                 
      3.70983937E-04    2           13       -13                       # HA0    -->  MU-    MU+                
      1.06255114E-01    2           15       -15                       # HA0    -->  TAU-   TAU+               
      1.07390151E-05    2            1        -1                       # HA0    -->  DN     DB                 
      4.33910498E-03    2            3        -3                       # HA0    -->  ST     SB                 
      6.26430750E-01    2            5        -5                       # HA0    -->  BT     BB                 
      3.43613998E-10    2            2        -2                       # HA0    -->  UP     UB                 
      4.68230201E-06    2            4        -4                       # HA0    -->  CH     CB                 
      2.41613522E-01    2            6        -6                       # HA0    -->  TP     TB                 
      9.92773266E-07    2           22        22                       # HA0    -->  GM     GM                 
      1.57791044E-04    2           21        21                       # HA0    -->  GL     GL                 
      2.22261599E-03    2      1000022   1000022                       # HA0    -->  Z1SS   Z1SS               
      1.19342469E-02    2      1000022   1000023                       # HA0    -->  Z1SS   Z2SS               
      3.33007629E-04    2           25        23                       # HA0    -->  HL0    Z0                 
      1.57348943E-11    2      1000011  -2000011                       # HA0    -->  EL-    ER+                
      1.57348943E-11    2      2000011  -1000011                       # HA0    -->  ER-    EL+                
      6.64355696E-07    2      1000013  -2000013                       # HA0    -->  MUL-   MUR+               
      6.64355696E-07    2      2000013  -1000013                       # HA0    -->  MUR-   MUL+               
      3.16256122E-03    2      1000015  -2000015                       # HA0    -->  TAU1-  TAU2+              
      3.16256122E-03    2      2000015  -1000015                       # HA0    -->  TAU2-  TAU1+              
#         PDG         Width
DECAY        37  2.37196493E+00   # H+    decays
#          BR          NDA       ID1       ID2       ID3       ID4
      9.67424807E-09    2           12       -11                       # H+     -->  NUE    E+                 
      4.08464199E-04    2           14       -13                       # H+     -->  NUM    MU+                
      1.16990007E-01    2           16       -15                       # H+     -->  NUT    TAU+               
      1.08938393E-05    2            2        -1                       # H+     -->  UP     DB                 
      4.40625614E-03    2            4        -3                       # H+     -->  CH     SB                 
      8.54846299E-01    2            6        -5                       # H+     -->  TP     BB                 
      1.56360492E-02    2      1000024   1000022                       # H+     -->  W1SS+  Z1SS               
      3.70944588E-04    2           25        24                       # H+     -->  HL0    W+                 
      7.33122742E-03    2     -1000015   1000016                       # H+     -->  TAU1+  NUTL               
