##******************************************************************
##                      MadGraph/MadEvent                          *
##******************************************************************
## Les Houches friendly file for the (MS)SM parameters of MadGraph *
##      SM parameter set and decay widths produced by MSSMCalc     *
##******************************************************************
##*Please note the following IMPORTANT issues:                     *
##                                                                 *
##0. REFRAIN from editing this file by hand! Some of the parame-   *
##   ters are not independent. Always use a calculator.            *
##                                                                 *
##1. alpha_S(MZ) has been used in the calculation of the parameters*
##   This value is KEPT by madgraph when no pdf are used lpp(i)=0, *
##   but, for consistency, it will be reset by madgraph to the     *
##   value expected IF the pdfs for collisions with hadrons are    *
##   used.                                                         *
##                                                                 *
##2. Values of the charm and bottom kinematic (pole) masses are    *
##   those used in the matrix elements and phase space UNLESS they *
##   are set to ZERO from the start in the model (particles.dat)   *
##   This happens, for example,  when using 5-flavor QCD where     *
##   charm and bottom are treated as partons in the initial state  *
##   and a zero mass might be hardwired in the model definition.   *
##                                                                 *
##       The SUSY decays have calculated using SDECAY 1.1a         *
##                                                                 *
##******************************************************************
#
BLOCK DCINFO  # Decay Program information
     1   SDECAY      # decay calculator
     2   1.1a        # version number
#
BLOCK SPINFO  # Spectrum calculator information
     1   SPMartin                                          
     2   0.0.0                                             
#
BLOCK MODSEL  # Model selection
     1     1   #                                                 
#
BLOCK SMINPUTS  # Standard Model inputs
     1     1.27908953E+02   # alpha_em^-1(M_Z)^MSbar
     2     1.16637000E-05   # G_F [GeV^-2]
     3     1.18000000E-01   # alpha_S(M_Z)^MSbar
     4     9.11876000E+01   # M_Z pole mass
     6     1.73100000E+02   # mt pole mass
     7     1.77700000E+00   # mtau pole mass
#
BLOCK MINPAR  # Input parameters - minimal models
     3     1.00000000E+01   #   tanbeta           
#
BLOCK MASS  # Mass Spectrum
# PDG code           mass       particle
         5     4.89000000E+00   # b-quark pole mass
         6     1.73100000E+02   # t-quark pole mass (not read by ME)
        24     7.98255855E+01   # W+
        25     1.15000000E+02   # h
        35     9.60200000E+02   # H
        36     9.60000000E+02   # A
        37     9.63360784E+02   # H+
   1000001     9.63294347E+02   # ~d_L
   2000001     9.60000000E+02   # ~d_R
   1000002     9.60000000E+02   # ~u_L
   2000002     9.60000000E+02   # ~u_R
   1000003     9.63294347E+02   # ~s_L
   2000003     9.60000000E+02   # ~s_R
   1000004     9.60000000E+02   # ~c_L
   2000004     9.60000000E+02   # ~c_R
   1000005     9.81874753E+02   # ~b_1
   2000005     1.01160752E+03   # ~b_2
   1000006     8.94000000E+02   # ~t_1
   2000006     1.02500000E+03   # ~t_2
   1000011     9.63294347E+02   # ~e_L
   2000011     9.60000000E+02   # ~e_R
   1000012     9.60000000E+02   # ~nu_eL
   1000013     9.63294347E+02   # ~mu_L
   2000013     9.60000000E+02   # ~mu_R
   1000014     9.60000000E+02   # ~nu_muL
   1000015     9.46155243E+02   # ~tau_1
   2000015     9.75844164E+02   # ~tau_2
   1000016     9.67897071E+02   # ~nu_tauL
   1000021     1.00000000E+03   # ~g
   1000022     6.64836512E+02   # ~chi_10
   1000023     7.26713367E+02   # ~chi_20
   1000025    -1.20173866E+03   # ~chi_30
   1000035     1.21018878E+03   # ~chi_40
   1000024     7.26518449E+02   # ~chi_1+
   1000037     1.20949441E+03   # ~chi_2+
#
BLOCK NMIX  # Neutralino Mixing Matrix
  1  1     9.96332345E-01   # N_11
  1  2    -4.97448252E-02   # N_12
  1  3     5.91804801E-02   # N_13
  1  4    -3.66739844E-02   # N_14
  2  1     5.84071839E-02   # N_21
  2  2     9.89979136E-01   # N_22
  2  3    -1.07042901E-01   # N_23
  2  4     7.12160733E-02   # N_24
  3  1    -1.45912454E-02   # N_31
  3  2     2.63264771E-02   # N_32
  3  3     7.06160763E-01   # N_33
  3  4     7.07411471E-01   # N_34
  4  1    -6.08075194E-02   # N_41
  4  2     1.29513242E-01   # N_42
  4  3     6.97406958E-01   # N_43
  4  4    -7.02248033E-01   # N_44
#
BLOCK UMIX  # Chargino Mixing Matrix U
  1  1     9.87760628E-01   # U_11
  1  2    -1.55977374E-01   # U_12
  2  1     1.55977374E-01   # U_21
  2  2     9.87760628E-01   # U_22
#
BLOCK VMIX  # Chargino Mixing Matrix V
  1  1     9.94597058E-01   # V_11
  1  2    -1.03810851E-01   # V_12
  2  1     1.03810851E-01   # V_21
  2  2     9.94597058E-01   # V_22
#
BLOCK STOPMIX  # Stop Mixing Matrix
  1  1     4.00000000E-01   # O_{11}
  1  2     9.16515139E-01   # O_{12}
  2  1     9.16515139E-01   # O_{21}
  2  2    -4.00000000E-01   # O_{22}
#
BLOCK SBOTMIX  # Sbottom Mixing Matrix
  1  1     7.85279203E-01   # O_{11}
  1  2    -6.19141804E-01   # O_{12}
  2  1     6.19141804E-01   # O_{21}
  2  2     7.85279203E-01   # O_{22}
#
BLOCK STAUMIX  # Stau Mixing Matrix
  1  1     3.99517810E-01   # O_{11}
  1  2     9.16725433E-01   # O_{12}
  2  1     9.16725433E-01   # O_{21}
  2  2    -3.99517810E-01   # O_{22}
#
BLOCK ALPHA  # Higgs mixing
          -9.96686525E-02   # Mixing angle in the neutral Higgs boson sector
#
BLOCK HMIX Q=  9.57261720E+02  # DRbar Higgs Parameters
     1     1.20000000E+03   #   mu(Q)MSSM DRbar   
     2     1.00000000E+01   #   tan beta(Q)MSSM DR
     3     2.45000000E+02   #   vev               
     4     9.21600000E+05   #   mA^2              
#
BLOCK GAUGE Q=  9.57261720E+02  # The gauge couplings
     3     1.06052333E+00   # g3(Q) MSbar
#
BLOCK AU Q=  9.57261720E+02  # The trilinear couplings
  3  3    -4.94520326E+02   # A_t(Q) DRbar
#
BLOCK AD Q=  9.57261720E+02  # The trilinear couplings
  3  3     0.00000000E+00   # A_b(Q) DRbar
#
BLOCK AE Q=  9.57261720E+02  # The trilinear couplings
  3  3     0.00000000E+00   # A_tau(Q) DRbar
#
BLOCK YU Q=  9.57261720E+02  # The Yukawa couplings
  3  3     8.70000000E-01   # y_t(Q) DRbar
#
BLOCK YD Q=  9.57261720E+02  # The Yukawa couplings
  3  3     1.36500000E-01   # y_b(Q) DRbar
#
BLOCK YE Q=  9.57261720E+02  # The Yukawa couplings
  3  3     1.00000000E-01   # y_tau(Q) DRbar
#
BLOCK MSOFT Q=  9.57261720E+02  # The soft SUSY breaking masses at the scale Q
     1     6.66666667E+02   #  M1                 
     2     7.33333333E+02   #  M2                 
     3     1.00000000E+03   #  M3                 
    31     9.62120190E+02   #  msL1               
    32     9.62120190E+02   #  msL2               
    33     9.70000000E+02   #  msL3               
    34     9.59054471E+02   #  mse1               
    35     9.59054471E+02   #  mse2               
    36     9.50000000E+02   #  mse3               
    41     9.61491331E+02   #  msQ1               
    42     9.61491331E+02   #  msQ2               
    43     9.91617229E+02   #  msQ3               
    44     9.60629836E+02   #  msu1               
    45     9.60629836E+02   #  msu2               
    46     9.00391199E+02   #  msu3               
    47     9.59684927E+02   #  msd1               
    48     9.59684927E+02   #  msd2               
    49     1.00000000E+03   #  msd3               
#
#
#
#                             =================
#                             |The decay table|
#                             =================
#
# - The multi-body decays for the inos, stops and sbottoms are included.
#
# - The SUSY decays of the top quark are included.
#
#
#         PDG            Width
DECAY        23     2.41162024E+00   # Z width (SM calculation)
DECAY        24     2.00287200E+00   # W width (SM calculation)
#
#         PDG            Width
DECAY         6     1.50386434E+00   # top decays
#          BR         NDA      ID1       ID2
     1.00000000E+00    2           5        24   # BR(t ->  b    W+)
     0.00000000E+00    2           5        37   # BR(t ->  b    H+)
     0.00000000E+00    2     1000006   1000022   # BR(t -> ~t_1 ~chi_10)
     0.00000000E+00    2     1000006   1000023   # BR(t -> ~t_1 ~chi_20)
     0.00000000E+00    2     1000006   1000025   # BR(t -> ~t_1 ~chi_30)
     0.00000000E+00    2     1000006   1000035   # BR(t -> ~t_1 ~chi_40)
     0.00000000E+00    2     2000006   1000022   # BR(t -> ~t_2 ~chi_10)
     0.00000000E+00    2     2000006   1000023   # BR(t -> ~t_2 ~chi_20)
     0.00000000E+00    2     2000006   1000025   # BR(t -> ~t_2 ~chi_30)
     0.00000000E+00    2     2000006   1000035   # BR(t -> ~t_2 ~chi_40)
#
#         PDG            Width
DECAY        25     1.60755216E-03   # h decays
#          BR         NDA      ID1       ID2
     1.40708089E-01    2          15       -15   # BR(H1 -> tau- tau+)
     7.79111283E-01    2           5        -5   # BR(H1 -> b bb)
     7.52034575E-02    2          24       -24   # BR(H1 -> W+ W-)
     4.97717075E-03    2          23        23   # BR(H1 -> Z Z)
#
#         PDG            Width
DECAY        35     1.59856249E+00   # H decays
#          BR         NDA      ID1       ID2
     1.18312854E-01    2          15       -15   # BR(H -> tau- tau+)
     2.18012966E-01    2           6        -6   # BR(H -> t tb)
     6.61241080E-01    2           5        -5   # BR(H -> b bb)
     2.71991611E-30    2          24       -24   # BR(H -> W+ W-)
     1.34287869E-30    2          23        23   # BR(H -> Z Z)
     0.00000000E+00    2          24       -37   # BR(H -> W+ H-)
     0.00000000E+00    2         -24        37   # BR(H -> W- H+)
     0.00000000E+00    2          37       -37   # BR(H -> H+ H-)
     2.43309962E-03    2          25        25   # BR(H -> h h)
     0.00000000E+00    2          36        36   # BR(H -> A A)
#
#         PDG            Width
DECAY        36     1.64650384E+00   # A decays
#          BR         NDA      ID1       ID2
     1.14845578E-01    2          15       -15   # BR(A -> tau- tau+)
     2.43233878E-01    2           6        -6   # BR(A -> t tb)
     6.41920544E-01    2           5        -5   # BR(A -> b bb)
     2.56029996E-30    2          23        25   # BR(A -> Z h)
     0.00000000E+00    2          23        35   # BR(A -> Z H)
     0.00000000E+00    2          24       -37   # BR(A -> W+ H-)
     0.00000000E+00    2         -24        37   # BR(A -> W- H+)
#
#         PDG            Width
DECAY        37     1.59677670E+00   # H+ decays
#          BR         NDA      ID1       ID2
     1.18837105E-01    2         -15        16   # BR(H+ -> tau+ nu_tau)
     8.81162895E-01    2           6        -5   # BR(H+ -> t bb)
     2.68693448E-30    2          24        25   # BR(H+ -> W+ h)
     0.00000000E+00    2          24        35   # BR(H+ -> W+ H)
     0.00000000E+00    2          24        36   # BR(H+ -> W+ A)
#
#         PDG            Width
DECAY   1000021     1.07805098E+00   # gluino decays
#          BR         NDA      ID1       ID2
     5.38937047E-02    2     1000001        -1   # BR(~g -> ~d_L  db)
     5.38937047E-02    2    -1000001         1   # BR(~g -> ~d_L* d )
     6.37871833E-02    2     2000001        -1   # BR(~g -> ~d_R  db)
     6.37871833E-02    2    -2000001         1   # BR(~g -> ~d_R* d )
     6.37871833E-02    2     1000002        -2   # BR(~g -> ~u_L  ub)
     6.37871833E-02    2    -1000002         2   # BR(~g -> ~u_L* u )
     6.37871833E-02    2     2000002        -2   # BR(~g -> ~u_R  ub)
     6.37871833E-02    2    -2000002         2   # BR(~g -> ~u_R* u )
     5.38937047E-02    2     1000003        -3   # BR(~g -> ~s_L  sb)
     5.38937047E-02    2    -1000003         3   # BR(~g -> ~s_L* s )
     6.37871833E-02    2     2000003        -3   # BR(~g -> ~s_R  sb)
     6.37871833E-02    2    -2000003         3   # BR(~g -> ~s_R* s )
     6.37871833E-02    2     1000004        -4   # BR(~g -> ~c_L  cb)
     6.37871833E-02    2    -1000004         4   # BR(~g -> ~c_L* c )
     6.37871833E-02    2     2000004        -4   # BR(~g -> ~c_R  cb)
     6.37871833E-02    2    -2000004         4   # BR(~g -> ~c_R* c )
     9.48949065E-03    2     1000005        -5   # BR(~g -> ~b_1  bb)
     9.48949065E-03    2    -1000005         5   # BR(~g -> ~b_1* b )
     0.00000000E+00    2     2000005        -5   # BR(~g -> ~b_2  bb)
     0.00000000E+00    2    -2000005         5   # BR(~g -> ~b_2* b )
     0.00000000E+00    2     1000006        -6   # BR(~g -> ~t_1  tb)
     0.00000000E+00    2    -1000006         6   # BR(~g -> ~t_1* t )
     0.00000000E+00    2     2000006        -6   # BR(~g -> ~t_2  tb)
     0.00000000E+00    2    -2000006         6   # BR(~g -> ~t_2* t )
#
#         PDG            Width
DECAY   1000006     4.51820187E-01   # stop1 decays
#          BR         NDA      ID1       ID2
     4.73607354E-01    2     1000022         6   # BR(~t_1 -> ~chi_10 t )
     0.00000000E+00    2     1000023         6   # BR(~t_1 -> ~chi_20 t )
     0.00000000E+00    2     1000025         6   # BR(~t_1 -> ~chi_30 t )
     0.00000000E+00    2     1000035         6   # BR(~t_1 -> ~chi_40 t )
     5.26392646E-01    2     1000024         5   # BR(~t_1 -> ~chi_1+ b )
     0.00000000E+00    2     1000037         5   # BR(~t_1 -> ~chi_2+ b )
     0.00000000E+00    2     1000021         6   # BR(~t_1 -> ~g      t )
     0.00000000E+00    2     1000005        37   # BR(~t_1 -> ~b_1    H+)
     0.00000000E+00    2     2000005        37   # BR(~t_1 -> ~b_2    H+)
     0.00000000E+00    2     1000005        24   # BR(~t_1 -> ~b_1    W+)
     0.00000000E+00    2     2000005        24   # BR(~t_1 -> ~b_2    W+)
#
#         PDG            Width
DECAY   2000006     2.52148511E+00   # stop2 decays
#          BR         NDA      ID1       ID2
     2.26517154E-02    2     1000022         6   # BR(~t_2 -> ~chi_10 t )
     2.05753397E-01    2     1000023         6   # BR(~t_2 -> ~chi_20 t )
     0.00000000E+00    2     1000025         6   # BR(~t_2 -> ~chi_30 t )
     0.00000000E+00    2     1000035         6   # BR(~t_2 -> ~chi_40 t )
     6.16733283E-01    2     1000024         5   # BR(~t_2 -> ~chi_1+ b )
     0.00000000E+00    2     1000037         5   # BR(~t_2 -> ~chi_2+ b )
     0.00000000E+00    2     1000021         6   # BR(~t_2 -> ~g      t )
     5.96889191E-02    2     1000006        25   # BR(~t_2 -> ~t_1    h )
     0.00000000E+00    2     1000006        35   # BR(~t_2 -> ~t_1    H )
     0.00000000E+00    2     1000006        36   # BR(~t_2 -> ~t_1    A )
     0.00000000E+00    2     1000005        37   # BR(~t_2 -> ~b_1    H+)
     0.00000000E+00    2     2000005        37   # BR(~t_2 -> ~b_2    H+)
     9.51726859E-02    2     1000006        23   # BR(~t_2 -> ~t_1    Z )
     0.00000000E+00    2     1000005        24   # BR(~t_2 -> ~b_1    W+)
     0.00000000E+00    2     2000005        24   # BR(~t_2 -> ~b_2    W+)
#
#         PDG            Width
DECAY   1000005     1.27419231E+00   # sbottom1 decays
#          BR         NDA      ID1       ID2
     8.93038771E-02    2     1000022         5   # BR(~b_1 -> ~chi_10 b )
     4.09731402E-01    2     1000023         5   # BR(~b_1 -> ~chi_20 b )
     0.00000000E+00    2     1000025         5   # BR(~b_1 -> ~chi_30 b )
     0.00000000E+00    2     1000035         5   # BR(~b_1 -> ~chi_40 b )
     4.83436633E-01    2    -1000024         6   # BR(~b_1 -> ~chi_1- t )
     0.00000000E+00    2    -1000037         6   # BR(~b_1 -> ~chi_2- t )
     0.00000000E+00    2     1000021         5   # BR(~b_1 -> ~g      b )
     0.00000000E+00    2     1000006       -37   # BR(~b_1 -> ~t_1    H-)
     0.00000000E+00    2     2000006       -37   # BR(~b_1 -> ~t_2    H-)
     1.75280884E-02    2     1000006       -24   # BR(~b_1 -> ~t_1    W-)
     0.00000000E+00    2     2000006       -24   # BR(~b_1 -> ~t_2    W-)
#
#         PDG            Width
DECAY   2000005     1.09053590E+00   # sbottom2 decays
#          BR         NDA      ID1       ID2
     1.18463916E-01    2     1000022         5   # BR(~b_2 -> ~chi_10 b )
     3.07561122E-01    2     1000023         5   # BR(~b_2 -> ~chi_20 b )
     0.00000000E+00    2     1000025         5   # BR(~b_2 -> ~chi_30 b )
     0.00000000E+00    2     1000035         5   # BR(~b_2 -> ~chi_40 b )
     3.99968483E-01    2    -1000024         6   # BR(~b_2 -> ~chi_1- t )
     0.00000000E+00    2    -1000037         6   # BR(~b_2 -> ~chi_2- t )
     1.54630697E-02    2     1000021         5   # BR(~b_2 -> ~g      b )
     0.00000000E+00    2     1000005        25   # BR(~b_2 -> ~b_1    h )
     0.00000000E+00    2     1000005        35   # BR(~b_2 -> ~b_1    H )
     0.00000000E+00    2     1000005        36   # BR(~b_2 -> ~b_1    A )
     0.00000000E+00    2     1000006       -37   # BR(~b_2 -> ~t_1    H-)
     0.00000000E+00    2     2000006       -37   # BR(~b_2 -> ~t_2    H-)
     0.00000000E+00    2     1000005        23   # BR(~b_2 -> ~b_1    Z )
     1.58543409E-01    2     1000006       -24   # BR(~b_2 -> ~t_1    W-)
     0.00000000E+00    2     2000006       -24   # BR(~b_2 -> ~t_2    W-)
#
#         PDG            Width
DECAY   1000002     2.20246239E+00   # sup_L decays
#          BR         NDA      ID1       ID2
     8.81750579E-03    2     1000022         2   # BR(~u_L -> ~chi_10 u)
     3.32789542E-01    2     1000023         2   # BR(~u_L -> ~chi_20 u)
     0.00000000E+00    2     1000025         2   # BR(~u_L -> ~chi_30 u)
     0.00000000E+00    2     1000035         2   # BR(~u_L -> ~chi_40 u)
     6.58392952E-01    2     1000024         1   # BR(~u_L -> ~chi_1+ d)
     0.00000000E+00    2     1000037         1   # BR(~u_L -> ~chi_2+ d)
     0.00000000E+00    2     1000021         2   # BR(~u_L -> ~g      u)
#
#         PDG            Width
DECAY   2000002     5.86430797E-01   # sup_R decays
#          BR         NDA      ID1       ID2
     9.97691987E-01    2     1000022         2   # BR(~u_R -> ~chi_10 u)
     2.30801293E-03    2     1000023         2   # BR(~u_R -> ~chi_20 u)
     0.00000000E+00    2     1000025         2   # BR(~u_R -> ~chi_30 u)
     0.00000000E+00    2     1000035         2   # BR(~u_R -> ~chi_40 u)
     0.00000000E+00    2     1000024         1   # BR(~u_R -> ~chi_1+ d)
     0.00000000E+00    2     1000037         1   # BR(~u_R -> ~chi_2+ d)
     0.00000000E+00    2     1000021         2   # BR(~u_R -> ~g      u)
#
#         PDG            Width
DECAY   1000001     2.23873744E+00   # sdown_L decays
#          BR         NDA      ID1       ID2
     2.68217109E-02    2     1000022         1   # BR(~d_L -> ~chi_10 d)
     3.20346791E-01    2     1000023         1   # BR(~d_L -> ~chi_20 d)
     0.00000000E+00    2     1000025         1   # BR(~d_L -> ~chi_30 d)
     0.00000000E+00    2     1000035         1   # BR(~d_L -> ~chi_40 d)
     6.52831498E-01    2    -1000024         2   # BR(~d_L -> ~chi_1- u)
     0.00000000E+00    2    -1000037         2   # BR(~d_L -> ~chi_2- u)
     0.00000000E+00    2     1000021         1   # BR(~d_L -> ~g      d)
#
#         PDG            Width
DECAY   2000001     1.46607699E-01   # sdown_R decays
#          BR         NDA      ID1       ID2
     9.97691987E-01    2     1000022         1   # BR(~d_R -> ~chi_10 d)
     2.30801293E-03    2     1000023         1   # BR(~d_R -> ~chi_20 d)
     0.00000000E+00    2     1000025         1   # BR(~d_R -> ~chi_30 d)
     0.00000000E+00    2     1000035         1   # BR(~d_R -> ~chi_40 d)
     0.00000000E+00    2    -1000024         2   # BR(~d_R -> ~chi_1- u)
     0.00000000E+00    2    -1000037         2   # BR(~d_R -> ~chi_2- u)
     0.00000000E+00    2     1000021         1   # BR(~d_R -> ~g      d)
#
#         PDG            Width
DECAY   1000004     2.20246239E+00   # scharm_L decays
#          BR         NDA      ID1       ID2
     8.81750579E-03    2     1000022         4   # BR(~c_L -> ~chi_10 c)
     3.32789542E-01    2     1000023         4   # BR(~c_L -> ~chi_20 c)
     0.00000000E+00    2     1000025         4   # BR(~c_L -> ~chi_30 c)
     0.00000000E+00    2     1000035         4   # BR(~c_L -> ~chi_40 c)
     6.58392952E-01    2     1000024         3   # BR(~c_L -> ~chi_1+ s)
     0.00000000E+00    2     1000037         3   # BR(~c_L -> ~chi_2+ s)
     0.00000000E+00    2     1000021         4   # BR(~c_L -> ~g      c)
#
#         PDG            Width
DECAY   2000004     5.86430797E-01   # scharm_R decays
#          BR         NDA      ID1       ID2
     9.97691987E-01    2     1000022         4   # BR(~c_R -> ~chi_10 c)
     2.30801293E-03    2     1000023         4   # BR(~c_R -> ~chi_20 c)
     0.00000000E+00    2     1000025         4   # BR(~c_R -> ~chi_30 c)
     0.00000000E+00    2     1000035         4   # BR(~c_R -> ~chi_40 c)
     0.00000000E+00    2     1000024         3   # BR(~c_R -> ~chi_1+ s)
     0.00000000E+00    2     1000037         3   # BR(~c_R -> ~chi_2+ s)
     0.00000000E+00    2     1000021         4   # BR(~c_R -> ~g      c)
#
#         PDG            Width
DECAY   1000003     2.23873744E+00   # sstrange_L decays
#          BR         NDA      ID1       ID2
     2.68217109E-02    2     1000022         3   # BR(~s_L -> ~chi_10 s)
     3.20346791E-01    2     1000023         3   # BR(~s_L -> ~chi_20 s)
     0.00000000E+00    2     1000025         3   # BR(~s_L -> ~chi_30 s)
     0.00000000E+00    2     1000035         3   # BR(~s_L -> ~chi_40 s)
     6.52831498E-01    2    -1000024         4   # BR(~s_L -> ~chi_1- c)
     0.00000000E+00    2    -1000037         4   # BR(~s_L -> ~chi_2- c)
     0.00000000E+00    2     1000021         3   # BR(~s_L -> ~g      s)
#
#         PDG            Width
DECAY   2000003     1.46607699E-01   # sstrange_R decays
#          BR         NDA      ID1       ID2
     9.97691987E-01    2     1000022         3   # BR(~s_R -> ~chi_10 s)
     2.30801293E-03    2     1000023         3   # BR(~s_R -> ~chi_20 s)
     0.00000000E+00    2     1000025         3   # BR(~s_R -> ~chi_30 s)
     0.00000000E+00    2     1000035         3   # BR(~s_R -> ~chi_40 s)
     0.00000000E+00    2    -1000024         4   # BR(~s_R -> ~chi_1- c)
     0.00000000E+00    2    -1000037         4   # BR(~s_R -> ~chi_2- c)
     0.00000000E+00    2     1000021         3   # BR(~s_R -> ~g      s)
#
#         PDG            Width
DECAY   1000011     2.51973198E+00   # selectron_L decays
#          BR         NDA      ID1       ID2
     1.09800442E-01    2     1000022        11   # BR(~e_L -> ~chi_10 e-)
     3.10170283E-01    2     1000023        11   # BR(~e_L -> ~chi_20 e-)
     0.00000000E+00    2     1000025        11   # BR(~e_L -> ~chi_30 e-)
     0.00000000E+00    2     1000035        11   # BR(~e_L -> ~chi_40 e-)
     5.80029275E-01    2    -1000024        12   # BR(~e_L -> ~chi_1- nu_e)
     0.00000000E+00    2    -1000037        12   # BR(~e_L -> ~chi_2- nu_e)
#
#         PDG            Width
DECAY   2000011     1.31946929E+00   # selectron_R decays
#          BR         NDA      ID1       ID2
     9.97691987E-01    2     1000022        11   # BR(~e_R -> ~chi_10 e-)
     2.30801293E-03    2     1000023        11   # BR(~e_R -> ~chi_20 e-)
     0.00000000E+00    2     1000025        11   # BR(~e_R -> ~chi_30 e-)
     0.00000000E+00    2     1000035        11   # BR(~e_R -> ~chi_40 e-)
     0.00000000E+00    2    -1000024        12   # BR(~e_R -> ~chi_1- nu_e)
     0.00000000E+00    2    -1000037        12   # BR(~e_R -> ~chi_2- nu_e)
#
#         PDG            Width
DECAY   1000013     2.51973198E+00   # smuon_L decays
#          BR         NDA      ID1       ID2
     1.09800442E-01    2     1000022        13   # BR(~mu_L -> ~chi_10 mu-)
     3.10170283E-01    2     1000023        13   # BR(~mu_L -> ~chi_20 mu-)
     0.00000000E+00    2     1000025        13   # BR(~mu_L -> ~chi_30 mu-)
     0.00000000E+00    2     1000035        13   # BR(~mu_L -> ~chi_40 mu-)
     5.80029275E-01    2    -1000024        14   # BR(~mu_L -> ~chi_1- nu_mu)
     0.00000000E+00    2    -1000037        14   # BR(~mu_L -> ~chi_2- nu_mu)
#
#         PDG            Width
DECAY   2000013     1.31946929E+00   # smuon_R decays
#          BR         NDA      ID1       ID2
     9.97691987E-01    2     1000022        13   # BR(~mu_R -> ~chi_10 mu-)
     2.30801293E-03    2     1000023        13   # BR(~mu_R -> ~chi_20 mu-)
     0.00000000E+00    2     1000025        13   # BR(~mu_R -> ~chi_30 mu-)
     0.00000000E+00    2     1000035        13   # BR(~mu_R -> ~chi_40 mu-)
     0.00000000E+00    2    -1000024        14   # BR(~mu_R -> ~chi_1- nu_mu)
     0.00000000E+00    2    -1000037        14   # BR(~mu_R -> ~chi_2- nu_mu)
#
#         PDG            Width
DECAY   1000015     1.43652114E+00   # stau_1 decays
#          BR         NDA      ID1       ID2
     7.52061355E-01    2     1000022        15   # BR(~tau_1 -> ~chi_10  tau-)
     8.68500115E-02    2     1000023        15   # BR(~tau_1 -> ~chi_20  tau-)
     0.00000000E+00    2     1000025        15   # BR(~tau_1 -> ~chi_30  tau-)
     0.00000000E+00    2     1000035        15   # BR(~tau_1 -> ~chi_40  tau-)
     1.61088634E-01    2    -1000024        16   # BR(~tau_1 -> ~chi_1-  nu_tau)
     0.00000000E+00    2    -1000037        16   # BR(~tau_1 -> ~chi_2-  nu_tau)
     0.00000000E+00    2     1000016       -37   # BR(~tau_1 -> ~nu_tauL H-)
     0.00000000E+00    2     1000016       -24   # BR(~tau_1 -> ~nu_tauL W-)
#
#         PDG            Width
DECAY   2000015     2.46422940E+00   # stau_2 decays
#          BR         NDA      ID1       ID2
     1.88479134E-01    2     1000022        15   # BR(~tau_2 -> ~chi_10  tau-)
     2.83373177E-01    2     1000023        15   # BR(~tau_2 -> ~chi_20  tau-)
     0.00000000E+00    2     1000025        15   # BR(~tau_2 -> ~chi_30  tau-)
     0.00000000E+00    2     1000035        15   # BR(~tau_2 -> ~chi_40  tau-)
     5.28147690E-01    2    -1000024        16   # BR(~tau_2 -> ~chi_1-  nu_tau)
     0.00000000E+00    2    -1000037        16   # BR(~tau_2 -> ~chi_2-  nu_tau)
     0.00000000E+00    2     1000016       -37   # BR(~tau_2 -> ~nu_tauL H-)
     0.00000000E+00    2     1000016       -24   # BR(~tau_2 -> ~nu_tauL W-)
     0.00000000E+00    2     1000015        25   # BR(~tau_2 -> ~tau_1 h)
     0.00000000E+00    2     1000015        35   # BR(~tau_2 -> ~tau_1 H)
     0.00000000E+00    2     1000015        36   # BR(~tau_2 -> ~tau_1 A)
     0.00000000E+00    2     1000015        23   # BR(~tau_2 -> ~tau_1 Z)
#
#         PDG            Width
DECAY   1000012     2.51271107E+00   # snu_eL decays
#          BR         NDA      ID1       ID2
     1.55731810E-01    2     1000022        12   # BR(~nu_eL -> ~chi_10 nu_e)
     2.67168129E-01    2     1000023        12   # BR(~nu_eL -> ~chi_20 nu_e)
     0.00000000E+00    2     1000025        12   # BR(~nu_eL -> ~chi_30 nu_e)
     0.00000000E+00    2     1000035        12   # BR(~nu_eL -> ~chi_40 nu_e)
     5.77100061E-01    2     1000024        11   # BR(~nu_eL -> ~chi_1+ e-)
     0.00000000E+00    2     1000037        11   # BR(~nu_eL -> ~chi_2+ e-)
#
#         PDG            Width
DECAY   1000014     2.51271107E+00   # snu_muL decays
#          BR         NDA      ID1       ID2
     1.55731810E-01    2     1000022        14   # BR(~nu_muL -> ~chi_10 nu_mu)
     2.67168129E-01    2     1000023        14   # BR(~nu_muL -> ~chi_20 nu_mu)
     0.00000000E+00    2     1000025        14   # BR(~nu_muL -> ~chi_30 nu_mu)
     0.00000000E+00    2     1000035        14   # BR(~nu_muL -> ~chi_40 nu_mu)
     5.77100061E-01    2     1000024        13   # BR(~nu_muL -> ~chi_1+ mu-)
     0.00000000E+00    2     1000037        13   # BR(~nu_muL -> ~chi_2+ mu-)
#
#         PDG            Width
DECAY   1000016     2.63989970E+00   # snu_tauL decays
#          BR         NDA      ID1       ID2
     1.53958444E-01    2     1000022        16   # BR(~nu_tauL -> ~chi_10 nu_tau)
     2.67694433E-01    2     1000023        16   # BR(~nu_tauL -> ~chi_20 nu_tau)
     0.00000000E+00    2     1000025        16   # BR(~nu_tauL -> ~chi_30 nu_tau)
     0.00000000E+00    2     1000035        16   # BR(~nu_tauL -> ~chi_40 nu_tau)
     5.78347123E-01    2     1000024        15   # BR(~nu_tauL -> ~chi_1+ tau-)
     0.00000000E+00    2     1000037        15   # BR(~nu_tauL -> ~chi_2+ tau-)
     0.00000000E+00    2    -1000015       -37   # BR(~nu_tauL -> ~tau_1+ H-)
     0.00000000E+00    2    -2000015       -37   # BR(~nu_tauL -> ~tau_2+ H-)
     0.00000000E+00    2    -1000015       -24   # BR(~nu_tauL -> ~tau_1+ W-)
     0.00000000E+00    2    -2000015       -24   # BR(~nu_tauL -> ~tau_2+ W-)
#
#         PDG            Width
DECAY   1000024     1.94124798E-05   # chargino1+ decays
#           BR         NDA      ID1       ID2       ID3
     3.34271139E-01    3     1000022         2        -1   # BR(~chi_1+ -> ~chi_10 u    db)
     0.00000000E+00    3     1000023         2        -1   # BR(~chi_1+ -> ~chi_20 u    db)
     0.00000000E+00    3     1000025         2        -1   # BR(~chi_1+ -> ~chi_30 u    db)
     0.00000000E+00    3     1000035         2        -1   # BR(~chi_1+ -> ~chi_40 u    db)
     3.34271139E-01    3     1000022         4        -3   # BR(~chi_1+ -> ~chi_10 c    sb)
     0.00000000E+00    3     1000023         4        -3   # BR(~chi_1+ -> ~chi_20 c    sb)
     0.00000000E+00    3     1000025         4        -3   # BR(~chi_1+ -> ~chi_30 c    sb)
     0.00000000E+00    3     1000035         4        -3   # BR(~chi_1+ -> ~chi_40 c    sb)
     0.00000000E+00    3     1000022         6        -5   # BR(~chi_1+ -> ~chi_10 t    bb)
     0.00000000E+00    3     1000023         6        -5   # BR(~chi_1+ -> ~chi_20 t    bb)
     0.00000000E+00    3     1000025         6        -5   # BR(~chi_1+ -> ~chi_30 t    bb)
     0.00000000E+00    3     1000035         6        -5   # BR(~chi_1+ -> ~chi_40 t    bb)
     1.10670156E-01    3     1000022       -11        12   # BR(~chi_1+ -> ~chi_10 e+   nu_e)
     0.00000000E+00    3     1000023       -11        12   # BR(~chi_1+ -> ~chi_20 e+   nu_e)
     0.00000000E+00    3     1000025       -11        12   # BR(~chi_1+ -> ~chi_30 e+   nu_e)
     0.00000000E+00    3     1000035       -11        12   # BR(~chi_1+ -> ~chi_40 e+   nu_e)
     1.10670156E-01    3     1000022       -13        14   # BR(~chi_1+ -> ~chi_10 mu+  nu_mu)
     0.00000000E+00    3     1000023       -13        14   # BR(~chi_1+ -> ~chi_20 mu+  nu_mu)
     0.00000000E+00    3     1000025       -13        14   # BR(~chi_1+ -> ~chi_30 mu+  nu_mu)
     0.00000000E+00    3     1000035       -13        14   # BR(~chi_1+ -> ~chi_40 mu+  nu_mu)
     1.10117409E-01    3     1000022       -15        16   # BR(~chi_1+ -> ~chi_10 tau+ nu_tau)
     0.00000000E+00    3     1000023       -15        16   # BR(~chi_1+ -> ~chi_20 tau+ nu_tau)
     0.00000000E+00    3     1000025       -15        16   # BR(~chi_1+ -> ~chi_30 tau+ nu_tau)
     0.00000000E+00    3     1000035       -15        16   # BR(~chi_1+ -> ~chi_40 tau+ nu_tau)
     0.00000000E+00    3     1000021         2        -1   # BR(~chi_1+ -> ~g      u    db)
     0.00000000E+00    3     1000021         4        -3   # BR(~chi_1+ -> ~g      c    sb)
     0.00000000E+00    3     1000021         6        -5   # BR(~chi_1+ -> ~g      t    bb)
#
#         PDG            Width
DECAY   1000037     1.48314341E+01   # chargino2+ decays
#          BR         NDA      ID1       ID2
     1.50954622E-03    2     1000002        -1   # BR(~chi_2+ -> ~u_L   db)
     0.00000000E+00    2     2000002        -1   # BR(~chi_2+ -> ~u_R   db)
     3.32856273E-03    2    -1000001         2   # BR(~chi_2+ -> ~d_L*  u )
     0.00000000E+00    2    -2000001         2   # BR(~chi_2+ -> ~d_R*  u )
     1.50954622E-03    2     1000004        -3   # BR(~chi_2+ -> ~c_L   sb)
     0.00000000E+00    2     2000004        -3   # BR(~chi_2+ -> ~c_R   sb)
     3.32856273E-03    2    -1000003         4   # BR(~chi_2+ -> ~s_L*  c )
     0.00000000E+00    2    -2000003         4   # BR(~chi_2+ -> ~s_R*  c )
     2.96139193E-01    2     1000006        -5   # BR(~chi_2+ -> ~t_1   bb)
     3.45240109E-02    2     2000006        -5   # BR(~chi_2+ -> ~t_2   bb)
     9.04950949E-02    2    -1000005         6   # BR(~chi_2+ -> ~b_1*  t )
     1.75029446E-02    2    -2000005         6   # BR(~chi_2+ -> ~b_2*  t )
     5.03182072E-04    2     1000012       -11   # BR(~chi_2+ -> ~nu_eL  e+  )
     5.03182072E-04    2     1000014       -13   # BR(~chi_2+ -> ~nu_muL  mu+ )
     1.48729287E-03    2     1000016       -15   # BR(~chi_2+ -> ~nu_tau1 tau+)
     1.10952091E-03    2    -1000011        12   # BR(~chi_2+ -> ~e_L+    nu_e)
     0.00000000E+00    2    -2000011        12   # BR(~chi_2+ -> ~e_R+    nu_e)
     1.10952091E-03    2    -1000013        14   # BR(~chi_2+ -> ~mu_L+   nu_mu)
     0.00000000E+00    2    -2000013        14   # BR(~chi_2+ -> ~mu_R+   nu_mu)
     3.07142783E-04    2    -1000015        16   # BR(~chi_2+ -> ~tau_1+  nu_tau)
     1.72659500E-03    2    -2000015        16   # BR(~chi_2+ -> ~tau_2+  nu_tau)
     1.67712468E-01    2     1000024        23   # BR(~chi_2+ -> ~chi_1+  Z )
     4.02342177E-02    2     1000022        24   # BR(~chi_2+ -> ~chi_10  W+)
     1.79729922E-01    2     1000023        24   # BR(~chi_2+ -> ~chi_20  W+)
     0.00000000E+00    2     1000025        24   # BR(~chi_2+ -> ~chi_30  W+)
     0.00000000E+00    2     1000035        24   # BR(~chi_2+ -> ~chi_40  W+)
     1.57239495E-01    2     1000024        25   # BR(~chi_2+ -> ~chi_1+  h )
     0.00000000E+00    2     1000024        35   # BR(~chi_2+ -> ~chi_1+  H )
     0.00000000E+00    2     1000024        36   # BR(~chi_2+ -> ~chi_1+  A )
     0.00000000E+00    2     1000022        37   # BR(~chi_2+ -> ~chi_10  H+)
     0.00000000E+00    2     1000023        37   # BR(~chi_2+ -> ~chi_20  H+)
     0.00000000E+00    2     1000025        37   # BR(~chi_2+ -> ~chi_30  H+)
     0.00000000E+00    2     1000035        37   # BR(~chi_2+ -> ~chi_40  H+)
#
#         PDG            Width
DECAY   1000022     0.00000000E+00   # neutralino1 decays
#
#         PDG            Width
DECAY   1000023     1.38042458E-07   # neutralino2 decays
#           BR         NDA      ID1       ID2       ID3
     1.23447615E-01    3     1000022        -2         2   # BR(~chi_20 -> ~chi_10 ub      u)
     2.11525006E-01    3     1000022        -1         1   # BR(~chi_20 -> ~chi_10 db      d)
     1.23447615E-01    3     1000022        -4         4   # BR(~chi_20 -> ~chi_10 cb      c)
     2.11525006E-01    3     1000022        -3         3   # BR(~chi_20 -> ~chi_10 sb      s)
     0.00000000E+00    3     1000022        -6         6   # BR(~chi_20 -> ~chi_10 tb      t)
     1.87755919E-01    3     1000022        -5         5   # BR(~chi_20 -> ~chi_10 bb      b)
     3.09661320E-02    3     1000022       -11        11   # BR(~chi_20 -> ~chi_10 e+      e-)
     3.09661320E-02    3     1000022       -13        13   # BR(~chi_20 -> ~chi_10 mu+     mu-)
     3.38894640E-02    3     1000022       -15        15   # BR(~chi_20 -> ~chi_10 tau+    tau-)
     1.62938150E-02    3     1000022       -12        12   # BR(~chi_20 -> ~chi_10 nu_eb   nu_e)
     1.62938150E-02    3     1000022       -14        14   # BR(~chi_20 -> ~chi_10 nu_mub  nu_mu)
     1.38894617E-02    3     1000022       -16        16   # BR(~chi_20 -> ~chi_10 nu_taub nu_tau)
     3.55884239E-09    3     1000024        -2         1   # BR(~chi_20 -> ~chi_1+ ub      d)
     3.55884239E-09    3    -1000024        -1         2   # BR(~chi_20 -> ~chi_1- db      u)
     0.00000000E+00    3     1000037        -2         1   # BR(~chi_20 -> ~chi_2+ ub      d)
     0.00000000E+00    3    -1000037        -1         2   # BR(~chi_20 -> ~chi_2- db      u)
     3.55884239E-09    3     1000024        -4         3   # BR(~chi_20 -> ~chi_1+ cb      s)
     3.55884239E-09    3    -1000024        -3         4   # BR(~chi_20 -> ~chi_1- sb      c)
     0.00000000E+00    3     1000037        -4         3   # BR(~chi_20 -> ~chi_2+ cb      s)
     0.00000000E+00    3    -1000037        -3         4   # BR(~chi_20 -> ~chi_2- sb      c)
     0.00000000E+00    3     1000024        -6         5   # BR(~chi_20 -> ~chi_1+ tb      b)
     0.00000000E+00    3    -1000024        -5         6   # BR(~chi_20 -> ~chi_1- bb      t)
     0.00000000E+00    3     1000037        -6         5   # BR(~chi_20 -> ~chi_2+ tb      b)
     0.00000000E+00    3    -1000037        -5         6   # BR(~chi_20 -> ~chi_2- bb      t)
     1.18627125E-09    3     1000024       -12        11   # BR(~chi_20 -> ~chi_1+ nu_eb   e-)
     1.18627125E-09    3    -1000024        12       -11   # BR(~chi_20 -> ~chi_1- nu_e    e+)
     0.00000000E+00    3     1000037       -12        11   # BR(~chi_20 -> ~chi_2+ nu_eb   e-)
     0.00000000E+00    3    -1000037        12       -11   # BR(~chi_20 -> ~chi_2- nu_e    e+)
     1.18627125E-09    3     1000024       -14        13   # BR(~chi_20 -> ~chi_1+ nu_mub  mu-)
     1.18627125E-09    3    -1000024        14       -13   # BR(~chi_20 -> ~chi_1- nu_mu   mu+)
     0.00000000E+00    3     1000037       -14        13   # BR(~chi_20 -> ~chi_2+ nu_mub  mu-)
     0.00000000E+00    3    -1000037        14       -13   # BR(~chi_20 -> ~chi_2- nu_mu   mu+)
     0.00000000E+00    3     1000024       -16        15   # BR(~chi_20 -> ~chi_1+ nu_taub tau-)
     0.00000000E+00    3    -1000024        16       -15   # BR(~chi_20 -> ~chi_1- nu_tau  tau+)
     0.00000000E+00    3     1000037       -16        15   # BR(~chi_20 -> ~chi_2+ nu_taub tau-)
     0.00000000E+00    3    -1000037        16       -15   # BR(~chi_20 -> ~chi_2- nu_tau  tau+)
     0.00000000E+00    3     1000021        -2         2   # BR(~chi_20 -> ~g      ub      u)
     0.00000000E+00    3     1000021        -1         1   # BR(~chi_20 -> ~g      db      d)
     0.00000000E+00    3     1000021        -4         4   # BR(~chi_20 -> ~g      cb      c)
     0.00000000E+00    3     1000021        -3         3   # BR(~chi_20 -> ~g      sb      s)
     0.00000000E+00    3     1000021        -6         6   # BR(~chi_20 -> ~g      tb      t)
     0.00000000E+00    3     1000021        -5         5   # BR(~chi_20 -> ~g      bb      b)
#
#         PDG            Width
DECAY   1000025     1.15802115E+01   # neutralino3 decays
#          BR         NDA      ID1       ID2
     7.24200034E-02    2     1000022        23   # BR(~chi_30 -> ~chi_10   Z )
     1.88898502E-01    2     1000023        23   # BR(~chi_30 -> ~chi_20   Z )
     2.12879907E-01    2     1000024       -24   # BR(~chi_30 -> ~chi_1+   W-)
     2.12879907E-01    2    -1000024        24   # BR(~chi_30 -> ~chi_1-   W+)
     0.00000000E+00    2     1000037       -24   # BR(~chi_30 -> ~chi_2+   W-)
     0.00000000E+00    2    -1000037        24   # BR(~chi_30 -> ~chi_2-   W+)
     4.07122429E-03    2     1000022        25   # BR(~chi_30 -> ~chi_10   h )
     0.00000000E+00    2     1000022        35   # BR(~chi_30 -> ~chi_10   H )
     0.00000000E+00    2     1000022        36   # BR(~chi_30 -> ~chi_10   A )
     7.28825536E-03    2     1000023        25   # BR(~chi_30 -> ~chi_20   h )
     0.00000000E+00    2     1000023        35   # BR(~chi_30 -> ~chi_20   H )
     0.00000000E+00    2     1000023        36   # BR(~chi_30 -> ~chi_20   A )
     0.00000000E+00    2     1000024       -37   # BR(~chi_30 -> ~chi_1+   H-)
     0.00000000E+00    2    -1000024        37   # BR(~chi_30 -> ~chi_1-   H+)
     0.00000000E+00    2     1000037       -37   # BR(~chi_30 -> ~chi_2+   H-)
     0.00000000E+00    2    -1000037        37   # BR(~chi_30 -> ~chi_2-   H+)
     4.76386327E-05    2     1000002        -2   # BR(~chi_30 -> ~u_L      ub)
     4.76386327E-05    2    -1000002         2   # BR(~chi_30 -> ~u_L*     u )
     9.83788791E-06    2     2000002        -2   # BR(~chi_30 -> ~u_R      ub)
     9.83788791E-06    2    -2000002         2   # BR(~chi_30 -> ~u_R*     u )
     7.00174951E-05    2     1000001        -1   # BR(~chi_30 -> ~d_L      db)
     7.00174951E-05    2    -1000001         1   # BR(~chi_30 -> ~d_L*     d )
     2.45947198E-06    2     2000001        -1   # BR(~chi_30 -> ~d_R      db)
     2.45947198E-06    2    -2000001         1   # BR(~chi_30 -> ~d_R*     d )
     4.76386327E-05    2     1000004        -4   # BR(~chi_30 -> ~c_L      cb)
     4.76386327E-05    2    -1000004         4   # BR(~chi_30 -> ~c_L*     c )
     9.83788791E-06    2     2000004        -4   # BR(~chi_30 -> ~c_R      cb)
     9.83788791E-06    2    -2000004         4   # BR(~chi_30 -> ~c_R*     c )
     7.00174951E-05    2     1000003        -3   # BR(~chi_30 -> ~s_L      sb)
     7.00174951E-05    2    -1000003         3   # BR(~chi_30 -> ~s_L*     s )
     2.45947198E-06    2     2000003        -3   # BR(~chi_30 -> ~s_R      sb)
     2.45947198E-06    2    -2000003         3   # BR(~chi_30 -> ~s_R*     s )
     1.11965402E-01    2     1000006        -6   # BR(~chi_30 -> ~t_1      tb)
     1.11965402E-01    2    -1000006         6   # BR(~chi_30 -> ~t_1*     t )
     3.15118347E-02    2     2000006        -6   # BR(~chi_30 -> ~t_2      tb)
     3.15118347E-02    2    -2000006         6   # BR(~chi_30 -> ~t_2*     t )
     2.65056295E-03    2     1000005        -5   # BR(~chi_30 -> ~b_1      bb)
     2.65056295E-03    2    -1000005         5   # BR(~chi_30 -> ~b_1*     b )
     2.92567311E-03    2     2000005        -5   # BR(~chi_30 -> ~b_2      bb)
     2.92567311E-03    2    -2000005         5   # BR(~chi_30 -> ~b_2*     b )
     9.25459152E-06    2     1000011       -11   # BR(~chi_30 -> ~e_L-     e+)
     9.25459152E-06    2    -1000011        11   # BR(~chi_30 -> ~e_L+     e-)
     7.37841593E-06    2     2000011       -11   # BR(~chi_30 -> ~e_R-     e+)
     7.37841593E-06    2    -2000011        11   # BR(~chi_30 -> ~e_R+     e-)
     9.25459152E-06    2     1000013       -13   # BR(~chi_30 -> ~mu_L-    mu+)
     9.25459152E-06    2    -1000013        13   # BR(~chi_30 -> ~mu_L+    mu-)
     7.37841593E-06    2     2000013       -13   # BR(~chi_30 -> ~mu_R-    mu+)
     7.37841593E-06    2    -2000013        13   # BR(~chi_30 -> ~mu_R+    mu-)
     6.27609194E-04    2     1000015       -15   # BR(~chi_30 -> ~tau_1-   tau+)
     6.27609194E-04    2    -1000015        15   # BR(~chi_30 -> ~tau_1+   tau-)
     7.08000323E-04    2     2000015       -15   # BR(~chi_30 -> ~tau_2-   tau+)
     7.08000323E-04    2    -2000015        15   # BR(~chi_30 -> ~tau_2+   tau-)
     3.35912655E-05    2     1000012       -12   # BR(~chi_30 -> ~nu_eL    nu_eb)
     3.35912655E-05    2    -1000012        12   # BR(~chi_30 -> ~nu_eL*   nu_e )
     3.35912655E-05    2     1000014       -14   # BR(~chi_30 -> ~nu_muL   nu_mub)
     3.35912655E-05    2    -1000014        14   # BR(~chi_30 -> ~nu_muL*  nu_mu )
     3.16624796E-05    2     1000016       -16   # BR(~chi_30 -> ~nu_tau1  nu_taub)
     3.16624796E-05    2    -1000016        16   # BR(~chi_30 -> ~nu_tau1* nu_tau )
#
#         PDG            Width
DECAY   1000035     1.50660856E+01   # neutralino4 decays
#          BR         NDA      ID1       ID2
     3.28255335E-03    2     1000022        23   # BR(~chi_40 -> ~chi_10   Z )
     6.42431233E-03    2     1000023        23   # BR(~chi_40 -> ~chi_20   Z )
     0.00000000E+00    2     1000025        23   # BR(~chi_40 -> ~chi_30   Z )
     1.67087840E-01    2     1000024       -24   # BR(~chi_40 -> ~chi_1+   W-)
     1.67087840E-01    2    -1000024        24   # BR(~chi_40 -> ~chi_1-   W+)
     0.00000000E+00    2     1000037       -24   # BR(~chi_40 -> ~chi_2+   W-)
     0.00000000E+00    2    -1000037        24   # BR(~chi_40 -> ~chi_2-   W+)
     5.63818771E-02    2     1000022        25   # BR(~chi_40 -> ~chi_10   h )
     0.00000000E+00    2     1000022        35   # BR(~chi_40 -> ~chi_10   H )
     0.00000000E+00    2     1000022        36   # BR(~chi_40 -> ~chi_10   A )
     1.38707493E-01    2     1000023        25   # BR(~chi_40 -> ~chi_20   h )
     0.00000000E+00    2     1000023        35   # BR(~chi_40 -> ~chi_20   H )
     0.00000000E+00    2     1000023        36   # BR(~chi_40 -> ~chi_20   A )
     0.00000000E+00    2     1000025        25   # BR(~chi_40 -> ~chi_30   h )
     0.00000000E+00    2     1000025        35   # BR(~chi_40 -> ~chi_30   H )
     0.00000000E+00    2     1000025        36   # BR(~chi_40 -> ~chi_30   A )
     0.00000000E+00    2     1000024       -37   # BR(~chi_40 -> ~chi_1+   H-)
     0.00000000E+00    2    -1000024        37   # BR(~chi_40 -> ~chi_1-   H+)
     0.00000000E+00    2     1000037       -37   # BR(~chi_40 -> ~chi_2+   H-)
     0.00000000E+00    2    -1000037        37   # BR(~chi_40 -> ~chi_2-   H+)
     9.69567073E-04    2     1000002        -2   # BR(~chi_40 -> ~u_L      ub)
     9.69567073E-04    2    -1000002         2   # BR(~chi_40 -> ~u_L*     u )
     1.38819541E-04    2     2000002        -2   # BR(~chi_40 -> ~u_R      ub)
     1.38819541E-04    2    -2000002         2   # BR(~chi_40 -> ~u_R*     u )
     1.33932945E-03    2     1000001        -1   # BR(~chi_40 -> ~d_L      db)
     1.33932945E-03    2    -1000001         1   # BR(~chi_40 -> ~d_L*     d )
     3.47048852E-05    2     2000001        -1   # BR(~chi_40 -> ~d_R      db)
     3.47048852E-05    2    -2000001         1   # BR(~chi_40 -> ~d_R*     d )
     9.69567073E-04    2     1000004        -4   # BR(~chi_40 -> ~c_L      cb)
     9.69567073E-04    2    -1000004         4   # BR(~chi_40 -> ~c_L*     c )
     1.38819541E-04    2     2000004        -4   # BR(~chi_40 -> ~c_R      cb)
     1.38819541E-04    2    -2000004         4   # BR(~chi_40 -> ~c_R*     c )
     1.33932945E-03    2     1000003        -3   # BR(~chi_40 -> ~s_L      sb)
     1.33932945E-03    2    -1000003         3   # BR(~chi_40 -> ~s_L*     s )
     3.47048852E-05    2     2000003        -3   # BR(~chi_40 -> ~s_R      sb)
     3.47048852E-05    2    -2000003         3   # BR(~chi_40 -> ~s_R*     s )
     2.09930315E-01    2     1000006        -6   # BR(~chi_40 -> ~t_1      tb)
     2.09930315E-01    2    -1000006         6   # BR(~chi_40 -> ~t_1*     t )
     6.82985544E-03    2     2000006        -6   # BR(~chi_40 -> ~t_2      tb)
     6.82985544E-03    2    -2000006         6   # BR(~chi_40 -> ~t_2*     t )
     1.33609207E-03    2     1000005        -5   # BR(~chi_40 -> ~b_1      bb)
     1.33609207E-03    2    -1000005         5   # BR(~chi_40 -> ~b_1*     b )
     3.74783829E-03    2     2000005        -5   # BR(~chi_40 -> ~b_2      bb)
     3.74783829E-03    2    -2000005         5   # BR(~chi_40 -> ~b_2*     b )
     2.07536947E-04    2     1000011       -11   # BR(~chi_40 -> ~e_L-     e+)
     2.07536947E-04    2    -1000011        11   # BR(~chi_40 -> ~e_L+     e-)
     1.04114656E-04    2     2000011       -11   # BR(~chi_40 -> ~e_R-     e+)
     1.04114656E-04    2    -2000011        11   # BR(~chi_40 -> ~e_R+     e-)
     2.07536947E-04    2     1000013       -13   # BR(~chi_40 -> ~mu_L-    mu+)
     2.07536947E-04    2    -1000013        13   # BR(~chi_40 -> ~mu_L+    mu-)
     1.04114656E-04    2     2000013       -13   # BR(~chi_40 -> ~mu_R-    mu+)
     1.04114656E-04    2    -2000013        13   # BR(~chi_40 -> ~mu_R+    mu-)
     2.59507738E-04    2     1000015       -15   # BR(~chi_40 -> ~tau_1-   tau+)
     2.59507738E-04    2    -1000015        15   # BR(~chi_40 -> ~tau_1+   tau-)
     1.01411142E-03    2     2000015       -15   # BR(~chi_40 -> ~tau_2-   tau+)
     1.01411142E-03    2    -2000015        15   # BR(~chi_40 -> ~tau_2+   tau-)
     6.14043348E-04    2     1000012       -12   # BR(~chi_40 -> ~nu_eL    nu_eb)
     6.14043348E-04    2    -1000012        12   # BR(~chi_40 -> ~nu_eL*   nu_e )
     6.14043348E-04    2     1000014       -14   # BR(~chi_40 -> ~nu_muL   nu_mub)
     6.14043348E-04    2    -1000014        14   # BR(~chi_40 -> ~nu_muL*  nu_mu )
     5.80090081E-04    2     1000016       -16   # BR(~chi_40 -> ~nu_tau1  nu_taub)
     5.80090081E-04    2    -1000016        16   # BR(~chi_40 -> ~nu_tau1* nu_tau )
