#  ISAJET SUSY parameters in SUSY Les Houches Accord 2 format
#  Created by ISALHA 2.0 Last revision: C. Balazs 21 Apr 2009
Block SPINFO   # Program information
     1   ISASUGRA from ISAJET          # Spectrum Calculator
     2   7.80   29-OCT-2009 12:50:36   # Version number
Block MODSEL   # Model selection
     1     1   # Minimal supergravity (mSUGRA) model               
Block SMINPUTS   # Standard Model inputs
     1     1.27844376E+02   # alpha_em^(-1)
     2     1.16570000E-05   # G_Fermi
     3     1.17200002E-01   # alpha_s(M_Z)
     4     9.11699982E+01   # m_{Z}(pole)
     5     4.19999981E+00   # m_{b}(m_{b})
     6     1.72500000E+02   # m_{top}(pole)
     7     1.77699995E+00   # m_{tau}(pole)
Block MINPAR   # SUSY breaking input parameters
     1     9.00000000E+02   # m_0
     2     7.50000000E+02   # m_{1/2}
     3     1.00000000E+01   # tan(beta)
     4     1.00000000E+00   # sign(mu)
     5     0.00000000E+00   # A_0
Block EXTPAR   # Non-universal SUSY breaking parameters
     0     1.65636208E+16   # Input scale
Block MASS   # Scalar and gaugino mass spectrum
#  PDG code   mass                 particle
        24     8.04229965E+01   #  W^+
        25     1.16367416E+02   #  h^0            
        35     1.34502026E+03   #  H^0            
        36     1.33611438E+03   #  A^0            
        37     1.34896326E+03   #  H^+            
   1000001     1.77118921E+03   #  dnl            
   1000002     1.76932129E+03   #  upl            
   1000003     1.77118921E+03   #  stl            
   1000004     1.76932190E+03   #  chl            
   1000005     1.59413171E+03   #  b1             
   1000006     1.30203149E+03   #  t1             
   1000011     1.02818884E+03   #  el-            
   1000012     1.02396423E+03   #  nuel           
   1000013     1.02818884E+03   #  mul-           
   1000014     1.02396423E+03   #  numl           
   1000015     9.31778503E+02   #  tau1           
   1000016     1.01907166E+03   #  nutl           
   1000021     1.71189038E+03   #  glss           
   1000022     3.17385986E+02   #  z1ss           
   1000023     5.99461243E+02   #  z2ss           
   1000024     6.00352417E+02   #  w1ss           
   1000025    -8.81849731E+02   #  z3ss           
   1000035     8.94528931E+02   #  z4ss           
   1000037     8.94546326E+02   #  w2ss           
   2000001     1.71726526E+03   #  dnr            
   2000002     1.72166028E+03   #  upr            
   2000003     1.71726526E+03   #  str            
   2000004     1.72166077E+03   #  chr            
   2000005     1.70300623E+03   #  b2             
   2000006     1.61820959E+03   #  t2             
   2000011     9.41280579E+02   #  er-            
   2000013     9.41280579E+02   #  mur-           
   2000015     1.02439197E+03   #  tau2           
Block ALPHA   # Effective Higgs mixing parameter
         -1.00734316E-01   # alpha
Block STOPMIX   # stop mixing matrix
  1  1     2.30783939E-01   # O_{11}
  1  2     9.73004997E-01   # O_{12}
  2  1    -9.73004997E-01   # O_{21}
  2  2     2.30783939E-01   # O_{22}
Block SBOTMIX   # sbottom mixing matrix
  1  1     9.97349024E-01   # O_{11}
  1  2     7.27664232E-02   # O_{12}
  2  1    -7.27664232E-02   # O_{21}
  2  2     9.97349024E-01   # O_{22}
Block STAUMIX   # stau mixing matrix
  1  1     9.16405395E-02   # O_{11}
  1  2     9.95792150E-01   # O_{12}
  2  1    -9.95792150E-01   # O_{21}
  2  2     9.16405395E-02   # O_{22}
Block NMIX   # neutralino mixing matrix
  1  1     9.97921348E-01   #
  1  2    -8.11200589E-03   #
  1  3     5.85813969E-02   #
  1  4    -2.55987570E-02   #
  2  1    -2.08922550E-02   #
  2  2    -9.78127599E-01   #
  2  3     1.67089567E-01   #
  2  4    -1.22111283E-01   #
  3  1     2.29979903E-02   #
  3  2    -3.26706208E-02   #
  3  3    -7.05491781E-01   #
  3  4    -7.07590699E-01   #
  4  1    -5.64578474E-02   #
  4  2     2.05264255E-01   #
  4  3     6.86243415E-01   #
  4  4    -6.95520580E-01   #
Block UMIX   # chargino U mixing matrix
  1  1    -9.71500278E-01   # U_{11}
  1  2     2.37038314E-01   # U_{12}
  2  1    -2.37038314E-01   # U_{21}
  2  2    -9.71500278E-01   # U_{22}
Block VMIX   # chargino V mixing matrix
  1  1    -9.84683812E-01   # V_{11}
  1  2     1.74349472E-01   # V_{12}
  2  1    -1.74349472E-01   # V_{21}
  2  2    -9.84683812E-01   # V_{22}
Block GAUGE Q=  1.39005103E+03   #
     1     3.57492983E-01   # g`
     2     6.52483404E-01   # g_2
     3     1.22092867E+00   # g_3
Block YU Q=  1.39005103E+03   #
  3  3     8.45894337E-01   # y_t
Block YD Q=  1.39005103E+03   #
  3  3     1.29353523E-01   # y_b
Block YE Q=  1.39005103E+03   #
  3  3     1.02148086E-01   # y_tau
Block HMIX Q=  1.39005103E+03   # Higgs mixing parameters
     1     8.74949097E+02   # mu(Q)
     2     1.00000000E+01   # tan(beta)(M_GUT)
     3     2.51258835E+02   # Higgs vev at Q
     4     1.78520162E+06   # m_A^2(Q)
Block MSOFT Q=  1.39005103E+03   # DRbar SUSY breaking parameters
     1     3.21096771E+02   # M_1(Q)          
     2     5.89623779E+02   # M_2(Q)          
     3     1.60651685E+03   # M_3(Q)          
    31     1.02244531E+03   # MeL(Q)          
    32     1.02244531E+03   # MmuL(Q)         
    33     1.01764734E+03   # MtauL(Q)        
    34     9.39256836E+02   # MeR(Q)          
    35     9.39256836E+02   # MmuR(Q)         
    36     9.30188721E+02   # MtauR(Q)        
    41     1.68658667E+03   # MqL1(Q)         
    42     1.68658667E+03   # MqL2(Q)         
    43     1.52342773E+03   # MqL3(Q)         
    44     1.63900659E+03   # MuR(Q)          
    45     1.63900659E+03   # McR(Q)          
    46     1.26835168E+03   # MtR(Q)          
    47     1.63410059E+03   # MdR(Q)          
    48     1.63410059E+03   # MsR(Q)          
    49     1.63356323E+03   # MbR(Q)          
Block AU Q=  1.39005103E+03   #
  1  1    -1.26109937E+03   # A_u
  2  2    -1.26109937E+03   # A_c
  3  3    -1.26109937E+03   # A_t
Block AD Q=  1.39005103E+03   #
  1  1    -1.84312000E+03   # A_d
  2  2    -1.84312000E+03   # A_s
  3  3    -1.84312000E+03   # A_b
Block AE Q=  1.39005103E+03   #
  1  1    -4.36814056E+02   # A_e
  2  2    -4.36814056E+02   # A_mu
  3  3    -4.36814056E+02   # A_tau
#  ISAJET decay tables in SUSY Les Houches accord format
#  Created by ISALHD. Last revision: C. Balazs, 2005 May 25
Block DCINFO                           # Program information
     1   ISASUGRA from ISAJET          # Spectrum Calculator
     2   7.80   29-OCT-2009 12:50:36   # Version number
#         PDG         Width
DECAY         6  1.14680779E+00   # TP    decays
#          BR          NDA       ID1       ID2       ID3       ID4
      3.33333343E-01    3            2        -1         5             # TP     -->  UP     DB     BT          
      3.33333343E-01    3            4        -3         5             # TP     -->  CH     SB     BT          
      1.11111112E-01    3          -11        12         5             # TP     -->  E+     NUE    BT          
      1.11111112E-01    3          -13        14         5             # TP     -->  MU+    NUM    BT          
      1.11111112E-01    3          -15        16         5             # TP     -->  TAU+   NUT    BT          
#         PDG         Width
DECAY   1000021  5.75896645E+00   # GLSS  decays
#          BR          NDA       ID1       ID2       ID3       ID4
      3.37389717E-03    3      1000024         1        -2             # GLSS   -->  W1SS+  DN     UB          
      3.37389717E-03    3     -1000024         2        -1             # GLSS   -->  W1SS-  UP     DB          
      3.37389065E-03    3      1000024         3        -4             # GLSS   -->  W1SS+  ST     CB          
      3.37389065E-03    3     -1000024         4        -3             # GLSS   -->  W1SS-  CH     SB          
      2.76545947E-03    3      1000024         5        -6             # GLSS   -->  W1SS+  BT     TB          
      2.76545947E-03    3     -1000024         6        -5             # GLSS   -->  W1SS-  TP     BB          
      7.44524659E-05    3      1000037         1        -2             # GLSS   -->  W2SS+  DN     UB          
      7.44524659E-05    3     -1000037         2        -1             # GLSS   -->  W2SS-  UP     DB          
      7.44523204E-05    3      1000037         3        -4             # GLSS   -->  W2SS+  ST     CB          
      7.44523204E-05    3     -1000037         4        -3             # GLSS   -->  W2SS-  CH     SB          
      3.84785468E-04    3      1000037         5        -6             # GLSS   -->  W2SS+  BT     TB          
      3.84785468E-04    3     -1000037         6        -5             # GLSS   -->  W2SS-  TP     BB          
      1.24540435E-07    2      1000022        21                       # GLSS   -->  Z1SS   GL                 
      2.02283752E-03    3      1000022         2        -2             # GLSS   -->  Z1SS   UP     UB          
      6.03169377E-04    3      1000022         1        -1             # GLSS   -->  Z1SS   DN     DB          
      6.03169377E-04    3      1000022         3        -3             # GLSS   -->  Z1SS   ST     SB          
      2.02282658E-03    3      1000022         4        -4             # GLSS   -->  Z1SS   CH     CB          
      1.96099078E-04    3      1000022         6        -6             # GLSS   -->  Z1SS   TP     TB          
      6.89241415E-06    2      1000023        21                       # GLSS   -->  Z2SS   GL                 
      1.71415857E-03    3      1000023         2        -2             # GLSS   -->  Z2SS   UP     UB          
      1.66586088E-03    3      1000023         1        -1             # GLSS   -->  Z2SS   DN     DB          
      1.66586088E-03    3      1000023         3        -3             # GLSS   -->  Z2SS   ST     SB          
      1.71415147E-03    3      1000023         4        -4             # GLSS   -->  Z2SS   CH     CB          
      2.79571302E-03    3      1000023         6        -6             # GLSS   -->  Z2SS   TP     TB          
      6.32950250E-05    2      1000025        21                       # GLSS   -->  Z3SS   GL                 
      6.56864984E-07    3      1000025         2        -2             # GLSS   -->  Z3SS   UP     UB          
      7.30757449E-07    3      1000025         1        -1             # GLSS   -->  Z3SS   DN     DB          
      7.30757449E-07    3      1000025         3        -3             # GLSS   -->  Z3SS   ST     SB          
      6.56860266E-07    3      1000025         4        -4             # GLSS   -->  Z3SS   CH     CB          
      1.99535233E-03    3      1000025         6        -6             # GLSS   -->  Z3SS   TP     TB          
      5.37638880E-05    2      1000035        21                       # GLSS   -->  Z4SS   GL                 
      3.57352546E-05    3      1000035         2        -2             # GLSS   -->  Z4SS   UP     UB          
      4.08248270E-05    3      1000035         1        -1             # GLSS   -->  Z4SS   DN     DB          
      4.08248270E-05    3      1000035         3        -3             # GLSS   -->  Z4SS   ST     SB          
      3.57350800E-05    3      1000035         4        -4             # GLSS   -->  Z4SS   CH     CB          
      3.50701832E-03    3      1000035         6        -6             # GLSS   -->  Z4SS   TP     TB          
      5.68288006E-02    2     -1000005         5                       # GLSS   -->  BB1    BT                 
      5.68288006E-02    2      1000005        -5                       # GLSS   -->  BT1    BB                 
      3.11112235E-04    2     -2000005         5                       # GLSS   -->  BB2    BT                 
      3.11112235E-04    2      2000005        -5                       # GLSS   -->  BT2    BB                 
      4.22420025E-01    2     -1000006         6                       # GLSS   -->  TB1    TP                 
      4.22420025E-01    2      1000006        -6                       # GLSS   -->  TP1    TB                 
#         PDG         Width
DECAY   1000002  1.79782124E+01   # UPL   decays
#          BR          NDA       ID1       ID2       ID3       ID4
      1.18445735E-02    2      1000022         2                       # UPL    -->  Z1SS   UP                 
      3.13001931E-01    2      1000023         2                       # UPL    -->  Z2SS   UP                 
      1.89502563E-04    2      1000025         2                       # UPL    -->  Z3SS   UP                 
      8.72150250E-03    2      1000035         2                       # UPL    -->  Z4SS   UP                 
      2.32852567E-02    2      1000021         2                       # UPL    -->  GLSS   UP                 
      6.29002035E-01    2      1000024         1                       # UPL    -->  W1SS+  DN                 
      1.39551600E-02    2      1000037         1                       # UPL    -->  W2SS+  DN                 
#         PDG         Width
DECAY   1000001  1.79368458E+01   # DNL   decays
#          BR          NDA       ID1       ID2       ID3       ID4
      1.41960727E-02    2      1000022         1                       # DNL    -->  Z1SS   DN                 
      3.09346497E-01    2      1000023         1                       # DNL    -->  Z2SS   DN                 
      3.19867395E-04    2      1000025         1                       # DNL    -->  Z3SS   DN                 
      1.07223708E-02    2      1000035         1                       # DNL    -->  Z4SS   DN                 
      2.48272978E-02    2      1000021         1                       # DNL    -->  GLSS   DN                 
      6.14668906E-01    2     -1000024         2                       # DNL    -->  W1SS-  UP                 
      2.59189736E-02    2     -1000037         2                       # DNL    -->  W2SS-  UP                 
#         PDG         Width
DECAY   1000003  1.79368267E+01   # STL   decays
#          BR          NDA       ID1       ID2       ID3       ID4
      1.41960876E-02    2      1000022         3                       # STL    -->  Z1SS   ST                 
      3.09346825E-01    2      1000023         3                       # STL    -->  Z2SS   ST                 
      3.19867744E-04    2      1000025         3                       # STL    -->  Z3SS   ST                 
      1.07223829E-02    2      1000035         3                       # STL    -->  Z4SS   ST                 
      2.48273239E-02    2      1000021         3                       # STL    -->  GLSS   ST                 
      6.14668608E-01    2     -1000024         4                       # STL    -->  W1SS-  CH                 
      2.59189457E-02    2     -1000037         4                       # STL    -->  W2SS-  CH                 
#         PDG         Width
DECAY   1000004  1.79781017E+01   # CHL   decays
#          BR          NDA       ID1       ID2       ID3       ID4
      1.18446341E-02    2      1000022         4                       # CHL    -->  Z1SS   CH                 
      3.13003570E-01    2      1000023         4                       # CHL    -->  Z2SS   CH                 
      1.89503437E-04    2      1000025         4                       # CHL    -->  Z3SS   CH                 
      8.72154441E-03    2      1000035         4                       # CHL    -->  Z4SS   CH                 
      2.32792385E-02    2      1000021         4                       # CHL    -->  GLSS   CH                 
      6.29006267E-01    2      1000024         3                       # CHL    -->  W1SS+  ST                 
      1.39552541E-02    2      1000037         3                       # CHL    -->  W2SS+  ST                 
#         PDG         Width
DECAY   1000005  2.93350983E+01   # BT1   decays
#          BR          NDA       ID1       ID2       ID3       ID4
      8.14156793E-03    2      1000022         5                       # BT1    -->  Z1SS   BT                 
      1.60697669E-01    2      1000023         5                       # BT1    -->  Z2SS   BT                 
      4.51667234E-03    2      1000025         5                       # BT1    -->  Z3SS   BT                 
      8.45003873E-03    2      1000035         5                       # BT1    -->  Z4SS   BT                 
      3.11035126E-01    2     -1000024         6                       # BT1    -->  W1SS-  TP                 
      3.51273715E-01    2     -1000037         6                       # BT1    -->  W2SS-  TP                 
      1.55885234E-01    2          -24   1000006                       # BT1    -->  W-     TP1                
#         PDG         Width
DECAY   1000006  1.30268936E+01   # TP1   decays
#          BR          NDA       ID1       ID2       ID3       ID4
      1.86351389E-01    2      1000022         6                       # TP1    -->  Z1SS   TP                 
      4.70657796E-02    2      1000023         6                       # TP1    -->  Z2SS   TP                 
      2.08662435E-01    2      1000025         6                       # TP1    -->  Z3SS   TP                 
      1.26747042E-01    2      1000035         6                       # TP1    -->  Z4SS   TP                 
      1.02792218E-01    2      1000024         5                       # TP1    -->  W1SS+  BT                 
      3.28381121E-01    2      1000037         5                       # TP1    -->  W2SS+  BT                 
#         PDG         Width
DECAY   2000002  3.63866997E+00   # UPR   decays
#          BR          NDA       ID1       ID2       ID3       ID4
      9.93989944E-01    2      1000022         2                       # UPR    -->  Z1SS   UP                 
      3.60526727E-04    2      1000023         2                       # UPR    -->  Z2SS   UP                 
      3.07816750E-04    2      1000025         2                       # UPR    -->  Z3SS   UP                 
      1.81705074E-03    2      1000035         2                       # UPR    -->  Z4SS   UP                 
      3.52471974E-03    2      1000021         2                       # UPR    -->  GLSS   UP                 
#         PDG         Width
DECAY   2000001  9.07716811E-01   # DNR   decays
#          BR          NDA       ID1       ID2       ID3       ID4
      9.93224740E-01    2      1000022         1                       # DNR    -->  Z1SS   DN                 
      3.59869708E-04    2      1000023         1                       # DNR    -->  Z2SS   DN                 
      3.06569971E-04    2      1000025         1                       # DNR    -->  Z3SS   DN                 
      1.80942903E-03    2      1000035         1                       # DNR    -->  Z4SS   DN                 
      4.29937337E-03    2      1000021         1                       # DNR    -->  GLSS   DN                 
#         PDG         Width
DECAY   2000003  9.07716811E-01   # STR   decays
#          BR          NDA       ID1       ID2       ID3       ID4
      9.93224740E-01    2      1000022         3                       # STR    -->  Z1SS   ST                 
      3.59869708E-04    2      1000023         3                       # STR    -->  Z2SS   ST                 
      3.06569971E-04    2      1000025         3                       # STR    -->  Z3SS   ST                 
      1.80942903E-03    2      1000035         3                       # STR    -->  Z4SS   ST                 
      4.29937337E-03    2      1000021         3                       # STR    -->  GLSS   ST                 
#         PDG         Width
DECAY   2000004  3.63854361E+00   # CHR   decays
#          BR          NDA       ID1       ID2       ID3       ID4
      9.94023323E-01    2      1000022         4                       # CHR    -->  Z1SS   CH                 
      3.60538805E-04    2      1000023         4                       # CHR    -->  Z2SS   CH                 
      3.07826936E-04    2      1000025         4                       # CHR    -->  Z3SS   CH                 
      1.81711116E-03    2      1000035         4                       # CHR    -->  Z4SS   CH                 
      3.49121122E-03    2      1000021         4                       # CHR    -->  GLSS   CH                 
#         PDG         Width
DECAY   2000005  1.72786319E+00   # BT2   decays
#          BR          NDA       ID1       ID2       ID3       ID4
      5.10665774E-01    2      1000022         5                       # BT2    -->  Z1SS   BT                 
      2.08259420E-03    2      1000023         5                       # BT2    -->  Z2SS   BT                 
      9.42029580E-02    2      1000025         5                       # BT2    -->  Z3SS   BT                 
      1.00727253E-01    2      1000035         5                       # BT2    -->  Z4SS   BT                 
      4.44056466E-03    2     -1000024         6                       # BT2    -->  W1SS-  TP                 
      2.50734568E-01    2     -1000037         6                       # BT2    -->  W2SS-  TP                 
      3.53389196E-02    2          -24   1000006                       # BT2    -->  W-     TP1                
      2.71806290E-04    2          -24   2000006                       # BT2    -->  W-     TP2                
      1.53547770E-03    2           23   1000005                       # BT2    -->  Z0     BT1                
#         PDG         Width
DECAY   2000006  3.08276405E+01   # TP2   decays
#          BR          NDA       ID1       ID2       ID3       ID4
      2.70833850E-01    2      1000024         5                       # TP2    -->  W1SS+  BT                 
      5.30702844E-02    2      1000037         5                       # TP2    -->  W2SS+  BT                 
      8.78173336E-02    2           23   1000006                       # TP2    -->  Z0     TP1                
      9.30558667E-02    2           25   1000006                       # TP2    -->  HL0    TP1                
      9.16706957E-03    2      1000022         6                       # TP2    -->  Z1SS   TP                 
      1.32239133E-01    2      1000023         6                       # TP2    -->  Z2SS   TP                 
      1.55831605E-01    2      1000025         6                       # TP2    -->  Z3SS   TP                 
      1.97984815E-01    2      1000035         6                       # TP2    -->  Z4SS   TP                 
#         PDG         Width
DECAY   1000011  6.46639729E+00   # EL-   decays
#          BR          NDA       ID1       ID2       ID3       ID4
      1.59963906E-01    2      1000022        11                       # EL-    -->  Z1SS   E-                 
      2.85591066E-01    2      1000023        11                       # EL-    -->  Z2SS   E-                 
      1.87722871E-05    2      1000025        11                       # EL-    -->  Z3SS   E-                 
      1.20068574E-03    2      1000035        11                       # EL-    -->  Z4SS   E-                 
      5.48782051E-01    2     -1000024        12                       # EL-    -->  W1SS-  NUE                
      4.44351044E-03    2     -1000037        12                       # EL-    -->  W2SS-  NUE                
#         PDG         Width
DECAY   1000013  6.46639729E+00   # MUL-  decays
#          BR          NDA       ID1       ID2       ID3       ID4
      1.59963906E-01    2      1000022        13                       # MUL-   -->  Z1SS   MU-                
      2.85591066E-01    2      1000023        13                       # MUL-   -->  Z2SS   MU-                
      1.87722835E-05    2      1000025        13                       # MUL-   -->  Z3SS   MU-                
      1.20068539E-03    2      1000035        13                       # MUL-   -->  Z4SS   MU-                
      5.48782051E-01    2     -1000024        14                       # MUL-   -->  W1SS-  NUM                
      4.44351044E-03    2     -1000037        14                       # MUL-   -->  W2SS-  NUM                
#         PDG         Width
DECAY   1000015  3.73787427E+00   # TAU1- decays
#          BR          NDA       ID1       ID2       ID3       ID4
      9.81704593E-01    2      1000022        15                       # TAU1-  -->  Z1SS   TAU-               
      6.08648732E-03    2      1000023        15                       # TAU1-  -->  Z2SS   TAU-               
      2.82674766E-04    2      1000025        15                       # TAU1-  -->  Z3SS   TAU-               
      1.42765755E-04    2      1000035        15                       # TAU1-  -->  Z4SS   TAU-               
      1.15545010E-02    2     -1000024        16                       # TAU1-  -->  W1SS-  NUT                
      2.28951045E-04    2     -1000037        16                       # TAU1-  -->  W2SS-  NUT                
#         PDG         Width
DECAY   1000012  6.45932007E+00   # NUEL  decays
#          BR          NDA       ID1       ID2       ID3       ID4
      1.68906972E-01    2      1000022        12                       # NUEL   -->  Z1SS   NUE                
      2.69358724E-01    2      1000023        12                       # NUEL   -->  Z2SS   NUE                
      9.14139237E-05    2      1000025        12                       # NUEL   -->  Z3SS   NUE                
      2.08980101E-03    2      1000035        12                       # NUEL   -->  Z4SS   NUE                
      5.57278216E-01    2      1000024        11                       # NUEL   -->  W1SS+  E-                 
      2.27488438E-03    2      1000037        11                       # NUEL   -->  W2SS+  E-                 
#         PDG         Width
DECAY   1000014  6.45932007E+00   # NUML  decays
#          BR          NDA       ID1       ID2       ID3       ID4
      1.68906972E-01    2      1000022        14                       # NUML   -->  Z1SS   NUM                
      2.69358724E-01    2      1000023        14                       # NUML   -->  Z2SS   NUM                
      9.14139237E-05    2      1000025        14                       # NUML   -->  Z3SS   NUM                
      2.08980101E-03    2      1000035        14                       # NUML   -->  Z4SS   NUM                
      5.57278216E-01    2      1000024        13                       # NUML   -->  W1SS+  MU-                
      2.27488345E-03    2      1000037        13                       # NUML   -->  W2SS+  MU-                
#         PDG         Width
DECAY   1000016  6.38826609E+00   # NUTL  decays
#          BR          NDA       ID1       ID2       ID3       ID4
      1.69622049E-01    2      1000022        16                       # NUTL   -->  Z1SS   NUT                
      2.68339336E-01    2      1000023        16                       # NUTL   -->  Z2SS   NUT                
      8.69748910E-05    2      1000025        16                       # NUTL   -->  Z3SS   NUT                
      1.97452283E-03    2      1000035        16                       # NUTL   -->  Z4SS   NUT                
      5.55827737E-01    2      1000024        15                       # NUTL   -->  W1SS+  TAU-               
      3.91519489E-03    2      1000037        15                       # NUTL   -->  W2SS+  TAU-               
      2.34156585E-04    2           24   1000015                       # NUTL   -->  W+     TAU1-              
#         PDG         Width
DECAY   2000011  3.74614501E+00   # ER-   decays
#          BR          NDA       ID1       ID2       ID3       ID4
      9.99754548E-01    2      1000022        11                       # ER-    -->  Z1SS   E-                 
      1.97097252E-04    2      1000023        11                       # ER-    -->  Z2SS   E-                 
      1.01087189E-05    2      1000025        11                       # ER-    -->  Z3SS   E-                 
      3.82256330E-05    2      1000035        11                       # ER-    -->  Z4SS   E-                 
#         PDG         Width
DECAY   2000013  3.74614501E+00   # MUR-  decays
#          BR          NDA       ID1       ID2       ID3       ID4
      9.99754548E-01    2      1000022        13                       # MUR-   -->  Z1SS   MU-                
      1.97097252E-04    2      1000023        13                       # MUR-   -->  Z2SS   MU-                
      1.01087007E-05    2      1000025        13                       # MUR-   -->  Z3SS   MU-                
      3.82255348E-05    2      1000035        13                       # MUR-   -->  Z4SS   MU-                
#         PDG         Width
DECAY   2000015  6.35908127E+00   # TAU2- decays
#          BR          NDA       ID1       ID2       ID3       ID4
      1.65337279E-01    2      1000022        15                       # TAU2-  -->  Z1SS   TAU-               
      2.83105880E-01    2      1000023        15                       # TAU2-  -->  Z2SS   TAU-               
      1.23552745E-03    2      1000025        15                       # TAU2-  -->  Z3SS   TAU-               
      2.36362359E-03    2      1000035        15                       # TAU2-  -->  Z4SS   TAU-               
      5.43154061E-01    2     -1000024        16                       # TAU2-  -->  W1SS-  NUT                
      4.79063299E-03    2     -1000037        16                       # TAU2-  -->  W2SS-  NUT                
      1.29479495E-05    2           23   1000015                       # TAU2-  -->  Z0     TAU1-              
#         PDG         Width
DECAY   1000023  2.30773427E-02   # Z2SS  decays
#          BR          NDA       ID1       ID2       ID3       ID4
      1.44908461E-06    2      1000022        22                       # Z2SS   -->  Z1SS   GM                 
      5.73944598E-02    2      1000022        23                       # Z2SS   -->  Z1SS   Z0                 
      3.04527407E-06    3      1000022         2        -2             # Z2SS   -->  Z1SS   UP     UB          
      3.54833628E-06    3      1000022         1        -1             # Z2SS   -->  Z1SS   DN     DB          
      3.54833628E-06    3      1000022         3        -3             # Z2SS   -->  Z1SS   ST     SB          
      3.04526975E-06    3      1000022         4        -4             # Z2SS   -->  Z1SS   CH     CB          
      6.30842715E-06    3      1000022         5        -5             # Z2SS   -->  Z1SS   BT     BB          
      1.19040807E-04    3      1000022        11       -11             # Z2SS   -->  Z1SS   E-     E+          
      1.19040807E-04    3      1000022        13       -13             # Z2SS   -->  Z1SS   MU-    MU+         
      1.25269493E-04    3      1000022        15       -15             # Z2SS   -->  Z1SS   TAU-   TAU+        
      1.22614816E-04    3      1000022        12       -12             # Z2SS   -->  Z1SS   NUE    ANUE        
      1.22614816E-04    3      1000022        14       -14             # Z2SS   -->  Z1SS   NUM    ANUM        
      1.25638064E-04    3      1000022        16       -16             # Z2SS   -->  Z1SS   NUT    ANUT        
      9.41850364E-01    2      1000022        25                       # Z2SS   -->  Z1SS   HL0                
#         PDG         Width
DECAY   1000025  4.53605223E+00   # Z3SS  decays
#          BR          NDA       ID1       ID2       ID3       ID4
      1.15786145E-08    2      1000022        22                       # Z3SS   -->  Z1SS   GM                 
      2.41234460E-07    2      1000023        22                       # Z3SS   -->  Z2SS   GM                 
      2.93909371E-01    2      1000024       -24                       # Z3SS   -->  W1SS+  W-                 
      2.93909371E-01    2     -1000024        24                       # Z3SS   -->  W1SS-  W+                 
      1.12610362E-01    2      1000022        23                       # Z3SS   -->  Z1SS   Z0                 
      2.76028335E-01    2      1000023        23                       # Z3SS   -->  Z2SS   Z0                 
      1.06261833E-09    3      1000022         2        -2             # Z3SS   -->  Z1SS   UP     UB          
      3.24458294E-10    3      1000022         1        -1             # Z3SS   -->  Z1SS   DN     DB          
      3.24458294E-10    3      1000022         3        -3             # Z3SS   -->  Z1SS   ST     SB          
      1.06261688E-09    3      1000022         4        -4             # Z3SS   -->  Z1SS   CH     CB          
      4.98135194E-07    3      1000022         5        -5             # Z3SS   -->  Z1SS   BT     BB          
      7.25054363E-08    3      1000022        11       -11             # Z3SS   -->  Z1SS   E-     E+          
      7.25054363E-08    3      1000022        13       -13             # Z3SS   -->  Z1SS   MU-    MU+         
      6.07694074E-06    3      1000022        15       -15             # Z3SS   -->  Z1SS   TAU-   TAU+        
      2.55473882E-08    3      1000022        12       -12             # Z3SS   -->  Z1SS   NUE    ANUE        
      2.55473882E-08    3      1000022        14       -14             # Z3SS   -->  Z1SS   NUM    ANUM        
      2.65590021E-08    3      1000022        16       -16             # Z3SS   -->  Z1SS   NUT    ANUT        
      2.56731275E-10    3      1000023         2        -2             # Z3SS   -->  Z2SS   UP     UB          
      4.22359675E-10    3      1000023         1        -1             # Z3SS   -->  Z2SS   DN     DB          
      4.22359675E-10    3      1000023         3        -3             # Z3SS   -->  Z2SS   ST     SB          
      2.56730803E-10    3      1000023         4        -4             # Z3SS   -->  Z2SS   CH     CB          
      1.23446000E-07    3      1000023         5        -5             # Z3SS   -->  Z2SS   BT     BB          
      1.33614331E-09    3      1000023        11       -11             # Z3SS   -->  Z2SS   E-     E+          
      1.33614331E-09    3      1000023        13       -13             # Z3SS   -->  Z2SS   MU-    MU+         
      2.01795800E-07    3      1000023        15       -15             # Z3SS   -->  Z2SS   TAU-   TAU+        
      6.77632794E-09    3      1000023        12       -12             # Z3SS   -->  Z2SS   NUE    ANUE        
      6.77632794E-09    3      1000023        14       -14             # Z3SS   -->  Z2SS   NUM    ANUM        
      7.10829040E-09    3      1000023        16       -16             # Z3SS   -->  Z2SS   NUT    ANUT        
      1.70309655E-02    2      1000022        25                       # Z3SS   -->  Z1SS   HL0                
      6.50422554E-03    2      1000023        25                       # Z3SS   -->  Z2SS   HL0                
#         PDG         Width
DECAY   1000035  4.80072403E+00   # Z4SS  decays
#          BR          NDA       ID1       ID2       ID3       ID4
      1.26917541E-07    2      1000022        22                       # Z4SS   -->  Z1SS   GM                 
      5.45749224E-09    2      1000023        22                       # Z4SS   -->  Z2SS   GM                 
      2.48452509E-10    2      1000025        22                       # Z4SS   -->  Z3SS   GM                 
      2.99223840E-01    2      1000024       -24                       # Z4SS   -->  W1SS+  W-                 
      2.99223840E-01    2     -1000024        24                       # Z4SS   -->  W1SS-  W+                 
      1.69287845E-02    2      1000022        23                       # Z4SS   -->  Z1SS   Z0                 
      8.18443764E-03    2      1000023        23                       # Z4SS   -->  Z2SS   Z0                 
      2.79369914E-08    3      1000022         2        -2             # Z4SS   -->  Z1SS   UP     UB          
      2.22674910E-08    3      1000022         1        -1             # Z4SS   -->  Z1SS   DN     DB          
      2.22674910E-08    3      1000022         3        -3             # Z4SS   -->  Z1SS   ST     SB          
      2.79369488E-08    3      1000022         4        -4             # Z4SS   -->  Z1SS   CH     CB          
      4.83482268E-07    3      1000022         5        -5             # Z4SS   -->  Z1SS   BT     BB          
      1.52490281E-06    3      1000022        11       -11             # Z4SS   -->  Z1SS   E-     E+          
      1.52490281E-06    3      1000022        13       -13             # Z4SS   -->  Z1SS   MU-    MU+         
      7.46308888E-06    3      1000022        15       -15             # Z4SS   -->  Z1SS   TAU-   TAU+        
      1.45133254E-06    3      1000022        12       -12             # Z4SS   -->  Z1SS   NUE    ANUE        
      1.45133254E-06    3      1000022        14       -14             # Z4SS   -->  Z1SS   NUM    ANUM        
      1.50440781E-06    3      1000022        16       -16             # Z4SS   -->  Z1SS   NUT    ANUT        
      3.98020958E-08    3      1000023         2        -2             # Z4SS   -->  Z2SS   UP     UB          
      4.76952060E-08    3      1000023         1        -1             # Z4SS   -->  Z2SS   DN     DB          
      4.76952060E-08    3      1000023         3        -3             # Z4SS   -->  Z2SS   ST     SB          
      3.98020283E-08    3      1000023         4        -4             # Z4SS   -->  Z2SS   CH     CB          
      2.00295489E-07    3      1000023         5        -5             # Z4SS   -->  Z2SS   BT     BB          
      3.13533661E-07    3      1000023        11       -11             # Z4SS   -->  Z2SS   E-     E+          
      3.13533661E-07    3      1000023        13       -13             # Z4SS   -->  Z2SS   MU-    MU+         
      4.78873346E-07    3      1000023        15       -15             # Z4SS   -->  Z2SS   TAU-   TAU+        
      5.71722353E-07    3      1000023        12       -12             # Z4SS   -->  Z2SS   NUE    ANUE        
      5.71722353E-07    3      1000023        14       -14             # Z4SS   -->  Z2SS   NUM    ANUM        
      5.98314443E-07    3      1000023        16       -16             # Z4SS   -->  Z2SS   NUT    ANUT        
      8.16416446E-09    3      1000025         2        -2             # Z4SS   -->  Z3SS   UP     UB          
      1.05286908E-08    3      1000025         1        -1             # Z4SS   -->  Z3SS   DN     DB          
      1.05286908E-08    3      1000025         3        -3             # Z4SS   -->  Z3SS   ST     SB          
      8.16416446E-09    3      1000025         4        -4             # Z4SS   -->  Z3SS   CH     CB          
      1.21034827E-09    3      1000025         5        -5             # Z4SS   -->  Z3SS   BT     BB          
      2.38920284E-09    3      1000025        11       -11             # Z4SS   -->  Z3SS   E-     E+          
      2.38920284E-09    3      1000025        13       -13             # Z4SS   -->  Z3SS   MU-    MU+         
      1.88047222E-09    3      1000025        15       -15             # Z4SS   -->  Z3SS   TAU-   TAU+        
      4.74943063E-09    3      1000025        12       -12             # Z4SS   -->  Z3SS   NUE    ANUE        
      4.74943063E-09    3      1000025        14       -14             # Z4SS   -->  Z3SS   NUM    ANUM        
      4.74932849E-09    3      1000025        16       -16             # Z4SS   -->  Z3SS   NUT    ANUT        
      1.05260022E-01    2      1000022        25                       # Z4SS   -->  Z1SS   HL0                
      2.71160215E-01    2      1000023        25                       # Z4SS   -->  Z2SS   HL0                
#         PDG         Width
DECAY   1000024  2.07950734E-02   # W1SS+ decays
#          BR          NDA       ID1       ID2       ID3       ID4
      7.39468214E-06    3      1000022         2        -1             # W1SS+  -->  Z1SS   UP     DB          
      7.39467805E-06    3      1000022         4        -3             # W1SS+  -->  Z1SS   CH     SB          
      2.72017496E-04    3      1000022       -11        12             # W1SS+  -->  Z1SS   E+     NUE         
      2.72017496E-04    3      1000022       -13        14             # W1SS+  -->  Z1SS   MU+    NUM         
      2.82522058E-04    3      1000022       -15        16             # W1SS+  -->  Z1SS   TAU+   NUT         
      9.99158680E-01    2      1000022        24                       # W1SS+  -->  Z1SS   W+                 
      1.55622286E-11    3      1000023       -11        12             # W1SS+  -->  Z2SS   E+     NUE         
      1.55622286E-11    3      1000023       -13        14             # W1SS+  -->  Z2SS   MU+    NUM         
#         PDG         Width
DECAY   1000037  4.76660633E+00   # W2SS+ decays
#          BR          NDA       ID1       ID2       ID3       ID4
      3.72075384E-08    3      1000022         2        -1             # W2SS+  -->  Z1SS   UP     DB          
      3.72075100E-08    3      1000022         4        -3             # W2SS+  -->  Z1SS   CH     SB          
      2.12374994E-06    3      1000022       -11        12             # W2SS+  -->  Z1SS   E+     NUE         
      2.12374994E-06    3      1000022       -13        14             # W2SS+  -->  Z1SS   MU+    NUM         
      8.16304237E-06    3      1000022       -15        16             # W2SS+  -->  Z1SS   TAU+   NUT         
      1.11565299E-01    2      1000022        24                       # W2SS+  -->  Z1SS   W+                 
      3.31239782E-08    3      1000023         2        -1             # W2SS+  -->  Z2SS   UP     DB          
      3.31239605E-08    3      1000023         4        -3             # W2SS+  -->  Z2SS   CH     SB          
      3.70883896E-07    3      1000023       -11        12             # W2SS+  -->  Z2SS   E+     NUE         
      3.70883896E-07    3      1000023       -13        14             # W2SS+  -->  Z2SS   MU+    NUM         
      5.69039798E-07    3      1000023       -15        16             # W2SS+  -->  Z2SS   TAU+   NUT         
      3.08947921E-01    2      1000023        24                       # W2SS+  -->  Z2SS   W+                 
      2.84351707E-08    3      1000025         2        -1             # W2SS+  -->  Z3SS   UP     DB          
      2.84351707E-08    3      1000025         4        -3             # W2SS+  -->  Z3SS   CH     SB          
      9.47754319E-09    3      1000025       -11        12             # W2SS+  -->  Z3SS   E+     NUE         
      9.47754319E-09    3      1000025       -13        14             # W2SS+  -->  Z3SS   MU+    NUM         
      9.49529699E-09    3      1000025       -15        16             # W2SS+  -->  Z3SS   TAU+   NUT         
      1.05702406E-25    3      1000035       -11        12             # W2SS+  -->  Z4SS   E+     NUE         
      2.94887245E-01    2      1000024        23                       # W2SS+  -->  W1SS+  Z0                 
      4.31155556E-08    3      1000024         1        -1             # W2SS+  -->  W1SS+  DN     DB          
      4.31154845E-08    3      1000024         3        -3             # W2SS+  -->  W1SS+  ST     SB          
      7.71749100E-08    3      1000024         2        -2             # W2SS+  -->  W1SS+  UP     UB          
      7.71749100E-08    3      1000024         4        -4             # W2SS+  -->  W1SS+  CH     CB          
      7.79127959E-07    3      1000024        12       -12             # W2SS+  -->  W1SS+  NUE    ANUE        
      7.79127959E-07    3      1000024        14       -14             # W2SS+  -->  W1SS+  NUM    ANUM        
      2.56211933E-06    3      1000024        16       -16             # W2SS+  -->  W1SS+  NUT    ANUT        
      4.50542501E-07    3      1000024        11       -11             # W2SS+  -->  W1SS+  E-     E+          
      4.50542501E-07    3      1000024        13       -13             # W2SS+  -->  W1SS+  MU-    MU+         
      4.72138197E-07    3      1000024        15       -15             # W2SS+  -->  W1SS+  TAU-   TAU+        
      2.84579784E-01    2      1000024        25                       # W2SS+  -->  W1SS+  HL0                
#         PDG         Width
DECAY        25  4.21458017E-03   # HL0   decays
#          BR          NDA       ID1       ID2       ID3       ID4
      4.79266227E-09    2           11       -11                       # HL0    -->  E-     E+                 
      2.02353869E-04    2           13       -13                       # HL0    -->  MU-    MU+                
      5.78764603E-02    2           15       -15                       # HL0    -->  TAU-   TAU+               
      6.01422562E-06    2            1        -1                       # HL0    -->  DN     DB                 
      2.43004854E-03    2            3        -3                       # HL0    -->  ST     SB                 
      7.95287013E-01    2            5        -5                       # HL0    -->  BT     BB                 
      1.88358774E-06    2            2        -2                       # HL0    -->  UP     UB                 
      3.53941731E-02    2            4        -4                       # HL0    -->  CH     CB                 
      1.85242470E-03    2           22        22                       # HL0    -->  GM     GM                 
      3.93020064E-02    2           21        21                       # HL0    -->  GL     GL                 
      3.48011404E-03    3           24        11       -12             # HL0    -->  W+     E-     ANUE        
      3.48011404E-03    3           24        13       -14             # HL0    -->  W+     MU-    ANUM        
      3.48011404E-03    3           24        15       -16             # HL0    -->  W+     TAU-   ANUT        
      1.04403431E-02    3           24        -2         1             # HL0    -->  W+     UB     DN          
      1.04403431E-02    3           24        -4         3             # HL0    -->  W+     CB     ST          
      3.48011404E-03    3          -24       -11        12             # HL0    -->  W-     E+     NUE         
      3.48011404E-03    3          -24       -13        14             # HL0    -->  W-     MU+    NUM         
      3.48011404E-03    3          -24       -15        16             # HL0    -->  W-     TAU+   NUT         
      1.04403431E-02    3          -24         2        -1             # HL0    -->  W-     UP     DB          
      1.04403431E-02    3          -24         4        -3             # HL0    -->  W-     CH     SB          
      3.42323037E-04    3           23        12       -12             # HL0    -->  Z0     NUE    ANUE        
      3.42323037E-04    3           23        14       -14             # HL0    -->  Z0     NUM    ANUM        
      3.42323037E-04    3           23        16       -16             # HL0    -->  Z0     NUT    ANUT        
      1.72287750E-04    3           23        11       -11             # HL0    -->  Z0     E-     E+          
      1.72287750E-04    3           23        13       -13             # HL0    -->  Z0     MU-    MU+         
      1.72287750E-04    3           23        15       -15             # HL0    -->  Z0     TAU-   TAU+        
      5.90243202E-04    3           23         2        -2             # HL0    -->  Z0     UP     UB          
      5.90243202E-04    3           23         4        -4             # HL0    -->  Z0     CH     CB          
      7.60378723E-04    3           23         1        -1             # HL0    -->  Z0     DN     DB          
      7.60378723E-04    3           23         3        -3             # HL0    -->  Z0     ST     SB          
      7.60378723E-04    3           23         5        -5             # HL0    -->  Z0     BT     BB          
#         PDG         Width
DECAY        35  3.04953671E+00   # HH0   decays
#          BR          NDA       ID1       ID2       ID3       ID4
      7.49367501E-09    2           11       -11                       # HH0    -->  E-     E+                 
      3.16396443E-04    2           13       -13                       # HH0    -->  MU-    MU+                
      9.06198472E-02    2           15       -15                       # HH0    -->  TAU-   TAU+               
      9.15838336E-06    2            1        -1                       # HH0    -->  DN     DB                 
      3.70045030E-03    2            3        -3                       # HH0    -->  ST     SB                 
      5.35691321E-01    2            5        -5                       # HH0    -->  BT     BB                 
      2.99381353E-10    2            2        -2                       # HH0    -->  UP     UB                 
      4.07651578E-06    2            4        -4                       # HH0    -->  CH     CB                 
      1.99045226E-01    2            6        -6                       # HH0    -->  TP     TB                 
      9.76818455E-07    2           22        22                       # HH0    -->  GM     GM                 
      8.67412673E-05    2           21        21                       # HH0    -->  GL     GL                 
      2.88576848E-04    2           24       -24                       # HH0    -->  W+     W-                 
      1.47219864E-04    2           23        23                       # HH0    -->  Z0     Z0                 
      2.44644261E-03    2      1000022   1000022                       # HH0    -->  Z1SS   Z1SS               
      1.38457986E-02    2      1000022   1000023                       # HH0    -->  Z1SS   Z2SS               
      1.15030020E-01    2      1000022   1000025                       # HH0    -->  Z1SS   Z3SS               
      1.47148967E-02    2      1000022   1000035                       # HH0    -->  Z1SS   Z4SS               
      7.65844807E-03    2      1000023   1000023                       # HH0    -->  Z2SS   Z2SS               
      1.57356635E-02    2      1000024  -1000024                       # HH0    -->  W1SS+  W1SS-              
      6.58728473E-04    2           25        25                       # HH0    -->  HL0    HL0                
#         PDG         Width
DECAY        36  3.43338013E+00   # HA0   decays
#          BR          NDA       ID1       ID2       ID3       ID4
      6.61324639E-09    2           11       -11                       # HA0    -->  E-     E+                 
      2.79223197E-04    2           13       -13                       # HA0    -->  MU-    MU+                
      7.99735188E-02    2           15       -15                       # HA0    -->  TAU-   TAU+               
      8.08278946E-06    2            1        -1                       # HA0    -->  DN     DB                 
      3.26585607E-03    2            3        -3                       # HA0    -->  ST     SB                 
      4.72789258E-01    2            5        -5                       # HA0    -->  BT     BB                 
      2.58623345E-10    2            2        -2                       # HA0    -->  UP     UB                 
      3.52422262E-06    2            4        -4                       # HA0    -->  CH     CB                 
      1.81853816E-01    2            6        -6                       # HA0    -->  TP     TB                 
      7.46026785E-07    2           22        22                       # HA0    -->  GM     GM                 
      1.21643156E-04    2           21        21                       # HA0    -->  GL     GL                 
      3.30548617E-03    2      1000022   1000022                       # HA0    -->  Z1SS   Z1SS               
      2.78183669E-02    2      1000022   1000023                       # HA0    -->  Z1SS   Z2SS               
      1.54798608E-02    2      1000022   1000025                       # HA0    -->  Z1SS   Z3SS               
      8.26653689E-02    2      1000022   1000035                       # HA0    -->  Z1SS   Z4SS               
      4.30083647E-02    2      1000023   1000023                       # HA0    -->  Z2SS   Z2SS               
      8.91762301E-02    2      1000024  -1000024                       # HA0    -->  W1SS+  W1SS-              
      2.50603596E-04    2           25        23                       # HA0    -->  HL0    Z0                 
#         PDG         Width
DECAY        37  2.78290510E+00   # H+    decays
#          BR          NDA       ID1       ID2       ID3       ID4
      8.23748536E-09    2           12       -11                       # H+     -->  NUE    E+                 
      3.47801513E-04    2           14       -13                       # H+     -->  NUM    MU+                
      9.96153429E-02    2           16       -15                       # H+     -->  NUT    TAU+               
      9.27595011E-06    2            2        -1                       # H+     -->  UP     DB                 
      3.75186582E-03    2            4        -3                       # H+     -->  CH     SB                 
      7.29307353E-01    2            6        -5                       # H+     -->  TP     BB                 
      4.88421693E-02    2      1000024   1000022                       # H+     -->  W1SS+  Z1SS               
      1.49541011E-05    2      1000024   1000023                       # H+     -->  W1SS+  Z2SS               
      1.17795892E-01    2      1000037   1000022                       # H+     -->  W2SS+  Z1SS               
      3.15246696E-04    2           25        24                       # H+     -->  HL0    W+                 
