#  ISAJET SUSY parameters in SUSY Les Houches Accord 2 format
#  Created by ISALHA 2.0 Last revision: C. Balazs 21 Apr 2009
Block SPINFO   # Program information
     1   ISASUGRA from ISAJET          # Spectrum Calculator
     2   7.80   29-OCT-2009 12:50:36   # Version number
Block MODSEL   # Model selection
     1     1   # Minimal supergravity (mSUGRA) model               
Block SMINPUTS   # Standard Model inputs
     1     1.27843353E+02   # alpha_em^(-1)
     2     1.16570000E-05   # G_Fermi
     3     1.17200002E-01   # alpha_s(M_Z)
     4     9.11699982E+01   # m_{Z}(pole)
     5     4.19999981E+00   # m_{b}(m_{b})
     6     1.72500000E+02   # m_{top}(pole)
     7     1.77699995E+00   # m_{tau}(pole)
Block MINPAR   # SUSY breaking input parameters
     1     2.60000000E+02   # m_0
     2     7.20000000E+02   # m_{1/2}
     3     1.00000000E+01   # tan(beta)
     4     1.00000000E+00   # sign(mu)
     5     0.00000000E+00   # A_0
Block EXTPAR   # Non-universal SUSY breaking parameters
     0     1.54729182E+16   # Input scale
Block MASS   # Scalar and gaugino mass spectrum
#  PDG code   mass                 particle
        24     8.04229965E+01   #  W^+
        25     1.16320679E+02   #  h^0            
        35     1.01465234E+03   #  H^0            
        36     1.00788043E+03   #  A^0            
        37     1.01976935E+03   #  H^+            
   1000001     1.49573315E+03   #  dnl            
   1000002     1.49345325E+03   #  upl            
   1000003     1.49573315E+03   #  stl            
   1000004     1.49345398E+03   #  chl            
   1000005     1.37833960E+03   #  b1             
   1000006     1.14641736E+03   #  t1             
   1000011     5.49828796E+02   #  el-            
   1000012     5.40893738E+02   #  nuel           
   1000013     5.49828796E+02   #  mul-           
   1000014     5.40893738E+02   #  numl           
   1000015     3.69131317E+02   #  tau1           
   1000016     5.35671753E+02   #  nutl           
   1000021     1.61634167E+03   #  glss           
   1000022     3.01619934E+02   #  z1ss           
   1000023     5.68988953E+02   #  z2ss           
   1000024     5.69901917E+02   #  w1ss           
   1000025    -8.62386230E+02   #  z3ss           
   1000035     8.74583801E+02   #  z4ss           
   1000037     8.74361572E+02   #  w2ss           
   2000001     1.43229065E+03   #  dnr            
   2000002     1.43874219E+03   #  upr            
   2000003     1.43229065E+03   #  str            
   2000004     1.43874292E+03   #  chr            
   2000005     1.42471484E+03   #  b2             
   2000006     1.41227722E+03   #  t2             
   2000011     3.73128510E+02   #  er-            
   2000013     3.73128571E+02   #  mur-           
   2000015     5.46937927E+02   #  tau2           
Block ALPHA   # Effective Higgs mixing parameter
         -1.01499081E-01   # alpha
Block STOPMIX   # stop mixing matrix
  1  1     3.20619702E-01   # O_{11}
  1  2     9.47207987E-01   # O_{12}
  2  1    -9.47207987E-01   # O_{21}
  2  2     3.20619702E-01   # O_{22}
Block SBOTMIX   # sbottom mixing matrix
  1  1     9.79847431E-01   # O_{11}
  1  2     1.99747398E-01   # O_{12}
  2  1    -1.99747398E-01   # O_{21}
  2  2     9.79847431E-01   # O_{22}
Block STAUMIX   # stau mixing matrix
  1  1     9.43974108E-02   # O_{11}
  1  2     9.95534599E-01   # O_{12}
  2  1    -9.95534599E-01   # O_{21}
  2  2     9.43974108E-02   # O_{22}
Block NMIX   # neutralino mixing matrix
  1  1     9.97877061E-01   #
  1  2    -8.65658186E-03   #
  1  3     5.93450516E-02   #
  1  4    -2.53895745E-02   #
  2  1    -2.11238712E-02   #
  2  2    -9.79607821E-01   #
  2  3     1.62653297E-01   #
  2  4    -1.16043858E-01   #
  3  1     2.36552358E-02   #
  3  2    -3.38168070E-02   #
  3  3    -7.05418646E-01   #
  3  4    -7.07588255E-01   #
  4  1    -5.68824522E-02   #
  4  2     1.97863534E-01   #
  4  3     6.87318146E-01   #
  4  4    -6.96568787E-01   #
Block UMIX   # chargino U mixing matrix
  1  1    -9.72875535E-01   # U_{11}
  1  2     2.31329262E-01   # U_{12}
  2  1    -2.31329262E-01   # U_{21}
  2  2    -9.72875535E-01   # U_{22}
Block VMIX   # chargino V mixing matrix
  1  1    -9.86101627E-01   # V_{11}
  1  2     1.66143358E-01   # V_{12}
  2  1    -1.66143358E-01   # V_{21}
  2  2    -9.86101627E-01   # V_{22}
Block GAUGE Q=  1.21955701E+03   #
     1     3.57491881E-01   # g`
     2     6.52501345E-01   # g_2
     3     1.22103310E+00   # g_3
Block YU Q=  1.21955701E+03   #
  3  3     8.49561572E-01   # y_t
Block YD Q=  1.21955701E+03   #
  3  3     1.29519403E-01   # y_b
Block YE Q=  1.21955701E+03   #
  3  3     1.02355726E-01   # y_tau
Block HMIX Q=  1.21955701E+03   # Higgs mixing parameters
     1     8.57050232E+02   # mu(Q)
     2     1.00000000E+01   # tan(beta)(M_GUT)
     3     2.51098145E+02   # Higgs vev at Q
     4     1.01582294E+06   # m_A^2(Q)
Block MSOFT Q=  1.21955701E+03   # DRbar SUSY breaking parameters
     1     3.07093170E+02   # M_1(Q)          
     2     5.64779114E+02   # M_2(Q)          
     3     1.54414331E+03   # M_3(Q)          
    31     5.42962097E+02   # MeL(Q)          
    32     5.42962097E+02   # MmuL(Q)         
    33     5.37869995E+02   # MtauL(Q)        
    34     3.70777374E+02   # MeR(Q)          
    35     3.70777374E+02   # MmuR(Q)         
    36     3.64928131E+02   # MtauR(Q)        
    41     1.41924011E+03   # MqL1(Q)         
    42     1.41924011E+03   # MqL2(Q)         
    43     1.31694849E+03   # MqL3(Q)         
    44     1.36603455E+03   # MuR(Q)          
    45     1.36603455E+03   # McR(Q)          
    46     1.12936780E+03   # MtR(Q)          
    47     1.35915796E+03   # MdR(Q)          
    48     1.35915796E+03   # MsR(Q)          
    49     1.36014746E+03   # MbR(Q)          
Block AU Q=  1.21955701E+03   #
  1  1    -1.22539587E+03   # A_u
  2  2    -1.22539587E+03   # A_c
  3  3    -1.22539587E+03   # A_t
Block AD Q=  1.21955701E+03   #
  1  1    -1.79175415E+03   # A_d
  2  2    -1.79175415E+03   # A_s
  3  3    -1.79175415E+03   # A_b
Block AE Q=  1.21955701E+03   #
  1  1    -4.21091461E+02   # A_e
  2  2    -4.21091461E+02   # A_mu
  3  3    -4.21091461E+02   # A_tau
#  ISAJET decay tables in SUSY Les Houches accord format
#  Created by ISALHD. Last revision: C. Balazs, 2005 May 25
Block DCINFO                           # Program information
     1   ISASUGRA from ISAJET          # Spectrum Calculator
     2   7.80   29-OCT-2009 12:50:36   # Version number
#         PDG         Width
DECAY         6  1.14680779E+00   # TP    decays
#          BR          NDA       ID1       ID2       ID3       ID4
      3.33333343E-01    3            2        -1         5             # TP     -->  UP     DB     BT          
      3.33333343E-01    3            4        -3         5             # TP     -->  CH     SB     BT          
      1.11111112E-01    3          -11        12         5             # TP     -->  E+     NUE    BT          
      1.11111112E-01    3          -13        14         5             # TP     -->  MU+    NUM    BT          
      1.11111112E-01    3          -15        16         5             # TP     -->  TAU+   NUT    BT          
#         PDG         Width
DECAY   1000021  2.16013947E+01   # GLSS  decays
#          BR          NDA       ID1       ID2       ID3       ID4
      1.75681300E-02    2     -1000002         2                       # GLSS   -->  UBL    UP                 
      1.75681300E-02    2      1000002        -2                       # GLSS   -->  UPL    UB                 
      1.69471093E-02    2     -1000001         1                       # GLSS   -->  DBL    DN                 
      1.69471093E-02    2      1000001        -1                       # GLSS   -->  DNL    DB                 
      3.54135409E-02    2     -2000002         2                       # GLSS   -->  UBR    UP                 
      3.54135409E-02    2      2000002        -2                       # GLSS   -->  UPR    UB                 
      3.78727131E-02    2     -2000001         1                       # GLSS   -->  DBR    DN                 
      3.78727131E-02    2      2000001        -1                       # GLSS   -->  DNR    DB                 
      1.69470888E-02    2     -1000003         3                       # GLSS   -->  SBL    ST                 
      1.69470888E-02    2      1000003        -3                       # GLSS   -->  STL    SB                 
      3.78726944E-02    2     -2000003         3                       # GLSS   -->  SBR    ST                 
      3.78726944E-02    2      2000003        -3                       # GLSS   -->  STR    SB                 
      1.75669510E-02    2     -1000004         4                       # GLSS   -->  CBL    CH                 
      1.75669510E-02    2      1000004        -4                       # GLSS   -->  CHL    CB                 
      3.54123525E-02    2     -2000004         4                       # GLSS   -->  CBR    CH                 
      3.54123525E-02    2      2000004        -4                       # GLSS   -->  CHR    CB                 
      6.05548359E-02    2     -1000005         5                       # GLSS   -->  BB1    BT                 
      6.05548359E-02    2      1000005        -5                       # GLSS   -->  BT1    BB                 
      4.12820354E-02    2     -2000005         5                       # GLSS   -->  BB2    BT                 
      4.12820354E-02    2      2000005        -5                       # GLSS   -->  BT2    BB                 
      1.43443257E-01    2     -1000006         6                       # GLSS   -->  TB1    TP                 
      1.43443257E-01    2      1000006        -6                       # GLSS   -->  TP1    TB                 
      3.91193144E-02    2     -2000006         6                       # GLSS   -->  TB2    TP                 
      3.91193144E-02    2      2000006        -6                       # GLSS   -->  TP2    TB                 
#         PDG         Width
DECAY   1000002  1.37909184E+01   # UPL   decays
#          BR          NDA       ID1       ID2       ID3       ID4
      1.27216550E-02    2      1000022         2                       # UPL    -->  Z1SS   UP                 
      3.22193742E-01    2      1000023         2                       # UPL    -->  Z2SS   UP                 
      1.76047470E-04    2      1000025         2                       # UPL    -->  Z3SS   UP                 
      6.91439491E-03    2      1000035         2                       # UPL    -->  Z4SS   UP                 
      6.47123754E-01    2      1000024         1                       # UPL    -->  W1SS+  DN                 
      1.08703971E-02    2      1000037         1                       # UPL    -->  W2SS+  DN                 
#         PDG         Width
DECAY   1000001  1.37206421E+01   # DNL   decays
#          BR          NDA       ID1       ID2       ID3       ID4
      1.54830208E-02    2      1000022         1                       # DNL    -->  Z1SS   DN                 
      3.19583625E-01    2      1000023         1                       # DNL    -->  Z2SS   DN                 
      2.97641265E-04    2      1000025         1                       # DNL    -->  Z3SS   DN                 
      8.62175040E-03    2      1000035         1                       # DNL    -->  Z4SS   DN                 
      6.34732485E-01    2     -1000024         2                       # DNL    -->  W1SS-  UP                 
      2.12814212E-02    2     -1000037         2                       # DNL    -->  W2SS-  UP                 
#         PDG         Width
DECAY   1000003  1.37206211E+01   # STL   decays
#          BR          NDA       ID1       ID2       ID3       ID4
      1.54830450E-02    2      1000022         3                       # STL    -->  Z1SS   ST                 
      3.19584101E-01    2      1000023         3                       # STL    -->  Z2SS   ST                 
      2.97641731E-04    2      1000025         3                       # STL    -->  Z3SS   ST                 
      8.62176344E-03    2      1000035         3                       # STL    -->  Z4SS   ST                 
      6.34732008E-01    2     -1000024         4                       # STL    -->  W1SS-  CH                 
      2.12813728E-02    2     -1000037         4                       # STL    -->  W2SS-  CH                 
#         PDG         Width
DECAY   1000004  1.37909212E+01   # CHL   decays
#          BR          NDA       ID1       ID2       ID3       ID4
      1.27216373E-02    2      1000022         4                       # CHL    -->  Z1SS   CH                 
      3.22193176E-01    2      1000023         4                       # CHL    -->  Z2SS   CH                 
      1.76047019E-04    2      1000025         4                       # CHL    -->  Z3SS   CH                 
      6.91437675E-03    2      1000035         4                       # CHL    -->  Z4SS   CH                 
      6.47124290E-01    2      1000024         3                       # CHL    -->  W1SS+  ST                 
      1.08704101E-02    2      1000037         3                       # CHL    -->  W2SS+  ST                 
#         PDG         Width
DECAY   1000005  2.16549625E+01   # BT1   decays
#          BR          NDA       ID1       ID2       ID3       ID4
      1.08039314E-02    2      1000022         5                       # BT1    -->  Z1SS   BT                 
      1.72150329E-01    2      1000023         5                       # BT1    -->  Z2SS   BT                 
      3.84375686E-03    2      1000025         5                       # BT1    -->  Z3SS   BT                 
      6.06259285E-03    2      1000035         5                       # BT1    -->  Z4SS   BT                 
      3.23204398E-01    2     -1000024         6                       # BT1    -->  W1SS-  TP                 
      2.96570122E-01    2     -1000037         6                       # BT1    -->  W2SS-  TP                 
      1.87364876E-01    2          -24   1000006                       # BT1    -->  W-     TP1                
#         PDG         Width
DECAY   1000006  8.44881821E+00   # TP1   decays
#          BR          NDA       ID1       ID2       ID3       ID4
      2.35622525E-01    2      1000022         6                       # TP1    -->  Z1SS   TP                 
      7.66924918E-02    2      1000023         6                       # TP1    -->  Z2SS   TP                 
      1.82751819E-01    2      1000025         6                       # TP1    -->  Z3SS   TP                 
      6.86103925E-02    2      1000035         6                       # TP1    -->  Z4SS   TP                 
      1.73878893E-01    2      1000024         5                       # TP1    -->  W1SS+  BT                 
      2.62443811E-01    2      1000037         5                       # TP1    -->  W2SS+  BT                 
#         PDG         Width
DECAY   2000002  2.96612167E+00   # UPR   decays
#          BR          NDA       ID1       ID2       ID3       ID4
      9.97989595E-01    2      1000022         2                       # UPR    -->  Z1SS   UP                 
      3.48199916E-04    2      1000023         2                       # UPR    -->  Z2SS   UP                 
      2.51881487E-04    2      1000025         2                       # UPR    -->  Z3SS   UP                 
      1.41029747E-03    2      1000035         2                       # UPR    -->  Z4SS   UP                 
#         PDG         Width
DECAY   2000001  7.37580121E-01   # DNR   decays
#          BR          NDA       ID1       ID2       ID3       ID4
      9.98006523E-01    2      1000022         1                       # DNR    -->  Z1SS   DN                 
      3.47329275E-04    2      1000023         1                       # DNR    -->  Z2SS   DN                 
      2.49548670E-04    2      1000025         1                       # DNR    -->  Z3SS   DN                 
      1.39659399E-03    2      1000035         1                       # DNR    -->  Z4SS   DN                 
#         PDG         Width
DECAY   2000003  7.37580121E-01   # STR   decays
#          BR          NDA       ID1       ID2       ID3       ID4
      9.98006523E-01    2      1000022         3                       # STR    -->  Z1SS   ST                 
      3.47329275E-04    2      1000023         3                       # STR    -->  Z2SS   ST                 
      2.49548670E-04    2      1000025         3                       # STR    -->  Z3SS   ST                 
      1.39659399E-03    2      1000035         3                       # STR    -->  Z4SS   ST                 
#         PDG         Width
DECAY   2000004  2.96611786E+00   # CHR   decays
#          BR          NDA       ID1       ID2       ID3       ID4
      9.97989595E-01    2      1000022         4                       # CHR    -->  Z1SS   CH                 
      3.48199770E-04    2      1000023         4                       # CHR    -->  Z2SS   CH                 
      2.51881109E-04    2      1000025         4                       # CHR    -->  Z3SS   CH                 
      1.41029526E-03    2      1000035         4                       # CHR    -->  Z4SS   CH                 
#         PDG         Width
DECAY   2000005  2.16023231E+00   # BT2   decays
#          BR          NDA       ID1       ID2       ID3       ID4
      3.20184559E-01    2      1000022         5                       # BT2    -->  Z1SS   BT                 
      4.41412739E-02    2      1000023         5                       # BT2    -->  Z2SS   BT                 
      4.98765297E-02    2      1000025         5                       # BT2    -->  Z3SS   BT                 
      6.36195168E-02    2      1000035         5                       # BT2    -->  Z4SS   BT                 
      8.38424489E-02    2     -1000024         6                       # BT2    -->  W1SS-  TP                 
      3.01195532E-01    2     -1000037         6                       # BT2    -->  W2SS-  TP                 
      1.37140110E-01    2          -24   1000006                       # BT2    -->  W-     TP1                
#         PDG         Width
DECAY   2000006  2.37917118E+01   # TP2   decays
#          BR          NDA       ID1       ID2       ID3       ID4
      2.63062328E-01    2      1000024         5                       # TP2    -->  W1SS+  BT                 
      6.71903491E-02    2      1000037         5                       # TP2    -->  W2SS+  BT                 
      1.18164934E-01    2           23   1000006                       # TP2    -->  Z0     TP1                
      9.69938934E-02    2           25   1000006                       # TP2    -->  HL0    TP1                
      1.42923882E-02    2      1000022         6                       # TP2    -->  Z1SS   TP                 
      1.25292078E-01    2      1000023         6                       # TP2    -->  Z2SS   TP                 
      1.25938341E-01    2      1000025         6                       # TP2    -->  Z3SS   TP                 
      1.89065754E-01    2      1000035         6                       # TP2    -->  Z4SS   TP                 
#         PDG         Width
DECAY   1000011  3.29568088E-01   # EL-   decays
#          BR          NDA       ID1       ID2       ID3       ID4
      9.99995470E-01    2      1000022        11                       # EL-    -->  Z1SS   E-                 
      1.90813148E-06    3      1000015        11       -15             # EL-    -->  TAU1-  E-     TAU+        
      2.58798264E-06    3     -1000015        11        15             # EL-    -->  TAU1+  E-     TAU-        
#         PDG         Width
DECAY   1000013  3.29568028E-01   # MUL-  decays
#          BR          NDA       ID1       ID2       ID3       ID4
      9.99995470E-01    2      1000022        13                       # MUL-   -->  Z1SS   MU-                
      1.90813194E-06    3      1000015        13       -15             # MUL-   -->  TAU1-  MU-    TAU+        
      2.58798309E-06    3     -1000015        13        15             # MUL-   -->  TAU1+  MU-    TAU-        
#         PDG         Width
DECAY   1000015  2.05610335E-01   # TAU1- decays
#          BR          NDA       ID1       ID2       ID3       ID4
      1.00000000E+00    2      1000022        15                       # TAU1-  -->  Z1SS   TAU-               
#         PDG         Width
DECAY   1000012  3.35511893E-01   # NUEL  decays
#          BR          NDA       ID1       ID2       ID3       ID4
      9.99990165E-01    2      1000022        12                       # NUEL   -->  Z1SS   NUE                
      1.14870340E-06    3      1000015        12       -15             # NUEL   -->  TAU1-  NUE    TAU+        
      1.64211178E-06    3     -1000015        12        15             # NUEL   -->  TAU1+  NUE    TAU-        
      7.06730862E-06    3     -1000015        11        16             # NUEL   -->  TAU1+  E-     NUT         
#         PDG         Width
DECAY   1000014  3.35511893E-01   # NUML  decays
#          BR          NDA       ID1       ID2       ID3       ID4
      9.99990165E-01    2      1000022        14                       # NUML   -->  Z1SS   NUM                
      1.14870340E-06    3      1000015        14       -15             # NUML   -->  TAU1-  NUM    TAU+        
      1.64211178E-06    3     -1000015        14        15             # NUML   -->  TAU1+  NUM    TAU-        
      7.06738047E-06    3     -1000015        13        16             # NUML   -->  TAU1+  MU-    NUT         
#         PDG         Width
DECAY   1000016  4.12076324E-01   # NUTL  decays
#          BR          NDA       ID1       ID2       ID3       ID4
      7.92134464E-01    2      1000022        16                       # NUTL   -->  Z1SS   NUT                
      2.07863629E-01    2           24   1000015                       # NUTL   -->  W+     TAU1-              
      7.59499301E-07    3     -1000015        16        15             # NUTL   -->  TAU1+  NUT    TAU-        
      1.08556969E-06    3      1000015        16       -15             # NUTL   -->  TAU1-  NUT    TAU+        
#         PDG         Width
DECAY   2000011  2.26974800E-01   # ER-   decays
#          BR          NDA       ID1       ID2       ID3       ID4
      1.00000000E+00    2      1000022        11                       # ER-    -->  Z1SS   E-                 
      7.04930349E-18    3      1000015        11       -15             # ER-    -->  TAU1-  E-     TAU+        
      4.32099258E-18    3     -1000015        11        15             # ER-    -->  TAU1+  E-     TAU-        
      5.79015195E-23    3      1000015        12       -16             # ER-    -->  TAU1-  NUE    ANUT        
#         PDG         Width
DECAY   2000013  2.26974845E-01   # MUR-  decays
#          BR          NDA       ID1       ID2       ID3       ID4
      1.00000000E+00    2      1000022        13                       # MUR-   -->  Z1SS   MU-                
      7.05006781E-18    3      1000015        13       -15             # MUR-   -->  TAU1-  MU-    TAU+        
      4.32148269E-18    3     -1000015        13        15             # MUR-   -->  TAU1+  MU-    TAU-        
      2.46194159E-18    3      1000015        14       -16             # MUR-   -->  TAU1-  NUM    ANUT        
#         PDG         Width
DECAY   2000015  4.39421952E-01   # TAU2- decays
#          BR          NDA       ID1       ID2       ID3       ID4
      7.55459309E-01    2      1000022        15                       # TAU2-  -->  Z1SS   TAU-               
      1.09113455E-01    2           23   1000015                       # TAU2-  -->  Z0     TAU1-              
      1.35427237E-01    2           25   1000015                       # TAU2-  -->  HL0    TAU1-              
#         PDG         Width
DECAY   1000023  1.39648020E-01   # Z2SS  decays
#          BR          NDA       ID1       ID2       ID3       ID4
      2.40790587E-09    2      1000022        22                       # Z2SS   -->  Z1SS   GM                 
      8.28565378E-03    2      1000022        23                       # Z2SS   -->  Z1SS   Z0                 
      7.88452610E-07    3      1000022         2        -2             # Z2SS   -->  Z1SS   UP     UB          
      9.27290898E-07    3      1000022         1        -1             # Z2SS   -->  Z1SS   DN     DB          
      9.27290898E-07    3      1000022         3        -3             # Z2SS   -->  Z1SS   ST     SB          
      7.88450905E-07    3      1000022         4        -4             # Z2SS   -->  Z1SS   CH     CB          
      1.56900910E-06    3      1000022         5        -5             # Z2SS   -->  Z1SS   BT     BB          
      2.55115165E-08    3      1000022        15       -15             # Z2SS   -->  Z1SS   TAU-   TAU+        
      1.36225477E-01    2      1000022        25                       # Z2SS   -->  Z1SS   HL0                
      3.69394794E-02    2      1000011       -11                       # Z2SS   -->  EL-    E+                 
      3.69394794E-02    2     -1000011        11                       # Z2SS   -->  EL+    E-                 
      3.69389392E-02    2      1000013       -13                       # Z2SS   -->  MUL-   MU+                
      3.69389392E-02    2     -1000013        13                       # Z2SS   -->  MUL+   MU-                
      1.50201097E-03    2      2000011       -11                       # Z2SS   -->  ER-    E+                 
      1.50201097E-03    2     -2000011        11                       # Z2SS   -->  ER+    E-                 
      1.50201016E-03    2      2000013       -13                       # Z2SS   -->  MUR-   MU+                
      1.50201016E-03    2     -2000013        13                       # Z2SS   -->  MUR+   MU-                
      4.97941263E-02    2      1000015       -15                       # Z2SS   -->  TAU1-  TAU+               
      4.97941263E-02    2     -1000015        15                       # Z2SS   -->  TAU1+  TAU-               
      4.81368378E-02    2      2000015       -15                       # Z2SS   -->  TAU2-  TAU+               
      4.81368378E-02    2     -2000015        15                       # Z2SS   -->  TAU2+  TAU-               
      7.45424554E-02    2      1000012       -12                       # Z2SS   -->  NUEL   ANUE               
      7.45424554E-02    2     -1000012        12                       # Z2SS   -->  ANUEL  NUE                
      7.45424554E-02    2      1000014       -14                       # Z2SS   -->  NUML   ANUM               
      7.45424554E-02    2     -1000014        14                       # Z2SS   -->  ANUML  NUM                
      1.03843585E-01    2      1000016       -16                       # Z2SS   -->  NUTL   ANUT               
      1.03843585E-01    2     -1000016        16                       # Z2SS   -->  ANUTL  NUT                
#         PDG         Width
DECAY   1000025  4.72556543E+00   # Z3SS  decays
#          BR          NDA       ID1       ID2       ID3       ID4
      3.79568270E-08    2      1000022        22                       # Z3SS   -->  Z1SS   GM                 
      1.98613733E-07    2      1000023        22                       # Z3SS   -->  Z2SS   GM                 
      2.89066821E-01    2      1000024       -24                       # Z3SS   -->  W1SS+  W-                 
      2.89066821E-01    2     -1000024        24                       # Z3SS   -->  W1SS-  W+                 
      1.04976967E-01    2      1000022        23                       # Z3SS   -->  Z1SS   Z0                 
      2.69732684E-01    2      1000023        23                       # Z3SS   -->  Z2SS   Z0                 
      2.39116837E-09    3      1000022         2        -2             # Z3SS   -->  Z1SS   UP     UB          
      7.09597880E-10    3      1000022         1        -1             # Z3SS   -->  Z1SS   DN     DB          
      7.09597880E-10    3      1000022         3        -3             # Z3SS   -->  Z1SS   ST     SB          
      2.39116238E-09    3      1000022         4        -4             # Z3SS   -->  Z1SS   CH     CB          
      1.45936588E-06    3      1000022         5        -5             # Z3SS   -->  Z1SS   BT     BB          
      1.81407714E-07    3      1000022        15       -15             # Z3SS   -->  Z1SS   TAU-   TAU+        
      7.12132575E-10    3      1000023         2        -2             # Z3SS   -->  Z2SS   UP     UB          
      1.16412036E-09    3      1000023         1        -1             # Z3SS   -->  Z2SS   DN     DB          
      1.16412036E-09    3      1000023         3        -3             # Z3SS   -->  Z2SS   ST     SB          
      7.12130743E-10    3      1000023         4        -4             # Z3SS   -->  Z2SS   CH     CB          
      3.64367821E-07    3      1000023         5        -5             # Z3SS   -->  Z2SS   BT     BB          
      3.11107442E-08    3      1000023        15       -15             # Z3SS   -->  Z2SS   TAU-   TAU+        
      1.66210402E-02    2      1000022        25                       # Z3SS   -->  Z1SS   HL0                
      7.40379980E-03    2      1000023        25                       # Z3SS   -->  Z2SS   HL0                
      5.86210153E-05    2      1000011       -11                       # Z3SS   -->  EL-    E+                 
      5.86210153E-05    2     -1000011        11                       # Z3SS   -->  EL+    E-                 
      5.86210153E-05    2      1000013       -13                       # Z3SS   -->  MUL-   MU+                
      5.86210153E-05    2     -1000013        13                       # Z3SS   -->  MUL+   MU-                
      1.71567634E-04    2      2000011       -11                       # Z3SS   -->  ER-    E+                 
      1.71567634E-04    2     -2000011        11                       # Z3SS   -->  ER+    E-                 
      1.71567590E-04    2      2000013       -13                       # Z3SS   -->  MUR-   MU+                
      1.71567590E-04    2     -2000013        13                       # Z3SS   -->  MUR+   MU-                
      6.38487237E-03    2      1000015       -15                       # Z3SS   -->  TAU1-  TAU+               
      6.38487237E-03    2     -1000015        15                       # Z3SS   -->  TAU1+  TAU-               
      3.78243974E-03    2      2000015       -15                       # Z3SS   -->  TAU2-  TAU+               
      3.78243974E-03    2     -2000015        15                       # Z3SS   -->  TAU2+  TAU-               
      3.09801108E-04    2      1000012       -12                       # Z3SS   -->  NUEL   ANUE               
      3.09801108E-04    2     -1000012        12                       # Z3SS   -->  ANUEL  NUE                
      3.09801108E-04    2      1000014       -14                       # Z3SS   -->  NUML   ANUM               
      3.09801108E-04    2     -1000014        14                       # Z3SS   -->  ANUML  NUM                
      3.17570259E-04    2      1000016       -16                       # Z3SS   -->  NUTL   ANUT               
      3.17570259E-04    2     -1000016        16                       # Z3SS   -->  ANUTL  NUT                
#         PDG         Width
DECAY   1000035  5.29471302E+00   # Z4SS  decays
#          BR          NDA       ID1       ID2       ID3       ID4
      1.34637347E-07    2      1000022        22                       # Z4SS   -->  Z1SS   GM                 
      3.17619953E-09    2      1000023        22                       # Z4SS   -->  Z2SS   GM                 
      1.90291297E-10    2      1000025        22                       # Z4SS   -->  Z3SS   GM                 
      2.73385763E-01    2      1000024       -24                       # Z4SS   -->  W1SS+  W-                 
      2.73385763E-01    2     -1000024        24                       # Z4SS   -->  W1SS-  W+                 
      1.56317707E-02    2      1000022        23                       # Z4SS   -->  Z1SS   Z0                 
      8.56222212E-03    2      1000023        23                       # Z4SS   -->  Z2SS   Z0                 
      5.13221678E-08    3      1000022         2        -2             # Z4SS   -->  Z1SS   UP     UB          
      3.88181576E-08    3      1000022         1        -1             # Z4SS   -->  Z1SS   DN     DB          
      3.88181576E-08    3      1000022         3        -3             # Z4SS   -->  Z1SS   ST     SB          
      5.13220400E-08    3      1000022         4        -4             # Z4SS   -->  Z1SS   CH     CB          
      1.31001491E-06    3      1000022         5        -5             # Z4SS   -->  Z1SS   BT     BB          
      1.57476435E-07    3      1000022        15       -15             # Z4SS   -->  Z1SS   TAU-   TAU+        
      8.73484325E-08    3      1000023         2        -2             # Z4SS   -->  Z2SS   UP     UB          
      1.05312012E-07    3      1000023         1        -1             # Z4SS   -->  Z2SS   DN     DB          
      1.05312012E-07    3      1000023         3        -3             # Z4SS   -->  Z2SS   ST     SB          
      8.73482051E-08    3      1000023         4        -4             # Z4SS   -->  Z2SS   CH     CB          
      4.92647700E-07    3      1000023         5        -5             # Z4SS   -->  Z2SS   BT     BB          
      2.82349930E-08    3      1000023        15       -15             # Z4SS   -->  Z2SS   TAU-   TAU+        
      6.10008888E-09    3      1000025         2        -2             # Z4SS   -->  Z3SS   UP     UB          
      7.86722953E-09    3      1000025         1        -1             # Z4SS   -->  Z3SS   DN     DB          
      7.86722953E-09    3      1000025         3        -3             # Z4SS   -->  Z3SS   ST     SB          
      6.10008888E-09    3      1000025         4        -4             # Z4SS   -->  Z3SS   CH     CB          
      6.75025646E-10    3      1000025         5        -5             # Z4SS   -->  Z3SS   BT     BB          
      1.78453374E-09    3      1000025        11       -11             # Z4SS   -->  Z3SS   E-     E+          
      1.78453374E-09    3      1000025        13       -13             # Z4SS   -->  Z3SS   MU-    MU+         
      1.37539635E-09    3      1000025        15       -15             # Z4SS   -->  Z3SS   TAU-   TAU+        
      3.55066065E-09    3      1000025        12       -12             # Z4SS   -->  Z3SS   NUE    ANUE        
      3.55066065E-09    3      1000025        14       -14             # Z4SS   -->  Z3SS   NUM    ANUM        
      3.55066065E-09    3      1000025        16       -16             # Z4SS   -->  Z3SS   NUT    ANUT        
      9.32612866E-02    2      1000022        25                       # Z4SS   -->  Z1SS   HL0                
      2.50739753E-01    2      1000023        25                       # Z4SS   -->  Z2SS   HL0                
      3.52912676E-03    2      1000011       -11                       # Z4SS   -->  EL-    E+                 
      3.52912676E-03    2     -1000011        11                       # Z4SS   -->  EL+    E-                 
      3.52912652E-03    2      1000013       -13                       # Z4SS   -->  MUL-   MU+                
      3.52912652E-03    2     -1000013        13                       # Z4SS   -->  MUL+   MU-                
      9.09435737E-04    2      2000011       -11                       # Z4SS   -->  ER-    E+                 
      9.09435737E-04    2     -2000011        11                       # Z4SS   -->  ER+    E-                 
      9.09435679E-04    2      2000013       -13                       # Z4SS   -->  MUR-   MU+                
      9.09435679E-04    2     -2000013        13                       # Z4SS   -->  MUR+   MU-                
      5.08976728E-03    2      1000015       -15                       # Z4SS   -->  TAU1-  TAU+               
      5.08976728E-03    2     -1000015        15                       # Z4SS   -->  TAU1+  TAU-               
      7.50310626E-03    2      2000015       -15                       # Z4SS   -->  TAU2-  TAU+               
      7.50310626E-03    2     -2000015        15                       # Z4SS   -->  TAU2+  TAU-               
      6.95955846E-03    2      1000012       -12                       # Z4SS   -->  NUEL   ANUE               
      6.95955846E-03    2     -1000012        12                       # Z4SS   -->  ANUEL  NUE                
      6.95955846E-03    2      1000014       -14                       # Z4SS   -->  NUML   ANUM               
      6.95955846E-03    2     -1000014        14                       # Z4SS   -->  ANUML  NUM                
      7.12621352E-03    2      1000016       -16                       # Z4SS   -->  NUTL   ANUT               
      7.12621352E-03    2     -1000016        16                       # Z4SS   -->  ANUTL  NUT                
#         PDG         Width
DECAY   1000024  1.45268336E-01   # W1SS+ decays
#          BR          NDA       ID1       ID2       ID3       ID4
      1.66811310E-06    3      1000022         2        -1             # W1SS+  -->  Z1SS   UP     DB          
      1.66811151E-06    3      1000022         4        -3             # W1SS+  -->  Z1SS   CH     SB          
      2.37668019E-08    3      1000022       -15        16             # W1SS+  -->  Z1SS   TAU+   NUT         
      1.27071917E-01    2      1000022        24                       # W1SS+  -->  Z1SS   W+                 
      2.41342580E-12    3      1000023       -11        12             # W1SS+  -->  Z2SS   E+     NUE         
      2.41342580E-12    3      1000023       -13        14             # W1SS+  -->  Z2SS   MU+    NUM         
      1.58049598E-01    2      1000012       -11                       # W1SS+  -->  NUEL   E+                 
      1.58048600E-01    2      1000014       -13                       # W1SS+  -->  NUML   MU+                
      2.18920514E-01    2      1000016       -15                       # W1SS+  -->  NUTL   TAU+               
      7.48533979E-02    2     -1000011        12                       # W1SS+  -->  EL+    NUE                
      7.48533979E-02    2     -1000013        14                       # W1SS+  -->  MUL+   NUM                
      9.23042074E-02    2     -1000015        16                       # W1SS+  -->  TAU1+  NUT                
      9.58949327E-02    2     -2000015        16                       # W1SS+  -->  TAU2+  NUT                
#         PDG         Width
DECAY   1000037  5.25813484E+00   # W2SS+ decays
#          BR          NDA       ID1       ID2       ID3       ID4
      6.43695870E-08    3      1000022         2        -1             # W2SS+  -->  Z1SS   UP     DB          
      6.43695373E-08    3      1000022         4        -3             # W2SS+  -->  Z1SS   CH     SB          
      1.44574756E-07    3      1000022       -15        16             # W2SS+  -->  Z1SS   TAU+   NUT         
      9.86085609E-02    2      1000022        24                       # W2SS+  -->  Z1SS   W+                 
      7.47772617E-08    3      1000023         2        -1             # W2SS+  -->  Z2SS   UP     DB          
      7.47772120E-08    3      1000023         4        -3             # W2SS+  -->  Z2SS   CH     SB          
      3.69038595E-08    3      1000023       -15        16             # W2SS+  -->  Z2SS   TAU+   NUT         
      2.85614073E-01    2      1000023        24                       # W2SS+  -->  Z2SS   W+                 
      1.93070822E-08    3      1000025         2        -1             # W2SS+  -->  Z3SS   UP     DB          
      1.93070822E-08    3      1000025         4        -3             # W2SS+  -->  Z3SS   CH     SB          
      6.43557696E-09    3      1000025       -11        12             # W2SS+  -->  Z3SS   E+     NUE         
      6.43557696E-09    3      1000025       -13        14             # W2SS+  -->  Z3SS   MU+    NUM         
      6.43557652E-09    3      1000025       -15        16             # W2SS+  -->  Z3SS   TAU+   NUT         
      7.36293057E-03    2      1000012       -11                       # W2SS+  -->  NUEL   E+                 
      7.36293057E-03    2      1000014       -13                       # W2SS+  -->  NUML   MU+                
      1.41059505E-02    2      1000016       -15                       # W2SS+  -->  NUTL   TAU+               
      1.36905694E-02    2     -1000011        12                       # W2SS+  -->  EL+    NUE                
      1.36905694E-02    2     -1000013        14                       # W2SS+  -->  MUL+   NUM                
      8.43775459E-03    2     -1000015        16                       # W2SS+  -->  TAU1+  NUT                
      1.55724380E-02    2     -2000015        16                       # W2SS+  -->  TAU2+  NUT                
      2.71815747E-01    2      1000024        23                       # W2SS+  -->  W1SS+  Z0                 
      9.29861699E-08    3      1000024         1        -1             # W2SS+  -->  W1SS+  DN     DB          
      9.29859354E-08    3      1000024         3        -3             # W2SS+  -->  W1SS+  ST     SB          
      1.74053085E-07    3      1000024         2        -2             # W2SS+  -->  W1SS+  UP     UB          
      1.74053085E-07    3      1000024         4        -4             # W2SS+  -->  W1SS+  CH     CB          
      2.63737410E-01    2      1000024        25                       # W2SS+  -->  W1SS+  HL0                
#         PDG         Width
DECAY        25  4.26597381E-03   # HL0   decays
#          BR          NDA       ID1       ID2       ID3       ID4
      4.80491158E-09    2           11       -11                       # HL0    -->  E-     E+                 
      2.02871030E-04    2           13       -13                       # HL0    -->  MU-    MU+                
      5.80243133E-02    2           15       -15                       # HL0    -->  TAU-   TAU+               
      6.02963291E-06    2            1        -1                       # HL0    -->  DN     DB                 
      2.43627396E-03    2            3        -3                       # HL0    -->  ST     SB                 
      7.97369778E-01    2            5        -5                       # HL0    -->  BT     BB                 
      1.85987074E-06    2            2        -2                       # HL0    -->  UP     UB                 
      3.49506624E-02    2            4        -4                       # HL0    -->  CH     CB                 
      1.82150526E-03    2           22        22                       # HL0    -->  GM     GM                 
      3.87838744E-02    2           21        21                       # HL0    -->  GL     GL                 
      3.41669051E-03    3           24        11       -12             # HL0    -->  W+     E-     ANUE        
      3.41669051E-03    3           24        13       -14             # HL0    -->  W+     MU-    ANUM        
      3.41669051E-03    3           24        15       -16             # HL0    -->  W+     TAU-   ANUT        
      1.02500720E-02    3           24        -2         1             # HL0    -->  W+     UB     DN          
      1.02500720E-02    3           24        -4         3             # HL0    -->  W+     CB     ST          
      3.41669051E-03    3          -24       -11        12             # HL0    -->  W-     E+     NUE         
      3.41669051E-03    3          -24       -13        14             # HL0    -->  W-     MU+    NUM         
      3.41669051E-03    3          -24       -15        16             # HL0    -->  W-     TAU+   NUT         
      1.02500720E-02    3          -24         2        -1             # HL0    -->  W-     UP     DB          
      1.02500720E-02    3          -24         4        -3             # HL0    -->  W-     CH     SB          
      3.35256162E-04    3           23        12       -12             # HL0    -->  Z0     NUE    ANUE        
      3.35256162E-04    3           23        14       -14             # HL0    -->  Z0     NUM    ANUM        
      3.35256162E-04    3           23        16       -16             # HL0    -->  Z0     NUT    ANUT        
      1.68731058E-04    3           23        11       -11             # HL0    -->  Z0     E-     E+          
      1.68731058E-04    3           23        13       -13             # HL0    -->  Z0     MU-    MU+         
      1.68731058E-04    3           23        15       -15             # HL0    -->  Z0     TAU-   TAU+        
      5.78058301E-04    3           23         2        -2             # HL0    -->  Z0     UP     UB          
      5.78058301E-04    3           23         4        -4             # HL0    -->  Z0     CH     CB          
      7.44681573E-04    3           23         1        -1             # HL0    -->  Z0     DN     DB          
      7.44681573E-04    3           23         3        -3             # HL0    -->  Z0     ST     SB          
      7.44681573E-04    3           23         5        -5             # HL0    -->  Z0     BT     BB          
#         PDG         Width
DECAY        35  1.97014666E+00   # HH0   decays
#          BR          NDA       ID1       ID2       ID3       ID4
      8.74885497E-09    2           11       -11                       # HH0    -->  E-     E+                 
      3.69392423E-04    2           13       -13                       # HH0    -->  MU-    MU+                
      1.05797708E-01    2           15       -15                       # HH0    -->  TAU-   TAU+               
      1.07166861E-05    2            1        -1                       # HH0    -->  DN     DB                 
      4.33008326E-03    2            3        -3                       # HH0    -->  ST     SB                 
      6.45694375E-01    2            5        -5                       # HH0    -->  BT     BB                 
      3.55697388E-10    2            2        -2                       # HH0    -->  UP     UB                 
      5.00461783E-06    2            4        -4                       # HH0    -->  CH     CB                 
      2.28876457E-01    2            6        -6                       # HH0    -->  TP     TB                 
      8.65882555E-07    2           22        22                       # HH0    -->  GM     GM                 
      1.35053328E-04    2           21        21                       # HH0    -->  GL     GL                 
      5.56659477E-04    2           24       -24                       # HH0    -->  W+     W-                 
      2.82673311E-04    2           23        23                       # HH0    -->  Z0     Z0                 
      2.23060488E-03    2      1000022   1000022                       # HH0    -->  Z1SS   Z1SS               
      5.41546755E-03    2      1000022   1000023                       # HH0    -->  Z1SS   Z2SS               
      1.09076058E-03    2           25        25                       # HH0    -->  HL0    HL0                
      6.72402821E-05    2      2000011  -2000011                       # HH0    -->  ER-    ER+                
      6.72022870E-05    2      2000013  -2000013                       # HH0    -->  MUR-   MUR+               
      3.75357020E-04    2      1000015  -1000015                       # HH0    -->  TAU1-  TAU1+              
      2.34717038E-03    2      1000015  -2000015                       # HH0    -->  TAU1-  TAU2+              
      2.34717038E-03    2      2000015  -1000015                       # HH0    -->  TAU2-  TAU1+              
#         PDG         Width
DECAY        36  2.02549410E+00   # HA0   decays
#          BR          NDA       ID1       ID2       ID3       ID4
      8.45611758E-09    2           11       -11                       # HA0    -->  E-     E+                 
      3.57032521E-04    2           13       -13                       # HA0    -->  MU-    MU+                
      1.02258950E-01    2           15       -15                       # HA0    -->  TAU-   TAU+               
      1.03586790E-05    2            1        -1                       # HA0    -->  DN     DB                 
      4.18543071E-03    2            3        -3                       # HA0    -->  ST     SB                 
      6.24151468E-01    2            5        -5                       # HA0    -->  BT     BB                 
      3.31444483E-10    2            2        -2                       # HA0    -->  UP     UB                 
      4.66707752E-06    2            4        -4                       # HA0    -->  CH     CB                 
      2.36636013E-01    2            6        -6                       # HA0    -->  TP     TB                 
      1.14362228E-06    2           22        22                       # HA0    -->  GM     GM                 
      1.94316381E-04    2           21        21                       # HA0    -->  GL     GL                 
      3.94937629E-03    2      1000022   1000022                       # HA0    -->  Z1SS   Z1SS               
      2.30797324E-02    2      1000022   1000023                       # HA0    -->  Z1SS   Z2SS               
      5.22732327E-04    2           25        23                       # HA0    -->  HL0    Z0                 
      1.20929881E-11    2      1000011  -2000011                       # HA0    -->  EL-    ER+                
      1.20929881E-11    2      2000011  -1000011                       # HA0    -->  ER-    EL+                
      5.10587654E-07    2      1000013  -2000013                       # HA0    -->  MUL-   MUR+               
      5.10587654E-07    2      2000013  -1000013                       # HA0    -->  MUR-   MUL+               
      2.32389919E-03    2      1000015  -2000015                       # HA0    -->  TAU1-  TAU2+              
      2.32389919E-03    2      2000015  -1000015                       # HA0    -->  TAU2-  TAU1+              
#         PDG         Width
DECAY        37  1.82849705E+00   # H+    decays
#          BR          NDA       ID1       ID2       ID3       ID4
      9.47764978E-09    2           12       -11                       # H+     -->  NUE    E+                 
      4.00163466E-04    2           14       -13                       # H+     -->  NUM    MU+                
      1.14612259E-01    2           16       -15                       # H+     -->  NUT    TAU+               
      1.06724565E-05    2            2        -1                       # H+     -->  UP     DB                 
      4.31686034E-03    2            4        -3                       # H+     -->  CH     SB                 
      8.42342615E-01    2            6        -5                       # H+     -->  TP     BB                 
      3.19053531E-02    2      1000024   1000022                       # H+     -->  W1SS+  Z1SS               
      5.96208673E-04    2           25        24                       # H+     -->  HL0    W+                 
      5.81577513E-03    2     -1000015   1000016                       # H+     -->  TAU1+  NUTL               
