  65
  401   1724.2263    0.42583E-25
  402   1722.3792    0.42383E-25
  403   1724.2163    0.42584E-25
  404   1722.3696    0.42383E-25
  405   1555.2428    0.31660E-25
  406   1351.6030    0.57417E-25
  407   1724.2263    0.42583E-25
  408   1722.3792    0.42383E-25
  409   1724.2163    0.42584E-25
  410   1722.3696    0.42383E-25
  411   1555.2428    0.31660E-25
  412   1351.6030    0.57417E-25
  413   1645.9247    0.78335E-24
  414   1653.1823    0.19480E-24
  415   1645.8947    0.78337E-24
  416   1653.1729    0.19480E-24
  417   1602.1743    0.56557E-25
  418   1595.5308    0.24027E-25
  419   1645.9247    0.78335E-24
  420   1653.1823    0.19480E-24
  421   1645.8947    0.78337E-24
  422   1653.1729    0.19480E-24
  423   1602.1743    0.56557E-25
  424   1595.5308    0.24027E-25
  425    572.7985    0.23566E-23
  426    567.2141    0.23496E-23
  427    572.7706    0.23570E-23
  428    567.1859    0.23500E-23
  429    261.3896    0.22416E-11
  430    555.0840    0.31244E-24
  431    572.7985    0.23566E-23
  432    567.2141    0.23496E-23
  433    572.7706    0.23570E-23
  434    567.1859    0.23500E-23
  435    261.3896    0.22416E-11
  436    555.0840    0.31244E-24
  437    323.7806    0.22960E-22
  438      0.0000    0.10000E+31
  439    324.7268    0.16264E-18
  440      0.0000    0.10000E+31
  441    569.9279    0.30093E-24
  442      0.0000    0.10000E+31
  443    323.7806    0.22960E-22
  444      0.0000    0.10000E+31
  445    324.7268    0.16264E-18
  446      0.0000    0.10000E+31
  447    569.9279    0.30093E-24
  448      0.0000    0.10000E+31
  449   1893.9500    0.19737E-25
  450    363.3939    0.11535E-23
  451    681.6120    0.37855E-24
  452   -990.9180    0.10762E-24
  453   1001.2617    0.10007E-24
  454    681.7488    0.37792E-24
  455   1001.3841    0.10124E-24
  456    681.7488    0.37792E-24
  457   1001.3841    0.10124E-24
  203    120.7862    0.11974E-21
  204    911.5172    0.30865E-25
  205    910.3730    0.30896E-25
  206    915.4078    0.34661E-25
  207    915.4078    0.34661E-25
  458      0.0000    0.10000E+31
    6    173.3000    0.56017E-24
   12    173.3000    0.56017E-24
   6
   401  0.15234838E-01     0   450     1     0     0     0
   401  0.32038054E+00     0   451     1     0     0     0
   401  0.27968560E-03     0   452     1     0     0     0
   401  0.78834882E-02     0   453     1     0     0     0
   401  0.63657534E+00     0   456     2     0     0     0
   401  0.19646149E-01     0   457     2     0     0     0
   6
   402  0.13400872E-01     0   450     2     0     0     0
   402  0.32207313E+00     0   451     2     0     0     0
   402  0.16789006E-03     0   452     2     0     0     0
   402  0.64261886E-02     0   453     2     0     0     0
   402  0.64814597E+00     0   454     1     0     0     0
   402  0.97859642E-02     0   455     1     0     0     0
   6
   403  0.15234907E-01     0   450     3     0     0     0
   403  0.32038093E+00     0   451     3     0     0     0
   403  0.27968394E-03     0   452     3     0     0     0
   403  0.78834379E-02     0   453     3     0     0     0
   403  0.63657516E+00     0   456     4     0     0     0
   403  0.19645972E-01     0   457     4     0     0     0
   6
   404  0.13400904E-01     0   450     4     0     0     0
   404  0.32207277E+00     0   451     4     0     0     0
   404  0.16788856E-03     0   452     4     0     0     0
   404  0.64261290E-02     0   453     4     0     0     0
   404  0.64814639E+00     0   454     3     0     0     0
   404  0.97858999E-02     0   455     3     0     0     0
   7
   405  0.24255639E-01     0   450     5     0     0     0
   405  0.18255700E+00     0   451     5     0     0     0
   405  0.54833774E-01     0   452     5     0     0     0
   405  0.42612672E-01     0   453     5     0     0     0
   405  0.33899772E+00     0   456     6     0     0     0
   405  0.24553803E+00     0   457     6     0     0     0
   405  0.11120515E+00     0   199   406     0     0     0
   6
   406  0.20486484E+00     0   450     6     0     0     0
   406  0.66570871E-01     0   451     6     0     0     0
   406  0.19939815E+00     0   452     6     0     0     0
   406  0.93969434E-01     0   453     6     0     0     0
   406  0.14751330E+00     0   454     5     0     0     0
   406  0.28768337E+00     0   455     5     0     0     0
   6
   407  0.15234838E-01     0   450     7     0     0     0
   407  0.32038054E+00     0   451     7     0     0     0
   407  0.27968560E-03     0   452     7     0     0     0
   407  0.78834882E-02     0   453     7     0     0     0
   407  0.63657534E+00     0   454     8     0     0     0
   407  0.19646149E-01     0   455     8     0     0     0
   6
   408  0.13400872E-01     0   450     8     0     0     0
   408  0.32207313E+00     0   451     8     0     0     0
   408  0.16789006E-03     0   452     8     0     0     0
   408  0.64261886E-02     0   453     8     0     0     0
   408  0.64814597E+00     0   456     7     0     0     0
   408  0.97859642E-02     0   457     7     0     0     0
   6
   409  0.15234907E-01     0   450     9     0     0     0
   409  0.32038093E+00     0   451     9     0     0     0
   409  0.27968394E-03     0   452     9     0     0     0
   409  0.78834379E-02     0   453     9     0     0     0
   409  0.63657516E+00     0   454    10     0     0     0
   409  0.19645972E-01     0   455    10     0     0     0
   6
   410  0.13400904E-01     0   450    10     0     0     0
   410  0.32207277E+00     0   451    10     0     0     0
   410  0.16788856E-03     0   452    10     0     0     0
   410  0.64261290E-02     0   453    10     0     0     0
   410  0.64814639E+00     0   456     9     0     0     0
   410  0.97858999E-02     0   457     9     0     0     0
   7
   411  0.24255639E-01     0   450    11     0     0     0
   411  0.18255700E+00     0   451    11     0     0     0
   411  0.54833774E-01     0   452    11     0     0     0
   411  0.42612672E-01     0   453    11     0     0     0
   411  0.33899772E+00     0   454    12     0     0     0
   411  0.24553803E+00     0   455    12     0     0     0
   411  0.11120515E+00     0   198   412     0     0     0
   6
   412  0.20486484E+00     0   450    12     0     0     0
   412  0.66570871E-01     0   451    12     0     0     0
   412  0.19939815E+00     0   452    12     0     0     0
   412  0.93969434E-01     0   453    12     0     0     0
   412  0.14751330E+00     0   456    11     0     0     0
   412  0.28768337E+00     0   457    11     0     0     0
   4
   413  0.99849439E+00     0   450     1     0     0     0
   413  0.19171735E-03     0   451     1     0     0     0
   413  0.21965679E-03     0   452     1     0     0     0
   413  0.10941667E-02     0   453     1     0     0     0
   4
   414  0.99848175E+00     0   450     2     0     0     0
   414  0.19223827E-03     0   451     2     0     0     0
   414  0.22164847E-03     0   452     2     0     0     0
   414  0.11044525E-02     0   453     2     0     0     0
   4
   415  0.99849445E+00     0   450     3     0     0     0
   415  0.19171518E-03     0   451     3     0     0     0
   415  0.21964851E-03     0   452     3     0     0     0
   415  0.10941240E-02     0   453     3     0     0     0
   4
   416  0.99848175E+00     0   450     4     0     0     0
   416  0.19223748E-03     0   451     4     0     0     0
   416  0.22164553E-03     0   452     4     0     0     0
   416  0.11044374E-02     0   453     4     0     0     0
   7
   417  0.46302192E-01     0   450     5     0     0     0
   417  0.46020612E-01     0   451     5     0     0     0
   417  0.11960115E+00     0   452     5     0     0     0
   417  0.13623157E+00     0   453     5     0     0     0
   417  0.84725738E-01     0   456     6     0     0     0
   417  0.44935450E+00     0   457     6     0     0     0
   417  0.11776426E+00     0   199   406     0     0     0
   8
   418  0.25340343E+00     0   454     5     0     0     0
   418  0.13888025E+00     0   455     5     0     0     0
   418  0.83766870E-01     0   200   406     0     0     0
   418  0.77634290E-01     0   203   406     0     0     0
   418  0.14949911E-01     0   450     6     0     0     0
   418  0.11803890E+00     0   451     6     0     0     0
   418  0.12700063E+00     0   452     6     0     0     0
   418  0.18632573E+00     0   453     6     0     0     0
   4
   419  0.99849439E+00     0   450     7     0     0     0
   419  0.19171735E-03     0   451     7     0     0     0
   419  0.21965679E-03     0   452     7     0     0     0
   419  0.10941667E-02     0   453     7     0     0     0
   4
   420  0.99848175E+00     0   450     8     0     0     0
   420  0.19223827E-03     0   451     8     0     0     0
   420  0.22164847E-03     0   452     8     0     0     0
   420  0.11044525E-02     0   453     8     0     0     0
   4
   421  0.99849445E+00     0   450     9     0     0     0
   421  0.19171518E-03     0   451     9     0     0     0
   421  0.21964851E-03     0   452     9     0     0     0
   421  0.10941240E-02     0   453     9     0     0     0
   4
   422  0.99848175E+00     0   450    10     0     0     0
   422  0.19223748E-03     0   451    10     0     0     0
   422  0.22164553E-03     0   452    10     0     0     0
   422  0.11044374E-02     0   453    10     0     0     0
   7
   423  0.46302192E-01     0   450    11     0     0     0
   423  0.46020612E-01     0   451    11     0     0     0
   423  0.11960115E+00     0   452    11     0     0     0
   423  0.13623157E+00     0   453    11     0     0     0
   423  0.84725738E-01     0   454    12     0     0     0
   423  0.44935450E+00     0   455    12     0     0     0
   423  0.11776426E+00     0   198   412     0     0     0
   8
   424  0.25340343E+00     0   456    11     0     0     0
   424  0.13888025E+00     0   457    11     0     0     0
   424  0.83766870E-01     0   200   412     0     0     0
   424  0.77634290E-01     0   203   412     0     0     0
   424  0.14949911E-01     0   450    12     0     0     0
   424  0.11803890E+00     0   451    12     0     0     0
   424  0.12700063E+00     0   452    12     0     0     0
   424  0.18632573E+00     0   453    12     0     0     0
   4
   425  0.90918642E+00     0   450   121     0     0     0
   425  0.11343735E-04     0   429   121   131     0     0
   425  0.27096876E-04     0   435   121   125     0     0
   425  0.90775087E-01     0   121   130     0     0     0
   4
   426  0.91023749E+00     0   450   122     0     0     0
   426  0.22796083E-04     0   435   122   125     0     0
   426  0.11498386E-03     0   435   121   126     0     0
   426  0.89624673E-01     0   129   121     0     0     0
   4
   427  0.90917563E+00     0   450   123     0     0     0
   427  0.11339465E-04     0   429   123   131     0     0
   427  0.27089171E-04     0   435   123   125     0     0
   427  0.90785958E-01     0   121   128     0     0     0
   4
   428  0.91022629E+00     0   450   124     0     0     0
   428  0.22789560E-04     0   435   124   125     0     0
   428  0.11496348E-03     0   435   123   126     0     0
   428  0.89635961E-01     0   127   121     0     0     0
   3
   429  0.20519599E-01     0   125   130     0     0     0
   429  0.48971763E+00     0   125   124     0     0     0
   429  0.48976278E+00     0   123   126     0     0     0
   2
   430  0.11127667E+00     0   450   126     0     0     0
   430  0.88872343E+00     0   198   429     0     0     0
   4
   431  0.90918642E+00     0   450   127     0     0     0
   431  0.11343735E-04     0   435   127   125     0     0
   431  0.27096876E-04     0   429   127   131     0     0
   431  0.90775087E-01     0   127   124     0     0     0
   4
   432  0.91023749E+00     0   450   128     0     0     0
   432  0.22796083E-04     0   429   128   131     0     0
   432  0.11498386E-03     0   429   127   132     0     0
   432  0.89624673E-01     0   123   127     0     0     0
   4
   433  0.90917563E+00     0   450   129     0     0     0
   433  0.11339465E-04     0   435   129   125     0     0
   433  0.27089171E-04     0   429   129   131     0     0
   433  0.90785958E-01     0   127   122     0     0     0
   4
   434  0.91022629E+00     0   450   130     0     0     0
   434  0.22789560E-04     0   429   130   131     0     0
   434  0.11496348E-03     0   429   129   132     0     0
   434  0.89635961E-01     0   121   127     0     0     0
   3
   435  0.20519599E-01     0   131   124     0     0     0
   435  0.48971763E+00     0   131   130     0     0     0
   435  0.48976278E+00     0   129   132     0     0     0
   2
   436  0.11127667E+00     0   450   132     0     0     0
   436  0.88872343E+00     0   199   435     0     0     0
   4
   437  0.51742343E-04     0   429   121   131     0     0
   437  0.77893863E-04     0   435   121   125     0     0
   437  0.49993515E+00     0   123   122     0     0     0
   437  0.49993524E+00     0   121   124     0     0     0
   0
   2
   439  0.40014961E+00     0   429   123   131     0     0
   439  0.59985036E+00     0   435   123   125     0     0
   0
   3
   441  0.12529805E+00     0   450   125     0     0     0
   441  0.45409951E+00     0   200   429     0     0     0
   441  0.42060235E+00     0   203   429     0     0     0
   0
   4
   443  0.51742343E-04     0   435   127   125     0     0
   443  0.77893863E-04     0   429   127   131     0     0
   443  0.49993515E+00     0   129   128     0     0     0
   443  0.49993524E+00     0   127   130     0     0     0
   0
   2
   445  0.40014961E+00     0   435   129   125     0     0
   445  0.59985036E+00     0   429   129   131     0     0
   0
   3
   447  0.12529805E+00     0   450   131     0     0     0
   447  0.45409951E+00     0   200   435     0     0     0
   447  0.42060235E+00     0   203   435     0     0     0
   0
  24
   449  0.18359147E-01     0   408     2     0     0     0
   449  0.18359147E-01     0   402     8     0     0     0
   449  0.17984316E-01     0   407     1     0     0     0
   449  0.17984316E-01     0   401     7     0     0     0
   449  0.34784120E-01     0   420     2     0     0     0
   449  0.34784120E-01     0   414     8     0     0     0
   449  0.36761858E-01     0   419     1     0     0     0
   449  0.36761858E-01     0   413     7     0     0     0
   449  0.17986322E-01     0   409     3     0     0     0
   449  0.17986322E-01     0   403     9     0     0     0
   449  0.36770120E-01     0   421     3     0     0     0
   449  0.36770120E-01     0   415     9     0     0     0
   449  0.18360563E-01     0   410     4     0     0     0
   449  0.18360563E-01     0   404    10     0     0     0
   449  0.34786161E-01     0   422     4     0     0     0
   449  0.34786161E-01     0   416    10     0     0     0
   449  0.64192675E-01     0   411     5     0     0     0
   449  0.64192675E-01     0   405    11     0     0     0
   449  0.50397314E-01     0   423     5     0     0     0
   449  0.50397314E-01     0   417    11     0     0     0
   449  0.10997409E+00     0   412     6     0     0     0
   449  0.10997409E+00     0   406    12     0     0     0
   449  0.59643392E-01     0   424     6     0     0     0
   449  0.59643392E-01     0   418    12     0     0     0
   6
   450  0.68593495E-01     0   437   127     0     0     0
   450  0.68593495E-01     0   443   121     0     0     0
   450  0.65535486E-01     0   439   129     0     0     0
   450  0.65535486E-01     0   445   123     0     0     0
   450  0.36587104E+00     0   429   131     0     0     0
   450  0.36587104E+00     0   435   125     0     0     0
  20
   451  0.81643788E-03     0   450   200     0     0     0
   451  0.92829904E-02     0   450   203     0     0     0
   451  0.69890797E-01     0   425   127     0     0     0
   451  0.69890797E-01     0   431   121     0     0     0
   451  0.69923580E-01     0   427   129     0     0     0
   451  0.69923580E-01     0   433   123     0     0     0
   451  0.15081825E-03     0   437   127     0     0     0
   451  0.15081825E-03     0   443   121     0     0     0
   451  0.15030413E-03     0   439   129     0     0     0
   451  0.15030413E-03     0   445   123     0     0     0
   451  0.49805366E-01     0   429   131     0     0     0
   451  0.49805366E-01     0   435   125     0     0     0
   451  0.68581894E-01     0   441   131     0     0     0
   451  0.68581894E-01     0   447   125     0     0     0
   451  0.73887333E-01     0   426   128     0     0     0
   451  0.73887333E-01     0   432   122     0     0     0
   451  0.73920399E-01     0   428   130     0     0     0
   451  0.73920399E-01     0   434   124     0     0     0
   451  0.88639811E-01     0   430   132     0     0     0
   451  0.88639811E-01     0   436   126     0     0     0
  25
   452  0.24940267E+00     0   454   199     0     0     0
   452  0.24940267E+00     0   456   198     0     0     0
   452  0.89344367E-01     0   450   200     0     0     0
   452  0.23180842E+00     0   451   200     0     0     0
   452  0.46317888E-04     0   450     5    11     0     0
   452  0.15939007E-01     0   450   203     0     0     0
   452  0.60674134E-02     0   451   203     0     0     0
   452  0.62001316E-04     0   425   127     0     0     0
   452  0.62001316E-04     0   431   121     0     0     0
   452  0.62007399E-04     0   427   129     0     0     0
   452  0.62007399E-04     0   433   123     0     0     0
   452  0.16048565E-03     0   437   127     0     0     0
   452  0.16048565E-03     0   443   121     0     0     0
   452  0.16026119E-03     0   439   129     0     0     0
   452  0.16026119E-03     0   445   123     0     0     0
   452  0.49633410E-01     0   429   131     0     0     0
   452  0.49633410E-01     0   435   125     0     0     0
   452  0.27986402E-01     0   441   131     0     0     0
   452  0.27986402E-01     0   447   125     0     0     0
   452  0.30576932E-03     0   426   128     0     0     0
   452  0.30576932E-03     0   432   122     0     0     0
   452  0.30579895E-03     0   428   130     0     0     0
   452  0.30579895E-03     0   434   124     0     0     0
   452  0.31850964E-03     0   430   132     0     0     0
   452  0.31850964E-03     0   436   126     0     0     0
  25
   453  0.24552299E+00     0   454   199     0     0     0
   453  0.24552299E+00     0   456   198     0     0     0
   453  0.15726348E-01     0   450   200     0     0     0
   453  0.77841356E-02     0   451   200     0     0     0
   453  0.42852298E-04     0   450     5    11     0     0
   453  0.78651577E-01     0   450   203     0     0     0
   453  0.20593834E+00     0   451   203     0     0     0
   453  0.36620584E-02     0   425   127     0     0     0
   453  0.36620584E-02     0   431   121     0     0     0
   453  0.36624058E-02     0   427   129     0     0     0
   453  0.36624058E-02     0   433   123     0     0     0
   453  0.77309582E-03     0   437   127     0     0     0
   453  0.77309582E-03     0   443   121     0     0     0
   453  0.77203917E-03     0   439   129     0     0     0
   453  0.77203917E-03     0   445   123     0     0     0
   453  0.38075760E-01     0   429   131     0     0     0
   453  0.38075760E-01     0   435   125     0     0     0
   453  0.32929577E-01     0   441   131     0     0     0
   453  0.32929577E-01     0   447   125     0     0     0
   453  0.67523494E-02     0   426   128     0     0     0
   453  0.67523494E-02     0   432   122     0     0     0
   453  0.67529846E-02     0   428   130     0     0     0
   453  0.67529846E-02     0   434   124     0     0     0
   453  0.70250975E-02     0   430   132     0     0     0
   453  0.70250975E-02     0   436   126     0     0     0
   8
   454  0.99599017E-02     0   450   198     0     0     0
   454  0.15234554E+00     0   426   127     0     0     0
   454  0.15241359E+00     0   428   129     0     0     0
   454  0.18479821E+00     0   430   131     0     0     0
   454  0.13570756E+00     0   431   122     0     0     0
   454  0.13577117E+00     0   433   124     0     0     0
   454  0.97619854E-01     0   435   126     0     0     0
   454  0.13138418E+00     0   447   126     0     0     0
  11
   455  0.93068987E-01     0   450   198     0     0     0
   455  0.25062308E+00     0   451   198     0     0     0
   455  0.71523678E-02     0   426   127     0     0     0
   455  0.71530403E-02     0   428   129     0     0     0
   455  0.59327703E-01     0   430   131     0     0     0
   455  0.13979835E-01     0   431   122     0     0     0
   455  0.13981160E-01     0   433   124     0     0     0
   455  0.71789920E-01     0   435   126     0     0     0
   455  0.25942307E-01     0   447   126     0     0     0
   455  0.24051547E+00     0   454   200     0     0     0
   455  0.21646617E+00     0   454   203     0     0     0
   8
   456  0.99599017E-02     0   450   199     0     0     0
   456  0.15234554E+00     0   432   121     0     0     0
   456  0.15241359E+00     0   434   123     0     0     0
   456  0.18479821E+00     0   436   125     0     0     0
   456  0.13570756E+00     0   425   128     0     0     0
   456  0.13577117E+00     0   427   130     0     0     0
   456  0.97619854E-01     0   429   132     0     0     0
   456  0.13138418E+00     0   441   132     0     0     0
  11
   457  0.93068987E-01     0   450   199     0     0     0
   457  0.25062308E+00     0   451   199     0     0     0
   457  0.71523678E-02     0   432   121     0     0     0
   457  0.71530403E-02     0   434   123     0     0     0
   457  0.59327703E-01     0   436   125     0     0     0
   457  0.13979835E-01     0   425   128     0     0     0
   457  0.13981160E-01     0   427   130     0     0     0
   457  0.71789920E-01     0   429   132     0     0     0
   457  0.25942307E-01     0   441   132     0     0     0
   457  0.24051547E+00     0   456   200     0     0     0
   457  0.21646617E+00     0   456   203     0     0     0
  28
   203  0.16527763E-03     0   123   129     0     0     0
   203  0.47276802E-01     0   125   131     0     0     0
   203  0.19836985E-02     0     3     9     0     0     0
   203  0.77899551E+00     0     5    11     0     0     0
   203  0.37747905E-01     0     4    10     0     0     0
   203  0.16719892E-02     0    59    59     0     0     0
   203  0.33225123E-01     0    13    13     0     0     0
   203  0.50400971E-02     0   198   121   128     0     0
   203  0.50400971E-02     0   198   123   130     0     0
   203  0.50400971E-02     0   198   125   132     0     0
   203  0.15120292E-01     0   198     8     1     0     0
   203  0.15120292E-01     0   198    10     3     0     0
   203  0.50400971E-02     0   199   127   122     0     0
   203  0.50400971E-02     0   199   129   124     0     0
   203  0.50400971E-02     0   199   131   126     0     0
   203  0.15120292E-01     0   199     2     7     0     0
   203  0.15120292E-01     0   199     4     9     0     0
   203  0.56161004E-03     0   200   122   128     0     0
   203  0.56161004E-03     0   200   124   130     0     0
   203  0.56161004E-03     0   200   126   132     0     0
   203  0.28265271E-03     0   200   121   127     0     0
   203  0.28265271E-03     0   200   123   129     0     0
   203  0.28265271E-03     0   200   125   131     0     0
   203  0.96834416E-03     0   200     2     8     0     0
   203  0.96834416E-03     0   200     4    10     0     0
   203  0.12474658E-02     0   200     1     7     0     0
   203  0.12474658E-02     0   200     3     9     0     0
   203  0.12474658E-02     0   200     5    11     0     0
   9
   204  0.22838122E-03     0   123   129     0     0     0
   204  0.65410398E-01     0   125   131     0     0     0
   204  0.26795159E-02     0     3     9     0     0     0
   204  0.80787838E+00     0     5    11     0     0     0
   204  0.28321666E-02     0     6    12     0     0     0
   204  0.65011831E-04     0   450   450     0     0     0
   204  0.19724805E-01     0   429   435     0     0     0
   204  0.50590679E-01     0   429   447     0     0     0
   204  0.50590679E-01     0   441   435     0     0     0
  10
   205  0.22833821E-03     0   123   129     0     0     0
   205  0.65399073E-01     0   125   131     0     0     0
   205  0.26790393E-02     0     3     9     0     0     0
   205  0.80789965E+00     0     5    11     0     0     0
   205  0.31201132E-02     0     6    12     0     0     0
   205  0.20025316E-04     0    13    13     0     0     0
   205  0.18894425E-03     0   450   450     0     0     0
   205  0.19648951E-01     0   429   435     0     0     0
   205  0.50408024E-01     0   429   447     0     0     0
   205  0.50408024E-01     0   441   435     0     0     0
   5
   206  0.25757827E-03     0   124   129     0     0     0
   206  0.73773801E-01     0   126   131     0     0     0
   206  0.27756724E-02     0     4     9     0     0     0
   206  0.78037512E+00     0     6    11     0     0     0
   206  0.14281780E+00     0   435   430     0     0     0
   5
   207  0.25757827E-03     0   130   123     0     0     0
   207  0.73773801E-01     0   132   125     0     0     0
   207  0.27756724E-02     0    10     3     0     0     0
   207  0.78037512E+00     0    12     5     0     0     0
   207  0.14281780E+00     0   429   436     0     0     0
   0
   5
     6  0.33333334E+00   100     2     7     5     0     0
     6  0.33333334E+00   100     4     9     5     0     0
     6  0.11111111E+00   100   122   127     5     0     0
     6  0.11111111E+00   100   124   129     5     0     0
     6  0.11111111E+00   100   126   131     5     0     0
   5
    12  0.33333334E+00   100     8     1    11     0     0
    12  0.33333334E+00   100    10     3    11     0     0
    12  0.11111111E+00   100   128   121    11     0     0
    12  0.11111111E+00   100   130   123    11     0     0
    12  0.11111111E+00   100   132   125    11     0     0
     27.14570236     -0.03750338
      0.99838310     -0.00558962      0.05253941     -0.02096631
     -0.01588391     -0.98193204      0.15387031     -0.10900044
      0.02209446     -0.03239438     -0.70562971     -0.70749485
     -0.04990746      0.18635687      0.68967372     -0.69794720
     -0.98796868      0.15465395     -0.15465395     -0.98796868
     -0.97589159      0.21825586     -0.21825586     -0.97589159
     -1.23766088     -0.50316864     -1.36888850
  -1461.72998047   5968.06982422  -2021.33996582
    988.49102783
    F
  0.00000000E+00  0.00000000E+00  0.00000000E+00  0.47169302E-01 -0.11734800E-19  0.00000000E+00  0.00000000E+00  0.00000000E+00 -0.68603497E-19 -0.47169302E-01  0.11734800E-19 -0.00000000E+00  0.00000000E+00  0.00000000E+00  0.00000000E+00  0.00000000E+00  0.00000000E+00  0.16974499E-06 -0.00000000E+00 -0.00000000E+00  0.68603497E-19 -0.00000000E+00 -0.00000000E+00 -0.16974499E-06  0.00000000E+00  0.00000000E+00  0.00000000E+00
 -0.10167000E-21  0.84077908E-44  0.00000000E+00  0.00000000E+00 -0.22260400E-20  0.00000000E+00  0.00000000E+00  0.00000000E+00 -0.88783402E-19  0.25156099E-09 -0.20650100E-31  0.00000000E+00 -0.96823596E-33  0.55078599E-08  0.00000000E+00  0.00000000E+00  0.00000000E+00  0.21967600E-06  0.00000000E+00  0.00000000E+00  0.00000000E+00  0.00000000E+00  0.00000000E+00  0.00000000E+00  0.00000000E+00  0.00000000E+00  0.00000000E+00
  0.00000000E+00  0.00000000E+00  0.00000000E+00  0.00000000E+00  0.00000000E+00  0.00000000E+00  0.00000000E+00  0.00000000E+00  0.00000000E+00  0.00000000E+00  0.00000000E+00  0.00000000E+00  0.00000000E+00  0.00000000E+00  0.00000000E+00  0.00000000E+00  0.00000000E+00  0.00000000E+00  0.00000000E+00  0.00000000E+00  0.00000000E+00  0.00000000E+00  0.00000000E+00  0.00000000E+00  0.00000000E+00  0.00000000E+00  0.00000000E+00
