#  ISAJET SUSY parameters in SUSY Les Houches Accord 2 format
#  Created by ISALHA 2.0 Last revision: C. Balazs 21 Apr 2009
Block SPINFO   # Program information
     1   ISASUGRA from ISAJET          # Spectrum Calculator
     2   7.80   29-OCT-2009 12:50:36   # Version number
Block MODSEL   # Model selection
     1     1   # Minimal supergravity (mSUGRA) model               
Block SMINPUTS   # Standard Model inputs
     1     1.27836311E+02   # alpha_em^(-1)
     2     1.16570000E-05   # G_Fermi
     3     1.17200002E-01   # alpha_s(M_Z)
     4     9.11699982E+01   # m_{Z}(pole)
     5     4.19999981E+00   # m_{b}(m_{b})
     6     1.72500000E+02   # m_{top}(pole)
     7     1.77699995E+00   # m_{tau}(pole)
Block MINPAR   # SUSY breaking input parameters
     1     2.82000000E+03   # m_0
     2     3.90000000E+02   # m_{1/2}
     3     1.00000000E+01   # tan(beta)
     4     1.00000000E+00   # sign(mu)
     5     0.00000000E+00   # A_0
Block EXTPAR   # Non-universal SUSY breaking parameters
     0     2.03333609E+16   # Input scale
Block MASS   # Scalar and gaugino mass spectrum
#  PDG code   mass                 particle
        24     8.04229965E+01   #  W^+
        25     1.16656548E+02   #  h^0            
        35     2.83456714E+03   #  H^0            
        36     2.81597534E+03   #  A^0            
        37     2.83582349E+03   #  H^+            
   1000001     2.90125684E+03   #  dnl            
   1000002     2.90015088E+03   #  upl            
   1000003     2.90125684E+03   #  stl            
   1000004     2.90015112E+03   #  chl            
   1000005     2.38931836E+03   #  b1             
   1000006     1.73003943E+03   #  t1             
   1000011     2.82633521E+03   #  el-            
   1000012     2.82615918E+03   #  nuel           
   1000013     2.82633521E+03   #  mul-           
   1000014     2.82615918E+03   #  numl           
   1000015     2.79507788E+03   #  tau1           
   1000016     2.81348291E+03   #  nutl           
   1000021     1.04341333E+03   #  glss           
   1000022     1.64257523E+02   #  z1ss           
   1000023     3.01858429E+02   #  z2ss           
   1000024     3.03619385E+02   #  w1ss           
   1000025    -4.24432495E+02   #  z3ss           
   1000035     4.54706512E+02   #  z4ss           
   1000037     4.52348572E+02   #  w2ss           
   2000001     2.90457373E+03   #  dnr            
   2000002     2.90357593E+03   #  upr            
   2000003     2.90457373E+03   #  str            
   2000004     2.90357666E+03   #  chr            
   2000005     2.87636304E+03   #  b2             
   2000006     2.39966113E+03   #  t2             
   2000011     2.82089526E+03   #  er-            
   2000013     2.82089526E+03   #  mur-           
   2000015     2.81330103E+03   #  tau2           
Block ALPHA   # Effective Higgs mixing parameter
         -9.99354050E-02   # alpha
Block STOPMIX   # stop mixing matrix
  1  1     2.96795443E-02   # O_{11}
  1  2     9.99559462E-01   # O_{12}
  2  1    -9.99559462E-01   # O_{21}
  2  2     2.96795443E-02   # O_{22}
Block SBOTMIX   # sbottom mixing matrix
  1  1     9.99977767E-01   # O_{11}
  1  2     6.66955905E-03   # O_{12}
  2  1    -6.66955905E-03   # O_{21}
  2  2     9.99977767E-01   # O_{22}
Block STAUMIX   # stau mixing matrix
  1  1     1.19711816E-01   # O_{11}
  1  2     9.92808700E-01   # O_{12}
  2  1    -9.92808700E-01   # O_{21}
  2  2     1.19711816E-01   # O_{22}
Block NMIX   # neutralino mixing matrix
  1  1     9.88784015E-01   #
  1  2    -3.61404531E-02   #
  1  3     1.31109282E-01   #
  1  4    -6.17298707E-02   #
  2  1    -9.52689797E-02   #
  2  2    -8.94113302E-01   #
  2  3     3.45721573E-01   #
  2  4    -2.68257409E-01   #
  3  1     4.62743565E-02   #
  3  2    -6.28692359E-02   #
  3  3    -7.00368404E-01   #
  3  4    -7.09500074E-01   #
  4  1    -1.05303638E-01   #
  4  2     4.41931129E-01   #
  4  3     6.10549808E-01   #
  4  4    -6.48719668E-01   #
Block UMIX   # chargino U mixing matrix
  1  1    -8.76211405E-01   # U_{11}
  1  2     4.81926978E-01   # U_{12}
  2  1    -4.81926978E-01   # U_{21}
  2  2    -8.76211405E-01   # U_{22}
Block VMIX   # chargino V mixing matrix
  1  1    -9.28616703E-01   # V_{11}
  1  2     3.71040404E-01   # V_{12}
  2  1    -3.71040404E-01   # V_{21}
  2  2    -9.28616703E-01   # V_{22}
Block GAUGE Q=  2.01849194E+03   #
     1     3.57524991E-01   # g`
     2     6.52378082E-01   # g_2
     3     1.21928298E+00   # g_3
Block YU Q=  2.01849194E+03   #
  3  3     8.47375453E-01   # y_t
Block YD Q=  2.01849194E+03   #
  3  3     1.29934609E-01   # y_b
Block YE Q=  2.01849194E+03   #
  3  3     1.01877198E-01   # y_tau
Block HMIX Q=  2.01849194E+03   # Higgs mixing parameters
     1     4.13076141E+02   # mu(Q)
     2     1.00000000E+01   # tan(beta)(M_GUT)
     3     2.51721771E+02   # Higgs vev at Q
     4     7.92971700E+06   # m_A^2(Q)
Block MSOFT Q=  2.01849194E+03   # DRbar SUSY breaking parameters
     1     1.67803635E+02   # M_1(Q)          
     2     3.07766357E+02   # M_2(Q)          
     3     8.84627502E+02   # M_3(Q)          
    31     2.81685596E+03   # MeL(Q)          
    32     2.81685596E+03   # MmuL(Q)         
    33     2.80450415E+03   # MtauL(Q)        
    34     2.81780762E+03   # MeR(Q)          
    35     2.81780762E+03   # MmuR(Q)         
    36     2.79296777E+03   # MtauR(Q)        
    41     2.85237012E+03   # MqL1(Q)         
    42     2.85237012E+03   # MqL2(Q)         
    43     2.35240186E+03   # MqL3(Q)         
    44     2.85549463E+03   # MuR(Q)          
    45     2.85549463E+03   # McR(Q)          
    46     1.73197852E+03   # MtR(Q)          
    47     2.85615308E+03   # MdR(Q)          
    48     2.85615308E+03   # MsR(Q)          
    49     2.83580029E+03   # MbR(Q)          
Block AU Q=  2.01849194E+03   #
  1  1    -6.39173706E+02   # A_u
  2  2    -6.39173706E+02   # A_c
  3  3    -6.39173706E+02   # A_t
Block AD Q=  2.01849194E+03   #
  1  1    -9.39952698E+02   # A_d
  2  2    -9.39952698E+02   # A_s
  3  3    -9.39952698E+02   # A_b
Block AE Q=  2.01849194E+03   #
  1  1    -2.26406906E+02   # A_e
  2  2    -2.26406906E+02   # A_mu
  3  3    -2.26406906E+02   # A_tau
#  ISAJET decay tables in SUSY Les Houches accord format
#  Created by ISALHD. Last revision: C. Balazs, 2005 May 25
Block DCINFO                           # Program information
     1   ISASUGRA from ISAJET          # Spectrum Calculator
     2   7.80   29-OCT-2009 12:50:36   # Version number
#         PDG         Width
DECAY         6  1.14680779E+00   # TP    decays
#          BR          NDA       ID1       ID2       ID3       ID4
      3.33333343E-01    3            2        -1         5             # TP     -->  UP     DB     BT          
      3.33333343E-01    3            4        -3         5             # TP     -->  CH     SB     BT          
      1.11111112E-01    3          -11        12         5             # TP     -->  E+     NUE    BT          
      1.11111112E-01    3          -13        14         5             # TP     -->  MU+    NUM    BT          
      1.11111112E-01    3          -15        16         5             # TP     -->  TAU+   NUT    BT          
#         PDG         Width
DECAY   1000021  1.87661231E-03   # GLSS  decays
#          BR          NDA       ID1       ID2       ID3       ID4
      3.23094875E-02    3      1000024         1        -2             # GLSS   -->  W1SS+  DN     UB          
      3.23094875E-02    3     -1000024         2        -1             # GLSS   -->  W1SS-  UP     DB          
      3.23094800E-02    3      1000024         3        -4             # GLSS   -->  W1SS+  ST     CB          
      3.23094800E-02    3     -1000024         4        -3             # GLSS   -->  W1SS-  CH     SB          
      5.44088744E-02    3      1000024         5        -6             # GLSS   -->  W1SS+  BT     TB          
      5.44088744E-02    3     -1000024         6        -5             # GLSS   -->  W1SS-  TP     BB          
      3.70742590E-03    3      1000037         1        -2             # GLSS   -->  W2SS+  DN     UB          
      3.70742590E-03    3     -1000037         2        -1             # GLSS   -->  W2SS-  UP     DB          
      3.70742567E-03    3      1000037         3        -4             # GLSS   -->  W2SS+  ST     CB          
      3.70742567E-03    3     -1000037         4        -3             # GLSS   -->  W2SS-  CH     SB          
      1.40915215E-01    3      1000037         5        -6             # GLSS   -->  W2SS+  BT     TB          
      1.40915215E-01    3     -1000037         6        -5             # GLSS   -->  W2SS-  TP     BB          
      1.16584633E-05    2      1000022        21                       # GLSS   -->  Z1SS   GL                 
      1.49655975E-02    3      1000022         2        -2             # GLSS   -->  Z1SS   UP     UB          
      4.88950731E-03    3      1000022         1        -1             # GLSS   -->  Z1SS   DN     DB          
      4.88950731E-03    3      1000022         3        -3             # GLSS   -->  Z1SS   ST     SB          
      1.49655808E-02    3      1000022         4        -4             # GLSS   -->  Z1SS   CH     CB          
      6.83228625E-03    3      1000022         5        -5             # GLSS   -->  Z1SS   BT     BB          
      7.23146796E-02    3      1000022         6        -6             # GLSS   -->  Z1SS   TP     TB          
      3.85028566E-03    2      1000023        21                       # GLSS   -->  Z2SS   GL                 
      1.66853163E-02    3      1000023         2        -2             # GLSS   -->  Z2SS   UP     UB          
      1.53416181E-02    3      1000023         1        -1             # GLSS   -->  Z2SS   DN     DB          
      1.53416181E-02    3      1000023         3        -3             # GLSS   -->  Z2SS   ST     SB          
      1.66853089E-02    3      1000023         4        -4             # GLSS   -->  Z2SS   CH     CB          
      3.59738469E-02    3      1000023         5        -5             # GLSS   -->  Z2SS   BT     BB          
      2.58521307E-02    3      1000023         6        -6             # GLSS   -->  Z2SS   TP     TB          
      1.88155584E-02    2      1000025        21                       # GLSS   -->  Z3SS   GL                 
      2.00489158E-05    3      1000025         2        -2             # GLSS   -->  Z3SS   UP     UB          
      2.62312551E-05    3      1000025         1        -1             # GLSS   -->  Z3SS   DN     DB          
      2.62312551E-05    3      1000025         3        -3             # GLSS   -->  Z3SS   ST     SB          
      2.00488976E-05    3      1000025         4        -4             # GLSS   -->  Z3SS   CH     CB          
      1.74934929E-03    3      1000025         5        -5             # GLSS   -->  Z3SS   BT     BB          
      6.84472993E-02    3      1000025         6        -6             # GLSS   -->  Z3SS   TP     TB          
      1.47789605E-02    2      1000035        21                       # GLSS   -->  Z4SS   GL                 
      1.84471416E-03    3      1000035         2        -2             # GLSS   -->  Z4SS   UP     UB          
      2.13768100E-03    3      1000035         1        -1             # GLSS   -->  Z4SS   DN     DB          
      2.13768100E-03    3      1000035         3        -3             # GLSS   -->  Z4SS   ST     SB          
      1.84471323E-03    3      1000035         4        -4             # GLSS   -->  Z4SS   CH     CB          
      6.18218631E-03    3      1000035         5        -5             # GLSS   -->  Z4SS   BT     BB          
      9.86545011E-02    3      1000035         6        -6             # GLSS   -->  Z4SS   TP     TB          
#         PDG         Width
DECAY   1000002  1.57756638E+02   # UPL   decays
#          BR          NDA       ID1       ID2       ID3       ID4
      1.61681557E-03    2      1000022         2                       # UPL    -->  Z1SS   UP                 
      6.29160330E-02    2      1000023         2                       # UPL    -->  Z2SS   UP                 
      2.19230453E-04    2      1000025         2                       # UPL    -->  Z3SS   UP                 
      1.31511884E-02    2      1000035         2                       # UPL    -->  Z4SS   UP                 
      7.71264553E-01    2      1000021         2                       # UPL    -->  GLSS   UP                 
      1.30549610E-01    2      1000024         1                       # UPL    -->  W1SS+  DN                 
      2.02826727E-02    2      1000037         1                       # UPL    -->  W2SS+  DN                 
#         PDG         Width
DECAY   1000001  1.57773254E+02   # DNL   decays
#          BR          NDA       ID1       ID2       ID3       ID4
      3.63133335E-03    2      1000022         1                       # DNL    -->  Z1SS   DN                 
      5.82066700E-02    2      1000023         1                       # DNL    -->  Z2SS   DN                 
      3.77333781E-04    2      1000025         1                       # DNL    -->  Z3SS   DN                 
      1.56669989E-02    2      1000035         1                       # DNL    -->  Z4SS   DN                 
      7.71625042E-01    2      1000021         1                       # DNL    -->  GLSS   DN                 
      1.16264626E-01    2     -1000024         2                       # DNL    -->  W1SS-  UP                 
      3.42280082E-02    2     -1000037         2                       # DNL    -->  W2SS-  UP                 
#         PDG         Width
DECAY   1000003  1.57773254E+02   # STL   decays
#          BR          NDA       ID1       ID2       ID3       ID4
      3.63133335E-03    2      1000022         3                       # STL    -->  Z1SS   ST                 
      5.82066700E-02    2      1000023         3                       # STL    -->  Z2SS   ST                 
      3.77333781E-04    2      1000025         3                       # STL    -->  Z3SS   ST                 
      1.56669989E-02    2      1000035         3                       # STL    -->  Z4SS   ST                 
      7.71625042E-01    2      1000021         3                       # STL    -->  GLSS   ST                 
      1.16264582E-01    2     -1000024         4                       # STL    -->  W1SS-  CH                 
      3.42279896E-02    2     -1000037         4                       # STL    -->  W2SS-  CH                 
#         PDG         Width
DECAY   1000004  1.57756577E+02   # CHL   decays
#          BR          NDA       ID1       ID2       ID3       ID4
      1.61681545E-03    2      1000022         4                       # CHL    -->  Z1SS   CH                 
      6.29160330E-02    2      1000023         4                       # CHL    -->  Z2SS   CH                 
      2.19230467E-04    2      1000025         4                       # CHL    -->  Z3SS   CH                 
      1.31511884E-02    2      1000035         4                       # CHL    -->  Z4SS   CH                 
      7.71264434E-01    2      1000021         4                       # CHL    -->  GLSS   CH                 
      1.30549669E-01    2      1000024         3                       # CHL    -->  W1SS+  ST                 
      2.02826820E-02    2      1000037         3                       # CHL    -->  W2SS+  ST                 
#         PDG         Width
DECAY   1000005  1.49472794E+02   # BT1   decays
#          BR          NDA       ID1       ID2       ID3       ID4
      3.26219643E-03    2      1000022         5                       # BT1    -->  Z1SS   BT                 
      5.07890210E-02    2      1000023         5                       # BT1    -->  Z2SS   BT                 
      2.89214007E-03    2      1000025         5                       # BT1    -->  Z3SS   BT                 
      1.51770124E-02    2      1000035         5                       # BT1    -->  Z4SS   BT                 
      5.90147436E-01    2      1000021         5                       # BT1    -->  GLSS   BT                 
      1.25954911E-01    2     -1000024         6                       # BT1    -->  W1SS-  TP                 
      2.06273824E-01    2     -1000037         6                       # BT1    -->  W2SS-  TP                 
      5.50355529E-03    2          -24   1000006                       # BT1    -->  W-     TP1                
#         PDG         Width
DECAY   1000006  8.42754593E+01   # TP1   decays
#          BR          NDA       ID1       ID2       ID3       ID4
      4.64661866E-01    2      1000021         6                       # TP1    -->  GLSS   TP                 
      4.47220430E-02    2      1000022         6                       # TP1    -->  Z1SS   TP                 
      2.11657342E-02    2      1000023         6                       # TP1    -->  Z2SS   TP                 
      1.23617232E-01    2      1000025         6                       # TP1    -->  Z3SS   TP                 
      9.85951424E-02    2      1000035         6                       # TP1    -->  Z4SS   TP                 
      4.07155715E-02    2      1000024         5                       # TP1    -->  W1SS+  BT                 
      2.06522420E-01    2      1000037         5                       # TP1    -->  W2SS+  BT                 
#         PDG         Width
DECAY   2000002  1.28405212E+02   # UPR   decays
#          BR          NDA       ID1       ID2       ID3       ID4
      4.96575795E-02    2      1000022         2                       # UPR    -->  Z1SS   UP                 
      4.53974237E-04    2      1000023         2                       # UPR    -->  Z2SS   UP                 
      1.04830331E-04    2      1000025         2                       # UPR    -->  Z3SS   UP                 
      5.39369590E-04    2      1000035         2                       # UPR    -->  Z4SS   UP                 
      9.49244261E-01    2      1000021         2                       # UPR    -->  GLSS   UP                 
#         PDG         Width
DECAY   2000001  1.23580643E+02   # DNR   decays
#          BR          NDA       ID1       ID2       ID3       ID4
      1.29035404E-02    2      1000022         1                       # DNR    -->  Z1SS   DN                 
      1.17966621E-04    2      1000023         1                       # DNR    -->  Z2SS   DN                 
      2.72408961E-05    2      1000025         1                       # DNR    -->  Z3SS   DN                 
      1.40159638E-04    2      1000035         1                       # DNR    -->  Z4SS   DN                 
      9.86811101E-01    2      1000021         1                       # DNR    -->  GLSS   DN                 
#         PDG         Width
DECAY   2000003  1.23580643E+02   # STR   decays
#          BR          NDA       ID1       ID2       ID3       ID4
      1.29035404E-02    2      1000022         3                       # STR    -->  Z1SS   ST                 
      1.17966621E-04    2      1000023         3                       # STR    -->  Z2SS   ST                 
      2.72408961E-05    2      1000025         3                       # STR    -->  Z3SS   ST                 
      1.40159638E-04    2      1000035         3                       # STR    -->  Z4SS   ST                 
      9.86811101E-01    2      1000021         3                       # STR    -->  GLSS   ST                 
#         PDG         Width
DECAY   2000004  1.28405182E+02   # CHR   decays
#          BR          NDA       ID1       ID2       ID3       ID4
      4.96575795E-02    2      1000022         4                       # CHR    -->  Z1SS   CH                 
      4.53974208E-04    2      1000023         4                       # CHR    -->  Z2SS   CH                 
      1.04830324E-04    2      1000025         4                       # CHR    -->  Z3SS   CH                 
      5.39369648E-04    2      1000035         4                       # CHR    -->  Z4SS   CH                 
      9.49244261E-01    2      1000021         4                       # CHR    -->  GLSS   CH                 
#         PDG         Width
DECAY   2000005  1.23765602E+02   # BT2   decays
#          BR          NDA       ID1       ID2       ID3       ID4
      1.28677124E-02    2      1000022         5                       # BT2    -->  Z1SS   BT                 
      9.68629029E-04    2      1000023         5                       # BT2    -->  Z2SS   BT                 
      3.88699165E-03    2      1000025         5                       # BT2    -->  Z3SS   BT                 
      3.14715342E-03    2      1000035         5                       # BT2    -->  Z4SS   BT                 
      9.70925033E-01    2      1000021         5                       # BT2    -->  GLSS   BT                 
      1.63443142E-03    2     -1000024         6                       # BT2    -->  W1SS-  TP                 
      6.16218103E-03    2     -1000037         6                       # BT2    -->  W2SS-  TP                 
      1.26480518E-06    2          -24   1000006                       # BT2    -->  W-     TP1                
      1.49565472E-04    2          -24   2000006                       # BT2    -->  W-     TP2                
      7.95792366E-05    2           23   1000005                       # BT2    -->  Z0     BT1                
      1.77455848E-04    2           25   1000005                       # BT2    -->  HL0    BT1                
#         PDG         Width
DECAY   2000006  1.49210724E+02   # TP2   decays
#          BR          NDA       ID1       ID2       ID3       ID4
      5.83856225E-01    2      1000021         6                       # TP2    -->  GLSS   TP                 
      1.10808291E-01    2      1000024         5                       # TP2    -->  W1SS+  BT                 
      2.48162169E-02    2      1000037         5                       # TP2    -->  W2SS+  BT                 
      2.89158709E-03    2           23   1000006                       # TP2    -->  Z0     TP1                
      5.90940472E-03    2           25   1000006                       # TP2    -->  HL0    TP1                
      2.01186794E-03    2      1000022         6                       # TP2    -->  Z1SS   TP                 
      6.64481297E-02    2      1000023         6                       # TP2    -->  Z2SS   TP                 
      1.02825142E-01    2      1000025         6                       # TP2    -->  Z3SS   TP                 
      1.00433134E-01    2      1000035         6                       # TP2    -->  Z4SS   TP                 
#         PDG         Width
DECAY   1000011  3.82332573E+01   # EL-   decays
#          BR          NDA       ID1       ID2       ID3       ID4
      7.95450285E-02    2      1000022        11                       # EL-    -->  Z1SS   E-                 
      2.72425801E-01    2      1000023        11                       # EL-    -->  Z2SS   E-                 
      4.16637544E-04    2      1000025        11                       # EL-    -->  Z3SS   E-                 
      4.35513258E-02    2      1000035        11                       # EL-    -->  Z4SS   E-                 
      4.66831625E-01    2     -1000024        12                       # EL-    -->  W1SS-  NUE                
      1.37229607E-01    2     -1000037        12                       # EL-    -->  W2SS-  NUE                
#         PDG         Width
DECAY   1000013  3.82332573E+01   # MUL-  decays
#          BR          NDA       ID1       ID2       ID3       ID4
      7.95450285E-02    2      1000022        13                       # MUL-   -->  Z1SS   MU-                
      2.72425801E-01    2      1000023        13                       # MUL-   -->  Z2SS   MU-                
      4.16637544E-04    2      1000025        13                       # MUL-   -->  Z3SS   MU-                
      4.35513258E-02    2      1000035        13                       # MUL-   -->  Z4SS   MU-                
      4.66831625E-01    2     -1000024        14                       # MUL-   -->  W1SS-  NUM                
      1.37229607E-01    2     -1000037        14                       # MUL-   -->  W2SS-  NUM                
#         PDG         Width
DECAY   1000015  1.56120214E+01   # TAU1- decays
#          BR          NDA       ID1       ID2       ID3       ID4
      8.77979696E-01    2      1000022        15                       # TAU1-  -->  Z1SS   TAU-               
      3.34756523E-02    2      1000023        15                       # TAU1-  -->  Z2SS   TAU-               
      1.75795462E-02    2      1000025        15                       # TAU1-  -->  Z3SS   TAU-               
      1.28826546E-02    2      1000035        15                       # TAU1-  -->  Z4SS   TAU-               
      4.85317148E-02    2     -1000024        16                       # TAU1-  -->  W1SS-  NUT                
      9.55080055E-03    2     -1000037        16                       # TAU1-  -->  W2SS-  NUT                
#         PDG         Width
DECAY   1000012  3.82715683E+01   # NUEL  decays
#          BR          NDA       ID1       ID2       ID3       ID4
      1.03715979E-01    2      1000022        12                       # NUEL   -->  Z1SS   NUE                
      2.15245590E-01    2      1000023        12                       # NUEL   -->  Z2SS   NUE                
      2.31560739E-03    2      1000025        12                       # NUEL   -->  Z3SS   NUE                
      7.36815259E-02    2      1000035        12                       # NUEL   -->  Z4SS   NUE                
      5.23783982E-01    2      1000024        11                       # NUEL   -->  W1SS+  E-                 
      8.12574178E-02    2      1000037        11                       # NUEL   -->  W2SS+  E-                 
#         PDG         Width
DECAY   1000014  3.82715683E+01   # NUML  decays
#          BR          NDA       ID1       ID2       ID3       ID4
      1.03715979E-01    2      1000022        14                       # NUML   -->  Z1SS   NUM                
      2.15245590E-01    2      1000023        14                       # NUML   -->  Z2SS   NUM                
      2.31560739E-03    2      1000025        14                       # NUML   -->  Z3SS   NUM                
      7.36815259E-02    2      1000035        14                       # NUML   -->  Z4SS   NUM                
      5.23783982E-01    2      1000024        13                       # NUML   -->  W1SS+  MU-                
      8.12574178E-02    2      1000037        13                       # NUML   -->  W2SS+  MU-                
#         PDG         Width
DECAY   1000016  3.86723404E+01   # NUTL  decays
#          BR          NDA       ID1       ID2       ID3       ID4
      1.02174498E-01    2      1000022        16                       # NUTL   -->  Z1SS   NUT                
      2.12015286E-01    2      1000023        16                       # NUTL   -->  Z2SS   NUT                
      2.28038058E-03    2      1000025        16                       # NUTL   -->  Z3SS   NUT                
      7.25560412E-02    2      1000035        16                       # NUTL   -->  Z4SS   NUT                
      5.19479990E-01    2      1000024        15                       # NUTL   -->  W1SS+  TAU-               
      9.14938375E-02    2      1000037        15                       # NUTL   -->  W2SS+  TAU-               
      2.29153002E-10    3      1000015        16       -15             # NUTL   -->  TAU1-  NUT    TAU+        
      2.29153002E-10    3      1000015        12       -11             # NUTL   -->  TAU1-  NUE    E+          
      2.29153002E-10    3      1000015        14       -13             # NUTL   -->  TAU1-  NUM    MU+         
      6.87459034E-10    3      1000015         2        -1             # NUTL   -->  TAU1-  UP     DB          
      6.87459034E-10    3      1000015         4        -3             # NUTL   -->  TAU1-  CH     SB          
#         PDG         Width
DECAY   2000011  1.42403536E+01   # ER-   decays
#          BR          NDA       ID1       ID2       ID3       ID4
      9.78403091E-01    2      1000022        11                       # ER-    -->  Z1SS   E-                 
      8.93644150E-03    2      1000023        11                       # ER-    -->  Z2SS   E-                 
      2.06089742E-03    2      1000025        11                       # ER-    -->  Z3SS   E-                 
      1.05994875E-02    2      1000035        11                       # ER-    -->  Z4SS   E-                 
#         PDG         Width
DECAY   2000013  1.42403536E+01   # MUR-  decays
#          BR          NDA       ID1       ID2       ID3       ID4
      9.78403091E-01    2      1000022        13                       # MUR-   -->  Z1SS   MU-                
      8.93644150E-03    2      1000023        13                       # MUR-   -->  Z2SS   MU-                
      2.06089742E-03    2      1000025        13                       # MUR-   -->  Z3SS   MU-                
      1.05994875E-02    2      1000035        13                       # MUR-   -->  Z4SS   MU-                
#         PDG         Width
DECAY   2000015  3.82775497E+01   # TAU2- decays
#          BR          NDA       ID1       ID2       ID3       ID4
      8.21612999E-02    2      1000022        15                       # TAU2-  -->  Z1SS   TAU-               
      2.64073670E-01    2      1000023        15                       # TAU2-  -->  Z2SS   TAU-               
      8.84944294E-03    2      1000025        15                       # TAU2-  -->  Z3SS   TAU-               
      5.31675071E-02    2      1000035        15                       # TAU2-  -->  Z4SS   TAU-               
      4.47717458E-01    2     -1000024        16                       # TAU2-  -->  W1SS-  NUT                
      1.44030616E-01    2     -1000037        16                       # TAU2-  -->  W2SS-  NUT                
#         PDG         Width
DECAY   1000023  3.23981270E-02   # Z2SS  decays
#          BR          NDA       ID1       ID2       ID3       ID4
      2.18754099E-06    2      1000022        22                       # Z2SS   -->  Z1SS   GM                 
      1.07179426E-01    2      1000022        23                       # Z2SS   -->  Z1SS   Z0                 
      5.10648013E-09    3      1000022         2        -2             # Z2SS   -->  Z1SS   UP     UB          
      9.28169008E-09    3      1000022         1        -1             # Z2SS   -->  Z1SS   DN     DB          
      9.28169008E-09    3      1000022         3        -3             # Z2SS   -->  Z1SS   ST     SB          
      5.10647835E-09    3      1000022         4        -4             # Z2SS   -->  Z1SS   CH     CB          
      2.45965044E-08    3      1000022         5        -5             # Z2SS   -->  Z1SS   BT     BB          
      2.29780515E-08    3      1000022        11       -11             # Z2SS   -->  Z1SS   E-     E+          
      2.29780515E-08    3      1000022        13       -13             # Z2SS   -->  Z1SS   MU-    MU+         
      2.50402827E-08    3      1000022        15       -15             # Z2SS   -->  Z1SS   TAU-   TAU+        
      2.24564953E-08    3      1000022        12       -12             # Z2SS   -->  Z1SS   NUE    ANUE        
      2.24564953E-08    3      1000022        14       -14             # Z2SS   -->  Z1SS   NUM    ANUM        
      2.28668462E-08    3      1000022        16       -16             # Z2SS   -->  Z1SS   NUT    ANUT        
      8.92818153E-01    2      1000022        25                       # Z2SS   -->  Z1SS   HL0                
#         PDG         Width
DECAY   1000025  9.23646450E-01   # Z3SS  decays
#          BR          NDA       ID1       ID2       ID3       ID4
      2.81772316E-07    2      1000022        22                       # Z3SS   -->  Z1SS   GM                 
      9.98273322E-07    2      1000023        22                       # Z3SS   -->  Z2SS   GM                 
      2.59241074E-01    2      1000024       -24                       # Z3SS   -->  W1SS+  W-                 
      2.59241074E-01    2     -1000024        24                       # Z3SS   -->  W1SS-  W+                 
      2.62441903E-01    2      1000022        23                       # Z3SS   -->  Z1SS   Z0                 
      1.88259780E-01    2      1000023        23                       # Z3SS   -->  Z2SS   Z0                 
      4.02237792E-11    3      1000022         2        -2             # Z3SS   -->  Z1SS   UP     UB          
      1.68314061E-11    3      1000022         1        -1             # Z3SS   -->  Z1SS   DN     DB          
      1.68314061E-11    3      1000022         3        -3             # Z3SS   -->  Z1SS   ST     SB          
      4.02237410E-11    3      1000022         4        -4             # Z3SS   -->  Z1SS   CH     CB          
      3.20283755E-09    3      1000022         5        -5             # Z3SS   -->  Z1SS   BT     BB          
      7.72405195E-11    3      1000022        11       -11             # Z3SS   -->  Z1SS   E-     E+          
      7.72405195E-11    3      1000022        13       -13             # Z3SS   -->  Z1SS   MU-    MU+         
      2.59299493E-09    3      1000022        15       -15             # Z3SS   -->  Z1SS   TAU-   TAU+        
      5.88060850E-11    3      1000022        12       -12             # Z3SS   -->  Z1SS   NUE    ANUE        
      5.88060850E-11    3      1000022        14       -14             # Z3SS   -->  Z1SS   NUM    ANUM        
      5.98870398E-11    3      1000022        16       -16             # Z3SS   -->  Z1SS   NUT    ANUT        
      6.16564352E-12    3      1000023         2        -2             # Z3SS   -->  Z2SS   UP     UB          
      9.77539317E-12    3      1000023         1        -1             # Z3SS   -->  Z2SS   DN     DB          
      9.77539317E-12    3      1000023         3        -3             # Z3SS   -->  Z2SS   ST     SB          
      6.16564222E-12    3      1000023         4        -4             # Z3SS   -->  Z2SS   CH     CB          
      6.49324317E-10    3      1000023         5        -5             # Z3SS   -->  Z2SS   BT     BB          
      1.18946834E-12    3      1000023        11       -11             # Z3SS   -->  Z2SS   E-     E+          
      1.18946834E-12    3      1000023        13       -13             # Z3SS   -->  Z2SS   MU-    MU+         
      9.38124647E-11    3      1000023        15       -15             # Z3SS   -->  Z2SS   TAU-   TAU+        
      5.11918329E-12    3      1000023        12       -12             # Z3SS   -->  Z2SS   NUE    ANUE        
      5.11918329E-12    3      1000023        14       -14             # Z3SS   -->  Z2SS   NUM    ANUM        
      5.21369406E-12    3      1000023        16       -16             # Z3SS   -->  Z2SS   NUT    ANUT        
      3.04554943E-02    2      1000022        25                       # Z3SS   -->  Z1SS   HL0                
      3.59460886E-04    2      1000023        25                       # Z3SS   -->  Z2SS   HL0                
#         PDG         Width
DECAY   1000035  1.59310389E+00   # Z4SS  decays
#          BR          NDA       ID1       ID2       ID3       ID4
      1.41611466E-07    2      1000022        22                       # Z4SS   -->  Z1SS   GM                 
      3.34529005E-07    2      1000023        22                       # Z4SS   -->  Z2SS   GM                 
      3.08288932E-08    2      1000025        22                       # Z4SS   -->  Z3SS   GM                 
      3.70318741E-01    2      1000024       -24                       # Z4SS   -->  W1SS+  W-                 
      3.70318741E-01    2     -1000024        24                       # Z4SS   -->  W1SS-  W+                 
      2.66040905E-11    3     -1000037         2        -1             # Z4SS   -->  W2SS-  UP     DB          
      8.86802957E-12    3     -1000037        12       -11             # Z4SS   -->  W2SS-  NUE    E+          
      8.86802957E-12    3     -1000037        14       -13             # Z4SS   -->  W2SS-  NUM    MU+         
      2.66040905E-11    3      1000037         1        -2             # Z4SS   -->  W2SS+  DN     UB          
      8.86802957E-12    3      1000037        11       -12             # Z4SS   -->  W2SS+  E-     ANUE        
      8.86802957E-12    3      1000037        13       -14             # Z4SS   -->  W2SS+  MU-    ANUM        
      2.25102548E-02    2      1000022        23                       # Z4SS   -->  Z1SS   Z0                 
      6.28209347E-03    2      1000023        23                       # Z4SS   -->  Z2SS   Z0                 
      9.34584854E-10    3      1000022         2        -2             # Z4SS   -->  Z1SS   UP     UB          
      1.39110046E-09    3      1000022         1        -1             # Z4SS   -->  Z1SS   DN     DB          
      1.39110046E-09    3      1000022         3        -3             # Z4SS   -->  Z1SS   ST     SB          
      9.34584188E-10    3      1000022         4        -4             # Z4SS   -->  Z1SS   CH     CB          
      4.25354152E-09    3      1000022         5        -5             # Z4SS   -->  Z1SS   BT     BB          
      2.71472733E-09    3      1000022        11       -11             # Z4SS   -->  Z1SS   E-     E+          
      2.71472733E-09    3      1000022        13       -13             # Z4SS   -->  Z1SS   MU-    MU+         
      4.36537206E-09    3      1000022        15       -15             # Z4SS   -->  Z1SS   TAU-   TAU+        
      4.22655955E-09    3      1000022        12       -12             # Z4SS   -->  Z1SS   NUE    ANUE        
      4.22655955E-09    3      1000022        14       -14             # Z4SS   -->  Z1SS   NUM    ANUM        
      4.30425695E-09    3      1000022        16       -16             # Z4SS   -->  Z1SS   NUT    ANUT        
      1.72203518E-09    3      1000023         2        -2             # Z4SS   -->  Z2SS   UP     UB          
      1.89346294E-09    3      1000023         1        -1             # Z4SS   -->  Z2SS   DN     DB          
      1.89346294E-09    3      1000023         3        -3             # Z4SS   -->  Z2SS   ST     SB          
      1.72203440E-09    3      1000023         4        -4             # Z4SS   -->  Z2SS   CH     CB          
      4.63507543E-09    3      1000023         5        -5             # Z4SS   -->  Z2SS   BT     BB          
      5.68070646E-10    3      1000023        11       -11             # Z4SS   -->  Z2SS   E-     E+          
      5.68070646E-10    3      1000023        13       -13             # Z4SS   -->  Z2SS   MU-    MU+         
      6.38230357E-10    3      1000023        15       -15             # Z4SS   -->  Z2SS   TAU-   TAU+        
      7.60321972E-10    3      1000023        12       -12             # Z4SS   -->  Z2SS   NUE    ANUE        
      7.60321972E-10    3      1000023        14       -14             # Z4SS   -->  Z2SS   NUM    ANUM        
      7.74375342E-10    3      1000023        16       -16             # Z4SS   -->  Z2SS   NUT    ANUT        
      1.53934866E-06    3      1000025         2        -2             # Z4SS   -->  Z3SS   UP     UB          
      1.98522548E-06    3      1000025         1        -1             # Z4SS   -->  Z3SS   DN     DB          
      1.98522548E-06    3      1000025         3        -3             # Z4SS   -->  Z3SS   ST     SB          
      1.53934866E-06    3      1000025         4        -4             # Z4SS   -->  Z3SS   CH     CB          
      1.46137245E-06    3      1000025         5        -5             # Z4SS   -->  Z3SS   BT     BB          
      4.50335335E-07    3      1000025        11       -11             # Z4SS   -->  Z3SS   E-     E+          
      4.50335335E-07    3      1000025        13       -13             # Z4SS   -->  Z3SS   MU-    MU+         
      4.28239730E-07    3      1000025        15       -15             # Z4SS   -->  Z3SS   TAU-   TAU+        
      8.95921687E-07    3      1000025        12       -12             # Z4SS   -->  Z3SS   NUE    ANUE        
      8.95921687E-07    3      1000025        14       -14             # Z4SS   -->  Z3SS   NUM    ANUM        
      8.95921005E-07    3      1000025        16       -16             # Z4SS   -->  Z3SS   NUT    ANUT        
      1.16298683E-01    2      1000022        25                       # Z4SS   -->  Z1SS   HL0                
      1.14258282E-01    2      1000023        25                       # Z4SS   -->  Z2SS   HL0                
#         PDG         Width
DECAY   1000024  3.20905596E-02   # W1SS+ decays
#          BR          NDA       ID1       ID2       ID3       ID4
      1.45354528E-08    3      1000022         2        -1             # W1SS+  -->  Z1SS   UP     DB          
      1.45354511E-08    3      1000022         4        -3             # W1SS+  -->  Z1SS   CH     SB          
      4.88212848E-08    3      1000022       -11        12             # W1SS+  -->  Z1SS   E+     NUE         
      4.88212848E-08    3      1000022       -13        14             # W1SS+  -->  Z1SS   MU+    NUM         
      5.14245997E-08    3      1000022       -15        16             # W1SS+  -->  Z1SS   TAU+   NUT         
      9.99999762E-01    2      1000022        24                       # W1SS+  -->  Z1SS   W+                 
      7.40337125E-10    3      1000023         2        -1             # W1SS+  -->  Z2SS   UP     DB          
      2.46787812E-10    3      1000023       -11        12             # W1SS+  -->  Z2SS   E+     NUE         
      2.46787812E-10    3      1000023       -13        14             # W1SS+  -->  Z2SS   MU+    NUM         
#         PDG         Width
DECAY   1000037  1.24094403E+00   # W2SS+ decays
#          BR          NDA       ID1       ID2       ID3       ID4
      2.20982455E-09    3      1000022         2        -1             # W2SS+  -->  Z1SS   UP     DB          
      2.20982432E-09    3      1000022         4        -3             # W2SS+  -->  Z1SS   CH     SB          
      6.60080390E-09    3      1000022       -11        12             # W2SS+  -->  Z1SS   E+     NUE         
      6.60080390E-09    3      1000022       -13        14             # W2SS+  -->  Z1SS   MU+    NUM         
      8.79117756E-09    3      1000022       -15        16             # W2SS+  -->  Z1SS   TAU+   NUT         
      1.42335951E-01    2      1000022        24                       # W2SS+  -->  Z1SS   W+                 
      1.44893664E-09    3      1000023         2        -1             # W2SS+  -->  Z2SS   UP     DB          
      1.44893619E-09    3      1000023         4        -3             # W2SS+  -->  Z2SS   CH     SB          
      5.82561166E-10    3      1000023       -11        12             # W2SS+  -->  Z2SS   E+     NUE         
      5.82561166E-10    3      1000023       -13        14             # W2SS+  -->  Z2SS   MU+    NUM         
      7.74307507E-10    3      1000023       -15        16             # W2SS+  -->  Z2SS   TAU+   NUT         
      3.72747988E-01    2      1000023        24                       # W2SS+  -->  Z2SS   W+                 
      4.75322213E-06    3      1000025         2        -1             # W2SS+  -->  Z3SS   UP     DB          
      4.75322213E-06    3      1000025         4        -3             # W2SS+  -->  Z3SS   CH     SB          
      1.58436796E-06    3      1000025       -11        12             # W2SS+  -->  Z3SS   E+     NUE         
      1.58436796E-06    3      1000025       -13        14             # W2SS+  -->  Z3SS   MU+    NUM         
      1.58440207E-06    3      1000025       -15        16             # W2SS+  -->  Z3SS   TAU+   NUT         
      3.10525090E-01    2      1000024        23                       # W2SS+  -->  W1SS+  Z0                 
      2.11069451E-09    3      1000024         1        -1             # W2SS+  -->  W1SS+  DN     DB          
      2.11069406E-09    3      1000024         3        -3             # W2SS+  -->  W1SS+  ST     SB          
      3.16530935E-09    3      1000024         2        -2             # W2SS+  -->  W1SS+  UP     UB          
      3.16530935E-09    3      1000024         4        -4             # W2SS+  -->  W1SS+  CH     CB          
      1.17372323E-09    3      1000024        12       -12             # W2SS+  -->  W1SS+  NUE    ANUE        
      1.17372323E-09    3      1000024        14       -14             # W2SS+  -->  W1SS+  NUM    ANUM        
      1.22813804E-09    3      1000024        16       -16             # W2SS+  -->  W1SS+  NUT    ANUT        
      7.81647913E-10    3      1000024        11       -11             # W2SS+  -->  W1SS+  E-     E+          
      7.81647913E-10    3      1000024        13       -13             # W2SS+  -->  W1SS+  MU-    MU+         
      7.96097133E-10    3      1000024        15       -15             # W2SS+  -->  W1SS+  TAU-   TAU+        
      1.74376637E-01    2      1000024        25                       # W2SS+  -->  W1SS+  HL0                
#         PDG         Width
DECAY        25  4.17830888E-03   # HL0   decays
#          BR          NDA       ID1       ID2       ID3       ID4
      4.76996753E-09    2           11       -11                       # HL0    -->  E-     E+                 
      2.01395655E-04    2           13       -13                       # HL0    -->  MU-    MU+                
      5.76027930E-02    2           15       -15                       # HL0    -->  TAU-   TAU+               
      5.98552333E-06    2            1        -1                       # HL0    -->  DN     DB                 
      2.41845124E-03    2            3        -3                       # HL0    -->  ST     SB                 
      7.91213334E-01    2            5        -5                       # HL0    -->  BT     BB                 
      1.90489516E-06    2            2        -2                       # HL0    -->  UP     UB                 
      3.57809402E-02    2            4        -4                       # HL0    -->  CH     CB                 
      1.90119562E-03    2           22        22                       # HL0    -->  GM     GM                 
      3.98719534E-02    2           21        21                       # HL0    -->  GL     GL                 
      3.64859495E-03    3           24        11       -12             # HL0    -->  W+     E-     ANUE        
      3.64859495E-03    3           24        13       -14             # HL0    -->  W+     MU-    ANUM        
      3.64859495E-03    3           24        15       -16             # HL0    -->  W+     TAU-   ANUT        
      1.09457849E-02    3           24        -2         1             # HL0    -->  W+     UB     DN          
      1.09457849E-02    3           24        -4         3             # HL0    -->  W+     CB     ST          
      3.64859495E-03    3          -24       -11        12             # HL0    -->  W-     E+     NUE         
      3.64859495E-03    3          -24       -13        14             # HL0    -->  W-     MU+    NUM         
      3.64859495E-03    3          -24       -15        16             # HL0    -->  W-     TAU+   NUT         
      1.09457849E-02    3          -24         2        -1             # HL0    -->  W-     UP     DB          
      1.09457849E-02    3          -24         4        -3             # HL0    -->  W-     CH     SB          
      3.64341628E-04    3           23        12       -12             # HL0    -->  Z0     NUE    ANUE        
      3.64341628E-04    3           23        14       -14             # HL0    -->  Z0     NUM    ANUM        
      3.64341628E-04    3           23        16       -16             # HL0    -->  Z0     NUT    ANUT        
      1.83369484E-04    3           23        11       -11             # HL0    -->  Z0     E-     E+          
      1.83369484E-04    3           23        13       -13             # HL0    -->  Z0     MU-    MU+         
      1.83369484E-04    3           23        15       -15             # HL0    -->  Z0     TAU-   TAU+        
      6.28208276E-04    3           23         2        -2             # HL0    -->  Z0     UP     UB          
      6.28208276E-04    3           23         4        -4             # HL0    -->  Z0     CH     CB          
      8.09287129E-04    3           23         1        -1             # HL0    -->  Z0     DN     DB          
      8.09287129E-04    3           23         3        -3             # HL0    -->  Z0     ST     SB          
      8.09287129E-04    3           23         5        -5             # HL0    -->  Z0     BT     BB          
#         PDG         Width
DECAY        35  4.18207779E+01   # HH0   decays
#          BR          NDA       ID1       ID2       ID3       ID4
      1.15176635E-09    2           11       -11                       # HH0    -->  E-     E+                 
      4.86296558E-05    2           13       -13                       # HH0    -->  MU-    MU+                
      1.39282458E-02    2           15       -15                       # HH0    -->  TAU-   TAU+               
      1.39997871E-06    2            1        -1                       # HH0    -->  DN     DB                 
      5.65662223E-04    2            3        -3                       # HH0    -->  ST     SB                 
      7.34344274E-02    2            5        -5                       # HH0    -->  BT     BB                 
      4.50364919E-11    2            2        -2                       # HH0    -->  UP     UB                 
      5.64752099E-07    2            4        -4                       # HH0    -->  CH     CB                 
      2.92934049E-02    2            6        -6                       # HH0    -->  TP     TB                 
      1.06305826E-07    2           22        22                       # HH0    -->  GM     GM                 
      6.24024551E-06    2           21        21                       # HH0    -->  GL     GL                 
      1.25447605E-05    2           24       -24                       # HH0    -->  W+     W-                 
      6.43020894E-06    2           23        23                       # HH0    -->  Z0     Z0                 
      2.90199462E-03    2      1000022   1000022                       # HH0    -->  Z1SS   Z1SS               
      2.27619614E-02    2      1000022   1000023                       # HH0    -->  Z1SS   Z2SS               
      5.18939011E-02    2      1000022   1000025                       # HH0    -->  Z1SS   Z3SS               
      1.68115329E-02    2      1000022   1000035                       # HH0    -->  Z1SS   Z4SS               
      3.79506052E-02    2      1000023   1000023                       # HH0    -->  Z2SS   Z2SS               
      1.05087936E-01    2      1000023   1000025                       # HH0    -->  Z2SS   Z3SS               
      2.26948950E-02    2      1000023   1000035                       # HH0    -->  Z2SS   Z4SS               
      2.27725483E-03    2      1000025   1000025                       # HH0    -->  Z3SS   Z3SS               
      5.05192801E-02    2      1000025   1000035                       # HH0    -->  Z3SS   Z4SS               
      3.56805585E-02    2      1000035   1000035                       # HH0    -->  Z4SS   Z4SS               
      9.06423107E-02    2      1000024  -1000024                       # HH0    -->  W1SS+  W1SS-              
      3.77618484E-02    2      1000037  -1000037                       # HH0    -->  W2SS+  W2SS-              
      2.02836484E-01    2      1000024  -1000037                       # HH0    -->  W1SS+  W2SS-              
      2.02836484E-01    2     -1000024   1000037                       # HH0    -->  W1SS-  W2SS+              
      4.52318600E-05    2           25        25                       # HH0    -->  HL0    HL0                
#         PDG         Width
DECAY        36  4.15215378E+01   # HA0   decays
#          BR          NDA       ID1       ID2       ID3       ID4
      1.15251975E-09    2           11       -11                       # HA0    -->  E-     E+                 
      4.86614626E-05    2           13       -13                       # HA0    -->  MU-    MU+                
      1.39373783E-02    2           15       -15                       # HA0    -->  TAU-   TAU+               
      1.40095722E-06    2            1        -1                       # HA0    -->  DN     DB                 
      5.66057628E-04    2            3        -3                       # HA0    -->  ST     SB                 
      7.34861270E-02    2            5        -5                       # HA0    -->  BT     BB                 
      4.48261601E-11    2            2        -2                       # HA0    -->  UP     UB                 
      5.62509115E-07    2            4        -4                       # HA0    -->  CH     CB                 
      2.95044128E-02    2            6        -6                       # HA0    -->  TP     TB                 
      3.14295079E-07    2           22        22                       # HA0    -->  GM     GM                 
      1.01305613E-05    2           21        21                       # HA0    -->  GL     GL                 
      3.55452532E-03    2      1000022   1000022                       # HA0    -->  Z1SS   Z1SS               
      3.05199325E-02    2      1000022   1000023                       # HA0    -->  Z1SS   Z2SS               
      3.27379405E-02    2      1000022   1000025                       # HA0    -->  Z1SS   Z3SS               
      2.82844380E-02    2      1000022   1000035                       # HA0    -->  Z1SS   Z4SS               
      5.42986915E-02    2      1000023   1000023                       # HA0    -->  Z2SS   Z2SS               
      6.28866106E-02    2      1000023   1000025                       # HA0    -->  Z2SS   Z3SS               
      3.96226421E-02    2      1000023   1000035                       # HA0    -->  Z2SS   Z4SS               
      1.66500255E-03    2      1000025   1000025                       # HA0    -->  Z3SS   Z3SS               
      3.39385159E-02    2      1000025   1000035                       # HA0    -->  Z3SS   Z4SS               
      6.09699003E-02    2      1000035   1000035                       # HA0    -->  Z4SS   Z4SS               
      1.27199277E-01    2      1000024  -1000024                       # HA0    -->  W1SS+  W1SS-              
      7.32318982E-02    2      1000037  -1000037                       # HA0    -->  W2SS+  W2SS-              
      1.66761518E-01    2      1000024  -1000037                       # HA0    -->  W1SS+  W2SS-              
      1.66761518E-01    2     -1000024   1000037                       # HA0    -->  W1SS-  W2SS+              
      1.25080323E-05    2           25        23                       # HA0    -->  HL0    Z0                 
#         PDG         Width
DECAY        37  4.14635582E+01   # H+    decays
#          BR          NDA       ID1       ID2       ID3       ID4
      1.16226617E-09    2           12       -11                       # H+     -->  NUE    E+                 
      4.90729726E-05    2           14       -13                       # H+     -->  NUM    MU+                
      1.40552409E-02    2           16       -15                       # H+     -->  NUT    TAU+               
      1.30878800E-06    2            2        -1                       # H+     -->  UP     DB                 
      5.29324578E-04    2            4        -3                       # H+     -->  CH     SB                 
      9.55451205E-02    2            6        -5                       # H+     -->  TP     BB                 
      4.60902080E-02    2      1000024   1000022                       # H+     -->  W1SS+  Z1SS               
      2.09225647E-04    2      1000024   1000023                       # H+     -->  W1SS+  Z2SS               
      2.12370455E-01    2      1000024   1000025                       # H+     -->  W1SS+  Z3SS               
      2.38528892E-01    2      1000024   1000035                       # H+     -->  W1SS+  Z4SS               
      3.45836580E-02    2      1000037   1000022                       # H+     -->  W2SS+  Z1SS               
      3.04506779E-01    2      1000037   1000023                       # H+     -->  W2SS+  Z2SS               
      5.18971495E-02    2      1000037   1000025                       # H+     -->  W2SS+  Z3SS               
      1.62099674E-03    2      1000037   1000035                       # H+     -->  W2SS+  Z4SS               
      1.26357945E-05    2           25        24                       # H+     -->  HL0    W+                 
