#  ISAJET SUSY parameters in SUSY Les Houches Accord 2 format
#  Created by ISALHA 2.0 Last revision: C. Balazs 21 Apr 2009
Block SPINFO   # Program information
     1   ISASUGRA from ISAJET          # Spectrum Calculator
     2   7.80   29-OCT-2009 12:50:36   # Version number
Block MODSEL   # Model selection
     1     1   # Minimal supergravity (mSUGRA) model               
Block SMINPUTS   # Standard Model inputs
     1     1.27835930E+02   # alpha_em^(-1)
     2     1.16570000E-05   # G_Fermi
     3     1.17200002E-01   # alpha_s(M_Z)
     4     9.11699982E+01   # m_{Z}(pole)
     5     4.19999981E+00   # m_{b}(m_{b})
     6     1.72500000E+02   # m_{top}(pole)
     7     1.77699995E+00   # m_{tau}(pole)
Block MINPAR   # SUSY breaking input parameters
     1     2.00000000E+02   # m_0
     2     1.60000000E+02   # m_{1/2}
     3     4.00000000E+01   # tan(beta)
     4     1.00000000E+00   # sign(mu)
     5     0.00000000E+00   # A_0
Block EXTPAR   # Non-universal SUSY breaking parameters
     0     2.67385830E+16   # Input scale
Block MASS   # Scalar and gaugino mass spectrum
#  PDG code   mass                 particle
        24     8.04229965E+01   #  W^+
        25     1.06316902E+02   #  h^0            
        35     2.22698959E+02   #  H^0            
        36     2.21303757E+02   #  A^0            
        37     2.38082230E+02   #  H^+            
   1000001     4.25595886E+02   #  dnl            
   1000002     4.17566071E+02   #  upl            
   1000003     4.25595947E+02   #  stl            
   1000004     4.17568390E+02   #  chl            
   1000005     3.44806702E+02   #  b1             
   1000006     2.92994629E+02   #  t1             
   1000011     2.31938385E+02   #  el-            
   1000012     2.17337997E+02   #  nuel           
   1000013     2.31938400E+02   #  mul-           
   1000014     2.17337997E+02   #  numl           
   1000015     1.44931808E+02   #  tau1           
   1000016     2.00156281E+02   #  nutl           
   1000021     4.13385895E+02   #  glss           
   1000022     5.97180786E+01   #  z1ss           
   1000023     1.06063713E+02   #  z2ss           
   1000024     1.05521065E+02   #  w1ss           
   1000025    -2.24531097E+02   #  z3ss           
   1000035     2.48260864E+02   #  z4ss           
   1000037     2.49144745E+02   #  w2ss           
   2000001     4.11637054E+02   #  dnr            
   2000002     4.10243500E+02   #  upr            
   2000003     4.11637115E+02   #  str            
   2000004     4.10245880E+02   #  chr            
   2000005     4.00654633E+02   #  b2             
   2000006     4.34045166E+02   #  t2             
   2000011     2.12849243E+02   #  er-            
   2000013     2.12849274E+02   #  mur-           
   2000015     2.37131073E+02   #  tau2           
Block ALPHA   # Effective Higgs mixing parameter
         -2.94087995E-02   # alpha
Block STOPMIX   # stop mixing matrix
  1  1     5.97106993E-01   # O_{11}
  1  2     8.02161574E-01   # O_{12}
  2  1    -8.02161574E-01   # O_{21}
  2  2     5.97106993E-01   # O_{22}
Block SBOTMIX   # sbottom mixing matrix
  1  1     7.66466618E-01   # O_{11}
  1  2     6.42284155E-01   # O_{12}
  2  1    -6.42284155E-01   # O_{21}
  2  2     7.66466618E-01   # O_{22}
Block STAUMIX   # stau mixing matrix
  1  1     5.23969650E-01   # O_{11}
  1  2     8.51736963E-01   # O_{12}
  2  1    -8.51736963E-01   # O_{21}
  2  2     5.23969650E-01   # O_{22}
Block NMIX   # neutralino mixing matrix
  1  1     9.58513200E-01   #
  1  2    -1.03078045E-01   #
  1  3     2.54430711E-01   #
  1  4    -7.67634660E-02   #
  2  1    -2.10323602E-01   #
  2  2    -8.80667031E-01   #
  2  3     3.76290709E-01   #
  2  4    -1.96455985E-01   #
  3  1    -1.05583705E-01   #
  3  2     1.54832736E-01   #
  3  3     6.75619066E-01   #
  3  4     7.13034272E-01   #
  4  1    -1.60837680E-01   #
  4  2     4.35691923E-01   #
  4  3     5.80697358E-01   #
  4  4    -6.68651223E-01   #
Block UMIX   # chargino U mixing matrix
  1  1    -8.22510540E-01   # U_{11}
  1  2     5.68749845E-01   # U_{12}
  2  1    -5.68749845E-01   # U_{21}
  2  2    -8.22510540E-01   # U_{22}
Block VMIX   # chargino V mixing matrix
  1  1    -9.55235839E-01   # V_{11}
  1  2     2.95845330E-01   # V_{12}
  2  1    -2.95845330E-01   # V_{21}
  2  2    -9.55235839E-01   # V_{22}
Block GAUGE Q=  3.25819916E+02   #
     1     3.57523531E-01   # g`
     2     6.52391136E-01   # g_2
     3     1.21934354E+00   # g_3
Block YU Q=  3.25819916E+02   #
  3  3     8.93227100E-01   # y_t
Block YD Q=  3.25819916E+02   #
  3  3     5.08448243E-01   # y_b
Block YE Q=  3.25819916E+02   #
  3  3     4.21674460E-01   # y_tau
Block HMIX Q=  3.25819916E+02   # Higgs mixing parameters
     1     2.13244049E+02   # mu(Q)
     2     4.00000000E+01   # tan(beta)(M_GUT)
     3     2.49878433E+02   # Higgs vev at Q
     4     4.89753516E+04   # m_A^2(Q)
Block MSOFT Q=  3.25819916E+02   # DRbar SUSY breaking parameters
     1     6.40313416E+01   # M_1(Q)          
     2     1.22050125E+02   # M_2(Q)          
     3     3.84485779E+02   # M_3(Q)          
    31     2.26662338E+02   # MeL(Q)          
    32     2.26662338E+02   # MmuL(Q)         
    33     2.10393829E+02   # MtauL(Q)        
    34     2.08180832E+02   # MeR(Q)          
    35     2.08180832E+02   # MmuR(Q)         
    36     1.70632492E+02   # MtauR(Q)        
    41     4.01078094E+02   # MqL1(Q)         
    42     4.01078094E+02   # MqL2(Q)         
    43     3.48075317E+02   # MqL3(Q)         
    44     3.91923157E+02   # MuR(Q)          
    45     3.91923157E+02   # McR(Q)          
    46     3.04987488E+02   # MtR(Q)          
    47     3.90830292E+02   # MdR(Q)          
    48     3.90830292E+02   # MsR(Q)          
    49     3.63208466E+02   # MbR(Q)          
Block AU Q=  3.25819916E+02   #
  1  1    -3.04780731E+02   # A_u
  2  2    -3.04780731E+02   # A_c
  3  3    -3.04780731E+02   # A_t
Block AD Q=  3.25819916E+02   #
  1  1    -4.09437012E+02   # A_d
  2  2    -4.09437012E+02   # A_s
  3  3    -4.09437012E+02   # A_b
Block AE Q=  3.25819916E+02   #
  1  1    -5.72714653E+01   # A_e
  2  2    -5.72714653E+01   # A_mu
  3  3    -5.72714653E+01   # A_tau
#  ISAJET decay tables in SUSY Les Houches accord format
#  Created by ISALHD. Last revision: C. Balazs, 2005 May 25
Block DCINFO                           # Program information
     1   ISASUGRA from ISAJET          # Spectrum Calculator
     2   7.80   29-OCT-2009 12:50:36   # Version number
#         PDG         Width
DECAY         6  1.14680779E+00   # TP    decays
#          BR          NDA       ID1       ID2       ID3       ID4
      3.33333343E-01    3            2        -1         5             # TP     -->  UP     DB     BT          
      3.33333343E-01    3            4        -3         5             # TP     -->  CH     SB     BT          
      1.11111112E-01    3          -11        12         5             # TP     -->  E+     NUE    BT          
      1.11111112E-01    3          -13        14         5             # TP     -->  MU+    NUM    BT          
      1.11111112E-01    3          -15        16         5             # TP     -->  TAU+   NUT    BT          
#         PDG         Width
DECAY   1000021  9.96832013E-01   # GLSS  decays
#          BR          NDA       ID1       ID2       ID3       ID4
      7.04039726E-03    3      1000024         1        -2             # GLSS   -->  W1SS+  DN     UB          
      7.04039726E-03    3     -1000024         2        -1             # GLSS   -->  W1SS-  UP     DB          
      7.03997584E-03    3      1000024         3        -4             # GLSS   -->  W1SS+  ST     CB          
      7.03997584E-03    3     -1000024         4        -3             # GLSS   -->  W1SS-  CH     SB          
      1.78822040E-04    3      1000024         5        -6             # GLSS   -->  W1SS+  BT     TB          
      1.78822040E-04    3     -1000024         6        -5             # GLSS   -->  W1SS-  TP     BB          
      3.98171658E-04    3      1000037         1        -2             # GLSS   -->  W2SS+  DN     UB          
      3.98171658E-04    3     -1000037         2        -1             # GLSS   -->  W2SS-  UP     DB          
      3.98155127E-04    3      1000037         3        -4             # GLSS   -->  W2SS+  ST     CB          
      3.98155127E-04    3     -1000037         4        -3             # GLSS   -->  W2SS-  CH     SB          
      2.80109962E-05    2      1000022        21                       # GLSS   -->  Z1SS   GL                 
      2.94375695E-05    3      1000022         2        -2             # GLSS   -->  Z1SS   UP     UB          
      3.33483535E-04    3      1000022         1        -1             # GLSS   -->  Z1SS   DN     DB          
      3.33482923E-04    3      1000022         3        -3             # GLSS   -->  Z1SS   ST     SB          
      2.94348119E-05    3      1000022         4        -4             # GLSS   -->  Z1SS   CH     CB          
      1.17766342E-06    3      1000022         6        -6             # GLSS   -->  Z1SS   TP     TB          
      1.99140286E-05    2      1000023        21                       # GLSS   -->  Z2SS   GL                 
      4.70472174E-03    3      1000023         2        -2             # GLSS   -->  Z2SS   UP     UB          
      3.02693294E-03    3      1000023         1        -1             # GLSS   -->  Z2SS   DN     DB          
      3.02692875E-03    3      1000023         3        -3             # GLSS   -->  Z2SS   ST     SB          
      4.70427843E-03    3      1000023         4        -4             # GLSS   -->  Z2SS   CH     CB          
      1.91679894E-04    2      1000025        21                       # GLSS   -->  Z3SS   GL                 
      9.17141224E-05    3      1000025         2        -2             # GLSS   -->  Z3SS   UP     UB          
      1.13722432E-04    3      1000025         1        -1             # GLSS   -->  Z3SS   DN     DB          
      1.13722221E-04    3      1000025         3        -3             # GLSS   -->  Z3SS   ST     SB          
      9.17047946E-05    3      1000025         4        -4             # GLSS   -->  Z3SS   CH     CB          
      1.69853578E-04    2      1000035        21                       # GLSS   -->  Z4SS   GL                 
      7.79290334E-04    3      1000035         2        -2             # GLSS   -->  Z4SS   UP     UB          
      7.58073293E-04    3      1000035         1        -1             # GLSS   -->  Z4SS   DN     DB          
      7.58071896E-04    3      1000035         3        -3             # GLSS   -->  Z4SS   ST     SB          
      7.79207796E-04    3      1000035         4        -4             # GLSS   -->  Z4SS   CH     CB          
      1.20439811E-03    2     -2000002         2                       # GLSS   -->  UBR    UP                 
      1.20439811E-03    2      2000002        -2                       # GLSS   -->  UPR    UB                 
      3.74291674E-04    2     -2000001         1                       # GLSS   -->  DBR    DN                 
      3.74291674E-04    2      2000001        -1                       # GLSS   -->  DNR    DB                 
      3.71855567E-04    2     -2000003         3                       # GLSS   -->  SBR    ST                 
      3.71855567E-04    2      2000003        -3                       # GLSS   -->  STR    SB                 
      1.08652015E-03    2     -2000004         4                       # GLSS   -->  CBR    CH                 
      1.08652015E-03    2      2000004        -4                       # GLSS   -->  CHR    CB                 
      4.47087646E-01    2     -1000005         5                       # GLSS   -->  BB1    BT                 
      4.47087646E-01    2      1000005        -5                       # GLSS   -->  BT1    BB                 
      2.47773603E-02    2     -2000005         5                       # GLSS   -->  BB2    BT                 
      2.47773603E-02    2      2000005        -5                       # GLSS   -->  BT2    BB                 
#         PDG         Width
DECAY   1000002  4.39590931E+00   # UPL   decays
#          BR          NDA       ID1       ID2       ID3       ID4
      2.01815204E-03    2      1000022         2                       # UPL    -->  Z1SS   UP                 
      2.95650721E-01    2      1000023         2                       # UPL    -->  Z2SS   UP                 
      3.70910973E-03    2      1000025         2                       # UPL    -->  Z3SS   UP                 
      2.75794193E-02    2      1000035         2                       # UPL    -->  Z4SS   UP                 
      2.54273391E-03    2      1000021         2                       # UPL    -->  GLSS   UP                 
      6.39472008E-01    2      1000024         1                       # UPL    -->  W1SS+  DN                 
      2.90279482E-02    2      1000037         1                       # UPL    -->  W2SS+  DN                 
#         PDG         Width
DECAY   1000001  4.17576218E+00   # DNL   decays
#          BR          NDA       ID1       ID2       ID3       ID4
      3.20204273E-02    2      1000022         1                       # DNL    -->  Z1SS   DN                 
      2.67635196E-01    2      1000023         1                       # DNL    -->  Z2SS   DN                 
      6.77846232E-03    2      1000025         1                       # DNL    -->  Z3SS   DN                 
      4.04026844E-02    2      1000035         1                       # DNL    -->  Z4SS   DN                 
      2.19412353E-02    2      1000021         1                       # DNL    -->  GLSS   DN                 
      5.11305392E-01    2     -1000024         2                       # DNL    -->  W1SS-  UP                 
      1.19916588E-01    2     -1000037         2                       # DNL    -->  W2SS-  UP                 
#         PDG         Width
DECAY   1000003  4.17569160E+00   # STL   decays
#          BR          NDA       ID1       ID2       ID3       ID4
      3.20209712E-02    2      1000022         3                       # STL    -->  Z1SS   ST                 
      2.67639756E-01    2      1000023         3                       # STL    -->  Z2SS   ST                 
      6.77857734E-03    2      1000025         3                       # STL    -->  Z3SS   ST                 
      4.04033810E-02    2      1000035         3                       # STL    -->  Z4SS   ST                 
      2.19417922E-02    2      1000021         3                       # STL    -->  GLSS   ST                 
      5.11302412E-01    2     -1000024         4                       # STL    -->  W1SS-  CH                 
      1.19913094E-01    2     -1000037         4                       # STL    -->  W2SS-  CH                 
#         PDG         Width
DECAY   1000004  4.39531326E+00   # CHL   decays
#          BR          NDA       ID1       ID2       ID3       ID4
      2.01839418E-03    2      1000022         4                       # CHL    -->  Z1SS   CH                 
      2.95685887E-01    2      1000023         4                       # CHL    -->  Z2SS   CH                 
      3.70951393E-03    2      1000025         4                       # CHL    -->  Z3SS   CH                 
      2.75822692E-02    2      1000035         4                       # CHL    -->  Z4SS   CH                 
      2.40834476E-03    2      1000021         4                       # CHL    -->  GLSS   CH                 
      6.39563143E-01    2      1000024         3                       # CHL    -->  W1SS+  ST                 
      2.90323999E-02    2      1000037         3                       # CHL    -->  W2SS+  ST                 
#         PDG         Width
DECAY   1000005  2.57115889E+00   # BT1   decays
#          BR          NDA       ID1       ID2       ID3       ID4
      1.85395762E-01    2      1000022         5                       # BT1    -->  Z1SS   BT                 
      4.17391479E-01    2      1000023         5                       # BT1    -->  Z2SS   BT                 
      8.13610256E-02    2      1000025         5                       # BT1    -->  Z3SS   BT                 
      2.72568073E-02    2      1000035         5                       # BT1    -->  Z4SS   BT                 
      2.88594961E-01    2     -1000024         6                       # BT1    -->  W1SS-  TP                 
#         PDG         Width
DECAY   1000006  2.05009985E+00   # TP1   decays
#          BR          NDA       ID1       ID2       ID3       ID4
      8.12069103E-02    2      1000022         6                       # TP1    -->  Z1SS   TP                 
      5.64400144E-02    2      1000023         6                       # TP1    -->  Z2SS   TP                 
      7.86177933E-01    2      1000024         5                       # TP1    -->  W1SS+  BT                 
      7.61751011E-02    2      1000037         5                       # TP1    -->  W2SS+  BT                 
#         PDG         Width
DECAY   2000002  8.66733849E-01   # UPR   decays
#          BR          NDA       ID1       ID2       ID3       ID4
      9.41814303E-01    2      1000022         2                       # UPR    -->  Z1SS   UP                 
      4.12153006E-02    2      1000023         2                       # UPR    -->  Z2SS   UP                 
      5.85221220E-03    2      1000025         2                       # UPR    -->  Z3SS   UP                 
      1.11182183E-02    2      1000035         2                       # UPR    -->  Z4SS   UP                 
#         PDG         Width
DECAY   2000001  2.17514440E-01   # DNR   decays
#          BR          NDA       ID1       ID2       ID3       ID4
      9.41678882E-01    2      1000022         1                       # DNR    -->  Z1SS   DN                 
      4.12372164E-02    2      1000023         1                       # DNR    -->  Z2SS   DN                 
      5.88352559E-03    2      1000025         1                       # DNR    -->  Z3SS   DN                 
      1.12003470E-02    2      1000035         1                       # DNR    -->  Z4SS   DN                 
#         PDG         Width
DECAY   2000003  2.17514485E-01   # STR   decays
#          BR          NDA       ID1       ID2       ID3       ID4
      9.41678882E-01    2      1000022         3                       # STR    -->  Z1SS   ST                 
      4.12372202E-02    2      1000023         3                       # STR    -->  Z2SS   ST                 
      5.88352652E-03    2      1000025         3                       # STR    -->  Z3SS   ST                 
      1.12003498E-02    2      1000035         3                       # STR    -->  Z4SS   ST                 
#         PDG         Width
DECAY   2000004  8.66719663E-01   # CHR   decays
#          BR          NDA       ID1       ID2       ID3       ID4
      9.41814542E-01    2      1000022         4                       # CHR    -->  Z1SS   CH                 
      4.12152559E-02    2      1000023         4                       # CHR    -->  Z2SS   CH                 
      5.85214049E-03    2      1000025         4                       # CHR    -->  Z3SS   CH                 
      1.11180153E-02    2      1000035         4                       # CHR    -->  Z4SS   CH                 
#         PDG         Width
DECAY   2000005  1.66451299E+00   # BT2   decays
#          BR          NDA       ID1       ID2       ID3       ID4
      8.81884806E-03    2      1000022         5                       # BT2    -->  Z1SS   BT                 
      1.35592371E-01    2      1000023         5                       # BT2    -->  Z2SS   BT                 
      3.41646969E-01    2      1000025         5                       # BT2    -->  Z3SS   BT                 
      3.28969449E-01    2      1000035         5                       # BT2    -->  Z4SS   BT                 
      7.77513459E-02    2     -1000024         6                       # BT2    -->  W1SS-  TP                 
      1.07220963E-01    2          -24   1000006                       # BT2    -->  W-     TP1                
#         PDG         Width
DECAY   2000006  5.78764105E+00   # TP2   decays
#          BR          NDA       ID1       ID2       ID3       ID4
      2.24450767E-01    2      1000024         5                       # TP2    -->  W1SS+  BT                 
      3.74088287E-01    2      1000037         5                       # TP2    -->  W2SS+  BT                 
      7.47714117E-02    2           23   1000006                       # TP2    -->  Z0     TP1                
      1.31377690E-02    2           25   1000006                       # TP2    -->  HL0    TP1                
      1.39790922E-02    2           24   1000005                       # TP2    -->  W+     BT1                
      2.12365426E-02    2      1000022         6                       # TP2    -->  Z1SS   TP                 
      5.94309010E-02    2      1000023         6                       # TP2    -->  Z2SS   TP                 
      3.97660285E-02    2      1000025         6                       # TP2    -->  Z3SS   TP                 
      1.79139242E-01    2      1000035         6                       # TP2    -->  Z4SS   TP                 
#         PDG         Width
DECAY   1000011  1.58972454E+00   # EL-   decays
#          BR          NDA       ID1       ID2       ID3       ID4
      9.61358100E-02    2      1000022        11                       # EL-    -->  Z1SS   E-                 
      3.81274581E-01    2      1000023        11                       # EL-    -->  Z2SS   E-                 
      2.27342116E-05    2      1000025        11                       # EL-    -->  Z3SS   E-                 
      5.22566617E-01    2     -1000024        12                       # EL-    -->  W1SS-  NUE                
      1.22492835E-07    3      1000015        11       -15             # EL-    -->  TAU1-  E-     TAU+        
      1.61993157E-07    3     -1000015        11        15             # EL-    -->  TAU1+  E-     TAU-        
#         PDG         Width
DECAY   1000013  1.58972418E+00   # MUL-  decays
#          BR          NDA       ID1       ID2       ID3       ID4
      9.61357802E-02    2      1000022        13                       # MUL-   -->  Z1SS   MU-                
      3.81274432E-01    2      1000023        13                       # MUL-   -->  Z2SS   MU-                
      2.27319597E-05    2      1000025        13                       # MUL-   -->  Z3SS   MU-                
      5.22566736E-01    2     -1000024        14                       # MUL-   -->  W1SS-  NUM                
      1.22492992E-07    3      1000015        13       -15             # MUL-   -->  TAU1-  MU-    TAU+        
      1.61993384E-07    3     -1000015        13        15             # MUL-   -->  TAU1+  MU-    TAU-        
#         PDG         Width
DECAY   1000015  6.75465703E-01   # TAU1- decays
#          BR          NDA       ID1       ID2       ID3       ID4
      6.48069084E-01    2      1000022        15                       # TAU1-  -->  Z1SS   TAU-               
      1.30002916E-01    2      1000023        15                       # TAU1-  -->  Z2SS   TAU-               
      2.21927986E-01    2     -1000024        16                       # TAU1-  -->  W1SS-  NUT                
#         PDG         Width
DECAY   1000012  1.59625149E+00   # NUEL  decays
#          BR          NDA       ID1       ID2       ID3       ID4
      1.94357157E-01    2      1000022        12                       # NUEL   -->  Z1SS   NUE                
      1.94705814E-01    2      1000023        12                       # NUEL   -->  Z2SS   NUE                
      6.10936463E-01    2      1000024        11                       # NUEL   -->  W1SS+  E-                 
      3.29372028E-07    3      1000015        12       -15             # NUEL   -->  TAU1-  NUE    TAU+        
      8.04740594E-08    3     -1000015        12        15             # NUEL   -->  TAU1+  NUE    TAU-        
      1.65411237E-07    3     -1000015        11        16             # NUEL   -->  TAU1+  E-     NUT         
#         PDG         Width
DECAY   1000014  1.59625065E+00   # NUML  decays
#          BR          NDA       ID1       ID2       ID3       ID4
      1.94357246E-01    2      1000022        14                       # NUML   -->  Z1SS   NUM                
      1.94705918E-01    2      1000023        14                       # NUML   -->  Z2SS   NUM                
      6.10936224E-01    2      1000024        13                       # NUML   -->  W1SS+  MU-                
      3.29372199E-07    3      1000015        14       -15             # NUML   -->  TAU1-  NUM    TAU+        
      8.04741020E-08    3     -1000015        14        15             # NUML   -->  TAU1+  NUM    TAU-        
      1.65662669E-07    3     -1000015        13        16             # NUML   -->  TAU1+  MU-    NUT         
#         PDG         Width
DECAY   1000016  1.44628644E+00   # NUTL  decays
#          BR          NDA       ID1       ID2       ID3       ID4
      1.91816807E-01    2      1000022        16                       # NUTL   -->  Z1SS   NUT                
      1.76371619E-01    2      1000023        16                       # NUTL   -->  Z2SS   NUT                
      6.31587982E-01    2      1000024        15                       # NUTL   -->  W1SS+  TAU-               
      8.57900702E-08    3     -1000015        16        15             # NUTL   -->  TAU1+  NUT    TAU-        
      2.48394208E-05    3      1000015        16       -15             # NUTL   -->  TAU1-  NUT    TAU+        
      2.48243887E-05    3      1000015        12       -11             # NUTL   -->  TAU1-  NUE    E+          
      2.48243887E-05    3      1000015        14       -13             # NUTL   -->  TAU1-  NUM    MU+         
      7.44731660E-05    3      1000015         2        -1             # NUTL   -->  TAU1-  UP     DB          
      7.44731660E-05    3      1000015         4        -3             # NUTL   -->  TAU1-  CH     SB          
#         PDG         Width
DECAY   2000011  8.71275663E-01   # ER-   decays
#          BR          NDA       ID1       ID2       ID3       ID4
      9.68942046E-01    2      1000022        11                       # ER-    -->  Z1SS   E-                 
      3.10578924E-02    2      1000023        11                       # ER-    -->  Z2SS   E-                 
      2.74329004E-08    3      1000015        11       -15             # ER-    -->  TAU1-  E-     TAU+        
      8.06322547E-08    3     -1000015        11        15             # ER-    -->  TAU1+  E-     TAU-        
      2.45908594E-15    3      1000015        12       -16             # ER-    -->  TAU1-  NUE    ANUT        
#         PDG         Width
DECAY   2000013  8.71275365E-01   # MUR-  decays
#          BR          NDA       ID1       ID2       ID3       ID4
      9.68942046E-01    2      1000022        13                       # MUR-   -->  Z1SS   MU-                
      3.10578849E-02    2      1000023        13                       # MUR-   -->  Z2SS   MU-                
      2.74330123E-08    3      1000015        13       -15             # MUR-   -->  TAU1-  MU-    TAU+        
      8.06325389E-08    3     -1000015        13        15             # MUR-   -->  TAU1+  MU-    TAU-        
      1.04050428E-10    3      1000015        14       -16             # MUR-   -->  TAU1-  NUM    ANUT        
#         PDG         Width
DECAY   2000015  1.03942120E+00   # TAU2- decays
#          BR          NDA       ID1       ID2       ID3       ID4
      3.00576448E-01    2      1000022        15                       # TAU2-  -->  Z1SS   TAU-               
      3.76940101E-01    2      1000023        15                       # TAU2-  -->  Z2SS   TAU-               
      4.55883937E-03    2      1000025        15                       # TAU2-  -->  Z3SS   TAU-               
      3.17297071E-01    2     -1000024        16                       # TAU2-  -->  W1SS-  NUT                
      6.27441623E-04    2           23   1000015                       # TAU2-  -->  Z0     TAU1-              
#         PDG         Width
DECAY   1000023  4.86111730E-06   # Z2SS  decays
#          BR          NDA       ID1       ID2       ID3       ID4
      4.08752263E-03    2      1000022        22                       # Z2SS   -->  Z1SS   GM                 
      7.24686906E-02    3      1000022         2        -2             # Z2SS   -->  Z1SS   UP     UB          
      1.01643942E-01    3      1000022         1        -1             # Z2SS   -->  Z1SS   DN     DB          
      1.01643927E-01    3      1000022         3        -3             # Z2SS   -->  Z1SS   ST     SB          
      7.24686012E-02    3      1000022         4        -4             # Z2SS   -->  Z1SS   CH     CB          
      1.71617121E-01    3      1000022         5        -5             # Z2SS   -->  Z1SS   BT     BB          
      4.44852456E-04    3      1000022        11       -11             # Z2SS   -->  Z1SS   E-     E+          
      4.44855366E-04    3      1000022        13       -13             # Z2SS   -->  Z1SS   MU-    MU+         
      4.72229123E-01    3      1000022        15       -15             # Z2SS   -->  Z1SS   TAU-   TAU+        
      1.33261329E-03    3      1000022        12       -12             # Z2SS   -->  Z1SS   NUE    ANUE        
      1.33261329E-03    3      1000022        14       -14             # Z2SS   -->  Z1SS   NUM    ANUM        
      2.86133814E-04    3      1000022        16       -16             # Z2SS   -->  Z1SS   NUT    ANUT        
#         PDG         Width
DECAY   1000025  6.93386376E-01   # Z3SS  decays
#          BR          NDA       ID1       ID2       ID3       ID4
      4.19826790E-07    2      1000022        22                       # Z3SS   -->  Z1SS   GM                 
      1.43677809E-07    2      1000023        22                       # Z3SS   -->  Z2SS   GM                 
      2.88134962E-01    2      1000024       -24                       # Z3SS   -->  W1SS+  W-                 
      2.88134962E-01    2     -1000024        24                       # Z3SS   -->  W1SS-  W+                 
      1.46471888E-01    2      1000022        23                       # Z3SS   -->  Z1SS   Z0                 
      1.13129042E-01    2      1000023        23                       # Z3SS   -->  Z2SS   Z0                 
      6.85466190E-08    3      1000022         2        -2             # Z3SS   -->  Z1SS   UP     UB          
      4.86758864E-08    3      1000022         1        -1             # Z3SS   -->  Z1SS   DN     DB          
      4.86758402E-08    3      1000022         3        -3             # Z3SS   -->  Z1SS   ST     SB          
      6.85447290E-08    3      1000022         4        -4             # Z3SS   -->  Z1SS   CH     CB          
      1.42506717E-04    3      1000022         5        -5             # Z3SS   -->  Z1SS   BT     BB          
      5.22436380E-07    3      1000022        11       -11             # Z3SS   -->  Z1SS   E-     E+          
      5.22435869E-07    3      1000022        13       -13             # Z3SS   -->  Z1SS   MU-    MU+         
      7.27703446E-05    3      1000022        15       -15             # Z3SS   -->  Z1SS   TAU-   TAU+        
      9.76577397E-08    3      1000023         2        -2             # Z3SS   -->  Z2SS   UP     UB          
      1.22273164E-07    3      1000023         1        -1             # Z3SS   -->  Z2SS   DN     DB          
      1.22273093E-07    3      1000023         3        -3             # Z3SS   -->  Z2SS   ST     SB          
      9.76550609E-08    3      1000023         4        -4             # Z3SS   -->  Z2SS   CH     CB          
      5.71629207E-05    3      1000023         5        -5             # Z3SS   -->  Z2SS   BT     BB          
      1.24119413E-06    3      1000023        11       -11             # Z3SS   -->  Z2SS   E-     E+          
      1.24119288E-06    3      1000023        13       -13             # Z3SS   -->  Z2SS   MU-    MU+         
      5.92468677E-05    3      1000023        15       -15             # Z3SS   -->  Z2SS   TAU-   TAU+        
      2.91474797E-02    2      1000022        25                       # Z3SS   -->  Z1SS   HL0                
      3.95089528E-03    2      1000023        25                       # Z3SS   -->  Z2SS   HL0                
      9.42974584E-05    2      2000011       -11                       # Z3SS   -->  ER-    E+                 
      9.42974584E-05    2     -2000011        11                       # Z3SS   -->  ER+    E-                 
      9.42934057E-05    2      2000013       -13                       # Z3SS   -->  MUR-   MU+                
      9.42934057E-05    2     -2000013        13                       # Z3SS   -->  MUR+   MU-                
      6.36111125E-02    2      1000015       -15                       # Z3SS   -->  TAU1-  TAU+               
      6.36111125E-02    2     -1000015        15                       # Z3SS   -->  TAU1+  TAU-               
      1.22744095E-04    2      1000012       -12                       # Z3SS   -->  NUEL   ANUE               
      1.22744095E-04    2     -1000012        12                       # Z3SS   -->  ANUEL  NUE                
      1.22744095E-04    2      1000014       -14                       # Z3SS   -->  NUML   ANUM               
      1.22744095E-04    2     -1000014        14                       # Z3SS   -->  ANUML  NUM                
      1.30197441E-03    2      1000016       -16                       # Z3SS   -->  NUTL   ANUT               
      1.30197441E-03    2     -1000016        16                       # Z3SS   -->  ANUTL  NUT                
#         PDG         Width
DECAY   1000035  1.04707265E+00   # Z4SS  decays
#          BR          NDA       ID1       ID2       ID3       ID4
      2.14260311E-07    2      1000022        22                       # Z4SS   -->  Z1SS   GM                 
      1.51507322E-08    2      1000023        22                       # Z4SS   -->  Z2SS   GM                 
      1.18283152E-08    2      1000025        22                       # Z4SS   -->  Z3SS   GM                 
      3.29869151E-01    2      1000024       -24                       # Z4SS   -->  W1SS+  W-                 
      3.29869151E-01    2     -1000024        24                       # Z4SS   -->  W1SS-  W+                 
      4.19349670E-02    2      1000022        23                       # Z4SS   -->  Z1SS   Z0                 
      2.52244584E-02    2      1000023        23                       # Z4SS   -->  Z2SS   Z0                 
      4.27769891E-07    3      1000022         2        -2             # Z4SS   -->  Z1SS   UP     UB          
      8.11017287E-07    3      1000022         1        -1             # Z4SS   -->  Z1SS   DN     DB          
      8.11016548E-07    3      1000022         3        -3             # Z4SS   -->  Z1SS   ST     SB          
      4.27757897E-07    3      1000022         4        -4             # Z4SS   -->  Z1SS   CH     CB          
      9.25453423E-05    3      1000022         5        -5             # Z4SS   -->  Z1SS   BT     BB          
      1.54729951E-05    3      1000022        15       -15             # Z4SS   -->  Z1SS   TAU-   TAU+        
      3.42351836E-06    3      1000023         2        -2             # Z4SS   -->  Z2SS   UP     UB          
      3.41960413E-06    3      1000023         1        -1             # Z4SS   -->  Z2SS   DN     DB          
      3.41960185E-06    3      1000023         3        -3             # Z4SS   -->  Z2SS   ST     SB          
      3.42342355E-06    3      1000023         4        -4             # Z4SS   -->  Z2SS   CH     CB          
      4.48445207E-05    3      1000023         5        -5             # Z4SS   -->  Z2SS   BT     BB          
      3.77721040E-06    3      1000023        15       -15             # Z4SS   -->  Z2SS   TAU-   TAU+        
      6.13248233E-07    3      1000025         2        -2             # Z4SS   -->  Z3SS   UP     UB          
      8.06321452E-07    3      1000025         1        -1             # Z4SS   -->  Z3SS   DN     DB          
      8.06321452E-07    3      1000025         3        -3             # Z4SS   -->  Z3SS   ST     SB          
      6.13248233E-07    3      1000025         4        -4             # Z4SS   -->  Z3SS   CH     CB          
      5.54159271E-07    3      1000025         5        -5             # Z4SS   -->  Z3SS   BT     BB          
      1.80963710E-07    3      1000025        11       -11             # Z4SS   -->  Z3SS   E-     E+          
      1.80963710E-07    3      1000025        13       -13             # Z4SS   -->  Z3SS   MU-    MU+         
      1.69962433E-07    3      1000025        15       -15             # Z4SS   -->  Z3SS   TAU-   TAU+        
      3.60060852E-07    3      1000025        12       -12             # Z4SS   -->  Z3SS   NUE    ANUE        
      3.60060852E-07    3      1000025        14       -14             # Z4SS   -->  Z3SS   NUM    ANUM        
      3.60060852E-07    3      1000025        16       -16             # Z4SS   -->  Z3SS   NUT    ANUT        
      7.42177144E-02    2      1000022        25                       # Z4SS   -->  Z1SS   HL0                
      8.27690288E-02    2      1000023        25                       # Z4SS   -->  Z2SS   HL0                
      9.73387505E-04    2      1000011       -11                       # Z4SS   -->  EL-    E+                 
      9.73387505E-04    2     -1000011        11                       # Z4SS   -->  EL+    E-                 
      9.73366783E-04    2      1000013       -13                       # Z4SS   -->  MUL-   MU+                
      9.73366783E-04    2     -1000013        13                       # Z4SS   -->  MUL+   MU-                
      1.09482242E-03    2      2000011       -11                       # Z4SS   -->  ER-    E+                 
      1.09482242E-03    2     -2000011        11                       # Z4SS   -->  ER+    E-                 
      1.09481672E-03    2      2000013       -13                       # Z4SS   -->  MUR-   MU+                
      1.09481672E-03    2     -2000013        13                       # Z4SS   -->  MUR+   MU-                
      2.00841594E-02    2      1000015       -15                       # Z4SS   -->  TAU1-  TAU+               
      2.00841594E-02    2     -1000015        15                       # Z4SS   -->  TAU1+  TAU-               
      1.99971674E-03    2      2000015       -15                       # Z4SS   -->  TAU2-  TAU+               
      1.99971674E-03    2     -2000015        15                       # Z4SS   -->  TAU2+  TAU-               
      7.47960247E-03    2      1000012       -12                       # Z4SS   -->  NUEL   ANUE               
      7.47960247E-03    2     -1000012        12                       # Z4SS   -->  ANUEL  NUE                
      7.47960247E-03    2      1000014       -14                       # Z4SS   -->  NUML   ANUM               
      7.47960247E-03    2     -1000014        14                       # Z4SS   -->  ANUML  NUM                
      1.67892966E-02    2      1000016       -16                       # Z4SS   -->  NUTL   ANUT               
      1.67892966E-02    2     -1000016        16                       # Z4SS   -->  ANUTL  NUT                
#         PDG         Width
DECAY   1000024  1.96517976E-05   # W1SS+ decays
#          BR          NDA       ID1       ID2       ID3       ID4
      3.03758383E-01    3      1000022         2        -1             # W1SS+  -->  Z1SS   UP     DB          
      3.03758383E-01    3      1000022         4        -3             # W1SS+  -->  Z1SS   CH     SB          
      9.56650078E-02    3      1000022       -11        12             # W1SS+  -->  Z1SS   E+     NUE         
      9.56650078E-02    3      1000022       -13        14             # W1SS+  -->  Z1SS   MU+    NUM         
      2.01153234E-01    3      1000022       -15        16             # W1SS+  -->  Z1SS   TAU+   NUT         
#         PDG         Width
DECAY   1000037  8.65599453E-01   # W2SS+ decays
#          BR          NDA       ID1       ID2       ID3       ID4
      1.23741563E-06    3      1000022         2        -1             # W2SS+  -->  Z1SS   UP     DB          
      1.23741324E-06    3      1000022         4        -3             # W2SS+  -->  Z1SS   CH     SB          
      2.19048593E-06    3      1000022       -15        16             # W2SS+  -->  Z1SS   TAU+   NUT         
      7.35082328E-02    2      1000022        24                       # W2SS+  -->  Z1SS   W+                 
      3.93480013E-06    3      1000023         2        -1             # W2SS+  -->  Z2SS   UP     DB          
      3.93478240E-06    3      1000023         4        -3             # W2SS+  -->  Z2SS   CH     SB          
      3.59480291E-05    3      1000023       -15        16             # W2SS+  -->  Z2SS   TAU+   NUT         
      4.20341730E-01    2      1000023        24                       # W2SS+  -->  Z2SS   W+                 
      3.48176513E-06    3      1000025         2        -1             # W2SS+  -->  Z3SS   UP     DB          
      3.48176513E-06    3      1000025         4        -3             # W2SS+  -->  Z3SS   CH     SB          
      1.15562443E-06    3      1000025       -11        12             # W2SS+  -->  Z3SS   E+     NUE         
      1.15562443E-06    3      1000025       -13        14             # W2SS+  -->  Z3SS   MU+    NUM         
      1.15710179E-06    3      1000025       -15        16             # W2SS+  -->  Z3SS   TAU+   NUT         
      1.24288085E-13    3      1000035       -11        12             # W2SS+  -->  Z4SS   E+     NUE         
      1.24288085E-13    3      1000035       -13        14             # W2SS+  -->  Z4SS   MU+    NUM         
      6.05869526E-03    2      1000012       -11                       # W2SS+  -->  NUEL   E+                 
      6.05866639E-03    2      1000014       -13                       # W2SS+  -->  NUML   MU+                
      5.49279004E-02    2      1000016       -15                       # W2SS+  -->  NUTL   TAU+               
      6.96949009E-03    2     -1000011        12                       # W2SS+  -->  EL+    NUE                
      6.96947658E-03    2     -1000013        14                       # W2SS+  -->  MUL+   NUM                
      1.31490948E-02    2     -1000015        16                       # W2SS+  -->  TAU1+  NUT                
      6.27405848E-03    2     -2000015        16                       # W2SS+  -->  TAU2+  NUT                
      2.66461253E-01    2      1000024        23                       # W2SS+  -->  W1SS+  Z0                 
      3.50911068E-06    3      1000024         1        -1             # W2SS+  -->  W1SS+  DN     DB          
      3.50901223E-06    3      1000024         3        -3             # W2SS+  -->  W1SS+  ST     SB          
      8.74025773E-06    3      1000024         2        -2             # W2SS+  -->  W1SS+  UP     UB          
      8.74025136E-06    3      1000024         4        -4             # W2SS+  -->  W1SS+  CH     CB          
      1.39197916E-01    2      1000024        25                       # W2SS+  -->  W1SS+  HL0                
#         PDG         Width
DECAY        25  4.85914899E-03   # HL0   decays
#          BR          NDA       ID1       ID2       ID3       ID4
      5.14701837E-09    2           11       -11                       # HL0    -->  E-     E+                 
      2.17315115E-04    2           13       -13                       # HL0    -->  MU-    MU+                
      6.21384457E-02    2           15       -15                       # HL0    -->  TAU-   TAU+               
      6.46777698E-06    2            1        -1                       # HL0    -->  DN     DB                 
      2.61330535E-03    2            3        -3                       # HL0    -->  ST     SB                 
      8.66256595E-01    2            5        -5                       # HL0    -->  BT     BB                 
      1.49463813E-06    2            2        -2                       # HL0    -->  UP     UB                 
      2.84797456E-02    2            4        -4                       # HL0    -->  CH     CB                 
      1.11597171E-03    2           22        22                       # HL0    -->  GM     GM                 
      2.73416657E-02    2           21        21                       # HL0    -->  GL     GL                 
      6.35400647E-04    3           24        11       -12             # HL0    -->  W+     E-     ANUE        
      6.35400647E-04    3           24        13       -14             # HL0    -->  W+     MU-    ANUM        
      6.35400647E-04    3           24        15       -16             # HL0    -->  W+     TAU-   ANUT        
      1.90620206E-03    3           24        -2         1             # HL0    -->  W+     UB     DN          
      1.90620206E-03    3           24        -4         3             # HL0    -->  W+     CB     ST          
      6.35400647E-04    3          -24       -11        12             # HL0    -->  W-     E+     NUE         
      6.35400647E-04    3          -24       -13        14             # HL0    -->  W-     MU+    NUM         
      6.35400647E-04    3          -24       -15        16             # HL0    -->  W-     TAU+   NUT         
      1.90620206E-03    3          -24         2        -1             # HL0    -->  W-     UP     DB          
      1.90620206E-03    3          -24         4        -3             # HL0    -->  W-     CH     SB          
      2.68071417E-05    3           23        12       -12             # HL0    -->  Z0     NUE    ANUE        
      2.68071417E-05    3           23        14       -14             # HL0    -->  Z0     NUM    ANUM        
      2.68071417E-05    3           23        16       -16             # HL0    -->  Z0     NUT    ANUT        
      1.34917645E-05    3           23        11       -11             # HL0    -->  Z0     E-     E+          
      1.34917645E-05    3           23        13       -13             # HL0    -->  Z0     MU-    MU+         
      1.34917645E-05    3           23        15       -15             # HL0    -->  Z0     TAU-   TAU+        
      4.62216449E-05    3           23         2        -2             # HL0    -->  Z0     UP     UB          
      4.62216449E-05    3           23         4        -4             # HL0    -->  Z0     CH     CB          
      5.95448655E-05    3           23         1        -1             # HL0    -->  Z0     DN     DB          
      5.95448655E-05    3           23         3        -3             # HL0    -->  Z0     ST     SB          
      5.95448655E-05    3           23         5        -5             # HL0    -->  Z0     BT     BB          
#         PDG         Width
DECAY        35  6.29777861E+00   # HH0   decays
#          BR          NDA       ID1       ID2       ID3       ID4
      9.61256674E-09    2           11       -11                       # HH0    -->  E-     E+                 
      4.05859348E-04    2           13       -13                       # HH0    -->  MU-    MU+                
      1.16200097E-01    2           15       -15                       # HH0    -->  TAU-   TAU+               
      1.19552760E-05    2            1        -1                       # HH0    -->  DN     DB                 
      4.83053504E-03    2            3        -3                       # HH0    -->  ST     SB                 
      8.62610042E-01    2            5        -5                       # HH0    -->  BT     BB                 
      2.06895373E-12    2            2        -2                       # HH0    -->  UP     UB                 
      3.53552032E-08    2            4        -4                       # HH0    -->  CH     CB                 
      2.20634561E-07    2           22        22                       # HH0    -->  GM     GM                 
      5.28894925E-05    2           21        21                       # HH0    -->  GL     GL                 
      5.24786265E-06    2           24       -24                       # HH0    -->  W+     W-                 
      2.18436753E-06    2           23        23                       # HH0    -->  Z0     Z0                 
      4.51221457E-03    2      1000022   1000022                       # HH0    -->  Z1SS   Z1SS               
      7.87001662E-03    2      1000022   1000023                       # HH0    -->  Z1SS   Z2SS               
      6.74415845E-04    2      1000023   1000023                       # HH0    -->  Z2SS   Z2SS               
      2.78293202E-03    2      1000024  -1000024                       # HH0    -->  W1SS+  W1SS-              
      4.13786584E-05    2           25        25                       # HH0    -->  HL0    HL0                
#         PDG         Width
DECAY        36  6.53212595E+00   # HA0   decays
#          BR          NDA       ID1       ID2       ID3       ID4
      9.21185528E-09    2           11       -11                       # HA0    -->  E-     E+                 
      3.88940971E-04    2           13       -13                       # HA0    -->  MU-    MU+                
      1.11384340E-01    2           15       -15                       # HA0    -->  TAU-   TAU+               
      1.14578170E-05    2            1        -1                       # HA0    -->  DN     DB                 
      4.62953886E-03    2            3        -3                       # HA0    -->  ST     SB                 
      8.27637076E-01    2            5        -5                       # HA0    -->  BT     BB                 
      1.43208394E-12    2            2        -2                       # HA0    -->  UP     UB                 
      2.44949927E-08    2            4        -4                       # HA0    -->  CH     CB                 
      1.79234803E-07    2           22        22                       # HA0    -->  GM     GM                 
      9.07799258E-05    2           21        21                       # HA0    -->  GL     GL                 
      6.25677966E-03    2      1000022   1000022                       # HA0    -->  Z1SS   Z1SS               
      1.67982411E-02    2      1000022   1000023                       # HA0    -->  Z1SS   Z2SS               
      6.90911291E-03    2      1000023   1000023                       # HA0    -->  Z2SS   Z2SS               
      2.58925967E-02    2      1000024  -1000024                       # HA0    -->  W1SS+  W1SS-              
      9.72716066E-07    2           25        23                       # HA0    -->  HL0    Z0                 
#         PDG         Width
DECAY        37  2.14596057E+00   # H+    decays
#          BR          NDA       ID1       ID2       ID3       ID4
      3.01660279E-08    2           12       -11                       # H+     -->  NUE    E+                 
      1.27366371E-03    2           14       -13                       # H+     -->  NUM    MU+                
      3.64756286E-01    2           16       -15                       # H+     -->  NUT    TAU+               
      3.39678481E-05    2            2        -1                       # H+     -->  UP     DB                 
      1.37238977E-02    2            4        -3                       # H+     -->  CH     SB                 
      5.47164738E-01    2            6        -5                       # H+     -->  TP     BB                 
      7.08699450E-02    2      1000024   1000022                       # H+     -->  W1SS+  Z1SS               
      2.16808473E-03    2      1000024   1000023                       # H+     -->  W1SS+  Z2SS               
      9.34830041E-06    2           25        24                       # H+     -->  HL0    W+                 
