  65
    6    171.4000    4.75466e-25
   12    171.4000    4.75466e-25
  203    118.4841    4.11808e-22
  204   1241.9884    1.96913e-25
  205   1242.4602    1.96643e-25
  206   1245.1618    2.05724e-25
  207   1245.1618    2.05724e-25
  401   3042.4980    2.53654e-26
  402   3027.6136    2.55166e-26
  403   3042.4928    2.53654e-26
  404   3027.6083    2.55166e-26
  405   2887.0106    7.93777e-26
  406   2722.1669    1.06991e-26
  407   3042.4980    2.53654e-26
  408   3027.6136    2.55166e-26
  409   3042.4928    2.53654e-26
  410   3027.6083    2.55166e-26
  411   2887.0106    7.93777e-26
  412   2722.1669    1.06991e-26
  413   2903.7869    4.31754e-25
  414   2914.5420    1.07500e-25
  415   2903.7782    4.31754e-25
  416   2914.5405    1.07500e-25
  417   2933.1569    1.15957e-26
  418   2930.4436    1.13912e-26
  419   2903.7869    4.31754e-25
  420   2914.5420    1.07500e-25
  421   2903.7782    4.31754e-25
  422   2914.5405    1.07500e-25
  423   2933.1569    1.15957e-26
  424   2930.4436    1.13912e-26
  429    443.9291    1.00000e+30
  430    949.1105    7.48246e-25
  427    471.8846    1.46091e-16
  428    951.2205    1.83342e-24
  425    471.9166    1.45242e-16
  426    951.2272    1.84089e-24
  435    443.9291    1.00000e+30
  436    949.1105    7.48246e-25
  433    471.8846    1.46091e-16
  434    951.2205    1.83342e-24
  431    471.9166    1.45242e-16
  432    951.2272    1.84089e-24
  437    942.1999    8.11214e-25
  438      0.0000    1.00000e+30
  439    954.6389    1.94352e-24
  440      0.0000    1.00000e+30
  441    954.8128    1.95088e-24
  442      0.0000    1.00000e+30
  443    942.1999    8.11214e-25
  444      0.0000    1.00000e+30
  445    954.6389    1.94352e-24
  446      0.0000    1.00000e+30
  447    954.8128    1.95088e-24
  448      0.0000    1.00000e+30
  449   3211.8213    3.31460e-26
  450    656.0387    2.53488e-25
  451    892.1601    8.78744e-25
  452   -898.3997    1.12950e-24
  453   1267.6590    5.02988e-26
  454    899.3349    1.07134e-24
  455   1267.6317    5.03880e-26
  456    899.3349    1.07134e-24
  457   1267.6317    5.03880e-26
  458      0.0000    1.00000e+30
   0
   0
   8
   203  6.32105835e-01     0     5    11     0     0     0
   203  1.53549437e-01     0   131   125     0     0     0
   203  5.59419688e-04     0   129   123     0     0     0
   203  1.22031744e-03     0     3     9     0     0     0
   203  5.16055055e-02     0     4    10     0     0     0
   203  1.54193608e-01     0    13    13     0     0     0
   203  4.70753486e-03     0    59    59     0     0     0
   203  2.05834311e-03     0    59   200     0     0     0
  15
   204  9.65990526e-06     0   429   435     0     0     0
   204  7.41032527e-06     0   427   433     0     0     0
   204  7.40558076e-06     0   425   431     0     0     0
   204  6.77673269e-01     0     5    11     0     0     0
   204  2.75566033e-01     0   131   125     0     0     0
   204  1.00265767e-03     0   129   123     0     0     0
   204  1.41472437e-03     0     3     9     0     0     0
   204  4.80375393e-07     0     4    10     0     0     0
   204  4.37113341e-02     0     6    12     0     0     0
   204  4.30983703e-05     0    13    13     0     0     0
   204  1.64608583e-07     0    59    59     0     0     0
   204  5.05877173e-08     0   200    59     0     0     0
   204  1.10291115e-04     0   198   199     0     0     0
   204  5.47493476e-05     0   200   200     0     0     0
   204  3.98671696e-04     0   203   203     0     0     0
  10
   205  6.77084897e-01     0     5    11     0     0     0
   205  2.75317749e-01     0   131   125     0     0     0
   205  1.00174633e-03     0   129   123     0     0     0
   205  1.41361210e-03     0     3     9     0     0     0
   205  4.70133283e-07     0     4    10     0     0     0
   205  4.48965522e-02     0     6    12     0     0     0
   205  1.76114517e-04     0    13    13     0     0     0
   205  5.25303279e-07     0    59    59     0     0     0
   205  1.35266463e-07     0   200    59     0     0     0
   205  1.08197778e-04     0   200   203     0     0     0
   8
   206  1.06798214e-03     0     4    11     0     0     0
   206  2.88658696e-01     0   131   126     0     0     0
   206  1.05028748e-03     0   129   124     0     0     0
   206  6.83504132e-06     0     2    11     0     0     0
   206  7.06833498e-05     0     2     9     0     0     0
   206  1.45425501e-03     0     4     9     0     0     0
   206  7.07576881e-01     0     6    11     0     0     0
   206  1.14379637e-04     0   198   203     0     0     0
   8
   207  1.06798214e-03     0    10     5     0     0     0
   207  2.88658696e-01     0   125   132     0     0     0
   207  1.05028748e-03     0   123   130     0     0     0
   207  6.83504132e-06     0     8     5     0     0     0
   207  7.06833498e-05     0     8     3     0     0     0
   207  1.45425501e-03     0    10     3     0     0     0
   207  7.07576881e-01     0    12     5     0     0     0
   207  1.14379637e-04     0   199   203     0     0     0
   6
   401  1.70852279e-02     0   450     1     0     0     0
   401  6.50516900e-03     0   451     1     0     0     0
   401  3.10012662e-04     0   452     1     0     0     0
   401  3.19982277e-01     0   453     1     0     0     0
   401  1.39797062e-02     0   456     2     0     0     0
   401  6.42137607e-01     0   457     2     0     0     0
   6
   402  1.33703386e-02     0   450     2     0     0     0
   402  1.29566021e-02     0   451     2     0     0     0
   402  1.70968133e-04     0   452     2     0     0     0
   402  3.16892367e-01     0   453     2     0     0     0
   402  2.54001082e-02     0   454     1     0     0     0
   402  6.31209616e-01     0   455     1     0     0     0
   6
   403  1.70852279e-02     0   450     3     0     0     0
   403  6.50516900e-03     0   451     3     0     0     0
   403  3.10012662e-04     0   452     3     0     0     0
   403  3.19982277e-01     0   453     3     0     0     0
   403  1.39797062e-02     0   456     4     0     0     0
   403  6.42137607e-01     0   457     4     0     0     0
   6
   404  1.33703386e-02     0   450     4     0     0     0
   404  1.29566021e-02     0   451     4     0     0     0
   404  1.70968133e-04     0   452     4     0     0     0
   404  3.16892367e-01     0   453     4     0     0     0
   404  2.54001082e-02     0   454     3     0     0     0
   404  6.31209616e-01     0   455     3     0     0     0
   7
   405  1.91985358e-01     0   450     5     0     0     0
   405  1.84047738e-01     0   451     5     0     0     0
   405  1.73098536e-01     0   452     5     0     0     0
   405  6.55189062e-03     0   453     5     0     0     0
   405  4.28969175e-01     0   456     6     0     0     0
   405  1.51049048e-02     0   457     6     0     0     0
   405  2.42397620e-04     0   406   199     0     0     0
   6
   406  9.36306549e-02     0   450     6     0     0     0
   406  2.20570423e-01     0   451     6     0     0     0
   406  2.31234743e-01     0   452     6     0     0     0
   406  1.05012777e-03     0   453     6     0     0     0
   406  4.51381254e-01     0   454     5     0     0     0
   406  2.13279710e-03     0   455     5     0     0     0
   6
   407  1.70852279e-02     0   450     7     0     0     0
   407  6.50516900e-03     0   451     7     0     0     0
   407  3.10012662e-04     0   452     7     0     0     0
   407  3.19982277e-01     0   453     7     0     0     0
   407  1.39797062e-02     0   454     8     0     0     0
   407  6.42137607e-01     0   455     8     0     0     0
   6
   408  1.33703386e-02     0   450     8     0     0     0
   408  1.29566021e-02     0   451     8     0     0     0
   408  1.70968133e-04     0   452     8     0     0     0
   408  3.16892367e-01     0   453     8     0     0     0
   408  2.54001082e-02     0   456     7     0     0     0
   408  6.31209616e-01     0   457     7     0     0     0
   6
   409  1.70852279e-02     0   450     9     0     0     0
   409  6.50516900e-03     0   451     9     0     0     0
   409  3.10012662e-04     0   452     9     0     0     0
   409  3.19982277e-01     0   453     9     0     0     0
   409  1.39797062e-02     0   454    10     0     0     0
   409  6.42137607e-01     0   455    10     0     0     0
   6
   410  1.33703386e-02     0   450    10     0     0     0
   410  1.29566021e-02     0   451    10     0     0     0
   410  1.70968133e-04     0   452    10     0     0     0
   410  3.16892367e-01     0   453    10     0     0     0
   410  2.54001082e-02     0   456     9     0     0     0
   410  6.31209616e-01     0   457     9     0     0     0
   7
   411  1.91985358e-01     0   450    11     0     0     0
   411  1.84047738e-01     0   451    11     0     0     0
   411  1.73098536e-01     0   452    11     0     0     0
   411  6.55189062e-03     0   453    11     0     0     0
   411  4.28969175e-01     0   454    12     0     0     0
   411  1.51049048e-02     0   455    12     0     0     0
   411  2.42397620e-04     0   412   198     0     0     0
   6
   412  9.36306549e-02     0   450    12     0     0     0
   412  2.20570423e-01     0   451    12     0     0     0
   412  2.31234743e-01     0   452    12     0     0     0
   412  1.05012777e-03     0   453    12     0     0     0
   412  4.51381254e-01     0   456    11     0     0     0
   412  2.13279710e-03     0   457    11     0     0     0
   4
   413  9.81934046e-01     0   450     1     0     0     0
   413  1.76669638e-02     0   451     1     0     0     0
   413  3.29432601e-04     0   452     1     0     0     0
   413  6.95576493e-05     0   453     1     0     0     0
   4
   414  9.81921416e-01     0   450     2     0     0     0
   414  1.76791831e-02     0   451     2     0     0     0
   414  3.29667908e-04     0   452     2     0     0     0
   414  6.97332417e-05     0   453     2     0     0     0
   4
   415  9.81934046e-01     0   450     3     0     0     0
   415  1.76669638e-02     0   451     3     0     0     0
   415  3.29432601e-04     0   452     3     0     0     0
   415  6.95576493e-05     0   453     3     0     0     0
   4
   416  9.81921416e-01     0   450     4     0     0     0
   416  1.76791831e-02     0   451     4     0     0     0
   416  3.29667908e-04     0   452     4     0     0     0
   416  6.97332417e-05     0   453     4     0     0     0
   7
   417  6.67905241e-03     0   450     5     0     0     0
   417  2.69782156e-02     0   451     5     0     0     0
   417  2.72309246e-02     0   452     5     0     0     0
   417  1.32732370e-01     0   453     5     0     0     0
   417  5.17810630e-01     0   456     6     0     0     0
   417  2.84282832e-01     0   457     6     0     0     0
   417  4.28597588e-03     0   406   199     0     0     0
   8
   418  7.43938570e-03     0   450     6     0     0     0
   418  2.57058307e-01     0   451     6     0     0     0
   418  2.64239840e-01     0   452     6     0     0     0
   418  1.44411533e-01     0   453     6     0     0     0
   418  5.02264499e-02     0   454     5     0     0     0
   418  2.70163066e-01     0   455     5     0     0     0
   418  4.14215527e-03     0   406   203     0     0     0
   418  2.31926385e-03     0   406   200     0     0     0
   4
   419  9.81934046e-01     0   450     7     0     0     0
   419  1.76669638e-02     0   451     7     0     0     0
   419  3.29432601e-04     0   452     7     0     0     0
   419  6.95576493e-05     0   453     7     0     0     0
   4
   420  9.81921416e-01     0   450     8     0     0     0
   420  1.76791831e-02     0   451     8     0     0     0
   420  3.29667908e-04     0   452     8     0     0     0
   420  6.97332417e-05     0   453     8     0     0     0
   4
   421  9.81934046e-01     0   450     9     0     0     0
   421  1.76669638e-02     0   451     9     0     0     0
   421  3.29432601e-04     0   452     9     0     0     0
   421  6.95576493e-05     0   453     9     0     0     0
   4
   422  9.81921416e-01     0   450    10     0     0     0
   422  1.76791831e-02     0   451    10     0     0     0
   422  3.29667908e-04     0   452    10     0     0     0
   422  6.97332417e-05     0   453    10     0     0     0
   7
   423  6.67905241e-03     0   450    11     0     0     0
   423  2.69782156e-02     0   451    11     0     0     0
   423  2.72309246e-02     0   452    11     0     0     0
   423  1.32732370e-01     0   453    11     0     0     0
   423  5.17810630e-01     0   454    12     0     0     0
   423  2.84282832e-01     0   455    12     0     0     0
   423  4.28597588e-03     0   412   198     0     0     0
   8
   424  7.43938570e-03     0   450    12     0     0     0
   424  2.57058307e-01     0   451    12     0     0     0
   424  2.64239840e-01     0   452    12     0     0     0
   424  1.44411533e-01     0   453    12     0     0     0
   424  5.02264499e-02     0   456    11     0     0     0
   424  2.70163066e-01     0   457    11     0     0     0
   424  4.14215527e-03     0   412   203     0     0     0
   424  2.31926385e-03     0   412   200     0     0     0
   0
   5
   430  3.98691632e-01     0   450   126     0     0     0
   430  3.39279867e-04     0   451   126     0     0     0
   430  5.90281714e-05     0   452   126     0     0     0
   430  1.23884148e-02     0   454   125     0     0     0
   430  5.88521645e-01     0   429   198     0     0     0
   3
   427  3.27057052e-01     0   429   123   131     0     0
   427  3.62027044e-06     0   429   124   132     0     0
   427  6.72939328e-01     0   435   123   125     0     0
   5
   428  9.87036746e-01     0   450   124     0     0     0
   428  8.90176076e-04     0   451   124     0     0     0
   428  1.56236884e-04     0   452   124     0     0     0
   428  7.90347523e-03     0   454   123     0     0     0
   428  4.01336615e-03     0   427   198     0     0     0
   3
   425  3.27073940e-01     0   429   121   131     0     0
   425  8.46627313e-11     0   429   122   132     0     0
   425  6.72926060e-01     0   435   121   125     0     0
   5
   426  9.91090587e-01     0   450   122     0     0     0
   426  8.93993493e-04     0   451   122     0     0     0
   426  1.56911092e-04     0   452   122     0     0     0
   426  7.85841456e-03     0   454   121     0     0     0
   426  9.41611119e-08     0   425   198     0     0     0
   0
   5
   436  3.98691632e-01     0   450   132     0     0     0
   436  3.39279867e-04     0   451   132     0     0     0
   436  5.90281714e-05     0   452   132     0     0     0
   436  1.23884148e-02     0   456   131     0     0     0
   436  5.88521645e-01     0   435   199     0     0     0
   3
   433  3.27057052e-01     0   435   129   125     0     0
   433  3.62027044e-06     0   435   130   126     0     0
   433  6.72939328e-01     0   429   129   131     0     0
   5
   434  9.87036746e-01     0   450   130     0     0     0
   434  8.90176076e-04     0   451   130     0     0     0
   434  1.56236884e-04     0   452   130     0     0     0
   434  7.90347523e-03     0   456   129     0     0     0
   434  4.01336615e-03     0   433   199     0     0     0
   3
   431  3.27073940e-01     0   435   127   125     0     0
   431  8.46627313e-11     0   435   128   126     0     0
   431  6.72926060e-01     0   429   127   131     0     0
   5
   432  9.91090587e-01     0   450   128     0     0     0
   432  8.93993493e-04     0   451   128     0     0     0
   432  1.56911092e-04     0   452   128     0     0     0
   432  7.85841456e-03     0   456   127     0     0     0
   432  9.41611119e-08     0   431   199     0     0     0
   6
   437  3.87148044e-01     0   450   125     0     0     0
   437  7.30460066e-03     0   451   125     0     0     0
   437  3.93843944e-03     0   452   125     0     0     0
   437  1.05009252e-03     0   456   126     0     0     0
   437  2.87754917e-01     0   429   203     0     0     0
   437  3.12803906e-01     0   429   200     0     0     0
   0
   6
   439  9.80115749e-01     0   450   123     0     0     0
   439  1.01058161e-02     0   451   123     0     0     0
   439  7.56592741e-05     0   452   123     0     0     0
   439  5.14585631e-03     0   456   124     0     0     0
   439  2.35270596e-03     0   427   203     0     0     0
   439  2.20421326e-03     0   427   200     0     0     0
   0
   6
   441  9.84628179e-01     0   450   121     0     0     0
   441  1.01441036e-02     0   451   121     0     0     0
   441  2.80445246e-05     0   452   121     0     0     0
   441  5.19956599e-03     0   456   122     0     0     0
   441  5.52350222e-08     0   425   203     0     0     0
   441  5.17472671e-08     0   425   200     0     0     0
   0
   6
   443  3.87148044e-01     0   450   131     0     0     0
   443  7.30460066e-03     0   451   131     0     0     0
   443  3.93843944e-03     0   452   131     0     0     0
   443  1.05009252e-03     0   454   132     0     0     0
   443  2.87754917e-01     0   435   203     0     0     0
   443  3.12803906e-01     0   435   200     0     0     0
   0
   6
   445  9.80115749e-01     0   450   129     0     0     0
   445  1.01058161e-02     0   451   129     0     0     0
   445  7.56592741e-05     0   452   129     0     0     0
   445  5.14585631e-03     0   454   130     0     0     0
   445  2.35270596e-03     0   433   203     0     0     0
   445  2.20421326e-03     0   433   200     0     0     0
   0
   6
   447  9.84628179e-01     0   450   127     0     0     0
   447  1.01441036e-02     0   451   127     0     0     0
   447  2.80445246e-05     0   452   127     0     0     0
   447  5.19956599e-03     0   454   128     0     0     0
   447  5.52350222e-08     0   431   203     0     0     0
   447  5.17472671e-08     0   431   200     0     0     0
   0
  24
   449  1.58760820e-02     0   401     7     0     0     0
   449  1.58760820e-02     0   407     1     0     0     0
   449  5.02371263e-02     0   413     7     0     0     0
   449  5.02371263e-02     0   419     1     0     0     0
   449  1.86994876e-02     0   402     8     0     0     0
   449  1.86994876e-02     0   408     2     0     0     0
   449  4.69524883e-02     0   414     8     0     0     0
   449  4.69524883e-02     0   420     2     0     0     0
   449  1.58760820e-02     0   403     9     0     0     0
   449  1.58760820e-02     0   409     3     0     0     0
   449  5.02371263e-02     0   415     9     0     0     0
   449  5.02371263e-02     0   421     3     0     0     0
   449  1.86994876e-02     0   404    10     0     0     0
   449  1.86994876e-02     0   410     4     0     0     0
   449  4.69524883e-02     0   416    10     0     0     0
   449  4.69524883e-02     0   422     4     0     0     0
   449  5.48390038e-02     0   405    11     0     0     0
   449  5.48390038e-02     0   411     5     0     0     0
   449  4.13895816e-02     0   417    11     0     0     0
   449  4.13895816e-02     0   423     5     0     0     0
   449  1.00708111e-01     0   406    12     0     0     0
   449  1.00708111e-01     0   412     6     0     0     0
   449  3.95329349e-02     0   418    12     0     0     0
   449  3.95329349e-02     0   424     6     0     0     0
   6
   450  1.93765582e-01     0   429   131     0     0     0
   450  1.93765582e-01     0   435   125     0     0     0
   450  1.53140163e-01     0   427   129     0     0     0
   450  1.53140163e-01     0   433   123     0     0     0
   450  1.53094255e-01     0   425   127     0     0     0
   450  1.53094255e-01     0   431   121     0     0     0
   8
   451  1.69918572e-01     0   429   131     0     0     0
   451  1.69918572e-01     0   435   125     0     0     0
   451  3.18965929e-02     0   427   129     0     0     0
   451  3.18965929e-02     0   433   123     0     0     0
   451  3.15027208e-02     0   425   127     0     0     0
   451  3.15027208e-02     0   431   121     0     0     0
   451  1.29317378e-02     0   450   200     0     0     0
   451  5.20432491e-01     0   450   203     0     0     0
   8
   452  1.79395130e-01     0   429   131     0     0     0
   452  1.79395130e-01     0   435   125     0     0     0
   452  1.28705761e-03     0   427   129     0     0     0
   452  1.28705761e-03     0   433   123     0     0     0
   452  7.70618480e-04     0   425   127     0     0     0
   452  7.70618480e-04     0   431   121     0     0     0
   452  6.26400313e-01     0   450   200     0     0     0
   452  1.06940757e-02     0   450   203     0     0     0
  26
   453  1.44535715e-05     0   429   131     0     0     0
   453  1.44535715e-05     0   435   125     0     0     0
   453  1.77574950e-05     0   427   129     0     0     0
   453  1.77574950e-05     0   433   123     0     0     0
   453  1.77717357e-05     0   425   127     0     0     0
   453  1.77717357e-05     0   431   121     0     0     0
   453  3.80556041e-02     0   437   131     0     0     0
   453  3.80556041e-02     0   443   125     0     0     0
   453  3.54906126e-02     0   439   129     0     0     0
   453  3.54906126e-02     0   445   123     0     0     0
   453  3.54564014e-02     0   441   127     0     0     0
   453  3.54564014e-02     0   447   121     0     0     0
   453  3.73994824e-02     0   430   132     0     0     0
   453  3.73994824e-02     0   436   126     0     0     0
   453  3.69759638e-02     0   428   130     0     0     0
   453  3.69759638e-02     0   434   124     0     0     0
   453  3.69746203e-02     0   426   128     0     0     0
   453  3.69746203e-02     0   432   122     0     0     0
   453  2.74625934e-06     0   450   200     0     0     0
   453  3.80476495e-03     0   451   200     0     0     0
   453  1.36302019e-01     0   452   200     0     0     0
   453  1.39337655e-01     0   454   199     0     0     0
   453  1.39337655e-01     0   456   198     0     0     0
   453  5.80743874e-05     0   450   203     0     0     0
   453  1.37286533e-01     0   451   203     0     0     0
   453  3.06521832e-03     0   452   203     0     0     0
   4
   454  3.50480123e-01     0   435   126     0     0     0
   454  1.01487966e-03     0   433   124     0     0     0
   454  2.37350442e-08     0   431   122     0     0     0
   454  6.48504973e-01     0   450   198     0     0     0
  14
   455  7.36095810e-02     0   430   131     0     0     0
   455  7.26816322e-02     0   428   129     0     0     0
   455  7.26787019e-02     0   426   127     0     0     0
   455  2.98755434e-06     0   435   126     0     0     0
   455  6.50878831e-09     0   433   124     0     0     0
   455  1.49945833e-13     0   431   122     0     0     0
   455  7.75481074e-02     0   443   126     0     0     0
   455  7.24111665e-02     0   445   124     0     0     0
   455  7.23416335e-02     0   447   122     0     0     0
   455  1.38019807e-01     0   454   200     0     0     0
   455  5.37615017e-05     0   450   198     0     0     0
   455  1.40912568e-01     0   451   198     0     0     0
   455  1.42099278e-01     0   452   198     0     0     0
   455  1.37640770e-01     0   454   203     0     0     0
   4
   456  3.50480123e-01     0   429   132     0     0     0
   456  1.01487966e-03     0   427   130     0     0     0
   456  2.37350442e-08     0   425   128     0     0     0
   456  6.48504973e-01     0   450   199     0     0     0
  14
   457  7.36095810e-02     0   436   125     0     0     0
   457  7.26816322e-02     0   434   123     0     0     0
   457  7.26787019e-02     0   432   121     0     0     0
   457  2.98755434e-06     0   429   132     0     0     0
   457  6.50878831e-09     0   427   130     0     0     0
   457  1.49945833e-13     0   425   128     0     0     0
   457  7.75481074e-02     0   437   132     0     0     0
   457  7.24111665e-02     0   439   130     0     0     0
   457  7.23416335e-02     0   441   128     0     0     0
   457  1.38019807e-01     0   456   200     0     0     0
   457  5.37615017e-05     0   450   199     0     0     0
   457  1.40912568e-01     0   451   199     0     0     0
   457  1.42099278e-01     0   452   199     0     0     0
   457  1.37640770e-01     0   456   203     0     0     0
   0
     19.19205849     -0.05283326
      0.99012028     -0.01159573      0.11145964     -0.08428596
     -0.13859847     -0.15494918      0.69326715     -0.69004483
     -0.01895159      0.02447538      0.70596385      0.70757108
     -0.00965084      0.98755114      0.09258751     -0.12679577
     -0.17983008      0.98369769     -0.98369769     -0.17983008
     -0.13340439      0.99106169     -0.99106169     -0.13340439
      1.46028393      1.43385713      1.52480617
   -816.29939477   -887.98047357    -98.47414045
    894.58932850
    T
