#  ISAJET SUSY parameters in SUSY Les Houches Accord 2 format
#  Created by ISALHA 2.0 Last revision: C. Balazs 21 Apr 2009
Block SPINFO   # Program information
     1   ISASUGRA from ISAJET          # Spectrum Calculator
     2   7.80   29-OCT-2009 12:50:36   # Version number
Block MODSEL   # Model selection
     1     1   # Minimal supergravity (mSUGRA) model               
Block SMINPUTS   # Standard Model inputs
     1     1.27833084E+02   # alpha_em^(-1)
     2     1.16570000E-05   # G_Fermi
     3     1.17200002E-01   # alpha_s(M_Z)
     4     9.11699982E+01   # m_{Z}(pole)
     5     4.19999981E+00   # m_{b}(m_{b})
     6     1.72500000E+02   # m_{top}(pole)
     7     1.77699995E+00   # m_{tau}(pole)
Block MINPAR   # SUSY breaking input parameters
     1     9.80000000E+02   # m_0
     2     6.60000000E+02   # m_{1/2}
     3     1.00000000E+01   # tan(beta)
     4     1.00000000E+00   # sign(mu)
     5     0.00000000E+00   # A_0
Block EXTPAR   # Non-universal SUSY breaking parameters
     0     1.73331555E+16   # Input scale
Block MASS   # Scalar and gaugino mass spectrum
#  PDG code   mass                 particle
        24     8.04229965E+01   #  W^+
        25     1.15718948E+02   #  h^0            
        35     1.31934473E+03   #  H^0            
        36     1.31060242E+03   #  A^0            
        37     1.32300269E+03   #  H^+            
   1000001     1.66956018E+03   #  dnl            
   1000002     1.66761609E+03   #  upl            
   1000003     1.66956018E+03   #  stl            
   1000004     1.66761658E+03   #  chl            
   1000005     1.48860913E+03   #  b1             
   1000006     1.20322778E+03   #  t1             
   1000011     1.07271790E+03   #  el-            
   1000012     1.06900964E+03   #  nuel           
   1000013     1.07271790E+03   #  mul-           
   1000014     1.06900964E+03   #  numl           
   1000015     9.99279663E+02   #  tau1           
   1000016     1.06420105E+03   #  nutl           
   1000021     1.53096936E+03   #  glss           
   1000022     2.78227386E+02   #  z1ss           
   1000023     5.25580139E+02   #  z2ss           
   1000024     5.26376465E+02   #  w1ss           
   1000025    -7.85401978E+02   #  z3ss           
   1000035     7.99276367E+02   #  z4ss           
   1000037     7.99216125E+02   #  w2ss           
   2000001     1.62697791E+03   #  dnr            
   2000002     1.63021777E+03   #  upr            
   2000003     1.62697791E+03   #  str            
   2000004     1.63021838E+03   #  chr            
   2000005     1.61247314E+03   #  b2             
   2000006     1.51140771E+03   #  t2             
   2000011     1.00942920E+03   #  er-            
   2000013     1.00942920E+03   #  mur-           
   2000015     1.06882471E+03   #  tau2           
Block ALPHA   # Effective Higgs mixing parameter
         -1.00775667E-01   # alpha
Block STOPMIX   # stop mixing matrix
  1  1     2.23284125E-01   # O_{11}
  1  2     9.74753380E-01   # O_{12}
  2  1    -9.74753380E-01   # O_{21}
  2  2     2.23284125E-01   # O_{22}
Block SBOTMIX   # sbottom mixing matrix
  1  1     9.98200953E-01   # O_{11}
  1  2     5.99574670E-02   # O_{12}
  2  1    -5.99574670E-02   # O_{21}
  2  2     9.98200953E-01   # O_{22}
Block STAUMIX   # stau mixing matrix
  1  1     1.05195276E-01   # O_{11}
  1  2     9.94451582E-01   # O_{12}
  2  1    -9.94451582E-01   # O_{21}
  2  2     1.05195276E-01   # O_{22}
Block NMIX   # neutralino mixing matrix
  1  1     9.97371316E-01   #
  1  2    -1.03043690E-02   #
  1  3     6.58156499E-02   #
  1  4    -2.85004228E-02   #
  2  1    -2.58612428E-02   #
  2  2    -9.74017262E-01   #
  2  3     1.82308897E-01   #
  2  4    -1.31852537E-01   #
  3  1     2.59213895E-02   #
  3  2    -3.68494838E-02   #
  3  3    -7.05049992E-01   #
  3  4    -7.07724631E-01   #
  4  1    -6.25255406E-02   #
  4  2     2.23218143E-01   #
  4  3     6.82155311E-01   #
  4  4    -6.93489730E-01   #
Block UMIX   # chargino U mixing matrix
  1  1    -9.66123104E-01   # U_{11}
  1  2     2.58081675E-01   # U_{12}
  2  1    -2.58081675E-01   # U_{21}
  2  2    -9.66123104E-01   # U_{22}
Block VMIX   # chargino V mixing matrix
  1  1    -9.82234180E-01   # V_{11}
  1  2     1.87659174E-01   # V_{12}
  2  1    -1.87659174E-01   # V_{21}
  2  2    -9.82234180E-01   # V_{22}
Block GAUGE Q=  1.29094788E+03   #
     1     3.57529432E-01   # g`
     2     6.52386546E-01   # g_2
     3     1.21921206E+00   # g_3
Block YU Q=  1.29094788E+03   #
  3  3     8.48872185E-01   # y_t
Block YD Q=  1.29094788E+03   #
  3  3     1.30378246E-01   # y_b
Block YE Q=  1.29094788E+03   #
  3  3     1.02132775E-01   # y_tau
Block HMIX Q=  1.29094788E+03   # Higgs mixing parameters
     1     7.78379700E+02   # mu(Q)
     2     1.00000000E+01   # tan(beta)(M_GUT)
     3     2.51202957E+02   # Higgs vev at Q
     4     1.71767875E+06   # m_A^2(Q)
Block MSOFT Q=  1.29094788E+03   # DRbar SUSY breaking parameters
     1     2.81482849E+02   # M_1(Q)          
     2     5.17980103E+02   # M_2(Q)          
     3     1.42598901E+03   # M_3(Q)          
    31     1.06743005E+03   # MeL(Q)          
    32     1.06743005E+03   # MmuL(Q)         
    33     1.06271619E+03   # MtauL(Q)        
    34     1.00743341E+03   # MeR(Q)          
    35     1.00743341E+03   # MmuR(Q)         
    36     9.98005737E+02   # MtauR(Q)        
    41     1.59398071E+03   # MqL1(Q)         
    42     1.59398071E+03   # MqL2(Q)         
    43     1.42383508E+03   # MqL3(Q)         
    44     1.55583325E+03   # MuR(Q)          
    45     1.55583325E+03   # McR(Q)          
    46     1.17046313E+03   # MtR(Q)          
    47     1.55197119E+03   # MdR(Q)          
    48     1.55197119E+03   # MsR(Q)          
    49     1.55068958E+03   # MbR(Q)          
Block AU Q=  1.29094788E+03   #
  1  1    -1.11737354E+03   # A_u
  2  2    -1.11737354E+03   # A_c
  3  3    -1.11737354E+03   # A_t
Block AD Q=  1.29094788E+03   #
  1  1    -1.63808704E+03   # A_d
  2  2    -1.63808704E+03   # A_s
  3  3    -1.63808704E+03   # A_b
Block AE Q=  1.29094788E+03   #
  1  1    -3.85960968E+02   # A_e
  2  2    -3.85960968E+02   # A_mu
  3  3    -3.85960968E+02   # A_tau
#  ISAJET decay tables in SUSY Les Houches accord format
#  Created by ISALHD. Last revision: C. Balazs, 2005 May 25
Block DCINFO                           # Program information
     1   ISASUGRA from ISAJET          # Spectrum Calculator
     2   7.80   29-OCT-2009 12:50:36   # Version number
#         PDG         Width
DECAY         6  1.14680779E+00   # TP    decays
#          BR          NDA       ID1       ID2       ID3       ID4
      3.33333343E-01    3            2        -1         5             # TP     -->  UP     DB     BT          
      3.33333343E-01    3            4        -3         5             # TP     -->  CH     SB     BT          
      1.11111112E-01    3          -11        12         5             # TP     -->  E+     NUE    BT          
      1.11111112E-01    3          -13        14         5             # TP     -->  MU+    NUM    BT          
      1.11111112E-01    3          -15        16         5             # TP     -->  TAU+   NUT    BT          
#         PDG         Width
DECAY   1000021  3.47036886E+00   # GLSS  decays
#          BR          NDA       ID1       ID2       ID3       ID4
      3.03496118E-03    3      1000024         1        -2             # GLSS   -->  W1SS+  DN     UB          
      3.03496118E-03    3     -1000024         2        -1             # GLSS   -->  W1SS-  UP     DB          
      3.03495745E-03    3      1000024         3        -4             # GLSS   -->  W1SS+  ST     CB          
      3.03495745E-03    3     -1000024         4        -3             # GLSS   -->  W1SS-  CH     SB          
      2.10504234E-03    3      1000024         5        -6             # GLSS   -->  W1SS+  BT     TB          
      2.10504234E-03    3     -1000024         6        -5             # GLSS   -->  W1SS-  TP     BB          
      7.23164121E-05    3      1000037         1        -2             # GLSS   -->  W2SS+  DN     UB          
      7.23164121E-05    3     -1000037         2        -1             # GLSS   -->  W2SS-  UP     DB          
      7.23163321E-05    3      1000037         3        -4             # GLSS   -->  W2SS+  ST     CB          
      7.23163321E-05    3     -1000037         4        -3             # GLSS   -->  W2SS-  CH     SB          
      3.38822807E-04    3      1000037         5        -6             # GLSS   -->  W2SS+  BT     TB          
      3.38822807E-04    3     -1000037         6        -5             # GLSS   -->  W2SS-  TP     BB          
      1.44997398E-06    2      1000022        21                       # GLSS   -->  Z1SS   GL                 
      1.55190576E-03    3      1000022         2        -2             # GLSS   -->  Z1SS   UP     UB          
      4.62155294E-04    3      1000022         1        -1             # GLSS   -->  Z1SS   DN     DB          
      4.62155294E-04    3      1000022         3        -3             # GLSS   -->  Z1SS   ST     SB          
      1.55190064E-03    3      1000022         4        -4             # GLSS   -->  Z1SS   CH     CB          
      4.07237269E-04    3      1000022         5        -5             # GLSS   -->  Z1SS   BT     BB          
      1.40140415E-04    3      1000022         6        -6             # GLSS   -->  Z1SS   TP     TB          
      5.14622525E-06    2      1000023        21                       # GLSS   -->  Z2SS   GL                 
      1.54258101E-03    3      1000023         2        -2             # GLSS   -->  Z2SS   UP     UB          
      1.49717752E-03    3      1000023         1        -1             # GLSS   -->  Z2SS   DN     DB          
      1.49717752E-03    3      1000023         3        -3             # GLSS   -->  Z2SS   ST     SB          
      1.54257682E-03    3      1000023         4        -4             # GLSS   -->  Z2SS   CH     CB          
      3.96386127E-07    3      1000023         5        -5             # GLSS   -->  Z2SS   BT     BB          
      2.07014405E-03    3      1000023         6        -6             # GLSS   -->  Z2SS   TP     TB          
      6.45824111E-05    2      1000025        21                       # GLSS   -->  Z3SS   GL                 
      5.53967539E-07    3      1000025         2        -2             # GLSS   -->  Z3SS   UP     UB          
      6.73337411E-07    3      1000025         1        -1             # GLSS   -->  Z3SS   DN     DB          
      6.73337411E-07    3      1000025         3        -3             # GLSS   -->  Z3SS   ST     SB          
      5.53965435E-07    3      1000025         4        -4             # GLSS   -->  Z3SS   CH     CB          
      3.55560733E-05    3      1000025         5        -5             # GLSS   -->  Z3SS   BT     BB          
      1.21760543E-03    3      1000025         6        -6             # GLSS   -->  Z3SS   TP     TB          
      5.29210811E-05    2      1000035        21                       # GLSS   -->  Z4SS   GL                 
      3.44039727E-05    3      1000035         2        -2             # GLSS   -->  Z4SS   UP     UB          
      3.99282653E-05    3      1000035         1        -1             # GLSS   -->  Z4SS   DN     DB          
      3.99282653E-05    3      1000035         3        -3             # GLSS   -->  Z4SS   ST     SB          
      3.44038745E-05    3      1000035         4        -4             # GLSS   -->  Z4SS   CH     CB          
      3.68048422E-05    3      1000035         5        -5             # GLSS   -->  Z4SS   BT     BB          
      2.40393938E-03    3      1000035         6        -6             # GLSS   -->  Z4SS   TP     TB          
      1.41885281E-02    2     -1000005         5                       # GLSS   -->  BB1    BT                 
      1.41885281E-02    2      1000005        -5                       # GLSS   -->  BT1    BB                 
      4.68805730E-01    2     -1000006         6                       # GLSS   -->  TB1    TP                 
      4.68805730E-01    2      1000006        -6                       # GLSS   -->  TP1    TB                 
#         PDG         Width
DECAY   1000002  1.95201588E+01   # UPL   decays
#          BR          NDA       ID1       ID2       ID3       ID4
      1.01037920E-02    2      1000022         2                       # UPL    -->  Z1SS   UP                 
      2.79449463E-01    2      1000023         2                       # UPL    -->  Z2SS   UP                 
      2.24395248E-04    2      1000025         2                       # UPL    -->  Z3SS   UP                 
      9.56798717E-03    2      1000035         2                       # UPL    -->  Z4SS   UP                 
      1.23122700E-01    2      1000021         2                       # UPL    -->  GLSS   UP                 
      5.62502682E-01    2      1000024         1                       # UPL    -->  W1SS+  DN                 
      1.50289601E-02    2      1000037         1                       # UPL    -->  W2SS+  DN                 
#         PDG         Width
DECAY   1000001  1.95069885E+01   # DNL   decays
#          BR          NDA       ID1       ID2       ID3       ID4
      1.26884785E-02    2      1000022         1                       # DNL    -->  Z1SS   DN                 
      2.74710327E-01    2      1000023         1                       # DNL    -->  Z2SS   DN                 
      3.78024386E-04    2      1000025         1                       # DNL    -->  Z3SS   DN                 
      1.17882490E-02    2      1000035         1                       # DNL    -->  Z4SS   DN                 
      1.26433492E-01    2      1000021         1                       # DNL    -->  GLSS   DN                 
      5.45484304E-01    2     -1000024         2                       # DNL    -->  W1SS-  UP                 
      2.85171047E-02    2     -1000037         2                       # DNL    -->  W2SS-  UP                 
#         PDG         Width
DECAY   1000003  1.95069714E+01   # STL   decays
#          BR          NDA       ID1       ID2       ID3       ID4
      1.26884887E-02    2      1000022         3                       # STL    -->  Z1SS   ST                 
      2.74710566E-01    2      1000023         3                       # STL    -->  Z2SS   ST                 
      3.78024735E-04    2      1000025         3                       # STL    -->  Z3SS   ST                 
      1.17882593E-02    2      1000035         3                       # STL    -->  Z4SS   ST                 
      1.26433611E-01    2      1000021         3                       # STL    -->  GLSS   ST                 
      5.45483947E-01    2     -1000024         4                       # STL    -->  W1SS-  CH                 
      2.85170656E-02    2     -1000037         4                       # STL    -->  W2SS-  CH                 
#         PDG         Width
DECAY   1000004  1.95200443E+01   # CHL   decays
#          BR          NDA       ID1       ID2       ID3       ID4
      1.01038404E-02    2      1000022         4                       # CHL    -->  Z1SS   CH                 
      2.79450774E-01    2      1000023         4                       # CHL    -->  Z2SS   CH                 
      2.24396208E-04    2      1000025         4                       # CHL    -->  Z3SS   CH                 
      9.56802722E-03    2      1000035         4                       # CHL    -->  Z4SS   CH                 
      1.23117670E-01    2      1000021         4                       # CHL    -->  GLSS   CH                 
      5.62506199E-01    2      1000024         3                       # CHL    -->  W1SS+  ST                 
      1.50290569E-02    2      1000037         3                       # CHL    -->  W2SS+  ST                 
#         PDG         Width
DECAY   1000005  2.84158669E+01   # BT1   decays
#          BR          NDA       ID1       ID2       ID3       ID4
      8.05484038E-03    2      1000022         5                       # BT1    -->  Z1SS   BT                 
      1.59611970E-01    2      1000023         5                       # BT1    -->  Z2SS   BT                 
      4.82422672E-03    2      1000025         5                       # BT1    -->  Z3SS   BT                 
      9.84768197E-03    2      1000035         5                       # BT1    -->  Z4SS   BT                 
      3.09441686E-01    2     -1000024         6                       # BT1    -->  W1SS-  TP                 
      3.70296568E-01    2     -1000037         6                       # BT1    -->  W2SS-  TP                 
      1.37923032E-01    2          -24   1000006                       # BT1    -->  W-     TP1                
#         PDG         Width
DECAY   1000006  1.32317505E+01   # TP1   decays
#          BR          NDA       ID1       ID2       ID3       ID4
      1.71230897E-01    2      1000022         6                       # TP1    -->  Z1SS   TP                 
      4.70272787E-02    2      1000023         6                       # TP1    -->  Z2SS   TP                 
      2.13338539E-01    2      1000025         6                       # TP1    -->  Z3SS   TP                 
      1.29269779E-01    2      1000035         6                       # TP1    -->  Z4SS   TP                 
      1.03112288E-01    2      1000024         5                       # TP1    -->  W1SS+  BT                 
      3.36021215E-01    2      1000037         5                       # TP1    -->  W2SS+  BT                 
#         PDG         Width
DECAY   2000002  4.79568052E+00   # UPR   decays
#          BR          NDA       ID1       ID2       ID3       ID4
      7.20525742E-01    2      1000022         2                       # UPR    -->  Z1SS   UP                 
      4.12651687E-04    2      1000023         2                       # UPR    -->  Z2SS   UP                 
      3.04457644E-04    2      1000025         2                       # UPR    -->  Z3SS   UP                 
      1.73347129E-03    2      1000035         2                       # UPR    -->  Z4SS   UP                 
      2.77023673E-01    2      1000021         2                       # UPR    -->  GLSS   UP                 
#         PDG         Width
DECAY   2000001  2.11317372E+00   # DNR   decays
#          BR          NDA       ID1       ID2       ID3       ID4
      4.07883972E-01    2      1000022         1                       # DNR    -->  Z1SS   DN                 
      2.33438739E-04    2      1000023         1                       # DNR    -->  Z2SS   DN                 
      1.71977124E-04    2      1000025         1                       # DNR    -->  Z3SS   DN                 
      9.79064382E-04    2      1000035         1                       # DNR    -->  Z4SS   DN                 
      5.90731502E-01    2      1000021         1                       # DNR    -->  GLSS   DN                 
#         PDG         Width
DECAY   2000003  2.11317372E+00   # STR   decays
#          BR          NDA       ID1       ID2       ID3       ID4
      4.07883972E-01    2      1000022         3                       # STR    -->  Z1SS   ST                 
      2.33438739E-04    2      1000023         3                       # STR    -->  Z2SS   ST                 
      1.71977124E-04    2      1000025         3                       # STR    -->  Z3SS   ST                 
      9.79064382E-04    2      1000035         3                       # STR    -->  Z4SS   ST                 
      5.90731502E-01    2      1000021         3                       # STR    -->  GLSS   ST                 
#         PDG         Width
DECAY   2000004  4.79556227E+00   # CHR   decays
#          BR          NDA       ID1       ID2       ID3       ID4
      7.20542729E-01    2      1000022         4                       # CHR    -->  Z1SS   CH                 
      4.12661437E-04    2      1000023         4                       # CHR    -->  Z2SS   CH                 
      3.04464716E-04    2      1000025         4                       # CHR    -->  Z3SS   CH                 
      1.73351169E-03    2      1000035         4                       # CHR    -->  Z4SS   CH                 
      2.77006686E-01    2      1000021         4                       # CHR    -->  GLSS   CH                 
#         PDG         Width
DECAY   2000005  2.58718920E+00   # BT2   decays
#          BR          NDA       ID1       ID2       ID3       ID4
      3.26699257E-01    2      1000022         5                       # BT2    -->  Z1SS   BT                 
      3.95946699E-04    2      1000023         5                       # BT2    -->  Z2SS   BT                 
      6.54807538E-02    2      1000025         5                       # BT2    -->  Z3SS   BT                 
      6.83641732E-02    2      1000035         5                       # BT2    -->  Z4SS   BT                 
      3.50996673E-01    2      1000021         5                       # BT2    -->  GLSS   BT                 
      9.09021357E-04    2     -1000024         6                       # BT2    -->  W1SS-  TP                 
      1.59172475E-01    2     -1000037         6                       # BT2    -->  W2SS-  TP                 
      1.54907126E-02    2          -24   1000006                       # BT2    -->  W-     TP1                
      1.43116934E-03    2          -24   2000006                       # BT2    -->  W-     TP2                
      1.91149535E-03    2           23   1000005                       # BT2    -->  Z0     BT1                
      9.14833136E-03    2           25   1000005                       # BT2    -->  HL0    BT1                
#         PDG         Width
DECAY   2000006  2.98025093E+01   # TP2   decays
#          BR          NDA       ID1       ID2       ID3       ID4
      2.70023584E-01    2      1000024         5                       # TP2    -->  W1SS+  BT                 
      5.61183169E-02    2      1000037         5                       # TP2    -->  W2SS+  BT                 
      7.73345307E-02    2           23   1000006                       # TP2    -->  Z0     TP1                
      8.51348117E-02    2           25   1000006                       # TP2    -->  HL0    TP1                
      8.36954731E-03    2      1000022         6                       # TP2    -->  Z1SS   TP                 
      1.32067263E-01    2      1000023         6                       # TP2    -->  Z2SS   TP                 
      1.63722396E-01    2      1000025         6                       # TP2    -->  Z3SS   TP                 
      2.07229510E-01    2      1000035         6                       # TP2    -->  Z4SS   TP                 
#         PDG         Width
DECAY   1000011  8.69342232E+00   # EL-   decays
#          BR          NDA       ID1       ID2       ID3       ID4
      1.30730063E-01    2      1000022        11                       # EL-    -->  Z1SS   E-                 
      2.92948097E-01    2      1000023        11                       # EL-    -->  Z2SS   E-                 
      5.71144628E-05    2      1000025        11                       # EL-    -->  Z3SS   E-                 
      3.66563699E-03    2      1000035        11                       # EL-    -->  Z4SS   E-                 
      5.58902502E-01    2     -1000024        12                       # EL-    -->  W1SS-  NUE                
      1.36965243E-02    2     -1000037        12                       # EL-    -->  W2SS-  NUE                
#         PDG         Width
DECAY   1000013  8.69342232E+00   # MUL-  decays
#          BR          NDA       ID1       ID2       ID3       ID4
      1.30730063E-01    2      1000022        13                       # MUL-   -->  Z1SS   MU-                
      2.92948097E-01    2      1000023        13                       # MUL-   -->  Z2SS   MU-                
      5.71144556E-05    2      1000025        13                       # MUL-   -->  Z3SS   MU-                
      3.66563699E-03    2      1000035        13                       # MUL-   -->  Z4SS   MU-                
      5.58902502E-01    2     -1000024        14                       # MUL-   -->  W1SS-  NUM                
      1.36965243E-02    2     -1000037        14                       # MUL-   -->  W2SS-  NUM                
#         PDG         Width
DECAY   1000015  4.45470572E+00   # TAU1- decays
#          BR          NDA       ID1       ID2       ID3       ID4
      9.59347010E-01    2      1000022        15                       # TAU1-  -->  Z1SS   TAU-               
      1.06851691E-02    2      1000023        15                       # TAU1-  -->  Z2SS   TAU-               
      3.39372293E-03    2      1000025        15                       # TAU1-  -->  Z3SS   TAU-               
      2.54116883E-03    2      1000035        15                       # TAU1-  -->  Z4SS   TAU-               
      2.00908929E-02    2     -1000024        16                       # TAU1-  -->  W1SS-  NUT                
      3.94195691E-03    2     -1000037        16                       # TAU1-  -->  W2SS-  NUT                
#         PDG         Width
DECAY   1000012  8.70827293E+00   # NUEL  decays
#          BR          NDA       ID1       ID2       ID3       ID4
      1.40072644E-01    2      1000022        12                       # NUEL   -->  Z1SS   NUE                
      2.73705900E-01    2      1000023        12                       # NUEL   -->  Z2SS   NUE                
      2.85735645E-04    2      1000025        12                       # NUEL   -->  Z3SS   NUE                
      6.66694855E-03    2      1000035        12                       # NUEL   -->  Z4SS   NUE                
      5.72189033E-01    2      1000024        11                       # NUEL   -->  W1SS+  E-                 
      7.07989000E-03    2      1000037        11                       # NUEL   -->  W2SS+  E-                 
#         PDG         Width
DECAY   1000014  8.70827293E+00   # NUML  decays
#          BR          NDA       ID1       ID2       ID3       ID4
      1.40072644E-01    2      1000022        14                       # NUML   -->  Z1SS   NUM                
      2.73705900E-01    2      1000023        14                       # NUML   -->  Z2SS   NUM                
      2.85735645E-04    2      1000025        14                       # NUML   -->  Z3SS   NUM                
      6.66694855E-03    2      1000035        14                       # NUML   -->  Z4SS   NUM                
      5.72189033E-01    2      1000024        13                       # NUML   -->  W1SS+  MU-                
      7.07988907E-03    2      1000037        13                       # NUML   -->  W2SS+  MU-                
#         PDG         Width
DECAY   1000016  8.67154789E+00   # NUTL  decays
#          BR          NDA       ID1       ID2       ID3       ID4
      1.39848888E-01    2      1000022        16                       # NUTL   -->  Z1SS   NUT                
      2.72050917E-01    2      1000023        16                       # NUTL   -->  Z2SS   NUT                
      2.79618049E-04    2      1000025        16                       # NUTL   -->  Z3SS   NUT                
      6.51288778E-03    2      1000035        16                       # NUTL   -->  Z4SS   NUT                
      5.69613636E-01    2      1000024        15                       # NUTL   -->  W1SS+  TAU-               
      1.16880247E-02    2      1000037        15                       # NUTL   -->  W2SS+  TAU-               
      6.52935569E-07    3      1000015        16       -15             # NUTL   -->  TAU1-  NUT    TAU+        
      6.52935569E-07    3      1000015        12       -11             # NUTL   -->  TAU1-  NUE    E+          
      6.52935569E-07    3      1000015        14       -13             # NUTL   -->  TAU1-  NUM    MU+         
      1.95880671E-06    3      1000015         2        -1             # NUTL   -->  TAU1-  UP     DB          
      1.95880671E-06    3      1000015         4        -3             # NUTL   -->  TAU1-  CH     SB          
#         PDG         Width
DECAY   2000011  4.36588907E+00   # ER-   decays
#          BR          NDA       ID1       ID2       ID3       ID4
      9.98819232E-01    2      1000022        11                       # ER-    -->  Z1SS   E-                 
      4.17868083E-04    2      1000023        11                       # ER-    -->  Z2SS   E-                 
      1.23044971E-04    2      1000025        11                       # ER-    -->  Z3SS   E-                 
      6.39763952E-04    2      1000035        11                       # ER-    -->  Z4SS   E-                 
#         PDG         Width
DECAY   2000013  4.36588907E+00   # MUR-  decays
#          BR          NDA       ID1       ID2       ID3       ID4
      9.98819232E-01    2      1000022        13                       # MUR-   -->  Z1SS   MU-                
      4.17868083E-04    2      1000023        13                       # MUR-   -->  Z2SS   MU-                
      1.23044956E-04    2      1000025        13                       # MUR-   -->  Z3SS   MU-                
      6.39763835E-04    2      1000035        13                       # MUR-   -->  Z4SS   MU-                
#         PDG         Width
DECAY   2000015  8.58301735E+00   # TAU2- decays
#          BR          NDA       ID1       ID2       ID3       ID4
      1.35654166E-01    2      1000022        15                       # TAU2-  -->  Z1SS   TAU-               
      2.88979769E-01    2      1000023        15                       # TAU2-  -->  Z2SS   TAU-               
      3.07034305E-03    2      1000025        15                       # TAU2-  -->  Z3SS   TAU-               
      6.91666827E-03    2      1000035        15                       # TAU2-  -->  Z4SS   TAU-               
      5.50200164E-01    2     -1000024        16                       # TAU2-  -->  W1SS-  NUT                
      1.51788341E-02    2     -1000037        16                       # TAU2-  -->  W2SS-  NUT                
#         PDG         Width
DECAY   1000023  2.32749563E-02   # Z2SS  decays
#          BR          NDA       ID1       ID2       ID3       ID4
      8.53991025E-07    2      1000022        22                       # Z2SS   -->  Z1SS   GM                 
      6.03830926E-02    2      1000022        23                       # Z2SS   -->  Z1SS   Z0                 
      1.88618230E-06    3      1000022         2        -2             # Z2SS   -->  Z1SS   UP     UB          
      2.29088573E-06    3      1000022         1        -1             # Z2SS   -->  Z1SS   DN     DB          
      2.29088573E-06    3      1000022         3        -3             # Z2SS   -->  Z1SS   ST     SB          
      1.88617980E-06    3      1000022         4        -4             # Z2SS   -->  Z1SS   CH     CB          
      4.25389635E-06    3      1000022         5        -5             # Z2SS   -->  Z1SS   BT     BB          
      4.39713294E-05    3      1000022        11       -11             # Z2SS   -->  Z1SS   E-     E+          
      4.39713294E-05    3      1000022        13       -13             # Z2SS   -->  Z1SS   MU-    MU+         
      4.60526244E-05    3      1000022        15       -15             # Z2SS   -->  Z1SS   TAU-   TAU+        
      4.52422646E-05    3      1000022        12       -12             # Z2SS   -->  Z1SS   NUE    ANUE        
      4.52422646E-05    3      1000022        14       -14             # Z2SS   -->  Z1SS   NUM    ANUM        
      4.62108728E-05    3      1000022        16       -16             # Z2SS   -->  Z1SS   NUT    ANUT        
      9.39332783E-01    2      1000022        25                       # Z2SS   -->  Z1SS   HL0                
#         PDG         Width
DECAY   1000025  3.99587989E+00   # Z3SS  decays
#          BR          NDA       ID1       ID2       ID3       ID4
      5.21644106E-09    2      1000022        22                       # Z3SS   -->  Z1SS   GM                 
      2.82213705E-07    2      1000023        22                       # Z3SS   -->  Z2SS   GM                 
      2.93872595E-01    2      1000024       -24                       # Z3SS   -->  W1SS+  W-                 
      2.93872595E-01    2     -1000024        24                       # Z3SS   -->  W1SS-  W+                 
      1.14028677E-01    2      1000022        23                       # Z3SS   -->  Z1SS   Z0                 
      2.73971945E-01    2      1000023        23                       # Z3SS   -->  Z2SS   Z0                 
      1.05766873E-09    3      1000022         2        -2             # Z3SS   -->  Z1SS   UP     UB          
      3.35674571E-10    3      1000022         1        -1             # Z3SS   -->  Z1SS   DN     DB          
      3.35674571E-10    3      1000022         3        -3             # Z3SS   -->  Z1SS   ST     SB          
      1.05766695E-09    3      1000022         4        -4             # Z3SS   -->  Z1SS   CH     CB          
      3.61509393E-07    3      1000022         5        -5             # Z3SS   -->  Z1SS   BT     BB          
      2.16627267E-08    3      1000022        11       -11             # Z3SS   -->  Z1SS   E-     E+          
      2.16627267E-08    3      1000022        13       -13             # Z3SS   -->  Z1SS   MU-    MU+         
      1.69706641E-06    3      1000022        15       -15             # Z3SS   -->  Z1SS   TAU-   TAU+        
      1.14315677E-08    3      1000022        12       -12             # Z3SS   -->  Z1SS   NUE    ANUE        
      1.14315677E-08    3      1000022        14       -14             # Z3SS   -->  Z1SS   NUM    ANUM        
      1.17480656E-08    3      1000022        16       -16             # Z3SS   -->  Z1SS   NUT    ANUT        
      2.87211588E-10    3      1000023         2        -2             # Z3SS   -->  Z2SS   UP     UB          
      4.70329997E-10    3      1000023         1        -1             # Z3SS   -->  Z2SS   DN     DB          
      4.70329997E-10    3      1000023         3        -3             # Z3SS   -->  Z2SS   ST     SB          
      2.87211199E-10    3      1000023         4        -4             # Z3SS   -->  Z2SS   CH     CB          
      1.04784107E-07    3      1000023         5        -5             # Z3SS   -->  Z2SS   BT     BB          
      5.51541979E-10    3      1000023        11       -11             # Z3SS   -->  Z2SS   E-     E+          
      5.51541979E-10    3      1000023        13       -13             # Z3SS   -->  Z2SS   MU-    MU+         
      7.77367930E-08    3      1000023        15       -15             # Z3SS   -->  Z2SS   TAU-   TAU+        
      2.71673839E-09    3      1000023        12       -12             # Z3SS   -->  Z2SS   NUE    ANUE        
      2.71673839E-09    3      1000023        14       -14             # Z3SS   -->  Z2SS   NUM    ANUM        
      2.80192447E-09    3      1000023        16       -16             # Z3SS   -->  Z2SS   NUT    ANUT        
      1.74832735E-02    2      1000022        25                       # Z3SS   -->  Z1SS   HL0                
      6.76841894E-03    2      1000023        25                       # Z3SS   -->  Z2SS   HL0                
#         PDG         Width
DECAY   1000035  4.28618193E+00   # Z4SS  decays
#          BR          NDA       ID1       ID2       ID3       ID4
      7.72197879E-08    2      1000022        22                       # Z4SS   -->  Z1SS   GM                 
      1.69439982E-08    2      1000023        22                       # Z4SS   -->  Z2SS   GM                 
      4.29375258E-10    2      1000025        22                       # Z4SS   -->  Z3SS   GM                 
      3.04828793E-01    2      1000024       -24                       # Z4SS   -->  W1SS+  W-                 
      3.04828793E-01    2     -1000024        24                       # Z4SS   -->  W1SS-  W+                 
      1.74048506E-02    2      1000022        23                       # Z4SS   -->  Z1SS   Z0                 
      8.90677609E-03    2      1000023        23                       # Z4SS   -->  Z2SS   Z0                 
      2.64467737E-08    3      1000022         2        -2             # Z4SS   -->  Z1SS   UP     UB          
      2.17578560E-08    3      1000022         1        -1             # Z4SS   -->  Z1SS   DN     DB          
      2.17578560E-08    3      1000022         3        -3             # Z4SS   -->  Z1SS   ST     SB          
      2.64467310E-08    3      1000022         4        -4             # Z4SS   -->  Z1SS   CH     CB          
      3.53455135E-07    3      1000022         5        -5             # Z4SS   -->  Z1SS   BT     BB          
      5.70155294E-07    3      1000022        11       -11             # Z4SS   -->  Z1SS   E-     E+          
      5.70155294E-07    3      1000022        13       -13             # Z4SS   -->  Z1SS   MU-    MU+         
      2.17658521E-06    3      1000022        15       -15             # Z4SS   -->  Z1SS   TAU-   TAU+        
      6.51393236E-07    3      1000022        12       -12             # Z4SS   -->  Z1SS   NUE    ANUE        
      6.51393236E-07    3      1000022        14       -14             # Z4SS   -->  Z1SS   NUM    ANUM        
      6.68633561E-07    3      1000022        16       -16             # Z4SS   -->  Z1SS   NUT    ANUT        
      4.21908410E-08    3      1000023         2        -2             # Z4SS   -->  Z2SS   UP     UB          
      5.05329005E-08    3      1000023         1        -1             # Z4SS   -->  Z2SS   DN     DB          
      5.05329005E-08    3      1000023         3        -3             # Z4SS   -->  Z2SS   ST     SB          
      4.21907842E-08    3      1000023         4        -4             # Z4SS   -->  Z2SS   CH     CB          
      1.89098643E-07    3      1000023         5        -5             # Z4SS   -->  Z2SS   BT     BB          
      1.27280984E-07    3      1000023        11       -11             # Z4SS   -->  Z2SS   E-     E+          
      1.27280984E-07    3      1000023        13       -13             # Z4SS   -->  Z2SS   MU-    MU+         
      1.99669770E-07    3      1000023        15       -15             # Z4SS   -->  Z2SS   TAU-   TAU+        
      2.28549354E-07    3      1000023        12       -12             # Z4SS   -->  Z2SS   NUE    ANUE        
      2.28549354E-07    3      1000023        14       -14             # Z4SS   -->  Z2SS   NUM    ANUM        
      2.35582363E-07    3      1000023        16       -16             # Z4SS   -->  Z2SS   NUT    ANUT        
      1.41627554E-08    3      1000025         2        -2             # Z4SS   -->  Z3SS   UP     UB          
      1.82651725E-08    3      1000025         1        -1             # Z4SS   -->  Z3SS   DN     DB          
      1.82651725E-08    3      1000025         3        -3             # Z4SS   -->  Z3SS   ST     SB          
      1.41627554E-08    3      1000025         4        -4             # Z4SS   -->  Z3SS   CH     CB          
      3.46197915E-09    3      1000025         5        -5             # Z4SS   -->  Z3SS   BT     BB          
      4.14388612E-09    3      1000025        11       -11             # Z4SS   -->  Z3SS   E-     E+          
      4.14388612E-09    3      1000025        13       -13             # Z4SS   -->  Z3SS   MU-    MU+         
      3.37250960E-09    3      1000025        15       -15             # Z4SS   -->  Z3SS   TAU-   TAU+        
      8.24084001E-09    3      1000025        12       -12             # Z4SS   -->  Z3SS   NUE    ANUE        
      8.24084001E-09    3      1000025        14       -14             # Z4SS   -->  Z3SS   NUM    ANUM        
      8.24078406E-09    3      1000025        16       -16             # Z4SS   -->  Z3SS   NUT    ANUT        
      1.03272751E-01    2      1000022        25                       # Z4SS   -->  Z1SS   HL0                
      2.60750771E-01    2      1000023        25                       # Z4SS   -->  Z2SS   HL0                
#         PDG         Width
DECAY   1000024  2.09412538E-02   # W1SS+ decays
#          BR          NDA       ID1       ID2       ID3       ID4
      4.68530925E-06    3      1000022         2        -1             # W1SS+  -->  Z1SS   UP     DB          
      4.68530652E-06    3      1000022         4        -3             # W1SS+  -->  Z1SS   CH     SB          
      1.00589175E-04    3      1000022       -11        12             # W1SS+  -->  Z1SS   E+     NUE         
      1.00589175E-04    3      1000022       -13        14             # W1SS+  -->  Z1SS   MU+    NUM         
      1.04059000E-04    3      1000022       -15        16             # W1SS+  -->  Z1SS   TAU+   NUT         
      9.99685407E-01    2      1000022        24                       # W1SS+  -->  Z1SS   W+                 
      6.76567136E-12    3      1000023       -11        12             # W1SS+  -->  Z2SS   E+     NUE         
      6.76567136E-12    3      1000023       -13        14             # W1SS+  -->  Z2SS   MU+    NUM         
#         PDG         Width
DECAY   1000037  4.19912815E+00   # W2SS+ decays
#          BR          NDA       ID1       ID2       ID3       ID4
      3.59491850E-08    3      1000022         2        -1             # W2SS+  -->  Z1SS   UP     DB          
      3.59491672E-08    3      1000022         4        -3             # W2SS+  -->  Z1SS   CH     SB          
      9.50356764E-07    3      1000022       -11        12             # W2SS+  -->  Z1SS   E+     NUE         
      9.50356764E-07    3      1000022       -13        14             # W2SS+  -->  Z1SS   MU+    NUM         
      2.61856417E-06    3      1000022       -15        16             # W2SS+  -->  Z1SS   TAU+   NUT         
      1.10978544E-01    2      1000022        24                       # W2SS+  -->  Z1SS   W+                 
      3.54873251E-08    3      1000023         2        -1             # W2SS+  -->  Z2SS   UP     DB          
      3.54873144E-08    3      1000023         4        -3             # W2SS+  -->  Z2SS   CH     SB          
      1.42318143E-07    3      1000023       -11        12             # W2SS+  -->  Z2SS   E+     NUE         
      1.42318143E-07    3      1000023       -13        14             # W2SS+  -->  Z2SS   MU+    NUM         
      2.24861239E-07    3      1000023       -15        16             # W2SS+  -->  Z2SS   TAU+   NUT         
      3.12110901E-01    2      1000023        24                       # W2SS+  -->  Z2SS   W+                 
      4.88101364E-08    3      1000025         2        -1             # W2SS+  -->  Z3SS   UP     DB          
      4.88101364E-08    3      1000025         4        -3             # W2SS+  -->  Z3SS   CH     SB          
      1.62690643E-08    3      1000025       -11        12             # W2SS+  -->  Z3SS   E+     NUE         
      1.62690643E-08    3      1000025       -13        14             # W2SS+  -->  Z3SS   MU+    NUM         
      1.62759264E-08    3      1000025       -15        16             # W2SS+  -->  Z3SS   TAU+   NUT         
      2.97268510E-01    2      1000024        23                       # W2SS+  -->  W1SS+  Z0                 
      4.55329499E-08    3      1000024         1        -1             # W2SS+  -->  W1SS+  DN     DB          
      4.55328859E-08    3      1000024         3        -3             # W2SS+  -->  W1SS+  ST     SB          
      8.28547826E-08    3      1000024         2        -2             # W2SS+  -->  W1SS+  UP     UB          
      8.28547826E-08    3      1000024         4        -4             # W2SS+  -->  W1SS+  CH     CB          
      3.14092887E-07    3      1000024        12       -12             # W2SS+  -->  W1SS+  NUE    ANUE        
      3.14092887E-07    3      1000024        14       -14             # W2SS+  -->  W1SS+  NUM    ANUM        
      5.21564345E-07    3      1000024        16       -16             # W2SS+  -->  W1SS+  NUT    ANUT        
      1.75718483E-07    3      1000024        11       -11             # W2SS+  -->  W1SS+  E-     E+          
      1.75718483E-07    3      1000024        13       -13             # W2SS+  -->  W1SS+  MU-    MU+         
      1.81190742E-07    3      1000024        15       -15             # W2SS+  -->  W1SS+  TAU-   TAU+        
      2.79634684E-01    2      1000024        25                       # W2SS+  -->  W1SS+  HL0                
#         PDG         Width
DECAY        25  4.17191908E-03   # HL0   decays
#          BR          NDA       ID1       ID2       ID3       ID4
      4.81862994E-09    2           11       -11                       # HL0    -->  E-     E+                 
      2.03450254E-04    2           13       -13                       # HL0    -->  MU-    MU+                
      5.81891313E-02    2           15       -15                       # HL0    -->  TAU-   TAU+               
      6.04731986E-06    2            1        -1                       # HL0    -->  DN     DB                 
      2.44342024E-03    2            3        -3                       # HL0    -->  ST     SB                 
      8.00296366E-01    2            5        -5                       # HL0    -->  BT     BB                 
      1.89238835E-06    2            2        -2                       # HL0    -->  UP     UB                 
      3.55900414E-02    2            4        -4                       # HL0    -->  CH     CB                 
      1.83201907E-03    2           22        22                       # HL0    -->  GM     GM                 
      3.89921106E-02    2           21        21                       # HL0    -->  GL     GL                 
      3.22071789E-03    3           24        11       -12             # HL0    -->  W+     E-     ANUE        
      3.22071789E-03    3           24        13       -14             # HL0    -->  W+     MU-    ANUM        
      3.22071789E-03    3           24        15       -16             # HL0    -->  W+     TAU-   ANUT        
      9.66215413E-03    3           24        -2         1             # HL0    -->  W+     UB     DN          
      9.66215413E-03    3           24        -4         3             # HL0    -->  W+     CB     ST          
      3.22071789E-03    3          -24       -11        12             # HL0    -->  W-     E+     NUE         
      3.22071789E-03    3          -24       -13        14             # HL0    -->  W-     MU+    NUM         
      3.22071789E-03    3          -24       -15        16             # HL0    -->  W-     TAU+   NUT         
      9.66215413E-03    3          -24         2        -1             # HL0    -->  W-     UP     DB          
      9.66215413E-03    3          -24         4        -3             # HL0    -->  W-     CH     SB          
      3.05889756E-04    3           23        12       -12             # HL0    -->  Z0     NUE    ANUE        
      3.05889756E-04    3           23        14       -14             # HL0    -->  Z0     NUM    ANUM        
      3.05889756E-04    3           23        16       -16             # HL0    -->  Z0     NUT    ANUT        
      1.53951230E-04    3           23        11       -11             # HL0    -->  Z0     E-     E+          
      1.53951230E-04    3           23        13       -13             # HL0    -->  Z0     MU-    MU+         
      1.53951230E-04    3           23        15       -15             # HL0    -->  Z0     TAU-   TAU+        
      5.27423865E-04    3           23         2        -2             # HL0    -->  Z0     UP     UB          
      5.27423865E-04    3           23         4        -4             # HL0    -->  Z0     CH     CB          
      6.79451856E-04    3           23         1        -1             # HL0    -->  Z0     DN     DB          
      6.79451856E-04    3           23         3        -3             # HL0    -->  Z0     ST     SB          
      6.79451856E-04    3           23         5        -5             # HL0    -->  Z0     BT     BB          
#         PDG         Width
DECAY        35  3.52599931E+00   # HH0   decays
#          BR          NDA       ID1       ID2       ID3       ID4
      6.35729469E-09    2           11       -11                       # HH0    -->  E-     E+                 
      2.68416450E-04    2           13       -13                       # HH0    -->  MU-    MU+                
      7.68777505E-02    2           15       -15                       # HH0    -->  TAU-   TAU+               
      7.77073274E-06    2            1        -1                       # HH0    -->  DN     DB                 
      3.13976943E-03    2            3        -3                       # HH0    -->  ST     SB                 
      4.19422954E-01    2            5        -5                       # HH0    -->  BT     BB                 
      2.54229943E-10    2            2        -2                       # HH0    -->  UP     UB                 
      3.46937327E-06    2            4        -4                       # HH0    -->  CH     CB                 
      1.68849379E-01    2            6        -6                       # HH0    -->  TP     TB                 
      1.33853155E-06    2           22        22                       # HH0    -->  GM     GM                 
      7.57330126E-05    2           21        21                       # HH0    -->  GL     GL                 
      2.53982027E-04    2           24       -24                       # HH0    -->  W+     W-                 
      1.29539898E-04    2           23        23                       # HH0    -->  Z0     Z0                 
      2.87131616E-03    2      1000022   1000022                       # HH0    -->  Z1SS   Z1SS               
      1.82929076E-02    2      1000022   1000023                       # HH0    -->  Z1SS   Z2SS               
      1.34506911E-01    2      1000022   1000025                       # HH0    -->  Z1SS   Z3SS               
      2.91803107E-02    2      1000022   1000035                       # HH0    -->  Z1SS   Z4SS               
      1.81030836E-02    2      1000023   1000023                       # HH0    -->  Z2SS   Z2SS               
      8.96551311E-02    2      1000023   1000025                       # HH0    -->  Z2SS   Z3SS               
      3.77602614E-02    2      1000024  -1000024                       # HH0    -->  W1SS+  W1SS-              
      5.99899970E-04    2           25        25                       # HH0    -->  HL0    HL0                
#         PDG         Width
DECAY        36  3.72689629E+00   # HA0   decays
#          BR          NDA       ID1       ID2       ID3       ID4
      5.97608274E-09    2           11       -11                       # HA0    -->  E-     E+                 
      2.52321013E-04    2           13       -13                       # HA0    -->  MU-    MU+                
      7.22683445E-02    2           15       -15                       # HA0    -->  TAU-   TAU+               
      7.30514694E-06    2            1        -1                       # HA0    -->  DN     DB                 
      2.95164902E-03    2            3        -3                       # HA0    -->  ST     SB                 
      3.94303024E-01    2            5        -5                       # HA0    -->  BT     BB                 
      2.33741276E-10    2            2        -2                       # HA0    -->  UP     UB                 
      3.19221272E-06    2            4        -4                       # HA0    -->  CH     CB                 
      1.64577454E-01    2            6        -6                       # HA0    -->  TP     TB                 
      4.36611771E-07    2           22        22                       # HA0    -->  GM     GM                 
      1.12974849E-04    2           21        21                       # HA0    -->  GL     GL                 
      3.90279968E-03    2      1000022   1000022                       # HA0    -->  Z1SS   Z1SS               
      3.36066931E-02    2      1000022   1000023                       # HA0    -->  Z1SS   Z2SS               
      3.31560001E-02    2      1000022   1000025                       # HA0    -->  Z1SS   Z3SS               
      1.04170546E-01    2      1000022   1000035                       # HA0    -->  Z1SS   Z4SS               
      6.16373383E-02    2      1000023   1000023                       # HA0    -->  Z2SS   Z2SS               
      1.28815010E-01    2      1000024  -1000024                       # HA0    -->  W1SS+  W1SS-              
      2.34847350E-04    2           25        23                       # HA0    -->  HL0    Z0                 
#         PDG         Width
DECAY        37  3.20670986E+00   # H+    decays
#          BR          NDA       ID1       ID2       ID3       ID4
      7.01122671E-09    2           12       -11                       # H+     -->  NUE    E+                 
      2.96026643E-04    2           14       -13                       # H+     -->  NUM    MU+                
      8.47862661E-02    2           16       -15                       # H+     -->  NUT    TAU+               
      7.89510250E-06    2            2        -1                       # H+     -->  UP     DB                 
      3.19335819E-03    2            4        -3                       # H+     -->  CH     SB                 
      5.85800111E-01    2            6        -5                       # H+     -->  TP     BB                 
      5.75945564E-02    2      1000024   1000022                       # H+     -->  W1SS+  Z1SS               
      2.62269041E-05    2      1000024   1000023                       # H+     -->  W1SS+  Z2SS               
      1.21395193E-01    2      1000024   1000025                       # H+     -->  W1SS+  Z3SS               
      1.46622121E-01    2      1000037   1000022                       # H+     -->  W2SS+  Z1SS               
      2.78210093E-04    2           25        24                       # H+     -->  HL0    W+                 
