#  ISAJET SUSY parameters in SUSY Les Houches Accord 2 format
#  Created by ISALHA 2.0 Last revision: C. Balazs 21 Apr 2009
Block SPINFO   # Program information
     1   ISASUGRA from ISAJET          # Spectrum Calculator
     2   7.80   29-OCT-2009 12:50:36   # Version number
Block MODSEL   # Model selection
     1     1   # Minimal supergravity (mSUGRA) model               
Block SMINPUTS   # Standard Model inputs
     1     1.27834114E+02   # alpha_em^(-1)
     2     1.16570000E-05   # G_Fermi
     3     1.17200002E-01   # alpha_s(M_Z)
     4     9.11699982E+01   # m_{Z}(pole)
     5     4.19999981E+00   # m_{b}(m_{b})
     6     1.72500000E+02   # m_{top}(pole)
     7     1.77699995E+00   # m_{tau}(pole)
Block MINPAR   # SUSY breaking input parameters
     1     2.26000000E+03   # m_0
     2     3.90000000E+02   # m_{1/2}
     3     1.00000000E+01   # tan(beta)
     4     1.00000000E+00   # sign(mu)
     5     0.00000000E+00   # A_0
Block EXTPAR   # Non-universal SUSY breaking parameters
     0     2.04345417E+16   # Input scale
Block MASS   # Scalar and gaugino mass spectrum
#  PDG code   mass                 particle
        24     8.04229965E+01   #  W^+
        25     1.15570328E+02   #  h^0            
        35     2.29840918E+03   #  H^0            
        36     2.28330762E+03   #  A^0            
        37     2.29998975E+03   #  H^+            
   1000001     2.37464038E+03   #  dnl            
   1000002     2.37329053E+03   #  upl            
   1000003     2.37464038E+03   #  stl            
   1000004     2.37329077E+03   #  chl            
   1000005     1.96554224E+03   #  b1             
   1000006     1.44074072E+03   #  t1             
   1000011     2.27027905E+03   #  el-            
   1000012     2.26952637E+03   #  nuel           
   1000013     2.27027905E+03   #  mul-           
   1000014     2.26952637E+03   #  numl           
   1000015     2.24149976E+03   #  tau1           
   1000016     2.25938647E+03   #  nutl           
   1000021     1.02555457E+03   #  glss           
   1000022     1.63839661E+02   #  z1ss           
   1000023     3.06315002E+02   #  z2ss           
   1000024     3.07542633E+02   #  w1ss           
   1000025    -4.67701538E+02   #  z3ss           
   1000035     4.90454803E+02   #  z4ss           
   1000037     4.89188019E+02   #  w2ss           
   2000001     2.37316724E+03   #  dnr            
   2000002     2.37265869E+03   #  upr            
   2000003     2.37316724E+03   #  str            
   2000004     2.37265918E+03   #  chr            
   2000005     2.34949341E+03   #  b2             
   2000006     1.97599744E+03   #  t2             
   2000011     2.26243774E+03   #  er-            
   2000013     2.26243774E+03   #  mur-           
   2000015     2.26000977E+03   #  tau2           
Block ALPHA   # Effective Higgs mixing parameter
         -1.00065447E-01   # alpha
Block STOPMIX   # stop mixing matrix
  1  1     4.60313708E-02   # O_{11}
  1  2     9.98939991E-01   # O_{12}
  2  1    -9.98939991E-01   # O_{21}
  2  2     4.60313708E-02   # O_{22}
Block SBOTMIX   # sbottom mixing matrix
  1  1     9.99952137E-01   # O_{11}
  1  2     9.78667289E-03   # O_{12}
  2  1    -9.78667289E-03   # O_{21}
  2  2     9.99952137E-01   # O_{22}
Block STAUMIX   # stau mixing matrix
  1  1     1.38499007E-01   # O_{11}
  1  2     9.90362585E-01   # O_{12}
  2  1    -9.90362585E-01   # O_{21}
  2  2     1.38499007E-01   # O_{22}
Block NMIX   # neutralino mixing matrix
  1  1     9.91796136E-01   #
  1  2    -2.97098346E-02   #
  1  3     1.13991626E-01   #
  1  4    -4.96334881E-02   #
  2  1    -7.09480867E-02   #
  2  2    -9.33654904E-01   #
  2  3     2.84210593E-01   #
  2  4    -2.06104785E-01   #
  3  1     4.33070213E-02   #
  3  2    -6.02232702E-02   #
  3  3    -7.01230228E-01   #
  3  4    -7.09065676E-01   #
  4  1    -9.71139595E-02   #
  4  2     3.51822317E-01   #
  4  3     6.43821955E-01   #
  4  4    -6.72519922E-01   #
Block UMIX   # chargino U mixing matrix
  1  1    -9.18146431E-01   # U_{11}
  1  2     3.96241248E-01   # U_{12}
  2  1    -3.96241248E-01   # U_{21}
  2  2    -9.18146431E-01   # U_{22}
Block VMIX   # chargino V mixing matrix
  1  1    -9.58298743E-01   # V_{11}
  1  2     2.85768211E-01   # V_{12}
  2  1    -2.85768211E-01   # V_{21}
  2  2    -9.58298743E-01   # V_{22}
Block GAUGE Q=  1.66097632E+03   #
     1     3.57511789E-01   # g`
     2     6.52482510E-01   # g_2
     3     1.22048998E+00   # g_3
Block YU Q=  1.66097632E+03   #
  3  3     8.51120293E-01   # y_t
Block YD Q=  1.66097632E+03   #
  3  3     1.31102562E-01   # y_b
Block YE Q=  1.66097632E+03   #
  3  3     1.01807825E-01   # y_tau
Block HMIX Q=  1.66097632E+03   # Higgs mixing parameters
     1     4.57093781E+02   # mu(Q)
     2     1.00000000E+01   # tan(beta)(M_GUT)
     3     2.51540009E+02   # Higgs vev at Q
     4     5.21349350E+06   # m_A^2(Q)
Block MSOFT Q=  1.66097632E+03   # DRbar SUSY breaking parameters
     1     1.66792480E+02   # M_1(Q)          
     2     3.06919708E+02   # M_2(Q)          
     3     8.82774109E+02   # M_3(Q)          
    31     2.26258716E+03   # MeL(Q)          
    32     2.26258716E+03   # MmuL(Q)         
    33     2.25269238E+03   # MtauL(Q)        
    34     2.25982129E+03   # MeR(Q)          
    35     2.25982129E+03   # MmuR(Q)         
    36     2.23982373E+03   # MtauR(Q)        
    41     2.32974341E+03   # MqL1(Q)         
    42     2.32974341E+03   # MqL2(Q)         
    43     1.92983203E+03   # MqL3(Q)         
    44     2.32878174E+03   # MuR(Q)          
    45     2.32878174E+03   # McR(Q)          
    46     1.42957654E+03   # MtR(Q)          
    47     2.32888184E+03   # MdR(Q)          
    48     2.32888184E+03   # MsR(Q)          
    49     2.31349927E+03   # MbR(Q)          
Block AU Q=  1.66097632E+03   #
  1  1    -6.48986816E+02   # A_u
  2  2    -6.48986816E+02   # A_c
  3  3    -6.48986816E+02   # A_t
Block AD Q=  1.66097632E+03   #
  1  1    -9.56856567E+02   # A_d
  2  2    -9.56856567E+02   # A_s
  3  3    -9.56856567E+02   # A_b
Block AE Q=  1.66097632E+03   #
  1  1    -2.27770599E+02   # A_e
  2  2    -2.27770599E+02   # A_mu
  3  3    -2.27770599E+02   # A_tau
#  ISAJET decay tables in SUSY Les Houches accord format
#  Created by ISALHD. Last revision: C. Balazs, 2005 May 25
Block DCINFO                           # Program information
     1   ISASUGRA from ISAJET          # Spectrum Calculator
     2   7.80   29-OCT-2009 12:50:36   # Version number
#         PDG         Width
DECAY         6  1.14680779E+00   # TP    decays
#          BR          NDA       ID1       ID2       ID3       ID4
      3.33333343E-01    3            2        -1         5             # TP     -->  UP     DB     BT          
      3.33333343E-01    3            4        -3         5             # TP     -->  CH     SB     BT          
      1.11111112E-01    3          -11        12         5             # TP     -->  E+     NUE    BT          
      1.11111112E-01    3          -13        14         5             # TP     -->  MU+    NUM    BT          
      1.11111112E-01    3          -15        16         5             # TP     -->  TAU+   NUT    BT          
#         PDG         Width
DECAY   1000021  3.38835455E-03   # GLSS  decays
#          BR          NDA       ID1       ID2       ID3       ID4
      4.06853780E-02    3      1000024         1        -2             # GLSS   -->  W1SS+  DN     UB          
      4.06853780E-02    3     -1000024         2        -1             # GLSS   -->  W1SS-  UP     DB          
      4.06853668E-02    3      1000024         3        -4             # GLSS   -->  W1SS+  ST     CB          
      4.06853668E-02    3     -1000024         4        -3             # GLSS   -->  W1SS-  CH     SB          
      5.80677837E-02    3      1000024         5        -6             # GLSS   -->  W1SS+  BT     TB          
      5.80677837E-02    3     -1000024         6        -5             # GLSS   -->  W1SS-  TP     BB          
      2.19433568E-03    3      1000037         1        -2             # GLSS   -->  W2SS+  DN     UB          
      2.19433568E-03    3     -1000037         2        -1             # GLSS   -->  W2SS-  UP     DB          
      2.19433475E-03    3      1000037         3        -4             # GLSS   -->  W2SS+  ST     CB          
      2.19433475E-03    3     -1000037         4        -3             # GLSS   -->  W2SS-  CH     SB          
      1.25512093E-01    3      1000037         5        -6             # GLSS   -->  W2SS+  BT     TB          
      1.25512093E-01    3     -1000037         6        -5             # GLSS   -->  W2SS-  TP     BB          
      2.80125221E-08    2      1000022        21                       # GLSS   -->  Z1SS   GL                 
      1.81110594E-02    3      1000022         2        -2             # GLSS   -->  Z1SS   UP     UB          
      5.79713332E-03    3      1000022         1        -1             # GLSS   -->  Z1SS   DN     DB          
      5.79713332E-03    3      1000022         3        -3             # GLSS   -->  Z1SS   ST     SB          
      1.81110408E-02    3      1000022         4        -4             # GLSS   -->  Z1SS   CH     CB          
      8.00599903E-03    3      1000022         5        -5             # GLSS   -->  Z1SS   BT     BB          
      8.78866017E-02    3      1000022         6        -6             # GLSS   -->  Z1SS   TP     TB          
      2.39429623E-03    2      1000023        21                       # GLSS   -->  Z2SS   GL                 
      2.08828878E-02    3      1000023         2        -2             # GLSS   -->  Z2SS   UP     UB          
      1.96588170E-02    3      1000023         1        -1             # GLSS   -->  Z2SS   DN     DB          
      1.96588170E-02    3      1000023         3        -3             # GLSS   -->  Z2SS   ST     SB          
      2.08828803E-02    3      1000023         4        -4             # GLSS   -->  Z2SS   CH     CB          
      4.62925807E-02    3      1000023         5        -5             # GLSS   -->  Z2SS   BT     BB          
      1.97274163E-02    3      1000023         6        -6             # GLSS   -->  Z2SS   TP     TB          
      1.65596846E-02    2      1000025        21                       # GLSS   -->  Z3SS   GL                 
      1.60140407E-05    3      1000025         2        -2             # GLSS   -->  Z3SS   UP     UB          
      2.09039299E-05    3      1000025         1        -1             # GLSS   -->  Z3SS   DN     DB          
      2.09039299E-05    3      1000025         3        -3             # GLSS   -->  Z3SS   ST     SB          
      1.60140335E-05    3      1000025         4        -4             # GLSS   -->  Z3SS   CH     CB          
      1.61839381E-03    3      1000025         5        -5             # GLSS   -->  Z3SS   BT     BB          
      4.72128689E-02    3      1000025         6        -6             # GLSS   -->  Z3SS   TP     TB          
      1.42292874E-02    2      1000035        21                       # GLSS   -->  Z4SS   GL                 
      1.08197855E-03    3      1000035         2        -2             # GLSS   -->  Z4SS   UP     UB          
      1.27571321E-03    3      1000035         1        -1             # GLSS   -->  Z4SS   DN     DB          
      1.27571321E-03    3      1000035         3        -3             # GLSS   -->  Z4SS   ST     SB          
      1.08197797E-03    3      1000035         4        -4             # GLSS   -->  Z4SS   CH     CB          
      4.27343277E-03    3      1000035         5        -5             # GLSS   -->  Z4SS   BT     BB          
      7.94318095E-02    3      1000035         6        -6             # GLSS   -->  Z4SS   TP     TB          
#         PDG         Width
DECAY   1000002  1.17701988E+02   # UPL   decays
#          BR          NDA       ID1       ID2       ID3       ID4
      1.94215379E-03    2      1000022         2                       # UPL    -->  Z1SS   UP                 
      7.35478178E-02    2      1000023         2                       # UPL    -->  Z2SS   UP                 
      2.14386164E-04    2      1000025         2                       # UPL    -->  Z3SS   UP                 
      8.67842883E-03    2      1000035         2                       # UPL    -->  Z4SS   UP                 
      7.52211809E-01    2      1000021         2                       # UPL    -->  GLSS   UP                 
      1.50695950E-01    2      1000024         1                       # UPL    -->  W1SS+  DN                 
      1.27094565E-02    2      1000037         1                       # UPL    -->  W2SS+  DN                 
#         PDG         Width
DECAY   1000001  1.17728302E+02   # DNL   decays
#          BR          NDA       ID1       ID2       ID3       ID4
      3.75881698E-03    2      1000022         1                       # DNL    -->  Z1SS   DN                 
      6.95905015E-02    2      1000023         1                       # DNL    -->  Z2SS   DN                 
      3.64409905E-04    2      1000025         1                       # DNL    -->  Z3SS   DN                 
      1.06306700E-02    2      1000035         1                       # DNL    -->  Z4SS   DN                 
      7.52823889E-01    2      1000021         1                       # DNL    -->  GLSS   DN                 
      1.38385445E-01    2     -1000024         2                       # DNL    -->  W1SS-  UP                 
      2.44462434E-02    2     -1000037         2                       # DNL    -->  W2SS-  UP                 
#         PDG         Width
DECAY   1000003  1.17728294E+02   # STL   decays
#          BR          NDA       ID1       ID2       ID3       ID4
      3.75881721E-03    2      1000022         3                       # STL    -->  Z1SS   ST                 
      6.95905089E-02    2      1000023         3                       # STL    -->  Z2SS   ST                 
      3.64409934E-04    2      1000025         3                       # STL    -->  Z3SS   ST                 
      1.06306709E-02    2      1000035         3                       # STL    -->  Z4SS   ST                 
      7.52823949E-01    2      1000021         3                       # STL    -->  GLSS   ST                 
      1.38385370E-01    2     -1000024         4                       # STL    -->  W1SS-  CH                 
      2.44462322E-02    2     -1000037         4                       # STL    -->  W2SS-  CH                 
#         PDG         Width
DECAY   1000004  1.17701920E+02   # CHL   decays
#          BR          NDA       ID1       ID2       ID3       ID4
      1.94215402E-03    2      1000022         4                       # CHL    -->  Z1SS   CH                 
      7.35478252E-02    2      1000023         4                       # CHL    -->  Z2SS   CH                 
      2.14386178E-04    2      1000025         4                       # CHL    -->  Z3SS   CH                 
      8.67842883E-03    2      1000035         4                       # CHL    -->  Z4SS   CH                 
      7.52211690E-01    2      1000021         4                       # CHL    -->  GLSS   CH                 
      1.50696069E-01    2      1000024         3                       # CHL    -->  W1SS+  ST                 
      1.27094649E-02    2      1000037         3                       # CHL    -->  W2SS+  ST                 
#         PDG         Width
DECAY   1000005  1.08861305E+02   # BT1   decays
#          BR          NDA       ID1       ID2       ID3       ID4
      3.46068642E-03    2      1000022         5                       # BT1    -->  Z1SS   BT                 
      6.19138107E-02    2      1000023         5                       # BT1    -->  Z2SS   BT                 
      3.11322580E-03    2      1000025         5                       # BT1    -->  Z3SS   BT                 
      1.13944644E-02    2      1000035         5                       # BT1    -->  Z4SS   BT                 
      5.49155414E-01    2      1000021         5                       # BT1    -->  GLSS   BT                 
      1.36589289E-01    2     -1000024         6                       # BT1    -->  W1SS-  TP                 
      2.25185961E-01    2     -1000037         6                       # BT1    -->  W2SS-  TP                 
      9.18714236E-03    2          -24   1000006                       # BT1    -->  W-     TP1                
#         PDG         Width
DECAY   1000006  5.33291016E+01   # TP1   decays
#          BR          NDA       ID1       ID2       ID3       ID4
      3.54039907E-01    2      1000021         6                       # TP1    -->  GLSS   TP                 
      5.77247478E-02    2      1000022         6                       # TP1    -->  Z1SS   TP                 
      1.77637637E-02    2      1000023         6                       # TP1    -->  Z2SS   TP                 
      1.48149475E-01    2      1000025         6                       # TP1    -->  Z3SS   TP                 
      1.24453172E-01    2      1000035         6                       # TP1    -->  Z4SS   TP                 
      3.49081159E-02    2      1000024         5                       # TP1    -->  W1SS+  BT                 
      2.62960851E-01    2      1000037         5                       # TP1    -->  W2SS+  BT                 
#         PDG         Width
DECAY   2000002  9.38012772E+01   # UPR   decays
#          BR          NDA       ID1       ID2       ID3       ID4
      5.57103530E-02    2      1000022         2                       # UPR    -->  Z1SS   UP                 
      2.78307649E-04    2      1000023         2                       # UPR    -->  Z2SS   UP                 
      9.90685003E-05    2      1000025         2                       # UPR    -->  Z3SS   UP                 
      4.94169130E-04    2      1000035         2                       # UPR    -->  Z4SS   UP                 
      9.43418086E-01    2      1000021         2                       # UPR    -->  GLSS   UP                 
#         PDG         Width
DECAY   2000001  8.98555908E+01   # DNR   decays
#          BR          NDA       ID1       ID2       ID3       ID4
      1.45423459E-02    2      1000022         1                       # DNR    -->  Z1SS   DN                 
      7.26487488E-05    2      1000023         1                       # DNR    -->  Z2SS   DN                 
      2.58611235E-05    2      1000025         1                       # DNR    -->  Z3SS   DN                 
      1.28999774E-04    2      1000035         1                       # DNR    -->  Z4SS   DN                 
      9.85230148E-01    2      1000021         1                       # DNR    -->  GLSS   DN                 
#         PDG         Width
DECAY   2000003  8.98555908E+01   # STR   decays
#          BR          NDA       ID1       ID2       ID3       ID4
      1.45423459E-02    2      1000022         3                       # STR    -->  Z1SS   ST                 
      7.26487488E-05    2      1000023         3                       # STR    -->  Z2SS   ST                 
      2.58611235E-05    2      1000025         3                       # STR    -->  Z3SS   ST                 
      1.28999774E-04    2      1000035         3                       # STR    -->  Z4SS   ST                 
      9.85230148E-01    2      1000021         3                       # STR    -->  GLSS   ST                 
#         PDG         Width
DECAY   2000004  9.38012238E+01   # CHR   decays
#          BR          NDA       ID1       ID2       ID3       ID4
      5.57103641E-02    2      1000022         4                       # CHR    -->  Z1SS   CH                 
      2.78307707E-04    2      1000023         4                       # CHR    -->  Z2SS   CH                 
      9.90685148E-05    2      1000025         4                       # CHR    -->  Z3SS   CH                 
      4.94169130E-04    2      1000035         4                       # CHR    -->  Z4SS   CH                 
      9.43418145E-01    2      1000021         4                       # CHR    -->  GLSS   CH                 
#         PDG         Width
DECAY   2000005  8.98299942E+01   # BT2   decays
#          BR          NDA       ID1       ID2       ID3       ID4
      1.44763561E-02    2      1000022         5                       # BT2    -->  Z1SS   BT                 
      6.56153192E-04    2      1000023         5                       # BT2    -->  Z2SS   BT                 
      4.29879408E-03    2      1000025         5                       # BT2    -->  Z3SS   BT                 
      3.82460537E-03    2      1000035         5                       # BT2    -->  Z4SS   BT                 
      9.67482626E-01    2      1000021         5                       # BT2    -->  GLSS   BT                 
      1.11523026E-03    2     -1000024         6                       # BT2    -->  W1SS-  TP                 
      7.48056779E-03    2     -1000037         6                       # BT2    -->  W2SS-  TP                 
      4.57514943E-06    2          -24   1000006                       # BT2    -->  W-     TP1                
      2.09540900E-04    2          -24   2000006                       # BT2    -->  W-     TP2                
      1.12897746E-04    2           23   1000005                       # BT2    -->  Z0     BT1                
      3.38652695E-04    2           25   1000005                       # BT2    -->  HL0    BT1                
#         PDG         Width
DECAY   2000006  1.08169884E+02   # TP2   decays
#          BR          NDA       ID1       ID2       ID3       ID4
      5.37486315E-01    2      1000021         6                       # TP2    -->  GLSS   TP                 
      1.30447969E-01    2      1000024         5                       # TP2    -->  W1SS+  BT                 
      2.07204167E-02    2      1000037         5                       # TP2    -->  W2SS+  BT                 
      4.88333125E-03    2           23   1000006                       # TP2    -->  Z0     TP1                
      9.93667264E-03    2           25   1000006                       # TP2    -->  HL0    TP1                
      2.07473850E-03    2      1000022         6                       # TP2    -->  Z1SS   TP                 
      7.09142238E-02    2      1000023         6                       # TP2    -->  Z2SS   TP                 
      1.11006573E-01    2      1000025         6                       # TP2    -->  Z3SS   TP                 
      1.12529702E-01    2      1000035         6                       # TP2    -->  Z4SS   TP                 
#         PDG         Width
DECAY   1000011  3.02665367E+01   # EL-   decays
#          BR          NDA       ID1       ID2       ID3       ID4
      8.30014348E-02    2      1000022        11                       # EL-    -->  Z1SS   E-                 
      2.87927687E-01    2      1000023        11                       # EL-    -->  Z2SS   E-                 
      3.84025188E-04    2      1000025        11                       # EL-    -->  Z3SS   E-                 
      2.55592298E-02    2      1000035        11                       # EL-    -->  Z4SS   E-                 
      5.12973905E-01    2     -1000024        12                       # EL-    -->  W1SS-  NUE                
      9.01537165E-02    2     -1000037        12                       # EL-    -->  W2SS-  NUE                
#         PDG         Width
DECAY   1000013  3.02665367E+01   # MUL-  decays
#          BR          NDA       ID1       ID2       ID3       ID4
      8.30014348E-02    2      1000022        13                       # MUL-   -->  Z1SS   MU-                
      2.87927687E-01    2      1000023        13                       # MUL-   -->  Z2SS   MU-                
      3.84025188E-04    2      1000025        13                       # MUL-   -->  Z3SS   MU-                
      2.55592298E-02    2      1000035        13                       # MUL-   -->  Z4SS   MU-                
      5.12973905E-01    2     -1000024        14                       # MUL-   -->  W1SS-  NUM                
      9.01537165E-02    2     -1000037        14                       # MUL-   -->  W2SS-  NUM                
#         PDG         Width
DECAY   1000015  1.25286837E+01   # TAU1- decays
#          BR          NDA       ID1       ID2       ID3       ID4
      8.75915170E-01    2      1000022        15                       # TAU1-  -->  Z1SS   TAU-               
      3.19381356E-02    2      1000023        15                       # TAU1-  -->  Z2SS   TAU-               
      1.63738597E-02    2      1000025        15                       # TAU1-  -->  Z3SS   TAU-               
      1.22360485E-02    2      1000035        15                       # TAU1-  -->  Z4SS   TAU-               
      5.23192622E-02    2     -1000024        16                       # TAU1-  -->  W1SS-  NUT                
      1.12175616E-02    2     -1000037        16                       # TAU1-  -->  W2SS-  NUT                
#         PDG         Width
DECAY   1000012  3.03077068E+01   # NUEL  decays
#          BR          NDA       ID1       ID2       ID3       ID4
      1.03067644E-01    2      1000022        12                       # NUEL   -->  Z1SS   NUE                
      2.43187964E-01    2      1000023        12                       # NUEL   -->  Z2SS   NUE                
      2.04044487E-03    2      1000025        12                       # NUEL   -->  Z3SS   NUE                
      4.70313393E-02    2      1000035        12                       # NUEL   -->  Z4SS   NUE                
      5.57863593E-01    2      1000024        11                       # NUEL   -->  W1SS+  E-                 
      4.68090363E-02    2      1000037        11                       # NUEL   -->  W2SS+  E-                 
#         PDG         Width
DECAY   1000014  3.03077068E+01   # NUML  decays
#          BR          NDA       ID1       ID2       ID3       ID4
      1.03067644E-01    2      1000022        14                       # NUML   -->  Z1SS   NUM                
      2.43187964E-01    2      1000023        14                       # NUML   -->  Z2SS   NUM                
      2.04044487E-03    2      1000025        14                       # NUML   -->  Z3SS   NUM                
      4.70313393E-02    2      1000035        14                       # NUML   -->  Z4SS   NUM                
      5.57863593E-01    2      1000024        13                       # NUML   -->  W1SS+  MU-                
      4.68090363E-02    2      1000037        13                       # NUML   -->  W2SS+  MU-                
#         PDG         Width
DECAY   1000016  3.06079559E+01   # NUTL  decays
#          BR          NDA       ID1       ID2       ID3       ID4
      1.01591051E-01    2      1000022        16                       # NUTL   -->  Z1SS   NUT                
      2.39646539E-01    2      1000023        16                       # NUTL   -->  Z2SS   NUT                
      2.00979761E-03    2      1000025        16                       # NUTL   -->  Z3SS   NUT                
      4.63210568E-02    2      1000035        16                       # NUTL   -->  Z4SS   NUT                
      5.52127957E-01    2      1000024        15                       # NUTL   -->  W1SS+  TAU-               
      5.83035834E-02    2      1000037        15                       # NUTL   -->  W2SS+  TAU-               
      3.35611122E-10    3      1000015        16       -15             # NUTL   -->  TAU1-  NUT    TAU+        
      3.35611122E-10    3      1000015        12       -11             # NUTL   -->  TAU1-  NUE    E+          
      3.35611122E-10    3      1000015        14       -13             # NUTL   -->  TAU1-  NUM    MU+         
      1.00683339E-09    3      1000015         2        -1             # NUTL   -->  TAU1-  UP     DB          
      1.00683339E-09    3      1000015         4        -3             # NUTL   -->  TAU1-  CH     SB          
#         PDG         Width
DECAY   2000011  1.13750687E+01   # ER-   decays
#          BR          NDA       ID1       ID2       ID3       ID4
      9.84689057E-01    2      1000022        11                       # ER-    -->  Z1SS   E-                 
      4.90719080E-03    2      1000023        11                       # ER-    -->  Z2SS   E-                 
      1.73861068E-03    2      1000025        11                       # ER-    -->  Z3SS   E-                 
      8.66514258E-03    2      1000035        11                       # ER-    -->  Z4SS   E-                 
#         PDG         Width
DECAY   2000013  1.13750687E+01   # MUR-  decays
#          BR          NDA       ID1       ID2       ID3       ID4
      9.84689057E-01    2      1000022        13                       # MUR-   -->  Z1SS   MU-                
      4.90719080E-03    2      1000023        13                       # MUR-   -->  Z2SS   MU-                
      1.73861068E-03    2      1000025        13                       # MUR-   -->  Z3SS   MU-                
      8.66514258E-03    2      1000035        13                       # MUR-   -->  Z4SS   MU-                
#         PDG         Width
DECAY   2000015  3.01858215E+01   # TAU2- decays
#          BR          NDA       ID1       ID2       ID3       ID4
      8.72942880E-02    2      1000022        15                       # TAU2-  -->  Z1SS   TAU-               
      2.78272182E-01    2      1000023        15                       # TAU2-  -->  Z2SS   TAU-               
      8.71245097E-03    2      1000025        15                       # TAU2-  -->  Z3SS   TAU-               
      3.57808955E-02    2      1000035        15                       # TAU2-  -->  Z4SS   TAU-               
      4.92377162E-01    2     -1000024        16                       # TAU2-  -->  W1SS-  NUT                
      9.75629836E-02    2     -1000037        16                       # TAU2-  -->  W2SS-  NUT                
#         PDG         Width
DECAY   1000023  2.27721911E-02   # Z2SS  decays
#          BR          NDA       ID1       ID2       ID3       ID4
      1.95035204E-06    2      1000022        22                       # Z2SS   -->  Z1SS   GM                 
      9.81906503E-02    2      1000022        23                       # Z2SS   -->  Z1SS   Z0                 
      2.10046931E-08    3      1000022         2        -2             # Z2SS   -->  Z1SS   UP     UB          
      3.59560168E-08    3      1000022         1        -1             # Z2SS   -->  Z1SS   DN     DB          
      3.59560168E-08    3      1000022         3        -3             # Z2SS   -->  Z1SS   ST     SB          
      2.10046824E-08    3      1000022         4        -4             # Z2SS   -->  Z1SS   CH     CB          
      8.95292658E-08    3      1000022         5        -5             # Z2SS   -->  Z1SS   BT     BB          
      9.78950609E-08    3      1000022        11       -11             # Z2SS   -->  Z1SS   E-     E+          
      9.78950609E-08    3      1000022        13       -13             # Z2SS   -->  Z1SS   MU-    MU+         
      1.04381080E-07    3      1000022        15       -15             # Z2SS   -->  Z1SS   TAU-   TAU+        
      1.00238111E-07    3      1000022        12       -12             # Z2SS   -->  Z1SS   NUE    ANUE        
      1.00238111E-07    3      1000022        14       -14             # Z2SS   -->  Z1SS   NUM    ANUM        
      1.02070111E-07    3      1000022        16       -16             # Z2SS   -->  Z1SS   NUT    ANUT        
      9.01806593E-01    2      1000022        25                       # Z2SS   -->  Z1SS   HL0                
#         PDG         Width
DECAY   1000025  1.73906076E+00   # Z3SS  decays
#          BR          NDA       ID1       ID2       ID3       ID4
      1.38394228E-07    2      1000022        22                       # Z3SS   -->  Z1SS   GM                 
      7.43601845E-07    2      1000023        22                       # Z3SS   -->  Z2SS   GM                 
      2.85356730E-01    2      1000024       -24                       # Z3SS   -->  W1SS+  W-                 
      2.85356730E-01    2     -1000024        24                       # Z3SS   -->  W1SS-  W+                 
      1.55309111E-01    2      1000022        23                       # Z3SS   -->  Z1SS   Z0                 
      2.47137755E-01    2      1000023        23                       # Z3SS   -->  Z2SS   Z0                 
      8.85071530E-11    3      1000022         2        -2             # Z3SS   -->  Z1SS   UP     UB          
      3.57125614E-11    3      1000022         1        -1             # Z3SS   -->  Z1SS   DN     DB          
      3.57125614E-11    3      1000022         3        -3             # Z3SS   -->  Z1SS   ST     SB          
      8.85070975E-11    3      1000022         4        -4             # Z3SS   -->  Z1SS   CH     CB          
      7.88205590E-09    3      1000022         5        -5             # Z3SS   -->  Z1SS   BT     BB          
      1.83132953E-10    3      1000022        11       -11             # Z3SS   -->  Z1SS   E-     E+          
      1.83132953E-10    3      1000022        13       -13             # Z3SS   -->  Z1SS   MU-    MU+         
      6.68295908E-09    3      1000022        15       -15             # Z3SS   -->  Z1SS   TAU-   TAU+        
      1.38699205E-10    3      1000022        12       -12             # Z3SS   -->  Z1SS   NUE    ANUE        
      1.38699205E-10    3      1000022        14       -14             # Z3SS   -->  Z1SS   NUM    ANUM        
      1.41266679E-10    3      1000022        16       -16             # Z3SS   -->  Z1SS   NUT    ANUT        
      2.68103265E-11    3      1000023         2        -2             # Z3SS   -->  Z2SS   UP     UB          
      4.29377575E-11    3      1000023         1        -1             # Z3SS   -->  Z2SS   DN     DB          
      4.29377575E-11    3      1000023         3        -3             # Z3SS   -->  Z2SS   ST     SB          
      2.68103109E-11    3      1000023         4        -4             # Z3SS   -->  Z2SS   CH     CB          
      3.20658700E-09    3      1000023         5        -5             # Z3SS   -->  Z2SS   BT     BB          
      5.55024950E-12    3      1000023        11       -11             # Z3SS   -->  Z2SS   E-     E+          
      5.55024950E-12    3      1000023        13       -13             # Z3SS   -->  Z2SS   MU-    MU+         
      4.69697614E-10    3      1000023        15       -15             # Z3SS   -->  Z2SS   TAU-   TAU+        
      2.47527433E-11    3      1000023        12       -12             # Z3SS   -->  Z2SS   NUE    ANUE        
      2.47527433E-11    3      1000023        14       -14             # Z3SS   -->  Z2SS   NUM    ANUM        
      2.52143150E-11    3      1000023        16       -16             # Z3SS   -->  Z2SS   NUT    ANUT        
      2.23622713E-02    2      1000022        25                       # Z3SS   -->  Z1SS   HL0                
      4.47641313E-03    2      1000023        25                       # Z3SS   -->  Z2SS   HL0                
#         PDG         Width
DECAY   1000035  2.25812769E+00   # Z4SS  decays
#          BR          NDA       ID1       ID2       ID3       ID4
      5.49646906E-08    2      1000022        22                       # Z4SS   -->  Z1SS   GM                 
      2.27100486E-07    2      1000023        22                       # Z4SS   -->  Z2SS   GM                 
      7.69947395E-09    2      1000025        22                       # Z4SS   -->  Z3SS   GM                 
      3.46393436E-01    2      1000024       -24                       # Z4SS   -->  W1SS+  W-                 
      3.46393436E-01    2     -1000024        24                       # Z4SS   -->  W1SS-  W+                 
      8.10436408E-13    3     -1000037         2        -1             # Z4SS   -->  W2SS-  UP     DB          
      2.70145451E-13    3     -1000037        12       -11             # Z4SS   -->  W2SS-  NUE    E+          
      2.70145451E-13    3     -1000037        14       -13             # Z4SS   -->  W2SS-  NUM    MU+         
      8.10436408E-13    3      1000037         1        -2             # Z4SS   -->  W2SS+  DN     UB          
      2.70145451E-13    3      1000037        11       -12             # Z4SS   -->  W2SS+  E-     ANUE        
      2.70145451E-13    3      1000037        13       -14             # Z4SS   -->  W2SS+  MU-    ANUM        
      2.08383072E-02    2      1000022        23                       # Z4SS   -->  Z1SS   Z0                 
      9.76865180E-03    2      1000023        23                       # Z4SS   -->  Z2SS   Z0                 
      1.89341853E-09    3      1000022         2        -2             # Z4SS   -->  Z1SS   UP     UB          
      2.25475039E-09    3      1000022         1        -1             # Z4SS   -->  Z1SS   DN     DB          
      2.25475039E-09    3      1000022         3        -3             # Z4SS   -->  Z1SS   ST     SB          
      1.89341742E-09    3      1000022         4        -4             # Z4SS   -->  Z1SS   CH     CB          
      9.64803526E-09    3      1000022         5        -5             # Z4SS   -->  Z1SS   BT     BB          
      5.38390132E-09    3      1000022        11       -11             # Z4SS   -->  Z1SS   E-     E+          
      5.38390132E-09    3      1000022        13       -13             # Z4SS   -->  Z1SS   MU-    MU+         
      1.08574865E-08    3      1000022        15       -15             # Z4SS   -->  Z1SS   TAU-   TAU+        
      7.82042076E-09    3      1000022        12       -12             # Z4SS   -->  Z1SS   NUE    ANUE        
      7.82042076E-09    3      1000022        14       -14             # Z4SS   -->  Z1SS   NUM    ANUM        
      7.96505883E-09    3      1000022        16       -16             # Z4SS   -->  Z1SS   NUT    ANUT        
      4.37186864E-09    3      1000023         2        -2             # Z4SS   -->  Z2SS   UP     UB          
      5.05048714E-09    3      1000023         1        -1             # Z4SS   -->  Z2SS   DN     DB          
      5.05048714E-09    3      1000023         3        -3             # Z4SS   -->  Z2SS   ST     SB          
      4.37186642E-09    3      1000023         4        -4             # Z4SS   -->  Z2SS   CH     CB          
      1.37858356E-08    3      1000023         5        -5             # Z4SS   -->  Z2SS   BT     BB          
      1.47572443E-09    3      1000023        11       -11             # Z4SS   -->  Z2SS   E-     E+          
      1.47572443E-09    3      1000023        13       -13             # Z4SS   -->  Z2SS   MU-    MU+         
      1.88656646E-09    3      1000023        15       -15             # Z4SS   -->  Z2SS   TAU-   TAU+        
      2.30273223E-09    3      1000023        12       -12             # Z4SS   -->  Z2SS   NUE    ANUE        
      2.30273223E-09    3      1000023        14       -14             # Z4SS   -->  Z2SS   NUM    ANUM        
      2.34571229E-09    3      1000023        16       -16             # Z4SS   -->  Z2SS   NUT    ANUT        
      2.85191504E-07    3      1000025         2        -2             # Z4SS   -->  Z3SS   UP     UB          
      3.67803409E-07    3      1000025         1        -1             # Z4SS   -->  Z3SS   DN     DB          
      3.67803409E-07    3      1000025         3        -3             # Z4SS   -->  Z3SS   ST     SB          
      2.85191504E-07    3      1000025         4        -4             # Z4SS   -->  Z3SS   CH     CB          
      2.13693212E-07    3      1000025         5        -5             # Z4SS   -->  Z3SS   BT     BB          
      8.34337257E-08    3      1000025        11       -11             # Z4SS   -->  Z3SS   E-     E+          
      8.34337257E-08    3      1000025        13       -13             # Z4SS   -->  Z3SS   MU-    MU+         
      7.65874972E-08    3      1000025        15       -15             # Z4SS   -->  Z3SS   TAU-   TAU+        
      1.65983920E-07    3      1000025        12       -12             # Z4SS   -->  Z3SS   NUE    ANUE        
      1.65983920E-07    3      1000025        14       -14             # Z4SS   -->  Z3SS   NUM    ANUM        
      1.65983764E-07    3      1000025        16       -16             # Z4SS   -->  Z3SS   NUT    ANUT        
      1.01591855E-01    2      1000022        25                       # Z4SS   -->  Z1SS   HL0                
      1.75011724E-01    2      1000023        25                       # Z4SS   -->  Z2SS   HL0                
#         PDG         Width
DECAY   1000024  2.16286127E-02   # W1SS+ decays
#          BR          NDA       ID1       ID2       ID3       ID4
      6.02785946E-08    3      1000022         2        -1             # W1SS+  -->  Z1SS   UP     DB          
      6.02785875E-08    3      1000022         4        -3             # W1SS+  -->  Z1SS   CH     SB          
      2.17685894E-07    3      1000022       -11        12             # W1SS+  -->  Z1SS   E+     NUE         
      2.17685894E-07    3      1000022       -13        14             # W1SS+  -->  Z1SS   MU+    NUM         
      2.26744604E-07    3      1000022       -15        16             # W1SS+  -->  Z1SS   TAU+   NUT         
      9.99999225E-01    2      1000022        24                       # W1SS+  -->  Z1SS   W+                 
      1.92403996E-10    3      1000023         2        -1             # W1SS+  -->  Z2SS   UP     DB          
      6.41413311E-11    3      1000023       -11        12             # W1SS+  -->  Z2SS   E+     NUE         
      6.41413311E-11    3      1000023       -13        14             # W1SS+  -->  Z2SS   MU+    NUM         
#         PDG         Width
DECAY   1000037  1.92354751E+00   # W2SS+ decays
#          BR          NDA       ID1       ID2       ID3       ID4
      3.50814289E-09    3      1000022         2        -1             # W2SS+  -->  Z1SS   UP     DB          
      3.50814289E-09    3      1000022         4        -3             # W2SS+  -->  Z1SS   CH     SB          
      1.13466250E-08    3      1000022       -11        12             # W2SS+  -->  Z1SS   E+     NUE         
      1.13466250E-08    3      1000022       -13        14             # W2SS+  -->  Z1SS   MU+    NUM         
      1.78982891E-08    3      1000022       -15        16             # W2SS+  -->  Z1SS   TAU+   NUT         
      1.18689351E-01    2      1000022        24                       # W2SS+  -->  Z1SS   W+                 
      3.77578990E-09    3      1000023         2        -1             # W2SS+  -->  Z2SS   UP     DB          
      3.77578946E-09    3      1000023         4        -3             # W2SS+  -->  Z2SS   CH     SB          
      1.61961344E-09    3      1000023       -11        12             # W2SS+  -->  Z2SS   E+     NUE         
      1.61961344E-09    3      1000023       -13        14             # W2SS+  -->  Z2SS   MU+    NUM         
      2.37676812E-09    3      1000023       -15        16             # W2SS+  -->  Z2SS   TAU+   NUT         
      3.38236272E-01    2      1000023        24                       # W2SS+  -->  Z2SS   W+                 
      8.91114837E-07    3      1000025         2        -1             # W2SS+  -->  Z3SS   UP     DB          
      8.91114837E-07    3      1000025         4        -3             # W2SS+  -->  Z3SS   CH     SB          
      2.97029970E-07    3      1000025       -11        12             # W2SS+  -->  Z3SS   E+     NUE         
      2.97029970E-07    3      1000025       -13        14             # W2SS+  -->  Z3SS   MU+    NUM         
      2.97040060E-07    3      1000025       -15        16             # W2SS+  -->  Z3SS   TAU+   NUT         
      3.09028268E-01    2      1000024        23                       # W2SS+  -->  W1SS+  Z0                 
      4.91153207E-09    3      1000024         1        -1             # W2SS+  -->  W1SS+  DN     DB          
      4.91153029E-09    3      1000024         3        -3             # W2SS+  -->  W1SS+  ST     SB          
      8.64795524E-09    3      1000024         2        -2             # W2SS+  -->  W1SS+  UP     UB          
      8.64795524E-09    3      1000024         4        -4             # W2SS+  -->  W1SS+  CH     CB          
      3.46974383E-09    3      1000024        12       -12             # W2SS+  -->  W1SS+  NUE    ANUE        
      3.46974383E-09    3      1000024        14       -14             # W2SS+  -->  W1SS+  NUM    ANUM        
      3.65756270E-09    3      1000024        16       -16             # W2SS+  -->  W1SS+  NUT    ANUT        
      1.96869587E-09    3      1000024        11       -11             # W2SS+  -->  W1SS+  E-     E+          
      1.96869587E-09    3      1000024        13       -13             # W2SS+  -->  W1SS+  MU-    MU+         
      2.00545269E-09    3      1000024        15       -15             # W2SS+  -->  W1SS+  TAU-   TAU+        
      2.34043270E-01    2      1000024        25                       # W2SS+  -->  W1SS+  HL0                
#         PDG         Width
DECAY        25  4.11123130E-03   # HL0   decays
#          BR          NDA       ID1       ID2       ID3       ID4
      4.81511941E-09    2           11       -11                       # HL0    -->  E-     E+                 
      2.03302014E-04    2           13       -13                       # HL0    -->  MU-    MU+                
      5.81465214E-02    2           15       -15                       # HL0    -->  TAU-   TAU+               
      6.04303023E-06    2            1        -1                       # HL0    -->  DN     DB                 
      2.44168704E-03    2            3        -3                       # HL0    -->  ST     SB                 
      7.99874306E-01    2            5        -5                       # HL0    -->  BT     BB                 
      1.91816798E-06    2            2        -2                       # HL0    -->  UP     UB                 
      3.60819958E-02    2            4        -4                       # HL0    -->  CH     CB                 
      1.86160149E-03    2           22        22                       # HL0    -->  GM     GM                 
      3.93239632E-02    2           21        21                       # HL0    -->  GL     GL                 
      3.20264348E-03    3           24        11       -12             # HL0    -->  W+     E-     ANUE        
      3.20264348E-03    3           24        13       -14             # HL0    -->  W+     MU-    ANUM        
      3.20264348E-03    3           24        15       -16             # HL0    -->  W+     TAU-   ANUT        
      9.60793067E-03    3           24        -2         1             # HL0    -->  W+     UB     DN          
      9.60793067E-03    3           24        -4         3             # HL0    -->  W+     CB     ST          
      3.20264348E-03    3          -24       -11        12             # HL0    -->  W-     E+     NUE         
      3.20264348E-03    3          -24       -13        14             # HL0    -->  W-     MU+    NUM         
      3.20264348E-03    3          -24       -15        16             # HL0    -->  W-     TAU+   NUT         
      9.60793067E-03    3          -24         2        -1             # HL0    -->  W-     UP     DB          
      9.60793067E-03    3          -24         4        -3             # HL0    -->  W-     CH     SB          
      3.01659456E-04    3           23        12       -12             # HL0    -->  Z0     NUE    ANUE        
      3.01659456E-04    3           23        14       -14             # HL0    -->  Z0     NUM    ANUM        
      3.01659456E-04    3           23        16       -16             # HL0    -->  Z0     NUT    ANUT        
      1.51822183E-04    3           23        11       -11             # HL0    -->  Z0     E-     E+          
      1.51822183E-04    3           23        13       -13             # HL0    -->  Z0     MU-    MU+         
      1.51822183E-04    3           23        15       -15             # HL0    -->  Z0     TAU-   TAU+        
      5.20129921E-04    3           23         2        -2             # HL0    -->  Z0     UP     UB          
      5.20129921E-04    3           23         4        -4             # HL0    -->  Z0     CH     CB          
      6.70055451E-04    3           23         1        -1             # HL0    -->  Z0     DN     DB          
      6.70055451E-04    3           23         3        -3             # HL0    -->  Z0     ST     SB          
      6.70055451E-04    3           23         5        -5             # HL0    -->  Z0     BT     BB          
#         PDG         Width
DECAY        35  3.25351410E+01   # HH0   decays
#          BR          NDA       ID1       ID2       ID3       ID4
      1.20041954E-09    2           11       -11                       # HH0    -->  E-     E+                 
      5.06838805E-05    2           13       -13                       # HH0    -->  MU-    MU+                
      1.45165883E-02    2           15       -15                       # HH0    -->  TAU-   TAU+               
      1.46124614E-06    2            1        -1                       # HH0    -->  DN     DB                 
      5.90417359E-04    2            3        -3                       # HH0    -->  ST     SB                 
      7.79687092E-02    2            5        -5                       # HH0    -->  BT     BB                 
      4.71306570E-11    2            2        -2                       # HH0    -->  UP     UB                 
      6.04505203E-07    2            4        -4                       # HH0    -->  CH     CB                 
      3.10868267E-02    2            6        -6                       # HH0    -->  TP     TB                 
      1.69365052E-07    2           22        22                       # HH0    -->  GM     GM                 
      8.23947357E-06    2           21        21                       # HH0    -->  GL     GL                 
      1.89755392E-05    2           24       -24                       # HH0    -->  W+     W-                 
      9.71953068E-06    2           23        23                       # HH0    -->  Z0     Z0                 
      2.24166061E-03    2      1000022   1000022                       # HH0    -->  Z1SS   Z1SS               
      1.70864612E-02    2      1000022   1000023                       # HH0    -->  Z1SS   Z2SS               
      5.21274358E-02    2      1000022   1000025                       # HH0    -->  Z1SS   Z3SS               
      2.11598966E-02    2      1000022   1000035                       # HH0    -->  Z1SS   Z4SS               
      2.93013230E-02    2      1000023   1000023                       # HH0    -->  Z2SS   Z2SS               
      1.23114996E-01    2      1000023   1000025                       # HH0    -->  Z2SS   Z3SS               
      4.04747389E-02    2      1000023   1000035                       # HH0    -->  Z2SS   Z4SS               
      1.89029810E-03    2      1000025   1000025                       # HH0    -->  Z3SS   Z3SS               
      3.49468142E-02    2      1000025   1000035                       # HH0    -->  Z3SS   Z4SS               
      2.37472225E-02    2      1000035   1000035                       # HH0    -->  Z4SS   Z4SS               
      6.57691732E-02    2      1000024  -1000024                       # HH0    -->  W1SS+  W1SS-              
      2.19384022E-02    2      1000037  -1000037                       # HH0    -->  W2SS+  W2SS-              
      2.20941365E-01    2      1000024  -1000037                       # HH0    -->  W1SS+  W2SS-              
      2.20941365E-01    2     -1000024   1000037                       # HH0    -->  W1SS-  W2SS+              
      6.63104147E-05    2           25        25                       # HH0    -->  HL0    HL0                
#         PDG         Width
DECAY        36  3.22844238E+01   # HA0   decays
#          BR          NDA       ID1       ID2       ID3       ID4
      1.20188892E-09    2           11       -11                       # HA0    -->  E-     E+                 
      5.07459190E-05    2           13       -13                       # HA0    -->  MU-    MU+                
      1.45343915E-02    2           15       -15                       # HA0    -->  TAU-   TAU+               
      1.46310299E-06    2            1        -1                       # HA0    -->  DN     DB                 
      5.91167656E-04    2            3        -3                       # HA0    -->  ST     SB                 
      7.80684054E-02    2            5        -5                       # HA0    -->  BT     BB                 
      4.68146112E-11    2            2        -2                       # HA0    -->  UP     UB                 
      6.00882288E-07    2            4        -4                       # HA0    -->  CH     CB                 
      3.14435735E-02    2            6        -6                       # HA0    -->  TP     TB                 
      3.10529572E-07    2           22        22                       # HA0    -->  GM     GM                 
      1.34782240E-05    2           21        21                       # HA0    -->  GL     GL                 
      2.72775278E-03    2      1000022   1000022                       # HA0    -->  Z1SS   Z1SS               
      2.27461699E-02    2      1000022   1000023                       # HA0    -->  Z1SS   Z2SS               
      3.21833529E-02    2      1000022   1000025                       # HA0    -->  Z1SS   Z3SS               
      3.55874375E-02    2      1000022   1000035                       # HA0    -->  Z1SS   Z4SS               
      4.22352366E-02    2      1000023   1000023                       # HA0    -->  Z2SS   Z2SS               
      7.09450841E-02    2      1000023   1000025                       # HA0    -->  Z2SS   Z3SS               
      7.18901008E-02    2      1000023   1000035                       # HA0    -->  Z2SS   Z4SS               
      1.50851579E-03    2      1000025   1000025                       # HA0    -->  Z3SS   Z3SS               
      2.18929481E-02    2      1000025   1000035                       # HA0    -->  Z3SS   Z4SS               
      4.41930145E-02    2      1000035   1000035                       # HA0    -->  Z4SS   Z4SS               
      9.35598612E-02    2      1000024  -1000024                       # HA0    -->  W1SS+  W1SS-              
      4.80501056E-02    2      1000037  -1000037                       # HA0    -->  W2SS+  W2SS-              
      1.93878666E-01    2      1000024  -1000037                       # HA0    -->  W1SS+  W2SS-              
      1.93878666E-01    2     -1000024   1000037                       # HA0    -->  W1SS-  W2SS+              
      1.88979066E-05    2           25        23                       # HA0    -->  HL0    Z0                 
#         PDG         Width
DECAY        37  3.22189064E+01   # H+    decays
#          BR          NDA       ID1       ID2       ID3       ID4
      1.21313204E-09    2           12       -11                       # H+     -->  NUE    E+                 
      5.12206207E-05    2           14       -13                       # H+     -->  NUM    MU+                
      1.46703534E-02    2           16       -15                       # H+     -->  NUT    TAU+               
      1.36606639E-06    2            2        -1                       # H+     -->  UP     DB                 
      5.52502461E-04    2            4        -3                       # H+     -->  CH     SB                 
      1.01186238E-01    2            6        -5                       # H+     -->  TP     BB                 
      3.54451723E-02    2      1000024   1000022                       # H+     -->  W1SS+  Z1SS               
      7.40497489E-05    2      1000024   1000023                       # H+     -->  W1SS+  Z2SS               
      2.29941949E-01    2      1000024   1000025                       # H+     -->  W1SS+  Z3SS               
      2.42829666E-01    2      1000024   1000035                       # H+     -->  W1SS+  Z4SS               
      4.58716564E-02    2      1000037   1000022                       # H+     -->  W2SS+  Z1SS               
      2.94786066E-01    2      1000037   1000023                       # H+     -->  W2SS+  Z2SS               
      3.27337421E-02    2      1000037   1000025                       # H+     -->  W2SS+  Z3SS               
      1.83688407E-03    2      1000037   1000035                       # H+     -->  W2SS+  Z4SS               
      1.91259132E-05    2           25        24                       # H+     -->  HL0    W+                 
