#  ISAJET SUSY parameters in SUSY Les Houches Accord 2 format
#  Created by ISALHA 2.0 Last revision: C. Balazs 21 Apr 2009
Block SPINFO   # Program information
     1   ISASUGRA from ISAJET          # Spectrum Calculator
     2   7.80   29-OCT-2009 12:50:36   # Version number
Block MODSEL   # Model selection
     1     0   #   MsR(Q)          MbR(Q)                          
Block SMINPUTS   # Standard Model inputs
     1     1.27837601E+02   # alpha_em^(-1)
     2     1.16570000E-05   # G_Fermi
     3     1.17200002E-01   # alpha_s(M_Z)
     4     9.11699982E+01   # m_{Z}(pole)
     5     4.19999981E+00   # m_{b}(m_{b})
     6     1.72500000E+02   # m_{top}(pole)
     7     1.77699995E+00   # m_{tau}(pole)
Block MINPAR   # SUSY breaking input parameters
Block MASS   # Scalar and gaugino mass spectrum
#  PDG code   mass                 particle
        24     8.04229965E+01   #  W^+
        25     1.20300003E+02   #  h^0            
        35     2.51771997E+03   #  H^0            
        36     2.50000000E+03   #  A^0            
        37     2.51633154E+03   #  H^+            
   1000001     8.01754700E+02   #  dnl            
   1000002     7.98563538E+02   #  upl            
   1000003     8.01754700E+02   #  stl            
   1000004     7.98564636E+02   #  chl            
   1000005     8.00312256E+02   #  b1             
   1000006     8.11648682E+02   #  t1             
   1000011     2.50035645E+03   #  el-            
   1000012     2.49933496E+03   #  nuel           
   1000013     2.50035645E+03   #  mul-           
   1000014     2.49933496E+03   #  numl           
   1000015     2.50029565E+03   #  tau1           
   1000016     2.49933496E+03   #  nutl           
   1000021     6.00000000E+02   #  glss           
   1000022     4.99348389E+02   #  z1ss           
   1000023     2.42860034E+03   #  z2ss           
   1000024     2.42832593E+03   #  w1ss           
   1000025    -2.50038916E+03   #  z3ss           
   1000035     2.57244043E+03   #  z4ss           
   1000037     2.57219092E+03   #  w2ss           
   2000001     8.00321350E+02   #  dnr            
   2000002     7.99356995E+02   #  upr            
   2000003     8.00321411E+02   #  str            
   2000004     7.99358093E+02   #  chr            
   2000005     8.01773621E+02   #  b2             
   2000006     8.12486816E+02   #  t2             
   2000011     2.50030859E+03   #  er-            
   2000013     2.50030859E+03   #  mur-           
   2000015     2.50037036E+03   #  tau2           
Block ALPHA   # Effective Higgs mixing parameter
         -3.22570533E-01   # alpha
Block STOPMIX   # stop mixing matrix
  1  1     7.19642818E-01   # O_{11}
  1  2     6.94344521E-01   # O_{12}
  2  1    -6.94344521E-01   # O_{21}
  2  2     7.19642818E-01   # O_{22}
Block SBOTMIX   # sbottom mixing matrix
  1  1     5.52335052E-07   # O_{11}
  1  2    -1.00000000E+00   # O_{12}
  2  1     1.00000000E+00   # O_{21}
  2  2     5.52335052E-07   # O_{22}
Block STAUMIX   # stau mixing matrix
  1  1     2.81731172E-06   # O_{11}
  1  2    -1.00000000E+00   # O_{12}
  2  1     1.00000000E+00   # O_{21}
  2  2     2.81731172E-06   # O_{22}
Block NMIX   # neutralino mixing matrix
  1  1     9.99782503E-01   #
  1  2    -5.92538971E-04   #
  1  3     1.86497718E-02   #
  1  4    -9.32106376E-03   #
  2  1     1.44137088E-02   #
  2  2     7.08370090E-01   #
  2  3    -5.02602518E-01   #
  2  4     4.95373696E-01   #
  3  1    -6.59014285E-03   #
  3  2     7.19456375E-03   #
  3  3     7.06963241E-01   #
  3  4     7.07183182E-01   #
  4  1     1.35595864E-02   #
  4  2    -7.05804527E-01   #
  4  3    -4.97238696E-01   #
  4  4     5.04390895E-01   #
Block UMIX   # chargino U mixing matrix
  1  1    -7.02002406E-01   # U_{11}
  1  2     7.12174535E-01   # U_{12}
  2  1    -7.12174535E-01   # U_{21}
  2  2    -7.02002406E-01   # U_{22}
Block VMIX   # chargino V mixing matrix
  1  1    -7.12174356E-01   # V_{11}
  1  2     7.02002585E-01   # V_{12}
  2  1    -7.02002585E-01   # V_{21}
  2  2    -7.12174356E-01   # V_{22}
Block GAUGE Q=  0.00000000E+00   #
     1     0.00000000E+00   # g`
     2     0.00000000E+00   # g_2
     3     0.00000000E+00   # g_3
Block YU Q=  0.00000000E+00   #
  3  3     0.00000000E+00   # y_t
Block YD Q=  0.00000000E+00   #
  3  3     0.00000000E+00   # y_b
Block YE Q=  0.00000000E+00   #
  3  3     0.00000000E+00   # y_tau
Block HMIX Q=  0.00000000E+00   # Higgs mixing parameters
     1     0.00000000E+00   # mu(Q)
     2     0.00000000E+00   # tan(beta)(M_GUT)
     3     0.00000000E+00   # Higgs vev at Q
     4     6.25000000E+06   # m_A^2(Q)
Block MSOFT Q=  0.00000000E+00   # DRbar SUSY breaking parameters
     1     0.00000000E+00   # M_1(Q)          
     2     0.00000000E+00   # M_2(Q)          
     3     0.00000000E+00   # M_3(Q)          
    31     0.00000000E+00   # MeL(Q)          
    32     0.00000000E+00   # MmuL(Q)         
    33     0.00000000E+00   # MtauL(Q)        
    34     0.00000000E+00   # MeR(Q)          
    35     0.00000000E+00   # MmuR(Q)         
    36     0.00000000E+00   # MtauR(Q)        
    41     0.00000000E+00   # MqL1(Q)         
    42     0.00000000E+00   # MqL2(Q)         
    43     0.00000000E+00   # MqL3(Q)         
    44     0.00000000E+00   # MuR(Q)          
    45     0.00000000E+00   # McR(Q)          
    46     0.00000000E+00   # MtR(Q)          
    47     0.00000000E+00   # MdR(Q)          
    48     0.00000000E+00   # MsR(Q)          
    49     0.00000000E+00   # MbR(Q)          
Block AU Q=  0.00000000E+00   #
  1  1     0.00000000E+00   # A_u
  2  2     0.00000000E+00   # A_c
  3  3     0.00000000E+00   # A_t
Block AD Q=  0.00000000E+00   #
  1  1     0.00000000E+00   # A_d
  2  2     0.00000000E+00   # A_s
  3  3     0.00000000E+00   # A_b
Block AE Q=  0.00000000E+00   #
  1  1     0.00000000E+00   # A_e
  2  2     0.00000000E+00   # A_mu
  3  3     0.00000000E+00   # A_tau
#         PDG         Width
DECAY   1000021  6.03380977E-06   # GLSS  decays
#          BR          NDA       ID1       ID2       ID3       ID4
      5.15256368E-04    2      1000022        21                       # GLSS   -->  Z1SS   GL                 
      3.47139806E-01    3      1000022         2        -2             # GLSS   -->  Z1SS   UP     UB          
      1.01008512E-01    3      1000022         1        -1             # GLSS   -->  Z1SS   DN     DB          
      1.01008467E-01    3      1000022         3        -3             # GLSS   -->  Z1SS   ST     SB          
      3.47136170E-01    3      1000022         4        -4             # GLSS   -->  Z1SS   CH     CB          
      9.91277695E-02    3      1000022         5        -5             # GLSS   -->  Z1SS   BT     BB          
      4.06404352E-03    2      1000039        21                       # GLSS   -->  GVSS   GL                 
#         PDG         Width
DECAY   1000002  9.56042290E+00   # UPL   decays
#          BR          NDA       ID1       ID2       ID3       ID4
      4.34655370E-03    2      1000022         2                       # UPL    -->  Z1SS   UP                 
      9.95653510E-01    2      1000021         2                       # UPL    -->  GLSS   UP                 
#         PDG         Width
DECAY   1000001  9.79338551E+00   # DNL   decays
#          BR          NDA       ID1       ID2       ID3       ID4
      4.35973750E-03    2      1000022         1                       # DNL    -->  Z1SS   DN                 
      9.95640218E-01    2      1000021         1                       # DNL    -->  GLSS   DN                 
#         PDG         Width
DECAY   1000003  9.79338551E+00   # STL   decays
#          BR          NDA       ID1       ID2       ID3       ID4
      4.35973750E-03    2      1000022         3                       # STL    -->  Z1SS   ST                 
      9.95640218E-01    2      1000021         3                       # STL    -->  GLSS   ST                 
#         PDG         Width
DECAY   1000004  9.56021595E+00   # CHL   decays
#          BR          NDA       ID1       ID2       ID3       ID4
      4.34660167E-03    2      1000022         4                       # CHL    -->  Z1SS   CH                 
      9.95653391E-01    2      1000021         4                       # CHL    -->  GLSS   CH                 
#         PDG         Width
DECAY   1000005  9.81039619E+00   # BT1   decays
#          BR          NDA       ID1       ID2       ID3       ID4
      1.71811171E-02    2      1000022         5                       # BT1    -->  Z1SS   BT                 
      9.82818902E-01    2      1000021         5                       # BT1    -->  GLSS   BT                 
#         PDG         Width
DECAY   1000006  9.94199753E+00   # TP1   decays
#          BR          NDA       ID1       ID2       ID3       ID4
      9.46000966E-09    2      1000022         4                       # TP1    -->  Z1SS   CH                 
      9.65164185E-01    2      1000021         6                       # TP1    -->  GLSS   TP                 
      3.48358341E-02    2      1000022         6                       # TP1    -->  Z1SS   TP                 
#         PDG         Width
DECAY   2000002  1.02479849E+01   # UPR   decays
#          BR          NDA       ID1       ID2       ID3       ID4
      6.55322745E-02    2      1000022         2                       # UPR    -->  Z1SS   UP                 
      9.34467733E-01    2      1000021         2                       # UPR    -->  GLSS   UP                 
#         PDG         Width
DECAY   2000001  9.81504726E+00   # DNR   decays
#          BR          NDA       ID1       ID2       ID3       ID4
      1.71791911E-02    2      1000022         1                       # DNR    -->  Z1SS   DN                 
      9.82820809E-01    2      1000021         1                       # DNR    -->  GLSS   DN                 
#         PDG         Width
DECAY   2000003  9.81505299E+00   # STR   decays
#          BR          NDA       ID1       ID2       ID3       ID4
      1.71791874E-02    2      1000022         3                       # STR    -->  Z1SS   ST                 
      9.82820809E-01    2      1000021         3                       # STR    -->  GLSS   ST                 
#         PDG         Width
DECAY   2000004  1.02477684E+01   # CHR   decays
#          BR          NDA       ID1       ID2       ID3       ID4
      6.55329749E-02    2      1000022         4                       # CHR    -->  Z1SS   CH                 
      9.34467018E-01    2      1000021         4                       # CHR    -->  GLSS   CH                 
#         PDG         Width
DECAY   2000005  9.79083157E+00   # BT2   decays
#          BR          NDA       ID1       ID2       ID3       ID4
      4.35964018E-03    2      1000022         5                       # BT2    -->  Z1SS   BT                 
      9.95640337E-01    2      1000021         5                       # BT2    -->  GLSS   BT                 
#         PDG         Width
DECAY   2000006  1.51553869E+00   # TP2   decays
#          BR          NDA       ID1       ID2       ID3       ID4
      6.20580636E-08    2      1000022         4                       # TP2    -->  Z1SS   CH                 
      8.52704287E-01    2      1000021         6                       # TP2    -->  GLSS   TP                 
      1.47295669E-01    2      1000022         6                       # TP2    -->  Z1SS   TP                 
#         PDG         Width
DECAY   1000011  2.97398496E+00   # EL-   decays
#          BR          NDA       ID1       ID2       ID3       ID4
      9.82930541E-01    2      1000022        11                       # EL-    -->  Z1SS   E-                 
      5.81134157E-03    2      1000023        11                       # EL-    -->  Z2SS   E-                 
      1.12478519E-02    2     -1000024        12                       # EL-    -->  W1SS-  NUE                
      1.03625034E-05    2           11   1000039                       # EL-    -->  E-     GVSS               
#         PDG         Width
DECAY   1000013  2.97398496E+00   # MUL-  decays
#          BR          NDA       ID1       ID2       ID3       ID4
      9.82930541E-01    2      1000022        13                       # MUL-   -->  Z1SS   MU-                
      5.81133505E-03    2      1000023        13                       # MUL-   -->  Z2SS   MU-                
      1.12478519E-02    2     -1000024        14                       # MUL-   -->  W1SS-  NUM                
      1.03625034E-05    2           13   1000039                       # MUL-   -->  MU-    GVSS               
#         PDG         Width
DECAY   1000015  1.17179670E+01   # TAU1- decays
#          BR          NDA       ID1       ID2       ID3       ID4
      9.99986231E-01    2      1000022        15                       # TAU1-  -->  Z1SS   TAU-               
      4.21355844E-06    2      1000023        15                       # TAU1-  -->  Z2SS   TAU-               
      6.91411151E-06    2     -1000024        16                       # TAU1-  -->  W1SS-  NUT                
      2.62964727E-06    2           15   1000039                       # TAU1-  -->  TAU-   GVSS               
#         PDG         Width
DECAY   1000012  2.98404694E+00   # NUEL  decays
#          BR          NDA       ID1       ID2       ID3       ID4
      9.83382225E-01    2      1000022        12                       # NUEL   -->  Z1SS   NUE                
      5.38614905E-03    2      1000023        12                       # NUEL   -->  Z2SS   NUE                
      1.12213083E-02    2      1000024        11                       # NUEL   -->  W1SS+  E-                 
      1.03064804E-05    2           12   1000039                       # NUEL   -->  NUE    GVSS               
#         PDG         Width
DECAY   1000014  2.98404694E+00   # NUML  decays
#          BR          NDA       ID1       ID2       ID3       ID4
      9.83382225E-01    2      1000022        14                       # NUML   -->  Z1SS   NUM                
      5.38614905E-03    2      1000023        14                       # NUML   -->  Z2SS   NUM                
      1.12212971E-02    2      1000024        13                       # NUML   -->  W1SS+  MU-                
      1.03064804E-05    2           14   1000039                       # NUML   -->  NUM    GVSS               
#         PDG         Width
DECAY   1000016  2.98403478E+00   # NUTL  decays
#          BR          NDA       ID1       ID2       ID3       ID4
      9.83386219E-01    2      1000022        16                       # NUTL   -->  Z1SS   NUT                
      5.38617093E-03    2      1000023        16                       # NUTL   -->  Z2SS   NUT                
      1.12173147E-02    2      1000024        15                       # NUTL   -->  W1SS+  TAU-               
      1.03065222E-05    2           16   1000039                       # NUTL   -->  NUT    GVSS               
#         PDG         Width
DECAY   2000011  1.17179203E+01   # ER-   decays
#          BR          NDA       ID1       ID2       ID3       ID4
      9.99996662E-01    2      1000022        11                       # ER-    -->  Z1SS   E-                 
      7.20707249E-07    2      1000023        11                       # ER-    -->  Z2SS   E-                 
      3.05777338E-40    3      1000015        12       -16             # ER-    -->  TAU1-  NUE    ANUT        
      2.62973072E-06    2           11   1000039                       # ER-    -->  E-     GVSS               
#         PDG         Width
DECAY   2000013  1.17179203E+01   # MUR-  decays
#          BR          NDA       ID1       ID2       ID3       ID4
      9.99996662E-01    2      1000022        13                       # MUR-   -->  Z1SS   MU-                
      7.20706510E-07    2      1000023        13                       # MUR-   -->  Z2SS   MU-                
      1.31006449E-35    3      1000015        14       -16             # MUR-   -->  TAU1-  NUM    ANUT        
      2.62973072E-06    2           13   1000039                       # MUR-   -->  MU-    GVSS               
#         PDG         Width
DECAY   2000015  2.97400331E+00   # TAU2- decays
#          BR          NDA       ID1       ID2       ID3       ID4
      9.82936502E-01    2      1000022        15                       # TAU2-  -->  Z1SS   TAU-               
      5.81148313E-03    2      1000023        15                       # TAU2-  -->  Z2SS   TAU-               
      1.12520037E-02    2     -1000024        16                       # TAU2-  -->  W1SS-  NUT                
#         PDG         Width
DECAY   1000022  9.67055946E-09   # Z1SS  decays
#          BR          NDA       ID1       ID2       ID3       ID4
      7.76693523E-01    2      1000039        22                       # Z1SS   -->  GVSS   GM                 
      1.77598726E-02    3      1000039        11       -11             # Z1SS   -->  GVSS   E-     E+          
      2.05543175E-01    2      1000039        23                       # Z1SS   -->  GVSS   Z0                 
      3.41722443E-06    2      1000039        25                       # Z1SS   -->  GVSS   HL0                
#         PDG         Width
DECAY   1000023  1.22523430E+02   # Z2SS  decays
#          BR          NDA       ID1       ID2       ID3       ID4
      7.12986576E-08    2      1000022        22                       # Z2SS   -->  Z1SS   GM                 
      7.67345482E-04    2      1000022        23                       # Z2SS   -->  Z1SS   Z0                 
      2.35309283E-08    3      1000022         5        -5             # Z2SS   -->  Z1SS   BT     BB          
      5.04811806E-06    3      1000022        11       -11             # Z2SS   -->  Z1SS   E-     E+          
      5.04811806E-06    3      1000022        13       -13             # Z2SS   -->  Z1SS   MU-    MU+         
      5.12202405E-06    3      1000022        15       -15             # Z2SS   -->  Z1SS   TAU-   TAU+        
      4.86208455E-06    3      1000022        12       -12             # Z2SS   -->  Z1SS   NUE    ANUE        
      4.86208455E-06    3      1000022        14       -14             # Z2SS   -->  Z1SS   NUM    ANUM        
      4.86208455E-06    3      1000022        16       -16             # Z2SS   -->  Z1SS   NUT    ANUT        
      7.34457048E-03    2      1000022        25                       # Z2SS   -->  Z1SS   HL0                
      5.03274947E-02    2      1000002        -2                       # Z2SS   -->  UPL    UB                 
      5.03274947E-02    2     -1000002         2                       # Z2SS   -->  UBL    UP                 
      4.94863763E-02    2      1000001        -1                       # Z2SS   -->  DNL    DB                 
      4.94863763E-02    2     -1000001         1                       # Z2SS   -->  DBL    DN                 
      4.94863763E-02    2      1000003        -3                       # Z2SS   -->  STL    SB                 
      4.94863763E-02    2     -1000003         3                       # Z2SS   -->  SBL    ST                 
      5.03274538E-02    2      1000004        -4                       # Z2SS   -->  CHL    CB                 
      5.03274538E-02    2     -1000004         4                       # Z2SS   -->  CBL    CH                 
      1.11019463E-05    2      2000002        -2                       # Z2SS   -->  UPR    UB                 
      1.11019463E-05    2     -2000002         2                       # Z2SS   -->  UBR    UP                 
      2.77385834E-06    2      2000001        -1                       # Z2SS   -->  DNR    DB                 
      2.77385834E-06    2     -2000001         1                       # Z2SS   -->  DBR    DN                 
      2.77385834E-06    2      2000003        -3                       # Z2SS   -->  STR    SB                 
      2.77385834E-06    2     -2000003         3                       # Z2SS   -->  SBR    ST                 
      1.11019372E-05    2      2000004        -4                       # Z2SS   -->  CHR    CB                 
      1.11019372E-05    2     -2000004         4                       # Z2SS   -->  CBR    CH                 
      3.11415730E-04    2      1000005        -5                       # Z2SS   -->  BT1    BB                 
      3.11415730E-04    2     -1000005         5                       # Z2SS   -->  BB1    BT                 
      4.98305187E-02    2      2000005        -5                       # Z2SS   -->  BT2    BB                 
      4.98305187E-02    2     -2000005         5                       # Z2SS   -->  BB2    BT                 
      2.03310952E-01    2      1000006        -6                       # Z2SS   -->  TP1    TB                 
      2.03310952E-01    2     -1000006         6                       # Z2SS   -->  TB1    TP                 
      4.28206809E-02    2      2000006        -6                       # Z2SS   -->  TP2    TB                 
      4.28206809E-02    2     -2000006         6                       # Z2SS   -->  TB2    TP                 
      2.72231642E-08    2      1000039        22                       # Z2SS   -->  GVSS   GM                 
      6.93873570E-10    3      1000039        11       -11             # Z2SS   -->  GVSS   E-     E+          
      1.24232457E-07    2      1000039        23                       # Z2SS   -->  GVSS   Z0                 
      1.03793480E-08    2      1000039        25                       # Z2SS   -->  GVSS   HL0                
#         PDG         Width
DECAY   1000025  9.37437744E+01   # Z3SS  decays
#          BR          NDA       ID1       ID2       ID3       ID4
      1.41336338E-08    2      1000022        22                       # Z3SS   -->  Z1SS   GM                 
      5.60026400E-11    2      1000023        22                       # Z3SS   -->  Z2SS   GM                 
      9.05596880E-06    3     -1000024         2        -1             # Z3SS   -->  W1SS-  UP     DB          
      3.01865634E-06    3     -1000024        12       -11             # Z3SS   -->  W1SS-  NUE    E+          
      3.01865634E-06    3     -1000024        14       -13             # Z3SS   -->  W1SS-  NUM    MU+         
      9.05596880E-06    3      1000024         1        -2             # Z3SS   -->  W1SS+  DN     UB          
      3.01865634E-06    3      1000024        11       -12             # Z3SS   -->  W1SS+  E-     ANUE        
      3.01865634E-06    3      1000024        13       -14             # Z3SS   -->  W1SS+  MU-    ANUM        
      9.05596880E-06    3     -1000024         4        -3             # Z3SS   -->  W1SS-  CH     SB          
      3.01865634E-06    3     -1000024        16       -15             # Z3SS   -->  W1SS-  NUT    TAU+        
      9.05596880E-06    3      1000024         3        -4             # Z3SS   -->  W1SS+  ST     CB          
      3.01865634E-06    3      1000024        15       -16             # Z3SS   -->  W1SS+  TAU-   ANUT        
      1.89981405E-02    2      1000022        23                       # Z3SS   -->  Z1SS   Z0                 
      7.17360109E-08    3      1000022         5        -5             # Z3SS   -->  Z1SS   BT     BB          
      9.16884346E-09    3      1000022        15       -15             # Z3SS   -->  Z1SS   TAU-   TAU+        
      2.00372165E-06    3      1000023         2        -2             # Z3SS   -->  Z2SS   UP     UB          
      2.58381215E-06    3      1000023         1        -1             # Z3SS   -->  Z2SS   DN     DB          
      2.58381215E-06    3      1000023         3        -3             # Z3SS   -->  Z2SS   ST     SB          
      2.00372165E-06    3      1000023         4        -4             # Z3SS   -->  Z2SS   CH     CB          
      2.49611708E-06    3      1000023         5        -5             # Z3SS   -->  Z2SS   BT     BB          
      5.86136537E-07    3      1000023        11       -11             # Z3SS   -->  Z2SS   E-     E+          
      5.86136537E-07    3      1000023        13       -13             # Z3SS   -->  Z2SS   MU-    MU+         
      5.82467237E-07    3      1000023        15       -15             # Z3SS   -->  Z2SS   TAU-   TAU+        
      1.16622721E-06    3      1000023        12       -12             # Z3SS   -->  Z2SS   NUE    ANUE        
      1.16622721E-06    3      1000023        14       -14             # Z3SS   -->  Z2SS   NUM    ANUM        
      1.16622721E-06    3      1000023        16       -16             # Z3SS   -->  Z2SS   NUT    ANUT        
      2.07315199E-03    2      1000022        25                       # Z3SS   -->  Z1SS   HL0                
      4.86819999E-06    2      1000002        -2                       # Z3SS   -->  UPL    UB                 
      4.86819999E-06    2     -1000002         2                       # Z3SS   -->  UBL    UP                 
      9.56946042E-06    2      1000001        -1                       # Z3SS   -->  DNL    DB                 
      9.56946042E-06    2     -1000001         1                       # Z3SS   -->  DBL    DN                 
      9.56946042E-06    2      1000003        -3                       # Z3SS   -->  STL    SB                 
      9.56946042E-06    2     -1000003         3                       # Z3SS   -->  SBL    ST                 
      4.86819681E-06    2      1000004        -4                       # Z3SS   -->  CHL    CB                 
      4.86819681E-06    2     -1000004         4                       # Z3SS   -->  CBL    CH                 
      3.16605201E-06    2      2000002        -2                       # Z3SS   -->  UPR    UB                 
      3.16605201E-06    2     -2000002         2                       # Z3SS   -->  UBR    UP                 
      7.91077980E-07    2      2000001        -1                       # Z3SS   -->  DNR    DB                 
      7.91077980E-07    2     -2000001         1                       # Z3SS   -->  DBR    DN                 
      7.91077809E-07    2      2000003        -3                       # Z3SS   -->  STR    SB                 
      7.91077809E-07    2     -2000003         3                       # Z3SS   -->  SBR    ST                 
      3.16604928E-06    2      2000004        -4                       # Z3SS   -->  CHR    CB                 
      3.16604928E-06    2     -2000004         4                       # Z3SS   -->  CBR    CH                 
      8.34859093E-04    2      1000005        -5                       # Z3SS   -->  BT1    BB                 
      8.34859093E-04    2     -1000005         5                       # Z3SS   -->  BB1    BT                 
      8.43508518E-04    2      2000005        -5                       # Z3SS   -->  BT2    BB                 
      8.43508518E-04    2     -2000005         5                       # Z3SS   -->  BB2    BT                 
      2.08436593E-01    2      1000006        -6                       # Z3SS   -->  TP1    TB                 
      2.08436593E-01    2     -1000006         6                       # Z3SS   -->  TB1    TP                 
      2.79276878E-01    2      2000006        -6                       # Z3SS   -->  TP2    TB                 
      2.79276878E-01    2     -2000006         6                       # Z3SS   -->  TB2    TP                 
      4.89936245E-16    2      1000011       -11                       # Z3SS   -->  EL-    E+                 
      4.89936245E-16    2     -1000011        11                       # Z3SS   -->  EL+    E-                 
      1.22403698E-14    2      2000011       -11                       # Z3SS   -->  ER-    E+                 
      1.22403698E-14    2     -2000011        11                       # Z3SS   -->  ER+    E-                 
      4.66861445E-12    2      1000012       -12                       # Z3SS   -->  NUEL   ANUE               
      4.66861445E-12    2     -1000012        12                       # Z3SS   -->  ANUEL  NUE                
      4.66861445E-12    2      1000014       -14                       # Z3SS   -->  NUML   ANUM               
      4.66861445E-12    2     -1000014        14                       # Z3SS   -->  ANUML  NUM                
      4.66861445E-12    2      1000016       -16                       # Z3SS   -->  NUTL   ANUT               
      4.66861445E-12    2     -1000016        16                       # Z3SS   -->  ANUTL  NUT                
      1.75426416E-12    2      1000039        22                       # Z3SS   -->  GVSS   GM                 
      4.47980208E-14    3      1000039        11       -11             # Z3SS   -->  GVSS   E-     E+          
      3.27489111E-08    2      1000039        23                       # Z3SS   -->  GVSS   Z0                 
      1.30408338E-07    2      1000039        25                       # Z3SS   -->  GVSS   HL0                
      1.23410198E-21    2      1000039        36                       # Z3SS   -->  GVSS   HA0                
#         PDG         Width
DECAY   1000035  1.25550941E+02   # Z4SS  decays
#          BR          NDA       ID1       ID2       ID3       ID4
      4.87072649E-09    2      1000022        22                       # Z4SS   -->  Z1SS   GM                 
      3.29686001E-10    2      1000023        22                       # Z4SS   -->  Z2SS   GM                 
      1.10842813E-09    2      1000025        22                       # Z4SS   -->  Z3SS   GM                 
      8.06211401E-03    2      1000024       -24                       # Z4SS   -->  W1SS+  W-                 
      8.06211401E-03    2     -1000024        24                       # Z4SS   -->  W1SS-  W+                 
      8.34011240E-04    2      1000022        23                       # Z4SS   -->  Z1SS   Z0                 
      2.11838436E-10    2      1000023        23                       # Z4SS   -->  Z2SS   Z0                 
      3.07392014E-08    3      1000022         5        -5             # Z4SS   -->  Z1SS   BT     BB          
      3.92887323E-09    3      1000022        15       -15             # Z4SS   -->  Z1SS   TAU-   TAU+        
      2.07026923E-16    3      1000023         5        -5             # Z4SS   -->  Z2SS   BT     BB          
      2.67390964E-17    3      1000023        15       -15             # Z4SS   -->  Z2SS   TAU-   TAU+        
      1.54388658E-06    3      1000025         2        -2             # Z4SS   -->  Z3SS   UP     UB          
      1.99085207E-06    3      1000025         1        -1             # Z4SS   -->  Z3SS   DN     DB          
      1.99085207E-06    3      1000025         3        -3             # Z4SS   -->  Z3SS   ST     SB          
      1.54388658E-06    3      1000025         4        -4             # Z4SS   -->  Z3SS   CH     CB          
      1.92560037E-06    3      1000025         5        -5             # Z4SS   -->  Z3SS   BT     BB          
      4.51623748E-07    3      1000025        11       -11             # Z4SS   -->  Z3SS   E-     E+          
      4.51623748E-07    3      1000025        13       -13             # Z4SS   -->  Z3SS   MU-    MU+         
      4.49020007E-07    3      1000025        15       -15             # Z4SS   -->  Z3SS   TAU-   TAU+        
      8.98589235E-07    3      1000025        12       -12             # Z4SS   -->  Z3SS   NUE    ANUE        
      8.98589235E-07    3      1000025        14       -14             # Z4SS   -->  Z3SS   NUM    ANUM        
      8.98589235E-07    3      1000025        16       -16             # Z4SS   -->  Z3SS   NUT    ANUT        
      6.78665191E-03    2      1000022        25                       # Z4SS   -->  Z1SS   HL0                
      1.03105648E-07    2      1000023        25                       # Z4SS   -->  Z2SS   HL0                
      5.22539727E-02    2      1000002        -2                       # Z4SS   -->  UPL    UB                 
      5.22539727E-02    2     -1000002         2                       # Z4SS   -->  UBL    UP                 
      5.29043674E-02    2      1000001        -1                       # Z4SS   -->  DNL    DB                 
      5.29043674E-02    2     -1000001         1                       # Z4SS   -->  DBL    DN                 
      5.29043674E-02    2      1000003        -3                       # Z4SS   -->  STL    SB                 
      5.29043674E-02    2     -1000003         3                       # Z4SS   -->  SBL    ST                 
      5.22539429E-02    2      1000004        -4                       # Z4SS   -->  CHL    CB                 
      5.22539429E-02    2     -1000004         4                       # Z4SS   -->  CBL    CH                 
      1.04261935E-05    2      2000002        -2                       # Z4SS   -->  UPR    UB                 
      1.04261935E-05    2     -2000002         2                       # Z4SS   -->  UBR    UP                 
      2.60520369E-06    2      2000001        -1                       # Z4SS   -->  DNR    DB                 
      2.60520369E-06    2     -2000001         1                       # Z4SS   -->  DBR    DN                 
      2.60520324E-06    2      2000003        -3                       # Z4SS   -->  STR    SB                 
      2.60520324E-06    2     -2000003         3                       # Z4SS   -->  SBR    ST                 
      1.04261862E-05    2      2000004        -4                       # Z4SS   -->  CHR    CB                 
      1.04261862E-05    2     -2000004         4                       # Z4SS   -->  CBR    CH                 
      3.23237036E-04    2      1000005        -5                       # Z4SS   -->  BT1    BB                 
      3.23237036E-04    2     -1000005         5                       # Z4SS   -->  BB1    BT                 
      5.31889349E-02    2      2000005        -5                       # Z4SS   -->  BT2    BB                 
      5.31889349E-02    2     -2000005         5                       # Z4SS   -->  BB2    BT                 
      5.52153960E-02    2      1000006        -6                       # Z4SS   -->  TP1    TB                 
      5.52153960E-02    2     -1000006         6                       # Z4SS   -->  TB1    TP                 
      1.68651193E-01    2      2000006        -6                       # Z4SS   -->  TP2    TB                 
      1.68651193E-01    2     -2000006         6                       # Z4SS   -->  TB2    TP                 
      6.42166415E-05    2      1000011       -11                       # Z4SS   -->  EL-    E+                 
      6.42166415E-05    2     -1000011        11                       # Z4SS   -->  EL+    E-                 
      6.42165760E-05    2      1000013       -13                       # Z4SS   -->  MUL-   MU+                
      6.42165760E-05    2     -1000013        13                       # Z4SS   -->  MUL+   MU-                
      2.92918738E-08    2      2000011       -11                       # Z4SS   -->  ER-    E+                 
      2.92918738E-08    2     -2000011        11                       # Z4SS   -->  ER+    E-                 
      2.92918454E-08    2      2000013       -13                       # Z4SS   -->  MUR-   MU+                
      2.92918454E-08    2     -2000013        13                       # Z4SS   -->  MUR+   MU-                
      1.79667722E-07    2      1000015       -15                       # Z4SS   -->  TAU1-  TAU+               
      1.79667722E-07    2     -1000015        15                       # Z4SS   -->  TAU1+  TAU-               
      6.41696897E-05    2      2000015       -15                       # Z4SS   -->  TAU2-  TAU+               
      6.41696897E-05    2     -2000015        15                       # Z4SS   -->  TAU2+  TAU-               
      6.88714572E-05    2      1000012       -12                       # Z4SS   -->  NUEL   ANUE               
      6.88714572E-05    2     -1000012        12                       # Z4SS   -->  ANUEL  NUE                
      6.88714572E-05    2      1000014       -14                       # Z4SS   -->  NUML   ANUM               
      6.88714572E-05    2     -1000014        14                       # Z4SS   -->  ANUML  NUM                
      6.88714572E-05    2      1000016       -16                       # Z4SS   -->  NUTL   ANUT               
      6.88714572E-05    2     -1000016        16                       # Z4SS   -->  ANUTL  NUT                
      3.04546184E-08    2      1000039        22                       # Z4SS   -->  GVSS   GM                 
      7.79143250E-10    3      1000039        11       -11             # Z4SS   -->  GVSS   E-     E+          
      1.66887176E-07    2      1000039        23                       # Z4SS   -->  GVSS   Z0                 
      1.44277141E-08    2      1000039        25                       # Z4SS   -->  GVSS   HL0                
      1.77077279E-13    2      1000039        35                       # Z4SS   -->  GVSS   HH0                
      1.31105589E-13    2      1000039        36                       # Z4SS   -->  GVSS   HA0                
#         PDG         Width
DECAY   1000024  1.22640518E+02   # W1SS+ decays
#          BR          NDA       ID1       ID2       ID3       ID4
      9.84123744E-06    3      1000022       -11        12             # W1SS+  -->  Z1SS   E+     NUE         
      9.84123744E-06    3      1000022       -13        14             # W1SS+  -->  Z1SS   MU+    NUM         
      9.91554043E-06    3      1000022       -15        16             # W1SS+  -->  Z1SS   TAU+   NUT         
      8.11239332E-03    2      1000022        24                       # W1SS+  -->  Z1SS   W+                 
      1.00871354E-01    2      1000002        -1                       # W1SS+  -->  UPL    DB                 
      9.78202075E-02    2     -1000001         2                       # W1SS+  -->  DBL    UP                 
      1.00871295E-01    2      1000004        -3                       # W1SS+  -->  CHL    SB                 
      9.80103910E-02    2     -1000003         4                       # W1SS+  -->  SBL    CH                 
      2.70002693E-01    2      1000006        -5                       # W1SS+  -->  TP1    BB                 
      7.09683541E-03    2      2000006        -5                       # W1SS+  -->  TP2    BB                 
      6.18656166E-04    2     -1000005         6                       # W1SS+  -->  BB1    TP                 
      3.16566557E-01    2     -2000005         6                       # W1SS+  -->  BB2    TP                 
#         PDG         Width
DECAY   1000037  1.25668922E+02   # W2SS+ decays
#          BR          NDA       ID1       ID2       ID3       ID4
      3.82575349E-09    3      1000022       -15        16             # W2SS+  -->  Z1SS   TAU+   NUT         
      7.56129576E-03    2      1000022        24                       # W2SS+  -->  Z1SS   W+                 
      5.85197106E-14    3      1000023       -15        16             # W2SS+  -->  Z2SS   TAU+   NUT         
      8.10479466E-03    2      1000023        24                       # W2SS+  -->  Z2SS   W+                 
      6.58428189E-06    3      1000025         2        -1             # W2SS+  -->  Z3SS   UP     DB          
      6.58428189E-06    3      1000025         4        -3             # W2SS+  -->  Z3SS   CH     SB          
      2.19476055E-06    3      1000025       -11        12             # W2SS+  -->  Z3SS   E+     NUE         
      2.19476055E-06    3      1000025       -13        14             # W2SS+  -->  Z3SS   MU+    NUM         
      2.19476055E-06    3      1000025       -15        16             # W2SS+  -->  Z3SS   TAU+   NUT         
      1.04004517E-01    2      1000002        -1                       # W2SS+  -->  UPL    DB                 
      1.06857613E-01    2     -1000001         2                       # W2SS+  -->  DBL    UP                 
      1.04004472E-01    2      1000004        -3                       # W2SS+  -->  CHL    SB                 
      1.07040323E-01    2     -1000003         4                       # W2SS+  -->  SBL    CH                 
      5.75771974E-03    2      1000006        -5                       # W2SS+  -->  TP1    BB                 
      2.90731549E-01    2      2000006        -5                       # W2SS+  -->  TP2    BB                 
      6.38178957E-04    2     -1000005         6                       # W2SS+  -->  BB1    TP                 
      2.57840097E-01    2     -2000005         6                       # W2SS+  -->  BB2    TP                 
      1.32421876E-04    2      1000012       -11                       # W2SS+  -->  NUEL   E+                 
      1.32421730E-04    2      1000014       -13                       # W2SS+  -->  NUML   MU+                
      1.32377638E-04    2      1000016       -15                       # W2SS+  -->  NUTL   TAU+               
      1.32545480E-04    2     -1000011        12                       # W2SS+  -->  EL+    NUE                
      1.32545480E-04    2     -1000013        14                       # W2SS+  -->  MUL+   NUM                
      3.04152877E-07    2     -1000015        16                       # W2SS+  -->  TAU1+  NUT                
      1.32494883E-04    2     -2000015        16                       # W2SS+  -->  TAU2+  NUT                
      6.64419821E-03    2      1000024        23                       # W2SS+  -->  W1SS+  Z0                 
      4.81602513E-07    2      1000024        25                       # W2SS+  -->  W1SS+  HL0                
#         PDG         Width
DECAY        25  4.47532395E-03   # HL0   decays
#          BR          NDA       ID1       ID2       ID3       ID4
      4.59058613E-09    2           11       -11                       # HL0    -->  E-     E+                 
      1.93821936E-04    2           13       -13                       # HL0    -->  MU-    MU+                
      5.54411635E-02    2           15       -15                       # HL0    -->  TAU-   TAU+               
      5.75778313E-06    2            1        -1                       # HL0    -->  DN     DB                 
      2.32643308E-03    2            3        -3                       # HL0    -->  ST     SB                 
      7.57798731E-01    2            5        -5                       # HL0    -->  BT     BB                 
      1.83227053E-06    2            2        -2                       # HL0    -->  UP     UB                 
      3.42552476E-02    2            4        -4                       # HL0    -->  CH     CB                 
      1.99784618E-03    2           22        22                       # HL0    -->  GM     GM                 
      4.09507081E-02    2           21        21                       # HL0    -->  GL     GL                 
      5.42771909E-03    3           24        11       -12             # HL0    -->  W+     E-     ANUE        
      5.42771909E-03    3           24        13       -14             # HL0    -->  W+     MU-    ANUM        
      5.42771909E-03    3           24        15       -16             # HL0    -->  W+     TAU-   ANUT        
      1.62831582E-02    3           24        -2         1             # HL0    -->  W+     UB     DN          
      1.62831582E-02    3           24        -4         3             # HL0    -->  W+     CB     ST          
      5.42771909E-03    3          -24       -11        12             # HL0    -->  W-     E+     NUE         
      5.42771909E-03    3          -24       -13        14             # HL0    -->  W-     MU+    NUM         
      5.42771909E-03    3          -24       -15        16             # HL0    -->  W-     TAU+   NUT         
      1.62831582E-02    3          -24         2        -1             # HL0    -->  W-     UP     DB          
      1.62831582E-02    3          -24         4        -3             # HL0    -->  W-     CH     SB          
      6.38076453E-04    3           23        12       -12             # HL0    -->  Z0     NUE    ANUE        
      6.38076453E-04    3           23        14       -14             # HL0    -->  Z0     NUM    ANUM        
      6.38076453E-04    3           23        16       -16             # HL0    -->  Z0     NUT    ANUT        
      3.21137457E-04    3           23        11       -11             # HL0    -->  Z0     E-     E+          
      3.21137457E-04    3           23        13       -13             # HL0    -->  Z0     MU-    MU+         
      3.21137457E-04    3           23        15       -15             # HL0    -->  Z0     TAU-   TAU+        
      1.10018975E-03    3           23         2        -2             # HL0    -->  Z0     UP     UB          
      1.10018975E-03    3           23         4        -4             # HL0    -->  Z0     CH     CB          
      1.41731557E-03    3           23         1        -1             # HL0    -->  Z0     DN     DB          
      1.41731557E-03    3           23         3        -3             # HL0    -->  Z0     ST     SB          
      1.41731557E-03    3           23         5        -5             # HL0    -->  Z0     BT     BB          
#         PDG         Width
DECAY        35  1.14939529E+02   # HH0   decays
#          BR          NDA       ID1       ID2       ID3       ID4
      3.34838997E-11    2           11       -11                       # HH0    -->  E-     E+                 
      1.41375074E-06    2           13       -13                       # HH0    -->  MU-    MU+                
      4.04918654E-04    2           15       -15                       # HH0    -->  TAU-   TAU+               
      4.07331591E-08    2            1        -1                       # HH0    -->  DN     DB                 
      1.64582580E-05    2            3        -3                       # HH0    -->  ST     SB                 
      3.66027770E-03    2            5        -5                       # HH0    -->  BT     BB                 
      1.61785738E-10    2            2        -2                       # HH0    -->  UP     UB                 
      2.05471656E-06    2            4        -4                       # HH0    -->  CH     CB                 
      1.06110834E-01    2            6        -6                       # HH0    -->  TP     TB                 
      2.54038127E-07    2           22        22                       # HH0    -->  GM     GM                 
      3.46426968E-05    2           21        21                       # HH0    -->  GL     GL                 
      3.01908149E-05    2           24       -24                       # HH0    -->  W+     W-                 
      1.54695463E-05    2           23        23                       # HH0    -->  Z0     Z0                 
      9.36945889E-06    2      1000022   1000022                       # HH0    -->  Z1SS   Z1SS               
      2.29820404E-02    2           25        25                       # HH0    -->  HL0    HL0                
      3.18314342E-05    2      1000002  -1000002                       # HH0    -->  UPL    UBL                
      6.38089796E-06    2      2000002  -2000002                       # HH0    -->  UPR    UBR                
      3.18092207E-05    2      1000004  -1000004                       # HH0    -->  CHL    CBL                
      6.37096082E-06    2      2000004  -2000004                       # HH0    -->  CHR    CBR                
      4.75555535E-05    2      1000001  -1000001                       # HH0    -->  DNL    DBL                
      1.59392027E-06    2      2000001  -2000001                       # HH0    -->  DNR    DBR                
      4.75608322E-05    2      1000003  -1000003                       # HH0    -->  STL    SBL                
      1.59295485E-06    2      2000003  -2000003                       # HH0    -->  STR    SBR                
      1.40577038E-06    2      1000005  -1000005                       # HH0    -->  BT1    BB1                
      4.86235585E-05    2      2000005  -2000005                       # HH0    -->  BT2    BB2                
      1.29359849E-02    2      1000005  -2000005                       # HH0    -->  BT1    BB2                
      1.29359849E-02    2      2000005  -1000005                       # HH0    -->  BT2    BB1                
      4.43946064E-01    2      1000006  -1000006                       # HH0    -->  TP1    TB1                
      3.95466179E-01    2      2000006  -2000006                       # HH0    -->  TP2    TB2                
      6.11523283E-04    2      1000006  -2000006                       # HH0    -->  TP1    TB2                
      6.11523283E-04    2      2000006  -1000006                       # HH0    -->  TP2    TB1                
#         PDG         Width
DECAY        36  1.12429276E+02   # HA0   decays
#          BR          NDA       ID1       ID2       ID3       ID4
      3.40091948E-11    2           11       -11                       # HA0    -->  E-     E+                 
      1.43592956E-06    2           13       -13                       # HA0    -->  MU-    MU+                
      4.11271816E-04    2           15       -15                       # HA0    -->  TAU-   TAU+               
      4.13742178E-08    2            1        -1                       # HA0    -->  DN     DB                 
      1.67172784E-05    2            3        -3                       # HA0    -->  ST     SB                 
      3.72073962E-03    2            5        -5                       # HA0    -->  BT     BB                 
      1.63437097E-10    2            2        -2                       # HA0    -->  UP     UB                 
      2.07727112E-06    2            4        -4                       # HA0    -->  CH     CB                 
      1.08825512E-01    2            6        -6                       # HA0    -->  TP     TB                 
      2.55631448E-07    2           22        22                       # HA0    -->  GM     GM                 
      3.34341566E-05    2           21        21                       # HA0    -->  GL     GL                 
      2.21236223E-05    2      1000022   1000022                       # HA0    -->  Z1SS   Z1SS               
      3.04684527E-05    2           25        23                       # HA0    -->  HL0    Z0                 
      5.23532329E-10    2      1000002  -2000002                       # HA0    -->  UPL    UBR                
      5.23532329E-10    2      2000002  -1000002                       # HA0    -->  UPR    UBL                
      3.04252790E-05    2      1000004  -2000004                       # HA0    -->  CHL    CBR                
      3.04252790E-05    2      2000004  -1000004                       # HA0    -->  CHR    CBL                
      1.63326019E-09    2      1000001  -2000001                       # HA0    -->  DNL    DBR                
      1.63326019E-09    2      2000001  -1000001                       # HA0    -->  DNR    DBL                
      6.59919749E-07    2      1000003  -2000003                       # HA0    -->  STL    SBR                
      6.59919749E-07    2      2000003  -1000003                       # HA0    -->  STR    SBL                
      1.32539403E-02    2      1000005  -2000005                       # HA0    -->  BT1    BB2                
      1.32539403E-02    2      2000005  -1000005                       # HA0    -->  BT2    BB1                
      4.30182934E-01    2      1000006  -2000006                       # HA0    -->  TP1    TB2                
      4.30182934E-01    2      2000006  -1000006                       # HA0    -->  TP2    TB1                
#         PDG         Width
DECAY        37  1.11755569E+02   # H+    decays
#          BR          NDA       ID1       ID2       ID3       ID4
      3.44377235E-11    2           12       -11                       # H+     -->  NUE    E+                 
      1.45402271E-06    2           14       -13                       # H+     -->  NUM    MU+                
      4.16453986E-04    2           16       -15                       # H+     -->  NUT    TAU+               
      3.89310806E-08    2            2        -1                       # H+     -->  UP     DB                 
      1.76137746E-05    2            4        -3                       # H+     -->  CH     SB                 
      1.04943566E-01    2            6        -5                       # H+     -->  TP     BB                 
      3.08811323E-05    2           25        24                       # H+     -->  HL0    W+                 
      8.06889366E-05    2      1000002  -1000001                       # H+     -->  UPL    DBL                
      3.28401462E-09    2      2000002  -2000001                       # H+     -->  UPR    DBR                
      8.06587268E-05    2      1000004  -1000003                       # H+     -->  CHL    SBL                
      1.32690718E-06    2      2000004  -2000003                       # H+     -->  CHR    SBR                
      1.42423930E-02    2      1000006  -1000005                       # H+     -->  TP1    BB1                
      4.25355315E-01    2      1000006  -2000005                       # H+     -->  TP1    BB2                
      1.22641921E-02    2      2000006  -1000005                       # H+     -->  TP2    BB1                
      4.42565441E-01    2      2000006  -2000005                       # H+     -->  TP2    BB2                
