#  ISAJET SUSY parameters in SUSY Les Houches Accord 2 format
#  Created by ISALHA 2.0 Last revision: C. Balazs 21 Apr 2009
Block SPINFO   # Program information
     1   ISASUGRA from ISAJET          # Spectrum Calculator
     2   7.80   29-OCT-2009 12:50:36   # Version number
Block MODSEL   # Model selection
     1     2   # Minimal gauge mediated (GMSB) model               
Block SMINPUTS   # Standard Model inputs
     1     1.27836258E+02   # alpha_em^(-1)
     2     1.16570000E-05   # G_Fermi
     3     1.17200002E-01   # alpha_s(M_Z)
     4     9.11699982E+01   # m_{Z}(pole)
     5     4.19999981E+00   # m_{b}(m_{b})
     6     1.72500000E+02   # m_{top}(pole)
     7     1.77699995E+00   # m_{tau}(pole)
Block MINPAR   # SUSY breaking input parameters
     1     2.50000000E+04   # Lambda scale of soft SSB
     2     2.50000000E+05   # M_mess overall messenger scale
     3     1.00000000E+01   # tan(beta)
     4     1.00000000E+00   # sign(mu)
     5     3.00000000E+00   # N_5 messenger index
     6     1.00000000E+00   # c_grav gravitino mass factor
    51     3.00000000E+00   # N5_1  U(1)_Y messenger index
    52     3.00000000E+00   # N5_2 SU(2)_L messenger index
    53     3.00000000E+00   # N5_3 SU(3)_C messenger index
   101     1.00000000E+00   # Rsl
   102     0.00000000E+00   # dmH_d^2
   103     0.00000000E+00   # dmH_u^2
   104     0.00000000E+00   # d_Y
Block MASS   # Scalar and gaugino mass spectrum
#  PDG code   mass                 particle
        24     8.04229965E+01   #  W^+
        25     1.06138451E+02   #  h^0            
        35     2.74909576E+02   #  H^0            
        36     2.72406464E+02   #  A^0            
        37     2.85611694E+02   #  H^+            
   1000001     5.86461304E+02   #  dnl            
   1000002     5.80693909E+02   #  upl            
   1000003     5.86461365E+02   #  stl            
   1000004     5.80695618E+02   #  chl            
   1000005     5.55996277E+02   #  b1             
   1000006     5.14565063E+02   #  t1             
   1000011     1.72700150E+02   #  el-            
   1000012     1.51634354E+02   #  nuel           
   1000013     1.72700180E+02   #  mul-           
   1000014     1.51634354E+02   #  numl           
   1000015     8.54884720E+01   #  tau1           
   1000016     1.49350311E+02   #  nutl           
   1000021     5.99505310E+02   #  glss           
   1000022     9.33678741E+01   #  z1ss           
   1000023     1.60259903E+02   #  z2ss           
   1000024     1.57754379E+02   #  w1ss           
   1000025    -2.35166153E+02   #  z3ss           
   1000035     2.81902893E+02   #  z4ss           
   1000037     2.80441254E+02   #  w2ss           
   1000039     1.50351642E-09   #  gvss
   2000001     5.62865295E+02   #  dnr            
   2000002     5.62782104E+02   #  upr            
   2000003     5.62865356E+02   #  str            
   2000004     5.62783875E+02   #  chr            
   2000005     5.67299988E+02   #  b2             
   2000006     5.95768738E+02   #  t2             
   2000011     8.77252121E+01   #  er-            
   2000013     8.77252731E+01   #  mur-           
   2000015     1.73090027E+02   #  tau2           
Block ALPHA   # Effective Higgs mixing parameter
         -1.28162354E-01   # alpha
Block STOPMIX   # stop mixing matrix
  1  1     4.49239314E-01   # O_{11}
  1  2     8.93411458E-01   # O_{12}
  2  1    -8.93411458E-01   # O_{21}
  2  2     4.49239314E-01   # O_{22}
Block SBOTMIX   # sbottom mixing matrix
  1  1     6.96341991E-01   # O_{11}
  1  2     7.17710137E-01   # O_{12}
  2  1    -7.17710137E-01   # O_{21}
  2  2     6.96341991E-01   # O_{22}
Block STAUMIX   # stau mixing matrix
  1  1     1.74798369E-01   # O_{11}
  1  2     9.84604239E-01   # O_{12}
  2  1    -9.84604239E-01   # O_{21}
  2  2     1.74798369E-01   # O_{22}
Block NMIX   # neutralino mixing matrix
  1  1    -9.44199681E-01   #
  1  2     1.22101866E-01   #
  1  3    -2.74429232E-01   #
  1  4     1.35155067E-01   #
  2  1     2.79968977E-01   #
  2  2     7.76381850E-01   #
  2  3    -4.49528515E-01   #
  2  4     3.41720283E-01   #
  3  1    -8.25102478E-02   #
  3  2     1.12341151E-01   #
  3  3     6.85709715E-01   #
  3  4     7.14404821E-01   #
  4  1     1.52632043E-01   #
  4  2    -6.08031273E-01   #
  4  3    -5.02409697E-01   #
  4  4     5.95471680E-01   #
Block UMIX   # chargino U mixing matrix
  1  1    -7.16691852E-01   # U_{11}
  1  2     6.97389901E-01   # U_{12}
  2  1    -6.97389901E-01   # U_{21}
  2  2    -7.16691852E-01   # U_{22}
Block VMIX   # chargino V mixing matrix
  1  1    -8.52022827E-01   # V_{11}
  1  2     5.23504615E-01   # V_{12}
  2  1    -5.23504615E-01   # V_{21}
  2  2    -8.52022827E-01   # V_{22}
Block GAUGE Q=  5.11898560E+02   #
     1     3.57524991E-01   # g`
     2     6.52378619E-01   # g_2
     3     1.21928000E+00   # g_3
Block YU Q=  5.11898560E+02   #
  3  3     8.88482153E-01   # y_t
Block YD Q=  5.11898560E+02   #
  3  3     1.39340177E-01   # y_b
Block YE Q=  5.11898560E+02   #
  3  3     1.01338856E-01   # y_tau
Block HMIX Q=  5.11898560E+02   # Higgs mixing parameters
     1     2.26129486E+02   # mu(Q)
     2     1.00000000E+01   # tan(beta)(M_GUT)
     3     2.49507874E+02   # Higgs vev at Q
     4     7.42052813E+04   # m_A^2(Q)
Block MSOFT Q=  5.11898560E+02   # DRbar SUSY breaking parameters
     1     1.02723534E+02   # M_1(Q)          
     2     1.96150818E+02   # M_2(Q)          
     3     5.60131348E+02   # M_3(Q)          
    31     1.65158401E+02   # MeL(Q)          
    32     1.65158401E+02   # MmuL(Q)         
    33     1.63098694E+02   # MtauL(Q)        
    34     7.70078812E+01   # MeR(Q)          
    35     7.70078812E+01   # MmuR(Q)         
    36     7.59762726E+01   # MtauR(Q)        
    41     5.54582458E+02   # MqL1(Q)         
    42     5.54582458E+02   # MqL2(Q)         
    43     5.34368896E+02   # MqL3(Q)         
    44     5.35784729E+02   # MuR(Q)          
    45     5.35784729E+02   # McR(Q)          
    46     4.90373108E+02   # MtR(Q)          
    47     5.34098694E+02   # MdR(Q)          
    48     5.34098694E+02   # MsR(Q)          
    49     5.33953613E+02   # MbR(Q)          
Block AU Q=  5.11898560E+02   #
  1  1    -2.04720245E+02   # A_u
  2  2    -2.04720245E+02   # A_c
  3  3    -2.04720245E+02   # A_t
Block AD Q=  5.11898560E+02   #
  1  1    -2.34915680E+02   # A_d
  2  2    -2.34915680E+02   # A_s
  3  3    -2.34915680E+02   # A_b
Block AE Q=  5.11898560E+02   #
  1  1    -2.29330959E+01   # A_e
  2  2    -2.29330959E+01   # A_mu
  3  3    -2.29330959E+01   # A_tau
#  ISAJET decay tables in SUSY Les Houches accord format
#  Created by ISALHD. Last revision: C. Balazs, 2005 May 25
Block DCINFO                           # Program information
     1   ISASUGRA from ISAJET          # Spectrum Calculator
     2   7.80   29-OCT-2009 12:50:36   # Version number
#         PDG         Width
DECAY         6  1.14680779E+00   # TP    decays
#          BR          NDA       ID1       ID2       ID3       ID4
      3.33333343E-01    3            2        -1         5             # TP     -->  UP     DB     BT          
      3.33333343E-01    3            4        -3         5             # TP     -->  CH     SB     BT          
      1.11111112E-01    3          -11        12         5             # TP     -->  E+     NUE    BT          
      1.11111112E-01    3          -13        14         5             # TP     -->  MU+    NUM    BT          
      1.11111112E-01    3          -15        16         5             # TP     -->  TAU+   NUT    BT          
#         PDG         Width
DECAY   1000021  1.42173934E+00   # GLSS  decays
#          BR          NDA       ID1       ID2       ID3       ID4
      4.56048641E-04    3      1000024         5        -6             # GLSS   -->  W1SS+  BT     TB          
      4.56048641E-04    3     -1000024         6        -5             # GLSS   -->  W1SS-  TP     BB          
      5.55967854E-04    3      1000037         5        -6             # GLSS   -->  W2SS+  BT     TB          
      5.55967854E-04    3     -1000037         6        -5             # GLSS   -->  W2SS-  TP     BB          
      5.53966311E-06    2      1000022        21                       # GLSS   -->  Z1SS   GL                 
      2.81246641E-04    3      1000022         6        -6             # GLSS   -->  Z1SS   TP     TB          
      8.25479074E-05    2      1000023        21                       # GLSS   -->  Z2SS   GL                 
      3.10557254E-04    3      1000023         6        -6             # GLSS   -->  Z2SS   TP     TB          
      3.00070038E-04    2      1000025        21                       # GLSS   -->  Z3SS   GL                 
      1.52047724E-05    3      1000025         6        -6             # GLSS   -->  Z3SS   TP     TB          
      2.09907492E-04    2      1000035        21                       # GLSS   -->  Z4SS   GL                 
      1.95517894E-02    2     -1000002         2                       # GLSS   -->  UBL    UP                 
      1.95517894E-02    2      1000002        -2                       # GLSS   -->  UPL    UB                 
      9.49291326E-03    2     -1000001         1                       # GLSS   -->  DBL    DN                 
      9.49291326E-03    2      1000001        -1                       # GLSS   -->  DNL    DB                 
      7.22672343E-02    2     -2000002         2                       # GLSS   -->  UBR    UP                 
      7.22672343E-02    2      2000002        -2                       # GLSS   -->  UPR    UB                 
      7.19504282E-02    2     -2000001         1                       # GLSS   -->  DBR    DN                 
      7.19504282E-02    2      2000001        -1                       # GLSS   -->  DNR    DB                 
      9.49175749E-03    2     -1000003         3                       # GLSS   -->  SBL    ST                 
      9.49175749E-03    2      1000003        -3                       # GLSS   -->  STL    SB                 
      7.19492212E-02    2     -2000003         3                       # GLSS   -->  SBR    ST                 
      7.19492212E-02    2      2000003        -3                       # GLSS   -->  STR    SB                 
      1.94994751E-02    2     -1000004         4                       # GLSS   -->  CBL    CH                 
      1.94994751E-02    2      1000004        -4                       # GLSS   -->  CHL    CB                 
      7.22147077E-02    2     -2000004         4                       # GLSS   -->  CBR    CH                 
      7.22147077E-02    2      2000004        -4                       # GLSS   -->  CHR    CB                 
      8.77745375E-02    2     -1000005         5                       # GLSS   -->  BB1    BT                 
      8.77745375E-02    2      1000005        -5                       # GLSS   -->  BT1    BB                 
      6.41933605E-02    2     -2000005         5                       # GLSS   -->  BB2    BT                 
      6.41933605E-02    2      2000005        -5                       # GLSS   -->  BT2    BB                 
      2.77405618E-08    2      1000039        21                       # GLSS   -->  GVSS   GL                 
#         PDG         Width
DECAY   1000002  5.76383018E+00   # UPL   decays
#          BR          NDA       ID1       ID2       ID3       ID4
      1.04190526E-03    2      1000022         2                       # UPL    -->  Z1SS   UP                 
      2.47945279E-01    2      1000023         2                       # UPL    -->  Z2SS   UP                 
      2.80162180E-03    2      1000025         2                       # UPL    -->  Z3SS   UP                 
      8.33619162E-02    2      1000035         2                       # UPL    -->  Z4SS   UP                 
      5.28187692E-01    2      1000024         1                       # UPL    -->  W1SS+  DN                 
      1.36661589E-01    2      1000037         1                       # UPL    -->  W2SS+  DN                 
#         PDG         Width
DECAY   1000001  5.54500294E+00   # DNL   decays
#          BR          NDA       ID1       ID2       ID3       ID4
      3.68253626E-02    2      1000022         1                       # DNL    -->  Z1SS   DN                 
      2.00411320E-01    2      1000023         1                       # DNL    -->  Z2SS   DN                 
      5.09351911E-03    2      1000025         1                       # DNL    -->  Z3SS   DN                 
      1.06474102E-01    2      1000035         1                       # DNL    -->  Z4SS   DN                 
      3.93555343E-01    2     -1000024         2                       # DNL    -->  W1SS-  UP                 
      2.57640332E-01    2     -1000037         2                       # DNL    -->  W2SS-  UP                 
#         PDG         Width
DECAY   1000003  5.54495096E+00   # STL   decays
#          BR          NDA       ID1       ID2       ID3       ID4
      3.68257128E-02    2      1000022         3                       # STL    -->  Z1SS   ST                 
      2.00413227E-01    2      1000023         3                       # STL    -->  Z2SS   ST                 
      5.09356754E-03    2      1000025         3                       # STL    -->  Z3SS   ST                 
      1.06475122E-01    2      1000035         3                       # STL    -->  Z4SS   ST                 
      3.93554211E-01    2     -1000024         4                       # STL    -->  W1SS-  CH                 
      2.57638246E-01    2     -1000037         4                       # STL    -->  W2SS-  CH                 
#         PDG         Width
DECAY   1000004  5.76382923E+00   # CHL   decays
#          BR          NDA       ID1       ID2       ID3       ID4
      1.04189699E-03    2      1000022         4                       # CHL    -->  Z1SS   CH                 
      2.47943193E-01    2      1000023         4                       # CHL    -->  Z2SS   CH                 
      2.80159409E-03    2      1000025         4                       # CHL    -->  Z3SS   CH                 
      8.33609402E-02    2      1000035         4                       # CHL    -->  Z4SS   CH                 
      5.28189898E-01    2      1000024         3                       # CHL    -->  W1SS+  ST                 
      1.36662498E-01    2      1000037         3                       # CHL    -->  W2SS+  ST                 
#         PDG         Width
DECAY   1000005  4.59951496E+00   # BT1   decays
#          BR          NDA       ID1       ID2       ID3       ID4
      7.89662749E-02    2      1000022         5                       # BT1    -->  Z1SS   BT                 
      1.56091109E-01    2      1000023         5                       # BT1    -->  Z2SS   BT                 
      6.70508109E-03    2      1000025         5                       # BT1    -->  Z3SS   BT                 
      3.24254856E-02    2      1000035         5                       # BT1    -->  Z4SS   BT                 
      3.25047255E-01    2     -1000024         6                       # BT1    -->  W1SS-  TP                 
      4.00764823E-01    2     -1000037         6                       # BT1    -->  W2SS-  TP                 
#         PDG         Width
DECAY   1000006  9.65222645E+00   # TP1   decays
#          BR          NDA       ID1       ID2       ID3       ID4
      8.73029530E-02    2      1000022         6                       # TP1    -->  Z1SS   TP                 
      1.17075920E-01    2      1000023         6                       # TP1    -->  Z2SS   TP                 
      2.56727517E-01    2      1000025         6                       # TP1    -->  Z3SS   TP                 
      2.10607257E-02    2      1000035         6                       # TP1    -->  Z4SS   TP                 
      3.78892243E-01    2      1000024         5                       # TP1    -->  W1SS+  BT                 
      1.38940603E-01    2      1000037         5                       # TP1    -->  W2SS+  BT                 
#         PDG         Width
DECAY   2000002  1.17934346E+00   # UPR   decays
#          BR          NDA       ID1       ID2       ID3       ID4
      9.09497678E-01    2      1000022         2                       # UPR    -->  Z1SS   UP                 
      7.13972971E-02    2      1000023         2                       # UPR    -->  Z2SS   UP                 
      5.00323018E-03    2      1000025         2                       # UPR    -->  Z3SS   UP                 
      1.41018257E-02    2      1000035         2                       # UPR    -->  Z4SS   UP                 
#         PDG         Width
DECAY   2000001  2.94886023E-01   # DNR   decays
#          BR          NDA       ID1       ID2       ID3       ID4
      9.09492552E-01    2      1000022         1                       # DNR    -->  Z1SS   DN                 
      7.13994354E-02    2      1000023         1                       # DNR    -->  Z2SS   DN                 
      5.00374380E-03    2      1000025         1                       # DNR    -->  Z3SS   DN                 
      1.41043011E-02    2      1000035         1                       # DNR    -->  Z4SS   DN                 
#         PDG         Width
DECAY   2000003  2.94886112E-01   # STR   decays
#          BR          NDA       ID1       ID2       ID3       ID4
      9.09492612E-01    2      1000022         3                       # STR    -->  Z1SS   ST                 
      7.13994205E-02    2      1000023         3                       # STR    -->  Z2SS   ST                 
      5.00374380E-03    2      1000025         3                       # STR    -->  Z3SS   ST                 
      1.41043002E-02    2      1000035         3                       # STR    -->  Z4SS   ST                 
#         PDG         Width
DECAY   2000004  1.17933297E+00   # CHR   decays
#          BR          NDA       ID1       ID2       ID3       ID4
      9.09497797E-01    2      1000022         4                       # CHR    -->  Z1SS   CH                 
      7.13972524E-02    2      1000023         4                       # CHR    -->  Z2SS   CH                 
      5.00321854E-03    2      1000025         4                       # CHR    -->  Z3SS   CH                 
      1.41017623E-02    2      1000035         4                       # CHR    -->  Z4SS   CH                 
#         PDG         Width
DECAY   2000005  5.05680180E+00   # BT2   decays
#          BR          NDA       ID1       ID2       ID3       ID4
      2.51283329E-02    2      1000022         5                       # BT2    -->  Z1SS   BT                 
      8.33089501E-02    2      1000023         5                       # BT2    -->  Z2SS   BT                 
      2.76582353E-02    2      1000025         5                       # BT2    -->  Z3SS   BT                 
      9.15863514E-02    2      1000035         5                       # BT2    -->  Z4SS   BT                 
      2.16003224E-01    2     -1000024         6                       # BT2    -->  W1SS-  TP                 
      5.56314886E-01    2     -1000037         6                       # BT2    -->  W2SS-  TP                 
#         PDG         Width
DECAY   2000006  1.01287260E+01   # TP2   decays
#          BR          NDA       ID1       ID2       ID3       ID4
      9.21838731E-02    2      1000024         5                       # TP2    -->  W1SS+  BT                 
      2.96485543E-01    2      1000037         5                       # TP2    -->  W2SS+  BT                 
      5.84247056E-03    2      1000022         6                       # TP2    -->  Z1SS   TP                 
      9.39560980E-02    2      1000023         6                       # TP2    -->  Z2SS   TP                 
      1.79084942E-01    2      1000025         6                       # TP2    -->  Z3SS   TP                 
      3.32447082E-01    2      1000035         6                       # TP2    -->  Z4SS   TP                 
#         PDG         Width
DECAY   1000011  8.99534747E-02   # EL-   decays
#          BR          NDA       ID1       ID2       ID3       ID4
      6.37461901E-01    2      1000022        11                       # EL-    -->  Z1SS   E-                 
      1.34885684E-01    2      1000023        11                       # EL-    -->  Z2SS   E-                 
      2.27651849E-01    2     -1000024        12                       # EL-    -->  W1SS-  NUE                
      4.16001342E-07    3      1000015        11       -15             # EL-    -->  TAU1-  E-     TAU+        
      1.24547256E-07    3     -1000015        11        15             # EL-    -->  TAU1+  E-     TAU-        
      8.69792571E-10    2           11   1000039                       # EL-    -->  E-     GVSS               
#         PDG         Width
DECAY   1000013  8.99530724E-02   # MUL-  decays
#          BR          NDA       ID1       ID2       ID3       ID4
      6.37464166E-01    2      1000022        13                       # MUL-   -->  Z1SS   MU-                
      1.34881645E-01    2      1000023        13                       # MUL-   -->  Z2SS   MU-                
      2.27653593E-01    2     -1000024        14                       # MUL-   -->  W1SS-  NUM                
      4.16003815E-07    3      1000015        13       -15             # MUL-   -->  TAU1-  MU-    TAU+        
      1.24548009E-07    3     -1000015        13        15             # MUL-   -->  TAU1+  MU-    TAU-        
      8.69795846E-10    2           13   1000039                       # MUL-   -->  MU-    GVSS               
#         PDG         Width
DECAY   1000015  2.32143818E-12   # TAU1- decays
#          BR          NDA       ID1       ID2       ID3       ID4
      1.00000000E+00    2           15   1000039                       # TAU1-  -->  TAU-   GVSS               
#         PDG         Width
DECAY   1000012  1.01114511E-01   # NUEL  decays
#          BR          NDA       ID1       ID2       ID3       ID4
      9.99936402E-01    2      1000022        12                       # NUEL   -->  Z1SS   NUE                
      1.10601441E-05    3      1000015        12       -15             # NUEL   -->  TAU1-  NUE    TAU+        
      1.25096694E-05    3     -1000015        12        15             # NUEL   -->  TAU1+  NUE    TAU-        
      4.00091740E-05    3     -1000015        11        16             # NUEL   -->  TAU1+  E-     NUT         
      4.03779760E-10    2           12   1000039                       # NUEL   -->  NUE    GVSS               
#         PDG         Width
DECAY   1000014  1.01114511E-01   # NUML  decays
#          BR          NDA       ID1       ID2       ID3       ID4
      9.99936402E-01    2      1000022        14                       # NUML   -->  Z1SS   NUM                
      1.10601441E-05    3      1000015        14       -15             # NUML   -->  TAU1-  NUM    TAU+        
      1.25096694E-05    3     -1000015        14        15             # NUML   -->  TAU1+  NUM    TAU-        
      4.00111749E-05    3     -1000015        13        16             # NUML   -->  TAU1+  MU-    NUT         
      4.03779760E-10    2           14   1000039                       # NUML   -->  NUM    GVSS               
#         PDG         Width
DECAY   1000016  9.59383547E-02   # NUTL  decays
#          BR          NDA       ID1       ID2       ID3       ID4
      9.99306500E-01    2      1000022        16                       # NUTL   -->  Z1SS   NUT                
      9.52039863E-06    3     -1000015        16        15             # NUTL   -->  TAU1+  NUT    TAU-        
      8.51721488E-05    3      1000015        16       -15             # NUTL   -->  TAU1-  NUT    TAU+        
      7.48490347E-05    3      1000015        12       -11             # NUTL   -->  TAU1-  NUE    E+          
      7.48490347E-05    3      1000015        14       -13             # NUTL   -->  TAU1-  NUM    MU+         
      2.24547111E-04    3      1000015         2        -1             # NUTL   -->  TAU1-  UP     DB          
      2.24547111E-04    3      1000015         4        -3             # NUTL   -->  TAU1-  CH     SB          
      3.94464988E-10    2           16   1000039                       # NUTL   -->  NUT    GVSS               
#         PDG         Width
DECAY   2000011  9.59730559E-12   # ER-   decays
#          BR          NDA       ID1       ID2       ID3       ID4
      3.35572869E-01    3      1000015        11       -15             # ER-    -->  TAU1-  E-     TAU+        
      3.88723254E-01    3     -1000015        11        15             # ER-    -->  TAU1+  E-     TAU-        
      5.03188984E-11    3      1000015        12       -16             # ER-    -->  TAU1-  NUE    ANUT        
      2.75703847E-01    2           11   1000039                       # ER-    -->  E-     GVSS               
#         PDG         Width
DECAY   2000013  9.60067963E-12   # MUR-  decays
#          BR          NDA       ID1       ID2       ID3       ID4
      3.35617185E-01    3      1000015        13       -15             # MUR-   -->  TAU1-  MU-    TAU+        
      3.88774365E-01    3     -1000015        13        15             # MUR-   -->  TAU1+  MU-    TAU-        
      2.14132888E-06    3      1000015        14       -16             # MUR-   -->  TAU1-  NUM    ANUT        
      2.75606334E-01    2           13   1000039                       # MUR-   -->  MU-    GVSS               
#         PDG         Width
DECAY   2000015  9.51776505E-02   # TAU2- decays
#          BR          NDA       ID1       ID2       ID3       ID4
      6.70546055E-01    2      1000022        15                       # TAU2-  -->  Z1SS   TAU-               
      1.22560613E-01    2      1000023        15                       # TAU2-  -->  Z2SS   TAU-               
      2.06893355E-01    2     -1000024        16                       # TAU2-  -->  W1SS-  NUT                
#         PDG         Width
DECAY   1000022  2.22828425E-02   # Z1SS  decays
#          BR          NDA       ID1       ID2       ID3       ID4
      1.30528390E-01    2      2000011       -11                       # Z1SS   -->  ER-    E+                 
      1.30528390E-01    2     -2000011        11                       # Z1SS   -->  ER+    E-                 
      1.30504429E-01    2      2000013       -13                       # Z1SS   -->  MUR-   MU+                
      1.30504429E-01    2     -2000013        13                       # Z1SS   -->  MUR+   MU-                
      2.38967225E-01    2      1000015       -15                       # Z1SS   -->  TAU1-  TAU+               
      2.38967225E-01    2     -1000015        15                       # Z1SS   -->  TAU1+  TAU-               
      9.58156193E-11    2      1000039        22                       # Z1SS   -->  GVSS   GM                 
      1.92456814E-12    3      1000039        11       -11             # Z1SS   -->  GVSS   E-     E+          
      2.49779269E-16    2      1000039        23                       # Z1SS   -->  GVSS   Z0                 
#         PDG         Width
DECAY   1000023  1.23083428E-01   # Z2SS  decays
#          BR          NDA       ID1       ID2       ID3       ID4
      3.77214349E-07    2      1000022        22                       # Z2SS   -->  Z1SS   GM                 
      8.27345137E-10    3     -1000024         2        -1             # Z2SS   -->  W1SS-  UP     DB          
      2.75781703E-10    3     -1000024        12       -11             # Z2SS   -->  W1SS-  NUE    E+          
      2.75781703E-10    3     -1000024        14       -13             # Z2SS   -->  W1SS-  NUM    MU+         
      8.27345137E-10    3      1000024         1        -2             # Z2SS   -->  W1SS+  DN     UB          
      2.75781703E-10    3      1000024        11       -12             # Z2SS   -->  W1SS+  E-     ANUE        
      2.75781703E-10    3      1000024        13       -14             # Z2SS   -->  W1SS+  MU-    ANUM        
      2.44632101E-05    3      1000022         2        -2             # Z2SS   -->  Z1SS   UP     UB          
      3.26287991E-05    3      1000022         1        -1             # Z2SS   -->  Z1SS   DN     DB          
      3.26287991E-05    3      1000022         3        -3             # Z2SS   -->  Z1SS   ST     SB          
      2.44632029E-05    3      1000022         4        -4             # Z2SS   -->  Z1SS   CH     CB          
      3.27799717E-05    3      1000022         5        -5             # Z2SS   -->  Z1SS   BT     BB          
      2.44139501E-05    3      1000022        11       -11             # Z2SS   -->  Z1SS   E-     E+          
      2.44138882E-05    3      1000022        13       -13             # Z2SS   -->  Z1SS   MU-    MU+         
      2.24203504E-05    3      1000022        15       -15             # Z2SS   -->  Z1SS   TAU-   TAU+        
      1.35760783E-05    3      1000022        12       -12             # Z2SS   -->  Z1SS   NUE    ANUE        
      1.35760783E-05    3      1000022        14       -14             # Z2SS   -->  Z1SS   NUM    ANUM        
      1.35760783E-05    3      1000022        16       -16             # Z2SS   -->  Z1SS   NUT    ANUT        
      1.27308398E-01    2      2000011       -11                       # Z2SS   -->  ER-    E+                 
      1.27308398E-01    2     -2000011        11                       # Z2SS   -->  ER+    E-                 
      1.27308175E-01    2      2000013       -13                       # Z2SS   -->  MUR-   MU+                
      1.27308175E-01    2     -2000013        13                       # Z2SS   -->  MUR+   MU-                
      2.03583628E-01    2      1000015       -15                       # Z2SS   -->  TAU1-  TAU+               
      2.03583628E-01    2     -1000015        15                       # Z2SS   -->  TAU1+  TAU-               
      1.16515039E-02    2      1000012       -12                       # Z2SS   -->  NUEL   ANUE               
      1.16515039E-02    2     -1000012        12                       # Z2SS   -->  ANUEL  NUE                
      1.16515039E-02    2      1000014       -14                       # Z2SS   -->  NUML   ANUM               
      1.16515039E-02    2     -1000014        14                       # Z2SS   -->  ANUML  NUM                
      1.83671191E-02    2      1000016       -16                       # Z2SS   -->  NUTL   ANUT               
      1.83671191E-02    2     -1000016        16                       # Z2SS   -->  ANUTL  NUT                
      1.67767383E-10    2      1000039        22                       # Z2SS   -->  GVSS   GM                 
      3.52006575E-12    3      1000039        11       -11             # Z2SS   -->  GVSS   E-     E+          
      3.40196309E-11    2      1000039        23                       # Z2SS   -->  GVSS   Z0                 
      1.72072350E-12    2      1000039        25                       # Z2SS   -->  GVSS   HL0                
#         PDG         Width
DECAY   1000025  1.82395115E-01   # Z3SS  decays
#          BR          NDA       ID1       ID2       ID3       ID4
      2.05308481E-07    2      1000022        22                       # Z3SS   -->  Z1SS   GM                 
      4.43732097E-06    2      1000023        22                       # Z3SS   -->  Z2SS   GM                 
      5.24928700E-03    3     -1000024         2        -1             # Z3SS   -->  W1SS-  UP     DB          
      1.74976233E-03    3     -1000024        12       -11             # Z3SS   -->  W1SS-  NUE    E+          
      1.74976233E-03    3     -1000024        14       -13             # Z3SS   -->  W1SS-  NUM    MU+         
      5.24928700E-03    3      1000024         1        -2             # Z3SS   -->  W1SS+  DN     UB          
      1.74976233E-03    3      1000024        11       -12             # Z3SS   -->  W1SS+  E-     ANUE        
      1.74976233E-03    3      1000024        13       -14             # Z3SS   -->  W1SS+  MU-    ANUM        
      5.24928700E-03    3     -1000024         4        -3             # Z3SS   -->  W1SS-  CH     SB          
      1.74976233E-03    3     -1000024        16       -15             # Z3SS   -->  W1SS-  NUT    TAU+        
      5.24928700E-03    3      1000024         3        -4             # Z3SS   -->  W1SS+  ST     CB          
      1.74976233E-03    3      1000024        15       -16             # Z3SS   -->  W1SS+  TAU-   ANUT        
      5.67474484E-01    2      1000022        23                       # Z3SS   -->  Z1SS   Z0                 
      2.26937047E-08    3      1000022         2        -2             # Z3SS   -->  Z1SS   UP     UB          
      1.64918497E-08    3      1000022         1        -1             # Z3SS   -->  Z1SS   DN     DB          
      1.64918426E-08    3      1000022         3        -3             # Z3SS   -->  Z1SS   ST     SB          
      2.26933885E-08    3      1000022         4        -4             # Z3SS   -->  Z1SS   CH     CB          
      6.61626882E-06    3      1000022         5        -5             # Z3SS   -->  Z1SS   BT     BB          
      9.35607261E-07    3      1000022        15       -15             # Z3SS   -->  Z1SS   TAU-   TAU+        
      5.31132158E-04    3      1000023         2        -2             # Z3SS   -->  Z2SS   UP     UB          
      6.77353528E-04    3      1000023         1        -1             # Z3SS   -->  Z2SS   DN     DB          
      6.77353528E-04    3      1000023         3        -3             # Z3SS   -->  Z2SS   ST     SB          
      5.31132158E-04    3      1000023         4        -4             # Z3SS   -->  Z2SS   CH     CB          
      6.59895304E-04    3      1000023         5        -5             # Z3SS   -->  Z2SS   BT     BB          
      1.54568857E-04    3      1000023        11       -11             # Z3SS   -->  Z2SS   E-     E+          
      1.54568857E-04    3      1000023        13       -13             # Z3SS   -->  Z2SS   MU-    MU+         
      1.53821748E-04    3      1000023        15       -15             # Z3SS   -->  Z2SS   TAU-   TAU+        
      3.07543407E-04    3      1000023        12       -12             # Z3SS   -->  Z2SS   NUE    ANUE        
      3.07543407E-04    3      1000023        14       -14             # Z3SS   -->  Z2SS   NUM    ANUM        
      3.07543407E-04    3      1000023        16       -16             # Z3SS   -->  Z2SS   NUT    ANUT        
      4.13653813E-02    2      1000022        25                       # Z3SS   -->  Z1SS   HL0                
      2.58470280E-03    2      1000011       -11                       # Z3SS   -->  EL-    E+                 
      2.58470280E-03    2     -1000011        11                       # Z3SS   -->  EL+    E-                 
      2.58469861E-03    2      1000013       -13                       # Z3SS   -->  MUL-   MU+                
      2.58469861E-03    2     -1000013        13                       # Z3SS   -->  MUL+   MU-                
      1.65423043E-02    2      2000011       -11                       # Z3SS   -->  ER-    E+                 
      1.65423043E-02    2     -2000011        11                       # Z3SS   -->  ER+    E-                 
      1.65422987E-02    2      2000013       -13                       # Z3SS   -->  MUR-   MU+                
      1.65422987E-02    2     -2000013        13                       # Z3SS   -->  MUR+   MU-                
      4.80091199E-02    2      1000015       -15                       # Z3SS   -->  TAU1-  TAU+               
      4.80091199E-02    2     -1000015        15                       # Z3SS   -->  TAU1+  TAU-               
      2.12450102E-02    2      2000015       -15                       # Z3SS   -->  TAU2-  TAU+               
      2.12450102E-02    2     -2000015        15                       # Z3SS   -->  TAU2+  TAU-               
      2.30320971E-02    2      1000012       -12                       # Z3SS   -->  NUEL   ANUE               
      2.30320971E-02    2     -1000012        12                       # Z3SS   -->  ANUEL  NUE                
      2.30320971E-02    2      1000014       -14                       # Z3SS   -->  NUML   ANUM               
      2.30320971E-02    2     -1000014        14                       # Z3SS   -->  ANUML  NUM                
      2.40226276E-02    2      1000016       -16                       # Z3SS   -->  NUTL   ANUT               
      2.40226276E-02    2     -1000016        16                       # Z3SS   -->  ANUTL  NUT                
      6.65064846E-13    2      1000039        22                       # Z3SS   -->  GVSS   GM                 
      1.43771103E-14    3      1000039        11       -11             # Z3SS   -->  GVSS   E-     E+          
      2.36158426E-10    2      1000039        23                       # Z3SS   -->  GVSS   Z0                 
      2.55937216E-10    2      1000039        25                       # Z3SS   -->  GVSS   HL0                
#         PDG         Width
DECAY   1000035  2.02192616E+00   # Z4SS  decays
#          BR          NDA       ID1       ID2       ID3       ID4
      3.02006642E-09    2      1000022        22                       # Z4SS   -->  Z1SS   GM                 
      1.08335016E-07    2      1000023        22                       # Z4SS   -->  Z2SS   GM                 
      9.42636689E-08    2      1000025        22                       # Z4SS   -->  Z3SS   GM                 
      1.46464959E-01    2      1000024       -24                       # Z4SS   -->  W1SS+  W-                 
      1.46464959E-01    2     -1000024        24                       # Z4SS   -->  W1SS-  W+                 
      2.56992496E-12    3     -1000037         2        -1             # Z4SS   -->  W2SS-  UP     DB          
      8.56641689E-13    3     -1000037        12       -11             # Z4SS   -->  W2SS-  NUE    E+          
      8.56641689E-13    3     -1000037        14       -13             # Z4SS   -->  W2SS-  NUM    MU+         
      2.56992496E-12    3      1000037         1        -2             # Z4SS   -->  W2SS+  DN     UB          
      8.56641689E-13    3      1000037        11       -12             # Z4SS   -->  W2SS+  E-     ANUE        
      8.56641689E-13    3      1000037        13       -14             # Z4SS   -->  W2SS+  MU-    ANUM        
      9.95795336E-03    2      1000022        23                       # Z4SS   -->  Z1SS   Z0                 
      7.45974132E-04    2      1000023        23                       # Z4SS   -->  Z2SS   Z0                 
      6.79065550E-08    3      1000022         2        -2             # Z4SS   -->  Z1SS   UP     UB          
      2.97767912E-07    3      1000022         1        -1             # Z4SS   -->  Z1SS   DN     DB          
      2.97767770E-07    3      1000022         3        -3             # Z4SS   -->  Z1SS   ST     SB          
      6.79055958E-08    3      1000022         4        -4             # Z4SS   -->  Z1SS   CH     CB          
      5.46976992E-07    3      1000022         5        -5             # Z4SS   -->  Z1SS   BT     BB          
      3.26908136E-08    3      1000022        15       -15             # Z4SS   -->  Z1SS   TAU-   TAU+        
      4.57032741E-07    3      1000023         2        -2             # Z4SS   -->  Z2SS   UP     UB          
      4.01532702E-07    3      1000023         1        -1             # Z4SS   -->  Z2SS   DN     DB          
      4.01532503E-07    3      1000023         3        -3             # Z4SS   -->  Z2SS   ST     SB          
      4.57026403E-07    3      1000023         4        -4             # Z4SS   -->  Z2SS   CH     CB          
      4.90089803E-07    3      1000023         5        -5             # Z4SS   -->  Z2SS   BT     BB          
      9.60490368E-11    3      1000023        15       -15             # Z4SS   -->  Z2SS   TAU-   TAU+        
      7.55579549E-06    3      1000025         2        -2             # Z4SS   -->  Z3SS   UP     UB          
      9.83322116E-06    3      1000025         1        -1             # Z4SS   -->  Z3SS   DN     DB          
      9.83322116E-06    3      1000025         3        -3             # Z4SS   -->  Z3SS   ST     SB          
      7.55579640E-06    3      1000025         4        -4             # Z4SS   -->  Z3SS   CH     CB          
      8.72233068E-06    3      1000025         5        -5             # Z4SS   -->  Z3SS   BT     BB          
      2.21925688E-06    3      1000025        11       -11             # Z4SS   -->  Z3SS   E-     E+          
      2.21925688E-06    3      1000025        13       -13             # Z4SS   -->  Z3SS   MU-    MU+         
      2.17457341E-06    3      1000025        15       -15             # Z4SS   -->  Z3SS   TAU-   TAU+        
      4.41562361E-06    3      1000025        12       -12             # Z4SS   -->  Z3SS   NUE    ANUE        
      4.41562361E-06    3      1000025        14       -14             # Z4SS   -->  Z3SS   NUM    ANUM        
      4.41562361E-06    3      1000025        16       -16             # Z4SS   -->  Z3SS   NUT    ANUT        
      3.09467707E-02    2      1000022        25                       # Z4SS   -->  Z1SS   HL0                
      3.88360396E-03    2      1000023        25                       # Z4SS   -->  Z2SS   HL0                
      3.14591490E-02    2      1000011       -11                       # Z4SS   -->  EL-    E+                 
      3.14591490E-02    2     -1000011        11                       # Z4SS   -->  EL+    E-                 
      3.14591341E-02    2      1000013       -13                       # Z4SS   -->  MUL-   MU+                
      3.14591341E-02    2     -1000013        13                       # Z4SS   -->  MUL+   MU-                
      6.73790695E-03    2      2000011       -11                       # Z4SS   -->  ER-    E+                 
      6.73790695E-03    2     -2000011        11                       # Z4SS   -->  ER+    E-                 
      6.73790276E-03    2      2000013       -13                       # Z4SS   -->  MUR-   MU+                
      6.73790276E-03    2     -2000013        13                       # Z4SS   -->  MUR+   MU-                
      5.19632874E-03    2      1000015       -15                       # Z4SS   -->  TAU1-  TAU+               
      5.19632874E-03    2     -1000015        15                       # Z4SS   -->  TAU1+  TAU-               
      3.45507823E-02    2      2000015       -15                       # Z4SS   -->  TAU2-  TAU+               
      3.45507823E-02    2     -2000015        15                       # Z4SS   -->  TAU2+  TAU-               
      7.09517747E-02    2      1000012       -12                       # Z4SS   -->  NUEL   ANUE               
      7.09517747E-02    2     -1000012        12                       # Z4SS   -->  ANUEL  NUE                
      7.09517747E-02    2      1000014       -14                       # Z4SS   -->  NUML   ANUM               
      7.09517747E-02    2     -1000014        14                       # Z4SS   -->  ANUML  NUM                
      7.26896152E-02    2      1000016       -16                       # Z4SS   -->  NUTL   ANUT               
      7.26896152E-02    2     -1000016        16                       # Z4SS   -->  ANUTL  NUT                
      1.13521675E-11    2      1000039        22                       # Z4SS   -->  GVSS   GM                 
      2.48818273E-13    3      1000039        11       -11             # Z4SS   -->  GVSS   E-     E+          
      1.65487346E-10    2      1000039        23                       # Z4SS   -->  GVSS   Z0                 
      3.37055349E-11    2      1000039        25                       # Z4SS   -->  GVSS   HL0                
      4.26452872E-16    2      1000039        35                       # Z4SS   -->  GVSS   HH0                
      8.38191511E-16    2      1000039        36                       # Z4SS   -->  GVSS   HA0                
#         PDG         Width
DECAY   1000024  2.92725582E-02   # W1SS+ decays
#          BR          NDA       ID1       ID2       ID3       ID4
      2.32762424E-03    3      1000022         2        -1             # W1SS+  -->  Z1SS   UP     DB          
      2.32762424E-03    3      1000022         4        -3             # W1SS+  -->  Z1SS   CH     SB          
      5.11254242E-04    3      1000022       -11        12             # W1SS+  -->  Z1SS   E+     NUE         
      5.11254417E-04    3      1000022       -13        14             # W1SS+  -->  Z1SS   MU+    NUM         
      5.23826922E-04    3      1000022       -15        16             # W1SS+  -->  Z1SS   TAU+   NUT         
      9.53289941E-02    2      1000012       -11                       # W1SS+  -->  NUEL   E+                 
      9.53155085E-02    2      1000014       -13                       # W1SS+  -->  NUML   MU+                
      1.85913518E-01    2      1000016       -15                       # W1SS+  -->  NUTL   TAU+               
      6.17240429E-01    2     -1000015        16                       # W1SS+  -->  TAU1+  NUT                
#         PDG         Width
DECAY   1000037  1.66789079E+00   # W2SS+ decays
#          BR          NDA       ID1       ID2       ID3       ID4
      3.36199946E-07    3      1000022         2        -1             # W2SS+  -->  Z1SS   UP     DB          
      3.36199577E-07    3      1000022         4        -3             # W2SS+  -->  Z1SS   CH     SB          
      3.31075195E-10    3      1000022       -15        16             # W2SS+  -->  Z1SS   TAU+   NUT         
      1.67399552E-02    2      1000022        24                       # W2SS+  -->  Z1SS   W+                 
      3.64669233E-07    3      1000023         2        -1             # W2SS+  -->  Z2SS   UP     DB          
      3.64667187E-07    3      1000023         4        -3             # W2SS+  -->  Z2SS   CH     SB          
      1.97877810E-07    3      1000023       -15        16             # W2SS+  -->  Z2SS   TAU+   NUT         
      1.72019631E-01    2      1000023        24                       # W2SS+  -->  Z2SS   W+                 
      3.05703870E-05    3      1000025         2        -1             # W2SS+  -->  Z3SS   UP     DB          
      3.05703870E-05    3      1000025         4        -3             # W2SS+  -->  Z3SS   CH     SB          
      1.01722817E-05    3      1000025       -11        12             # W2SS+  -->  Z3SS   E+     NUE         
      1.01722817E-05    3      1000025       -13        14             # W2SS+  -->  Z3SS   MU+    NUM         
      1.01729329E-05    3      1000025       -15        16             # W2SS+  -->  Z3SS   TAU+   NUT         
      9.71309319E-02    2      1000012       -11                       # W2SS+  -->  NUEL   E+                 
      9.71309245E-02    2      1000014       -13                       # W2SS+  -->  NUML   MU+                
      1.03418134E-01    2      1000016       -15                       # W2SS+  -->  NUTL   TAU+               
      1.32647917E-01    2     -1000011        12                       # W2SS+  -->  EL+    NUE                
      1.32647872E-01    2     -1000013        14                       # W2SS+  -->  MUL+   NUM                
      6.60363366E-05    2     -1000015        16                       # W2SS+  -->  TAU1+  NUT                
      1.35348603E-01    2     -2000015        16                       # W2SS+  -->  TAU2+  NUT                
      1.00515887E-01    2      1000024        23                       # W2SS+  -->  W1SS+  Z0                 
      6.69801466E-07    3      1000024         1        -1             # W2SS+  -->  W1SS+  DN     DB          
      6.69792144E-07    3      1000024         3        -3             # W2SS+  -->  W1SS+  ST     SB          
      8.02867646E-07    3      1000024         2        -2             # W2SS+  -->  W1SS+  UP     UB          
      8.02867362E-07    3      1000024         4        -4             # W2SS+  -->  W1SS+  CH     CB          
      1.22380657E-02    2      1000024        25                       # W2SS+  -->  W1SS+  HL0                
#         PDG         Width
DECAY        25  5.70847141E-03   # HL0   decays
#          BR          NDA       ID1       ID2       ID3       ID4
      5.21325649E-09    2           11       -11                       # HL0    -->  E-     E+                 
      2.20111804E-04    2           13       -13                       # HL0    -->  MU-    MU+                
      6.29377663E-02    2           15       -15                       # HL0    -->  TAU-   TAU+               
      6.55118129E-06    2            1        -1                       # HL0    -->  DN     DB                 
      2.64700502E-03    2            3        -3                       # HL0    -->  ST     SB                 
      8.77635360E-01    2            5        -5                       # HL0    -->  BT     BB                 
      1.26220732E-06    2            2        -2                       # HL0    -->  UP     UB                 
      2.40571424E-02    2            4        -4                       # HL0    -->  CH     CB                 
      9.30817099E-04    2           22        22                       # HL0    -->  GM     GM                 
      2.18327548E-02    2           21        21                       # HL0    -->  GL     GL                 
      5.23108523E-04    3           24        11       -12             # HL0    -->  W+     E-     ANUE        
      5.23108523E-04    3           24        13       -14             # HL0    -->  W+     MU-    ANUM        
      5.23108523E-04    3           24        15       -16             # HL0    -->  W+     TAU-   ANUT        
      1.56932557E-03    3           24        -2         1             # HL0    -->  W+     UB     DN          
      1.56932557E-03    3           24        -4         3             # HL0    -->  W+     CB     ST          
      5.23108523E-04    3          -24       -11        12             # HL0    -->  W-     E+     NUE         
      5.23108523E-04    3          -24       -13        14             # HL0    -->  W-     MU+    NUM         
      5.23108523E-04    3          -24       -15        16             # HL0    -->  W-     TAU+   NUT         
      1.56932557E-03    3          -24         2        -1             # HL0    -->  W-     UP     DB          
      1.56932557E-03    3          -24         4        -3             # HL0    -->  W-     CH     SB          
      2.15512136E-05    3           23        12       -12             # HL0    -->  Z0     NUE    ANUE        
      2.15512136E-05    3           23        14       -14             # HL0    -->  Z0     NUM    ANUM        
      2.15512136E-05    3           23        16       -16             # HL0    -->  Z0     NUT    ANUT        
      1.08465101E-05    3           23        11       -11             # HL0    -->  Z0     E-     E+          
      1.08465101E-05    3           23        13       -13             # HL0    -->  Z0     MU-    MU+         
      1.08465101E-05    3           23        15       -15             # HL0    -->  Z0     TAU-   TAU+        
      3.71592214E-05    3           23         2        -2             # HL0    -->  Z0     UP     UB          
      3.71592214E-05    3           23         4        -4             # HL0    -->  Z0     CH     CB          
      4.78702350E-05    3           23         1        -1             # HL0    -->  Z0     DN     DB          
      4.78702350E-05    3           23         3        -3             # HL0    -->  Z0     ST     SB          
      4.78702350E-05    3           23         5        -5             # HL0    -->  Z0     BT     BB          
#         PDG         Width
DECAY        35  5.19341111E-01   # HH0   decays
#          BR          NDA       ID1       ID2       ID3       ID4
      8.93713548E-09    2           11       -11                       # HH0    -->  E-     E+                 
      3.77341668E-04    2           13       -13                       # HH0    -->  MU-    MU+                
      1.08049445E-01    2           15       -15                       # HH0    -->  TAU-   TAU+               
      1.10864612E-05    2            1        -1                       # HH0    -->  DN     DB                 
      4.47949022E-03    2            3        -3                       # HH0    -->  ST     SB                 
      7.80859947E-01    2            5        -5                       # HH0    -->  BT     BB                 
      5.89106652E-10    2            2        -2                       # HH0    -->  UP     UB                 
      9.77877517E-06    2            4        -4                       # HH0    -->  CH     CB                 
      1.39067390E-06    2           22        22                       # HH0    -->  GM     GM                 
      2.42496608E-04    2           21        21                       # HH0    -->  GL     GL                 
      6.38862466E-03    2           24       -24                       # HH0    -->  W+     W-                 
      2.86237057E-03    2           23        23                       # HH0    -->  Z0     Z0                 
      4.70353626E-02    2      1000022   1000022                       # HH0    -->  Z1SS   Z1SS               
      2.15258319E-02    2      1000022   1000023                       # HH0    -->  Z1SS   Z2SS               
      2.43117493E-02    2           25        25                       # HH0    -->  HL0    HL0                
      1.36686151E-03    2      2000011  -2000011                       # HH0    -->  ER-    ER+                
      1.36618025E-03    2      2000013  -2000013                       # HH0    -->  MUR-   MUR+               
      1.10259047E-03    2      1000015  -1000015                       # HH0    -->  TAU1-  TAU1+              
      4.65527592E-06    2      1000015  -2000015                       # HH0    -->  TAU1-  TAU2+              
      4.65527592E-06    2      2000015  -1000015                       # HH0    -->  TAU2-  TAU1+              
#         PDG         Width
DECAY        36  6.11756027E-01   # HA0   decays
#          BR          NDA       ID1       ID2       ID3       ID4
      7.56714602E-09    2           11       -11                       # HA0    -->  E-     E+                 
      3.19498475E-04    2           13       -13                       # HA0    -->  MU-    MU+                
      9.15014967E-02    2           15       -15                       # HA0    -->  TAU-   TAU+               
      9.38802714E-06    2            1        -1                       # HA0    -->  DN     DB                 
      3.79323866E-03    2            3        -3                       # HA0    -->  ST     SB                 
      6.61701858E-01    2            5        -5                       # HA0    -->  BT     BB                 
      3.00386743E-10    2            2        -2                       # HA0    -->  UP     UB                 
      4.99262114E-06    2            4        -4                       # HA0    -->  CH     CB                 
      4.91998229E-08    2           22        22                       # HA0    -->  GM     GM                 
      2.60261713E-05    2           21        21                       # HA0    -->  GL     GL                 
      9.20745581E-02    2      1000022   1000022                       # HA0    -->  Z1SS   Z1SS               
      1.47683278E-01    2      1000022   1000023                       # HA0    -->  Z1SS   Z2SS               
      2.88497331E-03    2           25        23                       # HA0    -->  HL0    Z0                 
      7.26571017E-12    2      1000011  -2000011                       # HA0    -->  EL-    ER+                
      7.26571017E-12    2      2000011  -1000011                       # HA0    -->  ER-    EL+                
      3.06770261E-07    2      1000013  -2000013                       # HA0    -->  MUL-   MUR+               
      3.06770261E-07    2      2000013  -1000013                       # HA0    -->  MUR-   MUL+               
      1.88234726E-08    2      1000015  -2000015                       # HA0    -->  TAU1-  TAU2+              
      1.88234726E-08    2      2000015  -1000015                       # HA0    -->  TAU2-  TAU1+              
#         PDG         Width
DECAY        37  3.76109660E-01   # H+    decays
#          BR          NDA       ID1       ID2       ID3       ID4
      1.29048940E-08    2           12       -11                       # H+     -->  NUE    E+                 
      5.44867769E-04    2           14       -13                       # H+     -->  NUM    MU+                
      1.56046435E-01    2           16       -15                       # H+     -->  NUT    TAU+               
      1.45317599E-05    2            2        -1                       # H+     -->  UP     DB                 
      5.87878330E-03    2            4        -3                       # H+     -->  CH     SB                 
      5.41356206E-01    2            6        -5                       # H+     -->  TP     BB                 
      2.88974166E-01    2      1000024   1000022                       # H+     -->  W1SS+  Z1SS               
      7.01647066E-03    2           25        24                       # H+     -->  HL0    W+                 
      1.68571583E-04    2     -1000015   1000016                       # H+     -->  TAU1+  NUTL               
