#  ISAJET SUSY parameters in SUSY Les Houches Accord 2 format
#  Created by ISALHA 2.0 Last revision: C. Balazs 21 Apr 2009
Block SPINFO   # Program information
     1   ISASUGRA from ISAJET          # Spectrum Calculator
     2   7.80   29-OCT-2009 12:50:36   # Version number
Block MODSEL   # Model selection
     1     0   #   MsR(Q)          MbR(Q)                          
Block SMINPUTS   # Standard Model inputs
     1     1.27837601E+02   # alpha_em^(-1)
     2     1.16570000E-05   # G_Fermi
     3     1.17200002E-01   # alpha_s(M_Z)
     4     9.11699982E+01   # m_{Z}(pole)
     5     4.19999981E+00   # m_{b}(m_{b})
     6     1.72500000E+02   # m_{top}(pole)
     7     1.77699995E+00   # m_{tau}(pole)
Block MINPAR   # SUSY breaking input parameters
Block MASS   # Scalar and gaugino mass spectrum
#  PDG code   mass                 particle
        24     8.04229965E+01   #  W^+
        25     1.20300003E+02   #  h^0            
        35     2.51771997E+03   #  H^0            
        36     2.50000000E+03   #  A^0            
        37     2.51633154E+03   #  H^+            
   1000001     8.01754700E+02   #  dnl            
   1000002     7.98563538E+02   #  upl            
   1000003     8.01754700E+02   #  stl            
   1000004     7.98564636E+02   #  chl            
   1000005     8.00312256E+02   #  b1             
   1000006     8.11648682E+02   #  t1             
   1000011     2.50035645E+03   #  el-            
   1000012     2.49933496E+03   #  nuel           
   1000013     2.50035645E+03   #  mul-           
   1000014     2.49933496E+03   #  numl           
   1000015     2.50029565E+03   #  tau1           
   1000016     2.49933496E+03   #  nutl           
   1000021     9.00000000E+02   #  glss           
   1000022     4.95151367E+01   #  z1ss           
   1000023     2.42852466E+03   #  z2ss           
   1000024     2.42832593E+03   #  w1ss           
   1000025    -2.50041187E+03   #  z3ss           
   1000035     2.57237256E+03   #  z4ss           
   1000037     2.57219092E+03   #  w2ss           
   2000001     8.00321350E+02   #  dnr            
   2000002     7.99356995E+02   #  upr            
   2000003     8.00321411E+02   #  str            
   2000004     7.99358093E+02   #  chr            
   2000005     8.01773621E+02   #  b2             
   2000006     8.12486816E+02   #  t2             
   2000011     2.50030859E+03   #  er-            
   2000013     2.50030859E+03   #  mur-           
   2000015     2.50037036E+03   #  tau2           
Block ALPHA   # Effective Higgs mixing parameter
         -3.22570533E-01   # alpha
Block STOPMIX   # stop mixing matrix
  1  1     7.19642818E-01   # O_{11}
  1  2     6.94344521E-01   # O_{12}
  2  1    -6.94344521E-01   # O_{21}
  2  2     7.19642818E-01   # O_{22}
Block SBOTMIX   # sbottom mixing matrix
  1  1     5.52335052E-07   # O_{11}
  1  2    -1.00000000E+00   # O_{12}
  2  1     1.00000000E+00   # O_{21}
  2  2     5.52335052E-07   # O_{22}
Block STAUMIX   # stau mixing matrix
  1  1     2.81731172E-06   # O_{11}
  1  2    -1.00000000E+00   # O_{12}
  2  1     1.00000000E+00   # O_{21}
  2  2     2.81731172E-06   # O_{22}
Block NMIX   # neutralino mixing matrix
  1  1     9.99839604E-01   #
  1  2    -3.59976722E-04   #
  1  3     1.68992430E-02   #
  1  4    -5.92865795E-03   #
  2  1     1.16938101E-02   #
  2  2     7.08019316E-01   #
  2  3    -5.02892852E-01   #
  2  4     4.95652080E-01   #
  3  1    -7.75294006E-03   #
  3  2     7.19459541E-03   #
  3  3     7.06950903E-01   #
  3  4     7.07183957E-01   #
  4  1     1.11359842E-02   #
  4  2    -7.06156433E-01   #
  4  3    -4.97025281E-01   #
  4  4     5.04167676E-01   #
Block UMIX   # chargino U mixing matrix
  1  1    -7.02002406E-01   # U_{11}
  1  2     7.12174535E-01   # U_{12}
  2  1    -7.12174535E-01   # U_{21}
  2  2    -7.02002406E-01   # U_{22}
Block VMIX   # chargino V mixing matrix
  1  1    -7.12174356E-01   # V_{11}
  1  2     7.02002585E-01   # V_{12}
  2  1    -7.02002585E-01   # V_{21}
  2  2    -7.12174356E-01   # V_{22}
Block GAUGE Q=  0.00000000E+00   #
     1     0.00000000E+00   # g`
     2     0.00000000E+00   # g_2
     3     0.00000000E+00   # g_3
Block YU Q=  0.00000000E+00   #
  3  3     0.00000000E+00   # y_t
Block YD Q=  0.00000000E+00   #
  3  3     0.00000000E+00   # y_b
Block YE Q=  0.00000000E+00   #
  3  3     0.00000000E+00   # y_tau
Block HMIX Q=  0.00000000E+00   # Higgs mixing parameters
     1     0.00000000E+00   # mu(Q)
     2     0.00000000E+00   # tan(beta)(M_GUT)
     3     0.00000000E+00   # Higgs vev at Q
     4     6.25000000E+06   # m_A^2(Q)
Block MSOFT Q=  0.00000000E+00   # DRbar SUSY breaking parameters
     1     0.00000000E+00   # M_1(Q)          
     2     0.00000000E+00   # M_2(Q)          
     3     0.00000000E+00   # M_3(Q)          
    31     0.00000000E+00   # MeL(Q)          
    32     0.00000000E+00   # MmuL(Q)         
    33     0.00000000E+00   # MtauL(Q)        
    34     0.00000000E+00   # MeR(Q)          
    35     0.00000000E+00   # MmuR(Q)         
    36     0.00000000E+00   # MtauR(Q)        
    41     0.00000000E+00   # MqL1(Q)         
    42     0.00000000E+00   # MqL2(Q)         
    43     0.00000000E+00   # MqL3(Q)         
    44     0.00000000E+00   # MuR(Q)          
    45     0.00000000E+00   # McR(Q)          
    46     0.00000000E+00   # MtR(Q)          
    47     0.00000000E+00   # MdR(Q)          
    48     0.00000000E+00   # MsR(Q)          
    49     0.00000000E+00   # MbR(Q)          
Block AU Q=  0.00000000E+00   #
  1  1     0.00000000E+00   # A_u
  2  2     0.00000000E+00   # A_c
  3  3     0.00000000E+00   # A_t
Block AD Q=  0.00000000E+00   #
  1  1     0.00000000E+00   # A_d
  2  2     0.00000000E+00   # A_s
  3  3     0.00000000E+00   # A_b
Block AE Q=  0.00000000E+00   #
  1  1     0.00000000E+00   # A_e
  2  2     0.00000000E+00   # A_mu
  3  3     0.00000000E+00   # A_tau
#         PDG         Width
DECAY   1000021  9.19606495E+00   # GLSS  decays
#          BR          NDA       ID1       ID2       ID3       ID4
      1.43210912E-06    2      1000022        21                       # GLSS   -->  Z1SS   GL                 
      5.31058409E-04    3      1000022         6        -6             # GLSS   -->  Z1SS   TP     TB          
      5.15409596E-02    2     -1000002         2                       # GLSS   -->  UBL    UP                 
      5.15409596E-02    2      1000002        -2                       # GLSS   -->  UPL    UB                 
      4.85309064E-02    2     -1000001         1                       # GLSS   -->  DBL    DN                 
      4.85309064E-02    2      1000001        -1                       # GLSS   -->  DNL    DB                 
      5.07852025E-02    2     -2000002         2                       # GLSS   -->  UBR    UP                 
      5.07852025E-02    2      2000002        -2                       # GLSS   -->  UPR    UB                 
      4.98732254E-02    2     -2000001         1                       # GLSS   -->  DBR    DN                 
      4.98732254E-02    2      2000001        -1                       # GLSS   -->  DNR    DB                 
      4.85308021E-02    2     -1000003         3                       # GLSS   -->  SBL    ST                 
      4.85308021E-02    2      1000003        -3                       # GLSS   -->  STL    SB                 
      4.98730354E-02    2     -2000003         3                       # GLSS   -->  SBR    ST                 
      4.98730354E-02    2      2000003        -3                       # GLSS   -->  STR    SB                 
      5.15358821E-02    2     -1000004         4                       # GLSS   -->  CBL    CH                 
      5.15358821E-02    2      1000004        -4                       # GLSS   -->  CHL    CB                 
      5.07801287E-02    2     -2000004         4                       # GLSS   -->  CBR    CH                 
      5.07801287E-02    2      2000004        -4                       # GLSS   -->  CHR    CB                 
      4.98261303E-02    2     -1000005         5                       # GLSS   -->  BB1    BT                 
      4.98261303E-02    2      1000005        -5                       # GLSS   -->  BT1    BB                 
      4.84574400E-02    2     -2000005         5                       # GLSS   -->  BB2    BT                 
      4.84574400E-02    2      2000005        -5                       # GLSS   -->  BT2    BB                 
      2.02490327E-08    2      1000039        21                       # GLSS   -->  GVSS   GL                 
#         PDG         Width
DECAY   1000002  1.11483842E-01   # UPL   decays
#          BR          NDA       ID1       ID2       ID3       ID4
      1.00000000E+00    2      1000022         2                       # UPL    -->  Z1SS   UP                 
#         PDG         Width
DECAY   1000001  1.12819582E-01   # DNL   decays
#          BR          NDA       ID1       ID2       ID3       ID4
      1.00000000E+00    2      1000022         1                       # DNL    -->  Z1SS   DN                 
#         PDG         Width
DECAY   1000003  1.12819582E-01   # STL   decays
#          BR          NDA       ID1       ID2       ID3       ID4
      1.00000000E+00    2      1000022         3                       # STL    -->  Z1SS   ST                 
#         PDG         Width
DECAY   1000004  1.11483358E-01   # CHL   decays
#          BR          NDA       ID1       ID2       ID3       ID4
      1.00000000E+00    2      1000022         4                       # CHL    -->  Z1SS   CH                 
#         PDG         Width
DECAY   1000005  4.48661715E-01   # BT1   decays
#          BR          NDA       ID1       ID2       ID3       ID4
      1.00000000E+00    2      1000022         5                       # BT1    -->  Z1SS   BT                 
#         PDG         Width
DECAY   1000006  8.83452952E-01   # TP1   decays
#          BR          NDA       ID1       ID2       ID3       ID4
      2.73569185E-07    2      1000022         4                       # TP1    -->  Z1SS   CH                 
      9.99999702E-01    2      1000022         6                       # TP1    -->  Z1SS   TP                 
#         PDG         Width
DECAY   2000002  1.79258001E+00   # UPR   decays
#          BR          NDA       ID1       ID2       ID3       ID4
      1.00000000E+00    2      1000022         2                       # UPR    -->  Z1SS   UP                 
#         PDG         Width
DECAY   2000001  4.48693961E-01   # DNR   decays
#          BR          NDA       ID1       ID2       ID3       ID4
      1.00000000E+00    2      1000022         1                       # DNR    -->  Z1SS   DN                 
#         PDG         Width
DECAY   2000003  4.48694021E-01   # STR   decays
#          BR          NDA       ID1       ID2       ID3       ID4
      1.00000000E+00    2      1000022         3                       # STR    -->  Z1SS   ST                 
#         PDG         Width
DECAY   2000004  1.79257214E+00   # CHR   decays
#          BR          NDA       ID1       ID2       ID3       ID4
      1.00000000E+00    2      1000022         4                       # CHR    -->  Z1SS   CH                 
#         PDG         Width
DECAY   2000005  1.12823427E-01   # BT2   decays
#          BR          NDA       ID1       ID2       ID3       ID4
      1.00000000E+00    2      1000022         5                       # BT2    -->  Z1SS   BT                 
#         PDG         Width
DECAY   2000006  8.79276097E-01   # TP2   decays
#          BR          NDA       ID1       ID2       ID3       ID4
      2.74868768E-07    2      1000022         4                       # TP2    -->  Z1SS   CH                 
      9.99999702E-01    2      1000022         6                       # TP2    -->  Z1SS   TP                 
#         PDG         Width
DECAY   1000011  3.22240710E+00   # EL-   decays
#          BR          NDA       ID1       ID2       ID3       ID4
      9.84262943E-01    2      1000022        11                       # EL-    -->  Z1SS   E-                 
      5.34682302E-03    2      1000023        11                       # EL-    -->  Z2SS   E-                 
      1.03807310E-02    2     -1000024        12                       # EL-    -->  W1SS-  NUE                
      9.56363601E-06    2           11   1000039                       # EL-    -->  E-     GVSS               
#         PDG         Width
DECAY   1000013  3.22240710E+00   # MUL-  decays
#          BR          NDA       ID1       ID2       ID3       ID4
      9.84262943E-01    2      1000022        13                       # MUL-   -->  Z1SS   MU-                
      5.34681790E-03    2      1000023        13                       # MUL-   -->  Z2SS   MU-                
      1.03807310E-02    2     -1000024        14                       # MUL-   -->  W1SS-  NUM                
      9.56363601E-06    2           13   1000039                       # MUL-   -->  MU-    GVSS               
#         PDG         Width
DECAY   1000015  1.27032700E+01   # TAU1- decays
#          BR          NDA       ID1       ID2       ID3       ID4
      9.99987543E-01    2      1000022        15                       # TAU1-  -->  Z1SS   TAU-               
      3.65754045E-06    2      1000023        15                       # TAU1-  -->  Z2SS   TAU-               
      6.37783251E-06    2     -1000024        16                       # TAU1-  -->  W1SS-  NUT                
      2.42568422E-06    2           15   1000039                       # TAU1-  -->  TAU-   GVSS               
#         PDG         Width
DECAY   1000012  3.22839093E+00   # NUEL  decays
#          BR          NDA       ID1       ID2       ID3       ID4
      9.84613180E-01    2      1000022        12                       # NUEL   -->  Z1SS   NUE                
      5.00530750E-03    2      1000023        12                       # NUEL   -->  Z2SS   NUE                
      1.03720119E-02    2      1000024        11                       # NUEL   -->  W1SS+  E-                 
      9.52642404E-06    2           12   1000039                       # NUEL   -->  NUE    GVSS               
#         PDG         Width
DECAY   1000014  3.22839093E+00   # NUML  decays
#          BR          NDA       ID1       ID2       ID3       ID4
      9.84613180E-01    2      1000022        14                       # NUML   -->  Z1SS   NUM                
      5.00530750E-03    2      1000023        14                       # NUML   -->  Z2SS   NUM                
      1.03720017E-02    2      1000024        13                       # NUML   -->  W1SS+  MU-                
      9.52642404E-06    2           14   1000039                       # NUML   -->  NUM    GVSS               
#         PDG         Width
DECAY   1000016  3.22837877E+00   # NUTL  decays
#          BR          NDA       ID1       ID2       ID3       ID4
      9.84616876E-01    2      1000022        16                       # NUTL   -->  Z1SS   NUT                
      5.00532612E-03    2      1000023        16                       # NUTL   -->  Z2SS   NUT                
      1.03683183E-02    2      1000024        15                       # NUTL   -->  W1SS+  TAU-               
      9.52646042E-06    2           16   1000039                       # NUTL   -->  NUT    GVSS               
#         PDG         Width
DECAY   2000011  1.27032137E+01   # ER-   decays
#          BR          NDA       ID1       ID2       ID3       ID4
      9.99997139E-01    2      1000022        11                       # ER-    -->  Z1SS   E-                 
      4.38489423E-07    2      1000023        11                       # ER-    -->  Z2SS   E-                 
      2.82060361E-40    3      1000015        12       -16             # ER-    -->  TAU1-  NUE    ANUT        
      2.42576220E-06    2           11   1000039                       # ER-    -->  E-     GVSS               
#         PDG         Width
DECAY   2000013  1.27032137E+01   # MUR-  decays
#          BR          NDA       ID1       ID2       ID3       ID4
      9.99997139E-01    2      1000022        13                       # MUR-   -->  Z1SS   MU-                
      4.38488968E-07    2      1000023        13                       # MUR-   -->  Z2SS   MU-                
      1.20845268E-35    3      1000015        14       -16             # MUR-   -->  TAU1-  NUM    ANUT        
      2.42576220E-06    2           13   1000039                       # MUR-   -->  MU-    GVSS               
#         PDG         Width
DECAY   2000015  3.22241831E+00   # TAU2- decays
#          BR          NDA       ID1       ID2       ID3       ID4
      9.84268427E-01    2      1000022        15                       # TAU2-  -->  Z1SS   TAU-               
      5.34702651E-03    2      1000023        15                       # TAU2-  -->  Z2SS   TAU-               
      1.03845913E-02    2     -1000024        16                       # TAU2-  -->  W1SS-  NUT                
#         PDG         Width
DECAY   1000022  7.34044918E-14   # Z1SS  decays
#          BR          NDA       ID1       ID2       ID3       ID4
      9.81320918E-01    2      1000039        22                       # Z1SS   -->  GVSS   GM                 
      1.86790824E-02    3      1000039        11       -11             # Z1SS   -->  GVSS   E-     E+          
#         PDG         Width
DECAY   1000023  1.22316467E+02   # Z2SS  decays
#          BR          NDA       ID1       ID2       ID3       ID4
      9.56772794E-08    2      1000022        22                       # Z2SS   -->  Z1SS   GM                 
      1.19215541E-03    2      1000022        23                       # Z2SS   -->  Z1SS   Z0                 
      8.16229360E-08    3      1000022         5        -5             # Z2SS   -->  Z1SS   BT     BB          
      5.34469291E-06    3      1000022        11       -11             # Z2SS   -->  Z1SS   E-     E+          
      5.34469291E-06    3      1000022        13       -13             # Z2SS   -->  Z1SS   MU-    MU+         
      5.44381828E-06    3      1000022        15       -15             # Z2SS   -->  Z1SS   TAU-   TAU+        
      5.18610295E-06    3      1000022        12       -12             # Z2SS   -->  Z1SS   NUE    ANUE        
      5.18610295E-06    3      1000022        14       -14             # Z2SS   -->  Z1SS   NUM    ANUM        
      5.18610295E-06    3      1000022        16       -16             # Z2SS   -->  Z1SS   NUT    ANUT        
      5.41968318E-03    2      1000022        25                       # Z2SS   -->  Z1SS   HL0                
      5.02899922E-02    2      1000002        -2                       # Z2SS   -->  UPL    UB                 
      5.02899922E-02    2     -1000002         2                       # Z2SS   -->  UBL    UP                 
      4.95885350E-02    2      1000001        -1                       # Z2SS   -->  DNL    DB                 
      4.95885350E-02    2     -1000001         1                       # Z2SS   -->  DBL    DN                 
      4.95885350E-02    2      1000003        -3                       # Z2SS   -->  STL    SB                 
      4.95885350E-02    2     -1000003         3                       # Z2SS   -->  SBL    ST                 
      5.02899550E-02    2      1000004        -4                       # Z2SS   -->  CHL    CB                 
      5.02899550E-02    2     -1000004         4                       # Z2SS   -->  CBL    CH                 
      7.31937371E-06    2      2000002        -2                       # Z2SS   -->  UPR    UB                 
      7.31937371E-06    2     -2000002         2                       # Z2SS   -->  UBR    UP                 
      1.82877011E-06    2      2000001        -1                       # Z2SS   -->  DNR    DB                 
      1.82877011E-06    2     -2000001         1                       # Z2SS   -->  DBR    DN                 
      1.82876954E-06    2      2000003        -3                       # Z2SS   -->  STR    SB                 
      1.82876954E-06    2     -2000003         3                       # Z2SS   -->  SBR    ST                 
      7.31936734E-06    2      2000004        -4                       # Z2SS   -->  CHR    CB                 
      7.31936734E-06    2     -2000004         4                       # Z2SS   -->  CBR    CH                 
      3.11387063E-04    2      1000005        -5                       # Z2SS   -->  BT1    BB                 
      3.11387063E-04    2     -1000005         5                       # Z2SS   -->  BB1    BT                 
      4.99336310E-02    2      2000005        -5                       # Z2SS   -->  BT2    BB                 
      4.99336310E-02    2     -2000005         5                       # Z2SS   -->  BB2    BT                 
      2.03884467E-01    2      1000006        -6                       # Z2SS   -->  TP1    TB                 
      2.03884467E-01    2     -1000006         6                       # Z2SS   -->  TB1    TP                 
      4.27732170E-02    2      2000006        -6                       # Z2SS   -->  TP2    TB                 
      4.27732170E-02    2     -2000006         6                       # Z2SS   -->  TB2    TP                 
      2.68730176E-08    2      1000039        22                       # Z2SS   -->  GVSS   GM                 
      6.84947488E-10    3      1000039        11       -11             # Z2SS   -->  GVSS   E-     E+          
      1.24738520E-07    2      1000039        23                       # Z2SS   -->  GVSS   Z0                 
      1.04068070E-08    2      1000039        25                       # Z2SS   -->  GVSS   HL0                
#         PDG         Width
DECAY   1000025  9.34086990E+01   # Z3SS  decays
#          BR          NDA       ID1       ID2       ID3       ID4
      1.57724926E-08    2      1000022        22                       # Z3SS   -->  Z1SS   GM                 
      5.65371291E-11    2      1000023        22                       # Z3SS   -->  Z2SS   GM                 
      9.10078506E-06    3     -1000024         2        -1             # Z3SS   -->  W1SS-  UP     DB          
      3.03359525E-06    3     -1000024        12       -11             # Z3SS   -->  W1SS-  NUE    E+          
      3.03359525E-06    3     -1000024        14       -13             # Z3SS   -->  W1SS-  NUM    MU+         
      9.10078506E-06    3      1000024         1        -2             # Z3SS   -->  W1SS+  DN     UB          
      3.03359525E-06    3      1000024        11       -12             # Z3SS   -->  W1SS+  E-     ANUE        
      3.03359525E-06    3      1000024        13       -14             # Z3SS   -->  W1SS+  MU-    ANUM        
      9.10078506E-06    3     -1000024         4        -3             # Z3SS   -->  W1SS-  CH     SB          
      3.03359525E-06    3     -1000024        16       -15             # Z3SS   -->  W1SS-  NUT    TAU+        
      9.10078506E-06    3      1000024         3        -4             # Z3SS   -->  W1SS+  ST     CB          
      3.03359525E-06    3      1000024        15       -16             # Z3SS   -->  W1SS+  TAU-   ANUT        
      1.43538136E-02    2      1000022        23                       # Z3SS   -->  Z1SS   Z0                 
      2.79963302E-07    3      1000022         5        -5             # Z3SS   -->  Z1SS   BT     BB          
      3.57823886E-08    3      1000022        15       -15             # Z3SS   -->  Z1SS   TAU-   TAU+        
      2.03093964E-06    3      1000023         2        -2             # Z3SS   -->  Z2SS   UP     UB          
      2.61891023E-06    3      1000023         1        -1             # Z3SS   -->  Z2SS   DN     DB          
      2.61891023E-06    3      1000023         3        -3             # Z3SS   -->  Z2SS   ST     SB          
      2.03093964E-06    3      1000023         4        -4             # Z3SS   -->  Z2SS   CH     CB          
      2.53100939E-06    3      1000023         5        -5             # Z3SS   -->  Z2SS   BT     BB          
      5.94098424E-07    3      1000023        11       -11             # Z3SS   -->  Z2SS   E-     E+          
      5.94098424E-07    3      1000023        13       -13             # Z3SS   -->  Z2SS   MU-    MU+         
      5.90209936E-07    3      1000023        15       -15             # Z3SS   -->  Z2SS   TAU-   TAU+        
      1.18206901E-06    3      1000023        12       -12             # Z3SS   -->  Z2SS   NUE    ANUE        
      1.18206901E-06    3      1000023        14       -14             # Z3SS   -->  Z2SS   NUM    ANUM        
      1.18206901E-06    3      1000023        16       -16             # Z3SS   -->  Z2SS   NUT    ANUT        
      3.25125619E-03    2      1000022        25                       # Z3SS   -->  Z1SS   HL0                
      4.54428300E-06    2      1000002        -2                       # Z3SS   -->  UPL    UB                 
      4.54428300E-06    2     -1000002         2                       # Z3SS   -->  UBL    UP                 
      1.00971838E-05    2      1000001        -1                       # Z3SS   -->  DNL    DB                 
      1.00971838E-05    2     -1000001         1                       # Z3SS   -->  DBL    DN                 
      1.00971838E-05    2      1000003        -3                       # Z3SS   -->  STL    SB                 
      1.00971838E-05    2     -1000003         3                       # Z3SS   -->  SBL    ST                 
      4.54427936E-06    2      1000004        -4                       # Z3SS   -->  CHL    CB                 
      4.54427936E-06    2     -1000004         4                       # Z3SS   -->  CBL    CH                 
      4.39766382E-06    2      2000002        -2                       # Z3SS   -->  UPR    UB                 
      4.39766382E-06    2     -2000002         2                       # Z3SS   -->  UBR    UP                 
      1.09881159E-06    2      2000001        -1                       # Z3SS   -->  DNR    DB                 
      1.09881159E-06    2     -2000001         1                       # Z3SS   -->  DBR    DN                 
      1.09881159E-06    2      2000003        -3                       # Z3SS   -->  STR    SB                 
      1.09881159E-06    2     -2000003         3                       # Z3SS   -->  SBR    ST                 
      4.39766018E-06    2      2000004        -4                       # Z3SS   -->  CHR    CB                 
      4.39766018E-06    2     -2000004         4                       # Z3SS   -->  CBR    CH                 
      8.38181179E-04    2      1000005        -5                       # Z3SS   -->  BT1    BB                 
      8.38181179E-04    2     -1000005         5                       # Z3SS   -->  BB1    BT                 
      8.47029791E-04    2      2000005        -5                       # Z3SS   -->  BT2    BB                 
      8.47029791E-04    2     -2000005         5                       # Z3SS   -->  BB2    BT                 
      2.09287778E-01    2      1000006        -6                       # Z3SS   -->  TP1    TB                 
      2.09287778E-01    2     -1000006         6                       # Z3SS   -->  TB1    TP                 
      2.80148089E-01    2      2000006        -6                       # Z3SS   -->  TP2    TB                 
      2.80148089E-01    2     -2000006         6                       # Z3SS   -->  TB2    TP                 
      9.51587412E-16    2      1000011       -11                       # Z3SS   -->  EL-    E+                 
      9.51587412E-16    2     -1000011        11                       # Z3SS   -->  EL+    E-                 
      2.79264052E-14    2      2000011       -11                       # Z3SS   -->  ER-    E+                 
      2.79264052E-14    2     -2000011        11                       # Z3SS   -->  ER+    E-                 
      5.48402946E-12    2      1000012       -12                       # Z3SS   -->  NUEL   ANUE               
      5.48402946E-12    2     -1000012        12                       # Z3SS   -->  ANUEL  NUE                
      5.48402946E-12    2      1000014       -14                       # Z3SS   -->  NUML   ANUM               
      5.48402946E-12    2     -1000014        14                       # Z3SS   -->  ANUML  NUM                
      5.48402946E-12    2      1000016       -16                       # Z3SS   -->  NUTL   ANUT               
      5.48402946E-12    2     -1000016        16                       # Z3SS   -->  ANUTL  NUT                
      3.65663446E-12    2      1000039        22                       # Z3SS   -->  GVSS   GM                 
      9.33782470E-14    3      1000039        11       -11             # Z3SS   -->  GVSS   E-     E+          
      3.28721619E-08    2      1000039        23                       # Z3SS   -->  GVSS   Z0                 
      1.30881162E-07    2      1000039        25                       # Z3SS   -->  GVSS   HL0                
      1.55367036E-21    2      1000039        36                       # Z3SS   -->  GVSS   HA0                
#         PDG         Width
DECAY   1000035  1.25451538E+02   # Z4SS  decays
#          BR          NDA       ID1       ID2       ID3       ID4
      5.20090460E-09    2      1000022        22                       # Z4SS   -->  Z1SS   GM                 
      3.28974042E-10    2      1000023        22                       # Z4SS   -->  Z2SS   GM                 
      1.10697418E-09    2      1000025        22                       # Z4SS   -->  Z3SS   GM                 
      8.07544868E-03    2      1000024       -24                       # Z4SS   -->  W1SS+  W-                 
      8.07544868E-03    2     -1000024        24                       # Z4SS   -->  W1SS-  W+                 
      1.30817364E-03    2      1000022        23                       # Z4SS   -->  Z1SS   Z0                 
      2.76083462E-10    2      1000023        23                       # Z4SS   -->  Z2SS   Z0                 
      1.88610163E-16    3      1000023         5        -5             # Z4SS   -->  Z2SS   BT     BB          
      2.43611109E-17    3      1000023        15       -15             # Z4SS   -->  Z2SS   TAU-   TAU+        
      1.53152155E-06    3      1000025         2        -2             # Z4SS   -->  Z3SS   UP     UB          
      1.97490726E-06    3      1000025         1        -1             # Z4SS   -->  Z3SS   DN     DB          
      1.97490726E-06    3      1000025         3        -3             # Z4SS   -->  Z3SS   ST     SB          
      1.53152155E-06    3      1000025         4        -4             # Z4SS   -->  Z3SS   CH     CB          
      1.90967830E-06    3      1000025         5        -5             # Z4SS   -->  Z3SS   BT     BB          
      4.48006688E-07    3      1000025        11       -11             # Z4SS   -->  Z3SS   E-     E+          
      4.48006688E-07    3      1000025        13       -13             # Z4SS   -->  Z3SS   MU-    MU+         
      4.45325639E-07    3      1000025        15       -15             # Z4SS   -->  Z3SS   TAU-   TAU+        
      8.91392290E-07    3      1000025        12       -12             # Z4SS   -->  Z3SS   NUE    ANUE        
      8.91392290E-07    3      1000025        14       -14             # Z4SS   -->  Z3SS   NUM    ANUM        
      8.91392290E-07    3      1000025        16       -16             # Z4SS   -->  Z3SS   NUT    ANUT        
      5.21210628E-03    2      1000022        25                       # Z4SS   -->  Z1SS   HL0                
      1.61500202E-06    2      1000022        35                       # Z4SS   -->  Z1SS   HH0                
      3.38347149E-06    2      1000022        36                       # Z4SS   -->  Z1SS   HA0                
      5.43269358E-08    2      1000023        25                       # Z4SS   -->  Z2SS   HL0                
      5.24118282E-02    2      1000002        -2                       # Z4SS   -->  UPL    UB                 
      5.24118282E-02    2     -1000002         2                       # Z4SS   -->  UBL    UP                 
      5.29305041E-02    2      1000001        -1                       # Z4SS   -->  DNL    DB                 
      5.29305041E-02    2     -1000001         1                       # Z4SS   -->  DBL    DN                 
      5.29305041E-02    2      1000003        -3                       # Z4SS   -->  STL    SB                 
      5.29305041E-02    2     -1000003         3                       # Z4SS   -->  SBL    ST                 
      5.24117835E-02    2      1000004        -4                       # Z4SS   -->  CHL    CB                 
      5.24117835E-02    2     -1000004         4                       # Z4SS   -->  CBL    CH                 
      7.03748856E-06    2      2000002        -2                       # Z4SS   -->  UPR    UB                 
      7.03748856E-06    2     -2000002         2                       # Z4SS   -->  UBR    UP                 
      1.75846390E-06    2      2000001        -1                       # Z4SS   -->  DNR    DB                 
      1.75846390E-06    2     -2000001         1                       # Z4SS   -->  DBR    DN                 
      1.75846390E-06    2      2000003        -3                       # Z4SS   -->  STR    SB                 
      1.75846390E-06    2     -2000003         3                       # Z4SS   -->  SBR    ST                 
      7.03748310E-06    2      2000004        -4                       # Z4SS   -->  CHR    CB                 
      7.03748310E-06    2     -2000004         4                       # Z4SS   -->  CBR    CH                 
      3.22401233E-04    2      1000005        -5                       # Z4SS   -->  BT1    BB                 
      3.22401233E-04    2     -1000005         5                       # Z4SS   -->  BB1    BT                 
      5.32150306E-02    2      2000005        -5                       # Z4SS   -->  BT2    BB                 
      5.32150306E-02    2     -2000005         5                       # Z4SS   -->  BB2    BT                 
      5.53472787E-02    2      1000006        -6                       # Z4SS   -->  TP1    TB                 
      5.53472787E-02    2     -1000006         6                       # Z4SS   -->  TB1    TP                 
      1.68669000E-01    2      2000006        -6                       # Z4SS   -->  TP2    TB                 
      1.68669000E-01    2     -2000006         6                       # Z4SS   -->  TB2    TP                 
      6.44595420E-05    2      1000011       -11                       # Z4SS   -->  EL-    E+                 
      6.44595420E-05    2     -1000011        11                       # Z4SS   -->  EL+    E-                 
      6.44594766E-05    2      1000013       -13                       # Z4SS   -->  MUL-   MU+                
      6.44594766E-05    2     -1000013        13                       # Z4SS   -->  MUL+   MU-                
      1.97360297E-08    2      2000011       -11                       # Z4SS   -->  ER-    E+                 
      1.97360297E-08    2     -2000011        11                       # Z4SS   -->  ER+    E-                 
      1.97360084E-08    2      2000013       -13                       # Z4SS   -->  MUR-   MU+                
      1.97360084E-08    2     -2000013        13                       # Z4SS   -->  MUR+   MU-                
      1.70420606E-07    2      1000015       -15                       # Z4SS   -->  TAU1-  TAU+               
      1.70420606E-07    2     -1000015        15                       # Z4SS   -->  TAU1+  TAU-               
      6.44118336E-05    2      2000015       -15                       # Z4SS   -->  TAU2-  TAU+               
      6.44118336E-05    2     -2000015        15                       # Z4SS   -->  TAU2+  TAU-               
      6.86126441E-05    2      1000012       -12                       # Z4SS   -->  NUEL   ANUE               
      6.86126441E-05    2     -1000012        12                       # Z4SS   -->  ANUEL  NUE                
      6.86126441E-05    2      1000014       -14                       # Z4SS   -->  NUML   ANUM               
      6.86126441E-05    2     -1000014        14                       # Z4SS   -->  ANUML  NUM                
      6.86126441E-05    2      1000016       -16                       # Z4SS   -->  NUTL   ANUT               
      6.86126441E-05    2     -1000016        16                       # Z4SS   -->  ANUTL  NUT                
      3.09022781E-08    2      1000039        22                       # Z4SS   -->  GVSS   GM                 
      7.90594645E-10    3      1000039        11       -11             # Z4SS   -->  GVSS   E-     E+          
      1.66644995E-07    2      1000039        23                       # Z4SS   -->  GVSS   Z0                 
      1.44242636E-08    2      1000039        25                       # Z4SS   -->  GVSS   HL0                
      1.76191215E-13    2      1000039        35                       # Z4SS   -->  GVSS   HH0                
      1.30610895E-13    2      1000039        36                       # Z4SS   -->  GVSS   HA0                
#         PDG         Width
DECAY   1000024  1.22455734E+02   # W1SS+ decays
#          BR          NDA       ID1       ID2       ID3       ID4
      1.04739956E-05    3      1000022       -11        12             # W1SS+  -->  Z1SS   E+     NUE         
      1.04739956E-05    3      1000022       -13        14             # W1SS+  -->  Z1SS   MU+    NUM         
      1.05729951E-05    3      1000022       -15        16             # W1SS+  -->  Z1SS   TAU+   NUT         
      6.61377935E-03    2      1000022        24                       # W1SS+  -->  Z1SS   W+                 
      1.01023570E-01    2      1000002        -1                       # W1SS+  -->  UPL    DB                 
      9.79678184E-02    2     -1000001         2                       # W1SS+  -->  DBL    UP                 
      1.01023510E-01    2      1000004        -3                       # W1SS+  -->  CHL    SB                 
      9.81582850E-02    2     -1000003         4                       # W1SS+  -->  SBL    CH                 
      2.70410120E-01    2      1000006        -5                       # W1SS+  -->  TP1    BB                 
      7.10754469E-03    2      2000006        -5                       # W1SS+  -->  TP2    BB                 
      6.19589700E-04    2     -1000005         6                       # W1SS+  -->  BB1    TP                 
      3.17044258E-01    2     -2000005         6                       # W1SS+  -->  BB2    TP                 
#         PDG         Width
DECAY   1000037  1.25532333E+02   # W2SS+ decays
#          BR          NDA       ID1       ID2       ID3       ID4
      6.48608711E-03    2      1000022        24                       # W2SS+  -->  Z1SS   W+                 
      2.28094450E-06    2      1000022        37                       # W2SS+  -->  Z1SS   H+                 
      5.86199451E-14    3      1000023       -15        16             # W2SS+  -->  Z2SS   TAU+   NUT         
      8.10672063E-03    2      1000023        24                       # W2SS+  -->  Z2SS   W+                 
      6.57616647E-06    3      1000025         2        -1             # W2SS+  -->  Z3SS   UP     DB          
      6.57616647E-06    3      1000025         4        -3             # W2SS+  -->  Z3SS   CH     SB          
      2.19205549E-06    3      1000025       -11        12             # W2SS+  -->  Z3SS   E+     NUE         
      2.19205549E-06    3      1000025       -13        14             # W2SS+  -->  Z3SS   MU+    NUM         
      2.19205549E-06    3      1000025       -15        16             # W2SS+  -->  Z3SS   TAU+   NUT         
      1.04117684E-01    2      1000002        -1                       # W2SS+  -->  UPL    DB                 
      1.06973886E-01    2     -1000001         2                       # W2SS+  -->  DBL    UP                 
      1.04117639E-01    2      1000004        -3                       # W2SS+  -->  CHL    SB                 
      1.07156791E-01    2     -1000003         4                       # W2SS+  -->  SBL    CH                 
      5.76398429E-03    2      1000006        -5                       # W2SS+  -->  TP1    BB                 
      2.91047871E-01    2      2000006        -5                       # W2SS+  -->  TP2    BB                 
      6.38873375E-04    2     -1000005         6                       # W2SS+  -->  BB1    TP                 
      2.58120656E-01    2     -2000005         6                       # W2SS+  -->  BB2    TP                 
      1.32565969E-04    2      1000012       -11                       # W2SS+  -->  NUEL   E+                 
      1.32565823E-04    2      1000014       -13                       # W2SS+  -->  NUML   MU+                
      1.32521673E-04    2      1000016       -15                       # W2SS+  -->  NUTL   TAU+               
      1.32689704E-04    2     -1000011        12                       # W2SS+  -->  EL+    NUE                
      1.32689704E-04    2     -1000013        14                       # W2SS+  -->  MUL+   NUM                
      3.04483819E-07    2     -1000015        16                       # W2SS+  -->  TAU1+  NUT                
      1.32639048E-04    2     -2000015        16                       # W2SS+  -->  TAU2+  NUT                
      6.65142760E-03    2      1000024        23                       # W2SS+  -->  W1SS+  Z0                 
      4.82126552E-07    2      1000024        25                       # W2SS+  -->  W1SS+  HL0                
#         PDG         Width
DECAY        25  4.48208116E-03   # HL0   decays
#          BR          NDA       ID1       ID2       ID3       ID4
      4.58366545E-09    2           11       -11                       # HL0    -->  E-     E+                 
      1.93529733E-04    2           13       -13                       # HL0    -->  MU-    MU+                
      5.53575791E-02    2           15       -15                       # HL0    -->  TAU-   TAU+               
      5.74910246E-06    2            1        -1                       # HL0    -->  DN     DB                 
      2.32292572E-03    2            3        -3                       # HL0    -->  ST     SB                 
      7.56656289E-01    2            5        -5                       # HL0    -->  BT     BB                 
      1.82950816E-06    2            2        -2                       # HL0    -->  UP     UB                 
      3.42036039E-02    2            4        -4                       # HL0    -->  CH     CB                 
      1.99483428E-03    2           22        22                       # HL0    -->  GM     GM                 
      4.08889689E-02    2           21        21                       # HL0    -->  GL     GL                 
      5.41953603E-03    3           24        11       -12             # HL0    -->  W+     E-     ANUE        
      5.41953603E-03    3           24        13       -14             # HL0    -->  W+     MU-    ANUM        
      5.41953603E-03    3           24        15       -16             # HL0    -->  W+     TAU-   ANUT        
      1.62586085E-02    3           24        -2         1             # HL0    -->  W+     UB     DN          
      1.62586085E-02    3           24        -4         3             # HL0    -->  W+     CB     ST          
      5.41953603E-03    3          -24       -11        12             # HL0    -->  W-     E+     NUE         
      5.41953603E-03    3          -24       -13        14             # HL0    -->  W-     MU+    NUM         
      5.41953603E-03    3          -24       -15        16             # HL0    -->  W-     TAU+   NUT         
      1.62586085E-02    3          -24         2        -1             # HL0    -->  W-     UP     DB          
      1.62586085E-02    3          -24         4        -3             # HL0    -->  W-     CH     SB          
      6.37114514E-04    3           23        12       -12             # HL0    -->  Z0     NUE    ANUE        
      6.37114514E-04    3           23        14       -14             # HL0    -->  Z0     NUM    ANUM        
      6.37114514E-04    3           23        16       -16             # HL0    -->  Z0     NUT    ANUT        
      3.20653315E-04    3           23        11       -11             # HL0    -->  Z0     E-     E+          
      3.20653315E-04    3           23        13       -13             # HL0    -->  Z0     MU-    MU+         
      3.20653315E-04    3           23        15       -15             # HL0    -->  Z0     TAU-   TAU+        
      1.09853107E-03    3           23         2        -2             # HL0    -->  Z0     UP     UB          
      1.09853107E-03    3           23         4        -4             # HL0    -->  Z0     CH     CB          
      1.41517876E-03    3           23         1        -1             # HL0    -->  Z0     DN     DB          
      1.41517876E-03    3           23         3        -3             # HL0    -->  Z0     ST     SB          
      1.41517876E-03    3           23         5        -5             # HL0    -->  Z0     BT     BB          
      1.50759763E-03    2      1000022   1000022                       # HL0    -->  Z1SS   Z1SS               
#         PDG         Width
DECAY        35  1.14940392E+02   # HH0   decays
#          BR          NDA       ID1       ID2       ID3       ID4
      3.34836499E-11    2           11       -11                       # HH0    -->  E-     E+                 
      1.41374005E-06    2           13       -13                       # HH0    -->  MU-    MU+                
      4.04915598E-04    2           15       -15                       # HH0    -->  TAU-   TAU+               
      4.07328535E-08    2            1        -1                       # HH0    -->  DN     DB                 
      1.64581343E-05    2            3        -3                       # HH0    -->  ST     SB                 
      3.66025022E-03    2            5        -5                       # HH0    -->  BT     BB                 
      1.61784530E-10    2            2        -2                       # HH0    -->  UP     UB                 
      2.05470110E-06    2            4        -4                       # HH0    -->  CH     CB                 
      1.06110036E-01    2            6        -6                       # HH0    -->  TP     TB                 
      2.54036223E-07    2           22        22                       # HH0    -->  GM     GM                 
      3.46424349E-05    2           21        21                       # HH0    -->  GL     GL                 
      3.01905893E-05    2           24       -24                       # HH0    -->  W+     W-                 
      1.54694299E-05    2           23        23                       # HH0    -->  Z0     Z0                 
      1.11359759E-05    2      1000022   1000022                       # HH0    -->  Z1SS   Z1SS               
      5.76201819E-06    2      1000022   1000023                       # HH0    -->  Z1SS   Z2SS               
      2.29818672E-02    2           25        25                       # HH0    -->  HL0    HL0                
      3.18311941E-05    2      1000002  -1000002                       # HH0    -->  UPL    UBL                
      6.38085021E-06    2      2000002  -2000002                       # HH0    -->  UPR    UBR                
      3.18089806E-05    2      1000004  -1000004                       # HH0    -->  CHL    CBL                
      6.37091307E-06    2      2000004  -2000004                       # HH0    -->  CHR    CBR                
      4.75551969E-05    2      1000001  -1000001                       # HH0    -->  DNL    DBL                
      1.59390834E-06    2      2000001  -2000001                       # HH0    -->  DNR    DBR                
      4.75604757E-05    2      1000003  -1000003                       # HH0    -->  STL    SBL                
      1.59294291E-06    2      2000003  -2000003                       # HH0    -->  STR    SBR                
      1.40575980E-06    2      1000005  -1000005                       # HH0    -->  BT1    BB1                
      4.86231947E-05    2      2000005  -2000005                       # HH0    -->  BT2    BB2                
      1.29358880E-02    2      1000005  -2000005                       # HH0    -->  BT1    BB2                
      1.29358880E-02    2      2000005  -1000005                       # HH0    -->  BT2    BB1                
      4.43942726E-01    2      1000006  -1000006                       # HH0    -->  TP1    TB1                
      3.95463228E-01    2      2000006  -2000006                       # HH0    -->  TP2    TB2                
      6.11518684E-04    2      1000006  -2000006                       # HH0    -->  TP1    TB2                
      6.11518684E-04    2      2000006  -1000006                       # HH0    -->  TP2    TB1                
#         PDG         Width
DECAY        36  1.12434097E+02   # HA0   decays
#          BR          NDA       ID1       ID2       ID3       ID4
      3.40077341E-11    2           11       -11                       # HA0    -->  E-     E+                 
      1.43586794E-06    2           13       -13                       # HA0    -->  MU-    MU+                
      4.11254179E-04    2           15       -15                       # HA0    -->  TAU-   TAU+               
      4.13724450E-08    2            1        -1                       # HA0    -->  DN     DB                 
      1.67165599E-05    2            3        -3                       # HA0    -->  ST     SB                 
      3.72058013E-03    2            5        -5                       # HA0    -->  BT     BB                 
      1.63430089E-10    2            2        -2                       # HA0    -->  UP     UB                 
      2.07718199E-06    2            4        -4                       # HA0    -->  CH     CB                 
      1.08820841E-01    2            6        -6                       # HA0    -->  TP     TB                 
      2.55620478E-07    2           22        22                       # HA0    -->  GM     GM                 
      3.34327233E-05    2           21        21                       # HA0    -->  GL     GL                 
      1.81358100E-05    2      1000022   1000022                       # HA0    -->  Z1SS   Z1SS               
      4.68509752E-05    2      1000022   1000023                       # HA0    -->  Z1SS   Z2SS               
      3.04671448E-05    2           25        23                       # HA0    -->  HL0    Z0                 
      5.23509847E-10    2      1000002  -2000002                       # HA0    -->  UPL    UBR                
      5.23509847E-10    2      2000002  -1000002                       # HA0    -->  UPR    UBL                
      3.04239747E-05    2      1000004  -2000004                       # HA0    -->  CHL    CBR                
      3.04239747E-05    2      2000004  -1000004                       # HA0    -->  CHR    CBL                
      1.63319014E-09    2      1000001  -2000001                       # HA0    -->  DNL    DBR                
      1.63319014E-09    2      2000001  -1000001                       # HA0    -->  DNR    DBL                
      6.59891441E-07    2      1000003  -2000003                       # HA0    -->  STL    SBR                
      6.59891441E-07    2      2000003  -1000003                       # HA0    -->  STR    SBL                
      1.32533722E-02    2      1000005  -2000005                       # HA0    -->  BT1    BB2                
      1.32533722E-02    2      2000005  -1000005                       # HA0    -->  BT2    BB1                
      4.30164486E-01    2      1000006  -2000006                       # HA0    -->  TP1    TB2                
      4.30164486E-01    2      2000006  -1000006                       # HA0    -->  TP2    TB1                
#         PDG         Width
DECAY        37  1.11764542E+02   # H+    decays
#          BR          NDA       ID1       ID2       ID3       ID4
      3.44349584E-11    2           12       -11                       # H+     -->  NUE    E+                 
      1.45390607E-06    2           14       -13                       # H+     -->  NUM    MU+                
      4.16420575E-04    2           16       -15                       # H+     -->  NUT    TAU+               
      3.89279577E-08    2            2        -1                       # H+     -->  UP     DB                 
      1.76123594E-05    2            4        -3                       # H+     -->  CH     SB                 
      1.04935147E-01    2            6        -5                       # H+     -->  TP     BB                 
      8.03226576E-05    2      1000024   1000022                       # H+     -->  W1SS+  Z1SS               
      3.08786548E-05    2           25        24                       # H+     -->  HL0    W+                 
      8.06824537E-05    2      1000002  -1000001                       # H+     -->  UPL    DBL                
      3.28375105E-09    2      2000002  -2000001                       # H+     -->  UPR    DBR                
      8.06522512E-05    2      1000004  -1000003                       # H+     -->  CHL    SBL                
      1.32680066E-06    2      2000004  -2000003                       # H+     -->  CHR    SBR                
      1.42412493E-02    2      1000006  -1000005                       # H+     -->  TP1    BB1                
      4.25321162E-01    2      1000006  -2000005                       # H+     -->  TP1    BB2                
      1.22632077E-02    2      2000006  -1000005                       # H+     -->  TP2    BB1                
      4.42529917E-01    2      2000006  -2000005                       # H+     -->  TP2    BB2                
