  65
  401   1101.4081    0.10584E-25
  402   1098.8481    0.10594E-25
  403   1101.4081    0.10584E-25
  404   1098.8490    0.10594E-25
  405   3000.0916    0.40673E-26
  406   3002.5991    0.28042E-26
  407   1101.4081    0.10584E-25
  408   1098.8481    0.10594E-25
  409   1101.4081    0.10584E-25
  410   1098.8490    0.10594E-25
  411   3000.0916    0.40673E-26
  412   3002.5991    0.28042E-26
  413   1100.2578    0.12907E-25
  414   1099.4843    0.12473E-25
  415   1100.2578    0.12907E-25
  416   1099.4851    0.12473E-25
  417   3000.5220    0.28388E-26
  418   3002.8484    0.28494E-26
  419   1100.2578    0.12907E-25
  420   1099.4843    0.12473E-25
  421   1100.2578    0.12907E-25
  422   1099.4851    0.12473E-25
  423   3000.5220    0.28388E-26
  424   3002.8484    0.28494E-26
  425    200.0027    0.49704E-23
  426    185.3874    0.52323E-23
  427    200.0027    0.49704E-23
  428    185.3874    0.52323E-23
  429   3000.2717    0.42728E-25
  430   2999.3887    0.16086E-25
  431    200.0027    0.49704E-23
  432    185.3874    0.52323E-23
  433    200.0027    0.49704E-23
  434    185.3874    0.52323E-23
  435   3000.2717    0.42728E-25
  436   2999.3887    0.16086E-25
  437    200.0010    0.11591E-23
  438      0.0000    0.10000E+31
  439    200.0010    0.11591E-23
  440      0.0000    0.10000E+31
  441   3000.3406    0.16097E-25
  442      0.0000    0.10000E+31
  443    200.0010    0.11591E-23
  444      0.0000    0.10000E+31
  445    200.0010    0.11591E-23
  446      0.0000    0.10000E+31
  447   3000.3406    0.16097E-25
  448      0.0000    0.10000E+31
  449    400.0000    0.21034E-19
  450     99.9996    0.10000E+31
  451    299.9675    0.39535E-24
  452   -602.6180    0.14029E-24
  453    618.4830    0.12699E-24
  454    299.7536    0.39428E-24
  455    617.6116    0.12697E-24
  456    299.7536    0.39428E-24
  457    617.6116    0.12697E-24
  203    106.8536    0.17587E-21
  204   1007.7263    0.86892E-25
  205   1000.0000    0.87499E-25
  206   1012.7043    0.89422E-25
  207   1012.7043    0.89422E-25
  458      0.0000    0.10000E+31
    6    172.5000    0.57395E-24
   12    172.5000    0.57395E-24
   7
   401  0.29694685E-02     0   450     1     0     0     0
   401  0.59778113E-01     0   451     1     0     0     0
   401  0.96307231E-04     0   452     1     0     0     0
   401  0.19193046E-02     0   453     1     0     0     0
   401  0.81150669E+00     0   449     1     0     0     0
   401  0.11875961E+00     0   456     2     0     0     0
   401  0.49705063E-02     0   457     2     0     0     0
   7
   402  0.19640171E-02     0   450     2     0     0     0
   402  0.61333392E-01     0   451     2     0     0     0
   402  0.56574223E-04     0   452     2     0     0     0
   402  0.15040457E-02     0   453     2     0     0     0
   402  0.80942726E+00     0   449     2     0     0     0
   402  0.12349974E+00     0   454     1     0     0     0
   402  0.22149850E-02     0   455     1     0     0     0
   7
   403  0.29694699E-02     0   450     3     0     0     0
   403  0.59778139E-01     0   451     3     0     0     0
   403  0.96307274E-04     0   452     3     0     0     0
   403  0.19193054E-02     0   453     3     0     0     0
   403  0.81150705E+00     0   449     3     0     0     0
   403  0.11875925E+00     0   456     4     0     0     0
   403  0.49704774E-02     0   457     4     0     0     0
   7
   404  0.19640171E-02     0   450     4     0     0     0
   404  0.61333381E-01     0   451     4     0     0     0
   404  0.56574128E-04     0   452     4     0     0     0
   404  0.15040428E-02     0   453     4     0     0     0
   404  0.80942684E+00     0   449     4     0     0     0
   404  0.12350016E+00     0   454     3     0     0     0
   404  0.22149947E-02     0   455     3     0     0     0
   7
   405  0.10382975E-01     0   450     5     0     0     0
   405  0.61686522E-04     0   451     5     0     0     0
   405  0.65016327E-03     0   452     5     0     0     0
   405  0.64776867E-03     0   453     5     0     0     0
   405  0.98697221E+00     0   449     5     0     0     0
   405  0.97007978E-04     0   456     6     0     0     0
   405  0.11882017E-02     0   457     6     0     0     0
   7
   406  0.67637295E+00     0   449     6     0     0     0
   406  0.28587487E-01     0   450     6     0     0     0
   406  0.24521535E-02     0   451     6     0     0     0
   406  0.73942862E-01     0   452     6     0     0     0
   406  0.70803188E-01     0   453     6     0     0     0
   406  0.50097043E-02     0   454     5     0     0     0
   406  0.14283173E+00     0   455     5     0     0     0
   7
   407  0.29694685E-02     0   450     7     0     0     0
   407  0.59778113E-01     0   451     7     0     0     0
   407  0.96307231E-04     0   452     7     0     0     0
   407  0.19193046E-02     0   453     7     0     0     0
   407  0.81150669E+00     0   449     7     0     0     0
   407  0.11875961E+00     0   454     8     0     0     0
   407  0.49705063E-02     0   455     8     0     0     0
   7
   408  0.19640171E-02     0   450     8     0     0     0
   408  0.61333392E-01     0   451     8     0     0     0
   408  0.56574223E-04     0   452     8     0     0     0
   408  0.15040457E-02     0   453     8     0     0     0
   408  0.80942726E+00     0   449     8     0     0     0
   408  0.12349974E+00     0   456     7     0     0     0
   408  0.22149850E-02     0   457     7     0     0     0
   7
   409  0.29694699E-02     0   450     9     0     0     0
   409  0.59778139E-01     0   451     9     0     0     0
   409  0.96307274E-04     0   452     9     0     0     0
   409  0.19193054E-02     0   453     9     0     0     0
   409  0.81150705E+00     0   449     9     0     0     0
   409  0.11875925E+00     0   454    10     0     0     0
   409  0.49704774E-02     0   455    10     0     0     0
   7
   410  0.19640171E-02     0   450    10     0     0     0
   410  0.61333381E-01     0   451    10     0     0     0
   410  0.56574128E-04     0   452    10     0     0     0
   410  0.15040428E-02     0   453    10     0     0     0
   410  0.80942684E+00     0   449    10     0     0     0
   410  0.12350016E+00     0   456     9     0     0     0
   410  0.22149947E-02     0   457     9     0     0     0
   7
   411  0.10382975E-01     0   450    11     0     0     0
   411  0.61686522E-04     0   451    11     0     0     0
   411  0.65016327E-03     0   452    11     0     0     0
   411  0.64776867E-03     0   453    11     0     0     0
   411  0.98697221E+00     0   449    11     0     0     0
   411  0.97007978E-04     0   454    12     0     0     0
   411  0.11882017E-02     0   455    12     0     0     0
   7
   412  0.67637295E+00     0   449    12     0     0     0
   412  0.28587487E-01     0   450    12     0     0     0
   412  0.24521535E-02     0   451    12     0     0     0
   412  0.73942862E-01     0   452    12     0     0     0
   412  0.70803188E-01     0   453    12     0     0     0
   412  0.50097043E-02     0   456    11     0     0     0
   412  0.14283173E+00     0   457    11     0     0     0
   4
   413  0.11901209E-01     0   450     1     0     0     0
   413  0.14279449E-04     0   451     1     0     0     0
   413  0.29400780E-04     0   453     1     0     0     0
   413  0.98805517E+00     0   449     1     0     0     0
   5
   414  0.45971476E-01     0   450     2     0     0     0
   414  0.55146869E-04     0   451     2     0     0     0
   414  0.24213998E-04     0   452     2     0     0     0
   414  0.11342308E-03     0   453     2     0     0     0
   414  0.95383579E+00     0   449     2     0     0     0
   4
   415  0.11901209E-01     0   450     3     0     0     0
   415  0.14279449E-04     0   451     3     0     0     0
   415  0.29400780E-04     0   453     3     0     0     0
   415  0.98805517E+00     0   449     3     0     0     0
   5
   416  0.45971494E-01     0   450     4     0     0     0
   416  0.55146887E-04     0   451     4     0     0     0
   416  0.24213965E-04     0   452     4     0     0     0
   416  0.11342292E-03     0   453     4     0     0     0
   416  0.95383573E+00     0   449     4     0     0     0
   7
   417  0.22071989E-02     0   450     5     0     0     0
   417  0.49978565E-01     0   451     5     0     0     0
   417  0.57855365E-03     0   452     5     0     0     0
   417  0.31618886E-02     0   453     5     0     0     0
   417  0.68896759E+00     0   449     5     0     0     0
   417  0.10305665E+00     0   456     6     0     0     0
   417  0.15204947E+00     0   457     6     0     0     0
   7
   418  0.68733227E+00     0   449     6     0     0     0
   418  0.10392321E+00     0   454     5     0     0     0
   418  0.40306109E-02     0   455     5     0     0     0
   418  0.16200705E-02     0   450     6     0     0     0
   418  0.53427860E-01     0   451     6     0     0     0
   418  0.75238712E-01     0   452     6     0     0     0
   418  0.74427314E-01     0   453     6     0     0     0
   4
   419  0.11901209E-01     0   450     7     0     0     0
   419  0.14279449E-04     0   451     7     0     0     0
   419  0.29400780E-04     0   453     7     0     0     0
   419  0.98805517E+00     0   449     7     0     0     0
   5
   420  0.45971476E-01     0   450     8     0     0     0
   420  0.55146869E-04     0   451     8     0     0     0
   420  0.24213998E-04     0   452     8     0     0     0
   420  0.11342308E-03     0   453     8     0     0     0
   420  0.95383579E+00     0   449     8     0     0     0
   4
   421  0.11901209E-01     0   450     9     0     0     0
   421  0.14279449E-04     0   451     9     0     0     0
   421  0.29400780E-04     0   453     9     0     0     0
   421  0.98805517E+00     0   449     9     0     0     0
   5
   422  0.45971494E-01     0   450    10     0     0     0
   422  0.55146887E-04     0   451    10     0     0     0
   422  0.24213965E-04     0   452    10     0     0     0
   422  0.11342292E-03     0   453    10     0     0     0
   422  0.95383573E+00     0   449    10     0     0     0
   7
   423  0.22071989E-02     0   450    11     0     0     0
   423  0.49978565E-01     0   451    11     0     0     0
   423  0.57855365E-03     0   452    11     0     0     0
   423  0.31618886E-02     0   453    11     0     0     0
   423  0.68896759E+00     0   449    11     0     0     0
   423  0.10305665E+00     0   454    12     0     0     0
   423  0.15204947E+00     0   455    12     0     0     0
   7
   424  0.68733227E+00     0   449    12     0     0     0
   424  0.10392321E+00     0   456    11     0     0     0
   424  0.40306109E-02     0   457    11     0     0     0
   424  0.16200705E-02     0   450    12     0     0     0
   424  0.53427860E-01     0   451    12     0     0     0
   424  0.75238712E-01     0   452    12     0     0     0
   424  0.74427314E-01     0   453    12     0     0     0
   1
   425  0.10000000E+01     0   450   121     0     0     0
   1
   426  0.10000000E+01     0   450   122     0     0     0
   1
   427  0.10000000E+01     0   450   123     0     0     0
   1
   428  0.10000000E+01     0   450   124     0     0     0
   6
   429  0.98096251E+00     0   450   125     0     0     0
   429  0.15500282E-02     0   451   125     0     0     0
   429  0.39519686E-02     0   452   125     0     0     0
   429  0.74800113E-02     0   453   125     0     0     0
   429  0.45697493E-03     0   456   126     0     0     0
   429  0.55984743E-02     0   457   126     0     0     0
   6
   430  0.98720245E-01     0   450   126     0     0     0
   430  0.27504233E+00     0   451   126     0     0     0
   430  0.11340657E-02     0   452   126     0     0     0
   430  0.19219156E-01     0   453   126     0     0     0
   430  0.58578515E+00     0   454   125     0     0     0
   430  0.20099077E-01     0   455   125     0     0     0
   1
   431  0.10000000E+01     0   450   127     0     0     0
   1
   432  0.10000000E+01     0   450   128     0     0     0
   1
   433  0.10000000E+01     0   450   129     0     0     0
   1
   434  0.10000000E+01     0   450   130     0     0     0
   6
   435  0.98096251E+00     0   450   131     0     0     0
   435  0.15500282E-02     0   451   131     0     0     0
   435  0.39519686E-02     0   452   131     0     0     0
   435  0.74800113E-02     0   453   131     0     0     0
   435  0.45697493E-03     0   454   132     0     0     0
   435  0.55984743E-02     0   455   132     0     0     0
   6
   436  0.98720245E-01     0   450   132     0     0     0
   436  0.27504233E+00     0   451   132     0     0     0
   436  0.11340657E-02     0   452   132     0     0     0
   436  0.19219156E-01     0   453   132     0     0     0
   436  0.58578515E+00     0   456   131     0     0     0
   436  0.20099077E-01     0   457   131     0     0     0
   1
   437  0.10000000E+01     0   450   121     0     0     0
   0
   1
   439  0.10000000E+01     0   450   123     0     0     0
   0
   6
   441  0.86192593E-01     0   450   125     0     0     0
   441  0.29936630E+00     0   451   125     0     0     0
   441  0.13438117E-02     0   452   125     0     0     0
   441  0.10408857E-01     0   453   125     0     0     0
   441  0.56250650E+00     0   456   126     0     0     0
   441  0.40181842E-01     0   457   126     0     0     0
   0
   1
   443  0.10000000E+01     0   450   127     0     0     0
   0
   1
   445  0.10000000E+01     0   450   129     0     0     0
   0
   6
   447  0.86192593E-01     0   450   131     0     0     0
   447  0.29936630E+00     0   451   131     0     0     0
   447  0.13438117E-02     0   452   131     0     0     0
   447  0.10408857E-01     0   453   131     0     0     0
   447  0.56250650E+00     0   454   132     0     0     0
   447  0.40181842E-01     0   455   132     0     0     0
   0
  16
   449  0.18664273E-01     0   454     1     8     0     0
   449  0.18664273E-01     0   456     2     7     0     0
   449  0.18664241E-01     0   454     3    10     0     0
   449  0.18664241E-01     0   456     4     9     0     0
   449  0.46163335E-04     0   450    13     0     0     0
   449  0.33855903E+00     0   450     2     8     0     0
   449  0.10464232E+00     0   450     1     7     0     0
   449  0.10464232E+00     0   450     3     9     0     0
   449  0.33855796E+00     0   450     4    10     0     0
   449  0.16942417E-02     0   450     5    11     0     0
   449  0.72433788E-04     0   451    13     0     0     0
   449  0.94283540E-02     0   451     2     8     0     0
   449  0.90700332E-02     0   451     1     7     0     0
   449  0.90700332E-02     0   451     3     9     0     0
   449  0.94283223E-02     0   451     4    10     0     0
   449  0.13170500E-03     0   451     5    11     0     0
   0
  14
   451  0.50563691E-03     0   450   200     0     0     0
   451  0.91155320E-02     0   450   203     0     0     0
   451  0.11566445E+00     0   425   127     0     0     0
   451  0.11566445E+00     0   431   121     0     0     0
   451  0.11566436E+00     0   427   129     0     0     0
   451  0.11566436E+00     0   433   123     0     0     0
   451  0.19322100E-03     0   437   127     0     0     0
   451  0.19322100E-03     0   443   121     0     0     0
   451  0.19322083E-03     0   439   129     0     0     0
   451  0.19322083E-03     0   445   123     0     0     0
   451  0.13173707E+00     0   426   128     0     0     0
   451  0.13173707E+00     0   432   122     0     0     0
   451  0.13173707E+00     0   428   130     0     0     0
   451  0.13173707E+00     0   434   124     0     0     0
  18
   452  0.30533615E+00     0   454   199     0     0     0
   452  0.30533615E+00     0   456   198     0     0     0
   452  0.83565660E-01     0   450   200     0     0     0
   452  0.27555043E+00     0   451   200     0     0     0
   452  0.14530480E-01     0   450   203     0     0     0
   452  0.10407921E-01     0   451   203     0     0     0
   452  0.16244418E-03     0   425   127     0     0     0
   452  0.16244418E-03     0   431   121     0     0     0
   452  0.16244418E-03     0   427   129     0     0     0
   452  0.16244418E-03     0   433   123     0     0     0
   452  0.27168408E-03     0   437   127     0     0     0
   452  0.27168408E-03     0   443   121     0     0     0
   452  0.27168402E-03     0   439   129     0     0     0
   452  0.27168402E-03     0   445   123     0     0     0
   452  0.88432635E-03     0   426   128     0     0     0
   452  0.88432635E-03     0   432   122     0     0     0
   452  0.88432635E-03     0   428   130     0     0     0
   452  0.88432635E-03     0   434   124     0     0     0
  18
   453  0.29664123E+00     0   454   199     0     0     0
   453  0.29664123E+00     0   456   198     0     0     0
   453  0.14394783E-01     0   450   200     0     0     0
   453  0.12252603E-01     0   451   200     0     0     0
   453  0.66969343E-01     0   450   203     0     0     0
   453  0.22494073E+00     0   451   203     0     0     0
   453  0.66511752E-02     0   425   127     0     0     0
   453  0.66511752E-02     0   431   121     0     0     0
   453  0.66511752E-02     0   427   129     0     0     0
   453  0.66511752E-02     0   433   123     0     0     0
   453  0.12540095E-02     0   437   127     0     0     0
   453  0.12540095E-02     0   443   121     0     0     0
   453  0.12540093E-02     0   439   129     0     0     0
   453  0.12540093E-02     0   445   123     0     0     0
   453  0.14134862E-01     0   426   128     0     0     0
   453  0.14134862E-01     0   432   122     0     0     0
   453  0.14134862E-01     0   428   130     0     0     0
   453  0.14134862E-01     0   434   124     0     0     0
   5
   454  0.96210958E-02     0   450   198     0     0     0
   454  0.27903759E+00     0   426   127     0     0     0
   454  0.27903751E+00     0   428   129     0     0     0
   454  0.21615194E+00     0   431   122     0     0     0
   454  0.21615185E+00     0   433   124     0     0     0
   8
   455  0.73545359E-01     0   450   198     0     0     0
   455  0.30703464E+00     0   451   198     0     0     0
   455  0.13198751E-01     0   426   127     0     0     0
   455  0.13198751E-01     0   428   129     0     0     0
   455  0.28502934E-01     0   431   122     0     0     0
   455  0.28502934E-01     0   433   124     0     0     0
   455  0.29092821E+00     0   454   200     0     0     0
   455  0.24508838E+00     0   454   203     0     0     0
   5
   456  0.96210958E-02     0   450   199     0     0     0
   456  0.27903759E+00     0   432   121     0     0     0
   456  0.27903751E+00     0   434   123     0     0     0
   456  0.21615194E+00     0   425   128     0     0     0
   456  0.21615185E+00     0   427   130     0     0     0
   8
   457  0.73545359E-01     0   450   199     0     0     0
   457  0.30703464E+00     0   451   199     0     0     0
   457  0.13198751E-01     0   432   121     0     0     0
   457  0.13198751E-01     0   434   123     0     0     0
   457  0.28502934E-01     0   425   128     0     0     0
   457  0.28502934E-01     0   427   130     0     0     0
   457  0.29092821E+00     0   456   200     0     0     0
   457  0.24508838E+00     0   456   203     0     0     0
  28
   203  0.21258114E-03     0   123   129     0     0     0
   203  0.60785849E-01     0   125   131     0     0     0
   203  0.25561792E-02     0     3     9     0     0     0
   203  0.84671867E+00     0     5    11     0     0     0
   203  0.37052955E-01     0     4    10     0     0     0
   203  0.15032202E-02     0    59    59     0     0     0
   203  0.34213103E-01     0    13    13     0     0     0
   203  0.90872718E-03     0   198   121   128     0     0
   203  0.90872718E-03     0   198   123   130     0     0
   203  0.90872718E-03     0   198   125   132     0     0
   203  0.27261816E-02     0   198     8     1     0     0
   203  0.27261816E-02     0   198    10     3     0     0
   203  0.90872718E-03     0   199   127   122     0     0
   203  0.90872718E-03     0   199   129   124     0     0
   203  0.90872718E-03     0   199   131   126     0     0
   203  0.27261816E-02     0   199     2     7     0     0
   203  0.27261816E-02     0   199     4     9     0     0
   203  0.41067582E-04     0   200   122   128     0     0
   203  0.41067582E-04     0   200   124   130     0     0
   203  0.41067582E-04     0   200   126   132     0     0
   203  0.20668902E-04     0   200   121   127     0     0
   203  0.20668902E-04     0   200   123   129     0     0
   203  0.20668902E-04     0   200   125   131     0     0
   203  0.70809911E-04     0   200     2     8     0     0
   203  0.70809911E-04     0   200     4    10     0     0
   203  0.91220609E-04     0   200     1     7     0     0
   203  0.91220609E-04     0   200     3     9     0     0
   203  0.91220609E-04     0   200     5    11     0     0
  25
   204  0.15236634E-04     0   123   129     0     0     0
   204  0.43639238E-02     0   125   131     0     0     0
   204  0.17861665E-03     0     3     9     0     0     0
   204  0.44041429E-01     0     5    11     0     0     0
   204  0.36929369E+00     0     6    12     0     0     0
   204  0.20442039E-03     0    13    13     0     0     0
   204  0.92379021E-03     0   198   199     0     0     0
   204  0.46903393E-03     0   200   200     0     0     0
   204  0.15935862E-02     0   450   450     0     0     0
   204  0.95728599E-02     0   450   451     0     0     0
   204  0.60416717E-01     0   450   452     0     0     0
   204  0.11098553E-01     0   450   453     0     0     0
   204  0.11824887E-01     0   451   451     0     0     0
   204  0.14094058E+00     0   451   452     0     0     0
   204  0.67565935E-02     0   451   453     0     0     0
   204  0.26012028E-01     0   454   456     0     0     0
   204  0.15321922E+00     0   454   457     0     0     0
   204  0.15321922E+00     0   456   455     0     0     0
   204  0.39598853E-02     0   203   203     0     0     0
   204  0.17965795E-03     0   425   431     0     0     0
   204  0.13463362E-03     0   437   443     0     0     0
   204  0.17964318E-03     0   427   433     0     0     0
   204  0.13462083E-03     0   439   445     0     0     0
   204  0.63352165E-03     0   426   432     0     0     0
   204  0.63352165E-03     0   428   434     0     0     0
  17
   205  0.15261288E-04     0   123   129     0     0     0
   205  0.43710391E-02     0   125   131     0     0     0
   205  0.17891708E-03     0     3     9     0     0     0
   205  0.44157572E-01     0     5    11     0     0     0
   205  0.39524153E+00     0     6    12     0     0     0
   205  0.21850260E-03     0    13    13     0     0     0
   205  0.24923696E-02     0   450   450     0     0     0
   205  0.19200765E-01     0   450   451     0     0     0
   205  0.14038501E-01     0   450   452     0     0     0
   205  0.48776101E-01     0   450   453     0     0     0
   205  0.36090527E-01     0   451   451     0     0     0
   205  0.95461002E-02     0   451   452     0     0     0
   205  0.10214572E+00     0   451   453     0     0     0
   205  0.78437127E-01     0   454   456     0     0     0
   205  0.12209456E+00     0   454   457     0     0     0
   205  0.12209456E+00     0   456   455     0     0     0
   205  0.90081507E-03     0   203   200     0     0     0
  13
   206  0.15794736E-04     0   124   129     0     0     0
   206  0.45238268E-02     0   126   131     0     0     0
   206  0.17760930E-03     0     4     9     0     0     0
   206  0.40670681E+00     0     6    11     0     0     0
   206  0.28361592E-01     0   454   450     0     0     0
   206  0.48563328E-04     0   454   451     0     0     0
   206  0.17039558E+00     0   454   452     0     0     0
   206  0.15820773E+00     0   454   453     0     0     0
   206  0.55340070E-01     0   455   450     0     0     0
   206  0.17377628E+00     0   455   451     0     0     0
   206  0.95046207E-03     0   203   198     0     0     0
   206  0.74788416E-03     0   431   426     0     0     0
   206  0.74786233E-03     0   433   428     0     0     0
  13
   207  0.15794736E-04     0   130   123     0     0     0
   207  0.45238268E-02     0   132   125     0     0     0
   207  0.17760930E-03     0    10     3     0     0     0
   207  0.40670681E+00     0    12     5     0     0     0
   207  0.28361592E-01     0   456   450     0     0     0
   207  0.48563328E-04     0   456   451     0     0     0
   207  0.17039558E+00     0   456   452     0     0     0
   207  0.15820773E+00     0   456   453     0     0     0
   207  0.55340070E-01     0   457   450     0     0     0
   207  0.17377628E+00     0   457   451     0     0     0
   207  0.95046207E-03     0   203   199     0     0     0
   207  0.74788416E-03     0   425   432     0     0     0
   207  0.74786233E-03     0   427   434     0     0     0
   0
   5
     6  0.33333334E+00   100     2     7     5     0     0
     6  0.33333334E+00   100     4     9     5     0     0
     6  0.11111111E+00   100   122   127     5     0     0
     6  0.11111111E+00   100   124   129     5     0     0
     6  0.11111111E+00   100   126   131     5     0     0
   5
    12  0.33333334E+00   100     8     1    11     0     0
    12  0.33333334E+00   100    10     3    11     0     0
    12  0.11111111E+00   100   128   121    11     0     0
    12  0.11111111E+00   100   130   123    11     0     0
    12  0.11111111E+00   100   132   125    11     0     0
      4.00000000     -0.24965113
     -0.99620706      0.01872936     -0.07889482      0.03155782
     -0.03697012     -0.97399265      0.18600248     -0.12399424
      0.03241037     -0.04536194     -0.70344061     -0.70856375
      0.07179026     -0.22120078     -0.68143213      0.69394988
     -0.98397720      0.17829427     -0.17829427     -0.98397720
     -0.96388167      0.26633093     -0.26633093     -0.96388167
      1.57075512     -1.57079577     -1.57079387
    150.00000000   2400.00000000   2400.00000000
    600.00000000
    T
