  65
  401   2000.8307    0.26485E-25
  402   1999.3210    0.26388E-25
  403   2000.8307    0.26485E-25
  404   1999.3215    0.26388E-25
  405   1999.0466    0.29243E-25
  406   1830.2511    0.14716E-25
  407   2000.8307    0.26485E-25
  408   1999.3210    0.26388E-25
  409   2000.8307    0.26485E-25
  410   1999.3215    0.26388E-25
  411   1999.0466    0.29243E-25
  412   1830.2511    0.14716E-25
  413   2000.1520    0.60151E-24
  414   1999.6959    0.15041E-24
  415   2000.1520    0.60151E-24
  416   1999.6964    0.15041E-24
  417   2001.9387    0.18448E-25
  418   2164.3120    0.83211E-26
  419   2000.1520    0.60151E-24
  420   1999.6959    0.15041E-24
  421   2000.1520    0.60151E-24
  422   1999.6964    0.15041E-24
  423   2001.9387    0.18448E-25
  424   2164.3120    0.83211E-26
  425   2000.5267    0.24326E-25
  426   1999.0170    0.24283E-25
  427   2000.5267    0.24326E-25
  428   1999.0170    0.24283E-25
  429    215.0930    0.24058E-21
  430   1999.0170    0.24156E-25
  431   2000.5267    0.24326E-25
  432   1999.0170    0.24283E-25
  433   2000.5267    0.24326E-25
  434   1999.0170    0.24283E-25
  435    215.0930    0.24058E-21
  436   1999.0170    0.24156E-25
  437    215.0832    0.26359E-21
  438      0.0000    0.10000E+31
  439    215.0832    0.26359E-21
  440      0.0000    0.10000E+31
  441   2000.5482    0.24198E-25
  442      0.0000    0.10000E+31
  443    215.0832    0.26359E-21
  444      0.0000    0.10000E+31
  445    215.0832    0.26359E-21
  446      0.0000    0.10000E+31
  447   2000.5482    0.24198E-25
  448      0.0000    0.10000E+31
  449   2000.0000    0.28691E-24
  450    185.5234    0.10000E+31
  451    244.6015    0.37932E-23
  452   -355.0275    0.38770E-24
  453    384.9026    0.32595E-24
  454    188.0483    0.23064E-14
  455    379.7019    0.35928E-24
  456    188.0483    0.23064E-14
  457    379.7019    0.35928E-24
  203    119.0513    0.13103E-21
  204    504.3599    0.54698E-24
  205    500.0000    0.31300E-24
  206    509.4117    0.60082E-24
  207    509.4117    0.60082E-24
  458      0.0000    0.10000E+31
    6    172.5000    0.57395E-24
   12    172.5000    0.57395E-24
   6
   401  0.28729543E+00     0   450     1     0     0     0
   401  0.30063032E-02     0   451     1     0     0     0
   401  0.26535550E-02     0   452     1     0     0     0
   401  0.48253175E-01     0   453     1     0     0     0
   401  0.53536230E+00     0   456     2     0     0     0
   401  0.12342921E+00     0   457     2     0     0     0
   6
   402  0.24544680E+00     0   450     2     0     0     0
   402  0.64441092E-01     0   451     2     0     0     0
   402  0.18114180E-02     0   452     2     0     0     0
   402  0.28409289E-01     0   453     2     0     0     0
   402  0.60752892E+00     0   454     1     0     0     0
   402  0.52362517E-01     0   455     1     0     0     0
   6
   403  0.28729564E+00     0   450     3     0     0     0
   403  0.30063053E-02     0   451     3     0     0     0
   403  0.26535569E-02     0   452     3     0     0     0
   403  0.48253208E-01     0   453     3     0     0     0
   403  0.53536218E+00     0   456     4     0     0     0
   403  0.12342916E+00     0   457     4     0     0     0
   6
   404  0.24544661E+00     0   450     4     0     0     0
   404  0.64441048E-01     0   451     4     0     0     0
   404  0.18114165E-02     0   452     4     0     0     0
   404  0.28409267E-01     0   453     4     0     0     0
   404  0.60752910E+00     0   454     3     0     0     0
   404  0.52362524E-01     0   455     3     0     0     0
   7
   405  0.14854823E+00     0   450     5     0     0     0
   405  0.30902341E-01     0   451     5     0     0     0
   405  0.30013043E-02     0   452     5     0     0     0
   405  0.71988390E-02     0   453     5     0     0     0
   405  0.29567015E+00     0   456     6     0     0     0
   405  0.38770095E+00     0   457     6     0     0     0
   405  0.12697826E+00     0   199   406     0     0     0
   6
   406  0.23682673E-01     0   450     6     0     0     0
   406  0.51871110E-01     0   451     6     0     0     0
   406  0.21024856E+00     0   452     6     0     0     0
   406  0.31115332E+00     0   453     6     0     0     0
   406  0.61986353E-01     0   454     5     0     0     0
   406  0.34105793E+00     0   455     5     0     0     0
   6
   407  0.28729543E+00     0   450     7     0     0     0
   407  0.30063032E-02     0   451     7     0     0     0
   407  0.26535550E-02     0   452     7     0     0     0
   407  0.48253175E-01     0   453     7     0     0     0
   407  0.53536230E+00     0   454     8     0     0     0
   407  0.12342921E+00     0   455     8     0     0     0
   6
   408  0.24544680E+00     0   450     8     0     0     0
   408  0.64441092E-01     0   451     8     0     0     0
   408  0.18114180E-02     0   452     8     0     0     0
   408  0.28409289E-01     0   453     8     0     0     0
   408  0.60752892E+00     0   456     7     0     0     0
   408  0.52362517E-01     0   457     7     0     0     0
   6
   409  0.28729564E+00     0   450     9     0     0     0
   409  0.30063053E-02     0   451     9     0     0     0
   409  0.26535569E-02     0   452     9     0     0     0
   409  0.48253208E-01     0   453     9     0     0     0
   409  0.53536218E+00     0   454    10     0     0     0
   409  0.12342916E+00     0   455    10     0     0     0
   6
   410  0.24544661E+00     0   450    10     0     0     0
   410  0.64441048E-01     0   451    10     0     0     0
   410  0.18114165E-02     0   452    10     0     0     0
   410  0.28409267E-01     0   453    10     0     0     0
   410  0.60752910E+00     0   456     9     0     0     0
   410  0.52362524E-01     0   457     9     0     0     0
   7
   411  0.14854823E+00     0   450    11     0     0     0
   411  0.30902341E-01     0   451    11     0     0     0
   411  0.30013043E-02     0   452    11     0     0     0
   411  0.71988390E-02     0   453    11     0     0     0
   411  0.29567015E+00     0   454    12     0     0     0
   411  0.38770095E+00     0   455    12     0     0     0
   411  0.12697826E+00     0   198   412     0     0     0
   6
   412  0.23682673E-01     0   450    12     0     0     0
   412  0.51871110E-01     0   451    12     0     0     0
   412  0.21024856E+00     0   452    12     0     0     0
   412  0.31115332E+00     0   453    12     0     0     0
   412  0.61986353E-01     0   456    11     0     0     0
   412  0.34105793E+00     0   457    11     0     0     0
   4
   413  0.35367776E-01     0   450     1     0     0     0
   413  0.90442139E+00     0   451     1     0     0     0
   413  0.17803421E-02     0   452     1     0     0     0
   413  0.58430627E-01     0   453     1     0     0     0
   4
   414  0.35368010E-01     0   450     2     0     0     0
   414  0.90442222E+00     0   451     2     0     0     0
   414  0.17803153E-02     0   452     2     0     0     0
   414  0.58429442E-01     0   453     2     0     0     0
   4
   415  0.35367776E-01     0   450     3     0     0     0
   415  0.90442139E+00     0   451     3     0     0     0
   415  0.17803421E-02     0   452     3     0     0     0
   415  0.58430627E-01     0   453     3     0     0     0
   4
   416  0.35368010E-01     0   450     4     0     0     0
   416  0.90442234E+00     0   451     4     0     0     0
   416  0.17803153E-02     0   452     4     0     0     0
   416  0.58429442E-01     0   453     4     0     0     0
   7
   417  0.10966913E+00     0   450     5     0     0     0
   417  0.10625175E-01     0   451     5     0     0     0
   417  0.88115856E-02     0   452     5     0     0     0
   417  0.37747804E-01     0   453     5     0     0     0
   417  0.23534733E+00     0   456     6     0     0     0
   417  0.45978430E+00     0   457     6     0     0     0
   417  0.13801475E+00     0   199   406     0     0     0
   9
   418  0.19572864E+00     0   454     5     0     0     0
   418  0.87074220E-01     0   455     5     0     0     0
   418  0.21728763E+00     0   200   406     0     0     0
   418  0.33619944E-01     0   198   405     0     0     0
   418  0.50799750E-01     0   198   417     0     0     0
   418  0.10019021E+00     0   450     6     0     0     0
   418  0.46088338E-01     0   451     6     0     0     0
   418  0.18362683E+00     0   452     6     0     0     0
   418  0.85584611E-01     0   453     6     0     0     0
   4
   419  0.35367776E-01     0   450     7     0     0     0
   419  0.90442139E+00     0   451     7     0     0     0
   419  0.17803421E-02     0   452     7     0     0     0
   419  0.58430627E-01     0   453     7     0     0     0
   4
   420  0.35368010E-01     0   450     8     0     0     0
   420  0.90442222E+00     0   451     8     0     0     0
   420  0.17803153E-02     0   452     8     0     0     0
   420  0.58429442E-01     0   453     8     0     0     0
   4
   421  0.35367776E-01     0   450     9     0     0     0
   421  0.90442139E+00     0   451     9     0     0     0
   421  0.17803421E-02     0   452     9     0     0     0
   421  0.58430627E-01     0   453     9     0     0     0
   4
   422  0.35368010E-01     0   450    10     0     0     0
   422  0.90442234E+00     0   451    10     0     0     0
   422  0.17803153E-02     0   452    10     0     0     0
   422  0.58429442E-01     0   453    10     0     0     0
   7
   423  0.10966913E+00     0   450    11     0     0     0
   423  0.10625175E-01     0   451    11     0     0     0
   423  0.88115856E-02     0   452    11     0     0     0
   423  0.37747804E-01     0   453    11     0     0     0
   423  0.23534733E+00     0   454    12     0     0     0
   423  0.45978430E+00     0   455    12     0     0     0
   423  0.13801475E+00     0   198   412     0     0     0
   9
   424  0.19572864E+00     0   456    11     0     0     0
   424  0.87074220E-01     0   457    11     0     0     0
   424  0.21728763E+00     0   200   412     0     0     0
   424  0.33619944E-01     0   199   411     0     0     0
   424  0.50799750E-01     0   199   423     0     0     0
   424  0.10019021E+00     0   450    12     0     0     0
   424  0.46088338E-01     0   451    12     0     0     0
   424  0.18362683E+00     0   452    12     0     0     0
   424  0.85584611E-01     0   453    12     0     0     0
   6
   425  0.19184345E+00     0   450   121     0     0     0
   425  0.18929164E+00     0   451   121     0     0     0
   425  0.10492250E-02     0   452   121     0     0     0
   425  0.12830351E-01     0   453   121     0     0     0
   425  0.49163866E+00     0   456   122     0     0     0
   425  0.11334664E+00     0   457   122     0     0     0
   6
   426  0.30334538E+00     0   450   122     0     0     0
   426  0.19195054E-01     0   451   122     0     0     0
   426  0.33378927E-02     0   452   122     0     0     0
   426  0.66966042E-01     0   453   122     0     0     0
   426  0.55897856E+00     0   454   121     0     0     0
   426  0.48177157E-01     0   455   121     0     0     0
   6
   427  0.19184345E+00     0   450   123     0     0     0
   427  0.18929164E+00     0   451   123     0     0     0
   427  0.10492250E-02     0   452   123     0     0     0
   427  0.12830351E-01     0   453   123     0     0     0
   427  0.49163866E+00     0   456   124     0     0     0
   427  0.11334664E+00     0   457   124     0     0     0
   6
   428  0.30334538E+00     0   450   124     0     0     0
   428  0.19195054E-01     0   451   124     0     0     0
   428  0.33378927E-02     0   452   124     0     0     0
   428  0.66966042E-01     0   453   124     0     0     0
   428  0.55897856E+00     0   454   123     0     0     0
   428  0.48177157E-01     0   455   123     0     0     0
   2
   429  0.93461782E+00     0   450   125     0     0     0
   429  0.65382183E-01     0   456   126     0     0     0
   7
   430  0.30176193E+00     0   450   126     0     0     0
   430  0.19094856E-01     0   451   126     0     0     0
   430  0.33204691E-02     0   452   126     0     0     0
   430  0.66616476E-01     0   453   126     0     0     0
   430  0.55708891E+00     0   454   125     0     0     0
   430  0.51959895E-01     0   455   125     0     0     0
   430  0.15754547E-03     0   198   429     0     0     0
   6
   431  0.19184345E+00     0   450   127     0     0     0
   431  0.18929164E+00     0   451   127     0     0     0
   431  0.10492250E-02     0   452   127     0     0     0
   431  0.12830351E-01     0   453   127     0     0     0
   431  0.49163866E+00     0   454   128     0     0     0
   431  0.11334664E+00     0   455   128     0     0     0
   6
   432  0.30334538E+00     0   450   128     0     0     0
   432  0.19195054E-01     0   451   128     0     0     0
   432  0.33378927E-02     0   452   128     0     0     0
   432  0.66966042E-01     0   453   128     0     0     0
   432  0.55897856E+00     0   456   127     0     0     0
   432  0.48177157E-01     0   457   127     0     0     0
   6
   433  0.19184345E+00     0   450   129     0     0     0
   433  0.18929164E+00     0   451   129     0     0     0
   433  0.10492250E-02     0   452   129     0     0     0
   433  0.12830351E-01     0   453   129     0     0     0
   433  0.49163866E+00     0   454   130     0     0     0
   433  0.11334664E+00     0   455   130     0     0     0
   6
   434  0.30334538E+00     0   450   130     0     0     0
   434  0.19195054E-01     0   451   130     0     0     0
   434  0.33378927E-02     0   452   130     0     0     0
   434  0.66966042E-01     0   453   130     0     0     0
   434  0.55897856E+00     0   456   129     0     0     0
   434  0.48177157E-01     0   457   129     0     0     0
   2
   435  0.93461782E+00     0   450   131     0     0     0
   435  0.65382183E-01     0   454   132     0     0     0
   7
   436  0.30176193E+00     0   450   132     0     0     0
   436  0.19094856E-01     0   451   132     0     0     0
   436  0.33204691E-02     0   452   132     0     0     0
   436  0.66616476E-01     0   453   132     0     0     0
   436  0.55708891E+00     0   456   131     0     0     0
   436  0.51959895E-01     0   457   131     0     0     0
   436  0.15754547E-03     0   199   435     0     0     0
   1
   437  0.10000000E+01     0   450   121     0     0     0
   0
   1
   439  0.10000000E+01     0   450   123     0     0     0
   0
   8
   441  0.19143134E+00     0   450   125     0     0     0
   441  0.18838207E+00     0   451   125     0     0     0
   441  0.35085101E-02     0   452   125     0     0     0
   441  0.14699301E-01     0   453   125     0     0     0
   441  0.48902410E+00     0   456   126     0     0     0
   441  0.11279318E+00     0   457   126     0     0     0
   441  0.80025296E-04     0   200   429     0     0     0
   441  0.81554732E-04     0   203   429     0     0     0
   0
   1
   443  0.10000000E+01     0   450   127     0     0     0
   0
   1
   445  0.10000000E+01     0   450   129     0     0     0
   0
   8
   447  0.19143134E+00     0   450   131     0     0     0
   447  0.18838207E+00     0   451   131     0     0     0
   447  0.35085101E-02     0   452   131     0     0     0
   447  0.14699301E-01     0   453   131     0     0     0
   447  0.48902410E+00     0   454   132     0     0     0
   447  0.11279318E+00     0   455   132     0     0     0
   447  0.80025296E-04     0   200   435     0     0     0
   447  0.81554732E-04     0   203   435     0     0     0
   0
  32
   449  0.95640523E-02     0   454     1     8     0     0
   449  0.95640523E-02     0   456     2     7     0     0
   449  0.95640523E-02     0   454     3    10     0     0
   449  0.95640523E-02     0   456     4     9     0     0
   449  0.37554197E-01     0   454     5    12     0     0
   449  0.37554197E-01     0   456     6    11     0     0
   449  0.20946336E-02     0   455     1     8     0     0
   449  0.20946336E-02     0   457     2     7     0     0
   449  0.20946336E-02     0   455     3    10     0     0
   449  0.20946336E-02     0   457     4     9     0     0
   449  0.16456974E+00     0   455     5    12     0     0
   449  0.16456974E+00     0   457     6    11     0     0
   449  0.20446673E-03     0   450    13     0     0     0
   449  0.10969416E-01     0   450     1     7     0     0
   449  0.10969416E-01     0   450     3     9     0     0
   449  0.10953127E-01     0   450     5    11     0     0
   449  0.20495430E-01     0   450     6    12     0     0
   449  0.30152336E-04     0   451    13     0     0     0
   449  0.16540388E-02     0   451     1     7     0     0
   449  0.16540388E-02     0   451     3     9     0     0
   449  0.16451351E-02     0   451     5    11     0     0
   449  0.41322406E-01     0   451     6    12     0     0
   449  0.11557521E-02     0   452    13     0     0     0
   449  0.83467385E-04     0   452     1     7     0     0
   449  0.83467385E-04     0   452     3     9     0     0
   449  0.64393634E-03     0   452     5    11     0     0
   449  0.17828625E+00     0   452     6    12     0     0
   449  0.80692989E-03     0   453    13     0     0     0
   449  0.19208154E-02     0   453     1     7     0     0
   449  0.19208154E-02     0   453     3     9     0     0
   449  0.23556831E-02     0   453     5    11     0     0
   449  0.26196268E+00     0   453     6    12     0     0
   0
  16
   451  0.28602482E-03     0   456     2     7     0     0
   451  0.95341602E-04     0   456   122   127     0     0
   451  0.95341602E-04     0   456   124   129     0     0
   451  0.28602482E-03     0   454     1     8     0     0
   451  0.95341602E-04     0   454   121   128     0     0
   451  0.95341602E-04     0   454   123   130     0     0
   451  0.28602482E-03     0   456     4     9     0     0
   451  0.95341602E-04     0   456   126   131     0     0
   451  0.28602482E-03     0   454     3    10     0     0
   451  0.95341602E-04     0   454   125   132     0     0
   451  0.16638251E+00     0   437   127     0     0     0
   451  0.16638251E+00     0   443   121     0     0     0
   451  0.16638122E+00     0   439   129     0     0     0
   451  0.16638122E+00     0   445   123     0     0     0
   451  0.16637821E+00     0   429   131     0     0     0
   451  0.16637821E+00     0   435   125     0     0     0
  11
   452  0.32800689E+00     0   454   199     0     0     0
   452  0.32800689E+00     0   456   198     0     0     0
   452  0.32360870E+00     0   450   200     0     0     0
   452  0.56836167E-02     0   451   200     0     0     0
   452  0.93152160E-02     0   450   203     0     0     0
   452  0.39151910E-03     0   437   127     0     0     0
   452  0.39151910E-03     0   443   121     0     0     0
   452  0.39151899E-03     0   439   129     0     0     0
   452  0.39151899E-03     0   445   123     0     0     0
   452  0.19063026E-02     0   429   131     0     0     0
   452  0.19063026E-02     0   435   125     0     0     0
  12
   453  0.34313038E+00     0   454   199     0     0     0
   453  0.34313038E+00     0   456   198     0     0     0
   453  0.22627668E-01     0   450   200     0     0     0
   453  0.46252931E-03     0   451   200     0     0     0
   453  0.19858553E+00     0   450   203     0     0     0
   453  0.58786604E-02     0   451   203     0     0     0
   453  0.13985721E-01     0   437   127     0     0     0
   453  0.13985721E-01     0   443   121     0     0     0
   453  0.13985716E-01     0   439   129     0     0     0
   453  0.13985716E-01     0   445   123     0     0     0
   453  0.15121087E-01     0   429   131     0     0     0
   453  0.15121087E-01     0   435   125     0     0     0
   4
   454  0.49994680E+00     0   450     2     7     0     0
   454  0.16664977E+00     0   450   127   122     0     0
   454  0.16664977E+00     0   450   129   124     0     0
   454  0.16675362E+00     0   450   131   126     0     0
   5
   455  0.30306008E+00     0   450   198     0     0     0
   455  0.12893845E+00     0   451   198     0     0     0
   455  0.27941258E-02     0   435   126     0     0     0
   455  0.35818458E+00     0   454   200     0     0     0
   455  0.20702279E+00     0   454   203     0     0     0
   4
   456  0.49994680E+00     0   450     8     1     0     0
   456  0.16664977E+00     0   450   121   128     0     0
   456  0.16664977E+00     0   450   123   130     0     0
   456  0.16675362E+00     0   450   125   132     0     0
   5
   457  0.30306008E+00     0   450   199     0     0     0
   457  0.12893845E+00     0   451   199     0     0     0
   457  0.27941258E-02     0   429   132     0     0     0
   457  0.35818458E+00     0   456   200     0     0     0
   457  0.20702279E+00     0   456   203     0     0     0
  28
   203  0.20210525E-03     0   123   129     0     0     0
   203  0.57808951E-01     0   125   131     0     0     0
   203  0.24262348E-02     0     3     9     0     0     0
   203  0.79147732E+00     0     5    11     0     0     0
   203  0.30111661E-01     0     4    10     0     0     0
   203  0.17401199E-02     0    59    59     0     0     0
   203  0.34990113E-01     0    13    13     0     0     0
   203  0.41379496E-02     0   198   121   128     0     0
   203  0.41379496E-02     0   198   123   130     0     0
   203  0.41379496E-02     0   198   125   132     0     0
   203  0.12413847E-01     0   198     8     1     0     0
   203  0.12413847E-01     0   198    10     3     0     0
   203  0.41379496E-02     0   199   127   122     0     0
   203  0.41379496E-02     0   199   129   124     0     0
   203  0.41379496E-02     0   199   131   126     0     0
   203  0.12413847E-01     0   199     2     7     0     0
   203  0.12413847E-01     0   199     4     9     0     0
   203  0.46235695E-03     0   200   122   128     0     0
   203  0.46235695E-03     0   200   124   130     0     0
   203  0.46235695E-03     0   200   126   132     0     0
   203  0.23269962E-03     0   200   121   127     0     0
   203  0.23269962E-03     0   200   123   129     0     0
   203  0.23269962E-03     0   200   125   131     0     0
   203  0.79720910E-03     0   200     2     8     0     0
   203  0.79720910E-03     0   200     4    10     0     0
   203  0.10270018E-02     0   200     1     7     0     0
   203  0.10270018E-02     0   200     3     9     0     0
   203  0.10270018E-02     0   200     5    11     0     0
  17
   204  0.10769612E-03     0   123   129     0     0     0
   204  0.30843532E-01     0   125   131     0     0     0
   204  0.12702966E-02     0     3     9     0     0     0
   204  0.34084594E+00     0     5    11     0     0     0
   204  0.14213535E-04     0     4    10     0     0     0
   204  0.33980158E+00     0     6    12     0     0     0
   204  0.51323842E-03     0    13    13     0     0     0
   204  0.67511639E-02     0   198   199     0     0     0
   204  0.33188148E-02     0   200   200     0     0     0
   204  0.96349150E-01     0   450   450     0     0     0
   204  0.81062932E-02     0   450   451     0     0     0
   204  0.36048252E-04     0   451   451     0     0     0
   204  0.14326546E+00     0   454   456     0     0     0
   204  0.27335705E-01     0   203   203     0     0     0
   204  0.48983371E-03     0   437   443     0     0     0
   204  0.48973580E-03     0   439   445     0     0     0
   204  0.46128477E-03     0   429   435     0     0     0
  11
   205  0.61416707E-04     0   123   129     0     0     0
   205  0.17590243E-01     0   125   131     0     0     0
   205  0.72448194E-03     0     3     9     0     0     0
   205  0.19464548E+00     0     5    11     0     0     0
   205  0.28991029E+00     0     6    12     0     0     0
   205  0.25064842E-03     0    13    13     0     0     0
   205  0.18602316E+00     0   450   450     0     0     0
   205  0.27114598E-01     0   450   451     0     0     0
   205  0.51003869E-03     0   451   451     0     0     0
   205  0.27986810E+00     0   454   456     0     0     0
   205  0.33016168E-02     0   203   200     0     0     0
   7
   206  0.12011070E-03     0   124   129     0     0     0
   206  0.34400713E-01     0   126   131     0     0     0
   206  0.13063728E-02     0     4     9     0     0     0
   206  0.76228976E+00     0     6    11     0     0     0
   206  0.73259855E-02     0   454   450     0     0     0
   206  0.18768498E+00     0   454   451     0     0     0
   206  0.68720314E-02     0   203   198     0     0     0
   7
   207  0.12011070E-03     0   130   123     0     0     0
   207  0.34400713E-01     0   132   125     0     0     0
   207  0.13063728E-02     0    10     3     0     0     0
   207  0.76228976E+00     0    12     5     0     0     0
   207  0.73259855E-02     0   456   450     0     0     0
   207  0.18768498E+00     0   456   451     0     0     0
   207  0.68720314E-02     0   203   199     0     0     0
   0
   5
     6  0.33333334E+00   100     2     7     5     0     0
     6  0.33333334E+00   100     4     9     5     0     0
     6  0.11111111E+00   100   122   127     5     0     0
     6  0.11111111E+00   100   124   129     5     0     0
     6  0.11111111E+00   100   126   131     5     0     0
   5
    12  0.33333334E+00   100     8     1    11     0     0
    12  0.33333334E+00   100    10     3    11     0     0
    12  0.11111111E+00   100   128   121    11     0     0
    12  0.11111111E+00   100   130   123    11     0     0
    12  0.11111111E+00   100   132   125    11     0     0
      6.00000000     -0.18020257
      0.18664198     -0.89453262      0.34208021     -0.21899202
      0.94990969      0.26964587      0.12486856     -0.09680209
      0.04286549     -0.08351203     -0.69692177     -0.71097720
      0.24697970     -0.34659562     -0.61780989      0.66119862
     -0.95733196      0.28899062     -0.28899062     -0.95733196
     -0.89667630      0.44268677     -0.44268677     -0.89667630
      0.78483683     -0.90437746     -1.56986928
   4899.00000000      0.00000000      0.00000000
    350.00000000
    T
