  65
  401   3469.9832    0.22364E-25
  402   3469.0688    0.22337E-25
  403   3469.9631    0.22364E-25
  404   3469.0491    0.22337E-25
  405   3185.2278    0.12886E-25
  406   2749.2966    0.26966E-25
  407   3469.9832    0.22364E-25
  408   3469.0688    0.22337E-25
  409   3469.9631    0.22364E-25
  410   3469.0491    0.22337E-25
  411   3185.2278    0.12886E-25
  412   2749.2966    0.26966E-25
  413   3296.6570    0.39961E-24
  414   3314.4871    0.99230E-25
  415   3296.6270    0.39962E-24
  416   3314.4775    0.99231E-25
  417   3247.7983    0.73565E-25
  418   3201.9666    0.11810E-25
  419   3296.6570    0.39961E-24
  420   3314.4871    0.99230E-25
  421   3296.6270    0.39962E-24
  422   3314.4775    0.99231E-25
  423   3247.7983    0.73565E-25
  424   3201.9666    0.11810E-25
  425   1203.4503    0.12713E-23
  426   1200.8112    0.12682E-23
  427   1203.3004    0.12719E-23
  428   1200.6609    0.12688E-23
  429    641.4114    0.46693E-11
  430   1189.7251    0.31964E-24
  431   1203.4503    0.12713E-23
  432   1200.8112    0.12682E-23
  433   1203.3004    0.12719E-23
  434   1200.6609    0.12688E-23
  435    641.4114    0.46693E-11
  436   1189.7251    0.31964E-24
  437    683.5126    0.11075E-22
  438      0.0000    0.10000E+31
  439    685.4835    0.17295E-16
  440      0.0000    0.10000E+31
  441   1194.1912    0.31252E-24
  442      0.0000    0.10000E+31
  443    683.5126    0.11075E-22
  444      0.0000    0.10000E+31
  445    685.4835    0.17295E-16
  446      0.0000    0.10000E+31
  447   1194.1912    0.31252E-24
  448      0.0000    0.10000E+31
  449   3845.0200    0.92664E-26
  450    804.1887    0.56753E-24
  451   1488.6957    0.14217E-24
  452  -1930.2671    0.64819E-25
  453   1938.1118    0.62332E-25
  454   1488.8536    0.14205E-24
  455   1937.9978    0.62603E-25
  456   1488.8536    0.14205E-24
  457   1937.9978    0.62603E-25
  203    123.2614    0.11631E-21
  204   2028.1962    0.36085E-25
  205   2025.5800    0.36120E-25
  206   2029.8253    0.39095E-25
  207   2029.8253    0.39095E-25
  458      0.0000    0.10000E+31
    6    173.3000    0.56017E-24
   12    173.3000    0.56017E-24
   6
   401  0.15176940E-01     0   450     1     0     0     0
   401  0.32372355E+00     0   451     1     0     0     0
   401  0.72885632E-04     0   452     1     0     0     0
   401  0.45379209E-02     0   453     1     0     0     0
   401  0.64602208E+00     0   456     2     0     0     0
   401  0.10466613E-01     0   457     2     0     0     0
   6
   402  0.14606408E-01     0   450     2     0     0     0
   402  0.32454318E+00     0   451     2     0     0     0
   402  0.43802866E-04     0   452     2     0     0     0
   402  0.38700507E-02     0   453     2     0     0     0
   402  0.65036601E+00     0   454     1     0     0     0
   402  0.65705567E-02     0   455     1     0     0     0
   6
   403  0.15177005E-01     0   450     3     0     0     0
   403  0.32372367E+00     0   451     3     0     0     0
   403  0.72885283E-04     0   452     3     0     0     0
   403  0.45378986E-02     0   453     3     0     0     0
   403  0.64602202E+00     0   456     4     0     0     0
   403  0.10466554E-01     0   457     4     0     0     0
   6
   404  0.14606460E-01     0   450     4     0     0     0
   404  0.32454312E+00     0   451     4     0     0     0
   404  0.43802607E-04     0   452     4     0     0     0
   404  0.38700281E-02     0   453     4     0     0     0
   404  0.65036607E+00     0   454     3     0     0     0
   404  0.65705222E-02     0   455     3     0     0     0
   7
   405  0.99418527E-02     0   450     5     0     0     0
   405  0.15530944E+00     0   451     5     0     0     0
   405  0.22356765E-01     0   452     5     0     0     0
   405  0.20996450E-01     0   453     5     0     0     0
   405  0.30642438E+00     0   456     6     0     0     0
   405  0.31123516E+00     0   457     6     0     0     0
   405  0.17373590E+00     0   199   406     0     0     0
   6
   406  0.20723021E+00     0   450     6     0     0     0
   406  0.22572262E-01     0   451     6     0     0     0
   406  0.20092323E+00     0   452     6     0     0     0
   406  0.16618417E+00     0   453     6     0     0     0
   406  0.46419650E-01     0   454     5     0     0     0
   406  0.35667047E+00     0   455     5     0     0     0
   6
   407  0.15176940E-01     0   450     7     0     0     0
   407  0.32372355E+00     0   451     7     0     0     0
   407  0.72885632E-04     0   452     7     0     0     0
   407  0.45379209E-02     0   453     7     0     0     0
   407  0.64602208E+00     0   454     8     0     0     0
   407  0.10466613E-01     0   455     8     0     0     0
   6
   408  0.14606408E-01     0   450     8     0     0     0
   408  0.32454318E+00     0   451     8     0     0     0
   408  0.43802866E-04     0   452     8     0     0     0
   408  0.38700507E-02     0   453     8     0     0     0
   408  0.65036601E+00     0   456     7     0     0     0
   408  0.65705567E-02     0   457     7     0     0     0
   6
   409  0.15177005E-01     0   450     9     0     0     0
   409  0.32372367E+00     0   451     9     0     0     0
   409  0.72885283E-04     0   452     9     0     0     0
   409  0.45378986E-02     0   453     9     0     0     0
   409  0.64602202E+00     0   454    10     0     0     0
   409  0.10466554E-01     0   455    10     0     0     0
   6
   410  0.14606460E-01     0   450    10     0     0     0
   410  0.32454312E+00     0   451    10     0     0     0
   410  0.43802607E-04     0   452    10     0     0     0
   410  0.38700281E-02     0   453    10     0     0     0
   410  0.65036607E+00     0   456     9     0     0     0
   410  0.65705222E-02     0   457     9     0     0     0
   7
   411  0.99418527E-02     0   450    11     0     0     0
   411  0.15530944E+00     0   451    11     0     0     0
   411  0.22356765E-01     0   452    11     0     0     0
   411  0.20996450E-01     0   453    11     0     0     0
   411  0.30642438E+00     0   454    12     0     0     0
   411  0.31123516E+00     0   455    12     0     0     0
   411  0.17373590E+00     0   198   412     0     0     0
   6
   412  0.20723021E+00     0   450    12     0     0     0
   412  0.22572262E-01     0   451    12     0     0     0
   412  0.20092323E+00     0   452    12     0     0     0
   412  0.16618417E+00     0   453    12     0     0     0
   412  0.46419650E-01     0   456    11     0     0     0
   412  0.35667047E+00     0   457    11     0     0     0
   4
   413  0.99952185E+00     0   450     1     0     0     0
   413  0.23597810E-04     0   451     1     0     0     0
   413  0.56231082E-04     0   452     1     0     0     0
   413  0.39837966E-03     0   453     1     0     0     0
   4
   414  0.99951714E+00     0   450     2     0     0     0
   414  0.23695417E-04     0   451     2     0     0     0
   414  0.56784986E-04     0   452     2     0     0     0
   414  0.40235970E-03     0   453     2     0     0     0
   4
   415  0.99952179E+00     0   450     3     0     0     0
   415  0.23597649E-04     0   451     3     0     0     0
   415  0.56230150E-04     0   452     3     0     0     0
   415  0.39837297E-03     0   453     3     0     0     0
   4
   416  0.99951714E+00     0   450     4     0     0     0
   416  0.23695360E-04     0   451     4     0     0     0
   416  0.56784658E-04     0   452     4     0     0     0
   416  0.40235725E-03     0   453     4     0     0     0
   7
   417  0.16929208E+00     0   450     5     0     0     0
   417  0.19517494E-01     0   451     5     0     0     0
   417  0.14078549E+00     0   452     5     0     0     0
   417  0.15293735E+00     0   453     5     0     0     0
   417  0.38840041E-01     0   456     6     0     0     0
   417  0.40979302E+00     0   457     6     0     0     0
   417  0.68834588E-01     0   199   406     0     0     0
   8
   418  0.27183306E+00     0   454     5     0     0     0
   418  0.60757414E-01     0   455     5     0     0     0
   418  0.89351840E-01     0   200   406     0     0     0
   418  0.12035091E+00     0   203   406     0     0     0
   418  0.88932533E-02     0   450     6     0     0     0
   418  0.13425569E+00     0   451     6     0     0     0
   418  0.14843147E+00     0   452     6     0     0     0
   418  0.16612643E+00     0   453     6     0     0     0
   4
   419  0.99952185E+00     0   450     7     0     0     0
   419  0.23597810E-04     0   451     7     0     0     0
   419  0.56231082E-04     0   452     7     0     0     0
   419  0.39837966E-03     0   453     7     0     0     0
   4
   420  0.99951714E+00     0   450     8     0     0     0
   420  0.23695417E-04     0   451     8     0     0     0
   420  0.56784986E-04     0   452     8     0     0     0
   420  0.40235970E-03     0   453     8     0     0     0
   4
   421  0.99952179E+00     0   450     9     0     0     0
   421  0.23597649E-04     0   451     9     0     0     0
   421  0.56230150E-04     0   452     9     0     0     0
   421  0.39837297E-03     0   453     9     0     0     0
   4
   422  0.99951714E+00     0   450    10     0     0     0
   422  0.23695360E-04     0   451    10     0     0     0
   422  0.56784658E-04     0   452    10     0     0     0
   422  0.40235725E-03     0   453    10     0     0     0
   7
   423  0.16929208E+00     0   450    11     0     0     0
   423  0.19517494E-01     0   451    11     0     0     0
   423  0.14078549E+00     0   452    11     0     0     0
   423  0.15293735E+00     0   453    11     0     0     0
   423  0.38840041E-01     0   454    12     0     0     0
   423  0.40979302E+00     0   455    12     0     0     0
   423  0.68834588E-01     0   198   412     0     0     0
   8
   424  0.27183306E+00     0   456    11     0     0     0
   424  0.60757414E-01     0   457    11     0     0     0
   424  0.89351840E-01     0   200   412     0     0     0
   424  0.12035091E+00     0   203   412     0     0     0
   424  0.88932533E-02     0   450    12     0     0     0
   424  0.13425569E+00     0   451    12     0     0     0
   424  0.14843147E+00     0   452    12     0     0     0
   424  0.16612643E+00     0   453    12     0     0     0
   2
   425  0.89894754E+00     0   450   121     0     0     0
   425  0.10105253E+00     0   121   130     0     0     0
   2
   426  0.89941406E+00     0   450   122     0     0     0
   426  0.10058600E+00     0   129   121     0     0     0
   2
   427  0.89891094E+00     0   450   123     0     0     0
   427  0.10108907E+00     0   121   128     0     0     0
   2
   428  0.89937717E+00     0   450   124     0     0     0
   428  0.10062283E+00     0   127   121     0     0     0
   3
   429  0.21145837E-02     0   125   130     0     0     0
   429  0.49893889E+00     0   125   124     0     0     0
   429  0.49894652E+00     0   123   126     0     0     0
   2
   430  0.21780717E+00     0   450   126     0     0     0
   430  0.78219289E+00     0   198   429     0     0     0
   2
   431  0.89894754E+00     0   450   127     0     0     0
   431  0.10105253E+00     0   127   124     0     0     0
   2
   432  0.89941406E+00     0   450   128     0     0     0
   432  0.10058600E+00     0   123   127     0     0     0
   2
   433  0.89891094E+00     0   450   129     0     0     0
   433  0.10108907E+00     0   127   122     0     0     0
   2
   434  0.89937717E+00     0   450   130     0     0     0
   434  0.10062283E+00     0   121   127     0     0     0
   3
   435  0.21145837E-02     0   131   124     0     0     0
   435  0.49893889E+00     0   131   130     0     0     0
   435  0.49894652E+00     0   129   132     0     0     0
   2
   436  0.21780717E+00     0   450   132     0     0     0
   436  0.78219289E+00     0   199   435     0     0     0
   2
   437  0.50000000E+00     0   123   122     0     0     0
   437  0.50000000E+00     0   121   124     0     0     0
   0
   2
   439  0.40531474E+00     0   429   123   131     0     0
   439  0.59468526E+00     0   435   123   125     0     0
   0
   3
   441  0.21588673E+00     0   450   125     0     0     0
   441  0.38577622E+00     0   200   429     0     0     0
   441  0.39833704E+00     0   203   429     0     0     0
   0
   2
   443  0.50000000E+00     0   129   128     0     0     0
   443  0.50000000E+00     0   127   130     0     0     0
   0
   2
   445  0.40531474E+00     0   435   129   125     0     0
   445  0.59468526E+00     0   429   129   131     0     0
   0
   3
   447  0.21588673E+00     0   450   131     0     0     0
   447  0.38577622E+00     0   200   435     0     0     0
   447  0.39833704E+00     0   203   435     0     0     0
   0
  24
   449  0.18941116E-01     0   408     2     0     0     0
   449  0.18941116E-01     0   402     8     0     0     0
   449  0.18853821E-01     0   407     1     0     0     0
   449  0.18853821E-01     0   401     7     0     0     0
   449  0.36142111E-01     0   420     2     0     0     0
   449  0.36142111E-01     0   414     8     0     0     0
   449  0.38420148E-01     0   419     1     0     0     0
   449  0.38420148E-01     0   413     7     0     0     0
   449  0.18855730E-01     0   409     3     0     0     0
   449  0.18855730E-01     0   403     9     0     0     0
   449  0.38424041E-01     0   421     3     0     0     0
   449  0.38424041E-01     0   415     9     0     0     0
   449  0.18942909E-01     0   410     4     0     0     0
   449  0.18942909E-01     0   404    10     0     0     0
   449  0.36143199E-01     0   422     4     0     0     0
   449  0.36143199E-01     0   416    10     0     0     0
   449  0.53712212E-01     0   411     5     0     0     0
   449  0.53712212E-01     0   405    11     0     0     0
   449  0.45117941E-01     0   423     5     0     0     0
   449  0.45117941E-01     0   417    11     0     0     0
   449  0.12180804E+00     0   412     6     0     0     0
   449  0.12180804E+00     0   406    12     0     0     0
   449  0.54638736E-01     0   424     6     0     0     0
   449  0.54638736E-01     0   418    12     0     0     0
   6
   450  0.13575950E+00     0   437   127     0     0     0
   450  0.13575950E+00     0   443   121     0     0     0
   450  0.13170935E+00     0   439   129     0     0     0
   450  0.13170935E+00     0   445   123     0     0     0
   450  0.23253125E+00     0   429   131     0     0     0
   450  0.23253125E+00     0   435   125     0     0     0
  20
   451  0.30466661E-03     0   450   200     0     0     0
   451  0.45002596E-02     0   450   203     0     0     0
   451  0.80287665E-01     0   425   127     0     0     0
   451  0.80287665E-01     0   431   121     0     0     0
   451  0.80363110E-01     0   427   129     0     0     0
   451  0.80363110E-01     0   433   123     0     0     0
   451  0.16766267E-04     0   437   127     0     0     0
   451  0.16766267E-04     0   443   121     0     0     0
   451  0.16714579E-04     0   439   129     0     0     0
   451  0.16714579E-04     0   445   123     0     0     0
   451  0.50900877E-02     0   429   131     0     0     0
   451  0.50900877E-02     0   435   125     0     0     0
   451  0.84374391E-01     0   441   131     0     0     0
   451  0.84374391E-01     0   447   125     0     0     0
   451  0.80587536E-01     0   426   128     0     0     0
   451  0.80587536E-01     0   432   122     0     0     0
   451  0.80662660E-01     0   428   130     0     0     0
   451  0.80662660E-01     0   434   124     0     0     0
   451  0.86198650E-01     0   430   132     0     0     0
   451  0.86198650E-01     0   436   126     0     0     0
  24
   452  0.26784429E+00     0   454   199     0     0     0
   452  0.26784429E+00     0   456   198     0     0     0
   452  0.11129905E+00     0   450   200     0     0     0
   452  0.26002058E+00     0   451   200     0     0     0
   452  0.14947849E-01     0   450   203     0     0     0
   452  0.32792236E-02     0   451   203     0     0     0
   452  0.14027825E-04     0   425   127     0     0     0
   452  0.14027825E-04     0   431   121     0     0     0
   452  0.14032265E-04     0   427   129     0     0     0
   452  0.14032265E-04     0   433   123     0     0     0
   452  0.42568041E-04     0   437   127     0     0     0
   452  0.42568041E-04     0   443   121     0     0     0
   452  0.42497570E-04     0   439   129     0     0     0
   452  0.42497570E-04     0   445   123     0     0     0
   452  0.24853531E-01     0   429   131     0     0     0
   452  0.24853531E-01     0   435   125     0     0     0
   452  0.12206092E-01     0   441   131     0     0     0
   452  0.12206092E-01     0   447   125     0     0     0
   452  0.69366164E-04     0   426   128     0     0     0
   452  0.69366164E-04     0   432   122     0     0     0
   452  0.69388094E-04     0   428   130     0     0     0
   452  0.69388094E-04     0   434   124     0     0     0
   452  0.70985254E-04     0   430   132     0     0     0
   452  0.70985254E-04     0   436   126     0     0     0
  24
   453  0.26532337E+00     0   454   199     0     0     0
   453  0.26532337E+00     0   456   198     0     0     0
   453  0.14605647E-01     0   450   200     0     0     0
   453  0.37347476E-02     0   451   200     0     0     0
   453  0.10419466E+00     0   450   203     0     0     0
   453  0.24426857E+00     0   451   203     0     0     0
   453  0.20293521E-02     0   425   127     0     0     0
   453  0.20293521E-02     0   431   121     0     0     0
   453  0.20299861E-02     0   427   129     0     0     0
   453  0.20299861E-02     0   433   123     0     0     0
   453  0.29436062E-03     0   437   127     0     0     0
   453  0.29436062E-03     0   443   121     0     0     0
   453  0.29387785E-03     0   439   129     0     0     0
   453  0.29387785E-03     0   445   123     0     0     0
   453  0.22381276E-01     0   429   131     0     0     0
   453  0.22381276E-01     0   435   125     0     0     0
   453  0.14338794E-01     0   441   131     0     0     0
   453  0.14338794E-01     0   447   125     0     0     0
   453  0.32769286E-02     0   426   128     0     0     0
   453  0.32769286E-02     0   432   122     0     0     0
   453  0.32779509E-02     0   428   130     0     0     0
   453  0.32779509E-02     0   434   124     0     0     0
   453  0.33524071E-02     0   430   132     0     0     0
   453  0.33524071E-02     0   436   126     0     0     0
   8
   454  0.47825840E-02     0   450   198     0     0     0
   454  0.16289788E+00     0   426   127     0     0     0
   454  0.16304962E+00     0   428   129     0     0     0
   454  0.17463987E+00     0   430   131     0     0     0
   454  0.15889753E+00     0   431   122     0     0     0
   454  0.15904675E+00     0   433   124     0     0     0
   454  0.10109204E-01     0   435   126     0     0     0
   454  0.16657659E+00     0   447   126     0     0     0
  11
   455  0.11833803E+00     0   450   198     0     0     0
   455  0.26767051E+00     0   451   198     0     0     0
   455  0.41256854E-02     0   426   127     0     0     0
   455  0.41269721E-02     0   428   129     0     0     0
   455  0.27501758E-01     0   430   131     0     0     0
   455  0.65232818E-02     0   431   122     0     0     0
   455  0.65253195E-02     0   433   124     0     0     0
   455  0.44203825E-01     0   435   126     0     0     0
   455  0.83267698E-02     0   447   126     0     0     0
   455  0.26313731E+00     0   454   200     0     0     0
   455  0.24952060E+00     0   454   203     0     0     0
   8
   456  0.47825840E-02     0   450   199     0     0     0
   456  0.16289788E+00     0   432   121     0     0     0
   456  0.16304962E+00     0   434   123     0     0     0
   456  0.17463987E+00     0   436   125     0     0     0
   456  0.15889753E+00     0   425   128     0     0     0
   456  0.15904675E+00     0   427   130     0     0     0
   456  0.10109204E-01     0   429   132     0     0     0
   456  0.16657659E+00     0   441   132     0     0     0
  11
   457  0.11833803E+00     0   450   199     0     0     0
   457  0.26767051E+00     0   451   199     0     0     0
   457  0.41256854E-02     0   432   121     0     0     0
   457  0.41269721E-02     0   434   123     0     0     0
   457  0.27501758E-01     0   436   125     0     0     0
   457  0.65232818E-02     0   425   128     0     0     0
   457  0.65253195E-02     0   427   130     0     0     0
   457  0.44203825E-01     0   429   132     0     0     0
   457  0.83267698E-02     0   441   132     0     0     0
   457  0.26313731E+00     0   456   200     0     0     0
   457  0.24952060E+00     0   456   203     0     0     0
  28
   203  0.15938510E-03     0   123   129     0     0     0
   203  0.45593619E-01     0   125   131     0     0     0
   203  0.19123999E-02     0     3     9     0     0     0
   203  0.74886006E+00     0     5    11     0     0     0
   203  0.37294045E-01     0     4    10     0     0     0
   203  0.17679073E-02     0    59    59     0     0     0
   203  0.34648087E-01     0    13    13     0     0     0
   203  0.65619149E-02     0   198   121   128     0     0
   203  0.65619149E-02     0   198   123   130     0     0
   203  0.65619149E-02     0   198   125   132     0     0
   203  0.19685743E-01     0   198     8     1     0     0
   203  0.19685743E-01     0   198    10     3     0     0
   203  0.65619149E-02     0   199   127   122     0     0
   203  0.65619149E-02     0   199   129   124     0     0
   203  0.65619149E-02     0   199   131   126     0     0
   203  0.19685743E-01     0   199     2     7     0     0
   203  0.19685743E-01     0   199     4     9     0     0
   203  0.79673983E-03     0   200   122   128     0     0
   203  0.79673983E-03     0   200   124   130     0     0
   203  0.79673983E-03     0   200   126   132     0     0
   203  0.40099118E-03     0   200   121   127     0     0
   203  0.40099118E-03     0   200   123   129     0     0
   203  0.40099118E-03     0   200   125   131     0     0
   203  0.13737618E-02     0   200     2     8     0     0
   203  0.13737618E-02     0   200     4    10     0     0
   203  0.17697435E-02     0   200     1     7     0     0
   203  0.17697435E-02     0   200     3     9     0     0
   203  0.17697435E-02     0   200     5    11     0     0
   9
   204  0.26733891E-03     0   123   129     0     0     0
   204  0.76569609E-01     0   125   131     0     0     0
   204  0.31170188E-02     0     3     9     0     0     0
   204  0.85811341E+00     0     5    11     0     0     0
   204  0.16798276E-01     0     6    12     0     0     0
   204  0.48559086E-04     0   450   450     0     0     0
   204  0.76130289E-03     0   429   435     0     0     0
   204  0.22162277E-01     0   429   447     0     0     0
   204  0.22162277E-01     0   441   435     0     0     0
  10
   205  0.26725663E-03     0   123   129     0     0     0
   205  0.76546282E-01     0   125   131     0     0     0
   205  0.31160887E-02     0     3     9     0     0     0
   205  0.85798723E+00     0     5    11     0     0     0
   205  0.17031115E-01     0     6    12     0     0     0
   205  0.16173430E-04     0    13    13     0     0     0
   205  0.14446548E-03     0   450   450     0     0     0
   205  0.71842229E-03     0   429   435     0     0     0
   205  0.22086453E-01     0   429   447     0     0     0
   205  0.22086453E-01     0   441   435     0     0     0
   6
   206  0.28987086E-03     0   124   129     0     0     0
   206  0.83023332E-01     0   126   131     0     0     0
   206  0.31239742E-02     0     4     9     0     0     0
   206  0.86414796E+00     0     6    11     0     0     0
   206  0.10152990E-04     0   203   198     0     0     0
   206  0.49404670E-01     0   435   430     0     0     0
   6
   207  0.28987086E-03     0   130   123     0     0     0
   207  0.83023332E-01     0   132   125     0     0     0
   207  0.31239742E-02     0    10     3     0     0     0
   207  0.86414796E+00     0    12     5     0     0     0
   207  0.10152990E-04     0   203   199     0     0     0
   207  0.49404670E-01     0   429   436     0     0     0
   0
   5
     6  0.33333334E+00   100     2     7     5     0     0
     6  0.33333334E+00   100     4     9     5     0     0
     6  0.11111111E+00   100   122   127     5     0     0
     6  0.11111111E+00   100   124   129     5     0     0
     6  0.11111111E+00   100   126   131     5     0     0
   5
    12  0.33333334E+00   100     8     1    11     0     0
    12  0.33333334E+00   100    10     3    11     0     0
    12  0.11111111E+00   100   128   121    11     0     0
    12  0.11111111E+00   100   130   123    11     0     0
    12  0.11111111E+00   100   132   125    11     0     0
     18.20910072     -0.05511374
      0.99951464     -0.00168373      0.02824832     -0.01302889
     -0.00573758     -0.99089444      0.10540085     -0.08358362
      0.01072910     -0.01558363     -0.70674574     -0.70721465
     -0.02867960      0.13372645      0.69900167     -0.70191973
     -0.99297047      0.11836234     -0.11836234     -0.99297047
     -0.98880070      0.14924201     -0.14924201     -0.98880070
     -1.40337706     -0.21369670     -1.50578690
  -2996.03002930   6226.52001953  -2539.09008789
   1929.11999512
    F
  0.00000000E+00  0.00000000E+00  0.00000000E+00  0.46746999E-01 -0.28030399E-23  0.00000000E+00  0.00000000E+00  0.00000000E+00 -0.16373100E-22 -0.46746999E-01  0.28030399E-23 -0.00000000E+00  0.00000000E+00  0.00000000E+00  0.00000000E+00  0.00000000E+00  0.00000000E+00  0.74398997E-07 -0.00000000E+00 -0.00000000E+00  0.16373100E-22 -0.00000000E+00 -0.00000000E+00 -0.74398997E-07  0.00000000E+00  0.00000000E+00  0.00000000E+00
 -0.24526800E-25  0.00000000E+00  0.00000000E+00  0.00000000E+00 -0.53700799E-24  0.00000000E+00  0.00000000E+00  0.00000000E+00 -0.22011501E-22  0.11144900E-09 -0.13025100E-37  0.00000000E+00  0.64635732E-39  0.24401401E-08  0.00000000E+00  0.00000000E+00  0.00000000E+00  0.10001900E-06  0.00000000E+00  0.00000000E+00  0.00000000E+00  0.00000000E+00  0.00000000E+00  0.00000000E+00  0.00000000E+00  0.00000000E+00  0.00000000E+00
  0.00000000E+00  0.00000000E+00  0.00000000E+00  0.00000000E+00  0.00000000E+00  0.00000000E+00  0.00000000E+00  0.00000000E+00  0.00000000E+00  0.00000000E+00  0.00000000E+00  0.00000000E+00  0.00000000E+00  0.00000000E+00  0.00000000E+00  0.00000000E+00  0.00000000E+00  0.00000000E+00  0.00000000E+00  0.00000000E+00  0.00000000E+00  0.00000000E+00  0.00000000E+00  0.00000000E+00  0.00000000E+00  0.00000000E+00  0.00000000E+00
