  65
  401   2052.6943    0.36240E-25
  402   2051.1418    0.36118E-25
  403   2052.6646    0.36241E-25
  404   2051.1123    0.36119E-25
  405   1835.0465    0.28886E-25
  406   1616.1598    0.46225E-25
  407   2052.6943    0.36240E-25
  408   2051.1418    0.36118E-25
  409   2052.6646    0.36241E-25
  410   2051.1123    0.36119E-25
  411   1835.0465    0.28886E-25
  412   1616.1598    0.46225E-25
  413   1957.1940    0.66212E-24
  414   1966.3937    0.16459E-24
  415   1957.1339    0.66214E-24
  416   1966.3942    0.16459E-24
  417   1883.6216    0.33950E-25
  418   1878.6464    0.19721E-25
  419   1957.1940    0.66212E-24
  420   1966.3937    0.16459E-24
  421   1957.1339    0.66214E-24
  422   1966.3942    0.16459E-24
  423   1883.6216    0.33950E-25
  424   1878.6464    0.19721E-25
  425    689.4823    0.20167E-23
  426    684.8459    0.20123E-23
  427    689.4085    0.20175E-23
  428    684.7717    0.20130E-23
  429    288.7110    0.89203E-12
  430    664.1844    0.16833E-24
  431    689.4823    0.20167E-23
  432    684.8459    0.20123E-23
  433    689.4085    0.20175E-23
  434    684.7717    0.20130E-23
  435    288.7110    0.89203E-12
  436    664.1844    0.16833E-24
  437    389.7333    0.19165E-22
  438      0.0000    0.10000E+31
  439    390.7965    0.47932E-19
  440      0.0000    0.10000E+31
  441    679.7747    0.16591E-24
  442      0.0000    0.10000E+31
  443    389.7333    0.19165E-22
  444      0.0000    0.10000E+31
  445    390.7965    0.47932E-19
  446      0.0000    0.10000E+31
  447    679.7747    0.16591E-24
  448      0.0000    0.10000E+31
  449   2259.1699    0.15678E-25
  450    443.6383    0.68549E-24
  451    830.0775    0.27706E-24
  452  -1165.8259    0.87093E-25
  453   1175.2943    0.82727E-25
  454    830.2251    0.27670E-24
  455   1175.3839    0.83449E-25
  456    830.2251    0.27670E-24
  457   1175.3839    0.83449E-25
  203    121.5476    0.11845E-21
  204    974.6514    0.19976E-25
  205    973.4720    0.20117E-25
  206    978.6050    0.21511E-25
  207    978.6050    0.21511E-25
  458      0.0000    0.10000E+31
    6    173.3000    0.56017E-24
   12    173.3000    0.56017E-24
   6
   401  0.15112703E-01     0   450     1     0     0     0
   401  0.32141519E+00     0   451     1     0     0     0
   401  0.20706251E-03     0   452     1     0     0     0
   401  0.68884618E-02     0   453     1     0     0     0
   401  0.63950825E+00     0   456     2     0     0     0
   401  0.16868364E-01     0   457     2     0     0     0
   6
   402  0.13794708E-01     0   450     2     0     0     0
   402  0.32278782E+00     0   451     2     0     0     0
   402  0.12439022E-03     0   452     2     0     0     0
   402  0.56892452E-02     0   453     2     0     0     0
   402  0.64871520E+00     0   454     1     0     0     0
   402  0.88885734E-02     0   455     1     0     0     0
   6
   403  0.15112847E-01     0   450     3     0     0     0
   403  0.32141551E+00     0   451     3     0     0     0
   403  0.20705935E-03     0   452     3     0     0     0
   403  0.68883519E-02     0   453     3     0     0     0
   403  0.63950813E+00     0   456     4     0     0     0
   403  0.16868064E-01     0   457     4     0     0     0
   6
   404  0.13794822E-01     0   450     4     0     0     0
   404  0.32278761E+00     0   451     4     0     0     0
   404  0.12438805E-03     0   452     4     0     0     0
   404  0.56891418E-02     0   453     4     0     0     0
   404  0.64871562E+00     0   454     3     0     0     0
   404  0.88884281E-02     0   455     3     0     0     0
   7
   405  0.31162258E-01     0   450     5     0     0     0
   405  0.17185178E+00     0   451     5     0     0     0
   405  0.87401018E-01     0   452     5     0     0     0
   405  0.68548478E-01     0   453     5     0     0     0
   405  0.32287225E+00     0   456     6     0     0     0
   405  0.22828579E+00     0   457     6     0     0     0
   405  0.89878447E-01     0   199   406     0     0     0
   6
   406  0.20083740E+00     0   450     6     0     0     0
   406  0.53808101E-01     0   451     6     0     0     0
   406  0.20200182E+00     0   452     6     0     0     0
   406  0.11693994E+00     0   453     6     0     0     0
   406  0.11645640E+00     0   454     5     0     0     0
   406  0.30995631E+00     0   455     5     0     0     0
   6
   407  0.15112703E-01     0   450     7     0     0     0
   407  0.32141519E+00     0   451     7     0     0     0
   407  0.20706251E-03     0   452     7     0     0     0
   407  0.68884618E-02     0   453     7     0     0     0
   407  0.63950825E+00     0   454     8     0     0     0
   407  0.16868364E-01     0   455     8     0     0     0
   6
   408  0.13794708E-01     0   450     8     0     0     0
   408  0.32278782E+00     0   451     8     0     0     0
   408  0.12439022E-03     0   452     8     0     0     0
   408  0.56892452E-02     0   453     8     0     0     0
   408  0.64871520E+00     0   456     7     0     0     0
   408  0.88885734E-02     0   457     7     0     0     0
   6
   409  0.15112847E-01     0   450     9     0     0     0
   409  0.32141551E+00     0   451     9     0     0     0
   409  0.20705935E-03     0   452     9     0     0     0
   409  0.68883519E-02     0   453     9     0     0     0
   409  0.63950813E+00     0   454    10     0     0     0
   409  0.16868064E-01     0   455    10     0     0     0
   6
   410  0.13794822E-01     0   450    10     0     0     0
   410  0.32278761E+00     0   451    10     0     0     0
   410  0.12438805E-03     0   452    10     0     0     0
   410  0.56891418E-02     0   453    10     0     0     0
   410  0.64871562E+00     0   456     9     0     0     0
   410  0.88884281E-02     0   457     9     0     0     0
   7
   411  0.31162258E-01     0   450    11     0     0     0
   411  0.17185178E+00     0   451    11     0     0     0
   411  0.87401018E-01     0   452    11     0     0     0
   411  0.68548478E-01     0   453    11     0     0     0
   411  0.32287225E+00     0   454    12     0     0     0
   411  0.22828579E+00     0   455    12     0     0     0
   411  0.89878447E-01     0   198   412     0     0     0
   6
   412  0.20083740E+00     0   450    12     0     0     0
   412  0.53808101E-01     0   451    12     0     0     0
   412  0.20200182E+00     0   452    12     0     0     0
   412  0.11693994E+00     0   453    12     0     0     0
   412  0.11645640E+00     0   456    11     0     0     0
   412  0.30995631E+00     0   457    11     0     0     0
   4
   413  0.99887514E+00     0   450     1     0     0     0
   413  0.10917918E-03     0   451     1     0     0     0
   413  0.16236043E-03     0   452     1     0     0     0
   413  0.85334835E-03     0   453     1     0     0     0
   4
   414  0.99886513E+00     0   450     2     0     0     0
   414  0.10951483E-03     0   451     2     0     0     0
   414  0.16386430E-03     0   452     2     0     0     0
   414  0.86147711E-03     0   453     2     0     0     0
   4
   415  0.99887514E+00     0   450     3     0     0     0
   415  0.10917697E-03     0   451     3     0     0     0
   415  0.16235054E-03     0   452     3     0     0     0
   415  0.85329515E-03     0   453     3     0     0     0
   4
   416  0.99886513E+00     0   450     4     0     0     0
   416  0.10951481E-03     0   451     4     0     0     0
   416  0.16386421E-03     0   452     4     0     0     0
   416  0.86147647E-03     0   453     4     0     0     0
   7
   417  0.25980823E-01     0   450     5     0     0     0
   417  0.58996756E-01     0   451     5     0     0     0
   417  0.12135263E+00     0   452     5     0     0     0
   417  0.13727598E+00     0   453     5     0     0     0
   417  0.10942507E+00     0   456     6     0     0     0
   417  0.43062165E+00     0   457     6     0     0     0
   417  0.11634703E+00     0   199   406     0     0     0
   8
   418  0.25096273E+00     0   454     5     0     0     0
   418  0.16391537E+00     0   455     5     0     0     0
   418  0.75709343E-01     0   200   406     0     0     0
   418  0.77511080E-01     0   203   406     0     0     0
   418  0.13195909E-01     0   450     6     0     0     0
   418  0.11770427E+00     0   451     6     0     0     0
   418  0.12765667E+00     0   452     6     0     0     0
   418  0.17334469E+00     0   453     6     0     0     0
   4
   419  0.99887514E+00     0   450     7     0     0     0
   419  0.10917918E-03     0   451     7     0     0     0
   419  0.16236043E-03     0   452     7     0     0     0
   419  0.85334835E-03     0   453     7     0     0     0
   4
   420  0.99886513E+00     0   450     8     0     0     0
   420  0.10951483E-03     0   451     8     0     0     0
   420  0.16386430E-03     0   452     8     0     0     0
   420  0.86147711E-03     0   453     8     0     0     0
   4
   421  0.99887514E+00     0   450     9     0     0     0
   421  0.10917697E-03     0   451     9     0     0     0
   421  0.16235054E-03     0   452     9     0     0     0
   421  0.85329515E-03     0   453     9     0     0     0
   4
   422  0.99886513E+00     0   450    10     0     0     0
   422  0.10951481E-03     0   451    10     0     0     0
   422  0.16386421E-03     0   452    10     0     0     0
   422  0.86147647E-03     0   453    10     0     0     0
   7
   423  0.25980823E-01     0   450    11     0     0     0
   423  0.58996756E-01     0   451    11     0     0     0
   423  0.12135263E+00     0   452    11     0     0     0
   423  0.13727598E+00     0   453    11     0     0     0
   423  0.10942507E+00     0   454    12     0     0     0
   423  0.43062165E+00     0   455    12     0     0     0
   423  0.11634703E+00     0   198   412     0     0     0
   8
   424  0.25096273E+00     0   456    11     0     0     0
   424  0.16391537E+00     0   457    11     0     0     0
   424  0.75709343E-01     0   200   412     0     0     0
   424  0.77511080E-01     0   203   412     0     0     0
   424  0.13195909E-01     0   450    12     0     0     0
   424  0.11770427E+00     0   451    12     0     0     0
   424  0.12765667E+00     0   452    12     0     0     0
   424  0.17334469E+00     0   453    12     0     0     0
   4
   425  0.90691018E+00     0   450   121     0     0     0
   425  0.13025399E-04     0   429   121   131     0     0
   425  0.33185730E-04     0   435   121   125     0     0
   425  0.93043640E-01     0   121   130     0     0     0
   5
   426  0.90758914E+00     0   450   122     0     0     0
   426  0.10705562E-04     0   429   122   131     0     0
   426  0.28866247E-04     0   435   122   125     0     0
   426  0.15637449E-03     0   435   121   126     0     0
   426  0.92214890E-01     0   129   121     0     0     0
   4
   427  0.90688467E+00     0   450   123     0     0     0
   427  0.13015834E-04     0   429   123   131     0     0
   427  0.33168250E-04     0   435   123   125     0     0
   427  0.93069188E-01     0   121   128     0     0     0
   5
   428  0.90756291E+00     0   450   124     0     0     0
   428  0.10697603E-04     0   429   124   131     0     0
   428  0.28850938E-04     0   435   124   125     0     0
   428  0.15632722E-03     0   435   123   126     0     0
   428  0.92241161E-01     0   127   121     0     0     0
   3
   429  0.19601317E-01     0   125   130     0     0     0
   429  0.49018085E+00     0   125   124     0     0     0
   429  0.49021786E+00     0   123   126     0     0     0
   2
   430  0.67056425E-01     0   450   126     0     0     0
   430  0.93294358E+00     0   198   429     0     0     0
   4
   431  0.90691018E+00     0   450   127     0     0     0
   431  0.13025399E-04     0   435   127   125     0     0
   431  0.33185730E-04     0   429   127   131     0     0
   431  0.93043640E-01     0   127   124     0     0     0
   5
   432  0.90758914E+00     0   450   128     0     0     0
   432  0.10705562E-04     0   435   128   125     0     0
   432  0.28866247E-04     0   429   128   131     0     0
   432  0.15637449E-03     0   429   127   132     0     0
   432  0.92214890E-01     0   123   127     0     0     0
   4
   433  0.90688467E+00     0   450   129     0     0     0
   433  0.13015834E-04     0   435   129   125     0     0
   433  0.33168250E-04     0   429   129   131     0     0
   433  0.93069188E-01     0   127   122     0     0     0
   5
   434  0.90756291E+00     0   450   130     0     0     0
   434  0.10697603E-04     0   435   130   125     0     0
   434  0.28850938E-04     0   429   130   131     0     0
   434  0.15632722E-03     0   429   129   132     0     0
   434  0.92241161E-01     0   121   127     0     0     0
   3
   435  0.19601317E-01     0   131   124     0     0     0
   435  0.49018085E+00     0   131   130     0     0     0
   435  0.49021786E+00     0   129   132     0     0     0
   2
   436  0.67056425E-01     0   450   132     0     0     0
   436  0.93294358E+00     0   199   435     0     0     0
   4
   437  0.14237070E-03     0   429   121   131     0     0
   437  0.23458747E-03     0   435   121   125     0     0
   437  0.49981147E+00     0   123   122     0     0     0
   437  0.49981159E+00     0   121   124     0     0     0
   0
   2
   439  0.37865809E+00     0   429   123   131     0     0
   439  0.62134194E+00     0   435   123   125     0     0
   0
   3
   441  0.77231929E-01     0   450   125     0     0     0
   441  0.48220465E+00     0   200   429     0     0     0
   441  0.44056347E+00     0   203   429     0     0     0
   0
   4
   443  0.14237070E-03     0   435   127   125     0     0
   443  0.23458747E-03     0   429   127   131     0     0
   443  0.49981147E+00     0   129   128     0     0     0
   443  0.49981159E+00     0   127   130     0     0     0
   0
   2
   445  0.37865809E+00     0   435   129   125     0     0
   445  0.62134194E+00     0   429   129   131     0     0
   0
   3
   447  0.77231929E-01     0   450   131     0     0     0
   447  0.48220465E+00     0   200   435     0     0     0
   447  0.44056347E+00     0   203   435     0     0     0
   0
  24
   449  0.17646594E-01     0   408     2     0     0     0
   449  0.17646594E-01     0   402     8     0     0     0
   449  0.17396713E-01     0   407     1     0     0     0
   449  0.17396713E-01     0   401     7     0     0     0
   449  0.33592377E-01     0   420     2     0     0     0
   449  0.33592377E-01     0   414     8     0     0     0
   449  0.35581201E-01     0   419     1     0     0     0
   449  0.35581201E-01     0   413     7     0     0     0
   449  0.17401474E-01     0   409     3     0     0     0
   449  0.17401474E-01     0   403     9     0     0     0
   449  0.35594322E-01     0   421     3     0     0     0
   449  0.35594322E-01     0   415     9     0     0     0
   449  0.17651035E-01     0   410     4     0     0     0
   449  0.17651035E-01     0   404    10     0     0     0
   449  0.33591956E-01     0   422     4     0     0     0
   449  0.33591956E-01     0   416    10     0     0     0
   449  0.65345965E-01     0   411     5     0     0     0
   449  0.65345965E-01     0   405    11     0     0     0
   449  0.53867217E-01     0   423     5     0     0     0
   449  0.53867217E-01     0   417    11     0     0     0
   449  0.10939947E+00     0   412     6     0     0     0
   449  0.10939947E+00     0   406    12     0     0     0
   449  0.62931679E-01     0   424     6     0     0     0
   449  0.62931679E-01     0   418    12     0     0     0
   6
   450  0.61068643E-01     0   437   127     0     0     0
   450  0.61068643E-01     0   443   121     0     0     0
   450  0.58833133E-01     0   439   129     0     0     0
   450  0.58833133E-01     0   445   123     0     0     0
   450  0.38009822E+00     0   429   131     0     0     0
   450  0.38009822E+00     0   435   125     0     0     0
  20
   451  0.60704659E-03     0   450   200     0     0     0
   451  0.70169135E-02     0   450   203     0     0     0
   451  0.69502190E-01     0   425   127     0     0     0
   451  0.69502190E-01     0   431   121     0     0     0
   451  0.69568396E-01     0   427   129     0     0     0
   451  0.69568396E-01     0   433   123     0     0     0
   451  0.78778561E-04     0   437   127     0     0     0
   451  0.78778561E-04     0   443   121     0     0     0
   451  0.78535319E-04     0   439   129     0     0     0
   451  0.78535319E-04     0   445   123     0     0     0
   451  0.48930071E-01     0   429   131     0     0     0
   451  0.48930071E-01     0   435   125     0     0     0
   451  0.73385917E-01     0   441   131     0     0     0
   451  0.73385917E-01     0   447   125     0     0     0
   451  0.71748950E-01     0   426   128     0     0     0
   451  0.71748950E-01     0   432   122     0     0     0
   451  0.71815304E-01     0   428   130     0     0     0
   451  0.71815304E-01     0   434   124     0     0     0
   451  0.91079861E-01     0   430   132     0     0     0
   451  0.91079861E-01     0   436   126     0     0     0
  25
   452  0.22895057E+00     0   454   199     0     0     0
   452  0.22895057E+00     0   456   198     0     0     0
   452  0.84689185E-01     0   450   200     0     0     0
   452  0.21578167E+00     0   451   200     0     0     0
   452  0.96034993E-04     0   450     5    11     0     0
   452  0.14671290E-01     0   450   203     0     0     0
   452  0.48824078E-02     0   451   203     0     0     0
   452  0.40026607E-04     0   425   127     0     0     0
   452  0.40026607E-04     0   431   121     0     0     0
   452  0.40035822E-04     0   427   129     0     0     0
   452  0.40035822E-04     0   433   123     0     0     0
   452  0.10850380E-03     0   437   127     0     0     0
   452  0.10850380E-03     0   443   121     0     0     0
   452  0.10835471E-03     0   439   129     0     0     0
   452  0.10835471E-03     0   445   123     0     0     0
   452  0.72205737E-01     0   429   131     0     0     0
   452  0.72205737E-01     0   435   125     0     0     0
   452  0.37881341E-01     0   441   131     0     0     0
   452  0.37881341E-01     0   447   125     0     0     0
   452  0.19747509E-03     0   426   128     0     0     0
   452  0.19747509E-03     0   432   122     0     0     0
   452  0.19752028E-03     0   428   130     0     0     0
   452  0.19752028E-03     0   434   124     0     0     0
   452  0.21003593E-03     0   430   132     0     0     0
   452  0.21003593E-03     0   436   126     0     0     0
  25
   453  0.22821461E+00     0   454   199     0     0     0
   453  0.22821461E+00     0   456   198     0     0     0
   453  0.14561511E-01     0   450   200     0     0     0
   453  0.61281375E-02     0   451   200     0     0     0
   453  0.91310460E-04     0   450     5    11     0     0
   453  0.76935366E-01     0   450   203     0     0     0
   453  0.19746955E+00     0   451   203     0     0     0
   453  0.29007143E-02     0   425   127     0     0     0
   453  0.29007143E-02     0   431   121     0     0     0
   453  0.29013657E-02     0   427   129     0     0     0
   453  0.29013657E-02     0   433   123     0     0     0
   453  0.55827387E-03     0   437   127     0     0     0
   453  0.55827387E-03     0   443   121     0     0     0
   453  0.55752049E-03     0   439   129     0     0     0
   453  0.55752049E-03     0   445   123     0     0     0
   453  0.59196807E-01     0   429   131     0     0     0
   453  0.59196807E-01     0   435   125     0     0     0
   453  0.42304169E-01     0   441   131     0     0     0
   453  0.42304169E-01     0   447   125     0     0     0
   453  0.51509715E-02     0   426   128     0     0     0
   453  0.51509715E-02     0   432   122     0     0     0
   453  0.51521203E-02     0   428   130     0     0     0
   453  0.51521203E-02     0   434   124     0     0     0
   453  0.54705297E-02     0   430   132     0     0     0
   453  0.54705297E-02     0   436   126     0     0     0
   8
   454  0.75458619E-02     0   450   198     0     0     0
   454  0.14689501E+00     0   426   127     0     0     0
   454  0.14703068E+00     0   428   129     0     0     0
   454  0.18881547E+00     0   430   131     0     0     0
   454  0.13590911E+00     0   431   122     0     0     0
   454  0.13603847E+00     0   433   124     0     0     0
   454  0.96353054E-01     0   435   126     0     0     0
   454  0.14141236E+00     0   447   126     0     0     0
  11
   455  0.90648472E-01     0   450   198     0     0     0
   455  0.23176894E+00     0   451   198     0     0     0
   455  0.56910366E-02     0   426   127     0     0     0
   455  0.56923060E-02     0   428   129     0     0     0
   455  0.78568518E-01     0   430   131     0     0     0
   455  0.10590312E-01     0   431   122     0     0     0
   455  0.10592691E-01     0   433   124     0     0     0
   455  0.11296769E+00     0   435   126     0     0     0
   455  0.23743290E-01     0   447   126     0     0     0
   455  0.22424352E+00     0   454   200     0     0     0
   455  0.20549324E+00     0   454   203     0     0     0
   8
   456  0.75458619E-02     0   450   199     0     0     0
   456  0.14689501E+00     0   432   121     0     0     0
   456  0.14703068E+00     0   434   123     0     0     0
   456  0.18881547E+00     0   436   125     0     0     0
   456  0.13590911E+00     0   425   128     0     0     0
   456  0.13603847E+00     0   427   130     0     0     0
   456  0.96353054E-01     0   429   132     0     0     0
   456  0.14141236E+00     0   441   132     0     0     0
  11
   457  0.90648472E-01     0   450   199     0     0     0
   457  0.23176894E+00     0   451   199     0     0     0
   457  0.56910366E-02     0   432   121     0     0     0
   457  0.56923060E-02     0   434   123     0     0     0
   457  0.78568518E-01     0   436   125     0     0     0
   457  0.10590312E-01     0   425   128     0     0     0
   457  0.10592691E-01     0   427   130     0     0     0
   457  0.11296769E+00     0   429   132     0     0     0
   457  0.23743290E-01     0   441   132     0     0     0
   457  0.22424352E+00     0   456   200     0     0     0
   457  0.20549324E+00     0   456   203     0     0     0
  28
   203  0.16368668E-03     0   123   129     0     0     0
   203  0.46822477E-01     0   125   131     0     0     0
   203  0.19644203E-02     0     3     9     0     0     0
   203  0.77074456E+00     0     5    11     0     0     0
   203  0.37539545E-01     0     4    10     0     0     0
   203  0.16993077E-02     0    59    59     0     0     0
   203  0.33565681E-01     0    13    13     0     0     0
   203  0.54635317E-02     0   198   121   128     0     0
   203  0.54635317E-02     0   198   123   130     0     0
   203  0.54635317E-02     0   198   125   132     0     0
   203  0.16390594E-01     0   198     8     1     0     0
   203  0.16390594E-01     0   198    10     3     0     0
   203  0.54635317E-02     0   199   127   122     0     0
   203  0.54635317E-02     0   199   129   124     0     0
   203  0.54635317E-02     0   199   131   126     0     0
   203  0.16390594E-01     0   199     2     7     0     0
   203  0.16390594E-01     0   199     4     9     0     0
   203  0.62620867E-03     0   200   122   128     0     0
   203  0.62620867E-03     0   200   124   130     0     0
   203  0.62620867E-03     0   200   126   132     0     0
   203  0.31516454E-03     0   200   121   127     0     0
   203  0.31516454E-03     0   200   123   129     0     0
   203  0.31516454E-03     0   200   125   131     0     0
   203  0.10797270E-02     0   200     2     8     0     0
   203  0.10797270E-02     0   200     4    10     0     0
   203  0.13909545E-02     0   200     1     7     0     0
   203  0.13909545E-02     0   200     3     9     0     0
   203  0.13909545E-02     0   200     5    11     0     0
   9
   204  0.23422092E-03     0   123   129     0     0     0
   204  0.67083128E-01     0   125   131     0     0     0
   204  0.27464863E-02     0     3     9     0     0     0
   204  0.82156056E+00     0     5    11     0     0     0
   204  0.13386501E-02     0     6    12     0     0     0
   204  0.10629973E-04     0   450   450     0     0     0
   204  0.43323103E-01     0   429   435     0     0     0
   204  0.31851612E-01     0   429   447     0     0     0
   204  0.31851612E-01     0   441   435     0     0     0
  10
   205  0.23559034E-03     0   123   129     0     0     0
   205  0.67476235E-01     0   125   131     0     0     0
   205  0.27625721E-02     0     3     9     0     0     0
   205  0.82652974E+00     0     5    11     0     0     0
   205  0.14634321E-02     0     6    12     0     0     0
   205  0.16227348E-04     0    13    13     0     0     0
   205  0.65224041E-04     0   450   450     0     0     0
   205  0.43634582E-01     0   429   435     0     0     0
   205  0.28908215E-01     0   429   447     0     0     0
   205  0.28908215E-01     0   441   435     0     0     0
   5
   206  0.25323915E-03     0   124   129     0     0     0
   206  0.72531089E-01     0   126   131     0     0     0
   206  0.27288736E-02     0     4     9     0     0     0
   206  0.76675045E+00     0     6    11     0     0     0
   206  0.15773632E+00     0   435   430     0     0     0
   5
   207  0.25323915E-03     0   130   123     0     0     0
   207  0.72531089E-01     0   132   125     0     0     0
   207  0.27288736E-02     0    10     3     0     0     0
   207  0.76675045E+00     0    12     5     0     0     0
   207  0.15773632E+00     0   429   436     0     0     0
   0
   5
     6  0.33333334E+00   100     2     7     5     0     0
     6  0.33333334E+00   100     4     9     5     0     0
     6  0.11111111E+00   100   122   127     5     0     0
     6  0.11111111E+00   100   124   129     5     0     0
     6  0.11111111E+00   100   126   131     5     0     0
   5
    12  0.33333334E+00   100     8     1    11     0     0
    12  0.33333334E+00   100    10     3    11     0     0
    12  0.11111111E+00   100   128   121    11     0     0
    12  0.11111111E+00   100   130   123    11     0     0
    12  0.11111111E+00   100   132   125    11     0     0
     33.04529953     -0.03073298
      0.99881309     -0.00397795      0.04496653     -0.01829147
     -0.01207844     -0.98486829      0.13978049     -0.10173557
      0.01872301     -0.02736650     -0.70605159     -0.70738339
     -0.04331233      0.17108428      0.69276989     -0.69923073
     -0.98954731      0.14420852     -0.14420852     -0.98954731
     -0.98018104      0.19810380     -0.19810380     -0.98018104
     -1.27035868     -0.65134966     -1.37342978
  -1730.38000488   9149.33007813  -3243.62011719
   1163.76000977
    F
  0.00000000E+00  0.00000000E+00  0.00000000E+00  0.47052301E-01  0.39043002E-20  0.00000000E+00  0.00000000E+00  0.00000000E+00  0.22873000E-19 -0.47052301E-01 -0.39043002E-20 -0.00000000E+00  0.00000000E+00  0.00000000E+00  0.00000000E+00  0.00000000E+00  0.00000000E+00  0.25592101E-06 -0.00000000E+00 -0.00000000E+00 -0.22873000E-19 -0.00000000E+00 -0.00000000E+00 -0.25592101E-06  0.00000000E+00  0.00000000E+00  0.00000000E+00
  0.33550601E-22  0.14012985E-44  0.00000000E+00  0.00000000E+00  0.73458202E-21  0.00000000E+00  0.00000000E+00  0.00000000E+00  0.28661899E-19  0.37539100E-09  0.13055800E-31  0.00000000E+00  0.61227001E-33  0.82190903E-08  0.00000000E+00  0.00000000E+00  0.00000000E+00  0.32069201E-06  0.00000000E+00  0.00000000E+00  0.00000000E+00  0.00000000E+00  0.00000000E+00  0.00000000E+00  0.00000000E+00  0.00000000E+00  0.00000000E+00
  0.00000000E+00  0.00000000E+00  0.00000000E+00  0.00000000E+00  0.00000000E+00  0.00000000E+00  0.00000000E+00  0.00000000E+00  0.00000000E+00  0.00000000E+00  0.00000000E+00  0.00000000E+00  0.00000000E+00  0.00000000E+00  0.00000000E+00  0.00000000E+00  0.00000000E+00  0.00000000E+00  0.00000000E+00  0.00000000E+00  0.00000000E+00  0.00000000E+00  0.00000000E+00  0.00000000E+00  0.00000000E+00  0.00000000E+00  0.00000000E+00
