#  ISAJET SUSY parameters in SUSY Les Houches Accord 2 format
#  Created by ISALHA 2.0 Last revision: C. Balazs 21 Apr 2009
Block SPINFO   # Program information
     1   ISASUGRA from ISAJET          # Spectrum Calculator
     2   7.80   29-OCT-2009 12:50:36   # Version number
Block MODSEL   # Model selection
     1     1   # Minimal supergravity (mSUGRA) model               
Block SMINPUTS   # Standard Model inputs
     1     1.27840721E+02   # alpha_em^(-1)
     2     1.16570000E-05   # G_Fermi
     3     1.17200002E-01   # alpha_s(M_Z)
     4     9.11699982E+01   # m_{Z}(pole)
     5     4.19999981E+00   # m_{b}(m_{b})
     6     1.72500000E+02   # m_{top}(pole)
     7     1.77699995E+00   # m_{tau}(pole)
Block MINPAR   # SUSY breaking input parameters
     1     2.06000000E+03   # m_0
     2     3.10000000E+02   # m_{1/2}
     3     4.00000000E+01   # tan(beta)
     4     1.00000000E+00   # sign(mu)
     5    -5.00000000E+02   # A_0
Block EXTPAR   # Non-universal SUSY breaking parameters
     0     2.19562400E+16   # Input scale
Block MASS   # Scalar and gaugino mass spectrum
#  PDG code   mass                 particle
        24     8.04229965E+01   #  W^+
        25     1.16191650E+02   #  h^0            
        35     1.45439209E+03   #  H^0            
        36     1.44487720E+03   #  A^0            
        37     1.45708472E+03   #  H^+            
   1000001     2.13855176E+03   #  dnl            
   1000002     2.13702344E+03   #  upl            
   1000003     2.13855176E+03   #  stl            
   1000004     2.13702393E+03   #  chl            
   1000005     1.60397986E+03   #  b1             
   1000006     1.27528699E+03   #  t1             
   1000011     2.06666309E+03   #  el-            
   1000012     2.06550342E+03   #  nuel           
   1000013     2.06666309E+03   #  mul-           
   1000014     2.06550342E+03   #  numl           
   1000015     1.72782520E+03   #  tau1           
   1000016     1.90644104E+03   #  nutl           
   1000021     8.41610352E+02   #  glss           
   1000022     1.29795914E+02   #  z1ss           
   1000023     2.41522430E+02   #  z2ss           
   1000024     2.42904556E+02   #  w1ss           
   1000025    -3.81070526E+02   #  z3ss           
   1000035     4.02791534E+02   #  z4ss           
   1000037     4.02180634E+02   #  w2ss           
   2000001     2.13923340E+03   #  dnr            
   2000002     2.13839038E+03   #  upr            
   2000003     2.13923340E+03   #  str            
   2000004     2.13839087E+03   #  chr            
   2000005     1.85518005E+03   #  b2             
   2000006     1.61849731E+03   #  t2             
   2000011     2.06131519E+03   #  er-            
   2000013     2.06131519E+03   #  mur-           
   2000015     1.90745496E+03   #  tau2           
Block ALPHA   # Effective Higgs mixing parameter
         -2.52215918E-02   # alpha
Block STOPMIX   # stop mixing matrix
  1  1     8.93569589E-02   # O_{11}
  1  2     9.95999694E-01   # O_{12}
  2  1    -9.95999694E-01   # O_{21}
  2  2     8.93569589E-02   # O_{22}
Block SBOTMIX   # sbottom mixing matrix
  1  1     9.98637259E-01   # O_{11}
  1  2     5.21884598E-02   # O_{12}
  2  1    -5.21884598E-02   # O_{21}
  2  2     9.98637259E-01   # O_{22}
Block STAUMIX   # stau mixing matrix
  1  1     5.40188514E-02   # O_{11}
  1  2     9.98539925E-01   # O_{12}
  2  1    -9.98539925E-01   # O_{21}
  2  2     5.40188514E-02   # O_{22}
Block NMIX   # neutralino mixing matrix
  1  1     9.88488555E-01   #
  1  2    -3.46275866E-02   #
  1  3     1.38367265E-01   #
  1  4    -5.04547916E-02   #
  2  1     8.73525441E-02   #
  2  2     9.20422792E-01   #
  2  3    -3.16126794E-01   #
  2  4     2.12732926E-01   #
  3  1     5.85696101E-02   #
  3  2    -8.11026022E-02   #
  3  3    -6.97466433E-01   #
  3  4    -7.09600449E-01   #
  4  1     1.08762927E-01   #
  4  2    -3.80847961E-01   #
  4  3    -6.28059804E-01   #
  4  4     6.69825613E-01   #
Block UMIX   # chargino U mixing matrix
  1  1    -8.96609485E-01   # U_{11}
  1  2     4.42822069E-01   # U_{12}
  2  1    -4.42822069E-01   # U_{21}
  2  2    -8.96609485E-01   # U_{22}
Block VMIX   # chargino V mixing matrix
  1  1    -9.55535710E-01   # V_{11}
  1  2     2.94875443E-01   # V_{12}
  2  1    -2.94875443E-01   # V_{21}
  2  2    -9.55535710E-01   # V_{22}
Block GAUGE Q=  1.41399670E+03   #
     1     3.57503265E-01   # g`
     2     6.52461290E-01   # g_2
     3     1.22054613E+00   # g_3
Block YU Q=  1.41399670E+03   #
  3  3     8.51776540E-01   # y_t
Block YD Q=  1.41399670E+03   #
  3  3     5.17887831E-01   # y_b
Block YE Q=  1.41399670E+03   #
  3  3     4.08916771E-01   # y_tau
Block HMIX Q=  1.41399670E+03   # Higgs mixing parameters
     1     3.69770905E+02   # mu(Q)
     2     4.00000000E+01   # tan(beta)(M_GUT)
     3     2.51444992E+02   # Higgs vev at Q
     4     2.08767012E+06   # m_A^2(Q)
Block MSOFT Q=  1.41399670E+03   # DRbar SUSY breaking parameters
     1     1.32307617E+02   # M_1(Q)          
     2     2.44997665E+02   # M_2(Q)          
     3     7.18087036E+02   # M_3(Q)          
    31     2.05952148E+03   # MeL(Q)          
    32     2.05952148E+03   # MmuL(Q)         
    33     1.90337402E+03   # MtauL(Q)        
    34     2.05898096E+03   # MeR(Q)          
    35     2.05898096E+03   # MmuR(Q)         
    36     1.72999927E+03   # MtauR(Q)        
    41     2.10030518E+03   # MqL1(Q)         
    42     2.10030518E+03   # MqL2(Q)         
    43     1.57843726E+03   # MqL3(Q)         
    44     2.10128540E+03   # MuR(Q)          
    45     2.10128540E+03   # McR(Q)          
    46     1.26668738E+03   # MtR(Q)          
    47     2.10166431E+03   # MdR(Q)          
    48     2.10166431E+03   # MsR(Q)          
    49     1.83071716E+03   # MbR(Q)          
Block AU Q=  1.41399670E+03   #
  1  1    -6.68967651E+02   # A_u
  2  2    -6.68967651E+02   # A_c
  3  3    -6.68967651E+02   # A_t
Block AD Q=  1.41399670E+03   #
  1  1    -9.67067932E+02   # A_d
  2  2    -9.67067932E+02   # A_s
  3  3    -9.67067932E+02   # A_b
Block AE Q=  1.41399670E+03   #
  1  1    -4.51277557E+02   # A_e
  2  2    -4.51277557E+02   # A_mu
  3  3    -4.51277557E+02   # A_tau
#  ISAJET decay tables in SUSY Les Houches accord format
#  Created by ISALHD. Last revision: C. Balazs, 2005 May 25
Block DCINFO                           # Program information
     1   ISASUGRA from ISAJET          # Spectrum Calculator
     2   7.80   29-OCT-2009 12:50:36   # Version number
#         PDG         Width
DECAY         6  1.14680779E+00   # TP    decays
#          BR          NDA       ID1       ID2       ID3       ID4
      3.33333343E-01    3            2        -1         5             # TP     -->  UP     DB     BT          
      3.33333343E-01    3            4        -3         5             # TP     -->  CH     SB     BT          
      1.11111112E-01    3          -11        12         5             # TP     -->  E+     NUE    BT          
      1.11111112E-01    3          -13        14         5             # TP     -->  MU+    NUM    BT          
      1.11111112E-01    3          -15        16         5             # TP     -->  TAU+   NUT    BT          
#         PDG         Width
DECAY   1000021  2.06818106E-03   # GLSS  decays
#          BR          NDA       ID1       ID2       ID3       ID4
      3.77986506E-02    3      1000024         1        -2             # GLSS   -->  W1SS+  DN     UB          
      3.77986506E-02    3     -1000024         2        -1             # GLSS   -->  W1SS-  UP     DB          
      3.77986319E-02    3      1000024         3        -4             # GLSS   -->  W1SS+  ST     CB          
      3.77986319E-02    3     -1000024         4        -3             # GLSS   -->  W1SS-  CH     SB          
      7.44130090E-02    3      1000024         5        -6             # GLSS   -->  W1SS+  BT     TB          
      7.44130090E-02    3     -1000024         6        -5             # GLSS   -->  W1SS-  TP     BB          
      2.33204733E-03    3      1000037         1        -2             # GLSS   -->  W2SS+  DN     UB          
      2.33204733E-03    3     -1000037         2        -1             # GLSS   -->  W2SS-  UP     DB          
      2.33204686E-03    3      1000037         3        -4             # GLSS   -->  W2SS+  ST     CB          
      2.33204686E-03    3     -1000037         4        -3             # GLSS   -->  W2SS-  CH     SB          
      1.15062483E-01    3      1000037         5        -6             # GLSS   -->  W2SS+  BT     TB          
      1.15062483E-01    3     -1000037         6        -5             # GLSS   -->  W2SS-  TP     BB          
      4.06921536E-05    2      1000022        21                       # GLSS   -->  Z1SS   GL                 
      1.65587720E-02    3      1000022         2        -2             # GLSS   -->  Z1SS   UP     UB          
      5.38021047E-03    3      1000022         1        -1             # GLSS   -->  Z1SS   DN     DB          
      5.38021047E-03    3      1000022         3        -3             # GLSS   -->  Z1SS   ST     SB          
      1.65587552E-02    3      1000022         4        -4             # GLSS   -->  Z1SS   CH     CB          
      1.70958564E-02    3      1000022         5        -5             # GLSS   -->  Z1SS   BT     BB          
      5.84871881E-02    3      1000022         6        -6             # GLSS   -->  Z1SS   TP     TB          
      3.73018021E-03    2      1000023        21                       # GLSS   -->  Z2SS   GL                 
      1.95439514E-02    3      1000023         2        -2             # GLSS   -->  Z2SS   UP     UB          
      1.81129463E-02    3      1000023         1        -1             # GLSS   -->  Z2SS   DN     DB          
      1.81129463E-02    3      1000023         3        -3             # GLSS   -->  Z2SS   ST     SB          
      1.95439365E-02    3      1000023         4        -4             # GLSS   -->  Z2SS   CH     CB          
      8.11156705E-02    3      1000023         5        -5             # GLSS   -->  Z2SS   BT     BB          
      1.46802329E-02    3      1000023         6        -6             # GLSS   -->  Z2SS   TP     TB          
      2.33188197E-02    2      1000025        21                       # GLSS   -->  Z3SS   GL                 
      2.69566372E-05    3      1000025         2        -2             # GLSS   -->  Z3SS   UP     UB          
      3.51987292E-05    3      1000025         1        -1             # GLSS   -->  Z3SS   DN     DB          
      3.51987292E-05    3      1000025         3        -3             # GLSS   -->  Z3SS   ST     SB          
      2.69566117E-05    3      1000025         4        -4             # GLSS   -->  Z3SS   CH     CB          
      3.53991464E-02    3      1000025         5        -5             # GLSS   -->  Z3SS   BT     BB          
      1.66260414E-02    3      1000025         6        -6             # GLSS   -->  Z3SS   TP     TB          
      1.94358639E-02    2      1000035        21                       # GLSS   -->  Z4SS   GL                 
      1.14922994E-03    3      1000035         2        -2             # GLSS   -->  Z4SS   UP     UB          
      1.36038230E-03    3      1000035         1        -1             # GLSS   -->  Z4SS   DN     DB          
      1.36038230E-03    3      1000035         3        -3             # GLSS   -->  Z4SS   ST     SB          
      1.14922901E-03    3      1000035         4        -4             # GLSS   -->  Z4SS   CH     CB          
      2.95002107E-02    3      1000035         5        -5             # GLSS   -->  Z4SS   BT     BB          
      3.67611088E-02    3      1000035         6        -6             # GLSS   -->  Z4SS   TP     TB          
#         PDG         Width
DECAY   1000002  1.13375702E+02   # UPL   decays
#          BR          NDA       ID1       ID2       ID3       ID4
      1.68962835E-03    2      1000022         2                       # UPL    -->  Z1SS   UP                 
      6.78082705E-02    2      1000023         2                       # UPL    -->  Z2SS   UP                 
      3.68329580E-04    2      1000025         2                       # UPL    -->  Z3SS   UP                 
      9.61410906E-03    2      1000035         2                       # UPL    -->  Z4SS   UP                 
      7.66515911E-01    2      1000021         2                       # UPL    -->  GLSS   UP                 
      1.41166016E-01    2      1000024         1                       # UPL    -->  W1SS+  DN                 
      1.28376922E-02    2      1000037         1                       # UPL    -->  W2SS+  DN                 
#         PDG         Width
DECAY   1000001  1.13402260E+02   # DNL   decays
#          BR          NDA       ID1       ID2       ID3       ID4
      3.66697577E-03    2      1000022         1                       # DNL    -->  Z1SS   DN                 
      6.32848367E-02    2      1000023         1                       # DNL    -->  Z2SS   DN                 
      6.27596630E-04    2      1000025         1                       # DNL    -->  Z3SS   DN                 
      1.18614156E-02    2      1000035         1                       # DNL    -->  Z4SS   DN                 
      7.67234564E-01    2      1000021         1                       # DNL    -->  GLSS   DN                 
      1.24356374E-01    2     -1000024         2                       # DNL    -->  W1SS-  UP                 
      2.89682690E-02    2     -1000037         2                       # DNL    -->  W2SS-  UP                 
#         PDG         Width
DECAY   1000003  1.13402252E+02   # STL   decays
#          BR          NDA       ID1       ID2       ID3       ID4
      3.66697600E-03    2      1000022         3                       # STL    -->  Z1SS   ST                 
      6.32848367E-02    2      1000023         3                       # STL    -->  Z2SS   ST                 
      6.27596630E-04    2      1000025         3                       # STL    -->  Z3SS   ST                 
      1.18614165E-02    2      1000035         3                       # STL    -->  Z4SS   ST                 
      7.67234623E-01    2      1000021         3                       # STL    -->  GLSS   ST                 
      1.24356292E-01    2     -1000024         4                       # STL    -->  W1SS-  CH                 
      2.89682429E-02    2     -1000037         4                       # STL    -->  W2SS-  CH                 
#         PDG         Width
DECAY   1000004  1.13375618E+02   # CHL   decays
#          BR          NDA       ID1       ID2       ID3       ID4
      1.68962858E-03    2      1000022         4                       # CHL    -->  Z1SS   CH                 
      6.78082779E-02    2      1000023         4                       # CHL    -->  Z2SS   CH                 
      3.68329638E-04    2      1000025         4                       # CHL    -->  Z3SS   CH                 
      9.61411092E-03    2      1000035         4                       # CHL    -->  Z4SS   CH                 
      7.66515851E-01    2      1000021         4                       # CHL    -->  GLSS   CH                 
      1.41166165E-01    2      1000024         3                       # CHL    -->  W1SS+  ST                 
      1.28377033E-02    2      1000037         3                       # CHL    -->  W2SS+  ST                 
#         PDG         Width
DECAY   1000005  9.65936813E+01   # BT1   decays
#          BR          NDA       ID1       ID2       ID3       ID4
      5.55433007E-03    2      1000022         5                       # BT1    -->  Z1SS   BT                 
      6.50821775E-02    2      1000023         5                       # BT1    -->  Z2SS   BT                 
      3.84881794E-02    2      1000025         5                       # BT1    -->  Z3SS   BT                 
      3.87071110E-02    2      1000035         5                       # BT1    -->  Z4SS   BT                 
      5.10960221E-01    2      1000021         5                       # BT1    -->  GLSS   BT                 
      1.24417923E-01    2     -1000024         6                       # BT1    -->  W1SS-  TP                 
      2.06756175E-01    2     -1000037         6                       # BT1    -->  W2SS-  TP                 
      1.00339409E-02    2          -24   1000006                       # BT1    -->  W-     TP1                
#         PDG         Width
DECAY   1000006  5.44072189E+01   # TP1   decays
#          BR          NDA       ID1       ID2       ID3       ID4
      4.18948203E-01    2      1000021         6                       # TP1    -->  GLSS   TP                 
      4.98172976E-02    2      1000022         6                       # TP1    -->  Z1SS   TP                 
      1.96114741E-02    2      1000023         6                       # TP1    -->  Z2SS   TP                 
      1.35554358E-01    2      1000025         6                       # TP1    -->  Z3SS   TP                 
      1.06219664E-01    2      1000035         6                       # TP1    -->  Z4SS   TP                 
      3.95089015E-02    2      1000024         5                       # TP1    -->  W1SS+  BT                 
      2.30340138E-01    2      1000037         5                       # TP1    -->  W2SS+  BT                 
#         PDG         Width
DECAY   2000002  9.17886505E+01   # UPR   decays
#          BR          NDA       ID1       ID2       ID3       ID4
      5.10800816E-02    2      1000022         2                       # UPR    -->  Z1SS   UP                 
      3.91664129E-04    2      1000023         2                       # UPR    -->  Z2SS   UP                 
      1.69366642E-04    2      1000025         2                       # UPR    -->  Z3SS   UP                 
      5.79559943E-04    2      1000035         2                       # UPR    -->  Z4SS   UP                 
      9.47779298E-01    2      1000021         2                       # UPR    -->  GLSS   UP                 
#         PDG         Width
DECAY   2000001  8.82503433E+01   # DNR   decays
#          BR          NDA       ID1       ID2       ID3       ID4
      1.32873347E-02    2      1000022         1                       # DNR    -->  Z1SS   DN                 
      1.01884078E-04    2      1000023         1                       # DNR    -->  Z2SS   DN                 
      4.40589465E-05    2      1000025         1                       # DNR    -->  Z3SS   DN                 
      1.50767330E-04    2      1000035         1                       # DNR    -->  Z4SS   DN                 
      9.86415923E-01    2      1000021         1                       # DNR    -->  GLSS   DN                 
#         PDG         Width
DECAY   2000003  8.82503433E+01   # STR   decays
#          BR          NDA       ID1       ID2       ID3       ID4
      1.32873347E-02    2      1000022         3                       # STR    -->  Z1SS   ST                 
      1.01884078E-04    2      1000023         3                       # STR    -->  Z2SS   ST                 
      4.40589465E-05    2      1000025         3                       # STR    -->  Z3SS   ST                 
      1.50767330E-04    2      1000035         3                       # STR    -->  Z4SS   ST                 
      9.86415923E-01    2      1000021         3                       # STR    -->  GLSS   ST                 
#         PDG         Width
DECAY   2000004  9.17885666E+01   # CHR   decays
#          BR          NDA       ID1       ID2       ID3       ID4
      5.10801002E-02    2      1000022         4                       # CHR    -->  Z1SS   CH                 
      3.91664187E-04    2      1000023         4                       # CHR    -->  Z2SS   CH                 
      1.69366715E-04    2      1000025         4                       # CHR    -->  Z3SS   CH                 
      5.79560059E-04    2      1000035         4                       # CHR    -->  Z4SS   CH                 
      9.47779357E-01    2      1000021         4                       # CHR    -->  GLSS   CH                 
#         PDG         Width
DECAY   2000005  8.72699509E+01   # BT2   decays
#          BR          NDA       ID1       ID2       ID3       ID4
      1.29269827E-02    2      1000022         5                       # BT2    -->  Z1SS   BT                 
      8.48293491E-03    2      1000023         5                       # BT2    -->  Z2SS   BT                 
      5.16476035E-02    2      1000025         5                       # BT2    -->  Z3SS   BT                 
      4.36318517E-02    2      1000035         5                       # BT2    -->  Z4SS   BT                 
      7.73988664E-01    2      1000021         5                       # BT2    -->  GLSS   BT                 
      1.60258766E-02    2     -1000024         6                       # BT2    -->  W1SS-  TP                 
      8.80531445E-02    2     -1000037         6                       # BT2    -->  W2SS-  TP                 
      1.47442886E-04    2          -24   1000006                       # BT2    -->  W-     TP1                
      1.45778095E-03    2          -24   2000006                       # BT2    -->  W-     TP2                
      8.52244906E-04    2           23   1000005                       # BT2    -->  Z0     BT1                
      2.78540282E-03    2           25   1000005                       # BT2    -->  HL0    BT1                
#         PDG         Width
DECAY   2000006  9.52726440E+01   # TP2   decays
#          BR          NDA       ID1       ID2       ID3       ID4
      4.92745072E-01    2      1000021         6                       # TP2    -->  GLSS   TP                 
      1.31946668E-01    2      1000024         5                       # TP2    -->  W1SS+  BT                 
      8.45529214E-02    2      1000037         5                       # TP2    -->  W2SS+  BT                 
      5.66695444E-03    2           23   1000006                       # TP2    -->  Z0     TP1                
      1.00216698E-02    2           25   1000006                       # TP2    -->  HL0    TP1                
      1.69682375E-03    2      1000022         6                       # TP2    -->  Z1SS   TP                 
      6.25072345E-02    2      1000023         6                       # TP2    -->  Z2SS   TP                 
      1.01978600E-01    2      1000025         6                       # TP2    -->  Z3SS   TP                 
      1.08884074E-01    2      1000035         6                       # TP2    -->  Z4SS   TP                 
#         PDG         Width
DECAY   1000011  2.77810783E+01   # EL-   decays
#          BR          NDA       ID1       ID2       ID3       ID4
      8.03833604E-02    2      1000022        11                       # EL-    -->  Z1SS   E-                 
      2.85711527E-01    2      1000023        11                       # EL-    -->  Z2SS   E-                 
      6.99052354E-04    2      1000025        11                       # EL-    -->  Z3SS   E-                 
      2.98740417E-02    2      1000035        11                       # EL-    -->  Z4SS   E-                 
      4.89650965E-01    2     -1000024        12                       # EL-    -->  W1SS-  NUE                
      1.13681041E-01    2     -1000037        12                       # EL-    -->  W2SS-  NUE                
#         PDG         Width
DECAY   1000013  2.77810783E+01   # MUL-  decays
#          BR          NDA       ID1       ID2       ID3       ID4
      8.03833604E-02    2      1000022        13                       # MUL-   -->  Z1SS   MU-                
      2.85711527E-01    2      1000023        13                       # MUL-   -->  Z2SS   MU-                
      6.99052354E-04    2      1000025        13                       # MUL-   -->  Z3SS   MU-                
      2.98740417E-02    2      1000035        13                       # MUL-   -->  Z4SS   MU-                
      4.89650965E-01    2     -1000024        14                       # MUL-   -->  W1SS-  NUM                
      1.13681041E-01    2     -1000037        14                       # MUL-   -->  W2SS-  NUM                
#         PDG         Width
DECAY   1000015  1.92290611E+01   # TAU1- decays
#          BR          NDA       ID1       ID2       ID3       ID4
      4.49078411E-01    2      1000022        15                       # TAU1-  -->  Z1SS   TAU-               
      4.28316072E-02    2      1000023        15                       # TAU1-  -->  Z2SS   TAU-               
      1.31027117E-01    2      1000025        15                       # TAU1-  -->  Z3SS   TAU-               
      1.01870887E-01    2      1000035        15                       # TAU1-  -->  Z4SS   TAU-               
      7.77366981E-02    2     -1000024        16                       # TAU1-  -->  W1SS-  NUT                
      1.97455332E-01    2     -1000037        16                       # TAU1-  -->  W2SS-  NUT                
#         PDG         Width
DECAY   1000012  2.78249207E+01   # NUEL  decays
#          BR          NDA       ID1       ID2       ID3       ID4
      1.03539333E-01    2      1000022        12                       # NUEL   -->  Z1SS   NUE                
      2.31360495E-01    2      1000023        12                       # NUEL   -->  Z2SS   NUE                
      3.74227786E-03    2      1000025        12                       # NUEL   -->  Z3SS   NUE                
      5.61396107E-02    2      1000035        12                       # NUEL   -->  Z4SS   NUE                
      5.54921567E-01    2      1000024        11                       # NUEL   -->  W1SS+  E-                 
      5.02967350E-02    2      1000037        11                       # NUEL   -->  W2SS+  E-                 
#         PDG         Width
DECAY   1000014  2.78249207E+01   # NUML  decays
#          BR          NDA       ID1       ID2       ID3       ID4
      1.03539333E-01    2      1000022        14                       # NUML   -->  Z1SS   NUM                
      2.31360495E-01    2      1000023        14                       # NUML   -->  Z2SS   NUM                
      3.74227786E-03    2      1000025        14                       # NUML   -->  Z3SS   NUM                
      5.61396107E-02    2      1000035        14                       # NUML   -->  Z4SS   NUM                
      5.54921567E-01    2      1000024        13                       # NUML   -->  W1SS+  MU-                
      5.02967350E-02    2      1000037        13                       # NUML   -->  W2SS+  MU-                
#         PDG         Width
DECAY   1000016  3.14806194E+01   # NUTL  decays
#          BR          NDA       ID1       ID2       ID3       ID4
      8.43518823E-02    2      1000022        16                       # NUTL   -->  Z1SS   NUT                
      1.87837243E-01    2      1000023        16                       # NUTL   -->  Z2SS   NUT                
      3.01569514E-03    2      1000025        16                       # NUTL   -->  Z3SS   NUT                
      4.51718830E-02    2      1000035        16                       # NUTL   -->  Z4SS   NUT                
      4.88849670E-01    2      1000024        15                       # NUTL   -->  W1SS+  TAU-               
      1.89079553E-01    2      1000037        15                       # NUTL   -->  W2SS+  TAU-               
      1.69405283E-03    2           24   1000015                       # NUTL   -->  W+     TAU1-              
#         PDG         Width
DECAY   2000011  1.03894272E+01   # ER-   decays
#          BR          NDA       ID1       ID2       ID3       ID4
      9.78237331E-01    2      1000022        11                       # ER-    -->  Z1SS   E-                 
      7.49023864E-03    2      1000023        11                       # ER-    -->  Z2SS   E-                 
      3.22918012E-03    2      1000025        11                       # ER-    -->  Z3SS   E-                 
      1.10432813E-02    2      1000035        11                       # ER-    -->  Z4SS   E-                 
#         PDG         Width
DECAY   2000013  1.03894272E+01   # MUR-  decays
#          BR          NDA       ID1       ID2       ID3       ID4
      9.78237331E-01    2      1000022        13                       # MUR-   -->  Z1SS   MU-                
      7.49023864E-03    2      1000023        13                       # MUR-   -->  Z2SS   MU-                
      3.22918012E-03    2      1000025        13                       # MUR-   -->  Z3SS   MU-                
      1.10432813E-02    2      1000035        13                       # MUR-   -->  Z4SS   MU-                
#         PDG         Width
DECAY   2000015  3.13552380E+01   # TAU2- decays
#          BR          NDA       ID1       ID2       ID3       ID4
      6.82343170E-02    2      1000022        15                       # TAU2-  -->  Z1SS   TAU-               
      2.44912565E-01    2      1000023        15                       # TAU2-  -->  Z2SS   TAU-               
      9.35130194E-02    2      1000025        15                       # TAU2-  -->  Z3SS   TAU-               
      1.03494547E-01    2      1000035        15                       # TAU2-  -->  Z4SS   TAU-               
      3.84039879E-01    2     -1000024        16                       # TAU2-  -->  W1SS-  NUT                
      1.04482472E-01    2     -1000037        16                       # TAU2-  -->  W2SS-  NUT                
      7.84441014E-04    2           23   1000015                       # TAU2-  -->  Z0     TAU1-              
      5.38653694E-04    2           25   1000015                       # TAU2-  -->  HL0    TAU1-              
#         PDG         Width
DECAY   1000023  2.23563868E-03   # Z2SS  decays
#          BR          NDA       ID1       ID2       ID3       ID4
      2.40375211E-05    2      1000022        22                       # Z2SS   -->  Z1SS   GM                 
      9.99828875E-01    2      1000022        23                       # Z2SS   -->  Z1SS   Z0                 
      9.14959699E-08    3      1000022         2        -2             # Z2SS   -->  Z1SS   UP     UB          
      1.66297767E-07    3      1000022         1        -1             # Z2SS   -->  Z1SS   DN     DB          
      1.66297767E-07    3      1000022         3        -3             # Z2SS   -->  Z1SS   ST     SB          
      9.14958989E-08    3      1000022         4        -4             # Z2SS   -->  Z1SS   CH     CB          
      1.18479278E-04    3      1000022         5        -5             # Z2SS   -->  Z1SS   BT     BB          
      4.22505593E-07    3      1000022        11       -11             # Z2SS   -->  Z1SS   E-     E+          
      4.22505593E-07    3      1000022        13       -13             # Z2SS   -->  Z1SS   MU-    MU+         
      2.56462354E-05    3      1000022        15       -15             # Z2SS   -->  Z1SS   TAU-   TAU+        
      4.24362355E-07    3      1000022        12       -12             # Z2SS   -->  Z1SS   NUE    ANUE        
      4.24362355E-07    3      1000022        14       -14             # Z2SS   -->  Z1SS   NUM    ANUM        
      5.86419162E-07    3      1000022        16       -16             # Z2SS   -->  Z1SS   NUT    ANUT        
#         PDG         Width
DECAY   1000025  1.10249889E+00   # Z3SS  decays
#          BR          NDA       ID1       ID2       ID3       ID4
      1.12078425E-07    2      1000022        22                       # Z3SS   -->  Z1SS   GM                 
      8.05715104E-07    2      1000023        22                       # Z3SS   -->  Z2SS   GM                 
      2.88251936E-01    2      1000024       -24                       # Z3SS   -->  W1SS+  W-                 
      2.88251936E-01    2     -1000024        24                       # Z3SS   -->  W1SS-  W+                 
      1.69475213E-01    2      1000022        23                       # Z3SS   -->  Z1SS   Z0                 
      2.18900293E-01    2      1000023        23                       # Z3SS   -->  Z2SS   Z0                 
      1.43691337E-10    3      1000022         2        -2             # Z3SS   -->  Z1SS   UP     UB          
      6.06060757E-11    3      1000022         1        -1             # Z3SS   -->  Z1SS   DN     DB          
      6.06060757E-11    3      1000022         3        -3             # Z3SS   -->  Z1SS   ST     SB          
      1.43691212E-10    3      1000022         4        -4             # Z3SS   -->  Z1SS   CH     CB          
      3.59398229E-07    3      1000022         5        -5             # Z3SS   -->  Z1SS   BT     BB          
      2.85380886E-10    3      1000022        11       -11             # Z3SS   -->  Z1SS   E-     E+          
      2.85380886E-10    3      1000022        13       -13             # Z3SS   -->  Z1SS   MU-    MU+         
      1.96226409E-07    3      1000022        15       -15             # Z3SS   -->  Z1SS   TAU-   TAU+        
      2.20347796E-10    3      1000022        12       -12             # Z3SS   -->  Z1SS   NUE    ANUE        
      2.20347796E-10    3      1000022        14       -14             # Z3SS   -->  Z1SS   NUM    ANUM        
      3.05617170E-10    3      1000022        16       -16             # Z3SS   -->  Z1SS   NUT    ANUT        
      5.26105479E-11    3      1000023         2        -2             # Z3SS   -->  Z2SS   UP     UB          
      8.31891153E-11    3      1000023         1        -1             # Z3SS   -->  Z2SS   DN     DB          
      8.31891153E-11    3      1000023         3        -3             # Z3SS   -->  Z2SS   ST     SB          
      5.26105028E-11    3      1000023         4        -4             # Z3SS   -->  Z2SS   CH     CB          
      1.22624385E-07    3      1000023         5        -5             # Z3SS   -->  Z2SS   BT     BB          
      1.05525163E-11    3      1000023        11       -11             # Z3SS   -->  Z2SS   E-     E+          
      1.05525163E-11    3      1000023        13       -13             # Z3SS   -->  Z2SS   MU-    MU+         
      1.91835525E-08    3      1000023        15       -15             # Z3SS   -->  Z2SS   TAU-   TAU+        
      4.52725323E-11    3      1000023        12       -12             # Z3SS   -->  Z2SS   NUE    ANUE        
      4.52725323E-11    3      1000023        14       -14             # Z3SS   -->  Z2SS   NUM    ANUM        
      6.29141461E-11    3      1000023        16       -16             # Z3SS   -->  Z2SS   NUT    ANUT        
      3.12710740E-02    2      1000022        25                       # Z3SS   -->  Z1SS   HL0                
      3.84804048E-03    2      1000023        25                       # Z3SS   -->  Z2SS   HL0                
#         PDG         Width
DECAY   1000035  1.53007162E+00   # Z4SS  decays
#          BR          NDA       ID1       ID2       ID3       ID4
      1.13092177E-07    2      1000022        22                       # Z4SS   -->  Z1SS   GM                 
      4.17752887E-07    2      1000023        22                       # Z4SS   -->  Z2SS   GM                 
      1.13551755E-08    2      1000025        22                       # Z4SS   -->  Z3SS   GM                 
      3.50866586E-01    2      1000024       -24                       # Z4SS   -->  W1SS+  W-                 
      3.50866586E-01    2     -1000024        24                       # Z4SS   -->  W1SS-  W+                 
      3.15138884E-02    2      1000022        23                       # Z4SS   -->  Z1SS   Z0                 
      1.52454097E-02    2      1000023        23                       # Z4SS   -->  Z2SS   Z0                 
      1.93012228E-09    3      1000022         2        -2             # Z4SS   -->  Z1SS   UP     UB          
      2.41616727E-09    3      1000022         1        -1             # Z4SS   -->  Z1SS   DN     DB          
      2.41616727E-09    3      1000022         3        -3             # Z4SS   -->  Z1SS   ST     SB          
      1.93012051E-09    3      1000022         4        -4             # Z4SS   -->  Z1SS   CH     CB          
      2.25444978E-07    3      1000022         5        -5             # Z4SS   -->  Z1SS   BT     BB          
      5.26856425E-09    3      1000022        11       -11             # Z4SS   -->  Z1SS   E-     E+          
      5.26856425E-09    3      1000022        13       -13             # Z4SS   -->  Z1SS   MU-    MU+         
      1.53788278E-07    3      1000022        15       -15             # Z4SS   -->  Z1SS   TAU-   TAU+        
      7.83077692E-09    3      1000022        12       -12             # Z4SS   -->  Z1SS   NUE    ANUE        
      7.83077692E-09    3      1000022        14       -14             # Z4SS   -->  Z1SS   NUM    ANUM        
      1.08592078E-08    3      1000022        16       -16             # Z4SS   -->  Z1SS   NUT    ANUT        
      5.41726974E-09    3      1000023         2        -2             # Z4SS   -->  Z2SS   UP     UB          
      6.21127727E-09    3      1000023         1        -1             # Z4SS   -->  Z2SS   DN     DB          
      6.21127727E-09    3      1000023         3        -3             # Z4SS   -->  Z2SS   ST     SB          
      5.41726441E-09    3      1000023         4        -4             # Z4SS   -->  Z2SS   CH     CB          
      1.23838319E-07    3      1000023         5        -5             # Z4SS   -->  Z2SS   BT     BB          
      1.75511949E-09    3      1000023        11       -11             # Z4SS   -->  Z2SS   E-     E+          
      1.75511949E-09    3      1000023        13       -13             # Z4SS   -->  Z2SS   MU-    MU+         
      1.66596585E-08    3      1000023        15       -15             # Z4SS   -->  Z2SS   TAU-   TAU+        
      2.68506439E-09    3      1000023        12       -12             # Z4SS   -->  Z2SS   NUE    ANUE        
      2.68506439E-09    3      1000023        14       -14             # Z4SS   -->  Z2SS   NUM    ANUM        
      3.73257114E-09    3      1000023        16       -16             # Z4SS   -->  Z2SS   NUT    ANUT        
      3.18170038E-07    3      1000025         2        -2             # Z4SS   -->  Z3SS   UP     UB          
      4.10377964E-07    3      1000025         1        -1             # Z4SS   -->  Z3SS   DN     DB          
      4.10377964E-07    3      1000025         3        -3             # Z4SS   -->  Z3SS   ST     SB          
      3.18170038E-07    3      1000025         4        -4             # Z4SS   -->  Z3SS   CH     CB          
      2.26700593E-07    3      1000025         5        -5             # Z4SS   -->  Z3SS   BT     BB          
      9.30892057E-08    3      1000025        11       -11             # Z4SS   -->  Z3SS   E-     E+          
      9.30892057E-08    3      1000025        13       -13             # Z4SS   -->  Z3SS   MU-    MU+         
      8.50925090E-08    3      1000025        15       -15             # Z4SS   -->  Z3SS   TAU-   TAU+        
      1.85172539E-07    3      1000025        12       -12             # Z4SS   -->  Z3SS   NUE    ANUE        
      1.85172539E-07    3      1000025        14       -14             # Z4SS   -->  Z3SS   NUM    ANUM        
      1.85166911E-07    3      1000025        16       -16             # Z4SS   -->  Z3SS   NUT    ANUT        
      1.01240262E-01    2      1000022        25                       # Z4SS   -->  Z1SS   HL0                
      1.50263906E-01    2      1000023        25                       # Z4SS   -->  Z2SS   HL0                
#         PDG         Width
DECAY   1000024  1.09057324E-02   # W1SS+ decays
#          BR          NDA       ID1       ID2       ID3       ID4
      5.29260298E-08    3      1000022         2        -1             # W1SS+  -->  Z1SS   UP     DB          
      5.29260085E-08    3      1000022         4        -3             # W1SS+  -->  Z1SS   CH     SB          
      1.84137221E-07    3      1000022       -11        12             # W1SS+  -->  Z1SS   E+     NUE         
      1.84137221E-07    3      1000022       -13        14             # W1SS+  -->  Z1SS   MU+    NUM         
      4.63421912E-07    3      1000022       -15        16             # W1SS+  -->  Z1SS   TAU+   NUT         
      9.99999046E-01    2      1000022        24                       # W1SS+  -->  Z1SS   W+                 
      6.79672152E-10    3      1000023         2        -1             # W1SS+  -->  Z2SS   UP     DB          
      2.26577992E-10    3      1000023       -11        12             # W1SS+  -->  Z2SS   E+     NUE         
      2.26577992E-10    3      1000023       -13        14             # W1SS+  -->  Z2SS   MU+    NUM         
#         PDG         Width
DECAY   1000037  1.26721513E+00   # W2SS+ decays
#          BR          NDA       ID1       ID2       ID3       ID4
      3.85239707E-09    3      1000022         2        -1             # W2SS+  -->  Z1SS   UP     DB          
      3.85239618E-09    3      1000022         4        -3             # W2SS+  -->  Z1SS   CH     SB          
      1.13848140E-08    3      1000022       -11        12             # W2SS+  -->  Z1SS   E+     NUE         
      1.13848140E-08    3      1000022       -13        14             # W2SS+  -->  Z1SS   MU+    NUM         
      1.83429492E-07    3      1000022       -15        16             # W2SS+  -->  Z1SS   TAU+   NUT         
      1.30973980E-01    2      1000022        24                       # W2SS+  -->  Z1SS   W+                 
      5.04231545E-09    3      1000023         2        -1             # W2SS+  -->  Z2SS   UP     DB          
      5.04231501E-09    3      1000023         4        -3             # W2SS+  -->  Z2SS   CH     SB          
      2.13345408E-09    3      1000023       -11        12             # W2SS+  -->  Z2SS   E+     NUE         
      2.13345408E-09    3      1000023       -13        14             # W2SS+  -->  Z2SS   MU+    NUM         
      4.48654731E-08    3      1000023       -15        16             # W2SS+  -->  Z2SS   TAU+   NUT         
      3.59909534E-01    2      1000023        24                       # W2SS+  -->  Z2SS   W+                 
      1.19867582E-06    3      1000025         2        -1             # W2SS+  -->  Z3SS   UP     DB          
      1.19867582E-06    3      1000025         4        -3             # W2SS+  -->  Z3SS   CH     SB          
      3.99538607E-07    3      1000025       -11        12             # W2SS+  -->  Z3SS   E+     NUE         
      3.99538607E-07    3      1000025       -13        14             # W2SS+  -->  Z3SS   MU+    NUM         
      3.99895498E-07    3      1000025       -15        16             # W2SS+  -->  Z3SS   TAU+   NUT         
      3.02613944E-01    2      1000024        23                       # W2SS+  -->  W1SS+  Z0                 
      5.85531135E-09    3      1000024         1        -1             # W2SS+  -->  W1SS+  DN     DB          
      5.85530557E-09    3      1000024         3        -3             # W2SS+  -->  W1SS+  ST     SB          
      1.15923724E-08    3      1000024         2        -2             # W2SS+  -->  W1SS+  UP     UB          
      1.15923724E-08    3      1000024         4        -4             # W2SS+  -->  W1SS+  CH     CB          
      4.44555992E-09    3      1000024        12       -12             # W2SS+  -->  W1SS+  NUE    ANUE        
      4.44555992E-09    3      1000024        14       -14             # W2SS+  -->  W1SS+  NUM    ANUM        
      9.30432709E-09    3      1000024        16       -16             # W2SS+  -->  W1SS+  NUT    ANUT        
      2.24404983E-09    3      1000024        11       -11             # W2SS+  -->  W1SS+  E-     E+          
      2.24404983E-09    3      1000024        13       -13             # W2SS+  -->  W1SS+  MU-    MU+         
      3.11989168E-09    3      1000024        15       -15             # W2SS+  -->  W1SS+  TAU-   TAU+        
      2.06498742E-01    2      1000024        25                       # W2SS+  -->  W1SS+  HL0                
#         PDG         Width
DECAY        25  4.19044262E-03   # HL0   decays
#          BR          NDA       ID1       ID2       ID3       ID4
      4.79791051E-09    2           11       -11                       # HL0    -->  E-     E+                 
      2.02575437E-04    2           13       -13                       # HL0    -->  MU-    MU+                
      5.79395890E-02    2           15       -15                       # HL0    -->  TAU-   TAU+               
      6.02094769E-06    2            1        -1                       # HL0    -->  DN     DB                 
      2.43276474E-03    2            3        -3                       # HL0    -->  ST     SB                 
      7.96346366E-01    2            5        -5                       # HL0    -->  BT     BB                 
      1.89200296E-06    2            2        -2                       # HL0    -->  UP     UB                 
      3.55605446E-02    2            4        -4                       # HL0    -->  CH     CB                 
      1.85685919E-03    2           22        22                       # HL0    -->  GM     GM                 
      3.92490663E-02    2           21        21                       # HL0    -->  GL     GL                 
      3.41847097E-03    3           24        11       -12             # HL0    -->  W+     E-     ANUE        
      3.41847097E-03    3           24        13       -14             # HL0    -->  W+     MU-    ANUM        
      3.41847097E-03    3           24        15       -16             # HL0    -->  W+     TAU-   ANUT        
      1.02554131E-02    3           24        -2         1             # HL0    -->  W+     UB     DN          
      1.02554131E-02    3           24        -4         3             # HL0    -->  W+     CB     ST          
      3.41847097E-03    3          -24       -11        12             # HL0    -->  W-     E+     NUE         
      3.41847097E-03    3          -24       -13        14             # HL0    -->  W-     MU+    NUM         
      3.41847097E-03    3          -24       -15        16             # HL0    -->  W-     TAU+   NUT         
      1.02554131E-02    3          -24         2        -1             # HL0    -->  W-     UP     DB          
      1.02554131E-02    3          -24         4        -3             # HL0    -->  W-     CH     SB          
      3.33137985E-04    3           23        12       -12             # HL0    -->  Z0     NUE    ANUE        
      3.33137985E-04    3           23        14       -14             # HL0    -->  Z0     NUM    ANUM        
      3.33137985E-04    3           23        16       -16             # HL0    -->  Z0     NUT    ANUT        
      1.67664999E-04    3           23        11       -11             # HL0    -->  Z0     E-     E+          
      1.67664999E-04    3           23        13       -13             # HL0    -->  Z0     MU-    MU+         
      1.67664999E-04    3           23        15       -15             # HL0    -->  Z0     TAU-   TAU+        
      5.74406062E-04    3           23         2        -2             # HL0    -->  Z0     UP     UB          
      5.74406062E-04    3           23         4        -4             # HL0    -->  Z0     CH     CB          
      7.39976531E-04    3           23         1        -1             # HL0    -->  Z0     DN     DB          
      7.39976531E-04    3           23         3        -3             # HL0    -->  Z0     ST     SB          
      7.39976531E-04    3           23         5        -5             # HL0    -->  Z0     BT     BB          
#         PDG         Width
DECAY        35  4.74854012E+01   # HH0   decays
#          BR          NDA       ID1       ID2       ID3       ID4
      8.32778202E-09    2           11       -11                       # HH0    -->  E-     E+                 
      3.51613940E-04    2           13       -13                       # HH0    -->  MU-    MU+                
      1.00706726E-01    2           15       -15                       # HH0    -->  TAU-   TAU+               
      1.01716014E-05    2            1        -1                       # HH0    -->  DN     DB                 
      4.10984177E-03    2            3        -3                       # HH0    -->  ST     SB                 
      5.47546208E-01    2            5        -5                       # HH0    -->  BT     BB                 
      1.29450769E-12    2            2        -2                       # HH0    -->  UP     UB                 
      1.74700610E-08    2            4        -4                       # HH0    -->  CH     CB                 
      8.63185327E-04    2            6        -6                       # HH0    -->  TP     TB                 
      8.55021440E-08    2           22        22                       # HH0    -->  GM     GM                 
      1.51937229E-06    2           21        21                       # HH0    -->  GL     GL                 
      1.06455605E-06    2           24       -24                       # HH0    -->  W+     W-                 
      5.43572867E-07    2           23        23                       # HH0    -->  Z0     Z0                 
      1.54089648E-03    2      1000022   1000022                       # HH0    -->  Z1SS   Z1SS               
      1.03939204E-02    2      1000022   1000023                       # HH0    -->  Z1SS   Z2SS               
      1.82497520E-02    2      1000022   1000025                       # HH0    -->  Z1SS   Z3SS               
      8.74186307E-03    2      1000022   1000035                       # HH0    -->  Z1SS   Z4SS               
      1.58942416E-02    2      1000023   1000023                       # HH0    -->  Z2SS   Z2SS               
      3.98237221E-02    2      1000023   1000025                       # HH0    -->  Z2SS   Z3SS               
      1.44875795E-02    2      1000023   1000035                       # HH0    -->  Z2SS   Z4SS               
      1.04572927E-03    2      1000025   1000025                       # HH0    -->  Z3SS   Z3SS               
      1.60352308E-02    2      1000025   1000035                       # HH0    -->  Z3SS   Z4SS               
      1.07851774E-02    2      1000035   1000035                       # HH0    -->  Z4SS   Z4SS               
      3.74257118E-02    2      1000024  -1000024                       # HH0    -->  W1SS+  W1SS-              
      9.59256943E-03    2      1000037  -1000037                       # HH0    -->  W2SS+  W2SS-              
      8.11950937E-02    2      1000024  -1000037                       # HH0    -->  W1SS+  W2SS-              
      8.11950937E-02    2     -1000024   1000037                       # HH0    -->  W1SS-  W2SS+              
      2.30141450E-06    2           25        25                       # HH0    -->  HL0    HL0                
#         PDG         Width
DECAY        36  4.71263657E+01   # HA0   decays
#          BR          NDA       ID1       ID2       ID3       ID4
      8.33642577E-09    2           11       -11                       # HA0    -->  E-     E+                 
      3.51978932E-04    2           13       -13                       # HA0    -->  MU-    MU+                
      1.00811854E-01    2           15       -15                       # HA0    -->  TAU-   TAU+               
      1.01826754E-05    2            1        -1                       # HA0    -->  DN     DB                 
      4.11431585E-03    2            3        -3                       # HA0    -->  ST     SB                 
      5.48153579E-01    2            5        -5                       # HA0    -->  BT     BB                 
      1.27270709E-12    2            2        -2                       # HA0    -->  UP     UB                 
      1.71886931E-08    2            4        -4                       # HA0    -->  CH     CB                 
      8.89794028E-04    2            6        -6                       # HA0    -->  TP     TB                 
      1.13948936E-07    2           22        22                       # HA0    -->  GM     GM                 
      7.25113478E-06    2           21        21                       # HA0    -->  GL     GL                 
      1.65234145E-03    2      1000022   1000022                       # HA0    -->  Z1SS   Z1SS               
      1.16866780E-02    2      1000022   1000023                       # HA0    -->  Z1SS   Z2SS               
      1.47756562E-02    2      1000022   1000025                       # HA0    -->  Z1SS   Z3SS               
      1.09895803E-02    2      1000022   1000035                       # HA0    -->  Z1SS   Z4SS               
      1.91186890E-02    2      1000023   1000023                       # HA0    -->  Z2SS   Z2SS               
      2.92235371E-02    2      1000023   1000025                       # HA0    -->  Z2SS   Z3SS               
      2.00702418E-02    2      1000023   1000035                       # HA0    -->  Z2SS   Z4SS               
      1.29961874E-03    2      1000025   1000025                       # HA0    -->  Z3SS   Z3SS               
      1.06110675E-02    2      1000025   1000035                       # HA0    -->  Z3SS   Z4SS               
      1.72858667E-02    2      1000035   1000035                       # HA0    -->  Z4SS   Z4SS               
      4.48645130E-02    2      1000024  -1000024                       # HA0    -->  W1SS+  W1SS-              
      1.62012633E-02    2      1000037  -1000037                       # HA0    -->  W2SS+  W2SS-              
      7.39404187E-02    2      1000024  -1000037                       # HA0    -->  W1SS+  W2SS-              
      7.39404187E-02    2     -1000024   1000037                       # HA0    -->  W1SS-  W2SS+              
      1.05153299E-06    2           25        23                       # HA0    -->  HL0    Z0                 
#         PDG         Width
DECAY        37  4.47799339E+01   # H+    decays
#          BR          NDA       ID1       ID2       ID3       ID4
      8.84737172E-09    2           12       -11                       # H+     -->  NUE    E+                 
      3.73551942E-04    2           14       -13                       # H+     -->  NUM    MU+                
      1.06990695E-01    2           16       -15                       # H+     -->  NUT    TAU+               
      9.96240396E-06    2            2        -1                       # H+     -->  UP     DB                 
      4.02532471E-03    2            4        -3                       # H+     -->  CH     SB                 
      5.22131026E-01    2            6        -5                       # H+     -->  TP     BB                 
      2.04463564E-02    2      1000024   1000022                       # H+     -->  W1SS+  Z1SS               
      9.55693104E-05    2      1000024   1000023                       # H+     -->  W1SS+  Z2SS               
      9.18836296E-02    2      1000024   1000025                       # H+     -->  W1SS+  Z3SS               
      9.68377218E-02    2      1000024   1000035                       # H+     -->  W1SS+  Z4SS               
      1.57157164E-02    2      1000037   1000022                       # H+     -->  W2SS+  Z1SS               
      1.25055075E-01    2      1000037   1000023                       # H+     -->  W2SS+  Z2SS               
      1.53618166E-02    2      1000037   1000025                       # H+     -->  W2SS+  Z3SS               
      1.07253215E-03    2      1000037   1000035                       # H+     -->  W2SS+  Z4SS               
      1.12372265E-06    2           25        24                       # H+     -->  HL0    W+                 
