  65
  401    820.5927    0.86081E-25
  402    816.7043    0.84386E-25
  403    820.5917    0.86082E-25
  404    816.7043    0.84386E-25
  405    726.8597    0.94388E-25
  406    614.9798    0.17514E-24
  407    820.5927    0.86081E-25
  408    816.7043    0.84386E-25
  409    820.5917    0.86082E-25
  410    816.7043    0.84386E-25
  411    726.8597    0.94388E-25
  412    614.9798    0.17514E-24
  413    782.9575    0.16208E-23
  414    785.9127    0.40342E-24
  415    782.9575    0.16208E-23
  416    785.9128    0.40342E-24
  417    771.5269    0.10620E-24
  418    794.5458    0.53595E-25
  419    782.9575    0.16208E-23
  420    785.9127    0.40342E-24
  421    782.9575    0.16208E-23
  422    785.9128    0.40342E-24
  423    771.5269    0.10620E-24
  424    794.5458    0.53595E-25
  425    265.1609    0.44873E-23
  426    252.8710    0.44640E-23
  427    265.2219    0.44843E-23
  428    252.9350    0.44604E-23
  429     87.4003    0.68574E-11
  430    246.7607    0.92529E-24
  431    265.1609    0.44873E-23
  432    252.8710    0.44640E-23
  433    265.2219    0.44843E-23
  434    252.9350    0.44604E-23
  435     87.4003    0.68574E-11
  436    246.7607    0.92529E-24
  437    154.2744    0.47270E-22
  438      0.0000    0.10000E+31
  439    154.7193    0.10235E-19
  440      0.0000    0.10000E+31
  441    278.8937    0.74423E-24
  442      0.0000    0.10000E+31
  443    154.2744    0.47270E-22
  444      0.0000    0.10000E+31
  445    154.7193    0.10235E-19
  446      0.0000    0.10000E+31
  447    278.8937    0.74423E-24
  448      0.0000    0.10000E+31
  449    889.4110    0.57216E-25
  450    154.0100    0.20564E-23
  451    287.8205    0.12754E-23
  452   -492.9793    0.22083E-24
  453    507.7077    0.18199E-24
  454    287.8369    0.12845E-23
  455    508.4139    0.18863E-24
  456    287.8369    0.12845E-23
  457    508.4139    0.18863E-24
  203    115.4142    0.12310E-21
  204    483.5380    0.52560E-25
  205    483.0010    0.52382E-25
  206    490.6888    0.66918E-25
  207    490.6888    0.66918E-25
  458      0.0000    0.10000E+31
    6    171.4000    0.58581E-24
   12    171.4000    0.58581E-24
   6
   401  0.17491654E-01     0   450     1     0     0     0
   401  0.31293893E+00     0   451     1     0     0     0
   401  0.11015579E-02     0   452     1     0     0     0
   401  0.14669768E-01     0   453     1     0     0     0
   401  0.61380816E+00     0   456     2     0     0     0
   401  0.39989915E-01     0   457     2     0     0     0
   6
   402  0.10509103E-01     0   450     2     0     0     0
   402  0.31677353E+00     0   451     2     0     0     0
   402  0.64789259E-03     0   452     2     0     0     0
   402  0.11157886E-01     0   453     2     0     0     0
   402  0.64637834E+00     0   454     1     0     0     0
   402  0.14533255E-01     0   455     1     0     0     0
   6
   403  0.17491749E-01     0   450     3     0     0     0
   403  0.31294048E+00     0   451     3     0     0     0
   403  0.11015610E-02     0   452     3     0     0     0
   403  0.14669806E-01     0   453     3     0     0     0
   403  0.61380696E+00     0   456     4     0     0     0
   403  0.39989457E-01     0   457     4     0     0     0
   6
   404  0.10509067E-01     0   450     4     0     0     0
   404  0.31677207E+00     0   451     4     0     0     0
   404  0.64788561E-03     0   452     4     0     0     0
   404  0.11157755E-01     0   453     4     0     0     0
   404  0.64637995E+00     0   454     3     0     0     0
   404  0.14533293E-01     0   455     3     0     0     0
   7
   405  0.59214897E-01     0   450     5     0     0     0
   405  0.27032706E+00     0   451     5     0     0     0
   405  0.65008081E-01     0   452     5     0     0     0
   405  0.38592733E-01     0   453     5     0     0     0
   405  0.40997118E+00     0   456     6     0     0     0
   405  0.11304650E+00     0   457     6     0     0     0
   405  0.43839552E-01     0   199   406     0     0     0
   4
   406  0.22608426E+00     0   450     6     0     0     0
   406  0.15047482E+00     0   451     6     0     0     0
   406  0.45920208E+00     0   454     5     0     0     0
   406  0.16423883E+00     0   455     5     0     0     0
   6
   407  0.17491654E-01     0   450     7     0     0     0
   407  0.31293893E+00     0   451     7     0     0     0
   407  0.11015579E-02     0   452     7     0     0     0
   407  0.14669768E-01     0   453     7     0     0     0
   407  0.61380816E+00     0   454     8     0     0     0
   407  0.39989915E-01     0   455     8     0     0     0
   6
   408  0.10509103E-01     0   450     8     0     0     0
   408  0.31677353E+00     0   451     8     0     0     0
   408  0.64789259E-03     0   452     8     0     0     0
   408  0.11157886E-01     0   453     8     0     0     0
   408  0.64637834E+00     0   456     7     0     0     0
   408  0.14533255E-01     0   457     7     0     0     0
   6
   409  0.17491749E-01     0   450     9     0     0     0
   409  0.31294048E+00     0   451     9     0     0     0
   409  0.11015610E-02     0   452     9     0     0     0
   409  0.14669806E-01     0   453     9     0     0     0
   409  0.61380696E+00     0   454    10     0     0     0
   409  0.39989457E-01     0   455    10     0     0     0
   6
   410  0.10509067E-01     0   450    10     0     0     0
   410  0.31677207E+00     0   451    10     0     0     0
   410  0.64788561E-03     0   452    10     0     0     0
   410  0.11157755E-01     0   453    10     0     0     0
   410  0.64637995E+00     0   456     9     0     0     0
   410  0.14533293E-01     0   457     9     0     0     0
   7
   411  0.59214897E-01     0   450    11     0     0     0
   411  0.27032706E+00     0   451    11     0     0     0
   411  0.65008081E-01     0   452    11     0     0     0
   411  0.38592733E-01     0   453    11     0     0     0
   411  0.40997118E+00     0   454    12     0     0     0
   411  0.11304650E+00     0   455    12     0     0     0
   411  0.43839552E-01     0   198   412     0     0     0
   4
   412  0.22608426E+00     0   450    12     0     0     0
   412  0.15047482E+00     0   451    12     0     0     0
   412  0.45920208E+00     0   456    11     0     0     0
   412  0.16423883E+00     0   457    11     0     0     0
   4
   413  0.99407059E+00     0   450     1     0     0     0
   413  0.21756992E-02     0   451     1     0     0     0
   413  0.84938668E-03     0   452     1     0     0     0
   413  0.29043162E-02     0   453     1     0     0     0
   4
   414  0.99402922E+00     0   450     2     0     0     0
   414  0.21793980E-02     0   451     2     0     0     0
   414  0.85722946E-03     0   452     2     0     0     0
   414  0.29341439E-02     0   453     2     0     0     0
   4
   415  0.99407059E+00     0   450     3     0     0     0
   415  0.21756995E-02     0   451     3     0     0     0
   415  0.84938685E-03     0   452     3     0     0     0
   415  0.29043169E-02     0   453     3     0     0     0
   4
   416  0.99402928E+00     0   450     4     0     0     0
   416  0.21793952E-02     0   451     4     0     0     0
   416  0.85722160E-03     0   452     4     0     0     0
   416  0.29341129E-02     0   453     4     0     0     0
   7
   417  0.24605183E-01     0   450     5     0     0     0
   417  0.63141048E-01     0   451     5     0     0     0
   417  0.11490035E+00     0   452     5     0     0     0
   417  0.12984324E+00     0   453     5     0     0     0
   417  0.89963570E-01     0   456     6     0     0     0
   417  0.44570810E+00     0   457     6     0     0     0
   417  0.13183852E+00     0   199   406     0     0     0
   8
   418  0.22751382E+00     0   454     5     0     0     0
   418  0.20833181E+00     0   455     5     0     0     0
   418  0.10158754E+00     0   200   406     0     0     0
   418  0.42007092E-01     0   203   406     0     0     0
   418  0.24999520E-01     0   450     6     0     0     0
   418  0.89218207E-01     0   451     6     0     0     0
   418  0.82226992E-01     0   452     6     0     0     0
   418  0.22411501E+00     0   453     6     0     0     0
   4
   419  0.99407059E+00     0   450     7     0     0     0
   419  0.21756992E-02     0   451     7     0     0     0
   419  0.84938668E-03     0   452     7     0     0     0
   419  0.29043162E-02     0   453     7     0     0     0
   4
   420  0.99402922E+00     0   450     8     0     0     0
   420  0.21793980E-02     0   451     8     0     0     0
   420  0.85722946E-03     0   452     8     0     0     0
   420  0.29341439E-02     0   453     8     0     0     0
   4
   421  0.99407059E+00     0   450     9     0     0     0
   421  0.21756995E-02     0   451     9     0     0     0
   421  0.84938685E-03     0   452     9     0     0     0
   421  0.29043169E-02     0   453     9     0     0     0
   4
   422  0.99402928E+00     0   450    10     0     0     0
   422  0.21793952E-02     0   451    10     0     0     0
   422  0.85722160E-03     0   452    10     0     0     0
   422  0.29341129E-02     0   453    10     0     0     0
   7
   423  0.24605183E-01     0   450    11     0     0     0
   423  0.63141048E-01     0   451    11     0     0     0
   423  0.11490035E+00     0   452    11     0     0     0
   423  0.12984324E+00     0   453    11     0     0     0
   423  0.89963570E-01     0   454    12     0     0     0
   423  0.44570810E+00     0   455    12     0     0     0
   423  0.13183852E+00     0   198   412     0     0     0
   8
   424  0.22751382E+00     0   456    11     0     0     0
   424  0.20833181E+00     0   457    11     0     0     0
   424  0.10158754E+00     0   200   412     0     0     0
   424  0.42007092E-01     0   203   412     0     0     0
   424  0.24999520E-01     0   450    12     0     0     0
   424  0.89218207E-01     0   451    12     0     0     0
   424  0.82226992E-01     0   452    12     0     0     0
   424  0.22411501E+00     0   453    12     0     0     0
   4
   425  0.91806138E+00     0   450   121     0     0     0
   425  0.12909195E-03     0   429   121   131     0     0
   425  0.28277605E-03     0   435   121   125     0     0
   425  0.81526764E-01     0   121   130     0     0     0
   5
   426  0.92173064E+00     0   450   122     0     0     0
   426  0.65213389E-04     0   429   122   131     0     0
   426  0.16537159E-03     0   435   122   125     0     0
   426  0.69418189E-03     0   435   121   126     0     0
   426  0.77344604E-01     0   129   121     0     0     0
   4
   427  0.91809577E+00     0   450   123     0     0     0
   427  0.12934853E-03     0   429   123   131     0     0
   427  0.28316173E-03     0   435   123   125     0     0
   427  0.81491701E-01     0   121   128     0     0     0
   5
   428  0.92177206E+00     0   450   124     0     0     0
   428  0.65332002E-04     0   429   124   131     0     0
   428  0.16557331E-03     0   435   124   125     0     0
   428  0.69504185E-03     0   435   123   126     0     0
   428  0.77301979E-01     0   127   121     0     0     0
   3
   429  0.80953747E-01     0   125   130     0     0     0
   429  0.45933378E+00     0   125   124     0     0     0
   429  0.45971248E+00     0   123   126     0     0     0
   4
   430  0.17557724E+00     0   450   126     0     0     0
   430  0.82438225E+00     0   198   429     0     0     0
   430  0.12269526E-04     0   435   126   125     0     0
   430  0.28274253E-04     0   429   126   131     0     0
   4
   431  0.91806138E+00     0   450   127     0     0     0
   431  0.12909195E-03     0   435   127   125     0     0
   431  0.28277605E-03     0   429   127   131     0     0
   431  0.81526764E-01     0   127   124     0     0     0
   5
   432  0.92173064E+00     0   450   128     0     0     0
   432  0.65213389E-04     0   435   128   125     0     0
   432  0.16537159E-03     0   429   128   131     0     0
   432  0.69418189E-03     0   429   127   132     0     0
   432  0.77344604E-01     0   123   127     0     0     0
   4
   433  0.91809577E+00     0   450   129     0     0     0
   433  0.12934853E-03     0   435   129   125     0     0
   433  0.28316173E-03     0   429   129   131     0     0
   433  0.81491701E-01     0   127   122     0     0     0
   5
   434  0.92177206E+00     0   450   130     0     0     0
   434  0.65332002E-04     0   435   130   125     0     0
   434  0.16557331E-03     0   429   130   131     0     0
   434  0.69504185E-03     0   429   129   132     0     0
   434  0.77301979E-01     0   121   127     0     0     0
   3
   435  0.80953747E-01     0   131   124     0     0     0
   435  0.45933378E+00     0   131   130     0     0     0
   435  0.45971248E+00     0   129   132     0     0     0
   4
   436  0.17557724E+00     0   450   132     0     0     0
   436  0.82438225E+00     0   199   435     0     0     0
   436  0.12269526E-04     0   429   132   131     0     0
   436  0.28274253E-04     0   435   132   125     0     0
   3
   437  0.65268873E-03     0   450   121     0     0     0
   437  0.49967340E+00     0   123   122     0     0     0
   437  0.49967390E+00     0   121   124     0     0     0
   0
   3
   439  0.99994779E+00     0   450   123     0     0     0
   439  0.40467239E-04     0   429   123   131     0     0
   439  0.11769238E-04     0   435   123   125     0     0
   0
   3
   441  0.24822870E+00     0   450   125     0     0     0
   441  0.46676296E+00     0   200   429     0     0     0
   441  0.28500834E+00     0   203   429     0     0     0
   0
   3
   443  0.65268873E-03     0   450   127     0     0     0
   443  0.49967340E+00     0   129   128     0     0     0
   443  0.49967390E+00     0   127   130     0     0     0
   0
   3
   445  0.99994779E+00     0   450   129     0     0     0
   445  0.40467239E-04     0   435   129   125     0     0
   445  0.11769238E-04     0   429   129   131     0     0
   0
   3
   447  0.24822870E+00     0   450   131     0     0     0
   447  0.46676296E+00     0   200   435     0     0     0
   447  0.28500834E+00     0   203   435     0     0     0
   0
  32
   449  0.50975906E-03     0   454     5    12     0     0
   449  0.50975906E-03     0   456     6    11     0     0
   449  0.19016700E-03     0   455     5    12     0     0
   449  0.19016700E-03     0   457     6    11     0     0
   449  0.93597140E-04     0   450     6    12     0     0
   449  0.29324388E-03     0   451     6    12     0     0
   449  0.33732522E-04     0   452    13     0     0     0
   449  0.24040070E-04     0   452     6    12     0     0
   449  0.24379131E-04     0   453    13     0     0     0
   449  0.15791145E-03     0   453     6    12     0     0
   449  0.22156635E-01     0   408     2     0     0     0
   449  0.22156635E-01     0   402     8     0     0     0
   449  0.19940672E-01     0   407     1     0     0     0
   449  0.19940672E-01     0   401     7     0     0     0
   449  0.43291401E-01     0   420     2     0     0     0
   449  0.43291401E-01     0   414     8     0     0     0
   449  0.45637529E-01     0   419     1     0     0     0
   449  0.45637529E-01     0   413     7     0     0     0
   449  0.19941140E-01     0   409     3     0     0     0
   449  0.19941140E-01     0   403     9     0     0     0
   449  0.45637406E-01     0   421     3     0     0     0
   449  0.45637406E-01     0   415     9     0     0     0
   449  0.22153100E-01     0   410     4     0     0     0
   449  0.22153100E-01     0   404    10     0     0     0
   449  0.43288063E-01     0   422     4     0     0     0
   449  0.43288063E-01     0   416    10     0     0     0
   449  0.96119449E-01     0   411     5     0     0     0
   449  0.96119449E-01     0   405    11     0     0     0
   449  0.57567965E-01     0   423     5     0     0     0
   449  0.57567965E-01     0   417    11     0     0     0
   449  0.83253272E-01     0   412     6     0     0     0
   449  0.83253272E-01     0   406    12     0     0     0
   2
   450  0.50000000E+00     0   429   131     0     0     0
   450  0.50000000E+00     0   435   125     0     0     0
  20
   451  0.28264134E-02     0   450   200     0     0     0
   451  0.14266058E-01     0   450   203     0     0     0
   451  0.26158070E-01     0   425   127     0     0     0
   451  0.26158070E-01     0   431   121     0     0     0
   451  0.26022822E-01     0   427   129     0     0     0
   451  0.26022822E-01     0   433   123     0     0     0
   451  0.19231661E-02     0   437   127     0     0     0
   451  0.19231661E-02     0   443   121     0     0     0
   451  0.19142197E-02     0   439   129     0     0     0
   451  0.19142197E-02     0   445   123     0     0     0
   451  0.25517198E+00     0   429   131     0     0     0
   451  0.25517198E+00     0   435   125     0     0     0
   451  0.34651200E-02     0   441   131     0     0     0
   451  0.34651200E-02     0   447   125     0     0     0
   451  0.52842025E-01     0   426   128     0     0     0
   451  0.52842025E-01     0   432   122     0     0     0
   451  0.52661147E-01     0   428   130     0     0     0
   451  0.52661147E-01     0   434   124     0     0     0
   451  0.71295224E-01     0   430   132     0     0     0
   451  0.71295224E-01     0   436   126     0     0     0
  26
   452  0.25056285E+00     0   454   199     0     0     0
   452  0.25056285E+00     0   456   198     0     0     0
   452  0.87950878E-01     0   450   200     0     0     0
   452  0.20472813E+00     0   451   200     0     0     0
   452  0.58015215E-04     0   450     5    11     0     0
   452  0.20044272E-04     0   451     5    11     0     0
   452  0.18539535E-01     0   450   203     0     0     0
   452  0.93298722E-02     0   451   203     0     0     0
   452  0.33067321E-03     0   425   127     0     0     0
   452  0.33067321E-03     0   431   121     0     0     0
   452  0.33054929E-03     0   427   129     0     0     0
   452  0.33054929E-03     0   433   123     0     0     0
   452  0.73243119E-03     0   437   127     0     0     0
   452  0.73243119E-03     0   443   121     0     0     0
   452  0.73151279E-03     0   439   129     0     0     0
   452  0.73151279E-03     0   445   123     0     0     0
   452  0.48597801E-01     0   429   131     0     0     0
   452  0.48597801E-01     0   435   125     0     0     0
   452  0.33310074E-01     0   441   131     0     0     0
   452  0.33310074E-01     0   447   125     0     0     0
   452  0.16779308E-02     0   426   128     0     0     0
   452  0.16779308E-02     0   432   122     0     0     0
   452  0.16773242E-02     0   428   130     0     0     0
   452  0.16773242E-02     0   434   124     0     0     0
   452  0.17356271E-02     0   430   132     0     0     0
   452  0.17356271E-02     0   436   126     0     0     0
  26
   453  0.23627117E+00     0   454   199     0     0     0
   453  0.23627117E+00     0   456   198     0     0     0
   453  0.18686468E-01     0   450   200     0     0     0
   453  0.14861062E-01     0   451   200     0     0     0
   453  0.47711983E-04     0   450     5    11     0     0
   453  0.18335315E-04     0   451     5    11     0     0
   453  0.63404024E-01     0   450   203     0     0     0
   453  0.15296659E+00     0   451   203     0     0     0
   453  0.80294069E-02     0   425   127     0     0     0
   453  0.80294069E-02     0   431   121     0     0     0
   453  0.80266343E-02     0   427   129     0     0     0
   453  0.80266343E-02     0   433   123     0     0     0
   453  0.23343877E-02     0   437   127     0     0     0
   453  0.23343877E-02     0   443   121     0     0     0
   453  0.23316452E-02     0   439   129     0     0     0
   453  0.23316452E-02     0   445   123     0     0     0
   453  0.22677036E-01     0   429   131     0     0     0
   453  0.22677036E-01     0   435   125     0     0     0
   453  0.41975878E-01     0   441   131     0     0     0
   453  0.41975878E-01     0   447   125     0     0     0
   453  0.17602909E-01     0   426   128     0     0     0
   453  0.17602909E-01     0   432   122     0     0     0
   453  0.17597029E-01     0   428   130     0     0     0
   453  0.17597029E-01     0   434   124     0     0     0
   453  0.18161805E-01     0   430   132     0     0     0
   453  0.18161805E-01     0   436   126     0     0     0
   8
   454  0.18508889E-01     0   450   198     0     0     0
   454  0.11771705E+00     0   426   127     0     0     0
   454  0.11731383E+00     0   428   129     0     0     0
   454  0.16430794E+00     0   430   131     0     0     0
   454  0.47850315E-01     0   431   122     0     0     0
   454  0.47603577E-01     0   433   124     0     0     0
   454  0.48088109E+00     0   435   126     0     0     0
   454  0.58172992E-02     0   447   126     0     0     0
  11
   455  0.76546282E-01     0   450   198     0     0     0
   455  0.25102964E+00     0   451   198     0     0     0
   455  0.15269536E-01     0   426   127     0     0     0
   455  0.15264453E-01     0   428   129     0     0     0
   455  0.71671411E-01     0   430   131     0     0     0
   455  0.37899125E-01     0   431   122     0     0     0
   455  0.37886087E-01     0   433   124     0     0     0
   455  0.31574957E-01     0   435   126     0     0     0
   455  0.65787889E-01     0   447   126     0     0     0
   455  0.22302267E+00     0   454   200     0     0     0
   455  0.17404792E+00     0   454   203     0     0     0
   8
   456  0.18508889E-01     0   450   199     0     0     0
   456  0.11771705E+00     0   432   121     0     0     0
   456  0.11731383E+00     0   434   123     0     0     0
   456  0.16430794E+00     0   436   125     0     0     0
   456  0.47850315E-01     0   425   128     0     0     0
   456  0.47603577E-01     0   427   130     0     0     0
   456  0.48088109E+00     0   429   132     0     0     0
   456  0.58172992E-02     0   441   132     0     0     0
  11
   457  0.76546282E-01     0   450   199     0     0     0
   457  0.25102964E+00     0   451   199     0     0     0
   457  0.15269536E-01     0   432   121     0     0     0
   457  0.15264453E-01     0   434   123     0     0     0
   457  0.71671411E-01     0   436   125     0     0     0
   457  0.37899125E-01     0   425   128     0     0     0
   457  0.37886087E-01     0   427   130     0     0     0
   457  0.31574957E-01     0   429   132     0     0     0
   457  0.65787889E-01     0   441   132     0     0     0
   457  0.22302267E+00     0   456   200     0     0     0
   457  0.17404792E+00     0   456   203     0     0     0
  28
   203  0.17464666E-03     0   123   129     0     0     0
   203  0.49950596E-01     0   125   131     0     0     0
   203  0.20975745E-02     0     3     9     0     0     0
   203  0.82899129E+00     0     5    11     0     0     0
   203  0.37361331E-01     0     4    10     0     0     0
   203  0.14212079E-02     0    59    59     0     0     0
   203  0.29812792E-01     0    13    13     0     0     0
   203  0.26055537E-02     0   198   121   128     0     0
   203  0.26055537E-02     0   198   123   130     0     0
   203  0.26055537E-02     0   198   125   132     0     0
   203  0.78166602E-02     0   198     8     1     0     0
   203  0.78166602E-02     0   198    10     3     0     0
   203  0.26055537E-02     0   199   127   122     0     0
   203  0.26055537E-02     0   199   129   124     0     0
   203  0.26055537E-02     0   199   131   126     0     0
   203  0.78166602E-02     0   199     2     7     0     0
   203  0.78166602E-02     0   199     4     9     0     0
   203  0.22504454E-03     0   200   122   128     0     0
   203  0.22504454E-03     0   200   124   130     0     0
   203  0.22504454E-03     0   200   126   132     0     0
   203  0.11326266E-03     0   200   121   127     0     0
   203  0.11326266E-03     0   200   123   129     0     0
   203  0.11326266E-03     0   200   125   131     0     0
   203  0.38802825E-03     0   200     2     8     0     0
   203  0.38802825E-03     0   200     4    10     0     0
   203  0.49987598E-03     0   200     1     7     0     0
   203  0.49987598E-03     0   200     3     9     0     0
   203  0.49987598E-03     0   200     5    11     0     0
  12
   204  0.20927830E-03     0   123   129     0     0     0
   204  0.59935682E-01     0   125   131     0     0     0
   204  0.24694898E-02     0     3     9     0     0     0
   204  0.80449945E+00     0     5    11     0     0     0
   204  0.14354821E-02     0     6    12     0     0     0
   204  0.28127421E-04     0    13    13     0     0     0
   204  0.10694843E-04     0   198   199     0     0     0
   204  0.51074207E-03     0   450   450     0     0     0
   204  0.54585491E-03     0   450   451     0     0     0
   204  0.58459949E-01     0   429   435     0     0     0
   204  0.35947613E-01     0   429   447     0     0     0
   204  0.35947613E-01     0   441   435     0     0     0
  11
   205  0.20836724E-03     0   123   129     0     0     0
   205  0.59677962E-01     0   125   131     0     0     0
   205  0.24587652E-02     0     3     9     0     0     0
   205  0.80128962E+00     0     5    11     0     0     0
   205  0.24534990E-02     0     6    12     0     0     0
   205  0.35707410E-04     0    13    13     0     0     0
   205  0.90114336E-03     0   450   450     0     0     0
   205  0.32598274E-02     0   450   451     0     0     0
   205  0.58017854E-01     0   429   435     0     0     0
   205  0.35848625E-01     0   429   447     0     0     0
   205  0.35848625E-01     0   441   435     0     0     0
   7
   206  0.27042307E-03     0   124   129     0     0     0
   206  0.77451289E-01     0   126   131     0     0     0
   206  0.29140601E-02     0     4     9     0     0     0
   206  0.73218787E+00     0     6    11     0     0     0
   206  0.50686793E-02     0   454   450     0     0     0
   206  0.12836893E-04     0   203   198     0     0     0
   206  0.18209489E+00     0   435   430     0     0     0
   7
   207  0.27042307E-03     0   130   123     0     0     0
   207  0.77451289E-01     0   132   125     0     0     0
   207  0.29140601E-02     0    10     3     0     0     0
   207  0.73218787E+00     0    12     5     0     0     0
   207  0.50686793E-02     0   456   450     0     0     0
   207  0.12836893E-04     0   203   199     0     0     0
   207  0.18209489E+00     0   429   436     0     0     0
   0
   5
     6  0.33333334E+00   100     2     7     5     0     0
     6  0.33333334E+00   100     4     9     5     0     0
     6  0.11111111E+00   100   122   127     5     0     0
     6  0.11111111E+00   100   124   129     5     0     0
     6  0.11111111E+00   100   126   131     5     0     0
   5
    12  0.33333334E+00   100     8     1    11     0     0
    12  0.33333334E+00   100    10     3    11     0     0
    12  0.11111111E+00   100   128   121    11     0     0
    12  0.11111111E+00   100   130   123    11     0     0
    12  0.11111111E+00   100   132   125    11     0     0
     27.34149933     -0.03861816
      0.99360651     -0.02192577      0.10458961     -0.03642415
     -0.05166773     -0.95854169      0.23887673     -0.14651287
      0.04625971     -0.06879338     -0.70068133     -0.70864207
     -0.08908942      0.27565268      0.66411215     -0.68922698
     -0.97777683      0.20964858     -0.20964858     -0.97777683
     -0.93989509      0.34146333     -0.34146333     -0.93989509
     -1.05467725     -0.64615768     -1.17332864
   -691.60998535   3075.12011719   -995.04699707
    487.82998657
    F
  0.00000000E+00  0.00000000E+00  0.00000000E+00  0.47612600E-01 -0.27119001E-21  0.00000000E+00  0.00000000E+00  0.00000000E+00  0.15755000E-20 -0.47612600E-01  0.27119001E-21  0.00000000E+00  0.00000000E+00  0.00000000E+00  0.00000000E+00  0.00000000E+00  0.00000000E+00 -0.17277200E-06  0.00000000E+00  0.00000000E+00 -0.15755000E-20  0.00000000E+00  0.00000000E+00  0.17277200E-06  0.00000000E+00  0.00000000E+00  0.00000000E+00
  0.00000000E+00  0.00000000E+00  0.00000000E+00  0.00000000E+00  0.00000000E+00  0.00000000E+00  0.00000000E+00  0.00000000E+00  0.20485699E-20  0.00000000E+00  0.00000000E+00  0.00000000E+00  0.00000000E+00  0.00000000E+00  0.00000000E+00  0.00000000E+00  0.00000000E+00 -0.22464999E-06  0.00000000E+00  0.00000000E+00  0.00000000E+00  0.00000000E+00  0.00000000E+00  0.00000000E+00  0.00000000E+00  0.00000000E+00  0.00000000E+00
  0.00000000E+00  0.00000000E+00  0.00000000E+00  0.00000000E+00  0.00000000E+00  0.00000000E+00  0.00000000E+00  0.00000000E+00  0.00000000E+00  0.00000000E+00  0.00000000E+00  0.00000000E+00  0.00000000E+00  0.00000000E+00  0.00000000E+00  0.00000000E+00  0.00000000E+00  0.00000000E+00  0.00000000E+00  0.00000000E+00  0.00000000E+00  0.00000000E+00  0.00000000E+00  0.00000000E+00  0.00000000E+00  0.00000000E+00  0.00000000E+00
