#  ISAJET SUSY parameters in SUSY Les Houches Accord 2 format
#  Created by ISALHA 2.0 Last revision: C. Balazs 21 Apr 2009
Block SPINFO   # Program information
     1   ISASUGRA from ISAJET          # Spectrum Calculator
     2   7.80   29-OCT-2009 12:50:36   # Version number
Block MODSEL   # Model selection
     1     1   # Minimal supergravity (mSUGRA) model               
Block SMINPUTS   # Standard Model inputs
     1     1.27838371E+02   # alpha_em^(-1)
     2     1.16570000E-05   # G_Fermi
     3     1.17200002E-01   # alpha_s(M_Z)
     4     9.11699982E+01   # m_{Z}(pole)
     5     4.19999981E+00   # m_{b}(m_{b})
     6     1.72500000E+02   # m_{top}(pole)
     7     1.77699995E+00   # m_{tau}(pole)
Block MINPAR   # SUSY breaking input parameters
     1     3.86000000E+03   # m_0
     2     4.20000000E+02   # m_{1/2}
     3     1.00000000E+01   # tan(beta)
     4     1.00000000E+00   # sign(mu)
     5     0.00000000E+00   # A_0
Block EXTPAR   # Non-universal SUSY breaking parameters
     0     2.04345417E+16   # Input scale
Block MASS   # Scalar and gaugino mass spectrum
#  PDG code   mass                 particle
        24     8.04229965E+01   #  W^+
        25     1.18298355E+02   #  h^0            
        35     3.83962183E+03   #  H^0            
        36     3.81447754E+03   #  A^0            
        37     3.84049146E+03   #  H^+            
   1000001     3.91445679E+03   #  dnl            
   1000002     3.91363623E+03   #  upl            
   1000003     3.91445679E+03   #  stl            
   1000004     3.91363672E+03   #  chl            
   1000005     3.21646411E+03   #  b1             
   1000006     2.31415283E+03   #  t1             
   1000011     3.86278174E+03   #  el-            
   1000012     3.86341602E+03   #  nuel           
   1000013     3.86278174E+03   #  mul-           
   1000014     3.86341602E+03   #  numl           
   1000015     3.82429224E+03   #  tau1           
   1000016     3.84605127E+03   #  nutl           
   1000021     1.13967676E+03   #  glss           
   1000022     1.63700699E+02   #  z1ss           
   1000023     2.28129929E+02   #  z2ss           
   1000024     2.19368423E+02   #  w1ss           
   1000025    -2.40211121E+02   #  z3ss           
   1000035     3.87449341E+02   #  z4ss           
   1000037     3.78264587E+02   #  w2ss           
   2000001     3.92396509E+03   #  dnr            
   2000002     3.92228711E+03   #  upr            
   2000003     3.92396509E+03   #  str            
   2000004     3.92228735E+03   #  chr            
   2000005     3.88723071E+03   #  b2             
   2000006     3.22807275E+03   #  t2             
   2000011     3.85921924E+03   #  er-            
   2000013     3.85921924E+03   #  mur-           
   2000015     3.84470947E+03   #  tau2           
Block ALPHA   # Effective Higgs mixing parameter
         -9.98184010E-02   # alpha
Block STOPMIX   # stop mixing matrix
  1  1     1.63516421E-02   # O_{11}
  1  2     9.99866307E-01   # O_{12}
  2  1    -9.99866307E-01   # O_{21}
  2  2     1.63516421E-02   # O_{22}
Block SBOTMIX   # sbottom mixing matrix
  1  1     9.99991715E-01   # O_{11}
  1  2     4.06902842E-03   # O_{12}
  2  1    -4.06902842E-03   # O_{21}
  2  2     9.99991715E-01   # O_{22}
Block STAUMIX   # stau mixing matrix
  1  1     8.13012198E-02   # O_{11}
  1  2     9.96689558E-01   # O_{12}
  2  1    -9.96689558E-01   # O_{21}
  2  2     8.13012198E-02   # O_{22}
Block NMIX   # neutralino mixing matrix
  1  1     8.37801576E-01   #
  1  2    -1.48666158E-01   #
  1  3     4.20135230E-01   #
  1  4    -3.15394640E-01   #
  2  1    -5.37154138E-01   #
  2  2    -3.65921736E-01   #
  2  3     5.40943503E-01   #
  2  4    -5.33804297E-01   #
  3  1     6.48599043E-02   #
  3  2    -7.81023577E-02   #
  3  3    -6.92877948E-01   #
  3  4    -7.13872254E-01   #
  4  1     7.31267929E-02   #
  4  2    -9.15368497E-01   #
  4  3    -2.25360006E-01   #
  4  4     3.25523674E-01   #
Block UMIX   # chargino U mixing matrix
  1  1    -3.23098779E-01   # U_{11}
  1  2     9.46365237E-01   # U_{12}
  2  1    -9.46365237E-01   # U_{21}
  2  2    -3.23098779E-01   # U_{22}
Block VMIX   # chargino V mixing matrix
  1  1    -4.63939875E-01   # V_{11}
  1  2     8.85866702E-01   # V_{12}
  2  1    -8.85866702E-01   # V_{21}
  2  2    -4.63939875E-01   # V_{22}
Block GAUGE Q=  2.72126392E+03   #
     1     3.57506961E-01   # g`
     2     6.52464807E-01   # g_2
     3     1.22035873E+00   # g_3
Block YU Q=  2.72126392E+03   #
  3  3     8.40985715E-01   # y_t
Block YD Q=  2.72126392E+03   #
  3  3     1.28030330E-01   # y_b
Block YE Q=  2.72126392E+03   #
  3  3     1.02005839E-01   # y_tau
Block HMIX Q=  2.72126392E+03   # Higgs mixing parameters
     1     2.28707260E+02   # mu(Q)
     2     1.00000000E+01   # tan(beta)(M_GUT)
     3     2.51991959E+02   # Higgs vev at Q
     4     1.45502390E+07   # m_A^2(Q)
Block MSOFT Q=  2.72126392E+03   # DRbar SUSY breaking parameters
     1     1.82106140E+02   # M_1(Q)          
     2     3.32656616E+02   # M_2(Q)          
     3     9.51211853E+02   # M_3(Q)          
    31     3.84984033E+03   # MeL(Q)          
    32     3.84984033E+03   # MmuL(Q)         
    33     3.83295630E+03   # MtauL(Q)        
    34     3.85518604E+03   # MeR(Q)          
    35     3.85518604E+03   # MmuR(Q)         
    36     3.82136035E+03   # MtauR(Q)        
    41     3.85432568E+03   # MqL1(Q)         
    42     3.85432568E+03   # MqL2(Q)         
    43     3.17298682E+03   # MqL3(Q)         
    44     3.86268628E+03   # MuR(Q)          
    45     3.86268628E+03   # McR(Q)          
    46     2.33385059E+03   # MtR(Q)          
    47     3.86410229E+03   # MdR(Q)          
    48     3.86410229E+03   # MsR(Q)          
    49     3.83544531E+03   # MbR(Q)          
Block AU Q=  2.72126392E+03   #
  1  1    -6.73273010E+02   # A_u
  2  2    -6.73273010E+02   # A_c
  3  3    -6.73273010E+02   # A_t
Block AD Q=  2.72126392E+03   #
  1  1    -9.85464539E+02   # A_d
  2  2    -9.85464539E+02   # A_s
  3  3    -9.85464539E+02   # A_b
Block AE Q=  2.72126392E+03   #
  1  1    -2.41973282E+02   # A_e
  2  2    -2.41973282E+02   # A_mu
  3  3    -2.41973282E+02   # A_tau
#  ISAJET decay tables in SUSY Les Houches accord format
#  Created by ISALHD. Last revision: C. Balazs, 2005 May 25
Block DCINFO                           # Program information
     1   ISASUGRA from ISAJET          # Spectrum Calculator
     2   7.80   29-OCT-2009 12:50:36   # Version number
#         PDG         Width
DECAY         6  1.14680779E+00   # TP    decays
#          BR          NDA       ID1       ID2       ID3       ID4
      3.33333343E-01    3            2        -1         5             # TP     -->  UP     DB     BT          
      3.33333343E-01    3            4        -3         5             # TP     -->  CH     SB     BT          
      1.11111112E-01    3          -11        12         5             # TP     -->  E+     NUE    BT          
      1.11111112E-01    3          -13        14         5             # TP     -->  MU+    NUM    BT          
      1.11111112E-01    3          -15        16         5             # TP     -->  TAU+   NUT    BT          
#         PDG         Width
DECAY   1000021  1.64044986E-03   # GLSS  decays
#          BR          NDA       ID1       ID2       ID3       ID4
      4.18505305E-03    3      1000024         1        -2             # GLSS   -->  W1SS+  DN     UB          
      4.18505305E-03    3     -1000024         2        -1             # GLSS   -->  W1SS-  UP     DB          
      4.18505166E-03    3      1000024         3        -4             # GLSS   -->  W1SS+  ST     CB          
      4.18505166E-03    3     -1000024         4        -3             # GLSS   -->  W1SS-  CH     SB          
      1.49982750E-01    3      1000024         5        -6             # GLSS   -->  W1SS+  BT     TB          
      1.49982750E-01    3     -1000024         6        -5             # GLSS   -->  W1SS-  TP     BB          
      1.44421132E-02    3      1000037         1        -2             # GLSS   -->  W2SS+  DN     UB          
      1.44421132E-02    3     -1000037         2        -1             # GLSS   -->  W2SS-  UP     DB          
      1.44421086E-02    3      1000037         3        -4             # GLSS   -->  W2SS+  ST     CB          
      1.44421086E-02    3     -1000037         4        -3             # GLSS   -->  W2SS-  CH     SB          
      7.35550225E-02    3      1000037         5        -6             # GLSS   -->  W2SS+  BT     TB          
      7.35550225E-02    3     -1000037         6        -5             # GLSS   -->  W2SS-  TP     BB          
      2.46959203E-03    2      1000022        21                       # GLSS   -->  Z1SS   GL                 
      5.34921978E-03    3      1000022         2        -2             # GLSS   -->  Z1SS   UP     UB          
      2.64114281E-03    3      1000022         1        -1             # GLSS   -->  Z1SS   DN     DB          
      2.64114281E-03    3      1000022         3        -3             # GLSS   -->  Z1SS   ST     SB          
      5.34921791E-03    3      1000022         4        -4             # GLSS   -->  Z1SS   CH     CB          
      5.08349901E-03    3      1000022         5        -5             # GLSS   -->  Z1SS   BT     BB          
      4.14358899E-02    3      1000022         6        -6             # GLSS   -->  Z1SS   TP     TB          
      9.63186566E-03    2      1000023        21                       # GLSS   -->  Z2SS   GL                 
      4.82524373E-03    3      1000023         2        -2             # GLSS   -->  Z2SS   UP     UB          
      1.43546506E-03    3      1000023         1        -1             # GLSS   -->  Z2SS   DN     DB          
      1.43546506E-03    3      1000023         3        -3             # GLSS   -->  Z2SS   ST     SB          
      4.82524186E-03    3      1000023         4        -4             # GLSS   -->  Z2SS   CH     CB          
      3.79055110E-03    3      1000023         5        -5             # GLSS   -->  Z2SS   BT     BB          
      1.30539820E-01    3      1000023         6        -6             # GLSS   -->  Z2SS   TP     TB          
      1.52419638E-02    2      1000025        21                       # GLSS   -->  Z3SS   GL                 
      4.58638715E-05    3      1000025         2        -2             # GLSS   -->  Z3SS   UP     UB          
      5.98881998E-05    3      1000025         1        -1             # GLSS   -->  Z3SS   DN     DB          
      5.98881998E-05    3      1000025         3        -3             # GLSS   -->  Z3SS   ST     SB          
      4.58638497E-05    3      1000025         4        -4             # GLSS   -->  Z3SS   CH     CB          
      2.00414821E-03    3      1000025         5        -5             # GLSS   -->  Z3SS   BT     BB          
      1.44640714E-01    3      1000025         6        -6             # GLSS   -->  Z3SS   TP     TB          
      2.56053777E-03    2      1000035        21                       # GLSS   -->  Z4SS   GL                 
      6.78430637E-03    3      1000035         2        -2             # GLSS   -->  Z4SS   UP     UB          
      7.16793537E-03    3      1000035         1        -1             # GLSS   -->  Z4SS   DN     DB          
      7.16793537E-03    3      1000035         3        -3             # GLSS   -->  Z4SS   ST     SB          
      6.78430311E-03    3      1000035         4        -4             # GLSS   -->  Z4SS   CH     CB          
      1.65635440E-02    3      1000035         5        -5             # GLSS   -->  Z4SS   BT     BB          
      4.78355326E-02    3      1000035         6        -6             # GLSS   -->  Z4SS   TP     TB          
#         PDG         Width
DECAY   1000002  2.25729233E+02   # UPL   decays
#          BR          NDA       ID1       ID2       ID3       ID4
      1.69305270E-06    2      1000022         2                       # UPL    -->  Z1SS   UP                 
      1.56280901E-02    2      1000023         2                       # UPL    -->  Z2SS   UP                 
      3.17613565E-04    2      1000025         2                       # UPL    -->  Z3SS   UP                 
      5.82150258E-02    2      1000035         2                       # UPL    -->  Z4SS   UP                 
      7.82204449E-01    2      1000021         2                       # UPL    -->  GLSS   UP                 
      3.12194210E-02    2      1000024         1                       # UPL    -->  W1SS+  DN                 
      1.12413697E-01    2      1000037         1                       # UPL    -->  W2SS+  DN                 
#         PDG         Width
DECAY   1000001  2.25736908E+02   # DNL   decays
#          BR          NDA       ID1       ID2       ID3       ID4
      6.64089806E-03    2      1000022         1                       # DNL    -->  Z1SS   DN                 
      5.18812332E-03    2      1000023         1                       # DNL    -->  Z2SS   DN                 
      5.86604758E-04    2      1000025         1                       # DNL    -->  Z3SS   DN                 
      6.17365092E-02    2      1000035         1                       # DNL    -->  Z4SS   DN                 
      7.82387912E-01    2      1000021         1                       # DNL    -->  GLSS   DN                 
      1.51443109E-02    2     -1000024         2                       # DNL    -->  W1SS-  UP                 
      1.28315672E-01    2     -1000037         2                       # DNL    -->  W2SS-  UP                 
#         PDG         Width
DECAY   1000003  2.25736908E+02   # STL   decays
#          BR          NDA       ID1       ID2       ID3       ID4
      6.64089806E-03    2      1000022         3                       # STL    -->  Z1SS   ST                 
      5.18812332E-03    2      1000023         3                       # STL    -->  Z2SS   ST                 
      5.86604758E-04    2      1000025         3                       # STL    -->  Z3SS   ST                 
      6.17365092E-02    2      1000035         3                       # STL    -->  Z4SS   ST                 
      7.82387912E-01    2      1000021         3                       # STL    -->  GLSS   ST                 
      1.51443062E-02    2     -1000024         4                       # STL    -->  W1SS-  CH                 
      1.28315628E-01    2     -1000037         4                       # STL    -->  W2SS-  CH                 
#         PDG         Width
DECAY   1000004  2.25729218E+02   # CHL   decays
#          BR          NDA       ID1       ID2       ID3       ID4
      1.69305281E-06    2      1000022         4                       # CHL    -->  Z1SS   CH                 
      1.56280901E-02    2      1000023         4                       # CHL    -->  Z2SS   CH                 
      3.17613565E-04    2      1000025         4                       # CHL    -->  Z3SS   CH                 
      5.82150109E-02    2      1000035         4                       # CHL    -->  Z4SS   CH                 
      7.82204509E-01    2      1000021         4                       # CHL    -->  GLSS   CH                 
      3.12194284E-02    2      1000024         3                       # CHL    -->  W1SS+  ST                 
      1.12413712E-01    2      1000037         3                       # CHL    -->  W2SS+  ST                 
#         PDG         Width
DECAY   1000005  2.19134323E+02   # BT1   decays
#          BR          NDA       ID1       ID2       ID3       ID4
      6.53075520E-03    2      1000022         5                       # BT1    -->  Z1SS   BT                 
      5.83845843E-03    2      1000023         5                       # BT1    -->  Z2SS   BT                 
      2.87099485E-03    2      1000025         5                       # BT1    -->  Z3SS   BT                 
      5.19800335E-02    2      1000035         5                       # BT1    -->  Z4SS   BT                 
      6.15428567E-01    2      1000021         5                       # BT1    -->  GLSS   BT                 
      1.64709553E-01    2     -1000024         6                       # BT1    -->  W1SS-  TP                 
      1.49712235E-01    2     -1000037         6                       # BT1    -->  W2SS-  TP                 
      2.92938715E-03    2          -24   1000006                       # BT1    -->  W-     TP1                
#         PDG         Width
DECAY   1000006  1.39432205E+02   # TP1   decays
#          BR          NDA       ID1       ID2       ID3       ID4
      5.29661477E-01    2      1000021         6                       # TP1    -->  GLSS   TP                 
      4.77662273E-02    2      1000022         6                       # TP1    -->  Z1SS   TP                 
      7.30534270E-02    2      1000023         6                       # TP1    -->  Z2SS   TP                 
      1.10718578E-01    2      1000025         6                       # TP1    -->  Z3SS   TP                 
      2.11842135E-02    2      1000035         6                       # TP1    -->  Z4SS   TP                 
      1.74335510E-01    2      1000024         5                       # TP1    -->  W1SS+  BT                 
      4.32806611E-02    2      1000037         5                       # TP1    -->  W2SS+  BT                 
#         PDG         Width
DECAY   2000002  1.85892471E+02   # UPR   decays
#          BR          NDA       ID1       ID2       ID3       ID4
      3.33627574E-02    2      1000022         2                       # UPR    -->  Z1SS   UP                 
      1.36693623E-02    2      1000023         2                       # UPR    -->  Z2SS   UP                 
      1.99151022E-04    2      1000025         2                       # UPR    -->  Z3SS   UP                 
      2.50109268E-04    2      1000035         2                       # UPR    -->  Z4SS   UP                 
      9.52518642E-01    2      1000021         2                       # UPR    -->  GLSS   UP                 
#         PDG         Width
DECAY   2000001  1.79370468E+02   # DNR   decays
#          BR          NDA       ID1       ID2       ID3       ID4
      8.64768401E-03    2      1000022         1                       # DNR    -->  Z1SS   DN                 
      3.54313292E-03    2      1000023         1                       # DNR    -->  Z2SS   DN                 
      5.16204746E-05    2      1000025         1                       # DNR    -->  Z3SS   DN                 
      6.48296555E-05    2      1000035         1                       # DNR    -->  Z4SS   DN                 
      9.87692714E-01    2      1000021         1                       # DNR    -->  GLSS   DN                 
#         PDG         Width
DECAY   2000003  1.79370468E+02   # STR   decays
#          BR          NDA       ID1       ID2       ID3       ID4
      8.64768401E-03    2      1000022         3                       # STR    -->  Z1SS   ST                 
      3.54313292E-03    2      1000023         3                       # STR    -->  Z2SS   ST                 
      5.16204746E-05    2      1000025         3                       # STR    -->  Z3SS   ST                 
      6.48296555E-05    2      1000035         3                       # STR    -->  Z4SS   ST                 
      9.87692714E-01    2      1000021         3                       # STR    -->  GLSS   ST                 
#         PDG         Width
DECAY   2000004  1.85892456E+02   # CHR   decays
#          BR          NDA       ID1       ID2       ID3       ID4
      3.33627500E-02    2      1000022         4                       # CHR    -->  Z1SS   CH                 
      1.36693642E-02    2      1000023         4                       # CHR    -->  Z2SS   CH                 
      1.99150993E-04    2      1000025         4                       # CHR    -->  Z3SS   CH                 
      2.50109239E-04    2      1000035         4                       # CHR    -->  Z4SS   CH                 
      9.52518642E-01    2      1000021         4                       # CHR    -->  GLSS   CH                 
#         PDG         Width
DECAY   2000005  1.79899872E+02   # BT2   decays
#          BR          NDA       ID1       ID2       ID3       ID4
      9.78876464E-03    2      1000022         5                       # BT2    -->  Z1SS   BT                 
      5.64392516E-03    2      1000023         5                       # BT2    -->  Z2SS   BT                 
      3.59517313E-03    2      1000025         5                       # BT2    -->  Z3SS   BT                 
      4.78581875E-04    2      1000035         5                       # BT2    -->  Z4SS   BT                 
      9.72969890E-01    2      1000021         5                       # BT2    -->  GLSS   BT                 
      6.47868030E-03    2     -1000024         6                       # BT2    -->  W1SS-  TP                 
      8.48792843E-04    2     -1000037         6                       # BT2    -->  W2SS-  TP                 
      2.52061227E-07    2          -24   1000006                       # BT2    -->  W-     TP1                
      1.02815888E-04    2          -24   2000006                       # BT2    -->  W-     TP2                
      5.43315655E-05    2           23   1000005                       # BT2    -->  Z0     BT1                
      3.88057742E-05    2           25   1000005                       # BT2    -->  HL0    BT1                
#         PDG         Width
DECAY   2000006  2.19414719E+02   # TP2   decays
#          BR          NDA       ID1       ID2       ID3       ID4
      6.12459838E-01    2      1000021         6                       # TP2    -->  GLSS   TP                 
      2.88309772E-02    2      1000024         5                       # TP2    -->  W1SS+  BT                 
      9.70956832E-02    2      1000037         5                       # TP2    -->  W2SS+  BT                 
      1.52796472E-03    2           23   1000006                       # TP2    -->  Z0     TP1                
      3.19200847E-03    2           25   1000006                       # TP2    -->  HL0    TP1                
      1.87948998E-02    2      1000022         6                       # TP2    -->  Z1SS   TP                 
      6.81079105E-02    2      1000023         6                       # TP2    -->  Z2SS   TP                 
      9.91853178E-02    2      1000025         6                       # TP2    -->  Z3SS   TP                 
      7.08054528E-02    2      1000035         6                       # TP2    -->  Z4SS   TP                 
#         PDG         Width
DECAY   1000011  5.28083687E+01   # EL-   decays
#          BR          NDA       ID1       ID2       ID3       ID4
      2.98277475E-02    2      1000022        11                       # EL-    -->  Z1SS   E-                 
      1.33652955E-01    2      1000023        11                       # EL-    -->  Z2SS   E-                 
      5.50656870E-04    2      1000025        11                       # EL-    -->  Z3SS   E-                 
      2.31109545E-01    2      1000035        11                       # EL-    -->  Z4SS   E-                 
      6.38710856E-02    2     -1000024        12                       # EL-    -->  W1SS-  NUE                
      5.40988028E-01    2     -1000037        12                       # EL-    -->  W2SS-  NUE                
#         PDG         Width
DECAY   1000013  5.28083687E+01   # MUL-  decays
#          BR          NDA       ID1       ID2       ID3       ID4
      2.98277475E-02    2      1000022        13                       # MUL-   -->  Z1SS   MU-                
      1.33652955E-01    2      1000023        13                       # MUL-   -->  Z2SS   MU-                
      5.50656870E-04    2      1000025        13                       # MUL-   -->  Z3SS   MU-                
      2.31109545E-01    2      1000035        13                       # MUL-   -->  Z4SS   MU-                
      6.38710856E-02    2     -1000024        14                       # MUL-   -->  W1SS-  NUM                
      5.40988028E-01    2     -1000037        14                       # MUL-   -->  W2SS-  NUM                
#         PDG         Width
DECAY   1000015  2.12273979E+01   # TAU1- decays
#          BR          NDA       ID1       ID2       ID3       ID4
      6.51091397E-01    2      1000022        15                       # TAU1-  -->  Z1SS   TAU-               
      2.75411427E-01    2      1000023        15                       # TAU1-  -->  Z2SS   TAU-               
      2.02892479E-02    2      1000025        15                       # TAU1-  -->  Z3SS   TAU-               
      4.58504632E-03    2      1000035        15                       # TAU1-  -->  Z4SS   TAU-               
      4.76803519E-02    2     -1000024        16                       # TAU1-  -->  W1SS-  NUT                
      9.42551706E-04    2     -1000037        16                       # TAU1-  -->  W2SS-  NUT                
#         PDG         Width
DECAY   1000012  5.28465576E+01   # NUEL  decays
#          BR          NDA       ID1       ID2       ID3       ID4
      1.13773108E-01    2      1000022        12                       # NUEL   -->  Z1SS   NUE                
      1.52705726E-03    2      1000023        12                       # NUEL   -->  Z2SS   NUE                
      3.95103544E-03    2      1000025        12                       # NUEL   -->  Z3SS   NUE                
      2.75361508E-01    2      1000035        12                       # NUEL   -->  Z4SS   NUE                
      1.31617993E-01    2      1000024        11                       # NUEL   -->  W1SS+  E-                 
      4.73769307E-01    2      1000037        11                       # NUEL   -->  W2SS+  E-                 
#         PDG         Width
DECAY   1000014  5.28465576E+01   # NUML  decays
#          BR          NDA       ID1       ID2       ID3       ID4
      1.13773108E-01    2      1000022        14                       # NUML   -->  Z1SS   NUM                
      1.52705726E-03    2      1000023        14                       # NUML   -->  Z2SS   NUM                
      3.95103544E-03    2      1000025        14                       # NUML   -->  Z3SS   NUM                
      2.75361508E-01    2      1000035        14                       # NUML   -->  Z4SS   NUM                
      1.31617993E-01    2      1000024        13                       # NUML   -->  W1SS+  MU-                
      4.73769307E-01    2      1000037        13                       # NUML   -->  W2SS+  MU-                
#         PDG         Width
DECAY   1000016  5.34315033E+01   # NUTL  decays
#          BR          NDA       ID1       ID2       ID3       ID4
      1.12018153E-01    2      1000022        16                       # NUTL   -->  Z1SS   NUT                
      1.50345615E-03    2      1000023        16                       # NUTL   -->  Z2SS   NUT                
      3.88994324E-03    2      1000025        16                       # NUTL   -->  Z3SS   NUT                
      2.71073014E-01    2      1000035        16                       # NUTL   -->  Z4SS   NUT                
      1.43512562E-01    2      1000024        15                       # NUTL   -->  W1SS+  TAU-               
      4.68002886E-01    2      1000037        15                       # NUTL   -->  W2SS+  TAU-               
      1.77635517E-10    3      1000015        16       -15             # NUTL   -->  TAU1-  NUT    TAU+        
      1.77635517E-10    3      1000015        12       -11             # NUTL   -->  TAU1-  NUE    E+          
      1.77635517E-10    3      1000015        14       -13             # NUTL   -->  TAU1-  NUM    MU+         
      5.32906552E-10    3      1000015         2        -1             # NUTL   -->  TAU1-  UP     DB          
      5.32906552E-10    3      1000015         4        -3             # NUTL   -->  TAU1-  CH     SB          
#         PDG         Width
DECAY   2000011  1.95372200E+01   # ER-   decays
#          BR          NDA       ID1       ID2       ID3       ID4
      7.02673495E-01    2      1000022        11                       # ER-    -->  Z1SS   E-                 
      2.87867635E-01    2      1000023        11                       # ER-    -->  Z2SS   E-                 
      4.19388432E-03    2      1000025        11                       # ER-    -->  Z3SS   E-                 
      5.26489038E-03    2      1000035        11                       # ER-    -->  Z4SS   E-                 
#         PDG         Width
DECAY   2000013  1.95372200E+01   # MUR-  decays
#          BR          NDA       ID1       ID2       ID3       ID4
      7.02673495E-01    2      1000022        13                       # MUR-   -->  Z1SS   MU-                
      2.87867635E-01    2      1000023        13                       # MUR-   -->  Z2SS   MU-                
      4.19388432E-03    2      1000025        13                       # MUR-   -->  Z3SS   MU-                
      5.26489038E-03    2      1000035        13                       # MUR-   -->  Z4SS   MU-                
#         PDG         Width
DECAY   2000015  5.31643372E+01   # TAU2- decays
#          BR          NDA       ID1       ID2       ID3       ID4
      3.09010204E-02    2      1000022        15                       # TAU2-  -->  Z1SS   TAU-               
      1.36092901E-01    2      1000023        15                       # TAU2-  -->  Z2SS   TAU-               
      8.92122276E-03    2      1000025        15                       # TAU2-  -->  Z3SS   TAU-               
      2.30098948E-01    2      1000035        15                       # TAU2-  -->  Z4SS   TAU-               
      5.79997785E-02    2     -1000024        16                       # TAU2-  -->  W1SS-  NUT                
      5.35986185E-01    2     -1000037        16                       # TAU2-  -->  W2SS-  NUT                
#         PDG         Width
DECAY   1000023  1.46473531E-05   # Z2SS  decays
#          BR          NDA       ID1       ID2       ID3       ID4
      4.24477225E-03    2      1000022        22                       # Z2SS   -->  Z1SS   GM                 
      1.40158995E-03    3     -1000024         2        -1             # Z2SS   -->  W1SS-  UP     DB          
      4.67196660E-04    3     -1000024        12       -11             # Z2SS   -->  W1SS-  NUE    E+          
      4.67196660E-04    3     -1000024        14       -13             # Z2SS   -->  W1SS-  NUM    MU+         
      1.40158995E-03    3      1000024         1        -2             # Z2SS   -->  W1SS+  DN     UB          
      4.67196660E-04    3      1000024        11       -12             # Z2SS   -->  W1SS+  E-     ANUE        
      4.67196660E-04    3      1000024        13       -14             # Z2SS   -->  W1SS+  MU-    ANUM        
      1.40158995E-03    3     -1000024         4        -3             # Z2SS   -->  W1SS-  CH     SB          
      4.67196660E-04    3     -1000024        16       -15             # Z2SS   -->  W1SS-  NUT    TAU+        
      1.40158995E-03    3      1000024         3        -4             # Z2SS   -->  W1SS+  ST     CB          
      4.67196660E-04    3      1000024        15       -16             # Z2SS   -->  W1SS+  TAU-   ANUT        
      1.17223598E-01    3      1000022         2        -2             # Z2SS   -->  Z1SS   UP     UB          
      1.51079178E-01    3      1000022         1        -1             # Z2SS   -->  Z1SS   DN     DB          
      1.51079178E-01    3      1000022         3        -3             # Z2SS   -->  Z1SS   ST     SB          
      1.17223598E-01    3      1000022         4        -4             # Z2SS   -->  Z1SS   CH     CB          
      1.44536197E-01    3      1000022         5        -5             # Z2SS   -->  Z1SS   BT     BB          
      3.39863636E-02    3      1000022        11       -11             # Z2SS   -->  Z1SS   E-     E+          
      3.39863636E-02    3      1000022        13       -13             # Z2SS   -->  Z1SS   MU-    MU+         
      3.39168459E-02    3      1000022        15       -15             # Z2SS   -->  Z1SS   TAU-   TAU+        
      6.81048781E-02    3      1000022        12       -12             # Z2SS   -->  Z1SS   NUE    ANUE        
      6.81048781E-02    3      1000022        14       -14             # Z2SS   -->  Z1SS   NUM    ANUM        
      6.81045949E-02    3      1000022        16       -16             # Z2SS   -->  Z1SS   NUT    ANUT        
#         PDG         Width
DECAY   1000025  8.31611513E-04   # Z3SS  decays
#          BR          NDA       ID1       ID2       ID3       ID4
      1.77167909E-04    2      1000022        22                       # Z3SS   -->  Z1SS   GM                 
      2.67203646E-08    2      1000023        22                       # Z3SS   -->  Z2SS   GM                 
      1.59099186E-03    3     -1000024         2        -1             # Z3SS   -->  W1SS-  UP     DB          
      5.30330639E-04    3     -1000024        12       -11             # Z3SS   -->  W1SS-  NUE    E+          
      5.30330639E-04    3     -1000024        14       -13             # Z3SS   -->  W1SS-  NUM    MU+         
      1.59099186E-03    3      1000024         1        -2             # Z3SS   -->  W1SS+  DN     UB          
      5.30330639E-04    3      1000024        11       -12             # Z3SS   -->  W1SS+  E-     ANUE        
      5.30330639E-04    3      1000024        13       -14             # Z3SS   -->  W1SS+  MU-    ANUM        
      1.59099186E-03    3     -1000024         4        -3             # Z3SS   -->  W1SS-  CH     SB          
      5.30330639E-04    3     -1000024        16       -15             # Z3SS   -->  W1SS-  NUT    TAU+        
      1.59099186E-03    3      1000024         3        -4             # Z3SS   -->  W1SS+  ST     CB          
      5.30330639E-04    3      1000024        15       -16             # Z3SS   -->  W1SS+  TAU-   ANUT        
      1.17054790E-01    3      1000022         2        -2             # Z3SS   -->  Z1SS   UP     UB          
      1.50934488E-01    3      1000022         1        -1             # Z3SS   -->  Z1SS   DN     DB          
      1.50934488E-01    3      1000022         3        -3             # Z3SS   -->  Z1SS   ST     SB          
      1.17054790E-01    3      1000022         4        -4             # Z3SS   -->  Z1SS   CH     CB          
      1.47182718E-01    3      1000022         5        -5             # Z3SS   -->  Z1SS   BT     BB          
      3.42388041E-02    3      1000022        11       -11             # Z3SS   -->  Z1SS   E-     E+          
      3.42388041E-02    3      1000022        13       -13             # Z3SS   -->  Z1SS   MU-    MU+         
      3.40844728E-02    3      1000022        15       -15             # Z3SS   -->  Z1SS   TAU-   TAU+        
      6.81339055E-02    3      1000022        12       -12             # Z3SS   -->  Z1SS   NUE    ANUE        
      6.81339055E-02    3      1000022        14       -14             # Z3SS   -->  Z1SS   NUM    ANUM        
      6.81339577E-02    3      1000022        16       -16             # Z3SS   -->  Z1SS   NUT    ANUT        
      2.09761602E-05    3      1000023         2        -2             # Z3SS   -->  Z2SS   UP     UB          
      2.70473029E-05    3      1000023         1        -1             # Z3SS   -->  Z2SS   DN     DB          
      2.70473029E-05    3      1000023         3        -3             # Z3SS   -->  Z2SS   ST     SB          
      2.09761602E-05    3      1000023         4        -4             # Z3SS   -->  Z2SS   CH     CB          
      2.13020326E-06    3      1000023         5        -5             # Z3SS   -->  Z2SS   BT     BB          
      6.13590873E-06    3      1000023        11       -11             # Z3SS   -->  Z2SS   E-     E+          
      6.13590873E-06    3      1000023        13       -13             # Z3SS   -->  Z2SS   MU-    MU+         
      4.69795668E-06    3      1000023        15       -15             # Z3SS   -->  Z2SS   TAU-   TAU+        
      1.22085148E-05    3      1000023        12       -12             # Z3SS   -->  Z2SS   NUE    ANUE        
      1.22085148E-05    3      1000023        14       -14             # Z3SS   -->  Z2SS   NUM    ANUM        
      1.22085166E-05    3      1000023        16       -16             # Z3SS   -->  Z2SS   NUT    ANUT        
#         PDG         Width
DECAY   1000035  1.81104004E+00   # Z4SS  decays
#          BR          NDA       ID1       ID2       ID3       ID4
      9.78511423E-08    2      1000022        22                       # Z4SS   -->  Z1SS   GM                 
      1.16990418E-06    2      1000023        22                       # Z4SS   -->  Z2SS   GM                 
      2.82941483E-06    2      1000025        22                       # Z4SS   -->  Z3SS   GM                 
      3.28027278E-01    2      1000024       -24                       # Z4SS   -->  W1SS+  W-                 
      3.28027278E-01    2     -1000024        24                       # Z4SS   -->  W1SS-  W+                 
      5.09325098E-08    3     -1000037         2        -1             # Z4SS   -->  W2SS-  UP     DB          
      1.69775038E-08    3     -1000037        12       -11             # Z4SS   -->  W2SS-  NUE    E+          
      1.69775038E-08    3     -1000037        14       -13             # Z4SS   -->  W2SS-  NUM    MU+         
      5.09325098E-08    3      1000037         1        -2             # Z4SS   -->  W2SS+  DN     UB          
      1.69775038E-08    3      1000037        11       -12             # Z4SS   -->  W2SS+  E-     ANUE        
      1.69775038E-08    3      1000037        13       -14             # Z4SS   -->  W2SS+  MU-    ANUM        
      5.09325098E-08    3     -1000037         4        -3             # Z4SS   -->  W2SS-  CH     SB          
      1.69775038E-08    3     -1000037        16       -15             # Z4SS   -->  W2SS-  NUT    TAU+        
      5.09325098E-08    3      1000037         3        -4             # Z4SS   -->  W2SS+  ST     CB          
      1.69775038E-08    3      1000037        15       -16             # Z4SS   -->  W2SS+  TAU-   ANUT        
      4.36916482E-04    2      1000022        23                       # Z4SS   -->  Z1SS   Z0                 
      1.04240831E-02    2      1000023        23                       # Z4SS   -->  Z2SS   Z0                 
      1.86183959E-01    2      1000025        23                       # Z4SS   -->  Z3SS   Z0                 
      1.25593199E-11    3      1000022         2        -2             # Z4SS   -->  Z1SS   UP     UB          
      9.05859499E-10    3      1000022         1        -1             # Z4SS   -->  Z1SS   DN     DB          
      9.05859499E-10    3      1000022         3        -3             # Z4SS   -->  Z1SS   ST     SB          
      1.25593156E-11    3      1000022         4        -4             # Z4SS   -->  Z1SS   CH     CB          
      2.23547314E-09    3      1000022         5        -5             # Z4SS   -->  Z1SS   BT     BB          
      3.23156946E-10    3      1000022        11       -11             # Z4SS   -->  Z1SS   E-     E+          
      3.23156946E-10    3      1000022        13       -13             # Z4SS   -->  Z1SS   MU-    MU+         
      3.60131425E-10    3      1000022        15       -15             # Z4SS   -->  Z1SS   TAU-   TAU+        
      1.36823985E-09    3      1000022        12       -12             # Z4SS   -->  Z1SS   NUE    ANUE        
      1.36823985E-09    3      1000022        14       -14             # Z4SS   -->  Z1SS   NUM    ANUM        
      1.39325296E-09    3      1000022        16       -16             # Z4SS   -->  Z1SS   NUT    ANUT        
      5.56260926E-10    3      1000023         2        -2             # Z4SS   -->  Z2SS   UP     UB          
      1.95195193E-10    3      1000023         1        -1             # Z4SS   -->  Z2SS   DN     DB          
      1.95195193E-10    3      1000023         3        -3             # Z4SS   -->  Z2SS   ST     SB          
      5.56260649E-10    3      1000023         4        -4             # Z4SS   -->  Z2SS   CH     CB          
      6.19905016E-10    3      1000023         5        -5             # Z4SS   -->  Z2SS   BT     BB          
      3.74635850E-10    3      1000023        11       -11             # Z4SS   -->  Z2SS   E-     E+          
      3.74635850E-10    3      1000023        13       -13             # Z4SS   -->  Z2SS   MU-    MU+         
      4.08456741E-10    3      1000023        15       -15             # Z4SS   -->  Z2SS   TAU-   TAU+        
      5.06806749E-12    3      1000023        12       -12             # Z4SS   -->  Z2SS   NUE    ANUE        
      5.06806749E-12    3      1000023        14       -14             # Z4SS   -->  Z2SS   NUM    ANUM        
      5.16082489E-12    3      1000023        16       -16             # Z4SS   -->  Z2SS   NUT    ANUT        
      2.89512988E-12    3      1000025         2        -2             # Z4SS   -->  Z3SS   UP     UB          
      5.65379818E-12    3      1000025         1        -1             # Z4SS   -->  Z3SS   DN     DB          
      5.65379818E-12    3      1000025         3        -3             # Z4SS   -->  Z3SS   ST     SB          
      2.89512836E-12    3      1000025         4        -4             # Z4SS   -->  Z3SS   CH     CB          
      2.58433358E-10    3      1000025         5        -5             # Z4SS   -->  Z3SS   BT     BB          
      4.02311864E-13    3      1000025        11       -11             # Z4SS   -->  Z3SS   E-     E+          
      4.02311864E-13    3      1000025        13       -13             # Z4SS   -->  Z3SS   MU-    MU+         
      3.41695006E-11    3      1000025        15       -15             # Z4SS   -->  Z3SS   TAU-   TAU+        
      3.36064293E-12    3      1000025        12       -12             # Z4SS   -->  Z3SS   NUE    ANUE        
      3.36064293E-12    3      1000025        14       -14             # Z4SS   -->  Z3SS   NUM    ANUM        
      3.42218094E-12    3      1000025        16       -16             # Z4SS   -->  Z3SS   NUT    ANUT        
      9.83532425E-03    2      1000022        25                       # Z4SS   -->  Z1SS   HL0                
      1.34333149E-01    2      1000023        25                       # Z4SS   -->  Z2SS   HL0                
      2.72765127E-03    2      1000025        25                       # Z4SS   -->  Z3SS   HL0                
#         PDG         Width
DECAY   1000024  2.42704409E-04   # W1SS+ decays
#          BR          NDA       ID1       ID2       ID3       ID4
      3.33337963E-01    3      1000022         2        -1             # W1SS+  -->  Z1SS   UP     DB          
      3.33337963E-01    3      1000022         4        -3             # W1SS+  -->  Z1SS   CH     SB          
      1.11107595E-01    3      1000022       -11        12             # W1SS+  -->  Z1SS   E+     NUE         
      1.11107595E-01    3      1000022       -13        14             # W1SS+  -->  Z1SS   MU+    NUM         
      1.11108899E-01    3      1000022       -15        16             # W1SS+  -->  Z1SS   TAU+   NUT         
#         PDG         Width
DECAY   1000037  1.45678210E+00   # W2SS+ decays
#          BR          NDA       ID1       ID2       ID3       ID4
      6.89637680E-10    3      1000022         2        -1             # W2SS+  -->  Z1SS   UP     DB          
      6.89637680E-10    3      1000022         4        -3             # W2SS+  -->  Z1SS   CH     SB          
      1.50770418E-09    3      1000022       -11        12             # W2SS+  -->  Z1SS   E+     NUE         
      1.50770418E-09    3      1000022       -13        14             # W2SS+  -->  Z1SS   MU+    NUM         
      1.58575209E-09    3      1000022       -15        16             # W2SS+  -->  Z1SS   TAU+   NUT         
      3.04275695E-02    2      1000022        24                       # W2SS+  -->  Z1SS   W+                 
      2.75573814E-10    3      1000023         2        -1             # W2SS+  -->  Z2SS   UP     DB          
      2.75573731E-10    3      1000023         4        -3             # W2SS+  -->  Z2SS   CH     SB          
      2.57531246E-10    3      1000023       -11        12             # W2SS+  -->  Z2SS   E+     NUE         
      2.57531246E-10    3      1000023       -13        14             # W2SS+  -->  Z2SS   MU+    NUM         
      3.00325875E-10    3      1000023       -15        16             # W2SS+  -->  Z2SS   TAU+   NUT         
      2.87757933E-01    2      1000023        24                       # W2SS+  -->  Z2SS   W+                 
      2.21808266E-11    3      1000025         2        -1             # W2SS+  -->  Z3SS   UP     DB          
      2.21808214E-11    3      1000025         4        -3             # W2SS+  -->  Z3SS   CH     SB          
      7.87877142E-12    3      1000025       -11        12             # W2SS+  -->  Z3SS   E+     NUE         
      7.87877142E-12    3      1000025       -13        14             # W2SS+  -->  Z3SS   MU+    NUM         
      3.99648439E-11    3      1000025       -15        16             # W2SS+  -->  Z3SS   TAU+   NUT         
      2.38524571E-01    2      1000025        24                       # W2SS+  -->  Z3SS   W+                 
      2.74322659E-01    2      1000024        23                       # W2SS+  -->  W1SS+  Z0                 
      8.74533279E-10    3      1000024         1        -1             # W2SS+  -->  W1SS+  DN     DB          
      8.74532835E-10    3      1000024         3        -3             # W2SS+  -->  W1SS+  ST     SB          
      4.83657725E-10    3      1000024         2        -2             # W2SS+  -->  W1SS+  UP     UB          
      4.83657725E-10    3      1000024         4        -4             # W2SS+  -->  W1SS+  CH     CB          
      1.70076259E-10    3      1000024        12       -12             # W2SS+  -->  W1SS+  NUE    ANUE        
      1.70076259E-10    3      1000024        14       -14             # W2SS+  -->  W1SS+  NUM    ANUM        
      1.77071732E-10    3      1000024        16       -16             # W2SS+  -->  W1SS+  NUT    ANUT        
      3.07063763E-10    3      1000024        11       -11             # W2SS+  -->  W1SS+  E-     E+          
      3.07063763E-10    3      1000024        13       -13             # W2SS+  -->  W1SS+  MU-    MU+         
      3.12682102E-10    3      1000024        15       -15             # W2SS+  -->  W1SS+  TAU-   TAU+        
      1.68967366E-01    2      1000024        25                       # W2SS+  -->  W1SS+  HL0                
#         PDG         Width
DECAY        25  4.29584878E-03   # HL0   decays
#          BR          NDA       ID1       ID2       ID3       ID4
      4.69377603E-09    2           11       -11                       # HL0    -->  E-     E+                 
      1.98178779E-04    2           13       -13                       # HL0    -->  MU-    MU+                
      5.66848740E-02    2           15       -15                       # HL0    -->  TAU-   TAU+               
      5.88868352E-06    2            1        -1                       # HL0    -->  DN     DB                 
      2.37932336E-03    2            3        -3                       # HL0    -->  ST     SB                 
      7.76872396E-01    2            5        -5                       # HL0    -->  BT     BB                 
      1.87850151E-06    2            2        -2                       # HL0    -->  UP     UB                 
      3.52097265E-02    2            4        -4                       # HL0    -->  CH     CB                 
      1.96516747E-03    2           22        22                       # HL0    -->  GM     GM                 
      4.05700617E-02    2           21        21                       # HL0    -->  GL     GL                 
      4.39784816E-03    3           24        11       -12             # HL0    -->  W+     E-     ANUE        
      4.39784816E-03    3           24        13       -14             # HL0    -->  W+     MU-    ANUM        
      4.39784816E-03    3           24        15       -16             # HL0    -->  W+     TAU-   ANUT        
      1.31935459E-02    3           24        -2         1             # HL0    -->  W+     UB     DN          
      1.31935459E-02    3           24        -4         3             # HL0    -->  W+     CB     ST          
      4.39784816E-03    3          -24       -11        12             # HL0    -->  W-     E+     NUE         
      4.39784816E-03    3          -24       -13        14             # HL0    -->  W-     MU+    NUM         
      4.39784816E-03    3          -24       -15        16             # HL0    -->  W-     TAU+   NUT         
      1.31935459E-02    3          -24         2        -1             # HL0    -->  W-     UP     DB          
      1.31935459E-02    3          -24         4        -3             # HL0    -->  W-     CH     SB          
      4.75400942E-04    3           23        12       -12             # HL0    -->  Z0     NUE    ANUE        
      4.75400942E-04    3           23        14       -14             # HL0    -->  Z0     NUM    ANUM        
      4.75400942E-04    3           23        16       -16             # HL0    -->  Z0     NUT    ANUT        
      2.39264511E-04    3           23        11       -11             # HL0    -->  Z0     E-     E+          
      2.39264511E-04    3           23        13       -13             # HL0    -->  Z0     MU-    MU+         
      2.39264511E-04    3           23        15       -15             # HL0    -->  Z0     TAU-   TAU+        
      8.19699955E-04    3           23         2        -2             # HL0    -->  Z0     UP     UB          
      8.19699955E-04    3           23         4        -4             # HL0    -->  Z0     CH     CB          
      1.05597544E-03    3           23         1        -1             # HL0    -->  Z0     DN     DB          
      1.05597544E-03    3           23         3        -3             # HL0    -->  Z0     ST     SB          
      1.05597544E-03    3           23         5        -5             # HL0    -->  Z0     BT     BB          
#         PDG         Width
DECAY        35  5.86843567E+01   # HH0   decays
#          BR          NDA       ID1       ID2       ID3       ID4
      1.11184961E-09    2           11       -11                       # HH0    -->  E-     E+                 
      4.69442966E-05    2           13       -13                       # HH0    -->  MU-    MU+                
      1.34455496E-02    2           15       -15                       # HH0    -->  TAU-   TAU+               
      1.34873756E-06    2            1        -1                       # HH0    -->  DN     DB                 
      5.44958108E-04    2            3        -3                       # HH0    -->  ST     SB                 
      6.87501356E-02    2            5        -5                       # HH0    -->  BT     BB                 
      4.32858957E-11    2            2        -2                       # HH0    -->  UP     UB                 
      5.25756320E-07    2            4        -4                       # HH0    -->  CH     CB                 
      2.74694432E-02    2            6        -6                       # HH0    -->  TP     TB                 
      7.13537602E-08    2           22        22                       # HH0    -->  GM     GM                 
      4.19834532E-06    2           21        21                       # HH0    -->  GL     GL                 
      7.01593308E-06    2           24       -24                       # HH0    -->  W+     W-                 
      3.59848968E-06    2           23        23                       # HH0    -->  Z0     Z0                 
      3.02164238E-02    2      1000022   1000022                       # HH0    -->  Z1SS   Z1SS               
      2.82458868E-02    2      1000022   1000023                       # HH0    -->  Z1SS   Z2SS               
      4.81263697E-02    2      1000022   1000025                       # HH0    -->  Z1SS   Z3SS               
      1.70037989E-02    2      1000022   1000035                       # HH0    -->  Z1SS   Z4SS               
      6.33941963E-04    2      1000023   1000023                       # HH0    -->  Z2SS   Z2SS               
      5.43823774E-07    2      1000023   1000025                       # HH0    -->  Z2SS   Z3SS               
      5.35739213E-02    2      1000023   1000035                       # HH0    -->  Z2SS   Z4SS               
      4.02636919E-03    2      1000025   1000025                       # HH0    -->  Z3SS   Z3SS               
      1.51922360E-01    2      1000025   1000035                       # HH0    -->  Z3SS   Z4SS               
      1.73831396E-02    2      1000035   1000035                       # HH0    -->  Z4SS   Z4SS               
      9.00550112E-02    2      1000024  -1000024                       # HH0    -->  W1SS+  W1SS-              
      3.01584210E-02    2      1000037  -1000037                       # HH0    -->  W2SS+  W2SS-              
      2.09177092E-01    2      1000024  -1000037                       # HH0    -->  W1SS+  W2SS-              
      2.09177092E-01    2     -1000024   1000037                       # HH0    -->  W1SS-  W2SS+              
      2.58445361E-05    2           25        25                       # HH0    -->  HL0    HL0                
#         PDG         Width
DECAY        36  5.82912292E+01   # HA0   decays
#          BR          NDA       ID1       ID2       ID3       ID4
      1.11205123E-09    2           11       -11                       # HA0    -->  E-     E+                 
      4.69528095E-05    2           13       -13                       # HA0    -->  MU-    MU+                
      1.34479990E-02    2           15       -15                       # HA0    -->  TAU-   TAU+               
      1.34903939E-06    2            1        -1                       # HA0    -->  DN     DB                 
      5.45080111E-04    2            3        -3                       # HA0    -->  ST     SB                 
      6.87657073E-02    2            5        -5                       # HA0    -->  BT     BB                 
      4.31649647E-11    2            2        -2                       # HA0    -->  UP     UB                 
      5.24644747E-07    2            4        -4                       # HA0    -->  CH     CB                 
      2.75727976E-02    2            6        -6                       # HA0    -->  TP     TB                 
      3.44912536E-07    2           22        22                       # HA0    -->  GM     GM                 
      6.70547115E-06    2           21        21                       # HA0    -->  GL     GL                 
      4.11369465E-02    2      1000022   1000022                       # HA0    -->  Z1SS   Z1SS               
      4.20849845E-02    2      1000022   1000023                       # HA0    -->  Z1SS   Z2SS               
      2.87016071E-02    2      1000022   1000025                       # HA0    -->  Z1SS   Z3SS               
      2.02289727E-02    2      1000022   1000035                       # HA0    -->  Z1SS   Z4SS               
      9.55854834E-04    2      1000023   1000023                       # HA0    -->  Z2SS   Z2SS               
      1.49371976E-04    2      1000023   1000025                       # HA0    -->  Z2SS   Z3SS               
      8.11102390E-02    2      1000023   1000035                       # HA0    -->  Z2SS   Z4SS               
      2.70431978E-03    2      1000025   1000025                       # HA0    -->  Z3SS   Z3SS               
      1.01574749E-01    2      1000025   1000035                       # HA0    -->  Z3SS   Z4SS               
      3.24385799E-02    2      1000035   1000035                       # HA0    -->  Z4SS   Z4SS               
      1.18510298E-01    2      1000024  -1000024                       # HA0    -->  W1SS+  W1SS-              
      5.82644269E-02    2      1000037  -1000037                       # HA0    -->  W2SS+  W2SS-              
      1.80872604E-01    2      1000024  -1000037                       # HA0    -->  W1SS+  W2SS-              
      1.80872604E-01    2     -1000024   1000037                       # HA0    -->  W1SS-  W2SS+              
      7.00297505E-06    2           25        23                       # HA0    -->  HL0    Z0                 
#         PDG         Width
DECAY        37  5.82480812E+01   # H+    decays
#          BR          NDA       ID1       ID2       ID3       ID4
      1.12046461E-09    2           12       -11                       # H+     -->  NUE    E+                 
      4.73080363E-05    2           14       -13                       # H+     -->  NUM    MU+                
      1.35497414E-02    2           16       -15                       # H+     -->  NUT    TAU+               
      1.26171687E-06    2            2        -1                       # H+     -->  UP     DB                 
      5.10271348E-04    2            4        -3                       # H+     -->  CH     SB                 
      8.97486955E-02    2            6        -5                       # H+     -->  TP     BB                 
      6.52222335E-02    2      1000024   1000022                       # H+     -->  W1SS+  Z1SS               
      3.90198864E-02    2      1000024   1000023                       # H+     -->  W1SS+  Z2SS               
      3.50385234E-02    2      1000024   1000025                       # H+     -->  W1SS+  Z3SS               
      2.35094622E-01    2      1000024   1000035                       # H+     -->  W1SS+  Z4SS               
      5.74154891E-02    2      1000037   1000022                       # H+     -->  W2SS+  Z1SS               
      2.38321930E-01    2      1000037   1000023                       # H+     -->  W2SS+  Z2SS               
      2.25929216E-01    2      1000037   1000025                       # H+     -->  W2SS+  Z3SS               
      9.37697841E-05    2      1000037   1000035                       # H+     -->  W2SS+  Z4SS               
      7.06243554E-06    2           25        24                       # H+     -->  HL0    W+                 
