  65
  401   1613.5360    0.45301E-25
  402   1611.5620    0.45058E-25
  403   1613.5162    0.45302E-25
  404   1611.5426    0.45059E-25
  405   1454.0129    0.34381E-25
  406   1262.3496    0.62063E-25
  407   1613.5360    0.45301E-25
  408   1611.5620    0.45058E-25
  409   1613.5162    0.45302E-25
  410   1611.5426    0.45059E-25
  411   1454.0129    0.34381E-25
  412   1262.3496    0.62063E-25
  413   1540.9180    0.83527E-24
  414   1547.5159    0.20775E-24
  415   1540.8881    0.83529E-24
  416   1547.5165    0.20775E-24
  417   1500.7747    0.59614E-25
  418   1496.4327    0.25782E-25
  419   1540.9180    0.83527E-24
  420   1547.5159    0.20775E-24
  421   1540.8881    0.83529E-24
  422   1547.5165    0.20775E-24
  423   1500.7747    0.59614E-25
  424   1496.4327    0.25782E-25
  425    533.8358    0.25033E-23
  426    527.8394    0.24958E-23
  427    533.8199    0.25035E-23
  428    527.8232    0.24961E-23
  429    240.5878    0.24360E-11
  430    516.4780    0.33786E-24
  431    533.8358    0.25033E-23
  432    527.8394    0.24958E-23
  433    533.8199    0.25035E-23
  434    527.8232    0.24961E-23
  435    240.5878    0.24360E-11
  436    516.4780    0.33786E-24
  437    301.7833    0.24591E-22
  438      0.0000    0.10000E+31
  439    302.6699    0.13471E-18
  440      0.0000    0.10000E+31
  441    532.4739    0.32396E-24
  442      0.0000    0.10000E+31
  443    301.7833    0.24591E-22
  444      0.0000    0.10000E+31
  445    302.6699    0.13471E-18
  446      0.0000    0.10000E+31
  447    532.4739    0.32396E-24
  448      0.0000    0.10000E+31
  449   1770.9500    0.21395E-25
  450    336.9088    0.12475E-23
  451    632.2963    0.41817E-24
  452   -930.3427    0.11426E-24
  453    941.0339    0.10555E-24
  454    632.4283    0.41745E-24
  455    941.1857    0.10692E-24
  456    632.4283    0.41745E-24
  457    941.1857    0.10692E-24
  203    120.4693    0.12001E-21
  204    853.5829    0.32616E-25
  205    852.5170    0.32645E-25
  206    857.7311    0.36898E-25
  207    857.7311    0.36898E-25
  458      0.0000    0.10000E+31
    6    173.3000    0.56017E-24
   12    173.3000    0.56017E-24
   6
   401  0.15303424E-01     0   450     1     0     0     0
   401  0.31987301E+00     0   451     1     0     0     0
   401  0.31654019E-03     0   452     1     0     0     0
   401  0.83716055E-02     0   453     1     0     0     0
   401  0.63512343E+00     0   456     2     0     0     0
   401  0.21012036E-01     0   457     2     0     0     0
   6
   402  0.13238371E-01     0   450     2     0     0     0
   402  0.32170132E+00     0   451     2     0     0     0
   402  0.18989871E-03     0   452     2     0     0     0
   402  0.67923130E-02     0   453     2     0     0     0
   402  0.64784670E+00     0   454     1     0     0     0
   402  0.10231422E-01     0   455     1     0     0     0
   6
   403  0.15303552E-01     0   450     3     0     0     0
   403  0.31987354E+00     0   451     3     0     0     0
   403  0.31653576E-03     0   452     3     0     0     0
   403  0.83714817E-02     0   453     3     0     0     0
   403  0.63512325E+00     0   456     4     0     0     0
   403  0.21011660E-01     0   457     4     0     0     0
   6
   404  0.13238448E-01     0   450     4     0     0     0
   404  0.32170096E+00     0   451     4     0     0     0
   404  0.18989535E-03     0   452     4     0     0     0
   404  0.67921863E-02     0   453     4     0     0     0
   404  0.64784724E+00     0   454     3     0     0     0
   404  0.10231264E-01     0   455     3     0     0     0
   7
   405  0.25592146E-01     0   450     5     0     0     0
   405  0.18670978E+00     0   451     5     0     0     0
   405  0.55285331E-01     0   452     5     0     0     0
   405  0.42346533E-01     0   453     5     0     0     0
   405  0.34344119E+00     0   456     6     0     0     0
   405  0.24036744E+00     0   457     6     0     0     0
   405  0.10625766E+00     0   199   406     0     0     0
   6
   406  0.20442970E+00     0   450     6     0     0     0
   406  0.72724238E-01     0   451     6     0     0     0
   406  0.19751874E+00     0   452     6     0     0     0
   406  0.83369315E-01     0   453     6     0     0     0
   406  0.16330351E+00     0   454     5     0     0     0
   406  0.27865443E+00     0   455     5     0     0     0
   6
   407  0.15303424E-01     0   450     7     0     0     0
   407  0.31987301E+00     0   451     7     0     0     0
   407  0.31654019E-03     0   452     7     0     0     0
   407  0.83716055E-02     0   453     7     0     0     0
   407  0.63512343E+00     0   454     8     0     0     0
   407  0.21012036E-01     0   455     8     0     0     0
   6
   408  0.13238371E-01     0   450     8     0     0     0
   408  0.32170132E+00     0   451     8     0     0     0
   408  0.18989871E-03     0   452     8     0     0     0
   408  0.67923130E-02     0   453     8     0     0     0
   408  0.64784670E+00     0   456     7     0     0     0
   408  0.10231422E-01     0   457     7     0     0     0
   6
   409  0.15303552E-01     0   450     9     0     0     0
   409  0.31987354E+00     0   451     9     0     0     0
   409  0.31653576E-03     0   452     9     0     0     0
   409  0.83714817E-02     0   453     9     0     0     0
   409  0.63512325E+00     0   454    10     0     0     0
   409  0.21011660E-01     0   455    10     0     0     0
   6
   410  0.13238448E-01     0   450    10     0     0     0
   410  0.32170096E+00     0   451    10     0     0     0
   410  0.18989535E-03     0   452    10     0     0     0
   410  0.67921863E-02     0   453    10     0     0     0
   410  0.64784724E+00     0   456     9     0     0     0
   410  0.10231264E-01     0   457     9     0     0     0
   7
   411  0.25592146E-01     0   450    11     0     0     0
   411  0.18670978E+00     0   451    11     0     0     0
   411  0.55285331E-01     0   452    11     0     0     0
   411  0.42346533E-01     0   453    11     0     0     0
   411  0.34344119E+00     0   454    12     0     0     0
   411  0.24036744E+00     0   455    12     0     0     0
   411  0.10625766E+00     0   198   412     0     0     0
   6
   412  0.20442970E+00     0   450    12     0     0     0
   412  0.72724238E-01     0   451    12     0     0     0
   412  0.19751874E+00     0   452    12     0     0     0
   412  0.83369315E-01     0   453    12     0     0     0
   412  0.16330351E+00     0   456    11     0     0     0
   412  0.27865443E+00     0   457    11     0     0     0
   4
   413  0.99830872E+00     0   450     1     0     0     0
   413  0.23766595E-03     0   451     1     0     0     0
   413  0.24882270E-03     0   452     1     0     0     0
   413  0.12047343E-02     0   453     1     0     0     0
   4
   414  0.99829483E+00     0   450     2     0     0     0
   414  0.23827862E-03     0   451     2     0     0     0
   414  0.25103954E-03     0   452     2     0     0     0
   414  0.12159030E-02     0   453     2     0     0     0
   4
   415  0.99830884E+00     0   450     3     0     0     0
   415  0.23766322E-03     0   451     3     0     0     0
   415  0.24881260E-03     0   452     3     0     0     0
   415  0.12046838E-02     0   453     3     0     0     0
   4
   416  0.99829483E+00     0   450     4     0     0     0
   416  0.23827856E-03     0   451     4     0     0     0
   416  0.25103919E-03     0   452     4     0     0     0
   416  0.12159016E-02     0   453     4     0     0     0
   7
   417  0.44668905E-01     0   450     5     0     0     0
   417  0.46246197E-01     0   451     5     0     0     0
   417  0.11877640E+00     0   452     5     0     0     0
   417  0.13546835E+00     0   453     5     0     0     0
   417  0.84163748E-01     0   456     6     0     0     0
   417  0.45170701E+00     0   457     6     0     0     0
   417  0.11896942E+00     0   199   406     0     0     0
   8
   418  0.25098443E+00     0   454     5     0     0     0
   418  0.14402415E+00     0   455     5     0     0     0
   418  0.84373645E-01     0   200   406     0     0     0
   418  0.73931135E-01     0   203   406     0     0     0
   418  0.15847165E-01     0   450     6     0     0     0
   418  0.11589282E+00     0   451     6     0     0     0
   418  0.12462959E+00     0   452     6     0     0     0
   418  0.19031706E+00     0   453     6     0     0     0
   4
   419  0.99830872E+00     0   450     7     0     0     0
   419  0.23766595E-03     0   451     7     0     0     0
   419  0.24882270E-03     0   452     7     0     0     0
   419  0.12047343E-02     0   453     7     0     0     0
   4
   420  0.99829483E+00     0   450     8     0     0     0
   420  0.23827862E-03     0   451     8     0     0     0
   420  0.25103954E-03     0   452     8     0     0     0
   420  0.12159030E-02     0   453     8     0     0     0
   4
   421  0.99830884E+00     0   450     9     0     0     0
   421  0.23766322E-03     0   451     9     0     0     0
   421  0.24881260E-03     0   452     9     0     0     0
   421  0.12046838E-02     0   453     9     0     0     0
   4
   422  0.99829483E+00     0   450    10     0     0     0
   422  0.23827856E-03     0   451    10     0     0     0
   422  0.25103919E-03     0   452    10     0     0     0
   422  0.12159016E-02     0   453    10     0     0     0
   7
   423  0.44668905E-01     0   450    11     0     0     0
   423  0.46246197E-01     0   451    11     0     0     0
   423  0.11877640E+00     0   452    11     0     0     0
   423  0.13546835E+00     0   453    11     0     0     0
   423  0.84163748E-01     0   454    12     0     0     0
   423  0.45170701E+00     0   455    12     0     0     0
   423  0.11896942E+00     0   198   412     0     0     0
   8
   424  0.25098443E+00     0   456    11     0     0     0
   424  0.14402415E+00     0   457    11     0     0     0
   424  0.84373645E-01     0   200   412     0     0     0
   424  0.73931135E-01     0   203   412     0     0     0
   424  0.15847165E-01     0   450    12     0     0     0
   424  0.11589282E+00     0   451    12     0     0     0
   424  0.12462959E+00     0   452    12     0     0     0
   424  0.19031706E+00     0   453    12     0     0     0
   4
   425  0.90993291E+00     0   450   121     0     0     0
   425  0.13616051E-04     0   429   121   131     0     0
   425  0.32417538E-04     0   435   121   125     0     0
   425  0.90021126E-01     0   121   130     0     0     0
   5
   426  0.91108495E+00     0   450   122     0     0     0
   426  0.10654248E-04     0   429   122   131     0     0
   426  0.26875094E-04     0   435   122   125     0     0
   426  0.13306634E-03     0   435   121   126     0     0
   426  0.88744432E-01     0   129   121     0     0     0
   4
   427  0.90992630E+00     0   450   123     0     0     0
   427  0.13612916E-04     0   429   123   131     0     0
   427  0.32411921E-04     0   435   123   125     0     0
   427  0.90027630E-01     0   121   128     0     0     0
   5
   428  0.91107816E+00     0   450   124     0     0     0
   428  0.10651764E-04     0   429   124   131     0     0
   428  0.26870415E-04     0   435   124   125     0     0
   428  0.13305570E-03     0   435   123   126     0     0
   428  0.88751227E-01     0   127   121     0     0     0
   3
   429  0.23575341E-01     0   125   130     0     0     0
   429  0.48818582E+00     0   125   124     0     0     0
   429  0.48823887E+00     0   123   126     0     0     0
   2
   430  0.11341421E+00     0   450   126     0     0     0
   430  0.88658571E+00     0   198   429     0     0     0
   4
   431  0.90993291E+00     0   450   127     0     0     0
   431  0.13616051E-04     0   435   127   125     0     0
   431  0.32417538E-04     0   429   127   131     0     0
   431  0.90021126E-01     0   127   124     0     0     0
   5
   432  0.91108495E+00     0   450   128     0     0     0
   432  0.10654248E-04     0   435   128   125     0     0
   432  0.26875094E-04     0   429   128   131     0     0
   432  0.13306634E-03     0   429   127   132     0     0
   432  0.88744432E-01     0   123   127     0     0     0
   4
   433  0.90992630E+00     0   450   129     0     0     0
   433  0.13612916E-04     0   435   129   125     0     0
   433  0.32411921E-04     0   429   129   131     0     0
   433  0.90027630E-01     0   127   122     0     0     0
   5
   434  0.91107816E+00     0   450   130     0     0     0
   434  0.10651764E-04     0   435   130   125     0     0
   434  0.26870415E-04     0   429   130   131     0     0
   434  0.13305570E-03     0   429   129   132     0     0
   434  0.88751227E-01     0   121   127     0     0     0
   3
   435  0.23575341E-01     0   131   124     0     0     0
   435  0.48818582E+00     0   131   130     0     0     0
   435  0.48823887E+00     0   129   132     0     0     0
   2
   436  0.11341421E+00     0   450   132     0     0     0
   436  0.88658571E+00     0   199   435     0     0     0
   4
   437  0.67208042E-04     0   429   121   131     0     0
   437  0.10089519E-03     0   435   121   125     0     0
   437  0.49991590E+00     0   123   122     0     0     0
   437  0.49991602E+00     0   121   124     0     0     0
   0
   2
   439  0.40084723E+00     0   429   123   131     0     0
   439  0.59915274E+00     0   435   123   125     0     0
   0
   3
   441  0.13005316E+00     0   450   125     0     0     0
   441  0.45556101E+00     0   200   429     0     0     0
   441  0.41438583E+00     0   203   429     0     0     0
   0
   4
   443  0.67208042E-04     0   435   127   125     0     0
   443  0.10089519E-03     0   429   127   131     0     0
   443  0.49991590E+00     0   129   128     0     0     0
   443  0.49991602E+00     0   127   130     0     0     0
   0
   2
   445  0.40084723E+00     0   435   129   125     0     0
   445  0.59915274E+00     0   429   129   131     0     0
   0
   3
   447  0.13005316E+00     0   450   131     0     0     0
   447  0.45556101E+00     0   200   435     0     0     0
   447  0.41438583E+00     0   203   435     0     0     0
   0
  24
   449  0.18499149E-01     0   408     2     0     0     0
   449  0.18499149E-01     0   402     8     0     0     0
   449  0.18064825E-01     0   407     1     0     0     0
   449  0.18064825E-01     0   401     7     0     0     0
   449  0.34989350E-01     0   420     2     0     0     0
   449  0.34989350E-01     0   414     8     0     0     0
   449  0.36938943E-01     0   419     1     0     0     0
   449  0.36938943E-01     0   413     7     0     0     0
   449  0.18069133E-01     0   409     3     0     0     0
   449  0.18069133E-01     0   403     9     0     0     0
   449  0.36947872E-01     0   421     3     0     0     0
   449  0.36947872E-01     0   415     9     0     0     0
   449  0.18502844E-01     0   410     4     0     0     0
   449  0.18502844E-01     0   404    10     0     0     0
   449  0.34988597E-01     0   422     4     0     0     0
   449  0.34988597E-01     0   416    10     0     0     0
   449  0.65500498E-01     0   411     5     0     0     0
   449  0.65500498E-01     0   405    11     0     0     0
   449  0.50571498E-01     0   423     5     0     0     0
   449  0.50571498E-01     0   417    11     0     0     0
   449  0.10842361E+00     0   412     6     0     0     0
   449  0.10842361E+00     0   406    12     0     0     0
   449  0.58503650E-01     0   424     6     0     0     0
   449  0.58503650E-01     0   418    12     0     0     0
   6
   450  0.63204817E-01     0   437   127     0     0     0
   450  0.63204817E-01     0   443   121     0     0     0
   450  0.60221076E-01     0   439   129     0     0     0
   450  0.60221076E-01     0   445   123     0     0     0
   450  0.37657410E+00     0   429   131     0     0     0
   450  0.37657410E+00     0   435   125     0     0     0
  20
   451  0.90859737E-03     0   450   200     0     0     0
   451  0.10046188E-01     0   450   203     0     0     0
   451  0.68375491E-01     0   425   127     0     0     0
   451  0.68375491E-01     0   431   121     0     0     0
   451  0.68395749E-01     0   427   129     0     0     0
   451  0.68395749E-01     0   433   123     0     0     0
   451  0.18943526E-03     0   437   127     0     0     0
   451  0.18943526E-03     0   443   121     0     0     0
   451  0.18877815E-03     0   439   129     0     0     0
   451  0.18877815E-03     0   445   123     0     0     0
   451  0.57656053E-01     0   429   131     0     0     0
   451  0.57656053E-01     0   435   125     0     0     0
   451  0.65012373E-01     0   441   131     0     0     0
   451  0.65012373E-01     0   447   125     0     0     0
   451  0.73215231E-01     0   426   128     0     0     0
   451  0.73215231E-01     0   432   122     0     0     0
   451  0.73235780E-01     0   428   130     0     0     0
   451  0.73235780E-01     0   434   124     0     0     0
   451  0.88253759E-01     0   430   132     0     0     0
   451  0.88253759E-01     0   436   126     0     0     0
  25
   452  0.24963364E+00     0   454   199     0     0     0
   452  0.24963364E+00     0   456   198     0     0     0
   452  0.88798344E-01     0   450   200     0     0     0
   452  0.23049971E+00     0   451   200     0     0     0
   452  0.48931430E-04     0   450     5    11     0     0
   452  0.16115250E-01     0   450   203     0     0     0
   452  0.63592019E-02     0   451   203     0     0     0
   452  0.71868191E-04     0   425   127     0     0     0
   452  0.71868191E-04     0   431   121     0     0     0
   452  0.71872404E-04     0   427   129     0     0     0
   452  0.71872404E-04     0   433   123     0     0     0
   452  0.18335282E-03     0   437   127     0     0     0
   452  0.18335282E-03     0   443   121     0     0     0
   452  0.18309917E-03     0   439   129     0     0     0
   452  0.18309917E-03     0   445   123     0     0     0
   452  0.49505509E-01     0   429   131     0     0     0
   452  0.49505509E-01     0   435   125     0     0     0
   452  0.28361494E-01     0   441   131     0     0     0
   452  0.28361494E-01     0   447   125     0     0     0
   452  0.35465462E-03     0   426   128     0     0     0
   452  0.35465462E-03     0   432   122     0     0     0
   452  0.35467517E-03     0   428   130     0     0     0
   452  0.35467517E-03     0   434   124     0     0     0
   452  0.36913849E-03     0   430   132     0     0     0
   452  0.36913849E-03     0   436   126     0     0     0
  25
   453  0.24524026E+00     0   454   199     0     0     0
   453  0.24524026E+00     0   456   198     0     0     0
   453  0.15913049E-01     0   450   200     0     0     0
   453  0.82877744E-02     0   451   200     0     0     0
   453  0.45028250E-04     0   450     5    11     0     0
   453  0.77310614E-01     0   450   203     0     0     0
   453  0.20273887E+00     0   451   203     0     0     0
   453  0.39395974E-02     0   425   127     0     0     0
   453  0.39395974E-02     0   431   121     0     0     0
   453  0.39398214E-02     0   427   129     0     0     0
   453  0.39398214E-02     0   433   123     0     0     0
   453  0.85646840E-03     0   437   127     0     0     0
   453  0.85646840E-03     0   443   121     0     0     0
   453  0.85531321E-03     0   439   129     0     0     0
   453  0.85531321E-03     0   445   123     0     0     0
   453  0.36964338E-01     0   429   131     0     0     0
   453  0.36964338E-01     0   435   125     0     0     0
   453  0.33686515E-01     0   441   131     0     0     0
   453  0.33686515E-01     0   447   125     0     0     0
   453  0.73597003E-02     0   426   128     0     0     0
   453  0.73597003E-02     0   432   122     0     0     0
   453  0.73601133E-02     0   428   130     0     0     0
   453  0.73601133E-02     0   434   124     0     0     0
   453  0.76502631E-02     0   430   132     0     0     0
   453  0.76502631E-02     0   436   126     0     0     0
   8
   454  0.10787889E-01     0   450   198     0     0     0
   454  0.15147768E+00     0   426   127     0     0     0
   454  0.15152006E+00     0   428   129     0     0     0
   454  0.18482611E+00     0   430   131     0     0     0
   454  0.13233632E+00     0   431   122     0     0     0
   454  0.13237552E+00     0   433   124     0     0     0
   454  0.11273737E+00     0   435   126     0     0     0
   454  0.12393914E+00     0   447   126     0     0     0
  11
   455  0.91738813E-01     0   450   198     0     0     0
   455  0.25084814E+00     0   451   198     0     0     0
   455  0.76727387E-02     0   426   127     0     0     0
   455  0.76731686E-02     0   428   129     0     0     0
   455  0.60222059E-01     0   430   131     0     0     0
   455  0.15288570E-01     0   431   122     0     0     0
   455  0.15289432E-01     0   433   124     0     0     0
   455  0.68974778E-01     0   435   126     0     0     0
   455  0.28523210E-01     0   447   126     0     0     0
   455  0.23977737E+00     0   454   200     0     0     0
   455  0.21399161E+00     0   454   203     0     0     0
   8
   456  0.10787889E-01     0   450   199     0     0     0
   456  0.15147768E+00     0   432   121     0     0     0
   456  0.15152006E+00     0   434   123     0     0     0
   456  0.18482611E+00     0   436   125     0     0     0
   456  0.13233632E+00     0   425   128     0     0     0
   456  0.13237552E+00     0   427   130     0     0     0
   456  0.11273737E+00     0   429   132     0     0     0
   456  0.12393914E+00     0   441   132     0     0     0
  11
   457  0.91738813E-01     0   450   199     0     0     0
   457  0.25084814E+00     0   451   199     0     0     0
   457  0.76727387E-02     0   432   121     0     0     0
   457  0.76731686E-02     0   434   123     0     0     0
   457  0.60222059E-01     0   436   125     0     0     0
   457  0.15288570E-01     0   425   128     0     0     0
   457  0.15289432E-01     0   427   130     0     0     0
   457  0.68974778E-01     0   429   132     0     0     0
   457  0.28523210E-01     0   441   132     0     0     0
   457  0.23977737E+00     0   456   200     0     0     0
   457  0.21399161E+00     0   456   203     0     0     0
  28
   203  0.16597989E-03     0   123   129     0     0     0
   203  0.47477353E-01     0   125   131     0     0     0
   203  0.19922049E-02     0     3     9     0     0     0
   203  0.78262472E+00     0     5    11     0     0     0
   203  0.37749898E-01     0     4    10     0     0     0
   203  0.16570877E-02     0    59    59     0     0     0
   203  0.33014141E-01     0    13    13     0     0     0
   203  0.48608389E-02     0   198   121   128     0     0
   203  0.48608389E-02     0   198   123   130     0     0
   203  0.48608389E-02     0   198   125   132     0     0
   203  0.14582518E-01     0   198     8     1     0     0
   203  0.14582518E-01     0   198    10     3     0     0
   203  0.48608389E-02     0   199   127   122     0     0
   203  0.48608389E-02     0   199   129   124     0     0
   203  0.48608389E-02     0   199   131   126     0     0
   203  0.14582518E-01     0   199     2     7     0     0
   203  0.14582518E-01     0   199     4     9     0     0
   203  0.53504377E-03     0   200   122   128     0     0
   203  0.53504377E-03     0   200   124   130     0     0
   203  0.53504377E-03     0   200   126   132     0     0
   203  0.26928220E-03     0   200   121   127     0     0
   203  0.26928220E-03     0   200   123   129     0     0
   203  0.26928220E-03     0   200   125   131     0     0
   203  0.92253787E-03     0   200     2     8     0     0
   203  0.92253787E-03     0   200     4    10     0     0
   203  0.11884561E-02     0   200     1     7     0     0
   203  0.11884561E-02     0   200     3     9     0     0
   203  0.11884561E-02     0   200     5    11     0     0
   9
   204  0.22626667E-03     0   123   129     0     0     0
   204  0.64804561E-01     0   125   131     0     0     0
   204  0.26561893E-02     0     3     9     0     0     0
   204  0.80710906E+00     0     5    11     0     0     0
   204  0.27531758E-02     0     6    12     0     0     0
   204  0.76609329E-04     0   450   450     0     0     0
   204  0.22264410E-01     0   429   435     0     0     0
   204  0.50054900E-01     0   429   447     0     0     0
   204  0.50054900E-01     0   441   435     0     0     0
  10
   205  0.22619707E-03     0   123   129     0     0     0
   205  0.64785749E-01     0   125   131     0     0     0
   205  0.26554007E-02     0     3     9     0     0     0
   205  0.80704117E+00     0     5    11     0     0     0
   205  0.30853557E-02     0     6    12     0     0     0
   205  0.21416550E-04     0    13    13     0     0     0
   205  0.21507619E-03     0   450   450     0     0     0
   205  0.22177674E-01     0   429   435     0     0     0
   205  0.49896117E-01     0   429   447     0     0     0
   205  0.49896117E-01     0   441   435     0     0     0
   5
   206  0.25723269E-03     0   124   129     0     0     0
   206  0.73674753E-01     0   126   131     0     0     0
   206  0.27719471E-02     0     4     9     0     0     0
   206  0.77721947E+00     0     6    11     0     0     0
   206  0.14607669E+00     0   435   430     0     0     0
   5
   207  0.25723269E-03     0   130   123     0     0     0
   207  0.73674753E-01     0   132   125     0     0     0
   207  0.27719471E-02     0    10     3     0     0     0
   207  0.77721947E+00     0    12     5     0     0     0
   207  0.14607669E+00     0   429   436     0     0     0
   0
   5
     6  0.33333334E+00   100     2     7     5     0     0
     6  0.33333334E+00   100     4     9     5     0     0
     6  0.11111111E+00   100   122   127     5     0     0
     6  0.11111111E+00   100   124   129     5     0     0
     6  0.11111111E+00   100   126   131     5     0     0
   5
    12  0.33333334E+00   100     8     1    11     0     0
    12  0.33333334E+00   100    10     3    11     0     0
    12  0.11111111E+00   100   128   121    11     0     0
    12  0.11111111E+00   100   130   123    11     0     0
    12  0.11111111E+00   100   132   125    11     0     0
     27.16180038     -0.03756783
      0.99817777     -0.00631316      0.05582038     -0.02203158
     -0.01763432     -0.98053443      0.16014583     -0.11222564
      0.02361283     -0.03465628     -0.70542145     -0.70754653
     -0.05265575      0.19316159      0.68819910     -0.69735074
     -0.98723191      0.15928961     -0.15928961     -0.98723191
     -0.97384024      0.22723386     -0.22723386     -0.97384024
     -1.21986175     -0.51113582     -1.35448086
  -1366.43005371   5623.95996094  -1885.95996094
    927.74700928
    F
  0.00000000E+00  0.00000000E+00  0.00000000E+00  0.47210000E-01  0.26144099E-20  0.00000000E+00  0.00000000E+00  0.00000000E+00  0.15292800E-19 -0.47210000E-01 -0.26144099E-20 -0.00000000E+00  0.00000000E+00  0.00000000E+00  0.00000000E+00  0.00000000E+00  0.00000000E+00  0.16998000E-06 -0.00000000E+00 -0.00000000E+00 -0.15292800E-19 -0.00000000E+00 -0.00000000E+00 -0.16998000E-06  0.00000000E+00  0.00000000E+00  0.00000000E+00
  0.22672800E-22  0.00000000E+00  0.00000000E+00  0.00000000E+00  0.49641601E-21  0.00000000E+00  0.00000000E+00  0.00000000E+00  0.19801999E-19  0.25200900E-09  0.26406200E-32  0.00000000E+00  0.12270600E-33  0.55176801E-08  0.00000000E+00  0.00000000E+00  0.00000000E+00  0.22010001E-06  0.00000000E+00  0.00000000E+00  0.00000000E+00  0.00000000E+00  0.00000000E+00  0.00000000E+00  0.00000000E+00  0.00000000E+00  0.00000000E+00
  0.00000000E+00  0.00000000E+00  0.00000000E+00  0.00000000E+00  0.00000000E+00  0.00000000E+00  0.00000000E+00  0.00000000E+00  0.00000000E+00  0.00000000E+00  0.00000000E+00  0.00000000E+00  0.00000000E+00  0.00000000E+00  0.00000000E+00  0.00000000E+00  0.00000000E+00  0.00000000E+00  0.00000000E+00  0.00000000E+00  0.00000000E+00  0.00000000E+00  0.00000000E+00  0.00000000E+00  0.00000000E+00  0.00000000E+00  0.00000000E+00
