  65
  401   1281.5084    0.56169E-25
  402   1279.0209    0.55704E-25
  403   1281.5084    0.56170E-25
  404   1279.0216    0.55704E-25
  405   1140.3213    0.52613E-25
  406    984.7902    0.92416E-25
  407   1281.5084    0.56169E-25
  408   1279.0209    0.55704E-25
  409   1281.5084    0.56170E-25
  410   1279.0216    0.55704E-25
  411   1140.3213    0.52613E-25
  412    984.7902    0.92416E-25
  413   1219.9230    0.10499E-23
  414   1226.2771    0.26085E-24
  415   1219.9230    0.10499E-23
  416   1226.2778    0.26085E-24
  417   1187.2974    0.58091E-25
  418   1195.1578    0.33132E-25
  419   1219.9230    0.10499E-23
  420   1226.2771    0.26085E-24
  421   1219.9230    0.10499E-23
  422   1226.2778    0.26085E-24
  423   1187.2974    0.58091E-25
  424   1195.1578    0.33132E-25
  425    424.4266    0.29410E-23
  426    416.8553    0.29290E-23
  427    424.4395    0.29407E-23
  428    416.8685    0.29287E-23
  429    170.2141    0.22295E-11
  430    405.3416    0.35576E-24
  431    424.4266    0.29410E-23
  432    416.8553    0.29290E-23
  433    424.4395    0.29407E-23
  434    416.8685    0.29287E-23
  435    170.2141    0.22295E-11
  436    405.3416    0.35576E-24
  437    244.2728    0.30239E-22
  438      0.0000    0.10000E+31
  439    244.9526    0.20043E-19
  440      0.0000    0.10000E+31
  441    428.6207    0.33859E-24
  442      0.0000    0.10000E+31
  443    244.2728    0.30239E-22
  444      0.0000    0.10000E+31
  445    244.9526    0.20043E-19
  446      0.0000    0.10000E+31
  447    428.6207    0.33859E-24
  448      0.0000    0.10000E+31
  449   1397.4399    0.28889E-25
  450    258.7161    0.15413E-23
  451    485.8824    0.64614E-24
  452   -756.6025    0.13333E-24
  453    768.0192    0.12162E-24
  454    485.9987    0.64547E-24
  455    768.3501    0.12371E-24
  456    485.9987    0.64547E-24
  457    768.3501    0.12371E-24
  203    118.2475    0.12394E-21
  204    738.6094    0.27781E-25
  205    737.7380    0.27794E-25
  206    743.5350    0.31514E-25
  207    743.5350    0.31514E-25
  458      0.0000    0.10000E+31
    6    171.4000    0.58581E-24
   12    171.4000    0.58581E-24
   6
   401  0.15611738E-01     0   450     1     0     0     0
   401  0.31883404E+00     0   451     1     0     0     0
   401  0.47105204E-03     0   452     1     0     0     0
   401  0.93732895E-02     0   453     1     0     0     0
   401  0.63134617E+00     0   456     2     0     0     0
   401  0.24363743E-01     0   457     2     0     0     0
   6
   402  0.12609211E-01     0   450     2     0     0     0
   402  0.32094875E+00     0   451     2     0     0     0
   402  0.28191484E-03     0   452     2     0     0     0
   402  0.74442788E-02     0   453     2     0     0     0
   402  0.64812326E+00     0   454     1     0     0     0
   402  0.10592586E-01     0   455     1     0     0     0
   6
   403  0.15611770E-01     0   450     3     0     0     0
   403  0.31883469E+00     0   451     3     0     0     0
   403  0.47105300E-03     0   452     3     0     0     0
   403  0.93733091E-02     0   453     3     0     0     0
   403  0.63134551E+00     0   456     4     0     0     0
   403  0.24363661E-01     0   457     4     0     0     0
   6
   404  0.12609189E-01     0   450     4     0     0     0
   404  0.32094806E+00     0   451     4     0     0     0
   404  0.28191388E-03     0   452     4     0     0     0
   404  0.74442527E-02     0   453     4     0     0     0
   404  0.64812398E+00     0   454     3     0     0     0
   404  0.10592608E-01     0   455     3     0     0     0
   7
   405  0.42101454E-01     0   450     5     0     0     0
   405  0.21031366E+00     0   451     5     0     0     0
   405  0.74513614E-01     0   452     5     0     0     0
   405  0.52650224E-01     0   453     5     0     0     0
   405  0.36929992E+00     0   456     6     0     0     0
   405  0.17451166E+00     0   457     6     0     0     0
   405  0.76609455E-01     0   199   406     0     0     0
   6
   406  0.22607704E+00     0   450     6     0     0     0
   406  0.98848268E-01     0   451     6     0     0     0
   406  0.16237764E+00     0   452     6     0     0     0
   406  0.34163609E-01     0   453     6     0     0     0
   406  0.23670237E+00     0   454     5     0     0     0
   406  0.24183109E+00     0   455     5     0     0     0
   6
   407  0.15611738E-01     0   450     7     0     0     0
   407  0.31883404E+00     0   451     7     0     0     0
   407  0.47105204E-03     0   452     7     0     0     0
   407  0.93732895E-02     0   453     7     0     0     0
   407  0.63134617E+00     0   454     8     0     0     0
   407  0.24363743E-01     0   455     8     0     0     0
   6
   408  0.12609211E-01     0   450     8     0     0     0
   408  0.32094875E+00     0   451     8     0     0     0
   408  0.28191484E-03     0   452     8     0     0     0
   408  0.74442788E-02     0   453     8     0     0     0
   408  0.64812326E+00     0   456     7     0     0     0
   408  0.10592586E-01     0   457     7     0     0     0
   6
   409  0.15611770E-01     0   450     9     0     0     0
   409  0.31883469E+00     0   451     9     0     0     0
   409  0.47105300E-03     0   452     9     0     0     0
   409  0.93733091E-02     0   453     9     0     0     0
   409  0.63134551E+00     0   454    10     0     0     0
   409  0.24363661E-01     0   455    10     0     0     0
   6
   410  0.12609189E-01     0   450    10     0     0     0
   410  0.32094806E+00     0   451    10     0     0     0
   410  0.28191388E-03     0   452    10     0     0     0
   410  0.74442527E-02     0   453    10     0     0     0
   410  0.64812398E+00     0   456     9     0     0     0
   410  0.10592608E-01     0   457     9     0     0     0
   7
   411  0.42101454E-01     0   450    11     0     0     0
   411  0.21031366E+00     0   451    11     0     0     0
   411  0.74513614E-01     0   452    11     0     0     0
   411  0.52650224E-01     0   453    11     0     0     0
   411  0.36929992E+00     0   454    12     0     0     0
   411  0.17451166E+00     0   455    12     0     0     0
   411  0.76609455E-01     0   198   412     0     0     0
   6
   412  0.22607704E+00     0   450    12     0     0     0
   412  0.98848268E-01     0   451    12     0     0     0
   412  0.16237764E+00     0   452    12     0     0     0
   412  0.34163609E-01     0   453    12     0     0     0
   412  0.23670237E+00     0   456    11     0     0     0
   412  0.24183109E+00     0   457    11     0     0     0
   4
   413  0.99763030E+00     0   450     1     0     0     0
   413  0.45726370E-03     0   451     1     0     0     0
   413  0.36453357E-03     0   452     1     0     0     0
   413  0.15478976E-02     0   453     1     0     0     0
   4
   414  0.99760509E+00     0   450     2     0     0     0
   414  0.45858955E-03     0   451     2     0     0     0
   414  0.36889096E-03     0   452     2     0     0     0
   414  0.15674136E-02     0   453     2     0     0     0
   4
   415  0.99763030E+00     0   450     3     0     0     0
   415  0.45726370E-03     0   451     3     0     0     0
   415  0.36453357E-03     0   452     3     0     0     0
   415  0.15478976E-02     0   453     3     0     0     0
   4
   416  0.99760509E+00     0   450     4     0     0     0
   416  0.45858935E-03     0   451     4     0     0     0
   416  0.36889015E-03     0   452     4     0     0     0
   416  0.15674097E-02     0   453     4     0     0     0
   7
   417  0.24200788E-01     0   450     5     0     0     0
   417  0.64077862E-01     0   451     5     0     0     0
   417  0.10915896E+00     0   452     5     0     0     0
   417  0.12456884E+00     0   453     5     0     0     0
   417  0.10943292E+00     0   456     6     0     0     0
   417  0.43462089E+00     0   457     6     0     0     0
   417  0.13393973E+00     0   199   406     0     0     0
   8
   418  0.24928920E+00     0   454     5     0     0     0
   418  0.17029710E+00     0   455     5     0     0     0
   418  0.89048192E-01     0   200   406     0     0     0
   418  0.64845085E-01     0   203   406     0     0     0
   418  0.18699314E-01     0   450     6     0     0     0
   418  0.10967673E+00     0   451     6     0     0     0
   418  0.10641219E+00     0   452     6     0     0     0
   418  0.19173218E+00     0   453     6     0     0     0
   4
   419  0.99763030E+00     0   450     7     0     0     0
   419  0.45726370E-03     0   451     7     0     0     0
   419  0.36453357E-03     0   452     7     0     0     0
   419  0.15478976E-02     0   453     7     0     0     0
   4
   420  0.99760509E+00     0   450     8     0     0     0
   420  0.45858955E-03     0   451     8     0     0     0
   420  0.36889096E-03     0   452     8     0     0     0
   420  0.15674136E-02     0   453     8     0     0     0
   4
   421  0.99763030E+00     0   450     9     0     0     0
   421  0.45726370E-03     0   451     9     0     0     0
   421  0.36453357E-03     0   452     9     0     0     0
   421  0.15478976E-02     0   453     9     0     0     0
   4
   422  0.99760509E+00     0   450    10     0     0     0
   422  0.45858935E-03     0   451    10     0     0     0
   422  0.36889015E-03     0   452    10     0     0     0
   422  0.15674097E-02     0   453    10     0     0     0
   7
   423  0.24200788E-01     0   450    11     0     0     0
   423  0.64077862E-01     0   451    11     0     0     0
   423  0.10915896E+00     0   452    11     0     0     0
   423  0.12456884E+00     0   453    11     0     0     0
   423  0.10943292E+00     0   454    12     0     0     0
   423  0.43462089E+00     0   455    12     0     0     0
   423  0.13393973E+00     0   198   412     0     0     0
   8
   424  0.24928920E+00     0   456    11     0     0     0
   424  0.17029710E+00     0   457    11     0     0     0
   424  0.89048192E-01     0   200   412     0     0     0
   424  0.64845085E-01     0   203   412     0     0     0
   424  0.18699314E-01     0   450    12     0     0     0
   424  0.10967673E+00     0   451    12     0     0     0
   424  0.10641219E+00     0   452    12     0     0     0
   424  0.19173218E+00     0   453    12     0     0     0
   4
   425  0.91550010E+00     0   450   121     0     0     0
   425  0.37793943E-04     0   429   121   131     0     0
   425  0.87762710E-04     0   435   121   125     0     0
   425  0.84374309E-01     0   121   130     0     0     0
   5
   426  0.91705555E+00     0   450   122     0     0     0
   426  0.27523756E-04     0   429   122   131     0     0
   426  0.68508889E-04     0   435   122   125     0     0
   426  0.31765431E-03     0   435   121   126     0     0
   426  0.82530767E-01     0   129   121     0     0     0
   4
   427  0.91550565E+00     0   450   123     0     0     0
   427  0.37802922E-04     0   429   123   131     0     0
   427  0.87777800E-04     0   435   123   125     0     0
   427  0.84368773E-01     0   121   128     0     0     0
   5
   428  0.91706139E+00     0   450   124     0     0     0
   428  0.27530263E-04     0   429   124   131     0     0
   428  0.68520523E-04     0   435   124   125     0     0
   428  0.31773080E-03     0   435   123   126     0     0
   428  0.82524784E-01     0   127   121     0     0     0
   3
   429  0.43939624E-01     0   125   130     0     0     0
   429  0.47797826E+00     0   125   124     0     0     0
   429  0.47808212E+00     0   123   126     0     0     0
   2
   430  0.10063349E+00     0   450   126     0     0     0
   430  0.89936650E+00     0   198   429     0     0     0
   4
   431  0.91550010E+00     0   450   127     0     0     0
   431  0.37793943E-04     0   435   127   125     0     0
   431  0.87762710E-04     0   429   127   131     0     0
   431  0.84374309E-01     0   127   124     0     0     0
   5
   432  0.91705555E+00     0   450   128     0     0     0
   432  0.27523756E-04     0   435   128   125     0     0
   432  0.68508889E-04     0   429   128   131     0     0
   432  0.31765431E-03     0   429   127   132     0     0
   432  0.82530767E-01     0   123   127     0     0     0
   4
   433  0.91550565E+00     0   450   129     0     0     0
   433  0.37802922E-04     0   435   129   125     0     0
   433  0.87777800E-04     0   429   129   131     0     0
   433  0.84368773E-01     0   127   122     0     0     0
   5
   434  0.91706139E+00     0   450   130     0     0     0
   434  0.27530263E-04     0   435   130   125     0     0
   434  0.68520523E-04     0   429   130   131     0     0
   434  0.31773080E-03     0   429   129   132     0     0
   434  0.82524784E-01     0   121   127     0     0     0
   3
   435  0.43939624E-01     0   131   124     0     0     0
   435  0.47797826E+00     0   131   130     0     0     0
   435  0.47808212E+00     0   129   132     0     0     0
   2
   436  0.10063349E+00     0   450   132     0     0     0
   436  0.89936650E+00     0   199   435     0     0     0
   4
   437  0.58027258E-03     0   429   121   131     0     0
   437  0.83717657E-03     0   435   121   125     0     0
   437  0.49929118E+00     0   123   122     0     0     0
   437  0.49929136E+00     0   121   124     0     0     0
   0
   2
   439  0.41072538E+00     0   429   123   131     0     0
   439  0.58927459E+00     0   435   123   125     0     0
   0
   3
   441  0.13236947E+00     0   450   125     0     0     0
   441  0.48664936E+00     0   200   429     0     0     0
   441  0.38098115E+00     0   203   429     0     0     0
   0
   4
   443  0.58027258E-03     0   435   127   125     0     0
   443  0.83717657E-03     0   429   127   131     0     0
   443  0.49929118E+00     0   129   128     0     0     0
   443  0.49929136E+00     0   127   130     0     0     0
   0
   2
   445  0.41072538E+00     0   435   129   125     0     0
   445  0.58927459E+00     0   429   129   131     0     0
   0
   3
   447  0.13236947E+00     0   450   131     0     0     0
   447  0.48664936E+00     0   200   435     0     0     0
   447  0.38098115E+00     0   203   435     0     0     0
   0
  24
   449  0.17984612E-01     0   408     2     0     0     0
   449  0.17984612E-01     0   402     8     0     0     0
   449  0.17269023E-01     0   407     1     0     0     0
   449  0.17269023E-01     0   401     7     0     0     0
   449  0.36106799E-01     0   420     2     0     0     0
   449  0.36106799E-01     0   414     8     0     0     0
   449  0.38649481E-01     0   419     1     0     0     0
   449  0.38649481E-01     0   413     7     0     0     0
   449  0.17269000E-01     0   409     3     0     0     0
   449  0.17269000E-01     0   403     9     0     0     0
   449  0.38649458E-01     0   421     3     0     0     0
   449  0.38649458E-01     0   415     9     0     0     0
   449  0.17983334E-01     0   410     4     0     0     0
   449  0.17983334E-01     0   404    10     0     0     0
   449  0.36105525E-01     0   422     4     0     0     0
   449  0.36105525E-01     0   416    10     0     0     0
   449  0.74628934E-01     0   411     5     0     0     0
   449  0.74628934E-01     0   405    11     0     0     0
   449  0.54127049E-01     0   423     5     0     0     0
   449  0.54127049E-01     0   417    11     0     0     0
   449  0.10647871E+00     0   412     6     0     0     0
   449  0.10647871E+00     0   406    12     0     0     0
   449  0.44748072E-01     0   424     6     0     0     0
   449  0.44748072E-01     0   418    12     0     0     0
   6
   450  0.18053543E-01     0   437   127     0     0     0
   450  0.18053543E-01     0   443   121     0     0     0
   450  0.16437929E-01     0   439   129     0     0     0
   450  0.16437929E-01     0   445   123     0     0     0
   450  0.46550852E+00     0   429   131     0     0     0
   450  0.46550852E+00     0   435   125     0     0     0
  20
   451  0.13474366E-02     0   450   200     0     0     0
   451  0.12801769E-01     0   450   203     0     0     0
   451  0.55217739E-01     0   425   127     0     0     0
   451  0.55217739E-01     0   431   121     0     0     0
   451  0.55195987E-01     0   427   129     0     0     0
   451  0.55195987E-01     0   433   123     0     0     0
   451  0.39785908E-03     0   437   127     0     0     0
   451  0.39785908E-03     0   443   121     0     0     0
   451  0.39636038E-03     0   439   129     0     0     0
   451  0.39636038E-03     0   445   123     0     0     0
   451  0.12370332E+00     0   429   131     0     0     0
   451  0.12370332E+00     0   435   125     0     0     0
   451  0.42223744E-01     0   441   131     0     0     0
   451  0.42223744E-01     0   447   125     0     0     0
   451  0.64868838E-01     0   426   128     0     0     0
   451  0.64868838E-01     0   432   122     0     0     0
   451  0.64846009E-01     0   428   130     0     0     0
   451  0.64846009E-01     0   434   124     0     0     0
   451  0.86075529E-01     0   430   132     0     0     0
   451  0.86075529E-01     0   436   126     0     0     0
  26
   452  0.24216497E+00     0   454   199     0     0     0
   452  0.24216497E+00     0   456   198     0     0     0
   452  0.82591191E-01     0   450   200     0     0     0
   452  0.21767400E+00     0   451   200     0     0     0
   452  0.52085230E-04     0   450     5    11     0     0
   452  0.12048996E-04     0   451     5    11     0     0
   452  0.16438441E-01     0   450   203     0     0     0
   452  0.77918787E-02     0   451   203     0     0     0
   452  0.11392548E-03     0   425   127     0     0     0
   452  0.11392548E-03     0   431   121     0     0     0
   452  0.11391910E-03     0   427   129     0     0     0
   452  0.11391910E-03     0   433   123     0     0     0
   452  0.27379344E-03     0   437   127     0     0     0
   452  0.27379344E-03     0   443   121     0     0     0
   452  0.27343843E-03     0   439   129     0     0     0
   452  0.27343843E-03     0   445   123     0     0     0
   452  0.58405858E-01     0   429   131     0     0     0
   452  0.58405858E-01     0   435   125     0     0     0
   452  0.34660537E-01     0   441   131     0     0     0
   452  0.34660537E-01     0   447   125     0     0     0
   452  0.56224735E-03     0   426   128     0     0     0
   452  0.56224735E-03     0   432   122     0     0     0
   452  0.56221650E-03     0   428   130     0     0     0
   452  0.56221650E-03     0   434   124     0     0     0
   452  0.58926531E-03     0   430   132     0     0     0
   452  0.58926531E-03     0   436   126     0     0     0
  26
   453  0.23772623E+00     0   454   199     0     0     0
   453  0.23772623E+00     0   456   198     0     0     0
   453  0.16486447E-01     0   450   200     0     0     0
   453  0.10588717E-01     0   451   200     0     0     0
   453  0.47211663E-04     0   450     5    11     0     0
   453  0.11717976E-04     0   451     5    11     0     0
   453  0.69998555E-01     0   450   203     0     0     0
   453  0.18724863E+00     0   451   203     0     0     0
   453  0.45212684E-02     0   425   127     0     0     0
   453  0.45212684E-02     0   431   121     0     0     0
   453  0.45210258E-02     0   427   129     0     0     0
   453  0.45210258E-02     0   433   123     0     0     0
   453  0.11263582E-02     0   437   127     0     0     0
   453  0.11263582E-02     0   443   121     0     0     0
   453  0.11249454E-02     0   439   129     0     0     0
   453  0.11249454E-02     0   445   123     0     0     0
   453  0.40192738E-01     0   429   131     0     0     0
   453  0.40192738E-01     0   435   125     0     0     0
   453  0.41323889E-01     0   441   131     0     0     0
   453  0.41323889E-01     0   447   125     0     0     0
   453  0.89537716E-02     0   426   128     0     0     0
   453  0.89537716E-02     0   432   122     0     0     0
   453  0.89533003E-02     0   428   130     0     0     0
   453  0.89533003E-02     0   434   124     0     0     0
   453  0.93658296E-02     0   430   132     0     0     0
   453  0.93658296E-02     0   436   126     0     0     0
   8
   454  0.13858142E-01     0   450   198     0     0     0
   454  0.13615015E+00     0   426   127     0     0     0
   454  0.13610218E+00     0   428   129     0     0     0
   454  0.18418509E+00     0   430   131     0     0     0
   454  0.10571074E+00     0   431   122     0     0     0
   454  0.10566931E+00     0   433   124     0     0     0
   454  0.23965871E+00     0   435   126     0     0     0
   454  0.78665666E-01     0   447   126     0     0     0
  11
   455  0.84298477E-01     0   450   198     0     0     0
   455  0.24478710E+00     0   451   198     0     0     0
   455  0.86137792E-02     0   426   127     0     0     0
   455  0.86133257E-02     0   428   129     0     0     0
   455  0.73084414E-01     0   430   131     0     0     0
   455  0.18931784E-01     0   431   122     0     0     0
   455  0.18930769E-01     0   433   124     0     0     0
   455  0.70393354E-01     0   435   126     0     0     0
   455  0.40318172E-01     0   447   126     0     0     0
   455  0.23081265E+00     0   454   200     0     0     0
   455  0.20121619E+00     0   454   203     0     0     0
   8
   456  0.13858142E-01     0   450   199     0     0     0
   456  0.13615015E+00     0   432   121     0     0     0
   456  0.13610218E+00     0   434   123     0     0     0
   456  0.18418509E+00     0   436   125     0     0     0
   456  0.10571074E+00     0   425   128     0     0     0
   456  0.10566931E+00     0   427   130     0     0     0
   456  0.23965871E+00     0   429   132     0     0     0
   456  0.78665666E-01     0   441   132     0     0     0
  11
   457  0.84298477E-01     0   450   199     0     0     0
   457  0.24478710E+00     0   451   199     0     0     0
   457  0.86137792E-02     0   432   121     0     0     0
   457  0.86133257E-02     0   434   123     0     0     0
   457  0.73084414E-01     0   436   125     0     0     0
   457  0.18931784E-01     0   425   128     0     0     0
   457  0.18930769E-01     0   427   130     0     0     0
   457  0.70393354E-01     0   429   132     0     0     0
   457  0.40318172E-01     0   441   132     0     0     0
   457  0.23081265E+00     0   456   200     0     0     0
   457  0.20121619E+00     0   456   203     0     0     0
  28
   203  0.16978824E-03     0   123   129     0     0     0
   203  0.48564307E-01     0   125   131     0     0     0
   203  0.20384814E-02     0     3     9     0     0     0
   203  0.80289978E+00     0     5    11     0     0     0
   203  0.38387220E-01     0     4    10     0     0     0
   203  0.15847521E-02     0    59    59     0     0     0
   203  0.32248061E-01     0    13    13     0     0     0
   203  0.38074541E-02     0   198   121   128     0     0
   203  0.38074541E-02     0   198   123   130     0     0
   203  0.38074541E-02     0   198   125   132     0     0
   203  0.11422362E-01     0   198     8     1     0     0
   203  0.11422362E-01     0   198    10     3     0     0
   203  0.38074541E-02     0   199   127   122     0     0
   203  0.38074541E-02     0   199   129   124     0     0
   203  0.38074541E-02     0   199   131   126     0     0
   203  0.11422362E-01     0   199     2     7     0     0
   203  0.11422362E-01     0   199     4     9     0     0
   203  0.38117068E-03     0   200   122   128     0     0
   203  0.38117068E-03     0   200   124   130     0     0
   203  0.38117068E-03     0   200   126   132     0     0
   203  0.19183940E-03     0   200   121   127     0     0
   203  0.19183940E-03     0   200   123   129     0     0
   203  0.19183940E-03     0   200   125   131     0     0
   203  0.65722549E-03     0   200     2     8     0     0
   203  0.65722549E-03     0   200     4    10     0     0
   203  0.84666838E-03     0   200     1     7     0     0
   203  0.84666838E-03     0   200     3     9     0     0
   203  0.84666838E-03     0   200     5    11     0     0
  10
   204  0.20602200E-03     0   123   129     0     0     0
   204  0.59005812E-01     0   125   131     0     0     0
   204  0.24215966E-02     0     3     9     0     0     0
   204  0.74869418E+00     0     5    11     0     0     0
   204  0.15261151E-02     0     6    12     0     0     0
   204  0.10065345E-04     0    13    13     0     0     0
   204  0.13279273E-03     0   450   450     0     0     0
   204  0.49935658E-01     0   429   435     0     0     0
   204  0.69033869E-01     0   429   447     0     0     0
   204  0.69033869E-01     0   441   435     0     0     0
  10
   205  0.20588687E-03     0   123   129     0     0     0
   205  0.58968470E-01     0   125   131     0     0     0
   205  0.24200333E-02     0     3     9     0     0     0
   205  0.74838275E+00     0     5    11     0     0     0
   205  0.17944634E-02     0     6    12     0     0     0
   205  0.21819795E-04     0    13    13     0     0     0
   205  0.27364114E-03     0   450   450     0     0     0
   205  0.49908262E-01     0   429   435     0     0     0
   205  0.69012351E-01     0   429   447     0     0     0
   205  0.69012351E-01     0   441   435     0     0     0
   5
   206  0.23527279E-03     0   124   129     0     0     0
   206  0.67384973E-01     0   126   131     0     0     0
   206  0.25352787E-02     0     4     9     0     0     0
   206  0.70364594E+00     0     6    11     0     0     0
   206  0.22619855E+00     0   435   430     0     0     0
   5
   207  0.23527279E-03     0   130   123     0     0     0
   207  0.67384973E-01     0   132   125     0     0     0
   207  0.25352787E-02     0    10     3     0     0     0
   207  0.70364594E+00     0    12     5     0     0     0
   207  0.22619855E+00     0   429   436     0     0     0
   0
   5
     6  0.33333334E+00   100     2     7     5     0     0
     6  0.33333334E+00   100     4     9     5     0     0
     6  0.11111111E+00   100   122   127     5     0     0
     6  0.11111111E+00   100   124   129     5     0     0
     6  0.11111111E+00   100   126   131     5     0     0
   5
    12  0.33333334E+00   100     8     1    11     0     0
    12  0.33333334E+00   100    10     3    11     0     0
    12  0.11111111E+00   100   128   121    11     0     0
    12  0.11111111E+00   100   130   123    11     0     0
    12  0.11111111E+00   100   132   125    11     0     0
     30.18980217     -0.03395591
      0.99733353     -0.00926468      0.06783787     -0.02525760
     -0.02423642     -0.97640336      0.17877613     -0.11869426
      0.02958827     -0.04368518     -0.70448011     -0.70775974
     -0.06215213      0.21128750      0.68348002     -0.69595253
     -0.98566842      0.16869427     -0.16869427     -0.98566842
     -0.96721083      0.25397488     -0.25397488     -0.96721083
     -1.16788781     -0.66575938     -1.27640963
  -1084.31005859   5345.79003906  -1859.92004395
    753.32098389
    F
  0.00000000E+00  0.00000000E+00  0.00000000E+00  0.47290500E-01  0.45838498E-21  0.00000000E+00  0.00000000E+00  0.00000000E+00 -0.26720900E-20 -0.47290500E-01 -0.45838498E-21  0.00000000E+00  0.00000000E+00  0.00000000E+00  0.00000000E+00  0.00000000E+00  0.00000000E+00 -0.21333700E-06  0.00000000E+00  0.00000000E+00  0.26720900E-20  0.00000000E+00  0.00000000E+00  0.21333700E-06  0.00000000E+00  0.00000000E+00  0.00000000E+00
  0.00000000E+00  0.00000000E+00  0.00000000E+00  0.00000000E+00  0.00000000E+00  0.00000000E+00  0.00000000E+00  0.00000000E+00 -0.34021199E-20  0.00000000E+00  0.00000000E+00  0.00000000E+00  0.00000000E+00  0.00000000E+00  0.00000000E+00  0.00000000E+00  0.00000000E+00 -0.27162099E-06  0.00000000E+00  0.00000000E+00  0.00000000E+00  0.00000000E+00  0.00000000E+00  0.00000000E+00  0.00000000E+00  0.00000000E+00  0.00000000E+00
  0.00000000E+00  0.00000000E+00  0.00000000E+00  0.00000000E+00  0.00000000E+00  0.00000000E+00  0.00000000E+00  0.00000000E+00  0.00000000E+00  0.00000000E+00  0.00000000E+00  0.00000000E+00  0.00000000E+00  0.00000000E+00  0.00000000E+00  0.00000000E+00  0.00000000E+00  0.00000000E+00  0.00000000E+00  0.00000000E+00  0.00000000E+00  0.00000000E+00  0.00000000E+00  0.00000000E+00  0.00000000E+00  0.00000000E+00  0.00000000E+00
